{"text_format":"1","workbook":"xlsx","n_sheets":20,"sheets":["Topics","% Change","% Change (an)","Mean & SD","Mean & SD (an)","Median","Median (an)","Mode","Mode (an)","Frequency","Frequency (an)","Large Small","Large Small (an)","Sort List","Sort List (an)","Rank","Rank (an)","AVERAGEIF","AVERAGEIF (an)","Credit Analysis"],"not_rendered":{"charts":3,"images":0,"macros":0,"external_links":0,"defined_names":6,"comments":0,"pivot_tables":1},"unopened":[],"bounds":{"document_bytes":16777216,"sheet_cells":100000,"rows_first":2000,"rows_last":500,"rows_between":2000,"halvings":0,"cell_chars":16384,"cell_head_chars":4096},"cells_cut":0,"cells_raw":0,"read":"whole","date_system":"1900"}

{"sheet":"Topics","index":0,"n_rows":12,"n_cols":1,"rows_kept":12,"cut":false,"hidden":false,"merged":[]}
["% Change"]
["Web Query"]
["Mean"]
["Standard Deviation"]
["Median"]
["Mode"]
["RANK"]
["FREQUENCY table: 2 COUNTIF, COUNTIFS, SUMPRODUCT, FREQUENCY"]
["Relative Frequency"]
["LARGE"]
["SMALL"]
["AVEARGEIF for 3 columns"]

{"sheet":"% Change","index":1,"n_rows":7,"n_cols":10,"rows_kept":7,"cut":false,"hidden":false,"merged":[]}
["Stocks","Symbol","Price on 1/9/2007","# stock bought","Value on 1/9/2007",{"$f":"\"Price on \"&TEXT(TODAY(),\"m/d/y\")","v":"Price on 4/29/10"},{"$f":"\"Value on \"&TEXT(TODAY(),\"m/d/y\")","v":"Value on 4/29/10"},"Amount of Change","% Change","% Change = End/Beg-1"]
["Google","GOOG",485.5,1000,{"$f":"D2*C2","v":485500},null,{"$f":"$D2*F2","v":0}]
["Microsoft","MSFT",29.96,1000,{"$f":"D3*C3","v":29960},null,{"$f":"$D3*F3","v":0}]
["Goldman Sachs Group","GS",204.08,1000,204080,null,0]
["Citi Group","C",54.57,1000,54570,null,0]
["Bank og Ameraica","BAC",53.5,1000,53500,null,0]
["WholeFoods","WFMI",46.25,1000,46250,null,0]

{"sheet":"% Change (an)","index":2,"n_rows":30,"n_cols":16,"rows_kept":30,"cut":false,"hidden":true,"merged":[[9,0,9,15],[10,0,10,15],[19,2,19,4],[19,6,19,8],[30,0,30,15],[22,0,22,15],[23,0,23,15],[24,0,24,15],[25,0,25,15],[26,0,26,15],[27,0,27,15],[28,0,28,15],[29,0,29,15],[20,2,20,4],[20,6,20,8]]}
["Stocks","Symbol","Price on 1/9/2007","# stock bought","Value on 1/9/2007",{"$f":"\"Price on \"&TEXT(TODAY(),\"m/d/y\")","v":"Price on 4/29/10"},{"$f":"\"Value on \"&TEXT(TODAY(),\"m/d/y\")","v":"Value on 4/29/10"},"Amount of Change","% Change","% Change = End/Beg-1"]
["Google","GOOG",485.5,1000,{"$f":"D2*C2","v":485500},{"$f":"D13","v":529.19000000000005},{"$f":"$D2*F2","v":529190},{"$f":"G2-E2","v":43690},{"$f":"H2/E2","v":8.9989701338825959E-2},{"$f":"F2/C2-1","v":8.9989701338826E-2}]
["Microsoft","MSFT",29.96,1000,{"$f":"D3*C3","v":29960},{"$f":"D14","v":30.91},{"$f":"$D3*F3","v":30910},950,{"$f":"H3/E3","v":3.1708945260347128E-2},{"$f":"F3/C3-1","v":3.1708945260347177E-2}]
["Goldman Sachs Group","GS",204.08,1000,{"$f":"D4*C4","v":204080},157.01,157010,-47070,-0.23064484515876127,-0.23064484515876138]
["Citi Group","C",54.57,1000,54570,4.45,4450,-50120,-0.91845336265347255,-0.91845336265347255]
["Bank of America","BAC",53.5,1000,53500,17.78,17780,-35720,-0.66766355140186917,-0.66766355140186917]
["Wholefoods","WFMI",46.25,1000,46250,38.29,38290,-7960,-0.17210810810810812,-0.17210810810810817]
[]
[]
["Stock Quotes Provided by MSN Money"]
["Click here to visit MSN Money"]
[null,null,null,"Last","Previous Close","High","Low","Volume","Change","% Change","52 Wk High","52 Wk Low","Market Cap","EPS","P/E Ratio","# Shares Out"]
["Google Inc ","Chart","News",529.19000000000005,529.05999999999995,534.83000000000004,521.03,3398849,0.13,2.0000000000000001E-4,629.51,381.54,168271466543,22.07,24.9,317979300]
["Microsoft Corp ","Chart","News",30.91,30.85,31,30.62,64448632,7.0000000000000007E-2,2.0999999999999999E-3,31.58,19.010000000000002,271094948172,1.82,16.899999999999999,8770461000]
["Goldman Sachs Group Inc ","Chart","News",157.01,153.04,157.65,154.69,21179762,3.97,2.5899999999999999E-2,193.6,119.8,82626682320,21.77,7.4,526251100]
["Citigroup Inc ","Chart","News",4.45,4.34,4.5599999999999996,4.4000000000000004,1102154631,0.11,2.53E-2,5.43,2.5499999999999998,127087099553,-0.28000000000000003,0,28558900000]
["Bank of America Corp ","Chart","News",17.78,17.47,17.96,17.510000000000002,194910785,0.31,1.77E-2,19.86,8,178368966888,-0.24,0,10032000000]
["Whole Foods Market Inc ","Chart","News",38.29,37.729999999999997,38.619999999999997,37.909999999999997,2677783,0.56000000000000005,1.4800000000000001E-2,40.369999999999997,17.16,6522962028,0.97,40.4,170356800]
[]
["Symbol Lookup",null,"MSN Money Home",null,null,null,"Microsoft Office Tools on the Web"]
["Find stocks, mutual funds, options, indices, and currencies.",null,"Discover MSN Money's tools, columns, and more!",null,null,null,"Get the latest from Microsoft Office"]
[]
["Terms of Use. © 2010 Microsoft Corporation and/or its suppliers. All rights reserved."]
["Data providers"]
["Canadian investment fund pricing (c) 2010 CANNEX Financial Exchanges Limited."]
["Copyright © 2010 Thomson Reuters. Click for Restrictions."]
["Analyst Recommendations data provided by Zacks.com."]
["Fund data provided by Morningstar, Inc. © 2010. All rights reserved."]
["Quotes supplied by Interactive Data Real-Time Services."]
["StockScouter data provided by Gradient Analytics, Inc."]

{"sheet":"Mean & SD","index":3,"n_rows":45,"n_cols":9,"rows_kept":45,"cut":false,"hidden":false,"merged":[]}
[null,null,null,null,null,"Averages are estimates for a \"typical value\", or a measure of central tendency."]
[null,null,null,null,null,"Why do we have averages?"]
[null,"Times (Minutes) To Router Each Product",null,null,null,"Mean gives 1 number that will represent all the numbers (data points)"]
[null,null,null,null,null,"Mean = is one type of average = add/count = AVERAGE function"]
[null,"Shift 1","Shift 2","Shift 3",null,"Standard Deviation tells you how reliable your Mean is. Visually: It tells you how clustered your data points are around the mean."]
[null,1.0900000000000001,1.64,2,null,"The smaller the Standard Deviation, the more reliable the mean is; the \"more good\" your mean is; the more clustered the data points are around the mean."]
[null,1.25,2.2999999999999998,1.46]
[null,1.32,1.4,1.75]
[null,1.1599999999999999,1,1.54]
[null,1.4,1.73,1.68]
[null,1.4,0.91,1.04]
[null,1.2,0.45,0.45]
[null,0.71,0.62,1.98]
[null,1.54,0.73,2.2999999999999998]
[null,1.64,1.2,1.3]
[null,1.37,1.1200000000000001,1.74]
[null,1.3,1.25,1.27]
[null,1.2,1.73,1.66]
[null,1.1499999999999999,1.07,2.15]
[null,1.1499999999999999,1.63,0.56000000000000005]
[null,1.27,1.08,0.97]
[null,1.22,1.5,1.78]
["Mean"]
["STDEV"]
[]
[]
[]
[null,{"$f":"$B$5&\" X\"","v":"Shift 1 X"},{"$f":"$B$5&\" Y\"","v":"Shift 1 Y"},{"$f":"$C$5&\" X\"","v":"Shift 2 X"},{"$f":"$C$5&\" Y\"","v":"Shift 2 Y"},{"$f":"$B$5&\" mean\"","v":"Shift 1 mean"},{"$f":"$B$5&\" mean Y\"","v":"Shift 1 mean Y"},{"$f":"$C$5&\" mean\"","v":"Shift 2 mean"},{"$f":"$C$5&\" mean Y\"","v":"Shift 2 mean Y"}]
[null,{"$f":"B6","v":1.0900000000000001},1,{"$f":"C6","v":1.64},2,{"$f":"AVERAGE(B6:B22)","v":1.2570588235294116},1.5,{"$f":"AVERAGE(C6:C22)","v":1.256470588235294},2.5]
[null,{"$f":"B7","v":1.25},1,{"$f":"C7","v":2.2999999999999998},2]
[null,1.32,1,1.4,2]
[null,1.1599999999999999,1,1,2]
[null,1.4,1,1.73,2]
[null,1.4,1,0.91,2]
[null,1.2,1,0.45,2]
[null,0.71,1,0.62,2]
[null,1.54,1,0.73,2]
[null,1.64,1,1.2,2]
[null,1.37,1,1.1200000000000001,2]
[null,1.3,1,1.25,2]
[null,1.2,1,1.73,2]
[null,1.1499999999999999,1,1.07,2]
[null,1.1499999999999999,1,1.63,2]
[null,1.27,1,1.08,2]
[null,1.22,1,1.5,2]

{"sheet":"Mean & SD (an)","index":4,"n_rows":45,"n_cols":9,"rows_kept":45,"cut":false,"hidden":true,"merged":[]}
[null,null,null,null,null,"Averages are estimates for a \"typical value\", or a measure of central tendency."]
[null,null,null,null,null,"Why do we have averages?"]
[null,"Times (Minutes) To Router Each Product",null,null,null,"Mean gives 1 number that will represent all the numbers (data points)"]
[null,null,null,null,null,"Mean = is one type of average = add/count = AVERAGE function"]
[null,"Shift 1","Shift 2","Shift 3",null,"Standard Deviation tells you how reliable your Mean is. Visually: It tells you how clustered your data points are around the mean."]
[null,1.0900000000000001,1.64,2,null,"The smaller the Standard Deviation, the more reliable the mean is; the \"more good\" your mean is; the more clustered the data points are around the mean."]
[null,1.25,2.2999999999999998,1.46]
[null,1.32,1.4,1.75]
[null,1.1599999999999999,1,1.54]
[null,1.4,1.73,1.68]
[null,1.4,0.91,1.04]
[null,1.2,0.45,0.45]
[null,0.71,0.62,1.98]
[null,1.54,0.73,2.2999999999999998]
[null,1.64,1.2,1.3]
[null,1.37,1.1200000000000001,1.74]
[null,1.3,1.25,1.27]
[null,1.2,1.73,1.66]
[null,1.1499999999999999,1.07,2.15]
[null,1.1499999999999999,1.63,0.56000000000000005]
[null,1.27,1.08,0.97]
[null,1.22,1.5,1.78]
["Mean",{"$f":"AVERAGE(B6:B22)","v":1.2570588235294116},1.256470588235294,1.5076470588235291]
["STDEV",{"$f":"STDEV(B6:B22)","v":0.20213747505974652},0.4683874087823906,0.52279930914937134]
[]
[]
[]
[null,{"$f":"$B$5&\" X\"","v":"Shift 1 X"},{"$f":"$B$5&\" Y\"","v":"Shift 1 Y"},{"$f":"$C$5&\" X\"","v":"Shift 2 X"},{"$f":"$C$5&\" Y\"","v":"Shift 2 Y"},{"$f":"$B$5&\" mean\"","v":"Shift 1 mean"},{"$f":"$B$5&\" mean Y\"","v":"Shift 1 mean Y"},{"$f":"$C$5&\" mean\"","v":"Shift 2 mean"},{"$f":"$C$5&\" mean Y\"","v":"Shift 2 mean Y"}]
[null,{"$f":"B6","v":1.0900000000000001},1,{"$f":"C6","v":1.64},2,{"$f":"AVERAGE(B6:B22)","v":1.2570588235294116},1.5,{"$f":"AVERAGE(C6:C22)","v":1.256470588235294},2.5]
[null,{"$f":"B7","v":1.25},1,{"$f":"C7","v":2.2999999999999998},2]
[null,1.32,1,1.4,2]
[null,1.1599999999999999,1,1,2]
[null,1.4,1,1.73,2]
[null,1.4,1,0.91,2]
[null,1.2,1,0.45,2]
[null,0.71,1,0.62,2]
[null,1.54,1,0.73,2]
[null,1.64,1,1.2,2]
[null,1.37,1,1.1200000000000001,2]
[null,1.3,1,1.25,2]
[null,1.2,1,1.73,2]
[null,1.1499999999999999,1,1.07,2]
[null,1.1499999999999999,1,1.63,2]
[null,1.27,1,1.08,2]
[null,1.22,1,1.5,2]

{"sheet":"Median","index":5,"n_rows":40,"n_cols":17,"rows_kept":40,"cut":false,"hidden":false,"merged":[]}
["House Prices",null,"Mean = add/count = AVERAGE function",null,null,null,null,null,null,null,null,null,null,null,null,null,"Rand with a few extreemes"]
[159058,null,"Problem with mean is: a few really large values would pull the mean up.",null,null,null,null,null,null,null,null,null,null,null,null,null,{"$f":"IF(MOD(ROW(),10),125000+INT(RAND()*(290000-125000)),800000+INT(RAND()*500000))","v":216572}]
[140245,null,"Median is a type of average that avoids bias when there are a few really big or small numbers in data set"]
[266064,null,"Median is the one in the middle after sorting the list"]
[127204]
[275754,null,"Mean"]
[238830,null,"Median"]
[232234]
[250974,null,"This means that if the real estate agent wants the neighborhood to look richer than it is, he would use the Mean and if he want to take a more reasonable approach, he would use Median"]
[1043651]
[272952,null,null,"Sorted"]
[150892,null,{"$f":"ROWS(C$12:C12)","v":1},{"$f":"LARGE($A$2:$A$30,C12)","v":1266258}]
[284008,null,{"$f":"ROWS(C$12:C13)","v":2},{"$f":"LARGE($A$2:$A$30,C13)","v":1043651}]
[192061,null,{"$f":"ROWS(C$12:C14)","v":3},843136]
[194563,null,{"$f":"ROWS(C$12:C15)","v":4},284008]
[270528,null,{"$f":"ROWS(C$12:C16)","v":5},275754]
[180347,null,{"$f":"ROWS(C$12:C17)","v":6},272952]
[139844,null,{"$f":"ROWS(C$12:C18)","v":7},270528]
[196515,null,{"$f":"ROWS(C$12:C19)","v":8},266064]
[843136,null,{"$f":"ROWS(C$12:C20)","v":9},260104]
[126357,null,{"$f":"ROWS(C$12:C21)","v":10},255392]
[139393,null,{"$f":"ROWS(C$12:C22)","v":11},250974]
[255392,null,{"$f":"ROWS(C$12:C23)","v":12},246638]
[197379,null,{"$f":"ROWS(C$12:C24)","v":13},238830]
[152187,null,{"$f":"ROWS(C$12:C25)","v":14},232234]
[246638,null,{"$f":"ROWS(C$12:C26)","v":15},197379]
[260104,null,{"$f":"ROWS(C$12:C27)","v":16},196515]
[164684,null,{"$f":"ROWS(C$12:C28)","v":17},194563]
[150359,null,{"$f":"ROWS(C$12:C29)","v":18},192061]
[1266258,null,{"$f":"ROWS(C$12:C30)","v":19},180347]
[null,null,{"$f":"ROWS(C$12:C31)","v":20},164684]
[null,null,{"$f":"ROWS(C$12:C32)","v":21},159058]
[null,null,{"$f":"ROWS(C$12:C33)","v":22},152187]
[null,null,{"$f":"ROWS(C$12:C34)","v":23},150892]
[null,null,{"$f":"ROWS(C$12:C35)","v":24},150359]
[null,null,{"$f":"ROWS(C$12:C36)","v":25},140245]
[null,null,{"$f":"ROWS(C$12:C37)","v":26},139844]
[null,null,{"$f":"ROWS(C$12:C38)","v":27},139393]
[null,null,{"$f":"ROWS(C$12:C39)","v":28},127204]
[null,null,{"$f":"ROWS(C$12:C40)","v":29},126357]

{"sheet":"Median (an)","index":6,"n_rows":40,"n_cols":17,"rows_kept":40,"cut":false,"hidden":true,"merged":[]}
["House Prices",null,"Mean = add/count = AVERAGE function",null,null,null,null,null,null,null,null,null,null,null,null,null,"Rand with a few extreemes"]
[159058,null,"Problem with mean is: a few really large values would pull the mean up.",null,null,null,null,null,null,null,null,null,null,null,null,null,{"$f":"IF(MOD(ROW(),10),125000+INT(RAND()*(290000-125000)),800000+INT(RAND()*500000))","v":240859}]
[140245,null,"Median is a type of average that avoids bias when there are a few really big or small numbers in data set"]
[266064,null,"Median is the one in the middle after sorting the list"]
[127204]
[275754,null,"Mean"]
[238830,null,"Median"]
[232234]
[250974,null,"This means that if the real estate agent wants the neighborhood to look richer than it is, he would use the Mean and if he want to take a more reasonable approach, he would use Median"]
[1043651]
[272952,null,null,"Sorted"]
[150892,null,{"$f":"ROWS(C$12:C12)","v":1},{"$f":"LARGE($A$2:$A$30,C12)","v":1266258}]
[284008,null,{"$f":"ROWS(C$12:C13)","v":2},{"$f":"LARGE($A$2:$A$30,C13)","v":1043651}]
[192061,null,{"$f":"ROWS(C$12:C14)","v":3},843136]
[194563,null,{"$f":"ROWS(C$12:C15)","v":4},284008]
[270528,null,{"$f":"ROWS(C$12:C16)","v":5},275754]
[180347,null,{"$f":"ROWS(C$12:C17)","v":6},272952]
[139844,null,{"$f":"ROWS(C$12:C18)","v":7},270528]
[196515,null,{"$f":"ROWS(C$12:C19)","v":8},266064]
[843136,null,{"$f":"ROWS(C$12:C20)","v":9},260104]
[126357,null,{"$f":"ROWS(C$12:C21)","v":10},255392]
[139393,null,{"$f":"ROWS(C$12:C22)","v":11},250974]
[255392,null,{"$f":"ROWS(C$12:C23)","v":12},246638]
[197379,null,{"$f":"ROWS(C$12:C24)","v":13},238830]
[152187,null,{"$f":"ROWS(C$12:C25)","v":14},232234]
[246638,null,{"$f":"ROWS(C$12:C26)","v":15},197379]
[260104,null,{"$f":"ROWS(C$12:C27)","v":16},196515]
[164684,null,{"$f":"ROWS(C$12:C28)","v":17},194563]
[150359,null,{"$f":"ROWS(C$12:C29)","v":18},192061]
[1266258,null,{"$f":"ROWS(C$12:C30)","v":19},180347]
[null,null,{"$f":"ROWS(C$12:C31)","v":20},164684]
[null,null,{"$f":"ROWS(C$12:C32)","v":21},159058]
[null,null,{"$f":"ROWS(C$12:C33)","v":22},152187]
[null,null,{"$f":"ROWS(C$12:C34)","v":23},150892]
[null,null,{"$f":"ROWS(C$12:C35)","v":24},150359]
[null,null,{"$f":"ROWS(C$12:C36)","v":25},140245]
[null,null,{"$f":"ROWS(C$12:C37)","v":26},139844]
[null,null,{"$f":"ROWS(C$12:C38)","v":27},139393]
[null,null,{"$f":"ROWS(C$12:C39)","v":28},127204]
[null,null,{"$f":"ROWS(C$12:C40)","v":29},126357]

{"sheet":"Mode","index":7,"n_rows":45,"n_cols":18,"rows_kept":45,"cut":false,"hidden":false,"merged":[]}
["Mode is a type of average used for nominal data (counting things)",null,null,null,null,null,null,null,null,null,null,null,1,"Great",null,null,null,"Formula to generate:"]
["The problem with mean is that if we add/count, we get 10/10 = 1",null,null,null,null,null,null,null,null,null,null,null,2,"Very Good",null,null,null,{"$f":"VLOOKUP(INT(RAND()*6+1),$M$1:$N$6,2)","v":"Great"}]
[null,null,null,null,null,null,null,null,null,null,null,null,3,"Good"]
[null,null,null,null,null,null,null,null,null,null,null,null,4,"OK"]
["Respondents asked to say whether they liked new soda",null,"Category","Frequency",null,null,null,null,null,null,null,null,5,"Don't Like"]
["Good",null,"Great",null,null,null,null,null,null,null,null,null,6,"Dislike Greatly"]
["Good",null,"Very Good"]
["Great",null,"Good",null,null,"< == this is the mode and becomes the \"average\" response, or typical response, one value that can stand in for all the values"]
["Good",null,"OK"]
["OK",null,"Don't Like"]
["OK",null,"Dislike Greatly"]
["Don't Like"]
["Don't Like"]
["Great"]
["Very Good"]
["Don't Like"]
["OK"]
["Very Good"]
["Very Good"]
["Great"]
["OK"]
["Dislike Greatly"]
["Good"]
["Don't Like"]
["Good"]
["Don't Like"]
["Very Good"]
["Good"]
["Dislike Greatly"]
["Great"]
["Good"]
["Great"]
["Dislike Greatly"]
["OK"]
["Dislike Greatly"]
["OK"]
["Good"]
["Good"]
["Don't Like"]
["Good"]
["Very Good"]
["Don't Like"]
["Very Good"]
["Dislike Greatly"]
["Very Good"]

{"sheet":"Mode (an)","index":8,"n_rows":45,"n_cols":18,"rows_kept":45,"cut":false,"hidden":true,"merged":[]}
["Mode is a type of average used for nominal data (counting things)",null,null,null,null,null,null,null,null,null,null,null,1,"Great",null,null,null,"Formula to generate:"]
["The problem with mean is that if we add/count, we get 10/10 = 1",null,null,null,null,null,null,null,null,null,null,null,2,"Very Good",null,null,null,{"$f":"VLOOKUP(INT(RAND()*6+1),$M$1:$N$6,2)","v":"Good"}]
[null,null,null,null,null,null,null,null,null,null,null,null,3,"Good"]
[null,null,null,null,null,null,null,null,null,null,null,null,4,"OK"]
["Respondents asked to say whether they liked new soda",null,"Category","Frequency",null,null,null,null,null,null,null,null,5,"Don't Like"]
["Good",null,"Great",{"$f":"COUNTIF($A$6:$A$45,C6)","v":5},null,null,null,null,null,null,null,null,6,"Dislike Greatly"]
["Good",null,"Very Good",{"$f":"COUNTIF($A$6:$A$45,C7)","v":7}]
["Great",null,"Good",10,null,"< == this is the mode and becomes the \"average\" response, or typical response, one value that can stand in for all the values"]
["Good",null,"OK",6]
["OK",null,"Don't Like",7]
["OK",null,"Dislike Greatly",5]
["Don't Like"]
["Don't Like"]
["Great"]
["Very Good"]
["Don't Like"]
["OK"]
["Very Good"]
["Very Good"]
["Great"]
["OK"]
["Dislike Greatly"]
["Good"]
["Don't Like"]
["Good"]
["Don't Like"]
["Very Good"]
["Good"]
["Dislike Greatly"]
["Great"]
["Good"]
["Great"]
["Dislike Greatly"]
["OK"]
["Dislike Greatly"]
["OK"]
["Good"]
["Good"]
["Don't Like"]
["Good"]
["Very Good"]
["Don't Like"]
["Very Good"]
["Dislike Greatly"]
["Very Good"]

{"sheet":"Frequency","index":9,"n_rows":304,"n_cols":17,"rows_kept":304,"cut":false,"hidden":false,"merged":[]}
["Test Scores Last Two Years",null,"lower (included)","upper (not included)","Score Bin","Frequency","Relative Frequency",null,null,null,"Frequency","Frequency",null,null,null,null,"Rand formula:"]
[34,null,0,{"$f":"C2+10","v":10},null,null,null,null,null,null,{"$f":"COUNTIF($A$2:$A$304,\"<\"&D2)-COUNTIF($A$2:$A$304,\"<\"&C2)","v":14},{"$f":"SUMPRODUCT(--($A$2:$A$304>=C2),--($A$2:$A$304<D2))","v":14},null,null,null,null,{"$f":"IF(MOD(ROW(),7),INT(RAND()*100+1),80+INT(RAND()*20+1))","v":55}]
[91,null,{"$f":"D2","v":10},{"$f":"C3+10","v":20},null,null,null,null,null,null,28,28]
[72,null,{"$f":"D3","v":20},{"$f":"C4+10","v":30},null,null,null,null,null,null,28,28]
[28,null,30,40,null,null,null,null,null,null,24,24]
[90,null,40,50,null,null,null,null,null,null,18,18]
[98,null,50,60,null,null,null,null,null,null,27,27]
[29,null,60,70,null,null,null,null,null,null,24,24]
[89,null,{"$f":"D8","v":70},{"$f":"C9+10","v":80},null,null,null,null,null,null,30,30]
[53,null,80,90,null,null,null,null,null,null,42,42]
[90,null,90,100,null,null,null,null,null,null,60,60]
[40,null,null,null,"Total"]
[15]
[92]
[13]
[39]
[90]
[18]
[50]
[13]
[87]
[88]
[12]
[85]
[20]
[46]
[17]
[88]
[74]
[27]
[4]
[62]
[95]
[63]
[94]
[62]
[41]
[91]
[51]
[60]
[4]
[85]
[100]
[60]
[8]
[11]
[73]
[26]
[99]
[52]
[28]
[3]
[41]
[76]
[53]
[92]
[7]
[98]
[25]
[57]
[9]
[88]
[96]
[55]
[22]
[86]
[65]
[91]
[35]
[91]
[96]
[58]
[28]
[24]
[51]
[28]
[92]
[48]
[31]
[10]
[17]
[73]
[6]
[98]
[76]
[10]
[30]
[30]
[77]
[82]
[94]
[92]
[58]
[26]
[80]
[73]
[98]
[96]
[52]
[32]
[81]
[32]
[20]
[14]
[81]
[64]
[100]
[90]
[22]
[13]
[62]
[97]
[23]
[33]
[16]
[26]
[63]
[12]
[81]
[100]
[31]
[99]
[99]
[32]
[20]
[83]
[22]
[82]
[67]
[43]
[85]
[86]
[82]
[74]
[100]
[79]
[63]
[41]
[72]
[87]
[92]
[71]
[68]
[68]
[88]
[47]
[87]
[25]
[31]
[11]
[10]
[15]
[92]
[88]
[33]
[71]
[70]
[58]
[99]
[80]
[97]
[56]
[16]
[94]
[100]
[62]
[1]
[84]
[94]
[90]
[36]
[87]
[68]
[25]
[93]
[22]
[19]
[9]
[63]
[42]
[59]
[94]
[63]
[12]
[69]
[71]
[13]
[3]
[100]
[28]
[52]
[15]
[64]
[70]
[41]
[87]
[48]
[22]
[97]
[87]
[24]
[95]
[89]
[34]
[15]
[36]
[98]
[38]
[98]
[94]
[78]
[95]
[35]
[75]
[70]
[14]
[90]
[76]
[69]
[2]
[57]
[30]
[45]
[87]
[18]
[76]
[70]
[95]
[58]
[46]
[96]
[94]
[92]
[51]
[73]
[74]
[1]
[99]
[83]
[84]
[49]
[57]
[21]
[100]
[85]
[39]
[32]
[48]
[96]
[90]
[80]
[97]
[44]
[93]
[92]
[55]
[70]
[57]
[97]
[53]
[17]
[52]
[68]
[79]
[89]
[96]
[73]
[53]
[73]
[80]
[99]
[93]
[89]
[45]
[70]
[67]
[93]
[67]
[24]
[85]
[18]
[8]
[80]
[34]
[58]
[19]
[98]
[95]
[33]
[45]
[85]
[80]
[86]
[100]
[25]
[71]
[82]
[4]
[55]
[33]
[94]
[60]
[21]
[55]

{"sheet":"Frequency (an)","index":10,"n_rows":304,"n_cols":17,"rows_kept":304,"cut":false,"hidden":true,"merged":[]}
["Test Scores Last Two Years",null,"lower (included)","upper (not included)","Score Bin","Frequency","Relative Frequency",null,null,null,"Frequency","Frequency",null,null,null,null,"Rand formula:"]
[34,null,0,{"$f":"C2+10","v":10},{"$f":"C2&\" up to \"&D2","v":"0 up to 10"},{"$f":"COUNTIFS($A$2:$A$304,\">=\"&C2,$A$2:$A$304,\"<\"&D2)","v":14},{"$f":"F2/F$12","v":4.7457627118644069E-2},null,null,null,{"$f":"COUNTIF($A$2:$A$304,\"<\"&D2)-COUNTIF($A$2:$A$304,\"<\"&C2)","v":14},{"$f":"SUMPRODUCT(--($A$2:$A$304>=C2),--($A$2:$A$304<D2))","v":14},null,null,null,null,{"$f":"IF(MOD(ROW(),7),INT(RAND()*100+1),80+INT(RAND()*20+1))","v":39}]
[91,null,{"$f":"D2","v":10},{"$f":"C3+10","v":20},"10 up to 20",28,{"$f":"F3/F$12","v":9.4915254237288138E-2},null,null,null,28,28]
[72,null,{"$f":"D3","v":20},{"$f":"C4+10","v":30},"20 up to 30",28,9.4915254237288138E-2,null,null,null,28,28]
[28,null,30,40,"30 up to 40",24,8.1355932203389825E-2,null,null,null,24,24]
[90,null,40,50,"40 up to 50",18,6.1016949152542375E-2,null,null,null,18,18]
[98,null,50,60,"50 up to 60",27,9.152542372881356E-2,null,null,null,27,27]
[29,null,60,70,"60 up to 70",24,8.1355932203389825E-2,null,null,null,24,24]
[89,null,{"$f":"D8","v":70},{"$f":"C9+10","v":80},"70 up to 80",30,0.10169491525423729,null,null,null,30,30]
[53,null,80,90,"80 up to 90",42,0.14237288135593221,null,null,null,42,42]
[90,null,90,100,"90 up to 100",60,0.20338983050847459,null,null,null,60,60]
[40,null,null,null,"Total",{"$f":"SUM(F2:F11)","v":295},{"$f":"SUM(G2:G11)","v":0.99999999999999989}]
[15]
[92]
[13]
[39]
[90]
[18]
[50]
[13]
[87]
[88]
[12]
[85]
[20]
[46]
[17]
[88]
[74]
[27]
[4]
[62]
[95]
[63]
[94]
[62]
[41]
[91]
[51]
[60]
[4]
[85]
[100]
[60]
[8]
[11]
[73]
[26]
[99]
[52]
[28]
[3]
[41]
[76]
[53]
[92]
[7]
[98]
[25]
[57]
[9]
[88]
[96]
[55]
[22]
[86]
[65]
[91]
[35]
[91]
[96]
[58]
[28]
[24]
[51]
[28]
[92]
[48]
[31]
[10]
[17]
[73]
[6]
[98]
[76]
[10]
[30]
[30]
[77]
[82]
[94]
[92]
[58]
[26]
[80]
[73]
[98]
[96]
[52]
[32]
[81]
[32]
[20]
[14]
[81]
[64]
[100]
[90]
[22]
[13]
[62]
[97]
[23]
[33]
[16]
[26]
[63]
[12]
[81]
[100]
[31]
[99]
[99]
[32]
[20]
[83]
[22]
[82]
[67]
[43]
[85]
[86]
[82]
[74]
[100]
[79]
[63]
[41]
[72]
[87]
[92]
[71]
[68]
[68]
[88]
[47]
[87]
[25]
[31]
[11]
[10]
[15]
[92]
[88]
[33]
[71]
[70]
[58]
[99]
[80]
[97]
[56]
[16]
[94]
[100]
[62]
[1]
[84]
[94]
[90]
[36]
[87]
[68]
[25]
[93]
[22]
[19]
[9]
[63]
[42]
[59]
[94]
[63]
[12]
[69]
[71]
[13]
[3]
[100]
[28]
[52]
[15]
[64]
[70]
[41]
[87]
[48]
[22]
[97]
[87]
[24]
[95]
[89]
[34]
[15]
[36]
[98]
[38]
[98]
[94]
[78]
[95]
[35]
[75]
[70]
[14]
[90]
[76]
[69]
[2]
[57]
[30]
[45]
[87]
[18]
[76]
[70]
[95]
[58]
[46]
[96]
[94]
[92]
[51]
[73]
[74]
[1]
[99]
[83]
[84]
[49]
[57]
[21]
[100]
[85]
[39]
[32]
[48]
[96]
[90]
[80]
[97]
[44]
[93]
[92]
[55]
[70]
[57]
[97]
[53]
[17]
[52]
[68]
[79]
[89]
[96]
[73]
[53]
[73]
[80]
[99]
[93]
[89]
[45]
[70]
[67]
[93]
[67]
[24]
[85]
[18]
[8]
[80]
[34]
[58]
[19]
[98]
[95]
[33]
[45]
[85]
[80]
[86]
[100]
[25]
[71]
[82]
[4]
[55]
[33]
[94]
[60]
[21]
[55]

{"sheet":"Large Small","index":11,"n_rows":1190,"n_cols":17,"rows_kept":1190,"cut":false,"hidden":false,"merged":[]}
["Sales Rep","Sales",null,"#","Large",null,"Sales Rep","Time To Make Part",null,"#","Small",null,null,null,null,null,"Rand formulas:"]
["Richard",5937,null,1,null,null,"Denise",4.1260000000000003,null,1,null,null,null,null,null,null,{"$f":"INDEX(Names,INT(RAND()*COUNTA(Names)+1))","v":"Sarah"}]
["Manavbir",19551,null,2,null,null,"Manavbir",4.5199999999999996,null,2,null,null,null,null,null,null,{"$f":"IF(MOD(ROW(),100),RANDBETWEEN(5000,50000),RANDBETWEEN(60000,100000))","v":42238}]
["Janita",22010,null,3,null,null,"Nelia",3.742,null,3,null,null,null,null,null,null,{"$f":"IF(MOD(ROW(),375),RANDBETWEEN(2000,5000)/1000,RANDBETWEEN(1000,1750)/1000)","v":2.0419999999999998}]
["Mitchell",26146,null,4,null,null,"Nelia",3.92,null,4]
["Christina",16621,null,5,null,null,"Denise",4.4260000000000002,null,5]
["Nakyun",37653,null,null,null,null,"Denise",2.12]
["Mitchell",16018,null,"#","Large",null,"Carol",2.0230000000000001,null,"#","Large"]
["Daniel",31850,null,null,null,null,"Kaur",2.7309999999999999]
["Mi",29517,null,null,null,null,"Shari",2.4340000000000002]
["Richard",47477,null,null,null,null,"Mitchell",4.1959999999999997]
["Kaur",9008,null,null,null,null,"Janita",4.4580000000000002]
["Ewelina",13547,null,null,null,null,"Michael",4.0880000000000001]
["Ewelina",49100,null,null,null,null,"Debra",4.8360000000000003]
["Mitchell",26324,null,null,null,null,"Yla-Katrina",3.1819999999999999]
["Nelia",38612,null,null,null,null,"Ewelina",2.8279999999999998]
["Craig",40900,null,null,null,null,"Ewelina",4.9260000000000002]
["Carol",26761,null,null,null,null,"Janita",3.4140000000000001]
["Nelia",21598,null,null,null,null,"Sarah",2.6509999999999998]
["Denise",6625,null,null,null,null,"Carol",3.4129999999999998]
["Richard",37758,null,null,null,null,"Shari",3.915]
["Nelia",45437,null,null,null,null,"Michael",2.5659999999999998]
["Nelia",18107,null,null,null,null,"Debra",4.6879999999999997]
["Richard",39241,null,null,null,null,"Craig",2.1379999999999999]
["Sarah",7544,null,null,null,null,"Denise",4.6479999999999997]
["Nakyun",38052,null,null,null,null,"Shari",3.484]
["Janita",27275,null,null,null,null,"Carol",2.9540000000000002]
["Kaur",32573,null,null,null,null,"Denise",4.6849999999999996]
["Shari",32327,null,null,null,null,"Carol",4.274]
["Shari",15245,null,null,null,null,"Carol",3.1120000000000001]
["Yla-Katrina",38620,null,null,null,null,"Nelia",3.1589999999999998]
["Denise",26444,null,null,null,null,"Carol",4.92]
["Richard",40199,null,null,null,null,"Michael",3.452]
["Carol",36011,null,null,null,null,"Yla-Katrina",4.2859999999999996]
["Michelle",45422,null,null,null,null,"Nelia",3.5049999999999999]
["Nakyun",40283,null,null,null,null,"Daniel",2.7120000000000002]
["Ewelina",37862,null,null,null,null,"Craig",2.778]
["Janita",47855,null,null,null,null,"Michael",3.911]
["Nelia",29383,null,null,null,null,"Michelle",3.6720000000000002]
["Mi",36334,null,null,null,null,"Ewelina",4.742]
["Nakyun",40325,null,null,null,null,"Kaur",4.516]
["Manavbir",7257,null,null,null,null,"Mansa",4.2409999999999997]
["Janita",6429,null,null,null,null,"Sarah",4.8380000000000001]
["Manavbir",32666,null,null,null,null,"Mansa",2.6160000000000001]
["Shari",14516,null,null,null,null,"Daniel",2.8029999999999999]
["Manavbir",17731,null,null,null,null,"Sykes",3.468]
["Mi",40705,null,null,null,null,"Nelia",3.8039999999999998]
["Craig",7940,null,null,null,null,"Manavbir",2.1419999999999999]
["Nelia",16064,null,null,null,null,"Carol",2.9620000000000002]
["Shari",34144,null,null,null,null,"Manavbir",4.907]
["Michael",32784,null,null,null,null,"Nelia",2.6240000000000001]
["Elain",9958,null,null,null,null,"Michelle",4.7229999999999999]
["Nelia",48074,null,null,null,null,"Michael",3.3530000000000002]
["Gianna",36132,null,null,null,null,"Michelle",4.3369999999999997]
["Denise",11251,null,null,null,null,"Craig",3.5129999999999999]
["Denise",47943,null,null,null,null,"Carol",2.7829999999999999]
["Jason",44129,null,null,null,null,"Michael",2.1320000000000001]
["Craig",7793,null,null,null,null,"Mi",3.6739999999999999]
["Richard",14712,null,null,null,null,"Shari",4.431]
["Craig",45146,null,null,null,null,"Kaur",4.3259999999999996]
["Debra",21954,null,null,null,null,"Nakyun",2.7]
["Ewelina",33319,null,null,null,null,"Manavbir",2.5179999999999998]
["Manavbir",7638,null,null,null,null,"Sykes",3.117]
["Richard",15678,null,null,null,null,"Kaur",3.7170000000000001]
["Sarah",7138,null,null,null,null,"Denise",3.6219999999999999]
["Gianna",40848,null,null,null,null,"Shari",2.99]
["Nelia",32714,null,null,null,null,"Elain",4.3520000000000003]
["Sarah",46889,null,null,null,null,"Sarah",2.048]
["Manavbir",25614,null,null,null,null,"Daniel",2.6949999999999998]
["Kaur",5294,null,null,null,null,"Kaur",2.6059999999999999]
["Elain",19448,null,null,null,null,"Nelia",2.2010000000000001]
["Gianna",7232,null,null,null,null,"Kaur",3.7450000000000001]
["Debra",49129,null,null,null,null,"Nakyun",2.6230000000000002]
["Jason",10720,null,null,null,null,"Ewelina",2.488]
["Shari",8892,null,null,null,null,"Michael",3.3460000000000001]
["Nelia",15063,null,null,null,null,"Nakyun",2.3820000000000001]
["Sarah",44344,null,null,null,null,"Mansa",3.2519999999999998]
["Jason",48600,null,null,null,null,"Richard",3.319]
["Mitchell",28247,null,null,null,null,"Richard",2.302]
["Gianna",44470,null,null,null,null,"Sarah",2.984]
["Jason",9839,null,null,null,null,"Michelle",3.3380000000000001]
["Michael",9584,null,null,null,null,"Debra",3.4590000000000001]
["Sarah",12220,null,null,null,null,"Debra",4.7590000000000003]
["Richard",15578,null,null,null,null,"Jason",3.6019999999999999]
["Sarah",45413,null,null,null,null,"Michelle",2.6219999999999999]
["Gianna",31959,null,null,null,null,"Daniel",2.25]
["Mi",23107,null,null,null,null,"Jason",4.335]
["Sarah",28368,null,null,null,null,"Ewelina",4.4139999999999997]
["Michael",36489,null,null,null,null,"Michael",2.758]
["Yla-Katrina",5612,null,null,null,null,"Craig",4.2869999999999999]
["Christina",36978,null,null,null,null,"Michael",3.1779999999999999]
["Craig",24439,null,null,null,null,"Elain",3.8980000000000001]
["Mitchell",26715,null,null,null,null,"Christina",4.149]
["Mi",23882,null,null,null,null,"Jason",2.9180000000000001]
["Craig",21426,null,null,null,null,"Carol",4.76]
["Mitchell",38312,null,null,null,null,"Craig",2.4159999999999999]
["Mi",23551,null,null,null,null,"Jason",4.234]
["Nakyun",28866,null,null,null,null,"Nakyun",5]
["Nelia",8812,null,null,null,null,"Sykes",3.782]
["Sarah",61911,null,null,null,null,"Nakyun",4.12]
["Manavbir",16958,null,null,null,null,"Gianna",2.0950000000000002]
["Mi",17952,null,null,null,null,"Manavbir",4.5330000000000004]
["Elain",33291,null,null,null,null,"Elain",4.431]
["Mi",6800,null,null,null,null,"Yla-Katrina",2.8340000000000001]
["Carol",24953,null,null,null,null,"Daniel",4.8479999999999999]
["Nakyun",31603,null,null,null,null,"Yla-Katrina",2.8069999999999999]
["Michael",30943,null,null,null,null,"Sarah",2.238]
["Kaur",38208,null,null,null,null,"Mansa",3.0990000000000002]
["Mitchell",35127,null,null,null,null,"Elain",3.7519999999999998]
["Sykes",43569,null,null,null,null,"Denise",4.38]
["Carol",41682,null,null,null,null,"Mi",4.367]
["Mansa",42821,null,null,null,null,"Mi",4.444]
["Richard",20726,null,null,null,null,"Craig",3.1459999999999999]
["Sykes",25969,null,null,null,null,"Yla-Katrina",2.8610000000000002]
["Christina",46134,null,null,null,null,"Yla-Katrina",4.8559999999999999]
["Jason",43807,null,null,null,null,"Sarah",2.9780000000000002]
["Sarah",48593,null,null,null,null,"Michelle",2.722]
["Mitchell",43707,null,null,null,null,"Janita",4.907]
["Mitchell",45405,null,null,null,null,"Nelia",4.484]
["Debra",7850,null,null,null,null,"Craig",4.91]
["Manavbir",36076,null,null,null,null,"Kaur",3.7959999999999998]
["Nakyun",20109,null,null,null,null,"Debra",3.6080000000000001]
["Michelle",32743,null,null,null,null,"Debra",2.0870000000000002]
["Denise",19508,null,null,null,null,"Michelle",4.4109999999999996]
["Mitchell",16002,null,null,null,null,"Richard",2.3620000000000001]
["Nelia",16402,null,null,null,null,"Daniel",3.2040000000000002]
["Mitchell",12451,null,null,null,null,"Mansa",4.9249999999999998]
["Michelle",46644,null,null,null,null,"Michael",2.0299999999999998]
["Carol",44253,null,null,null,null,"Jason",3.32]
["Christina",49494,null,null,null,null,"Ewelina",2.5739999999999998]
["Nakyun",47340,null,null,null,null,"Craig",3.3849999999999998]
["Carol",6681,null,null,null,null,"Nakyun",2.4910000000000001]
["Nelia",40975,null,null,null,null,"Janita",3.968]
["Michelle",49190,null,null,null,null,"Richard",2.9740000000000002]
["Mansa",32908,null,null,null,null,"Mansa",4.2389999999999999]
["Nelia",7894,null,null,null,null,"Janita",4.6680000000000001]
["Yla-Katrina",31206,null,null,null,null,"Michelle",3.6419999999999999]
["Mi",45239,null,null,null,null,"Mi",3.5870000000000002]
["Jason",32214,null,null,null,null,"Craig",4.3120000000000003]
["Richard",14015,null,null,null,null,"Manavbir",3.173]
["Daniel",34706,null,null,null,null,"Shari",4.4790000000000001]
["Janita",45676,null,null,null,null,"Shari",3.5430000000000001]
["Ewelina",7488,null,null,null,null,"Craig",3.448]
["Denise",30415,null,null,null,null,"Michael",4.2670000000000003]
["Janita",19724,null,null,null,null,"Daniel",4.3520000000000003]
["Christina",5252,null,null,null,null,"Mi",4.1859999999999999]
["Sykes",39222,null,null,null,null,"Jason",4.9279999999999999]
["Gianna",11449,null,null,null,null,"Janita",3.7240000000000002]
["Ewelina",39876,null,null,null,null,"Mitchell",4.1459999999999999]
["Michelle",41728,null,null,null,null,"Gianna",3.617]
["Kaur",48797,null,null,null,null,"Sarah",3.177]
["Gianna",39504,null,null,null,null,"Janita",4.8280000000000003]
["Michael",14342,null,null,null,null,"Manavbir",3.0419999999999998]
["Jason",30224,null,null,null,null,"Shari",4.9349999999999996]
["Craig",38293,null,null,null,null,"Sarah",3.2719999999999998]
["Richard",43317,null,null,null,null,"Nakyun",3.4830000000000001]
["Denise",34112,null,null,null,null,"Carol",2.2519999999999998]
["Michael",48024,null,null,null,null,"Ewelina",3.3559999999999999]
["Kaur",47831,null,null,null,null,"Daniel",2.6]
["Michael",44663,null,null,null,null,"Daniel",2.9950000000000001]
["Jason",36798,null,null,null,null,"Jason",4.4429999999999996]
["Yla-Katrina",21365,null,null,null,null,"Yla-Katrina",4.8369999999999997]
["Nakyun",45944,null,null,null,null,"Denise",4.6479999999999997]
["Mitchell",33527,null,null,null,null,"Denise",4.2169999999999996]
["Sykes",48077,null,null,null,null,"Sarah",3.5569999999999999]
["Mi",16983,null,null,null,null,"Kaur",3.1230000000000002]
["Michelle",6251,null,null,null,null,"Michelle",4.0789999999999997]
["Kaur",20968,null,null,null,null,"Yla-Katrina",3.403]
["Mitchell",9759,null,null,null,null,"Elain",4.1639999999999997]
["Shari",11835,null,null,null,null,"Mi",2.7559999999999998]
["Mansa",14181,null,null,null,null,"Debra",2.2650000000000001]
["Carol",10117,null,null,null,null,"Michelle",4.0620000000000003]
["Ewelina",48418,null,null,null,null,"Richard",4.7960000000000003]
["Carol",36245,null,null,null,null,"Debra",2.4079999999999999]
["Denise",31306,null,null,null,null,"Shari",4.0510000000000002]
["Daniel",7240,null,null,null,null,"Richard",4.2110000000000003]
["Yla-Katrina",14883,null,null,null,null,"Yla-Katrina",2.6579999999999999]
["Carol",13871,null,null,null,null,"Yla-Katrina",4.7519999999999998]
["Mi",26792,null,null,null,null,"Nelia",3.0459999999999998]
["Sarah",13150,null,null,null,null,"Michelle",3.4820000000000002]
["Ewelina",47850,null,null,null,null,"Ewelina",3.1150000000000002]
["Denise",40529,null,null,null,null,"Mansa",4.0090000000000003]
["Debra",35013,null,null,null,null,"Michael",4.4640000000000004]
["Janita",16459,null,null,null,null,"Manavbir",4.3120000000000003]
["Nakyun",10897,null,null,null,null,"Sarah",3.1869999999999998]
["Craig",24361,null,null,null,null,"Shari",3.4670000000000001]
["Kaur",44746,null,null,null,null,"Ewelina",3.7120000000000002]
["Jason",20768,null,null,null,null,"Nelia",4.4809999999999999]
["Michelle",22517,null,null,null,null,"Michael",2.5430000000000001]
["Yla-Katrina",11307,null,null,null,null,"Michelle",2.274]
["Craig",14094,null,null,null,null,"Daniel",2.2509999999999999]
["Yla-Katrina",39123,null,null,null,null,"Michelle",3.589]
["Kaur",28032,null,null,null,null,"Shari",4.1719999999999997]
["Carol",10296,null,null,null,null,"Mitchell",3.512]
["Daniel",42922,null,null,null,null,"Jason",2.653]
["Elain",37938,null,null,null,null,"Sarah",2.133]
["Richard",10818,null,null,null,null,"Manavbir",2.5569999999999999]
["Mi",11023,null,null,null,null,"Mitchell",2.1019999999999999]
["Yla-Katrina",23907,null,null,null,null,"Mi",4.202]
["Mi",84341,null,null,null,null,"Michelle",2.2480000000000002]
["Daniel",14845,null,null,null,null,"Richard",2.6760000000000002]
["Debra",27986,null,null,null,null,"Christina",3.0449999999999999]
["Michael",33726,null,null,null,null,"Jason",4.9320000000000004]
["Michelle",33481,null,null,null,null,"Nelia",2.5409999999999999]
["Sarah",46579,null,null,null,null,"Nelia",2.274]
["Denise",23604,null,null,null,null,"Jason",2.86]
["Gianna",38016,null,null,null,null,"Nakyun",3.7850000000000001]
["Sarah",18547,null,null,null,null,"Denise",3.21]
["Mi",41094,null,null,null,null,"Richard",2.9580000000000002]
["Janita",10588,null,null,null,null,"Jason",2.6150000000000002]
["Sarah",47493,null,null,null,null,"Craig",3.5550000000000002]
["Nelia",34971,null,null,null,null,"Nakyun",4.952]
["Michael",23413,null,null,null,null,"Richard",2.7349999999999999]
["Janita",49867,null,null,null,null,"Mi",3.7610000000000001]
["Elain",11745,null,null,null,null,"Mitchell",2.4260000000000002]
["Mi",9451,null,null,null,null,"Craig",3.4260000000000002]
["Mitchell",48527,null,null,null,null,"Carol",2.8290000000000002]
["Nakyun",32380,null,null,null,null,"Craig",2.016]
["Denise",8402,null,null,null,null,"Mi",3.335]
["Christina",40229,null,null,null,null,"Mi",2.0910000000000002]
["Kaur",11941,null,null,null,null,"Debra",2.0550000000000002]
["Craig",7598,null,null,null,null,"Elain",2.5339999999999998]
["Mi",7226,null,null,null,null,"Yla-Katrina",2.16]
["Elain",47146,null,null,null,null,"Debra",2.1030000000000002]
["Kaur",48535,null,null,null,null,"Jason",3.1150000000000002]
["Yla-Katrina",8838,null,null,null,null,"Mi",3.5529999999999999]
["Daniel",13845,null,null,null,null,"Sarah",2.391]
["Debra",43911,null,null,null,null,"Debra",3.0550000000000002]
["Jason",48938,null,null,null,null,"Shari",2.4119999999999999]
["Craig",26349,null,null,null,null,"Manavbir",2.8519999999999999]
["Daniel",46577,null,null,null,null,"Mi",3.484]
["Sykes",7542,null,null,null,null,"Debra",4.0039999999999996]
["Craig",42462,null,null,null,null,"Sykes",2.8340000000000001]
["Mitchell",21637,null,null,null,null,"Yla-Katrina",3.6120000000000001]
["Mitchell",23836,null,null,null,null,"Mi",3.8290000000000002]
["Yla-Katrina",5407,null,null,null,null,"Mansa",2.6909999999999998]
["Debra",27142,null,null,null,null,"Sarah",2.7010000000000001]
["Ewelina",45973,null,null,null,null,"Mansa",4.71]
["Carol",31678,null,null,null,null,"Sykes",2.923]
["Kaur",22202,null,null,null,null,"Michelle",2.3149999999999999]
["Jason",40146,null,null,null,null,"Michelle",4.6100000000000003]
["Shari",40689,null,null,null,null,"Michael",3.5409999999999999]
["Michael",34941,null,null,null,null,"Kaur",4.0810000000000004]
["Richard",5774,null,null,null,null,"Janita",3.6]
["Denise",22946,null,null,null,null,"Shari",3.7509999999999999]
["Kaur",10727,null,null,null,null,"Christina",4.9050000000000002]
["Daniel",6427,null,null,null,null,"Denise",4.2610000000000001]
["Denise",40983,null,null,null,null,"Mitchell",4.976]
["Shari",27878,null,null,null,null,"Elain",3.5059999999999998]
["Michael",22496,null,null,null,null,"Michelle",3]
["Jason",16731,null,null,null,null,"Elain",2.9319999999999999]
["Nakyun",43564,null,null,null,null,"Michael",4.8570000000000002]
["Nakyun",20898,null,null,null,null,"Christina",3.794]
["Nakyun",16167,null,null,null,null,"Nakyun",4.16]
["Jason",19304,null,null,null,null,"Craig",4.93]
["Mi",49558,null,null,null,null,"Denise",4.0469999999999997]
["Debra",14373,null,null,null,null,"Mitchell",2.7240000000000002]
["Mi",31995,null,null,null,null,"Gianna",4.1689999999999996]
["Sykes",45150,null,null,null,null,"Yla-Katrina",4.9219999999999997]
["Mitchell",10053,null,null,null,null,"Janita",2.5710000000000002]
["Craig",22612,null,null,null,null,"Jason",4.2089999999999996]
["Janita",10439,null,null,null,null,"Carol",2.8959999999999999]
["Jason",26481,null,null,null,null,"Yla-Katrina",3.2240000000000002]
["Yla-Katrina",24448,null,null,null,null,"Mi",4.0010000000000003]
["Gianna",13656,null,null,null,null,"Elain",4.9640000000000004]
["Michelle",25184,null,null,null,null,"Elain",4.8369999999999997]
["Denise",23349,null,null,null,null,"Michelle",3.206]
["Denise",9096,null,null,null,null,"Ewelina",4.09]
["Yla-Katrina",8374,null,null,null,null,"Mi",2.0579999999999998]
["Craig",47501,null,null,null,null,"Nakyun",2.298]
["Debra",44007,null,null,null,null,"Richard",4.1539999999999999]
["Debra",15399,null,null,null,null,"Ewelina",4.7270000000000003]
["Mi",37590,null,null,null,null,"Sarah",2.2559999999999998]
["Gianna",18199,null,null,null,null,"Manavbir",3.74]
["Debra",47968,null,null,null,null,"Nakyun",4.6559999999999997]
["Yla-Katrina",28941,null,null,null,null,"Sarah",3.2650000000000001]
["Christina",42362,null,null,null,null,"Christina",2.3159999999999998]
["Richard",33614,null,null,null,null,"Mi",4.952]
["Nelia",6046,null,null,null,null,"Michael",3.23]
["Manavbir",47527,null,null,null,null,"Richard",4.9880000000000004]
["Michelle",36535,null,null,null,null,"Gianna",2.383]
["Denise",42345,null,null,null,null,"Richard",4.0410000000000004]
["Craig",23694,null,null,null,null,"Yla-Katrina",4.367]
["Nelia",9440,null,null,null,null,"Ewelina",3.5449999999999999]
["Sykes",24657,null,null,null,null,"Craig",3.9260000000000002]
["Christina",37870,null,null,null,null,"Nakyun",3.9729999999999999]
["Mansa",30641,null,null,null,null,"Craig",3.61]
["Mi",17354,null,null,null,null,"Denise",4.4080000000000004]
["Michelle",11498,null,null,null,null,"Mansa",2.121]
["Carol",28088,null,null,null,null,"Ewelina",2.3940000000000001]
["Richard",10357,null,null,null,null,"Carol",4.258]
["Carol",38344,null,null,null,null,"Daniel",3.931]
["Mi",24051,null,null,null,null,"Sykes",4.9169999999999998]
["Mansa",13989,null,null,null,null,"Richard",3.4369999999999998]
["Janita",31421,null,null,null,null,"Christina",3.423]
["Nelia",33653,null,null,null,null,"Mansa",4.4909999999999997]
["Sarah",21935,null,null,null,null,"Manavbir",3.2429999999999999]
["Richard",15527,null,null,null,null,"Carol",4.2409999999999997]
["Nelia",13689,null,null,null,null,"Elain",3.133]
["Denise",61035,null,null,null,null,"Sykes",4.4909999999999997]
["Gianna",26689,null,null,null,null,"Shari",2.194]
["Elain",32440,null,null,null,null,"Mitchell",3.7080000000000002]
["Christina",30375,null,null,null,null,"Richard",4.8079999999999998]
["Elain",19863,null,null,null,null,"Kaur",4.2850000000000001]
["Craig",8754,null,null,null,null,"Kaur",4.79]
["Debra",9277,null,null,null,null,"Sykes",2.7010000000000001]
["Yla-Katrina",22707,null,null,null,null,"Richard",3.0259999999999998]
["Mi",6965,null,null,null,null,"Elain",3.157]
["Gianna",44347,null,null,null,null,"Shari",2.952]
["Michael",5327,null,null,null,null,"Mi",3.121]
["Sarah",29380,null,null,null,null,"Daniel",2.056]
["Kaur",13564,null,null,null,null,"Christina",2.6560000000000001]
["Manavbir",43079,null,null,null,null,"Elain",4.5010000000000003]
["Yla-Katrina",31417,null,null,null,null,"Janita",3.1720000000000002]
["Mitchell",39035,null,null,null,null,"Daniel",2.3980000000000001]
["Richard",42648,null,null,null,null,"Craig",4.7229999999999999]
["Nakyun",22714,null,null,null,null,"Michael",3.9809999999999999]
["Carol",38929,null,null,null,null,"Gianna",3.5990000000000002]
["Mansa",49670,null,null,null,null,"Michael",3.355]
["Craig",35552,null,null,null,null,"Nelia",4.2039999999999997]
["Manavbir",31306,null,null,null,null,"Mi",3.0750000000000002]
["Manavbir",6432,null,null,null,null,"Denise",3.98]
["Elain",23208,null,null,null,null,"Debra",2.7290000000000001]
["Elain",39351,null,null,null,null,"Ewelina",3.2469999999999999]
["Carol",49361,null,null,null,null,"Michelle",4.3310000000000004]
["Richard",47967,null,null,null,null,"Elain",2.6880000000000002]
["Janita",21203,null,null,null,null,"Jason",3.2149999999999999]
["Jason",6019,null,null,null,null,"Shari",3.0510000000000002]
["Janita",5159,null,null,null,null,"Mi",4.5209999999999999]
["Elain",26631,null,null,null,null,"Richard",2.6110000000000002]
["Christina",29166,null,null,null,null,"Christina",3.6749999999999998]
["Sarah",28114,null,null,null,null,"Mitchell",2.0859999999999999]
["Kaur",21329,null,null,null,null,"Elain",4.0289999999999999]
["Craig",6195,null,null,null,null,"Yla-Katrina",4.5449999999999999]
["Michael",30818,null,null,null,null,"Janita",2.6829999999999998]
["Debra",28737,null,null,null,null,"Michelle",3.1850000000000001]
["Christina",26855,null,null,null,null,"Jason",2.1960000000000002]
["Sykes",6522,null,null,null,null,"Carol",2.3610000000000002]
["Carol",18519,null,null,null,null,"Carol",2.677]
["Nakyun",40619,null,null,null,null,"Mansa",3.2290000000000001]
["Jason",46307,null,null,null,null,"Mitchell",3.6669999999999998]
["Elain",37743,null,null,null,null,"Michael",3.5739999999999998]
["Yla-Katrina",35176,null,null,null,null,"Mitchell",2.4889999999999999]
["Sarah",21573,null,null,null,null,"Carol",4.2080000000000002]
["Denise",25778,null,null,null,null,"Mi",2.5880000000000001]
["Sykes",7358,null,null,null,null,"Nelia",2.048]
["Michelle",43754,null,null,null,null,"Denise",2.077]
["Elain",6738,null,null,null,null,"Michael",4.0209999999999999]
["Janita",27030,null,null,null,null,"Ewelina",2.4670000000000001]
["Jason",38189,null,null,null,null,"Elain",2.6059999999999999]
["Sykes",28769,null,null,null,null,"Ewelina",2.9430000000000001]
["Denise",10865,null,null,null,null,"Jason",4.9109999999999996]
["Nakyun",10587,null,null,null,null,"Mansa",3.9039999999999999]
["Sarah",22267,null,null,null,null,"Nakyun",3.73]
["Mansa",15214,null,null,null,null,"Daniel",4.7169999999999996]
["Nakyun",32041,null,null,null,null,"Daniel",2.4079999999999999]
["Sykes",6664,null,null,null,null,"Michael",4.2359999999999998]
["Mansa",5167,null,null,null,null,"Daniel",4.7329999999999997]
["Christina",43654,null,null,null,null,"Manavbir",4.8540000000000001]
["Mitchell",35145,null,null,null,null,"Ewelina",4.53]
["Nakyun",15473,null,null,null,null,"Richard",2.2759999999999998]
["Sarah",8635,null,null,null,null,"Kaur",2.0870000000000002]
["Craig",16770,null,null,null,null,"Mansa",4.4189999999999996]
["Kaur",46271,null,null,null,null,"Mansa",2.6360000000000001]
["Mi",11914,null,null,null,null,"Mitchell",4.9450000000000003]
["Mansa",20113,null,null,null,null,"Jason",4.7969999999999997]
["Richard",17645,null,null,null,null,"Shari",2.4220000000000002]
["Sarah",10320,null,null,null,null,"Manavbir",3.3860000000000001]
["Sykes",40362,null,null,null,null,"Michelle",2.2690000000000001]
["Sykes",16308,null,null,null,null,"Jason",4.8239999999999998]
["Sarah",31926,null,null,null,null,"Kaur",2.407]
["Mitchell",30781,null,null,null,null,"Mitchell",4.8739999999999997]
["Mansa",23470,null,null,null,null,"Denise",2.8149999999999999]
["Nelia",8146,null,null,null,null,"Manavbir",4.8769999999999998]
["Mitchell",12907,null,null,null,null,"Sarah",1.194]
["Yla-Katrina",28110,null,null,null,null,"Christina",2.8130000000000002]
["Daniel",10352,null,null,null,null,"Gianna",2.1269999999999998]
["Sarah",42277,null,null,null,null,"Nelia",3.6850000000000001]
["Manavbir",14040,null,null,null,null,"Janita",3.7759999999999998]
["Debra",24222,null,null,null,null,"Mi",2.0979999999999999]
["Carol",11622,null,null,null,null,"Sykes",2.714]
["Craig",22470,null,null,null,null,"Nelia",4.0339999999999998]
["Ewelina",40967,null,null,null,null,"Shari",3.5619999999999998]
["Craig",28534,null,null,null,null,"Elain",2.0859999999999999]
["Yla-Katrina",17579,null,null,null,null,"Nakyun",4.1210000000000004]
["Mi",18950,null,null,null,null,"Jason",3.3639999999999999]
["Carol",30452,null,null,null,null,"Daniel",2.1589999999999998]
["Mi",23999,null,null,null,null,"Debra",2.032]
["Gianna",21391,null,null,null,null,"Richard",2.823]
["Daniel",7023,null,null,null,null,"Christina",3.411]
["Jason",32947,null,null,null,null,"Nakyun",4.9320000000000004]
["Carol",15859,null,null,null,null,"Richard",3.7229999999999999]
["Debra",23275,null,null,null,null,"Daniel",3.7839999999999998]
["Nakyun",47824,null,null,null,null,"Carol",2.1760000000000002]
["Mitchell",32143,null,null,null,null,"Ewelina",3.7530000000000001]
["Gianna",28160,null,null,null,null,"Nelia",2.6819999999999999]
["Sarah",39399,null,null,null,null,"Sarah",3.766]
["Gianna",21354,null,null,null,null,"Michelle",2.65]
["Daniel",15272,null,null,null,null,"Sykes",2.2719999999999998]
["Elain",79756,null,null,null,null,"Debra",4.43]
["Mansa",35133,null,null,null,null,"Christina",4.1550000000000002]
["Michelle",40375,null,null,null,null,"Janita",4.5350000000000001]
["Nelia",34345,null,null,null,null,"Jason",3.7370000000000001]
["Manavbir",9979,null,null,null,null,"Michael",2.907]
["Denise",24007,null,null,null,null,"Christina",3.1150000000000002]
["Christina",11615,null,null,null,null,"Michelle",4.1529999999999996]
["Yla-Katrina",37605,null,null,null,null,"Mansa",3.8130000000000002]
["Yla-Katrina",40732,null,null,null,null,"Sykes",3.9009999999999998]
["Michelle",40034,null,null,null,null,"Yla-Katrina",3.1539999999999999]
["Sarah",43849,null,null,null,null,"Richard",2.9340000000000002]
["Michelle",48799,null,null,null,null,"Sarah",2.7330000000000001]
["Richard",31813,null,null,null,null,"Mitchell",2.726]
["Elain",11093,null,null,null,null,"Gianna",2.9340000000000002]
["Sykes",5742,null,null,null,null,"Richard",3.4590000000000001]
["Kaur",40194,null,null,null,null,"Richard",3.1779999999999999]
["Christina",41133,null,null,null,null,"Shari",3.57]
["Mitchell",19410,null,null,null,null,"Elain",4.8730000000000002]
["Mitchell",34376,null,null,null,null,"Denise",4.9260000000000002]
["Richard",36010,null,null,null,null,"Mi",4.9729999999999999]
["Carol",18623,null,null,null,null,"Ewelina",4.0549999999999997]
["Kaur",17280,null,null,null,null,"Debra",3.4239999999999999]
["Richard",6550,null,null,null,null,"Gianna",4.798]
["Daniel",31661,null,null,null,null,"Michael",3.117]
["Shari",12062,null,null,null,null,"Nelia",3.7879999999999998]
["Craig",27479,null,null,null,null,"Mi",3.8820000000000001]
["Craig",14944,null,null,null,null,"Jason",2.4580000000000002]
["Debra",11620,null,null,null,null,"Mansa",2.9369999999999998]
["Sarah",48485,null,null,null,null,"Sarah",2.6760000000000002]
["Michael",46460,null,null,null,null,"Shari",4.26]
["Kaur",9036,null,null,null,null,"Sarah",2.7229999999999999]
["Mi",19017,null,null,null,null,"Craig",4.7919999999999998]
["Mi",46672,null,null,null,null,"Debra",4.2670000000000003]
["Carol",35922,null,null,null,null,"Sarah",2.1110000000000002]
["Yla-Katrina",6913,null,null,null,null,"Daniel",2.0859999999999999]
["Ewelina",35569,null,null,null,null,"Nelia",4.9939999999999998]
["Carol",46275,null,null,null,null,"Shari",2.0209999999999999]
["Sykes",39738,null,null,null,null,"Richard",4.0670000000000002]
["Janita",14240,null,null,null,null,"Janita",4.8159999999999998]
["Mansa",25768,null,null,null,null,"Gianna",4.625]
["Mansa",39626,null,null,null,null,"Shari",2.2349999999999999]
["Janita",33529,null,null,null,null,"Denise",2.3889999999999998]
["Carol",20056,null,null,null,null,"Gianna",2.1080000000000001]
["Michelle",27554,null,null,null,null,"Jason",3.194]
["Kaur",7803,null,null,null,null,"Daniel",4.6500000000000004]
["Nakyun",12044,null,null,null,null,"Mansa",3.298]
["Carol",26987,null,null,null,null,"Michelle",4.1470000000000002]
["Carol",5231,null,null,null,null,"Kaur",3.7109999999999999]
["Janita",18028,null,null,null,null,"Kaur",3.8450000000000002]
["Mansa",22701,null,null,null,null,"Carol",2.29]
["Craig",28066,null,null,null,null,"Gianna",4.67]
["Yla-Katrina",21219,null,null,null,null,"Kaur",2.4729999999999999]
["Shari",13231,null,null,null,null,"Richard",3.3069999999999999]
["Kaur",45316,null,null,null,null,"Jason",3.536]
["Michael",27239,null,null,null,null,"Elain",4.9619999999999997]
["Daniel",44965,null,null,null,null,"Denise",3.2490000000000001]
["Elain",14550,null,null,null,null,"Janita",3.742]
["Sarah",32846,null,null,null,null,"Nakyun",3.012]
["Michelle",26315,null,null,null,null,"Richard",3.5019999999999998]
["Janita",26159,null,null,null,null,"Nakyun",4.5869999999999997]
["Mansa",45837,null,null,null,null,"Sarah",2.1989999999999998]
["Debra",47813,null,null,null,null,"Kaur",4.6580000000000004]
["Denise",35590,null,null,null,null,"Ewelina",3.1320000000000001]
["Daniel",42916,null,null,null,null,"Ewelina",4.6369999999999996]
["Gianna",45836,null,null,null,null,"Daniel",2.4849999999999999]
["Michael",20507,null,null,null,null,"Manavbir",2.0009999999999999]
["Debra",13084,null,null,null,null,"Shari",4.8440000000000003]
["Richard",20582,null,null,null,null,"Yla-Katrina",3.4860000000000002]
["Mi",48001,null,null,null,null,"Mansa",4.3920000000000003]
["Daniel",40594,null,null,null,null,"Sarah",3.1829999999999998]
["Craig",42154,null,null,null,null,"Richard",2.7160000000000002]
["Sarah",5460,null,null,null,null,"Gianna",3.7160000000000002]
["Mansa",37976,null,null,null,null,"Kaur",2.6659999999999999]
["Yla-Katrina",39011,null,null,null,null,"Debra",4.1859999999999999]
["Sykes",40840,null,null,null,null,"Gianna",4.2320000000000002]
["Manavbir",40202,null,null,null,null,"Ewelina",4.6289999999999996]
["Debra",20750,null,null,null,null,"Michael",2.6349999999999998]
["Manavbir",34877,null,null,null,null,"Debra",2.7040000000000002]
["Jason",42906,null,null,null,null,"Carol",3.95]
["Janita",34359,null,null,null,null,"Yla-Katrina",3.5030000000000001]
["Nelia",11938,null,null,null,null,"Gianna",3.5289999999999999]
["Daniel",43849,null,null,null,null,"Janita",3.6549999999999998]
["Sykes",6197,null,null,null,null,"Denise",4.6020000000000003]
["Michelle",38351,null,null,null,null,"Mi",3.5019999999999998]
["Nelia",11912,null,null,null,null,"Craig",4.1749999999999998]
["Carol",23837,null,null,null,null,"Kaur",3.1419999999999999]
["Sarah",13045,null,null,null,null,"Manavbir",3.32]
["Mitchell",23261,null,null,null,null,"Ewelina",3.823]
["Michael",22960,null,null,null,null,"Ewelina",3.47]
["Yla-Katrina",24137,null,null,null,null,"Debra",3.4980000000000002]
["Sykes",36616,null,null,null,null,"Craig",3.726]
["Richard",21885,null,null,null,null,"Denise",4.7009999999999996]
["Craig",45796,null,null,null,null,"Shari",4.8650000000000002]
["Carol",41349,null,null,null,null,"Daniel",4.0330000000000004]
["Ewelina",30315,null,null,null,null,"Mitchell",4.859]
["Yla-Katrina",49593,null,null,null,null,"Mi",3.4529999999999998]
["Daniel",48982,null,null,null,null,"Michael",3.78]
["Carol",18711,null,null,null,null,"Michael",4.3979999999999997]
["Nelia",20356,null,null,null,null,"Gianna",4.9080000000000004]
["Mansa",49304,null,null,null,null,"Gianna",2.4590000000000001]
["Mitchell",86845,null,null,null,null,"Daniel",2.2839999999999998]
["Shari",27261,null,null,null,null,"Nelia",4.1210000000000004]
["Shari",21145,null,null,null,null,"Nakyun",2.9580000000000002]
["Janita",15564,null,null,null,null,"Christina",3.9950000000000001]
["Daniel",13391,null,null,null,null,"Debra",2.4929999999999999]
["Gianna",24788,null,null,null,null,"Nelia",3.28]
["Michael",45520,null,null,null,null,"Craig",3.5089999999999999]
["Michael",34961,null,null,null,null,"Mi",2.6240000000000001]
["Christina",45551,null,null,null,null,"Nelia",4.3609999999999998]
["Craig",6109,null,null,null,null,"Richard",3.528]
["Christina",35601,null,null,null,null,"Elain",4.4880000000000004]
["Yla-Katrina",30631,null,null,null,null,"Carol",2.1320000000000001]
["Michelle",31287,null,null,null,null,"Gianna",4.5869999999999997]
["Janita",42219,null,null,null,null,"Michael",2.7869999999999999]
["Nakyun",20933,null,null,null,null,"Michelle",4.681]
["Yla-Katrina",29736,null,null,null,null,"Janita",4.2629999999999999]
["Shari",36834,null,null,null,null,"Elain",3.2149999999999999]
["Sykes",9576,null,null,null,null,"Elain",3.9169999999999998]
["Richard",30788,null,null,null,null,"Debra",4.673]
["Denise",14167,null,null,null,null,"Craig",3.8969999999999998]
["Craig",28462,null,null,null,null,"Mi",3.7240000000000002]
["Christina",14092,null,null,null,null,"Manavbir",4.5439999999999996]
["Jason",5707,null,null,null,null,"Mitchell",4.0540000000000003]
["Nelia",20164,null,null,null,null,"Elain",3.609]
["Michelle",16087,null,null,null,null,"Mi",3.2749999999999999]
["Nelia",21774,null,null,null,null,"Janita",4.3600000000000003]
["Christina",10579,null,null,null,null,"Elain",2.5870000000000002]
["Denise",42566,null,null,null,null,"Manavbir",4.375]
["Sarah",32327,null,null,null,null,"Janita",3.7989999999999999]
["Manavbir",31600,null,null,null,null,"Shari",3.7669999999999999]
["Janita",49683,null,null,null,null,"Elain",2.3210000000000002]
["Nakyun",24078,null,null,null,null,"Daniel",2.15]
["Kaur",49861,null,null,null,null,"Elain",2.9369999999999998]
["Christina",8291,null,null,null,null,"Shari",2.141]
["Mitchell",42746,null,null,null,null,"Christina",3.3519999999999999]
["Yla-Katrina",26851,null,null,null,null,"Denise",2.395]
["Elain",25461,null,null,null,null,"Christina",2.4540000000000002]
["Mansa",22507,null,null,null,null,"Jason",2.1139999999999999]
["Daniel",25771,null,null,null,null,"Richard",2.5710000000000002]
["Shari",15092,null,null,null,null,"Kaur",2.3420000000000001]
["Yla-Katrina",40001,null,null,null,null,"Janita",2.5350000000000001]
["Kaur",36626,null,null,null,null,"Kaur",2.8889999999999998]
["Jason",18727,null,null,null,null,"Elain",2.8460000000000001]
["Sarah",45834,null,null,null,null,"Ewelina",2.9870000000000001]
["Daniel",48794,null,null,null,null,"Michelle",4.2080000000000002]
["Shari",48492,null,null,null,null,"Mi",4.5129999999999999]
["Debra",18196,null,null,null,null,"Sarah",4.0179999999999998]
["Yla-Katrina",17338,null,null,null,null,"Craig",3.7050000000000001]
["Craig",20327,null,null,null,null,"Carol",2.5619999999999998]
["Nakyun",26406,null,null,null,null,"Manavbir",3.234]
["Nelia",23338,null,null,null,null,"Kaur",4.173]
["Jason",38511,null,null,null,null,"Ewelina",3.4729999999999999]
["Debra",9359,null,null,null,null,"Daniel",2.7679999999999998]
["Nelia",5933,null,null,null,null,"Gianna",4.42]
["Daniel",20113,null,null,null,null,"Debra",4.556]
["Gianna",26036,null,null,null,null,"Denise",3.399]
["Mi",22301,null,null,null,null,"Kaur",3.718]
["Michael",39584,null,null,null,null,"Manavbir",2.5979999999999999]
["Sykes",47969,null,null,null,null,"Sarah",3.738]
["Mitchell",32765,null,null,null,null,"Sarah",3.2890000000000001]
["Kaur",49576,null,null,null,null,"Nelia",4.2220000000000004]
["Jason",44273,null,null,null,null,"Michelle",4.2839999999999998]
["Christina",43325,null,null,null,null,"Mansa",2.7909999999999999]
["Kaur",49482,null,null,null,null,"Sarah",3.101]
["Carol",15986,null,null,null,null,"Richard",2.5640000000000001]
["Elain",16777,null,null,null,null,"Mi",3.0760000000000001]
["Mi",22904,null,null,null,null,"Debra",2.0019999999999998]
["Christina",21010,null,null,null,null,"Michelle",4.8540000000000001]
["Mitchell",40322,null,null,null,null,"Janita",3.508]
["Michelle",23550,null,null,null,null,"Christina",2.3929999999999998]
["Kaur",5347,null,null,null,null,"Mi",3.0550000000000002]
["Yla-Katrina",10921,null,null,null,null,"Richard",4.8680000000000003]
["Daniel",42298,null,null,null,null,"Mansa",2.7869999999999999]
["Kaur",31382,null,null,null,null,"Jason",4.1609999999999996]
["Richard",24401,null,null,null,null,"Ewelina",3.552]
["Debra",26307,null,null,null,null,"Daniel",3.919]
["Carol",32818,null,null,null,null,"Michael",4.7530000000000001]
["Kaur",22474,null,null,null,null,"Denise",4.5339999999999998]
["Nelia",15515,null,null,null,null,"Manavbir",4.9290000000000003]
["Michelle",29624,null,null,null,null,"Christina",2.2749999999999999]
["Elain",30686,null,null,null,null,"Nakyun",2.1179999999999999]
["Yla-Katrina",38636,null,null,null,null,"Manavbir",4.2190000000000003]
["Manavbir",9894,null,null,null,null,"Sykes",3.181]
["Yla-Katrina",5639,null,null,null,null,"Elain",2.657]
["Mi",6597,null,null,null,null,"Richard",3.855]
["Gianna",35547,null,null,null,null,"Gianna",3.5710000000000002]
["Mitchell",31205,null,null,null,null,"Christina",2.7229999999999999]
["Richard",43084,null,null,null,null,"Jason",2.319]
["Yla-Katrina",17593,null,null,null,null,"Sykes",4.4349999999999996]
["Sarah",35657,null,null,null,null,"Michael",2.1669999999999998]
["Daniel",40550,null,null,null,null,"Yla-Katrina",2.8719999999999999]
["Jason",20846,null,null,null,null,"Mitchell",2.7570000000000001]
["Nakyun",35429,null,null,null,null,"Sykes",2.3109999999999999]
["Shari",21451,null,null,null,null,"Richard",3.4260000000000002]
["Carol",8819,null,null,null,null,"Debra",3.4860000000000002]
["Nelia",18755,null,null,null,null,"Shari",3.4289999999999998]
["Michael",23929,null,null,null,null,"Mi",4.9820000000000002]
["Craig",36627,null,null,null,null,"Christina",2.3180000000000001]
["Manavbir",7088,null,null,null,null,"Sarah",3.3490000000000002]
["Manavbir",14548,null,null,null,null,"Denise",4.7670000000000003]
["Sykes",97748,null,null,null,null,"Christina",3.8759999999999999]
["Denise",38305,null,null,null,null,"Shari",2.5510000000000002]
["Michael",13424,null,null,null,null,"Shari",3.004]
["Elain",26412,null,null,null,null,"Nelia",4.62]
["Mansa",26415,null,null,null,null,"Nelia",4.8559999999999999]
["Shari",31459,null,null,null,null,"Jason",4.1619999999999999]
["Michelle",23910,null,null,null,null,"Debra",3.4359999999999999]
["Sarah",29130,null,null,null,null,"Daniel",4.97]
["Mi",39211,null,null,null,null,"Gianna",4.8419999999999996]
["Nakyun",7873,null,null,null,null,"Michelle",4.37]
["Sarah",17355,null,null,null,null,"Jason",3.5179999999999998]
["Manavbir",37143,null,null,null,null,"Shari",3.9590000000000001]
["Michael",45224,null,null,null,null,"Jason",3.9340000000000002]
["Mi",11659,null,null,null,null,"Shari",3.4249999999999998]
["Debra",9144,null,null,null,null,"Kaur",3.1059999999999999]
["Richard",30654,null,null,null,null,"Kaur",2.0470000000000002]
["Mi",39597,null,null,null,null,"Denise",4.9489999999999998]
["Ewelina",36715,null,null,null,null,"Kaur",2.347]
["Carol",41954,null,null,null,null,"Manavbir",2.7389999999999999]
["Michael",21580,null,null,null,null,"Mansa",4.6890000000000001]
["Michelle",22671,null,null,null,null,"Elain",4.0339999999999998]
["Sarah",13493,null,null,null,null,"Manavbir",3.4420000000000002]
["Daniel",27320,null,null,null,null,"Manavbir",4.7060000000000004]
["Shari",29524,null,null,null,null,"Christina",2.0449999999999999]
["Ewelina",30856,null,null,null,null,"Richard",2.3570000000000002]
["Nakyun",30489,null,null,null,null,"Denise",2.5880000000000001]
["Christina",45713,null,null,null,null,"Denise",3.9129999999999998]
["Sarah",36134,null,null,null,null,"Nelia",3.41]
["Craig",43001,null,null,null,null,"Richard",4.9000000000000004]
["Manavbir",15091,null,null,null,null,"Mitchell",3.2949999999999999]
["Ewelina",46081,null,null,null,null,"Janita",4.3730000000000002]
["Nelia",42888,null,null,null,null,"Nelia",4.149]
["Ewelina",28640,null,null,null,null,"Janita",3.9569999999999999]
["Sykes",36121,null,null,null,null,"Sykes",4.8920000000000003]
["Janita",18253,null,null,null,null,"Mitchell",3.2450000000000001]
["Ewelina",29915,null,null,null,null,"Janita",4.1580000000000004]
["Jason",17790,null,null,null,null,"Elain",3.3029999999999999]
["Shari",9937,null,null,null,null,"Michael",3.7480000000000002]
["Debra",11140,null,null,null,null,"Manavbir",3.8650000000000002]
["Yla-Katrina",39064,null,null,null,null,"Jason",2.7010000000000001]
["Richard",23646,null,null,null,null,"Nelia",4.5460000000000003]
["Yla-Katrina",10701,null,null,null,null,"Sykes",3.42]
["Ewelina",16982,null,null,null,null,"Kaur",4.2160000000000002]
["Elain",16741,null,null,null,null,"Elain",2.4940000000000002]
["Mitchell",27665,null,null,null,null,"Jason",2.9119999999999999]
["Yla-Katrina",10112,null,null,null,null,"Gianna",2.81]
["Mansa",24839,null,null,null,null,"Christina",4.1719999999999997]
["Kaur",7826,null,null,null,null,"Denise",2.8479999999999999]
["Mitchell",32763,null,null,null,null,"Ewelina",3.444]
["Shari",38854,null,null,null,null,"Kaur",4.0609999999999999]
["Kaur",46268,null,null,null,null,"Elain",3.0139999999999998]
["Ewelina",16701,null,null,null,null,"Daniel",2.6280000000000001]
["Christina",46725,null,null,null,null,"Michael",3.38]
["Christina",14586,null,null,null,null,"Craig",4.4169999999999998]
["Shari",18386,null,null,null,null,"Kaur",3.0470000000000002]
["Richard",40483,null,null,null,null,"Daniel",3.7109999999999999]
["Mitchell",48751,null,null,null,null,"Manavbir",4.375]
["Daniel",48109,null,null,null,null,"Michelle",2.738]
["Craig",27120,null,null,null,null,"Mansa",3.8879999999999999]
["Richard",39260,null,null,null,null,"Nelia",4.3109999999999999]
["Elain",27737,null,null,null,null,"Manavbir",4.133]
["Manavbir",14897,null,null,null,null,"Nakyun",4.9180000000000001]
["Daniel",21085,null,null,null,null,"Ewelina",4.1740000000000004]
["Craig",17910,null,null,null,null,"Daniel",4.7350000000000003]
["Jason",44811,null,null,null,null,"Yla-Katrina",3.581]
["Michelle",7042,null,null,null,null,"Yla-Katrina",2.153]
["Carol",24058,null,null,null,null,"Manavbir",3.8370000000000002]
["Shari",8763,null,null,null,null,"Daniel",3.6480000000000001]
["Janita",38446,null,null,null,null,"Daniel",2.7909999999999999]
["Gianna",9913,null,null,null,null,"Sarah",2.6480000000000001]
["Yla-Katrina",46898,null,null,null,null,"Christina",4.306]
["Mansa",33652,null,null,null,null,"Manavbir",2.746]
["Michelle",35100,null,null,null,null,"Mansa",3.7]
["Richard",23045,null,null,null,null,"Christina",3.6749999999999998]
["Mitchell",31972,null,null,null,null,"Carol",4.6470000000000002]
["Shari",14446,null,null,null,null,"Mitchell",4.2770000000000001]
["Mi",48467,null,null,null,null,"Nakyun",4.1360000000000001]
["Denise",12821,null,null,null,null,"Michelle",4.0960000000000001]
["Mi",26138,null,null,null,null,"Craig",4.1399999999999997]
["Christina",27414,null,null,null,null,"Yla-Katrina",4.4009999999999998]
["Michael",30142,null,null,null,null,"Michael",3.1320000000000001]
["Ewelina",10961,null,null,null,null,"Gianna",2.8849999999999998]
["Gianna",15946,null,null,null,null,"Mi",3.3359999999999999]
["Christina",26878,null,null,null,null,"Christina",3.0830000000000002]
["Christina",44389,null,null,null,null,"Yla-Katrina",3.7269999999999999]
["Nakyun",40017,null,null,null,null,"Kaur",3.6779999999999999]
["Christina",15597,null,null,null,null,"Manavbir",4.4589999999999996]
["Shari",27047,null,null,null,null,"Nakyun",4.1500000000000004]
["Manavbir",14143,null,null,null,null,"Jason",4.0350000000000001]
["Richard",40008,null,null,null,null,"Christina",2.1579999999999999]
["Ewelina",44096,null,null,null,null,"Michelle",4.3019999999999996]
["Sarah",40983,null,null,null,null,"Janita",2.6629999999999998]
["Nakyun",9886,null,null,null,null,"Michelle",3.5579999999999998]
["Sykes",23116,null,null,null,null,"Sykes",2.2749999999999999]
["Ewelina",18060,null,null,null,null,"Richard",2.589]
["Michael",20264,null,null,null,null,"Carol",3.968]
["Michael",45809,null,null,null,null,"Richard",2.8879999999999999]
["Mi",11547,null,null,null,null,"Carol",3.1059999999999999]
["Mansa",13042,null,null,null,null,"Craig",2.1160000000000001]
["Mitchell",26800,null,null,null,null,"Carol",2.9380000000000002]
["Janita",90280,null,null,null,null,"Gianna",3.169]
["Manavbir",9109,null,null,null,null,"Gianna",2.9830000000000001]
["Sykes",40932,null,null,null,null,"Yla-Katrina",2.5960000000000001]
["Mansa",16135,null,null,null,null,"Mansa",3.1059999999999999]
["Kaur",23459,null,null,null,null,"Mansa",4.2320000000000002]
["Daniel",14123,null,null,null,null,"Christina",2.0779999999999998]
["Mitchell",44845,null,null,null,null,"Gianna",3.0649999999999999]
["Michelle",17721,null,null,null,null,"Daniel",3.0179999999999998]
["Richard",26304,null,null,null,null,"Daniel",4.0060000000000002]
["Carol",25661,null,null,null,null,"Michelle",3.1629999999999998]
["Yla-Katrina",14392,null,null,null,null,"Ewelina",4.5869999999999997]
["Nakyun",16157,null,null,null,null,"Denise",4.423]
["Sarah",14132,null,null,null,null,"Craig",2.3860000000000001]
["Kaur",49273,null,null,null,null,"Michelle",2.7429999999999999]
["Ewelina",13849,null,null,null,null,"Janita",3.5139999999999998]
["Nakyun",27291,null,null,null,null,"Richard",4.8129999999999997]
["Christina",33921,null,null,null,null,"Jason",4.53]
["Jason",40446,null,null,null,null,"Denise",4.68]
["Jason",17021,null,null,null,null,"Gianna",3.9329999999999998]
["Sarah",46580,null,null,null,null,"Jason",4.6500000000000004]
["Mansa",48066,null,null,null,null,"Denise",2.2919999999999998]
["Michelle",27538,null,null,null,null,"Daniel",4.7290000000000001]
["Ewelina",32128,null,null,null,null,"Christina",4.125]
["Craig",39674,null,null,null,null,"Michelle",2.8250000000000002]
["Shari",23130,null,null,null,null,"Mitchell",3.7770000000000001]
["Nakyun",33904,null,null,null,null,"Daniel",2.9870000000000001]
["Nelia",14637,null,null,null,null,"Sykes",4.8419999999999996]
["Nakyun",47428,null,null,null,null,"Nakyun",3.2330000000000001]
["Mi",13838,null,null,null,null,"Mitchell",2.6880000000000002]
["Michael",16881,null,null,null,null,"Michael",3.3069999999999999]
["Carol",14379,null,null,null,null,"Michael",4.9779999999999998]
["Sarah",22124,null,null,null,null,"Richard",2.609]
["Nakyun",49315,null,null,null,null,"Jason",3.327]
["Gianna",11956,null,null,null,null,"Jason",4.2060000000000004]
["Yla-Katrina",44574,null,null,null,null,"Nakyun",3.2320000000000002]
["Michelle",20756,null,null,null,null,"Craig",4.101]
["Sykes",16312,null,null,null,null,"Sarah",3.089]
["Yla-Katrina",34660,null,null,null,null,"Yla-Katrina",2.9580000000000002]
["Shari",8942,null,null,null,null,"Mi",2.2589999999999999]
["Mi",26128,null,null,null,null,"Mitchell",2.4540000000000002]
["Mansa",32722,null,null,null,null,"Ewelina",2.5920000000000001]
["Sarah",46258,null,null,null,null,"Yla-Katrina",4.3899999999999997]
["Nelia",34719,null,null,null,null,"Manavbir",2.218]
["Kaur",45941,null,null,null,null,"Jason",2.3380000000000001]
["Manavbir",26935,null,null,null,null,"Christina",3.278]
["Christina",39176,null,null,null,null,"Mansa",2.1819999999999999]
["Richard",21657,null,null,null,null,"Gianna",2.96]
["Carol",10570,null,null,null,null,"Manavbir",4.3109999999999999]
["Richard",43862,null,null,null,null,"Jason",3.9860000000000002]
["Mansa",9983,null,null,null,null,"Mitchell",2.5939999999999999]
["Richard",23370,null,null,null,null,"Mi",1.5549999999999999]
["Nakyun",43844,null,null,null,null,"Gianna",4.8760000000000003]
["Denise",11125,null,null,null,null,"Gianna",2.2250000000000001]
["Shari",37519,null,null,null,null,"Richard",4.5890000000000004]
["Mi",27063,null,null,null,null,"Nelia",4.0289999999999999]
["Daniel",35383,null,null,null,null,"Janita",3.3919999999999999]
["Nakyun",19372,null,null,null,null,"Daniel",4.8559999999999999]
["Debra",20448,null,null,null,null,"Sykes",4.8250000000000002]
["Shari",49282,null,null,null,null,"Gianna",3.0209999999999999]
["Christina",38596,null,null,null,null,"Mitchell",2.7389999999999999]
["Michael",25703,null,null,null,null,"Nelia",4.2679999999999998]
["Mitchell",31332,null,null,null,null,"Michelle",3.7429999999999999]
["Mansa",30645,null,null,null,null,"Sarah",3.1160000000000001]
["Nelia",36606,null,null,null,null,"Sykes",2.036]
["Daniel",13797,null,null,null,null,"Debra",2.3879999999999999]
["Mitchell",31406,null,null,null,null,"Yla-Katrina",3.4940000000000002]
["Kaur",33411,null,null,null,null,"Nelia",4.8369999999999997]
["Gianna",33552,null,null,null,null,"Michelle",2.1640000000000001]
["Nakyun",20676,null,null,null,null,"Christina",4.6639999999999997]
["Carol",30417,null,null,null,null,"Jason",2.1379999999999999]
["Carol",25995,null,null,null,null,"Sykes",4.4029999999999996]
["Christina",12739,null,null,null,null,"Nelia",4.1459999999999999]
["Michelle",31557,null,null,null,null,"Christina",3.0339999999999998]
["Sarah",10032,null,null,null,null,"Denise",2.1709999999999998]
["Michelle",39470,null,null,null,null,"Gianna",2.363]
["Michael",22539,null,null,null,null,"Yla-Katrina",2.871]
["Debra",25550,null,null,null,null,"Craig",4.9059999999999997]
["Nakyun",29257,null,null,null,null,"Mansa",4.9089999999999998]
["Yla-Katrina",28493,null,null,null,null,"Mitchell",3.113]
["Jason",7648,null,null,null,null,"Sykes",2.3109999999999999]
["Christina",30846,null,null,null,null,"Nelia",2.847]
["Michelle",43550,null,null,null,null,"Debra",4.59]
["Richard",47215,null,null,null,null,"Sykes",2.1890000000000001]
["Yla-Katrina",5496,null,null,null,null,"Nakyun",2.339]
["Michael",29747,null,null,null,null,"Mi",2.1680000000000001]
["Sykes",5338,null,null,null,null,"Debra",2.048]
["Craig",18120,null,null,null,null,"Michael",4.0039999999999996]
["Jason",6392,null,null,null,null,"Daniel",2.9860000000000002]
["Sykes",32660,null,null,null,null,"Ewelina",4.9930000000000003]
["Nakyun",45676,null,null,null,null,"Janita",2.722]
["Kaur",7709,null,null,null,null,"Gianna",3.8439999999999999]
["Mitchell",49195,null,null,null,null,"Manavbir",2.2869999999999999]
["Michael",19299,null,null,null,null,"Yla-Katrina",3.1179999999999999]
["Kaur",20571,null,null,null,null,"Michael",3.4390000000000001]
["Sykes",37946,null,null,null,null,"Denise",2.9540000000000002]
["Ewelina",10131,null,null,null,null,"Denise",2.3639999999999999]
["Carol",13434,null,null,null,null,"Craig",3.6480000000000001]
["Debra",31442,null,null,null,null,"Mansa",3.242]
["Debra",10335,null,null,null,null,"Daniel",2.7810000000000001]
["Manavbir",46598,null,null,null,null,"Manavbir",3.85]
["Denise",91999,null,null,null,null,"Michelle",3.6760000000000002]
["Carol",47327,null,null,null,null,"Ewelina",2.6549999999999998]
["Manavbir",47918,null,null,null,null,"Debra",4.34]
["Ewelina",48401,null,null,null,null,"Nelia",2.3170000000000002]
["Kaur",19238,null,null,null,null,"Daniel",3.2170000000000001]
["Gianna",30945,null,null,null,null,"Craig",4.149]
["Debra",17720,null,null,null,null,"Michael",2.8639999999999999]
["Debra",22159,null,null,null,null,"Kaur",2.4790000000000001]
["Debra",46663,null,null,null,null,"Nelia",4.0460000000000003]
["Mansa",36772,null,null,null,null,"Jason",3.605]
["Mitchell",40136,null,null,null,null,"Sarah",2.694]
["Michael",27150,null,null,null,null,"Michelle",3.653]
["Elain",12909,null,null,null,null,"Ewelina",2.3370000000000002]
["Michelle",29454,null,null,null,null,"Shari",3.4710000000000001]
["Shari",39636,null,null,null,null,"Michelle",2.4900000000000002]
["Kaur",45453,null,null,null,null,"Gianna",2.161]
["Michelle",42179,null,null,null,null,"Mansa",2.7149999999999999]
["Denise",24157,null,null,null,null,"Elain",2.226]
["Michelle",23397,null,null,null,null,"Jason",4.4139999999999997]
["Carol",16521,null,null,null,null,"Debra",3.702]
["Sarah",29024,null,null,null,null,"Richard",3.512]
["Nelia",10116,null,null,null,null,"Shari",4.6319999999999997]
["Debra",35470,null,null,null,null,"Michael",3.625]
["Elain",43904,null,null,null,null,"Richard",3.8940000000000001]
["Manavbir",8514,null,null,null,null,"Elain",4.5910000000000002]
["Ewelina",14068,null,null,null,null,"Elain",4.9859999999999998]
["Sarah",39902,null,null,null,null,"Michelle",4.7889999999999997]
["Gianna",16838,null,null,null,null,"Richard",3.8029999999999999]
["Sykes",44876,null,null,null,null,"Jason",3.2810000000000001]
["Nelia",19756,null,null,null,null,"Gianna",2.6190000000000002]
["Mansa",27188,null,null,null,null,"Elain",2.1629999999999998]
["Craig",8612,null,null,null,null,"Jason",2.4079999999999999]
["Craig",26813,null,null,null,null,"Carol",4.0949999999999998]
["Michelle",48273,null,null,null,null,"Debra",2.59]
["Daniel",43690,null,null,null,null,"Gianna",4.4870000000000001]
["Christina",11032,null,null,null,null,"Mansa",2.1819999999999999]
["Mansa",24823,null,null,null,null,"Nakyun",2.3849999999999998]
["Ewelina",30620,null,null,null,null,"Elain",2.8159999999999998]
["Denise",18760,null,null,null,null,"Sarah",3.6259999999999999]
["Michelle",49728,null,null,null,null,"Michelle",2.1259999999999999]
["Denise",48660,null,null,null,null,"Mi",3.78]
["Mi",9821,null,null,null,null,"Sarah",3.4060000000000001]
["Michael",32203,null,null,null,null,"Debra",3.8479999999999999]
["Nakyun",39081,null,null,null,null,"Nakyun",2.3119999999999998]
["Janita",5131,null,null,null,null,"Craig",3.1389999999999998]
["Sarah",49684,null,null,null,null,"Carol",4.2850000000000001]
["Sarah",46903,null,null,null,null,"Yla-Katrina",3.6469999999999998]
["Sykes",11827,null,null,null,null,"Richard",2.5819999999999999]
["Manavbir",12327,null,null,null,null,"Sarah",2.097]
["Michelle",14572,null,null,null,null,"Denise",3.5]
["Janita",30719,null,null,null,null,"Daniel",4.1159999999999997]
["Sykes",28135,null,null,null,null,"Michael",3.0790000000000002]
["Debra",46055,null,null,null,null,"Gianna",4.2309999999999999]
["Daniel",15210,null,null,null,null,"Nakyun",3.9249999999999998]
["Denise",21207,null,null,null,null,"Richard",2.8180000000000001]
["Mitchell",24863,null,null,null,null,"Janita",4.1440000000000001]
["Kaur",7030,null,null,null,null,"Christina",2.2599999999999998]
["Nelia",41520,null,null,null,null,"Elain",3.2759999999999998]
["Debra",37222,null,null,null,null,"Michelle",3.0680000000000001]
["Sykes",21190,null,null,null,null,"Craig",2.835]
["Gianna",20186,null,null,null,null,"Denise",3.1429999999999998]
["Gianna",11831,null,null,null,null,"Ewelina",2.3490000000000002]
["Sykes",19908,null,null,null,null,"Mitchell",4.5460000000000003]
["Kaur",49350,null,null,null,null,"Michelle",3.3690000000000002]
["Jason",19259,null,null,null,null,"Richard",3.8410000000000002]
["Shari",22190,null,null,null,null,"Michelle",4.2690000000000001]
["Yla-Katrina",35007,null,null,null,null,"Ewelina",3.6469999999999998]
["Shari",41335,null,null,null,null,"Sykes",4.93]
["Michael",48686,null,null,null,null,"Richard",2.403]
["Gianna",42607,null,null,null,null,"Sarah",3.1030000000000002]
["Debra",33204,null,null,null,null,"Nakyun",2.7410000000000001]
["Kaur",22096,null,null,null,null,"Nelia",4.47]
["Nelia",34324,null,null,null,null,"Denise",4.9720000000000004]
["Jason",40664,null,null,null,null,"Michael",2.056]
["Shari",15864,null,null,null,null,"Yla-Katrina",4.7089999999999996]
["Ewelina",10531,null,null,null,null,"Denise",3.5049999999999999]
["Shari",39168,null,null,null,null,"Craig",2.5390000000000001]
["Denise",11776,null,null,null,null,"Jason",2.8969999999999998]
["Michelle",29477,null,null,null,null,"Sarah",2.2410000000000001]
["Ewelina",12062,null,null,null,null,"Jason",4.3769999999999998]
["Gianna",5640,null,null,null,null,"Sykes",2.4279999999999999]
["Jason",22513,null,null,null,null,"Yla-Katrina",3.097]
["Mi",45336,null,null,null,null,"Christina",4.4279999999999999]
["Ewelina",24720,null,null,null,null,"Janita",2.0840000000000001]
["Nelia",30635,null,null,null,null,"Carol",3.585]
["Mi",9661,null,null,null,null,"Nelia",3.4609999999999999]
["Sarah",42839,null,null,null,null,"Kaur",2.593]
["Sarah",25523,null,null,null,null,"Sarah",4.6150000000000002]
["Sykes",28504,null,null,null,null,"Sykes",3.399]
["Christina",6293,null,null,null,null,"Denise",3.173]
["Sarah",31146,null,null,null,null,"Sykes",2.92]
["Christina",30955,null,null,null,null,"Craig",4.0490000000000004]
["Nakyun",21729,null,null,null,null,"Debra",2.8279999999999998]
["Manavbir",49296,null,null,null,null,"Christina",4.6070000000000002]
["Yla-Katrina",26142,null,null,null,null,"Gianna",4.1550000000000002]
["Ewelina",13778,null,null,null,null,"Shari",3.331]
["Richard",9897,null,null,null,null,"Elain",3.4260000000000002]
["Mi",39740,null,null,null,null,"Richard",3.0449999999999999]
["Mitchell",13509,null,null,null,null,"Denise",2.4630000000000001]
["Ewelina",27044,null,null,null,null,"Richard",3.077]
["Craig",74314,null,null,null,null,"Kaur",2.1760000000000002]
["Nelia",28920,null,null,null,null,"Shari",2.145]
["Yla-Katrina",9974,null,null,null,null,"Yla-Katrina",3.5710000000000002]
["Manavbir",31732,null,null,null,null,"Craig",3.6629999999999998]
["Nelia",40076,null,null,null,null,"Mi",2.0710000000000002]
["Denise",16031,null,null,null,null,"Janita",3.8719999999999999]
["Janita",6797,null,null,null,null,"Gianna",3.3119999999999998]
["Manavbir",42023,null,null,null,null,"Nelia",2.6150000000000002]
["Sykes",21100,null,null,null,null,"Ewelina",3.6280000000000001]
["Daniel",28491,null,null,null,null,"Michelle",4.6120000000000001]
["Sykes",15606,null,null,null,null,"Gianna",4.3129999999999997]
["Janita",41515,null,null,null,null,"Craig",4.0629999999999997]
["Sarah",16873,null,null,null,null,"Janita",4.8449999999999998]
["Debra",38794,null,null,null,null,"Elain",2.048]
["Craig",44308,null,null,null,null,"Elain",2.39]
["Christina",49993,null,null,null,null,"Michelle",2.9940000000000002]
["Michael",37615,null,null,null,null,"Gianna",2.8439999999999999]
["Manavbir",7742,null,null,null,null,"Ewelina",3.5880000000000001]
["Sarah",5645,null,null,null,null,"Christina",3.988]
["Yla-Katrina",5685,null,null,null,null,"Carol",4.9800000000000004]
["Gianna",23159,null,null,null,null,"Christina",4.1120000000000001]
["Debra",6991,null,null,null,null,"Jason",2.8119999999999998]
["Nakyun",6740,null,null,null,null,"Richard",3.1840000000000002]
["Elain",40674,null,null,null,null,"Mi",2.1859999999999999]
["Kaur",28314,null,null,null,null,"Manavbir",3.931]
["Sarah",46574,null,null,null,null,"Richard",2.004]
["Debra",31027,null,null,null,null,"Daniel",4.4820000000000002]
["Yla-Katrina",7656,null,null,null,null,"Shari",4.1449999999999996]
["Jason",46970,null,null,null,null,"Denise",2.3330000000000002]
["Michelle",46003,null,null,null,null,"Christina",2.4510000000000001]
["Sykes",28458,null,null,null,null,"Jason",3.9740000000000002]
["Shari",19854,null,null,null,null,"Richard",4.6840000000000002]
["Shari",32344,null,null,null,null,"Ewelina",4.6219999999999999]
["Shari",5994,null,null,null,null,"Debra",4.3010000000000002]
["Gianna",27156,null,null,null,null,"Sarah",4.7610000000000001]
["Nakyun",14281,null,null,null,null,"Richard",2.726]
["Jason",14972,null,null,null,null,"Richard",3.9009999999999998]
["Mansa",40097,null,null,null,null,"Debra",4.2910000000000004]
["Manavbir",28801,null,null,null,null,"Debra",3.8889999999999998]
["Richard",15990,null,null,null,null,"Mansa",3.706]
["Shari",18752,null,null,null,null,"Christina",2.19]
["Richard",16506,null,null,null,null,"Manavbir",4.1870000000000003]
["Gianna",37606,null,null,null,null,"Mitchell",4.0759999999999996]
["Michelle",7218,null,null,null,null,"Janita",2.5409999999999999]
["Mitchell",31935,null,null,null,null,"Mansa",4.66]
["Gianna",5315,null,null,null,null,"Christina",4.774]
["Manavbir",33215,null,null,null,null,"Nelia",3.794]
["Christina",28745,null,null,null,null,"Kaur",3.839]
["Nelia",31832,null,null,null,null,"Shari",4.5999999999999996]
["Nelia",34300,null,null,null,null,"Yla-Katrina",4.13]
["Denise",5225,null,null,null,null,"Denise",4.8040000000000003]
["Christina",15047,null,null,null,null,"Debra",3.9329999999999998]
["Janita",20898,null,null,null,null,"Nelia",3.42]
["Janita",19952,null,null,null,null,"Michelle",2.5539999999999998]
["Nelia",8172,null,null,null,null,"Richard",2.8769999999999998]
["Jason",48908,null,null,null,null,"Mi",2.2519999999999998]
["Craig",10684,null,null,null,null,"Elain",2.2839999999999998]
["Nelia",41622,null,null,null,null,"Elain",4.7910000000000004]
["Daniel",49252,null,null,null,null,"Shari",3.7010000000000001]
["Manavbir",34889,null,null,null,null,"Craig",3.5190000000000001]
["Manavbir",9492,null,null,null,null,"Yla-Katrina",4.8780000000000001]
["Denise",33194,null,null,null,null,"Mitchell",2.657]
["Mansa",29241,null,null,null,null,"Christina",2.302]
["Mitchell",21907,null,null,null,null,"Elain",4.3579999999999997]
["Ewelina",16067,null,null,null,null,"Michael",2.9790000000000001]
["Craig",6531,null,null,null,null,"Nelia",2.0630000000000002]
["Elain",25439,null,null,null,null,"Denise",3.3290000000000002]
["Christina",24527,null,null,null,null,"Sarah",2.2410000000000001]
["Ewelina",7180,null,null,null,null,"Shari",3.1]
["Nelia",22005,null,null,null,null,"Mitchell",2.0910000000000002]
["Gianna",11744,null,null,null,null,"Jason",2.16]
["Denise",14449,null,null,null,null,"Michelle",3.5870000000000002]
["Craig",10565,null,null,null,null,"Yla-Katrina",3.8090000000000002]
["Sarah",13824,null,null,null,null,"Debra",3.3359999999999999]
["Mitchell",24156,null,null,null,null,"Nakyun",4.4349999999999996]
["Elain",18126,null,null,null,null,"Craig",2.1320000000000001]
["Mi",7232,null,null,null,null,"Michael",2.3820000000000001]
["Denise",46140,null,null,null,null,"Nelia",2.2429999999999999]
["Ewelina",23787,null,null,null,null,"Gianna",2.4]
["Ewelina",43910,null,null,null,null,"Debra",3.2050000000000001]
["Richard",38292,null,null,null,null,"Mitchell",2.2749999999999999]
["Gianna",33896,null,null,null,null,"Kaur",2.8210000000000002]
["Elain",22753,null,null,null,null,"Sykes",4.149]
["Nakyun",37720,null,null,null,null,"Michael",4.4359999999999999]
["Debra",9726,null,null,null,null,"Carol",2.044]
["Sykes",5863,null,null,null,null,"Kaur",3.05]
["Yla-Katrina",16491,null,null,null,null,"Mitchell",4.3150000000000004]
["Christina",20680,null,null,null,null,"Craig",3.7410000000000001]
["Manavbir",48427,null,null,null,null,"Michael",4.9169999999999998]
["Nakyun",33846,null,null,null,null,"Michelle",2.3079999999999998]
["Christina",19747,null,null,null,null,"Christina",4.3949999999999996]
["Michael",27760,null,null,null,null,"Mitchell",4.2050000000000001]
["Janita",24121,null,null,null,null,"Gianna",4.9950000000000001]
["Yla-Katrina",20680,null,null,null,null,"Michael",3.4089999999999998]
["Carol",6428,null,null,null,null,"Sykes",4.7329999999999997]
["Mansa",31928,null,null,null,null,"Craig",3.4129999999999998]
["Mansa",21156,null,null,null,null,"Sarah",3.2349999999999999]
["Shari",33275,null,null,null,null,"Gianna",3.653]
["Kaur",49194,null,null,null,null,"Janita",3.6909999999999998]
["Daniel",44016,null,null,null,null,"Mi",2.468]
["Sarah",80843,null,null,null,null,"Nakyun",2.161]
["Elain",14694,null,null,null,null,"Manavbir",2.093]
["Elain",39648,null,null,null,null,"Sarah",2.8530000000000002]
["Ewelina",26518,null,null,null,null,"Manavbir",3.9980000000000002]
["Sarah",34995,null,null,null,null,"Yla-Katrina",4.2869999999999999]
["Michael",7624,null,null,null,null,"Michael",4.3170000000000002]
["Kaur",12384,null,null,null,null,"Debra",3.9660000000000002]
["Gianna",32828,null,null,null,null,"Carol",4.8449999999999998]
["Manavbir",39964,null,null,null,null,"Manavbir",4.8639999999999999]
["Janita",16262,null,null,null,null,"Denise",4.3159999999999998]
["Sarah",20171,null,null,null,null,"Debra",2.673]
["Sykes",16267,null,null,null,null,"Kaur",3.4910000000000001]
["Manavbir",6574,null,null,null,null,"Kaur",2.8039999999999998]
["Shari",22443,null,null,null,null,"Nakyun",4.2389999999999999]
["Sykes",13408,null,null,null,null,"Mansa",2.1309999999999998]
["Denise",14887,null,null,null,null,"Carol",4.9690000000000003]
["Denise",46397,null,null,null,null,"Mi",4.3979999999999997]
["Gianna",27849,null,null,null,null,"Jason",4.6100000000000003]
["Jason",42605,null,null,null,null,"Denise",4.4619999999999997]
["Mansa",6518,null,null,null,null,"Yla-Katrina",2.5750000000000002]
["Sykes",39339,null,null,null,null,"Sarah",4.7779999999999996]
["Michael",48498,null,null,null,null,"Yla-Katrina",4.7220000000000004]
["Carol",27777,null,null,null,null,"Manavbir",4.5]
["Gianna",20343,null,null,null,null,"Christina",2.6360000000000001]
["Yla-Katrina",46323,null,null,null,null,"Nelia",3.7149999999999999]
["Nelia",28573,null,null,null,null,"Kaur",4.452]
["Jason",46165,null,null,null,null,"Michelle",3.89]
["Mi",5956,null,null,null,null,"Ewelina",2.21]
["Kaur",14167,null,null,null,null,"Michael",4.9329999999999998]
["Manavbir",44274,null,null,null,null,"Sykes",3.9550000000000001]
["Nakyun",12703,null,null,null,null,"Michael",2.9329999999999998]
["Janita",19020,null,null,null,null,"Mi",3.6219999999999999]
["Sykes",35250,null,null,null,null,"Nakyun",3.4689999999999999]
["Craig",37653,null,null,null,null,"Mi",4.28]
["Michael",22742,null,null,null,null,"Michelle",2.351]
["Kaur",9351,null,null,null,null,"Nelia",4.9379999999999997]
["Jason",5728,null,null,null,null,"Kaur",2.9929999999999999]
["Sarah",30954,null,null,null,null,"Manavbir",4.2679999999999998]
["Yla-Katrina",25478,null,null,null,null,"Mi",3.6960000000000002]
["Nelia",32928,null,null,null,null,"Denise",3.399]
["Michelle",44508,null,null,null,null,"Christina",4.5759999999999996]
["Sykes",7372,null,null,null,null,"Richard",2.4540000000000002]
["Mansa",44681,null,null,null,null,"Christina",4.84]
["Sarah",14033,null,null,null,null,"Ewelina",4.3630000000000004]
["Mitchell",37165,null,null,null,null,"Debra",3.5259999999999998]
["Craig",33055,null,null,null,null,"Denise",2.1030000000000002]
["Mitchell",28993,null,null,null,null,"Debra",4.9400000000000004]
["Mitchell",38464,null,null,null,null,"Nelia",3.6749999999999998]
["Gianna",19196,null,null,null,null,"Richard",4.9980000000000002]
["Kaur",5837,null,null,null,null,"Mansa",2.593]
["Shari",9719,null,null,null,null,"Debra",4.0490000000000004]
["Kaur",26689,null,null,null,null,"Shari",4.9820000000000002]
["Carol",45008,null,null,null,null,"Denise",4.2939999999999996]
["Mitchell",22865,null,null,null,null,"Nakyun",2.0529999999999999]
["Kaur",6815,null,null,null,null,"Mansa",4.7169999999999996]
["Nelia",30738,null,null,null,null,"Shari",4.3109999999999999]
["Mi",19591,null,null,null,null,"Ewelina",4.444]
["Richard",37379,null,null,null,null,"Kaur",2.7290000000000001]
["Manavbir",12519,null,null,null,null,"Craig",3.113]
["Shari",31556,null,null,null,null,"Craig",4.617]
["Mi",24516,null,null,null,null,"Sarah",2.0209999999999999]
["Shari",14710,null,null,null,null,"Mansa",4.984]
["Mi",9576,null,null,null,null,"Manavbir",3.4340000000000002]
["Mansa",35097,null,null,null,null,"Yla-Katrina",4.3390000000000004]
["Janita",19328,null,null,null,null,"Mi",2.1819999999999999]
["Nakyun",25983,null,null,null,null,"Denise",2.7440000000000002]
["Mansa",20096,null,null,null,null,"Sykes",4.7050000000000001]
["Daniel",14409,null,null,null,null,"Mansa",3.4169999999999998]
["Gianna",31115,null,null,null,null,"Michelle",3.4319999999999999]
["Shari",22804,null,null,null,null,"Manavbir",3.4369999999999998]
["Sykes",39457,null,null,null,null,"Michelle",4.367]
["Michelle",24621,null,null,null,null,"Jason",2.7480000000000002]
["Mi",7003,null,null,null,null,"Richard",2.653]
["Ewelina",22663,null,null,null,null,"Daniel",4.827]
["Sykes",44908,null,null,null,null,"Denise",3.84]
["Debra",26013,null,null,null,null,"Janita",2.1720000000000002]
["Yla-Katrina",22851,null,null,null,null,"Richard",2.105]
["Michael",9067,null,null,null,null,"Michelle",3.1280000000000001]
["Nelia",13246,null,null,null,null,"Elain",3.2679999999999998]
["Manavbir",43687,null,null,null,null,"Michael",3.2719999999999998]
["Nelia",26513,null,null,null,null,"Sykes",3.7589999999999999]
["Daniel",15716,null,null,null,null,"Carol",3.4409999999999998]
["Mitchell",23915,null,null,null,null,"Shari",2.9969999999999999]
["Janita",41265,null,null,null,null,"Nelia",2.7490000000000001]
["Gianna",20900,null,null,null,null,"Daniel",4.1139999999999999]
["Richard",28091,null,null,null,null,"Elain",4.6609999999999996]
["Yla-Katrina",45219,null,null,null,null,"Christina",2.6920000000000002]
["Richard",47640,null,null,null,null,"Nakyun",3.669]
["Daniel",43014,null,null,null,null,"Manavbir",2.3860000000000001]
["Denise",34433,null,null,null,null,"Mitchell",4.7709999999999999]
["Nakyun",30018,null,null,null,null,"Mitchell",3.645]
["Mitchell",32586,null,null,null,null,"Richard",3.0950000000000002]
["Richard",16165,null,null,null,null,"Ewelina",4.5860000000000003]
["Debra",5217,null,null,null,null,"Christina",3.8820000000000001]
["Shari",34784,null,null,null,null,"Ewelina",2.08]
["Debra",41967,null,null,null,null,"Craig",3.7440000000000002]
["Janita",37874,null,null,null,null,"Elain",4.8920000000000003]
["Daniel",13491,null,null,null,null,"Mansa",3.141]
["Michael",49996,null,null,null,null,"Gianna",2.8340000000000001]
["Gianna",16673,null,null,null,null,"Yla-Katrina",4.8979999999999997]
["Michelle",69329,null,null,null,null,"Sarah",4.1660000000000004]
["Mansa",13431,null,null,null,null,"Jason",2.1760000000000002]
["Mitchell",32621,null,null,null,null,"Sykes",3.2330000000000001]
["Craig",7630,null,null,null,null,"Mi",2.0739999999999998]
["Sarah",30935,null,null,null,null,"Debra",2.73]
["Jason",47240,null,null,null,null,"Mi",3.649]
["Sarah",36560,null,null,null,null,"Elain",4.782]
["Elain",29430,null,null,null,null,"Yla-Katrina",2.391]
["Manavbir",42684,null,null,null,null,"Denise",2.504]
["Elain",34889,null,null,null,null,"Mansa",3.4260000000000002]
["Daniel",38484,null,null,null,null,"Michael",4.1369999999999996]
["Daniel",33470,null,null,null,null,"Nakyun",2.1760000000000002]
["Michelle",12937,null,null,null,null,"Richard",4.6970000000000001]
["Mitchell",46404,null,null,null,null,"Mi",4.7]
["Nakyun",35356,null,null,null,null,"Ewelina",3.2450000000000001]
["Jason",45992,null,null,null,null,"Jason",2.4420000000000002]
["Mi",23270,null,null,null,null,"Mi",3.7789999999999999]
["Mi",7449,null,null,null,null,"Nelia",3.8719999999999999]
["Craig",39531,null,null,null,null,"Christina",3.4119999999999999]
["Ewelina",38810,null,null,null,null,"Yla-Katrina",4.7149999999999999]
["Shari",31145,null,null,null,null,"Mitchell",4.867]
["Manavbir",21299,null,null,null,null,"Mitchell",2.6539999999999999]
["Mitchell",29699,null,null,null,null,"Nelia",2.2589999999999999]
["Jason",49837,null,null,null,null,"Jason",2.343]
["Elain",22945,null,null,null,null,"Yla-Katrina",2.8]
["Sarah",21695,null,null,null,null,"Sarah",1.381]
["Carol",44441,null,null,null,null,"Richard",3.4910000000000001]
["Mi",20554,null,null,null,null,"Michelle",4.4349999999999996]
["Craig",40164,null,null,null,null,"Jason",3.3410000000000002]
["Debra",11115,null,null,null,null,"Jason",3.9710000000000001]
["Michelle",17782,null,null,null,null,"Gianna",4.7430000000000003]
["Yla-Katrina",40051,null,null,null,null,"Nakyun",4.7]
["Nelia",38192,null,null,null,null,"Shari",2.5960000000000001]
["Debra",9571,null,null,null,null,"Sarah",3.4660000000000002]
["Michael",33483,null,null,null,null,"Christina",3.786]
["Yla-Katrina",26926,null,null,null,null,"Daniel",4.49]
["Nakyun",31142,null,null,null,null,"Richard",4.4749999999999996]
["Richard",10784,null,null,null,null,"Debra",4.6660000000000004]
["Daniel",48452,null,null,null,null,"Michael",4.1849999999999996]
["Daniel",35710,null,null,null,null,"Ewelina",2.2759999999999998]
["Ewelina",14256,null,null,null,null,"Mitchell",3.22]
["Kaur",24050,null,null,null,null,"Nakyun",2.706]
["Yla-Katrina",32077,null,null,null,null,"Mi",2.5129999999999999]
["Yla-Katrina",42696,null,null,null,null,"Sarah",3.9889999999999999]
["Nelia",49256,null,null,null,null,"Denise",2.0880000000000001]
["Mitchell",16116,null,null,null,null,"Jason",4.84]
["Richard",18765,null,null,null,null,"Christina",4.2530000000000001]
["Gianna",37202,null,null,null,null,"Sarah",4.0229999999999997]
["Daniel",23840,null,null,null,null,"Mitchell",4.5449999999999999]
["Craig",37606,null,null,null,null,"Denise",2.605]
["Yla-Katrina",9972,null,null,null,null,"Denise",4.5940000000000003]
["Michael",20391,null,null,null,null,"Ewelina",4.0209999999999999]
["Debra",42338,null,null,null,null,"Yla-Katrina",4.3979999999999997]
["Mansa",48891,null,null,null,null,"Elain",2.8460000000000001]
["Mansa",37080,null,null,null,null,"Daniel",4.4619999999999997]
["Christina",12590,null,null,null,null,"Richard",3.1850000000000001]
["Christina",24283,null,null,null,null,"Michelle",3.93]
["Richard",7022,null,null,null,null,"Debra",4.3730000000000002]
["Richard",18164,null,null,null,null,"Denise",2.7930000000000001]
["Ewelina",48405,null,null,null,null,"Denise",4.0220000000000002]
["Mansa",19688,null,null,null,null,"Shari",4.5430000000000001]
["Debra",31466,null,null,null,null,"Daniel",4.3479999999999999]
["Mi",46330,null,null,null,null,"Gianna",2.161]
["Mi",13157,null,null,null,null,"Mi",3.25]
["Jason",40343,null,null,null,null,"Debra",4.3849999999999998]
["Mansa",18595,null,null,null,null,"Ewelina",2.3050000000000002]
["Craig",49116,null,null,null,null,"Jason",4.2469999999999999]
["Kaur",6619,null,null,null,null,"Yla-Katrina",4.9119999999999999]
["Craig",44764,null,null,null,null,"Nakyun",3.972]
["Jason",33033,null,null,null,null,"Mansa",3.1360000000000001]
["Shari",26782,null,null,null,null,"Debra",3.6779999999999999]
["Carol",12470,null,null,null,null,"Mi",4.3090000000000002]
["Nakyun",46584,null,null,null,null,"Debra",2.3090000000000002]
["Manavbir",44827,null,null,null,null,"Yla-Katrina",2.8380000000000001]
["Daniel",46347,null,null,null,null,"Mansa",2.8759999999999999]
["Debra",27946,null,null,null,null,"Sykes",3.1280000000000001]
["Daniel",42652,null,null,null,null,"Michelle",2.2309999999999999]
["Debra",36063,null,null,null,null,"Shari",2.4460000000000002]
["Michael",17278,null,null,null,null,"Jason",2.6509999999999998]
["Michael",38101,null,null,null,null,"Ewelina",4.0990000000000002]
["Mansa",16020,null,null,null,null,"Mi",3.6320000000000001]
["Gianna",18954,null,null,null,null,"Gianna",4.8380000000000001]
["Nakyun",28470,null,null,null,null,"Ewelina",4.3410000000000002]
["Yla-Katrina",37361,null,null,null,null,"Sarah",3.8079999999999998]
["Carol",21445,null,null,null,null,"Mansa",4.1769999999999996]
["Debra",24125,null,null,null,null,"Elain",4.0679999999999996]
["Shari",47917,null,null,null,null,"Shari",3.6920000000000002]
["Richard",7870,null,null,null,null,"Denise",3.5230000000000001]
["Mi",42284,null,null,null,null,"Denise",3.399]
["Mansa",26379,null,null,null,null,"Janita",3.855]
["Elain",30481,null,null,null,null,"Sykes",3.6160000000000001]

{"sheet":"Large Small (an)","index":12,"n_rows":1190,"n_cols":17,"rows_kept":1190,"cut":false,"hidden":true,"merged":[]}
["Sales Rep","Sales",null,"#","Large",null,"Sales Rep","Time To Make Part",null,"#","Small",null,null,null,null,null,"Rand formulas:"]
["Richard",5937,null,1,{"$f":"LARGE($B$2:$B$1190,D2)","v":97748},null,"Denise",4.1260000000000003,null,1,{"$f":"SMALL($H$2:$H$1190,J2)","v":1.194},null,null,null,null,null,{"$f":"INDEX(Names,INT(RAND()*COUNTA(Names)+1))","v":"Michael"}]
["Manavbir",19551,null,2,91999,null,"Manavbir",4.5199999999999996,null,2,{"$f":"SMALL($H$2:$H$1190,J3)","v":1.381},null,null,null,null,null,{"$f":"IF(MOD(ROW(),100),RANDBETWEEN(5000,50000),RANDBETWEEN(60000,100000))","v":24952}]
["Janita",22010,null,3,90280,null,"Nelia",3.742,null,3,1.5549999999999999,null,null,null,null,null,{"$f":"IF(MOD(ROW(),375),RANDBETWEEN(2000,5000)/1000,RANDBETWEEN(1000,1750)/1000)","v":2.5259999999999998}]
["Mitchell",26146,null,4,86845,null,"Nelia",3.92,null,4,2.0009999999999999]
["Christina",16621,null,5,84341,null,"Denise",4.4260000000000002,null,5,2.0019999999999998]
["Nakyun",37653,null,null,null,null,"Denise",2.12]
["Mitchell",16018,null,"#","Large",null,"Carol",2.0230000000000001,null,"#","Large"]
["Daniel",31850,null,{"$f":"ROWS(D$9:D9)","v":1},{"$f":"LARGE($B$2:$B$1190,D9)","v":97748},null,"Kaur",2.7309999999999999,null,{"$f":"ROWS(J$9:J9)","v":1},{"$f":"SMALL($H$2:$H$1190,J9)","v":1.194}]
["Mi",29517,null,{"$f":"ROWS(D$9:D10)","v":2},91999,null,"Shari",2.4340000000000002,null,{"$f":"ROWS(J$9:J10)","v":2},{"$f":"SMALL($H$2:$H$1190,J10)","v":1.381}]
["Richard",47477,null,{"$f":"ROWS(D$9:D11)","v":3},90280,null,"Mitchell",4.1959999999999997,null,{"$f":"ROWS(J$9:J11)","v":3},1.5549999999999999]
["Kaur",9008,null,{"$f":"ROWS(D$9:D12)","v":4},86845,null,"Janita",4.4580000000000002,null,{"$f":"ROWS(J$9:J12)","v":4},2.0009999999999999]
["Ewelina",13547,null,{"$f":"ROWS(D$9:D13)","v":5},84341,null,"Michael",4.0880000000000001,null,{"$f":"ROWS(J$9:J13)","v":5},2.0019999999999998]
["Ewelina",49100,null,null,null,null,"Debra",4.8360000000000003]
["Mitchell",26324,null,null,null,null,"Yla-Katrina",3.1819999999999999]
["Nelia",38612,null,null,null,null,"Ewelina",2.8279999999999998]
["Craig",40900,null,null,null,null,"Ewelina",4.9260000000000002]
["Carol",26761,null,null,null,null,"Janita",3.4140000000000001]
["Nelia",21598,null,null,null,null,"Sarah",2.6509999999999998]
["Denise",6625,null,null,null,null,"Carol",3.4129999999999998]
["Richard",37758,null,null,null,null,"Shari",3.915]
["Nelia",45437,null,null,null,null,"Michael",2.5659999999999998]
["Nelia",18107,null,null,null,null,"Debra",4.6879999999999997]
["Richard",39241,null,null,null,null,"Craig",2.1379999999999999]
["Sarah",7544,null,null,null,null,"Denise",4.6479999999999997]
["Nakyun",38052,null,null,null,null,"Shari",3.484]
["Janita",27275,null,null,null,null,"Carol",2.9540000000000002]
["Kaur",32573,null,null,null,null,"Denise",4.6849999999999996]
["Shari",32327,null,null,null,null,"Carol",4.274]
["Shari",15245,null,null,null,null,"Carol",3.1120000000000001]
["Yla-Katrina",38620,null,null,null,null,"Nelia",3.1589999999999998]
["Denise",26444,null,null,null,null,"Carol",4.92]
["Richard",40199,null,null,null,null,"Michael",3.452]
["Carol",36011,null,null,null,null,"Yla-Katrina",4.2859999999999996]
["Michelle",45422,null,null,null,null,"Nelia",3.5049999999999999]
["Nakyun",40283,null,null,null,null,"Daniel",2.7120000000000002]
["Ewelina",37862,null,null,null,null,"Craig",2.778]
["Janita",47855,null,null,null,null,"Michael",3.911]
["Nelia",29383,null,null,null,null,"Michelle",3.6720000000000002]
["Mi",36334,null,null,null,null,"Ewelina",4.742]
["Nakyun",40325,null,null,null,null,"Kaur",4.516]
["Manavbir",7257,null,null,null,null,"Mansa",4.2409999999999997]
["Janita",6429,null,null,null,null,"Sarah",4.8380000000000001]
["Manavbir",32666,null,null,null,null,"Mansa",2.6160000000000001]
["Shari",14516,null,null,null,null,"Daniel",2.8029999999999999]
["Manavbir",17731,null,null,null,null,"Sykes",3.468]
["Mi",40705,null,null,null,null,"Nelia",3.8039999999999998]
["Craig",7940,null,null,null,null,"Manavbir",2.1419999999999999]
["Nelia",16064,null,null,null,null,"Carol",2.9620000000000002]
["Shari",34144,null,null,null,null,"Manavbir",4.907]
["Michael",32784,null,null,null,null,"Nelia",2.6240000000000001]
["Elain",9958,null,null,null,null,"Michelle",4.7229999999999999]
["Nelia",48074,null,null,null,null,"Michael",3.3530000000000002]
["Gianna",36132,null,null,null,null,"Michelle",4.3369999999999997]
["Denise",11251,null,null,null,null,"Craig",3.5129999999999999]
["Denise",47943,null,null,null,null,"Carol",2.7829999999999999]
["Jason",44129,null,null,null,null,"Michael",2.1320000000000001]
["Craig",7793,null,null,null,null,"Mi",3.6739999999999999]
["Richard",14712,null,null,null,null,"Shari",4.431]
["Craig",45146,null,null,null,null,"Kaur",4.3259999999999996]
["Debra",21954,null,null,null,null,"Nakyun",2.7]
["Ewelina",33319,null,null,null,null,"Manavbir",2.5179999999999998]
["Manavbir",7638,null,null,null,null,"Sykes",3.117]
["Richard",15678,null,null,null,null,"Kaur",3.7170000000000001]
["Sarah",7138,null,null,null,null,"Denise",3.6219999999999999]
["Gianna",40848,null,null,null,null,"Shari",2.99]
["Nelia",32714,null,null,null,null,"Elain",4.3520000000000003]
["Sarah",46889,null,null,null,null,"Sarah",2.048]
["Manavbir",25614,null,null,null,null,"Daniel",2.6949999999999998]
["Kaur",5294,null,null,null,null,"Kaur",2.6059999999999999]
["Elain",19448,null,null,null,null,"Nelia",2.2010000000000001]
["Gianna",7232,null,null,null,null,"Kaur",3.7450000000000001]
["Debra",49129,null,null,null,null,"Nakyun",2.6230000000000002]
["Jason",10720,null,null,null,null,"Ewelina",2.488]
["Shari",8892,null,null,null,null,"Michael",3.3460000000000001]
["Nelia",15063,null,null,null,null,"Nakyun",2.3820000000000001]
["Sarah",44344,null,null,null,null,"Mansa",3.2519999999999998]
["Jason",48600,null,null,null,null,"Richard",3.319]
["Mitchell",28247,null,null,null,null,"Richard",2.302]
["Gianna",44470,null,null,null,null,"Sarah",2.984]
["Jason",9839,null,null,null,null,"Michelle",3.3380000000000001]
["Michael",9584,null,null,null,null,"Debra",3.4590000000000001]
["Sarah",12220,null,null,null,null,"Debra",4.7590000000000003]
["Richard",15578,null,null,null,null,"Jason",3.6019999999999999]
["Sarah",45413,null,null,null,null,"Michelle",2.6219999999999999]
["Gianna",31959,null,null,null,null,"Daniel",2.25]
["Mi",23107,null,null,null,null,"Jason",4.335]
["Sarah",28368,null,null,null,null,"Ewelina",4.4139999999999997]
["Michael",36489,null,null,null,null,"Michael",2.758]
["Yla-Katrina",5612,null,null,null,null,"Craig",4.2869999999999999]
["Christina",36978,null,null,null,null,"Michael",3.1779999999999999]
["Craig",24439,null,null,null,null,"Elain",3.8980000000000001]
["Mitchell",26715,null,null,null,null,"Christina",4.149]
["Mi",23882,null,null,null,null,"Jason",2.9180000000000001]
["Craig",21426,null,null,null,null,"Carol",4.76]
["Mitchell",38312,null,null,null,null,"Craig",2.4159999999999999]
["Mi",23551,null,null,null,null,"Jason",4.234]
["Nakyun",28866,null,null,null,null,"Nakyun",5]
["Nelia",8812,null,null,null,null,"Sykes",3.782]
["Sarah",61911,null,null,null,null,"Nakyun",4.12]
["Manavbir",16958,null,null,null,null,"Gianna",2.0950000000000002]
["Mi",17952,null,null,null,null,"Manavbir",4.5330000000000004]
["Elain",33291,null,null,null,null,"Elain",4.431]
["Mi",6800,null,null,null,null,"Yla-Katrina",2.8340000000000001]
["Carol",24953,null,null,null,null,"Daniel",4.8479999999999999]
["Nakyun",31603,null,null,null,null,"Yla-Katrina",2.8069999999999999]
["Michael",30943,null,null,null,null,"Sarah",2.238]
["Kaur",38208,null,null,null,null,"Mansa",3.0990000000000002]
["Mitchell",35127,null,null,null,null,"Elain",3.7519999999999998]
["Sykes",43569,null,null,null,null,"Denise",4.38]
["Carol",41682,null,null,null,null,"Mi",4.367]
["Mansa",42821,null,null,null,null,"Mi",4.444]
["Richard",20726,null,null,null,null,"Craig",3.1459999999999999]
["Sykes",25969,null,null,null,null,"Yla-Katrina",2.8610000000000002]
["Christina",46134,null,null,null,null,"Yla-Katrina",4.8559999999999999]
["Jason",43807,null,null,null,null,"Sarah",2.9780000000000002]
["Sarah",48593,null,null,null,null,"Michelle",2.722]
["Mitchell",43707,null,null,null,null,"Janita",4.907]
["Mitchell",45405,null,null,null,null,"Nelia",4.484]
["Debra",7850,null,null,null,null,"Craig",4.91]
["Manavbir",36076,null,null,null,null,"Kaur",3.7959999999999998]
["Nakyun",20109,null,null,null,null,"Debra",3.6080000000000001]
["Michelle",32743,null,null,null,null,"Debra",2.0870000000000002]
["Denise",19508,null,null,null,null,"Michelle",4.4109999999999996]
["Mitchell",16002,null,null,null,null,"Richard",2.3620000000000001]
["Nelia",16402,null,null,null,null,"Daniel",3.2040000000000002]
["Mitchell",12451,null,null,null,null,"Mansa",4.9249999999999998]
["Michelle",46644,null,null,null,null,"Michael",2.0299999999999998]
["Carol",44253,null,null,null,null,"Jason",3.32]
["Christina",49494,null,null,null,null,"Ewelina",2.5739999999999998]
["Nakyun",47340,null,null,null,null,"Craig",3.3849999999999998]
["Carol",6681,null,null,null,null,"Nakyun",2.4910000000000001]
["Nelia",40975,null,null,null,null,"Janita",3.968]
["Michelle",49190,null,null,null,null,"Richard",2.9740000000000002]
["Mansa",32908,null,null,null,null,"Mansa",4.2389999999999999]
["Nelia",7894,null,null,null,null,"Janita",4.6680000000000001]
["Yla-Katrina",31206,null,null,null,null,"Michelle",3.6419999999999999]
["Mi",45239,null,null,null,null,"Mi",3.5870000000000002]
["Jason",32214,null,null,null,null,"Craig",4.3120000000000003]
["Richard",14015,null,null,null,null,"Manavbir",3.173]
["Daniel",34706,null,null,null,null,"Shari",4.4790000000000001]
["Janita",45676,null,null,null,null,"Shari",3.5430000000000001]
["Ewelina",7488,null,null,null,null,"Craig",3.448]
["Denise",30415,null,null,null,null,"Michael",4.2670000000000003]
["Janita",19724,null,null,null,null,"Daniel",4.3520000000000003]
["Christina",5252,null,null,null,null,"Mi",4.1859999999999999]
["Sykes",39222,null,null,null,null,"Jason",4.9279999999999999]
["Gianna",11449,null,null,null,null,"Janita",3.7240000000000002]
["Ewelina",39876,null,null,null,null,"Mitchell",4.1459999999999999]
["Michelle",41728,null,null,null,null,"Gianna",3.617]
["Kaur",48797,null,null,null,null,"Sarah",3.177]
["Gianna",39504,null,null,null,null,"Janita",4.8280000000000003]
["Michael",14342,null,null,null,null,"Manavbir",3.0419999999999998]
["Jason",30224,null,null,null,null,"Shari",4.9349999999999996]
["Craig",38293,null,null,null,null,"Sarah",3.2719999999999998]
["Richard",43317,null,null,null,null,"Nakyun",3.4830000000000001]
["Denise",34112,null,null,null,null,"Carol",2.2519999999999998]
["Michael",48024,null,null,null,null,"Ewelina",3.3559999999999999]
["Kaur",47831,null,null,null,null,"Daniel",2.6]
["Michael",44663,null,null,null,null,"Daniel",2.9950000000000001]
["Jason",36798,null,null,null,null,"Jason",4.4429999999999996]
["Yla-Katrina",21365,null,null,null,null,"Yla-Katrina",4.8369999999999997]
["Nakyun",45944,null,null,null,null,"Denise",4.6479999999999997]
["Mitchell",33527,null,null,null,null,"Denise",4.2169999999999996]
["Sykes",48077,null,null,null,null,"Sarah",3.5569999999999999]
["Mi",16983,null,null,null,null,"Kaur",3.1230000000000002]
["Michelle",6251,null,null,null,null,"Michelle",4.0789999999999997]
["Kaur",20968,null,null,null,null,"Yla-Katrina",3.403]
["Mitchell",9759,null,null,null,null,"Elain",4.1639999999999997]
["Shari",11835,null,null,null,null,"Mi",2.7559999999999998]
["Mansa",14181,null,null,null,null,"Debra",2.2650000000000001]
["Carol",10117,null,null,null,null,"Michelle",4.0620000000000003]
["Ewelina",48418,null,null,null,null,"Richard",4.7960000000000003]
["Carol",36245,null,null,null,null,"Debra",2.4079999999999999]
["Denise",31306,null,null,null,null,"Shari",4.0510000000000002]
["Daniel",7240,null,null,null,null,"Richard",4.2110000000000003]
["Yla-Katrina",14883,null,null,null,null,"Yla-Katrina",2.6579999999999999]
["Carol",13871,null,null,null,null,"Yla-Katrina",4.7519999999999998]
["Mi",26792,null,null,null,null,"Nelia",3.0459999999999998]
["Sarah",13150,null,null,null,null,"Michelle",3.4820000000000002]
["Ewelina",47850,null,null,null,null,"Ewelina",3.1150000000000002]
["Denise",40529,null,null,null,null,"Mansa",4.0090000000000003]
["Debra",35013,null,null,null,null,"Michael",4.4640000000000004]
["Janita",16459,null,null,null,null,"Manavbir",4.3120000000000003]
["Nakyun",10897,null,null,null,null,"Sarah",3.1869999999999998]
["Craig",24361,null,null,null,null,"Shari",3.4670000000000001]
["Kaur",44746,null,null,null,null,"Ewelina",3.7120000000000002]
["Jason",20768,null,null,null,null,"Nelia",4.4809999999999999]
["Michelle",22517,null,null,null,null,"Michael",2.5430000000000001]
["Yla-Katrina",11307,null,null,null,null,"Michelle",2.274]
["Craig",14094,null,null,null,null,"Daniel",2.2509999999999999]
["Yla-Katrina",39123,null,null,null,null,"Michelle",3.589]
["Kaur",28032,null,null,null,null,"Shari",4.1719999999999997]
["Carol",10296,null,null,null,null,"Mitchell",3.512]
["Daniel",42922,null,null,null,null,"Jason",2.653]
["Elain",37938,null,null,null,null,"Sarah",2.133]
["Richard",10818,null,null,null,null,"Manavbir",2.5569999999999999]
["Mi",11023,null,null,null,null,"Mitchell",2.1019999999999999]
["Yla-Katrina",23907,null,null,null,null,"Mi",4.202]
["Mi",84341,null,null,null,null,"Michelle",2.2480000000000002]
["Daniel",14845,null,null,null,null,"Richard",2.6760000000000002]
["Debra",27986,null,null,null,null,"Christina",3.0449999999999999]
["Michael",33726,null,null,null,null,"Jason",4.9320000000000004]
["Michelle",33481,null,null,null,null,"Nelia",2.5409999999999999]
["Sarah",46579,null,null,null,null,"Nelia",2.274]
["Denise",23604,null,null,null,null,"Jason",2.86]
["Gianna",38016,null,null,null,null,"Nakyun",3.7850000000000001]
["Sarah",18547,null,null,null,null,"Denise",3.21]
["Mi",41094,null,null,null,null,"Richard",2.9580000000000002]
["Janita",10588,null,null,null,null,"Jason",2.6150000000000002]
["Sarah",47493,null,null,null,null,"Craig",3.5550000000000002]
["Nelia",34971,null,null,null,null,"Nakyun",4.952]
["Michael",23413,null,null,null,null,"Richard",2.7349999999999999]
["Janita",49867,null,null,null,null,"Mi",3.7610000000000001]
["Elain",11745,null,null,null,null,"Mitchell",2.4260000000000002]
["Mi",9451,null,null,null,null,"Craig",3.4260000000000002]
["Mitchell",48527,null,null,null,null,"Carol",2.8290000000000002]
["Nakyun",32380,null,null,null,null,"Craig",2.016]
["Denise",8402,null,null,null,null,"Mi",3.335]
["Christina",40229,null,null,null,null,"Mi",2.0910000000000002]
["Kaur",11941,null,null,null,null,"Debra",2.0550000000000002]
["Craig",7598,null,null,null,null,"Elain",2.5339999999999998]
["Mi",7226,null,null,null,null,"Yla-Katrina",2.16]
["Elain",47146,null,null,null,null,"Debra",2.1030000000000002]
["Kaur",48535,null,null,null,null,"Jason",3.1150000000000002]
["Yla-Katrina",8838,null,null,null,null,"Mi",3.5529999999999999]
["Daniel",13845,null,null,null,null,"Sarah",2.391]
["Debra",43911,null,null,null,null,"Debra",3.0550000000000002]
["Jason",48938,null,null,null,null,"Shari",2.4119999999999999]
["Craig",26349,null,null,null,null,"Manavbir",2.8519999999999999]
["Daniel",46577,null,null,null,null,"Mi",3.484]
["Sykes",7542,null,null,null,null,"Debra",4.0039999999999996]
["Craig",42462,null,null,null,null,"Sykes",2.8340000000000001]
["Mitchell",21637,null,null,null,null,"Yla-Katrina",3.6120000000000001]
["Mitchell",23836,null,null,null,null,"Mi",3.8290000000000002]
["Yla-Katrina",5407,null,null,null,null,"Mansa",2.6909999999999998]
["Debra",27142,null,null,null,null,"Sarah",2.7010000000000001]
["Ewelina",45973,null,null,null,null,"Mansa",4.71]
["Carol",31678,null,null,null,null,"Sykes",2.923]
["Kaur",22202,null,null,null,null,"Michelle",2.3149999999999999]
["Jason",40146,null,null,null,null,"Michelle",4.6100000000000003]
["Shari",40689,null,null,null,null,"Michael",3.5409999999999999]
["Michael",34941,null,null,null,null,"Kaur",4.0810000000000004]
["Richard",5774,null,null,null,null,"Janita",3.6]
["Denise",22946,null,null,null,null,"Shari",3.7509999999999999]
["Kaur",10727,null,null,null,null,"Christina",4.9050000000000002]
["Daniel",6427,null,null,null,null,"Denise",4.2610000000000001]
["Denise",40983,null,null,null,null,"Mitchell",4.976]
["Shari",27878,null,null,null,null,"Elain",3.5059999999999998]
["Michael",22496,null,null,null,null,"Michelle",3]
["Jason",16731,null,null,null,null,"Elain",2.9319999999999999]
["Nakyun",43564,null,null,null,null,"Michael",4.8570000000000002]
["Nakyun",20898,null,null,null,null,"Christina",3.794]
["Nakyun",16167,null,null,null,null,"Nakyun",4.16]
["Jason",19304,null,null,null,null,"Craig",4.93]
["Mi",49558,null,null,null,null,"Denise",4.0469999999999997]
["Debra",14373,null,null,null,null,"Mitchell",2.7240000000000002]
["Mi",31995,null,null,null,null,"Gianna",4.1689999999999996]
["Sykes",45150,null,null,null,null,"Yla-Katrina",4.9219999999999997]
["Mitchell",10053,null,null,null,null,"Janita",2.5710000000000002]
["Craig",22612,null,null,null,null,"Jason",4.2089999999999996]
["Janita",10439,null,null,null,null,"Carol",2.8959999999999999]
["Jason",26481,null,null,null,null,"Yla-Katrina",3.2240000000000002]
["Yla-Katrina",24448,null,null,null,null,"Mi",4.0010000000000003]
["Gianna",13656,null,null,null,null,"Elain",4.9640000000000004]
["Michelle",25184,null,null,null,null,"Elain",4.8369999999999997]
["Denise",23349,null,null,null,null,"Michelle",3.206]
["Denise",9096,null,null,null,null,"Ewelina",4.09]
["Yla-Katrina",8374,null,null,null,null,"Mi",2.0579999999999998]
["Craig",47501,null,null,null,null,"Nakyun",2.298]
["Debra",44007,null,null,null,null,"Richard",4.1539999999999999]
["Debra",15399,null,null,null,null,"Ewelina",4.7270000000000003]
["Mi",37590,null,null,null,null,"Sarah",2.2559999999999998]
["Gianna",18199,null,null,null,null,"Manavbir",3.74]
["Debra",47968,null,null,null,null,"Nakyun",4.6559999999999997]
["Yla-Katrina",28941,null,null,null,null,"Sarah",3.2650000000000001]
["Christina",42362,null,null,null,null,"Christina",2.3159999999999998]
["Richard",33614,null,null,null,null,"Mi",4.952]
["Nelia",6046,null,null,null,null,"Michael",3.23]
["Manavbir",47527,null,null,null,null,"Richard",4.9880000000000004]
["Michelle",36535,null,null,null,null,"Gianna",2.383]
["Denise",42345,null,null,null,null,"Richard",4.0410000000000004]
["Craig",23694,null,null,null,null,"Yla-Katrina",4.367]
["Nelia",9440,null,null,null,null,"Ewelina",3.5449999999999999]
["Sykes",24657,null,null,null,null,"Craig",3.9260000000000002]
["Christina",37870,null,null,null,null,"Nakyun",3.9729999999999999]
["Mansa",30641,null,null,null,null,"Craig",3.61]
["Mi",17354,null,null,null,null,"Denise",4.4080000000000004]
["Michelle",11498,null,null,null,null,"Mansa",2.121]
["Carol",28088,null,null,null,null,"Ewelina",2.3940000000000001]
["Richard",10357,null,null,null,null,"Carol",4.258]
["Carol",38344,null,null,null,null,"Daniel",3.931]
["Mi",24051,null,null,null,null,"Sykes",4.9169999999999998]
["Mansa",13989,null,null,null,null,"Richard",3.4369999999999998]
["Janita",31421,null,null,null,null,"Christina",3.423]
["Nelia",33653,null,null,null,null,"Mansa",4.4909999999999997]
["Sarah",21935,null,null,null,null,"Manavbir",3.2429999999999999]
["Richard",15527,null,null,null,null,"Carol",4.2409999999999997]
["Nelia",13689,null,null,null,null,"Elain",3.133]
["Denise",61035,null,null,null,null,"Sykes",4.4909999999999997]
["Gianna",26689,null,null,null,null,"Shari",2.194]
["Elain",32440,null,null,null,null,"Mitchell",3.7080000000000002]
["Christina",30375,null,null,null,null,"Richard",4.8079999999999998]
["Elain",19863,null,null,null,null,"Kaur",4.2850000000000001]
["Craig",8754,null,null,null,null,"Kaur",4.79]
["Debra",9277,null,null,null,null,"Sykes",2.7010000000000001]
["Yla-Katrina",22707,null,null,null,null,"Richard",3.0259999999999998]
["Mi",6965,null,null,null,null,"Elain",3.157]
["Gianna",44347,null,null,null,null,"Shari",2.952]
["Michael",5327,null,null,null,null,"Mi",3.121]
["Sarah",29380,null,null,null,null,"Daniel",2.056]
["Kaur",13564,null,null,null,null,"Christina",2.6560000000000001]
["Manavbir",43079,null,null,null,null,"Elain",4.5010000000000003]
["Yla-Katrina",31417,null,null,null,null,"Janita",3.1720000000000002]
["Mitchell",39035,null,null,null,null,"Daniel",2.3980000000000001]
["Richard",42648,null,null,null,null,"Craig",4.7229999999999999]
["Nakyun",22714,null,null,null,null,"Michael",3.9809999999999999]
["Carol",38929,null,null,null,null,"Gianna",3.5990000000000002]
["Mansa",49670,null,null,null,null,"Michael",3.355]
["Craig",35552,null,null,null,null,"Nelia",4.2039999999999997]
["Manavbir",31306,null,null,null,null,"Mi",3.0750000000000002]
["Manavbir",6432,null,null,null,null,"Denise",3.98]
["Elain",23208,null,null,null,null,"Debra",2.7290000000000001]
["Elain",39351,null,null,null,null,"Ewelina",3.2469999999999999]
["Carol",49361,null,null,null,null,"Michelle",4.3310000000000004]
["Richard",47967,null,null,null,null,"Elain",2.6880000000000002]
["Janita",21203,null,null,null,null,"Jason",3.2149999999999999]
["Jason",6019,null,null,null,null,"Shari",3.0510000000000002]
["Janita",5159,null,null,null,null,"Mi",4.5209999999999999]
["Elain",26631,null,null,null,null,"Richard",2.6110000000000002]
["Christina",29166,null,null,null,null,"Christina",3.6749999999999998]
["Sarah",28114,null,null,null,null,"Mitchell",2.0859999999999999]
["Kaur",21329,null,null,null,null,"Elain",4.0289999999999999]
["Craig",6195,null,null,null,null,"Yla-Katrina",4.5449999999999999]
["Michael",30818,null,null,null,null,"Janita",2.6829999999999998]
["Debra",28737,null,null,null,null,"Michelle",3.1850000000000001]
["Christina",26855,null,null,null,null,"Jason",2.1960000000000002]
["Sykes",6522,null,null,null,null,"Carol",2.3610000000000002]
["Carol",18519,null,null,null,null,"Carol",2.677]
["Nakyun",40619,null,null,null,null,"Mansa",3.2290000000000001]
["Jason",46307,null,null,null,null,"Mitchell",3.6669999999999998]
["Elain",37743,null,null,null,null,"Michael",3.5739999999999998]
["Yla-Katrina",35176,null,null,null,null,"Mitchell",2.4889999999999999]
["Sarah",21573,null,null,null,null,"Carol",4.2080000000000002]
["Denise",25778,null,null,null,null,"Mi",2.5880000000000001]
["Sykes",7358,null,null,null,null,"Nelia",2.048]
["Michelle",43754,null,null,null,null,"Denise",2.077]
["Elain",6738,null,null,null,null,"Michael",4.0209999999999999]
["Janita",27030,null,null,null,null,"Ewelina",2.4670000000000001]
["Jason",38189,null,null,null,null,"Elain",2.6059999999999999]
["Sykes",28769,null,null,null,null,"Ewelina",2.9430000000000001]
["Denise",10865,null,null,null,null,"Jason",4.9109999999999996]
["Nakyun",10587,null,null,null,null,"Mansa",3.9039999999999999]
["Sarah",22267,null,null,null,null,"Nakyun",3.73]
["Mansa",15214,null,null,null,null,"Daniel",4.7169999999999996]
["Nakyun",32041,null,null,null,null,"Daniel",2.4079999999999999]
["Sykes",6664,null,null,null,null,"Michael",4.2359999999999998]
["Mansa",5167,null,null,null,null,"Daniel",4.7329999999999997]
["Christina",43654,null,null,null,null,"Manavbir",4.8540000000000001]
["Mitchell",35145,null,null,null,null,"Ewelina",4.53]
["Nakyun",15473,null,null,null,null,"Richard",2.2759999999999998]
["Sarah",8635,null,null,null,null,"Kaur",2.0870000000000002]
["Craig",16770,null,null,null,null,"Mansa",4.4189999999999996]
["Kaur",46271,null,null,null,null,"Mansa",2.6360000000000001]
["Mi",11914,null,null,null,null,"Mitchell",4.9450000000000003]
["Mansa",20113,null,null,null,null,"Jason",4.7969999999999997]
["Richard",17645,null,null,null,null,"Shari",2.4220000000000002]
["Sarah",10320,null,null,null,null,"Manavbir",3.3860000000000001]
["Sykes",40362,null,null,null,null,"Michelle",2.2690000000000001]
["Sykes",16308,null,null,null,null,"Jason",4.8239999999999998]
["Sarah",31926,null,null,null,null,"Kaur",2.407]
["Mitchell",30781,null,null,null,null,"Mitchell",4.8739999999999997]
["Mansa",23470,null,null,null,null,"Denise",2.8149999999999999]
["Nelia",8146,null,null,null,null,"Manavbir",4.8769999999999998]
["Mitchell",12907,null,null,null,null,"Sarah",1.194]
["Yla-Katrina",28110,null,null,null,null,"Christina",2.8130000000000002]
["Daniel",10352,null,null,null,null,"Gianna",2.1269999999999998]
["Sarah",42277,null,null,null,null,"Nelia",3.6850000000000001]
["Manavbir",14040,null,null,null,null,"Janita",3.7759999999999998]
["Debra",24222,null,null,null,null,"Mi",2.0979999999999999]
["Carol",11622,null,null,null,null,"Sykes",2.714]
["Craig",22470,null,null,null,null,"Nelia",4.0339999999999998]
["Ewelina",40967,null,null,null,null,"Shari",3.5619999999999998]
["Craig",28534,null,null,null,null,"Elain",2.0859999999999999]
["Yla-Katrina",17579,null,null,null,null,"Nakyun",4.1210000000000004]
["Mi",18950,null,null,null,null,"Jason",3.3639999999999999]
["Carol",30452,null,null,null,null,"Daniel",2.1589999999999998]
["Mi",23999,null,null,null,null,"Debra",2.032]
["Gianna",21391,null,null,null,null,"Richard",2.823]
["Daniel",7023,null,null,null,null,"Christina",3.411]
["Jason",32947,null,null,null,null,"Nakyun",4.9320000000000004]
["Carol",15859,null,null,null,null,"Richard",3.7229999999999999]
["Debra",23275,null,null,null,null,"Daniel",3.7839999999999998]
["Nakyun",47824,null,null,null,null,"Carol",2.1760000000000002]
["Mitchell",32143,null,null,null,null,"Ewelina",3.7530000000000001]
["Gianna",28160,null,null,null,null,"Nelia",2.6819999999999999]
["Sarah",39399,null,null,null,null,"Sarah",3.766]
["Gianna",21354,null,null,null,null,"Michelle",2.65]
["Daniel",15272,null,null,null,null,"Sykes",2.2719999999999998]
["Elain",79756,null,null,null,null,"Debra",4.43]
["Mansa",35133,null,null,null,null,"Christina",4.1550000000000002]
["Michelle",40375,null,null,null,null,"Janita",4.5350000000000001]
["Nelia",34345,null,null,null,null,"Jason",3.7370000000000001]
["Manavbir",9979,null,null,null,null,"Michael",2.907]
["Denise",24007,null,null,null,null,"Christina",3.1150000000000002]
["Christina",11615,null,null,null,null,"Michelle",4.1529999999999996]
["Yla-Katrina",37605,null,null,null,null,"Mansa",3.8130000000000002]
["Yla-Katrina",40732,null,null,null,null,"Sykes",3.9009999999999998]
["Michelle",40034,null,null,null,null,"Yla-Katrina",3.1539999999999999]
["Sarah",43849,null,null,null,null,"Richard",2.9340000000000002]
["Michelle",48799,null,null,null,null,"Sarah",2.7330000000000001]
["Richard",31813,null,null,null,null,"Mitchell",2.726]
["Elain",11093,null,null,null,null,"Gianna",2.9340000000000002]
["Sykes",5742,null,null,null,null,"Richard",3.4590000000000001]
["Kaur",40194,null,null,null,null,"Richard",3.1779999999999999]
["Christina",41133,null,null,null,null,"Shari",3.57]
["Mitchell",19410,null,null,null,null,"Elain",4.8730000000000002]
["Mitchell",34376,null,null,null,null,"Denise",4.9260000000000002]
["Richard",36010,null,null,null,null,"Mi",4.9729999999999999]
["Carol",18623,null,null,null,null,"Ewelina",4.0549999999999997]
["Kaur",17280,null,null,null,null,"Debra",3.4239999999999999]
["Richard",6550,null,null,null,null,"Gianna",4.798]
["Daniel",31661,null,null,null,null,"Michael",3.117]
["Shari",12062,null,null,null,null,"Nelia",3.7879999999999998]
["Craig",27479,null,null,null,null,"Mi",3.8820000000000001]
["Craig",14944,null,null,null,null,"Jason",2.4580000000000002]
["Debra",11620,null,null,null,null,"Mansa",2.9369999999999998]
["Sarah",48485,null,null,null,null,"Sarah",2.6760000000000002]
["Michael",46460,null,null,null,null,"Shari",4.26]
["Kaur",9036,null,null,null,null,"Sarah",2.7229999999999999]
["Mi",19017,null,null,null,null,"Craig",4.7919999999999998]
["Mi",46672,null,null,null,null,"Debra",4.2670000000000003]
["Carol",35922,null,null,null,null,"Sarah",2.1110000000000002]
["Yla-Katrina",6913,null,null,null,null,"Daniel",2.0859999999999999]
["Ewelina",35569,null,null,null,null,"Nelia",4.9939999999999998]
["Carol",46275,null,null,null,null,"Shari",2.0209999999999999]
["Sykes",39738,null,null,null,null,"Richard",4.0670000000000002]
["Janita",14240,null,null,null,null,"Janita",4.8159999999999998]
["Mansa",25768,null,null,null,null,"Gianna",4.625]
["Mansa",39626,null,null,null,null,"Shari",2.2349999999999999]
["Janita",33529,null,null,null,null,"Denise",2.3889999999999998]
["Carol",20056,null,null,null,null,"Gianna",2.1080000000000001]
["Michelle",27554,null,null,null,null,"Jason",3.194]
["Kaur",7803,null,null,null,null,"Daniel",4.6500000000000004]
["Nakyun",12044,null,null,null,null,"Mansa",3.298]
["Carol",26987,null,null,null,null,"Michelle",4.1470000000000002]
["Carol",5231,null,null,null,null,"Kaur",3.7109999999999999]
["Janita",18028,null,null,null,null,"Kaur",3.8450000000000002]
["Mansa",22701,null,null,null,null,"Carol",2.29]
["Craig",28066,null,null,null,null,"Gianna",4.67]
["Yla-Katrina",21219,null,null,null,null,"Kaur",2.4729999999999999]
["Shari",13231,null,null,null,null,"Richard",3.3069999999999999]
["Kaur",45316,null,null,null,null,"Jason",3.536]
["Michael",27239,null,null,null,null,"Elain",4.9619999999999997]
["Daniel",44965,null,null,null,null,"Denise",3.2490000000000001]
["Elain",14550,null,null,null,null,"Janita",3.742]
["Sarah",32846,null,null,null,null,"Nakyun",3.012]
["Michelle",26315,null,null,null,null,"Richard",3.5019999999999998]
["Janita",26159,null,null,null,null,"Nakyun",4.5869999999999997]
["Mansa",45837,null,null,null,null,"Sarah",2.1989999999999998]
["Debra",47813,null,null,null,null,"Kaur",4.6580000000000004]
["Denise",35590,null,null,null,null,"Ewelina",3.1320000000000001]
["Daniel",42916,null,null,null,null,"Ewelina",4.6369999999999996]
["Gianna",45836,null,null,null,null,"Daniel",2.4849999999999999]
["Michael",20507,null,null,null,null,"Manavbir",2.0009999999999999]
["Debra",13084,null,null,null,null,"Shari",4.8440000000000003]
["Richard",20582,null,null,null,null,"Yla-Katrina",3.4860000000000002]
["Mi",48001,null,null,null,null,"Mansa",4.3920000000000003]
["Daniel",40594,null,null,null,null,"Sarah",3.1829999999999998]
["Craig",42154,null,null,null,null,"Richard",2.7160000000000002]
["Sarah",5460,null,null,null,null,"Gianna",3.7160000000000002]
["Mansa",37976,null,null,null,null,"Kaur",2.6659999999999999]
["Yla-Katrina",39011,null,null,null,null,"Debra",4.1859999999999999]
["Sykes",40840,null,null,null,null,"Gianna",4.2320000000000002]
["Manavbir",40202,null,null,null,null,"Ewelina",4.6289999999999996]
["Debra",20750,null,null,null,null,"Michael",2.6349999999999998]
["Manavbir",34877,null,null,null,null,"Debra",2.7040000000000002]
["Jason",42906,null,null,null,null,"Carol",3.95]
["Janita",34359,null,null,null,null,"Yla-Katrina",3.5030000000000001]
["Nelia",11938,null,null,null,null,"Gianna",3.5289999999999999]
["Daniel",43849,null,null,null,null,"Janita",3.6549999999999998]
["Sykes",6197,null,null,null,null,"Denise",4.6020000000000003]
["Michelle",38351,null,null,null,null,"Mi",3.5019999999999998]
["Nelia",11912,null,null,null,null,"Craig",4.1749999999999998]
["Carol",23837,null,null,null,null,"Kaur",3.1419999999999999]
["Sarah",13045,null,null,null,null,"Manavbir",3.32]
["Mitchell",23261,null,null,null,null,"Ewelina",3.823]
["Michael",22960,null,null,null,null,"Ewelina",3.47]
["Yla-Katrina",24137,null,null,null,null,"Debra",3.4980000000000002]
["Sykes",36616,null,null,null,null,"Craig",3.726]
["Richard",21885,null,null,null,null,"Denise",4.7009999999999996]
["Craig",45796,null,null,null,null,"Shari",4.8650000000000002]
["Carol",41349,null,null,null,null,"Daniel",4.0330000000000004]
["Ewelina",30315,null,null,null,null,"Mitchell",4.859]
["Yla-Katrina",49593,null,null,null,null,"Mi",3.4529999999999998]
["Daniel",48982,null,null,null,null,"Michael",3.78]
["Carol",18711,null,null,null,null,"Michael",4.3979999999999997]
["Nelia",20356,null,null,null,null,"Gianna",4.9080000000000004]
["Mansa",49304,null,null,null,null,"Gianna",2.4590000000000001]
["Mitchell",86845,null,null,null,null,"Daniel",2.2839999999999998]
["Shari",27261,null,null,null,null,"Nelia",4.1210000000000004]
["Shari",21145,null,null,null,null,"Nakyun",2.9580000000000002]
["Janita",15564,null,null,null,null,"Christina",3.9950000000000001]
["Daniel",13391,null,null,null,null,"Debra",2.4929999999999999]
["Gianna",24788,null,null,null,null,"Nelia",3.28]
["Michael",45520,null,null,null,null,"Craig",3.5089999999999999]
["Michael",34961,null,null,null,null,"Mi",2.6240000000000001]
["Christina",45551,null,null,null,null,"Nelia",4.3609999999999998]
["Craig",6109,null,null,null,null,"Richard",3.528]
["Christina",35601,null,null,null,null,"Elain",4.4880000000000004]
["Yla-Katrina",30631,null,null,null,null,"Carol",2.1320000000000001]
["Michelle",31287,null,null,null,null,"Gianna",4.5869999999999997]
["Janita",42219,null,null,null,null,"Michael",2.7869999999999999]
["Nakyun",20933,null,null,null,null,"Michelle",4.681]
["Yla-Katrina",29736,null,null,null,null,"Janita",4.2629999999999999]
["Shari",36834,null,null,null,null,"Elain",3.2149999999999999]
["Sykes",9576,null,null,null,null,"Elain",3.9169999999999998]
["Richard",30788,null,null,null,null,"Debra",4.673]
["Denise",14167,null,null,null,null,"Craig",3.8969999999999998]
["Craig",28462,null,null,null,null,"Mi",3.7240000000000002]
["Christina",14092,null,null,null,null,"Manavbir",4.5439999999999996]
["Jason",5707,null,null,null,null,"Mitchell",4.0540000000000003]
["Nelia",20164,null,null,null,null,"Elain",3.609]
["Michelle",16087,null,null,null,null,"Mi",3.2749999999999999]
["Nelia",21774,null,null,null,null,"Janita",4.3600000000000003]
["Christina",10579,null,null,null,null,"Elain",2.5870000000000002]
["Denise",42566,null,null,null,null,"Manavbir",4.375]
["Sarah",32327,null,null,null,null,"Janita",3.7989999999999999]
["Manavbir",31600,null,null,null,null,"Shari",3.7669999999999999]
["Janita",49683,null,null,null,null,"Elain",2.3210000000000002]
["Nakyun",24078,null,null,null,null,"Daniel",2.15]
["Kaur",49861,null,null,null,null,"Elain",2.9369999999999998]
["Christina",8291,null,null,null,null,"Shari",2.141]
["Mitchell",42746,null,null,null,null,"Christina",3.3519999999999999]
["Yla-Katrina",26851,null,null,null,null,"Denise",2.395]
["Elain",25461,null,null,null,null,"Christina",2.4540000000000002]
["Mansa",22507,null,null,null,null,"Jason",2.1139999999999999]
["Daniel",25771,null,null,null,null,"Richard",2.5710000000000002]
["Shari",15092,null,null,null,null,"Kaur",2.3420000000000001]
["Yla-Katrina",40001,null,null,null,null,"Janita",2.5350000000000001]
["Kaur",36626,null,null,null,null,"Kaur",2.8889999999999998]
["Jason",18727,null,null,null,null,"Elain",2.8460000000000001]
["Sarah",45834,null,null,null,null,"Ewelina",2.9870000000000001]
["Daniel",48794,null,null,null,null,"Michelle",4.2080000000000002]
["Shari",48492,null,null,null,null,"Mi",4.5129999999999999]
["Debra",18196,null,null,null,null,"Sarah",4.0179999999999998]
["Yla-Katrina",17338,null,null,null,null,"Craig",3.7050000000000001]
["Craig",20327,null,null,null,null,"Carol",2.5619999999999998]
["Nakyun",26406,null,null,null,null,"Manavbir",3.234]
["Nelia",23338,null,null,null,null,"Kaur",4.173]
["Jason",38511,null,null,null,null,"Ewelina",3.4729999999999999]
["Debra",9359,null,null,null,null,"Daniel",2.7679999999999998]
["Nelia",5933,null,null,null,null,"Gianna",4.42]
["Daniel",20113,null,null,null,null,"Debra",4.556]
["Gianna",26036,null,null,null,null,"Denise",3.399]
["Mi",22301,null,null,null,null,"Kaur",3.718]
["Michael",39584,null,null,null,null,"Manavbir",2.5979999999999999]
["Sykes",47969,null,null,null,null,"Sarah",3.738]
["Mitchell",32765,null,null,null,null,"Sarah",3.2890000000000001]
["Kaur",49576,null,null,null,null,"Nelia",4.2220000000000004]
["Jason",44273,null,null,null,null,"Michelle",4.2839999999999998]
["Christina",43325,null,null,null,null,"Mansa",2.7909999999999999]
["Kaur",49482,null,null,null,null,"Sarah",3.101]
["Carol",15986,null,null,null,null,"Richard",2.5640000000000001]
["Elain",16777,null,null,null,null,"Mi",3.0760000000000001]
["Mi",22904,null,null,null,null,"Debra",2.0019999999999998]
["Christina",21010,null,null,null,null,"Michelle",4.8540000000000001]
["Mitchell",40322,null,null,null,null,"Janita",3.508]
["Michelle",23550,null,null,null,null,"Christina",2.3929999999999998]
["Kaur",5347,null,null,null,null,"Mi",3.0550000000000002]
["Yla-Katrina",10921,null,null,null,null,"Richard",4.8680000000000003]
["Daniel",42298,null,null,null,null,"Mansa",2.7869999999999999]
["Kaur",31382,null,null,null,null,"Jason",4.1609999999999996]
["Richard",24401,null,null,null,null,"Ewelina",3.552]
["Debra",26307,null,null,null,null,"Daniel",3.919]
["Carol",32818,null,null,null,null,"Michael",4.7530000000000001]
["Kaur",22474,null,null,null,null,"Denise",4.5339999999999998]
["Nelia",15515,null,null,null,null,"Manavbir",4.9290000000000003]
["Michelle",29624,null,null,null,null,"Christina",2.2749999999999999]
["Elain",30686,null,null,null,null,"Nakyun",2.1179999999999999]
["Yla-Katrina",38636,null,null,null,null,"Manavbir",4.2190000000000003]
["Manavbir",9894,null,null,null,null,"Sykes",3.181]
["Yla-Katrina",5639,null,null,null,null,"Elain",2.657]
["Mi",6597,null,null,null,null,"Richard",3.855]
["Gianna",35547,null,null,null,null,"Gianna",3.5710000000000002]
["Mitchell",31205,null,null,null,null,"Christina",2.7229999999999999]
["Richard",43084,null,null,null,null,"Jason",2.319]
["Yla-Katrina",17593,null,null,null,null,"Sykes",4.4349999999999996]
["Sarah",35657,null,null,null,null,"Michael",2.1669999999999998]
["Daniel",40550,null,null,null,null,"Yla-Katrina",2.8719999999999999]
["Jason",20846,null,null,null,null,"Mitchell",2.7570000000000001]
["Nakyun",35429,null,null,null,null,"Sykes",2.3109999999999999]
["Shari",21451,null,null,null,null,"Richard",3.4260000000000002]
["Carol",8819,null,null,null,null,"Debra",3.4860000000000002]
["Nelia",18755,null,null,null,null,"Shari",3.4289999999999998]
["Michael",23929,null,null,null,null,"Mi",4.9820000000000002]
["Craig",36627,null,null,null,null,"Christina",2.3180000000000001]
["Manavbir",7088,null,null,null,null,"Sarah",3.3490000000000002]
["Manavbir",14548,null,null,null,null,"Denise",4.7670000000000003]
["Sykes",97748,null,null,null,null,"Christina",3.8759999999999999]
["Denise",38305,null,null,null,null,"Shari",2.5510000000000002]
["Michael",13424,null,null,null,null,"Shari",3.004]
["Elain",26412,null,null,null,null,"Nelia",4.62]
["Mansa",26415,null,null,null,null,"Nelia",4.8559999999999999]
["Shari",31459,null,null,null,null,"Jason",4.1619999999999999]
["Michelle",23910,null,null,null,null,"Debra",3.4359999999999999]
["Sarah",29130,null,null,null,null,"Daniel",4.97]
["Mi",39211,null,null,null,null,"Gianna",4.8419999999999996]
["Nakyun",7873,null,null,null,null,"Michelle",4.37]
["Sarah",17355,null,null,null,null,"Jason",3.5179999999999998]
["Manavbir",37143,null,null,null,null,"Shari",3.9590000000000001]
["Michael",45224,null,null,null,null,"Jason",3.9340000000000002]
["Mi",11659,null,null,null,null,"Shari",3.4249999999999998]
["Debra",9144,null,null,null,null,"Kaur",3.1059999999999999]
["Richard",30654,null,null,null,null,"Kaur",2.0470000000000002]
["Mi",39597,null,null,null,null,"Denise",4.9489999999999998]
["Ewelina",36715,null,null,null,null,"Kaur",2.347]
["Carol",41954,null,null,null,null,"Manavbir",2.7389999999999999]
["Michael",21580,null,null,null,null,"Mansa",4.6890000000000001]
["Michelle",22671,null,null,null,null,"Elain",4.0339999999999998]
["Sarah",13493,null,null,null,null,"Manavbir",3.4420000000000002]
["Daniel",27320,null,null,null,null,"Manavbir",4.7060000000000004]
["Shari",29524,null,null,null,null,"Christina",2.0449999999999999]
["Ewelina",30856,null,null,null,null,"Richard",2.3570000000000002]
["Nakyun",30489,null,null,null,null,"Denise",2.5880000000000001]
["Christina",45713,null,null,null,null,"Denise",3.9129999999999998]
["Sarah",36134,null,null,null,null,"Nelia",3.41]
["Craig",43001,null,null,null,null,"Richard",4.9000000000000004]
["Manavbir",15091,null,null,null,null,"Mitchell",3.2949999999999999]
["Ewelina",46081,null,null,null,null,"Janita",4.3730000000000002]
["Nelia",42888,null,null,null,null,"Nelia",4.149]
["Ewelina",28640,null,null,null,null,"Janita",3.9569999999999999]
["Sykes",36121,null,null,null,null,"Sykes",4.8920000000000003]
["Janita",18253,null,null,null,null,"Mitchell",3.2450000000000001]
["Ewelina",29915,null,null,null,null,"Janita",4.1580000000000004]
["Jason",17790,null,null,null,null,"Elain",3.3029999999999999]
["Shari",9937,null,null,null,null,"Michael",3.7480000000000002]
["Debra",11140,null,null,null,null,"Manavbir",3.8650000000000002]
["Yla-Katrina",39064,null,null,null,null,"Jason",2.7010000000000001]
["Richard",23646,null,null,null,null,"Nelia",4.5460000000000003]
["Yla-Katrina",10701,null,null,null,null,"Sykes",3.42]
["Ewelina",16982,null,null,null,null,"Kaur",4.2160000000000002]
["Elain",16741,null,null,null,null,"Elain",2.4940000000000002]
["Mitchell",27665,null,null,null,null,"Jason",2.9119999999999999]
["Yla-Katrina",10112,null,null,null,null,"Gianna",2.81]
["Mansa",24839,null,null,null,null,"Christina",4.1719999999999997]
["Kaur",7826,null,null,null,null,"Denise",2.8479999999999999]
["Mitchell",32763,null,null,null,null,"Ewelina",3.444]
["Shari",38854,null,null,null,null,"Kaur",4.0609999999999999]
["Kaur",46268,null,null,null,null,"Elain",3.0139999999999998]
["Ewelina",16701,null,null,null,null,"Daniel",2.6280000000000001]
["Christina",46725,null,null,null,null,"Michael",3.38]
["Christina",14586,null,null,null,null,"Craig",4.4169999999999998]
["Shari",18386,null,null,null,null,"Kaur",3.0470000000000002]
["Richard",40483,null,null,null,null,"Daniel",3.7109999999999999]
["Mitchell",48751,null,null,null,null,"Manavbir",4.375]
["Daniel",48109,null,null,null,null,"Michelle",2.738]
["Craig",27120,null,null,null,null,"Mansa",3.8879999999999999]
["Richard",39260,null,null,null,null,"Nelia",4.3109999999999999]
["Elain",27737,null,null,null,null,"Manavbir",4.133]
["Manavbir",14897,null,null,null,null,"Nakyun",4.9180000000000001]
["Daniel",21085,null,null,null,null,"Ewelina",4.1740000000000004]
["Craig",17910,null,null,null,null,"Daniel",4.7350000000000003]
["Jason",44811,null,null,null,null,"Yla-Katrina",3.581]
["Michelle",7042,null,null,null,null,"Yla-Katrina",2.153]
["Carol",24058,null,null,null,null,"Manavbir",3.8370000000000002]
["Shari",8763,null,null,null,null,"Daniel",3.6480000000000001]
["Janita",38446,null,null,null,null,"Daniel",2.7909999999999999]
["Gianna",9913,null,null,null,null,"Sarah",2.6480000000000001]
["Yla-Katrina",46898,null,null,null,null,"Christina",4.306]
["Mansa",33652,null,null,null,null,"Manavbir",2.746]
["Michelle",35100,null,null,null,null,"Mansa",3.7]
["Richard",23045,null,null,null,null,"Christina",3.6749999999999998]
["Mitchell",31972,null,null,null,null,"Carol",4.6470000000000002]
["Shari",14446,null,null,null,null,"Mitchell",4.2770000000000001]
["Mi",48467,null,null,null,null,"Nakyun",4.1360000000000001]
["Denise",12821,null,null,null,null,"Michelle",4.0960000000000001]
["Mi",26138,null,null,null,null,"Craig",4.1399999999999997]
["Christina",27414,null,null,null,null,"Yla-Katrina",4.4009999999999998]
["Michael",30142,null,null,null,null,"Michael",3.1320000000000001]
["Ewelina",10961,null,null,null,null,"Gianna",2.8849999999999998]
["Gianna",15946,null,null,null,null,"Mi",3.3359999999999999]
["Christina",26878,null,null,null,null,"Christina",3.0830000000000002]
["Christina",44389,null,null,null,null,"Yla-Katrina",3.7269999999999999]
["Nakyun",40017,null,null,null,null,"Kaur",3.6779999999999999]
["Christina",15597,null,null,null,null,"Manavbir",4.4589999999999996]
["Shari",27047,null,null,null,null,"Nakyun",4.1500000000000004]
["Manavbir",14143,null,null,null,null,"Jason",4.0350000000000001]
["Richard",40008,null,null,null,null,"Christina",2.1579999999999999]
["Ewelina",44096,null,null,null,null,"Michelle",4.3019999999999996]
["Sarah",40983,null,null,null,null,"Janita",2.6629999999999998]
["Nakyun",9886,null,null,null,null,"Michelle",3.5579999999999998]
["Sykes",23116,null,null,null,null,"Sykes",2.2749999999999999]
["Ewelina",18060,null,null,null,null,"Richard",2.589]
["Michael",20264,null,null,null,null,"Carol",3.968]
["Michael",45809,null,null,null,null,"Richard",2.8879999999999999]
["Mi",11547,null,null,null,null,"Carol",3.1059999999999999]
["Mansa",13042,null,null,null,null,"Craig",2.1160000000000001]
["Mitchell",26800,null,null,null,null,"Carol",2.9380000000000002]
["Janita",90280,null,null,null,null,"Gianna",3.169]
["Manavbir",9109,null,null,null,null,"Gianna",2.9830000000000001]
["Sykes",40932,null,null,null,null,"Yla-Katrina",2.5960000000000001]
["Mansa",16135,null,null,null,null,"Mansa",3.1059999999999999]
["Kaur",23459,null,null,null,null,"Mansa",4.2320000000000002]
["Daniel",14123,null,null,null,null,"Christina",2.0779999999999998]
["Mitchell",44845,null,null,null,null,"Gianna",3.0649999999999999]
["Michelle",17721,null,null,null,null,"Daniel",3.0179999999999998]
["Richard",26304,null,null,null,null,"Daniel",4.0060000000000002]
["Carol",25661,null,null,null,null,"Michelle",3.1629999999999998]
["Yla-Katrina",14392,null,null,null,null,"Ewelina",4.5869999999999997]
["Nakyun",16157,null,null,null,null,"Denise",4.423]
["Sarah",14132,null,null,null,null,"Craig",2.3860000000000001]
["Kaur",49273,null,null,null,null,"Michelle",2.7429999999999999]
["Ewelina",13849,null,null,null,null,"Janita",3.5139999999999998]
["Nakyun",27291,null,null,null,null,"Richard",4.8129999999999997]
["Christina",33921,null,null,null,null,"Jason",4.53]
["Jason",40446,null,null,null,null,"Denise",4.68]
["Jason",17021,null,null,null,null,"Gianna",3.9329999999999998]
["Sarah",46580,null,null,null,null,"Jason",4.6500000000000004]
["Mansa",48066,null,null,null,null,"Denise",2.2919999999999998]
["Michelle",27538,null,null,null,null,"Daniel",4.7290000000000001]
["Ewelina",32128,null,null,null,null,"Christina",4.125]
["Craig",39674,null,null,null,null,"Michelle",2.8250000000000002]
["Shari",23130,null,null,null,null,"Mitchell",3.7770000000000001]
["Nakyun",33904,null,null,null,null,"Daniel",2.9870000000000001]
["Nelia",14637,null,null,null,null,"Sykes",4.8419999999999996]
["Nakyun",47428,null,null,null,null,"Nakyun",3.2330000000000001]
["Mi",13838,null,null,null,null,"Mitchell",2.6880000000000002]
["Michael",16881,null,null,null,null,"Michael",3.3069999999999999]
["Carol",14379,null,null,null,null,"Michael",4.9779999999999998]
["Sarah",22124,null,null,null,null,"Richard",2.609]
["Nakyun",49315,null,null,null,null,"Jason",3.327]
["Gianna",11956,null,null,null,null,"Jason",4.2060000000000004]
["Yla-Katrina",44574,null,null,null,null,"Nakyun",3.2320000000000002]
["Michelle",20756,null,null,null,null,"Craig",4.101]
["Sykes",16312,null,null,null,null,"Sarah",3.089]
["Yla-Katrina",34660,null,null,null,null,"Yla-Katrina",2.9580000000000002]
["Shari",8942,null,null,null,null,"Mi",2.2589999999999999]
["Mi",26128,null,null,null,null,"Mitchell",2.4540000000000002]
["Mansa",32722,null,null,null,null,"Ewelina",2.5920000000000001]
["Sarah",46258,null,null,null,null,"Yla-Katrina",4.3899999999999997]
["Nelia",34719,null,null,null,null,"Manavbir",2.218]
["Kaur",45941,null,null,null,null,"Jason",2.3380000000000001]
["Manavbir",26935,null,null,null,null,"Christina",3.278]
["Christina",39176,null,null,null,null,"Mansa",2.1819999999999999]
["Richard",21657,null,null,null,null,"Gianna",2.96]
["Carol",10570,null,null,null,null,"Manavbir",4.3109999999999999]
["Richard",43862,null,null,null,null,"Jason",3.9860000000000002]
["Mansa",9983,null,null,null,null,"Mitchell",2.5939999999999999]
["Richard",23370,null,null,null,null,"Mi",1.5549999999999999]
["Nakyun",43844,null,null,null,null,"Gianna",4.8760000000000003]
["Denise",11125,null,null,null,null,"Gianna",2.2250000000000001]
["Shari",37519,null,null,null,null,"Richard",4.5890000000000004]
["Mi",27063,null,null,null,null,"Nelia",4.0289999999999999]
["Daniel",35383,null,null,null,null,"Janita",3.3919999999999999]
["Nakyun",19372,null,null,null,null,"Daniel",4.8559999999999999]
["Debra",20448,null,null,null,null,"Sykes",4.8250000000000002]
["Shari",49282,null,null,null,null,"Gianna",3.0209999999999999]
["Christina",38596,null,null,null,null,"Mitchell",2.7389999999999999]
["Michael",25703,null,null,null,null,"Nelia",4.2679999999999998]
["Mitchell",31332,null,null,null,null,"Michelle",3.7429999999999999]
["Mansa",30645,null,null,null,null,"Sarah",3.1160000000000001]
["Nelia",36606,null,null,null,null,"Sykes",2.036]
["Daniel",13797,null,null,null,null,"Debra",2.3879999999999999]
["Mitchell",31406,null,null,null,null,"Yla-Katrina",3.4940000000000002]
["Kaur",33411,null,null,null,null,"Nelia",4.8369999999999997]
["Gianna",33552,null,null,null,null,"Michelle",2.1640000000000001]
["Nakyun",20676,null,null,null,null,"Christina",4.6639999999999997]
["Carol",30417,null,null,null,null,"Jason",2.1379999999999999]
["Carol",25995,null,null,null,null,"Sykes",4.4029999999999996]
["Christina",12739,null,null,null,null,"Nelia",4.1459999999999999]
["Michelle",31557,null,null,null,null,"Christina",3.0339999999999998]
["Sarah",10032,null,null,null,null,"Denise",2.1709999999999998]
["Michelle",39470,null,null,null,null,"Gianna",2.363]
["Michael",22539,null,null,null,null,"Yla-Katrina",2.871]
["Debra",25550,null,null,null,null,"Craig",4.9059999999999997]
["Nakyun",29257,null,null,null,null,"Mansa",4.9089999999999998]
["Yla-Katrina",28493,null,null,null,null,"Mitchell",3.113]
["Jason",7648,null,null,null,null,"Sykes",2.3109999999999999]
["Christina",30846,null,null,null,null,"Nelia",2.847]
["Michelle",43550,null,null,null,null,"Debra",4.59]
["Richard",47215,null,null,null,null,"Sykes",2.1890000000000001]
["Yla-Katrina",5496,null,null,null,null,"Nakyun",2.339]
["Michael",29747,null,null,null,null,"Mi",2.1680000000000001]
["Sykes",5338,null,null,null,null,"Debra",2.048]
["Craig",18120,null,null,null,null,"Michael",4.0039999999999996]
["Jason",6392,null,null,null,null,"Daniel",2.9860000000000002]
["Sykes",32660,null,null,null,null,"Ewelina",4.9930000000000003]
["Nakyun",45676,null,null,null,null,"Janita",2.722]
["Kaur",7709,null,null,null,null,"Gianna",3.8439999999999999]
["Mitchell",49195,null,null,null,null,"Manavbir",2.2869999999999999]
["Michael",19299,null,null,null,null,"Yla-Katrina",3.1179999999999999]
["Kaur",20571,null,null,null,null,"Michael",3.4390000000000001]
["Sykes",37946,null,null,null,null,"Denise",2.9540000000000002]
["Ewelina",10131,null,null,null,null,"Denise",2.3639999999999999]
["Carol",13434,null,null,null,null,"Craig",3.6480000000000001]
["Debra",31442,null,null,null,null,"Mansa",3.242]
["Debra",10335,null,null,null,null,"Daniel",2.7810000000000001]
["Manavbir",46598,null,null,null,null,"Manavbir",3.85]
["Denise",91999,null,null,null,null,"Michelle",3.6760000000000002]
["Carol",47327,null,null,null,null,"Ewelina",2.6549999999999998]
["Manavbir",47918,null,null,null,null,"Debra",4.34]
["Ewelina",48401,null,null,null,null,"Nelia",2.3170000000000002]
["Kaur",19238,null,null,null,null,"Daniel",3.2170000000000001]
["Gianna",30945,null,null,null,null,"Craig",4.149]
["Debra",17720,null,null,null,null,"Michael",2.8639999999999999]
["Debra",22159,null,null,null,null,"Kaur",2.4790000000000001]
["Debra",46663,null,null,null,null,"Nelia",4.0460000000000003]
["Mansa",36772,null,null,null,null,"Jason",3.605]
["Mitchell",40136,null,null,null,null,"Sarah",2.694]
["Michael",27150,null,null,null,null,"Michelle",3.653]
["Elain",12909,null,null,null,null,"Ewelina",2.3370000000000002]
["Michelle",29454,null,null,null,null,"Shari",3.4710000000000001]
["Shari",39636,null,null,null,null,"Michelle",2.4900000000000002]
["Kaur",45453,null,null,null,null,"Gianna",2.161]
["Michelle",42179,null,null,null,null,"Mansa",2.7149999999999999]
["Denise",24157,null,null,null,null,"Elain",2.226]
["Michelle",23397,null,null,null,null,"Jason",4.4139999999999997]
["Carol",16521,null,null,null,null,"Debra",3.702]
["Sarah",29024,null,null,null,null,"Richard",3.512]
["Nelia",10116,null,null,null,null,"Shari",4.6319999999999997]
["Debra",35470,null,null,null,null,"Michael",3.625]
["Elain",43904,null,null,null,null,"Richard",3.8940000000000001]
["Manavbir",8514,null,null,null,null,"Elain",4.5910000000000002]
["Ewelina",14068,null,null,null,null,"Elain",4.9859999999999998]
["Sarah",39902,null,null,null,null,"Michelle",4.7889999999999997]
["Gianna",16838,null,null,null,null,"Richard",3.8029999999999999]
["Sykes",44876,null,null,null,null,"Jason",3.2810000000000001]
["Nelia",19756,null,null,null,null,"Gianna",2.6190000000000002]
["Mansa",27188,null,null,null,null,"Elain",2.1629999999999998]
["Craig",8612,null,null,null,null,"Jason",2.4079999999999999]
["Craig",26813,null,null,null,null,"Carol",4.0949999999999998]
["Michelle",48273,null,null,null,null,"Debra",2.59]
["Daniel",43690,null,null,null,null,"Gianna",4.4870000000000001]
["Christina",11032,null,null,null,null,"Mansa",2.1819999999999999]
["Mansa",24823,null,null,null,null,"Nakyun",2.3849999999999998]
["Ewelina",30620,null,null,null,null,"Elain",2.8159999999999998]
["Denise",18760,null,null,null,null,"Sarah",3.6259999999999999]
["Michelle",49728,null,null,null,null,"Michelle",2.1259999999999999]
["Denise",48660,null,null,null,null,"Mi",3.78]
["Mi",9821,null,null,null,null,"Sarah",3.4060000000000001]
["Michael",32203,null,null,null,null,"Debra",3.8479999999999999]
["Nakyun",39081,null,null,null,null,"Nakyun",2.3119999999999998]
["Janita",5131,null,null,null,null,"Craig",3.1389999999999998]
["Sarah",49684,null,null,null,null,"Carol",4.2850000000000001]
["Sarah",46903,null,null,null,null,"Yla-Katrina",3.6469999999999998]
["Sykes",11827,null,null,null,null,"Richard",2.5819999999999999]
["Manavbir",12327,null,null,null,null,"Sarah",2.097]
["Michelle",14572,null,null,null,null,"Denise",3.5]
["Janita",30719,null,null,null,null,"Daniel",4.1159999999999997]
["Sykes",28135,null,null,null,null,"Michael",3.0790000000000002]
["Debra",46055,null,null,null,null,"Gianna",4.2309999999999999]
["Daniel",15210,null,null,null,null,"Nakyun",3.9249999999999998]
["Denise",21207,null,null,null,null,"Richard",2.8180000000000001]
["Mitchell",24863,null,null,null,null,"Janita",4.1440000000000001]
["Kaur",7030,null,null,null,null,"Christina",2.2599999999999998]
["Nelia",41520,null,null,null,null,"Elain",3.2759999999999998]
["Debra",37222,null,null,null,null,"Michelle",3.0680000000000001]
["Sykes",21190,null,null,null,null,"Craig",2.835]
["Gianna",20186,null,null,null,null,"Denise",3.1429999999999998]
["Gianna",11831,null,null,null,null,"Ewelina",2.3490000000000002]
["Sykes",19908,null,null,null,null,"Mitchell",4.5460000000000003]
["Kaur",49350,null,null,null,null,"Michelle",3.3690000000000002]
["Jason",19259,null,null,null,null,"Richard",3.8410000000000002]
["Shari",22190,null,null,null,null,"Michelle",4.2690000000000001]
["Yla-Katrina",35007,null,null,null,null,"Ewelina",3.6469999999999998]
["Shari",41335,null,null,null,null,"Sykes",4.93]
["Michael",48686,null,null,null,null,"Richard",2.403]
["Gianna",42607,null,null,null,null,"Sarah",3.1030000000000002]
["Debra",33204,null,null,null,null,"Nakyun",2.7410000000000001]
["Kaur",22096,null,null,null,null,"Nelia",4.47]
["Nelia",34324,null,null,null,null,"Denise",4.9720000000000004]
["Jason",40664,null,null,null,null,"Michael",2.056]
["Shari",15864,null,null,null,null,"Yla-Katrina",4.7089999999999996]
["Ewelina",10531,null,null,null,null,"Denise",3.5049999999999999]
["Shari",39168,null,null,null,null,"Craig",2.5390000000000001]
["Denise",11776,null,null,null,null,"Jason",2.8969999999999998]
["Michelle",29477,null,null,null,null,"Sarah",2.2410000000000001]
["Ewelina",12062,null,null,null,null,"Jason",4.3769999999999998]
["Gianna",5640,null,null,null,null,"Sykes",2.4279999999999999]
["Jason",22513,null,null,null,null,"Yla-Katrina",3.097]
["Mi",45336,null,null,null,null,"Christina",4.4279999999999999]
["Ewelina",24720,null,null,null,null,"Janita",2.0840000000000001]
["Nelia",30635,null,null,null,null,"Carol",3.585]
["Mi",9661,null,null,null,null,"Nelia",3.4609999999999999]
["Sarah",42839,null,null,null,null,"Kaur",2.593]
["Sarah",25523,null,null,null,null,"Sarah",4.6150000000000002]
["Sykes",28504,null,null,null,null,"Sykes",3.399]
["Christina",6293,null,null,null,null,"Denise",3.173]
["Sarah",31146,null,null,null,null,"Sykes",2.92]
["Christina",30955,null,null,null,null,"Craig",4.0490000000000004]
["Nakyun",21729,null,null,null,null,"Debra",2.8279999999999998]
["Manavbir",49296,null,null,null,null,"Christina",4.6070000000000002]
["Yla-Katrina",26142,null,null,null,null,"Gianna",4.1550000000000002]
["Ewelina",13778,null,null,null,null,"Shari",3.331]
["Richard",9897,null,null,null,null,"Elain",3.4260000000000002]
["Mi",39740,null,null,null,null,"Richard",3.0449999999999999]
["Mitchell",13509,null,null,null,null,"Denise",2.4630000000000001]
["Ewelina",27044,null,null,null,null,"Richard",3.077]
["Craig",74314,null,null,null,null,"Kaur",2.1760000000000002]
["Nelia",28920,null,null,null,null,"Shari",2.145]
["Yla-Katrina",9974,null,null,null,null,"Yla-Katrina",3.5710000000000002]
["Manavbir",31732,null,null,null,null,"Craig",3.6629999999999998]
["Nelia",40076,null,null,null,null,"Mi",2.0710000000000002]
["Denise",16031,null,null,null,null,"Janita",3.8719999999999999]
["Janita",6797,null,null,null,null,"Gianna",3.3119999999999998]
["Manavbir",42023,null,null,null,null,"Nelia",2.6150000000000002]
["Sykes",21100,null,null,null,null,"Ewelina",3.6280000000000001]
["Daniel",28491,null,null,null,null,"Michelle",4.6120000000000001]
["Sykes",15606,null,null,null,null,"Gianna",4.3129999999999997]
["Janita",41515,null,null,null,null,"Craig",4.0629999999999997]
["Sarah",16873,null,null,null,null,"Janita",4.8449999999999998]
["Debra",38794,null,null,null,null,"Elain",2.048]
["Craig",44308,null,null,null,null,"Elain",2.39]
["Christina",49993,null,null,null,null,"Michelle",2.9940000000000002]
["Michael",37615,null,null,null,null,"Gianna",2.8439999999999999]
["Manavbir",7742,null,null,null,null,"Ewelina",3.5880000000000001]
["Sarah",5645,null,null,null,null,"Christina",3.988]
["Yla-Katrina",5685,null,null,null,null,"Carol",4.9800000000000004]
["Gianna",23159,null,null,null,null,"Christina",4.1120000000000001]
["Debra",6991,null,null,null,null,"Jason",2.8119999999999998]
["Nakyun",6740,null,null,null,null,"Richard",3.1840000000000002]
["Elain",40674,null,null,null,null,"Mi",2.1859999999999999]
["Kaur",28314,null,null,null,null,"Manavbir",3.931]
["Sarah",46574,null,null,null,null,"Richard",2.004]
["Debra",31027,null,null,null,null,"Daniel",4.4820000000000002]
["Yla-Katrina",7656,null,null,null,null,"Shari",4.1449999999999996]
["Jason",46970,null,null,null,null,"Denise",2.3330000000000002]
["Michelle",46003,null,null,null,null,"Christina",2.4510000000000001]
["Sykes",28458,null,null,null,null,"Jason",3.9740000000000002]
["Shari",19854,null,null,null,null,"Richard",4.6840000000000002]
["Shari",32344,null,null,null,null,"Ewelina",4.6219999999999999]
["Shari",5994,null,null,null,null,"Debra",4.3010000000000002]
["Gianna",27156,null,null,null,null,"Sarah",4.7610000000000001]
["Nakyun",14281,null,null,null,null,"Richard",2.726]
["Jason",14972,null,null,null,null,"Richard",3.9009999999999998]
["Mansa",40097,null,null,null,null,"Debra",4.2910000000000004]
["Manavbir",28801,null,null,null,null,"Debra",3.8889999999999998]
["Richard",15990,null,null,null,null,"Mansa",3.706]
["Shari",18752,null,null,null,null,"Christina",2.19]
["Richard",16506,null,null,null,null,"Manavbir",4.1870000000000003]
["Gianna",37606,null,null,null,null,"Mitchell",4.0759999999999996]
["Michelle",7218,null,null,null,null,"Janita",2.5409999999999999]
["Mitchell",31935,null,null,null,null,"Mansa",4.66]
["Gianna",5315,null,null,null,null,"Christina",4.774]
["Manavbir",33215,null,null,null,null,"Nelia",3.794]
["Christina",28745,null,null,null,null,"Kaur",3.839]
["Nelia",31832,null,null,null,null,"Shari",4.5999999999999996]
["Nelia",34300,null,null,null,null,"Yla-Katrina",4.13]
["Denise",5225,null,null,null,null,"Denise",4.8040000000000003]
["Christina",15047,null,null,null,null,"Debra",3.9329999999999998]
["Janita",20898,null,null,null,null,"Nelia",3.42]
["Janita",19952,null,null,null,null,"Michelle",2.5539999999999998]
["Nelia",8172,null,null,null,null,"Richard",2.8769999999999998]
["Jason",48908,null,null,null,null,"Mi",2.2519999999999998]
["Craig",10684,null,null,null,null,"Elain",2.2839999999999998]
["Nelia",41622,null,null,null,null,"Elain",4.7910000000000004]
["Daniel",49252,null,null,null,null,"Shari",3.7010000000000001]
["Manavbir",34889,null,null,null,null,"Craig",3.5190000000000001]
["Manavbir",9492,null,null,null,null,"Yla-Katrina",4.8780000000000001]
["Denise",33194,null,null,null,null,"Mitchell",2.657]
["Mansa",29241,null,null,null,null,"Christina",2.302]
["Mitchell",21907,null,null,null,null,"Elain",4.3579999999999997]
["Ewelina",16067,null,null,null,null,"Michael",2.9790000000000001]
["Craig",6531,null,null,null,null,"Nelia",2.0630000000000002]
["Elain",25439,null,null,null,null,"Denise",3.3290000000000002]
["Christina",24527,null,null,null,null,"Sarah",2.2410000000000001]
["Ewelina",7180,null,null,null,null,"Shari",3.1]
["Nelia",22005,null,null,null,null,"Mitchell",2.0910000000000002]
["Gianna",11744,null,null,null,null,"Jason",2.16]
["Denise",14449,null,null,null,null,"Michelle",3.5870000000000002]
["Craig",10565,null,null,null,null,"Yla-Katrina",3.8090000000000002]
["Sarah",13824,null,null,null,null,"Debra",3.3359999999999999]
["Mitchell",24156,null,null,null,null,"Nakyun",4.4349999999999996]
["Elain",18126,null,null,null,null,"Craig",2.1320000000000001]
["Mi",7232,null,null,null,null,"Michael",2.3820000000000001]
["Denise",46140,null,null,null,null,"Nelia",2.2429999999999999]
["Ewelina",23787,null,null,null,null,"Gianna",2.4]
["Ewelina",43910,null,null,null,null,"Debra",3.2050000000000001]
["Richard",38292,null,null,null,null,"Mitchell",2.2749999999999999]
["Gianna",33896,null,null,null,null,"Kaur",2.8210000000000002]
["Elain",22753,null,null,null,null,"Sykes",4.149]
["Nakyun",37720,null,null,null,null,"Michael",4.4359999999999999]
["Debra",9726,null,null,null,null,"Carol",2.044]
["Sykes",5863,null,null,null,null,"Kaur",3.05]
["Yla-Katrina",16491,null,null,null,null,"Mitchell",4.3150000000000004]
["Christina",20680,null,null,null,null,"Craig",3.7410000000000001]
["Manavbir",48427,null,null,null,null,"Michael",4.9169999999999998]
["Nakyun",33846,null,null,null,null,"Michelle",2.3079999999999998]
["Christina",19747,null,null,null,null,"Christina",4.3949999999999996]
["Michael",27760,null,null,null,null,"Mitchell",4.2050000000000001]
["Janita",24121,null,null,null,null,"Gianna",4.9950000000000001]
["Yla-Katrina",20680,null,null,null,null,"Michael",3.4089999999999998]
["Carol",6428,null,null,null,null,"Sykes",4.7329999999999997]
["Mansa",31928,null,null,null,null,"Craig",3.4129999999999998]
["Mansa",21156,null,null,null,null,"Sarah",3.2349999999999999]
["Shari",33275,null,null,null,null,"Gianna",3.653]
["Kaur",49194,null,null,null,null,"Janita",3.6909999999999998]
["Daniel",44016,null,null,null,null,"Mi",2.468]
["Sarah",80843,null,null,null,null,"Nakyun",2.161]
["Elain",14694,null,null,null,null,"Manavbir",2.093]
["Elain",39648,null,null,null,null,"Sarah",2.8530000000000002]
["Ewelina",26518,null,null,null,null,"Manavbir",3.9980000000000002]
["Sarah",34995,null,null,null,null,"Yla-Katrina",4.2869999999999999]
["Michael",7624,null,null,null,null,"Michael",4.3170000000000002]
["Kaur",12384,null,null,null,null,"Debra",3.9660000000000002]
["Gianna",32828,null,null,null,null,"Carol",4.8449999999999998]
["Manavbir",39964,null,null,null,null,"Manavbir",4.8639999999999999]
["Janita",16262,null,null,null,null,"Denise",4.3159999999999998]
["Sarah",20171,null,null,null,null,"Debra",2.673]
["Sykes",16267,null,null,null,null,"Kaur",3.4910000000000001]
["Manavbir",6574,null,null,null,null,"Kaur",2.8039999999999998]
["Shari",22443,null,null,null,null,"Nakyun",4.2389999999999999]
["Sykes",13408,null,null,null,null,"Mansa",2.1309999999999998]
["Denise",14887,null,null,null,null,"Carol",4.9690000000000003]
["Denise",46397,null,null,null,null,"Mi",4.3979999999999997]
["Gianna",27849,null,null,null,null,"Jason",4.6100000000000003]
["Jason",42605,null,null,null,null,"Denise",4.4619999999999997]
["Mansa",6518,null,null,null,null,"Yla-Katrina",2.5750000000000002]
["Sykes",39339,null,null,null,null,"Sarah",4.7779999999999996]
["Michael",48498,null,null,null,null,"Yla-Katrina",4.7220000000000004]
["Carol",27777,null,null,null,null,"Manavbir",4.5]
["Gianna",20343,null,null,null,null,"Christina",2.6360000000000001]
["Yla-Katrina",46323,null,null,null,null,"Nelia",3.7149999999999999]
["Nelia",28573,null,null,null,null,"Kaur",4.452]
["Jason",46165,null,null,null,null,"Michelle",3.89]
["Mi",5956,null,null,null,null,"Ewelina",2.21]
["Kaur",14167,null,null,null,null,"Michael",4.9329999999999998]
["Manavbir",44274,null,null,null,null,"Sykes",3.9550000000000001]
["Nakyun",12703,null,null,null,null,"Michael",2.9329999999999998]
["Janita",19020,null,null,null,null,"Mi",3.6219999999999999]
["Sykes",35250,null,null,null,null,"Nakyun",3.4689999999999999]
["Craig",37653,null,null,null,null,"Mi",4.28]
["Michael",22742,null,null,null,null,"Michelle",2.351]
["Kaur",9351,null,null,null,null,"Nelia",4.9379999999999997]
["Jason",5728,null,null,null,null,"Kaur",2.9929999999999999]
["Sarah",30954,null,null,null,null,"Manavbir",4.2679999999999998]
["Yla-Katrina",25478,null,null,null,null,"Mi",3.6960000000000002]
["Nelia",32928,null,null,null,null,"Denise",3.399]
["Michelle",44508,null,null,null,null,"Christina",4.5759999999999996]
["Sykes",7372,null,null,null,null,"Richard",2.4540000000000002]
["Mansa",44681,null,null,null,null,"Christina",4.84]
["Sarah",14033,null,null,null,null,"Ewelina",4.3630000000000004]
["Mitchell",37165,null,null,null,null,"Debra",3.5259999999999998]
["Craig",33055,null,null,null,null,"Denise",2.1030000000000002]
["Mitchell",28993,null,null,null,null,"Debra",4.9400000000000004]
["Mitchell",38464,null,null,null,null,"Nelia",3.6749999999999998]
["Gianna",19196,null,null,null,null,"Richard",4.9980000000000002]
["Kaur",5837,null,null,null,null,"Mansa",2.593]
["Shari",9719,null,null,null,null,"Debra",4.0490000000000004]
["Kaur",26689,null,null,null,null,"Shari",4.9820000000000002]
["Carol",45008,null,null,null,null,"Denise",4.2939999999999996]
["Mitchell",22865,null,null,null,null,"Nakyun",2.0529999999999999]
["Kaur",6815,null,null,null,null,"Mansa",4.7169999999999996]
["Nelia",30738,null,null,null,null,"Shari",4.3109999999999999]
["Mi",19591,null,null,null,null,"Ewelina",4.444]
["Richard",37379,null,null,null,null,"Kaur",2.7290000000000001]
["Manavbir",12519,null,null,null,null,"Craig",3.113]
["Shari",31556,null,null,null,null,"Craig",4.617]
["Mi",24516,null,null,null,null,"Sarah",2.0209999999999999]
["Shari",14710,null,null,null,null,"Mansa",4.984]
["Mi",9576,null,null,null,null,"Manavbir",3.4340000000000002]
["Mansa",35097,null,null,null,null,"Yla-Katrina",4.3390000000000004]
["Janita",19328,null,null,null,null,"Mi",2.1819999999999999]
["Nakyun",25983,null,null,null,null,"Denise",2.7440000000000002]
["Mansa",20096,null,null,null,null,"Sykes",4.7050000000000001]
["Daniel",14409,null,null,null,null,"Mansa",3.4169999999999998]
["Gianna",31115,null,null,null,null,"Michelle",3.4319999999999999]
["Shari",22804,null,null,null,null,"Manavbir",3.4369999999999998]
["Sykes",39457,null,null,null,null,"Michelle",4.367]
["Michelle",24621,null,null,null,null,"Jason",2.7480000000000002]
["Mi",7003,null,null,null,null,"Richard",2.653]
["Ewelina",22663,null,null,null,null,"Daniel",4.827]
["Sykes",44908,null,null,null,null,"Denise",3.84]
["Debra",26013,null,null,null,null,"Janita",2.1720000000000002]
["Yla-Katrina",22851,null,null,null,null,"Richard",2.105]
["Michael",9067,null,null,null,null,"Michelle",3.1280000000000001]
["Nelia",13246,null,null,null,null,"Elain",3.2679999999999998]
["Manavbir",43687,null,null,null,null,"Michael",3.2719999999999998]
["Nelia",26513,null,null,null,null,"Sykes",3.7589999999999999]
["Daniel",15716,null,null,null,null,"Carol",3.4409999999999998]
["Mitchell",23915,null,null,null,null,"Shari",2.9969999999999999]
["Janita",41265,null,null,null,null,"Nelia",2.7490000000000001]
["Gianna",20900,null,null,null,null,"Daniel",4.1139999999999999]
["Richard",28091,null,null,null,null,"Elain",4.6609999999999996]
["Yla-Katrina",45219,null,null,null,null,"Christina",2.6920000000000002]
["Richard",47640,null,null,null,null,"Nakyun",3.669]
["Daniel",43014,null,null,null,null,"Manavbir",2.3860000000000001]
["Denise",34433,null,null,null,null,"Mitchell",4.7709999999999999]
["Nakyun",30018,null,null,null,null,"Mitchell",3.645]
["Mitchell",32586,null,null,null,null,"Richard",3.0950000000000002]
["Richard",16165,null,null,null,null,"Ewelina",4.5860000000000003]
["Debra",5217,null,null,null,null,"Christina",3.8820000000000001]
["Shari",34784,null,null,null,null,"Ewelina",2.08]
["Debra",41967,null,null,null,null,"Craig",3.7440000000000002]
["Janita",37874,null,null,null,null,"Elain",4.8920000000000003]
["Daniel",13491,null,null,null,null,"Mansa",3.141]
["Michael",49996,null,null,null,null,"Gianna",2.8340000000000001]
["Gianna",16673,null,null,null,null,"Yla-Katrina",4.8979999999999997]
["Michelle",69329,null,null,null,null,"Sarah",4.1660000000000004]
["Mansa",13431,null,null,null,null,"Jason",2.1760000000000002]
["Mitchell",32621,null,null,null,null,"Sykes",3.2330000000000001]
["Craig",7630,null,null,null,null,"Mi",2.0739999999999998]
["Sarah",30935,null,null,null,null,"Debra",2.73]
["Jason",47240,null,null,null,null,"Mi",3.649]
["Sarah",36560,null,null,null,null,"Elain",4.782]
["Elain",29430,null,null,null,null,"Yla-Katrina",2.391]
["Manavbir",42684,null,null,null,null,"Denise",2.504]
["Elain",34889,null,null,null,null,"Mansa",3.4260000000000002]
["Daniel",38484,null,null,null,null,"Michael",4.1369999999999996]
["Daniel",33470,null,null,null,null,"Nakyun",2.1760000000000002]
["Michelle",12937,null,null,null,null,"Richard",4.6970000000000001]
["Mitchell",46404,null,null,null,null,"Mi",4.7]
["Nakyun",35356,null,null,null,null,"Ewelina",3.2450000000000001]
["Jason",45992,null,null,null,null,"Jason",2.4420000000000002]
["Mi",23270,null,null,null,null,"Mi",3.7789999999999999]
["Mi",7449,null,null,null,null,"Nelia",3.8719999999999999]
["Craig",39531,null,null,null,null,"Christina",3.4119999999999999]
["Ewelina",38810,null,null,null,null,"Yla-Katrina",4.7149999999999999]
["Shari",31145,null,null,null,null,"Mitchell",4.867]
["Manavbir",21299,null,null,null,null,"Mitchell",2.6539999999999999]
["Mitchell",29699,null,null,null,null,"Nelia",2.2589999999999999]
["Jason",49837,null,null,null,null,"Jason",2.343]
["Elain",22945,null,null,null,null,"Yla-Katrina",2.8]
["Sarah",21695,null,null,null,null,"Sarah",1.381]
["Carol",44441,null,null,null,null,"Richard",3.4910000000000001]
["Mi",20554,null,null,null,null,"Michelle",4.4349999999999996]
["Craig",40164,null,null,null,null,"Jason",3.3410000000000002]
["Debra",11115,null,null,null,null,"Jason",3.9710000000000001]
["Michelle",17782,null,null,null,null,"Gianna",4.7430000000000003]
["Yla-Katrina",40051,null,null,null,null,"Nakyun",4.7]
["Nelia",38192,null,null,null,null,"Shari",2.5960000000000001]
["Debra",9571,null,null,null,null,"Sarah",3.4660000000000002]
["Michael",33483,null,null,null,null,"Christina",3.786]
["Yla-Katrina",26926,null,null,null,null,"Daniel",4.49]
["Nakyun",31142,null,null,null,null,"Richard",4.4749999999999996]
["Richard",10784,null,null,null,null,"Debra",4.6660000000000004]
["Daniel",48452,null,null,null,null,"Michael",4.1849999999999996]
["Daniel",35710,null,null,null,null,"Ewelina",2.2759999999999998]
["Ewelina",14256,null,null,null,null,"Mitchell",3.22]
["Kaur",24050,null,null,null,null,"Nakyun",2.706]
["Yla-Katrina",32077,null,null,null,null,"Mi",2.5129999999999999]
["Yla-Katrina",42696,null,null,null,null,"Sarah",3.9889999999999999]
["Nelia",49256,null,null,null,null,"Denise",2.0880000000000001]
["Mitchell",16116,null,null,null,null,"Jason",4.84]
["Richard",18765,null,null,null,null,"Christina",4.2530000000000001]
["Gianna",37202,null,null,null,null,"Sarah",4.0229999999999997]
["Daniel",23840,null,null,null,null,"Mitchell",4.5449999999999999]
["Craig",37606,null,null,null,null,"Denise",2.605]
["Yla-Katrina",9972,null,null,null,null,"Denise",4.5940000000000003]
["Michael",20391,null,null,null,null,"Ewelina",4.0209999999999999]
["Debra",42338,null,null,null,null,"Yla-Katrina",4.3979999999999997]
["Mansa",48891,null,null,null,null,"Elain",2.8460000000000001]
["Mansa",37080,null,null,null,null,"Daniel",4.4619999999999997]
["Christina",12590,null,null,null,null,"Richard",3.1850000000000001]
["Christina",24283,null,null,null,null,"Michelle",3.93]
["Richard",7022,null,null,null,null,"Debra",4.3730000000000002]
["Richard",18164,null,null,null,null,"Denise",2.7930000000000001]
["Ewelina",48405,null,null,null,null,"Denise",4.0220000000000002]
["Mansa",19688,null,null,null,null,"Shari",4.5430000000000001]
["Debra",31466,null,null,null,null,"Daniel",4.3479999999999999]
["Mi",46330,null,null,null,null,"Gianna",2.161]
["Mi",13157,null,null,null,null,"Mi",3.25]
["Jason",40343,null,null,null,null,"Debra",4.3849999999999998]
["Mansa",18595,null,null,null,null,"Ewelina",2.3050000000000002]
["Craig",49116,null,null,null,null,"Jason",4.2469999999999999]
["Kaur",6619,null,null,null,null,"Yla-Katrina",4.9119999999999999]
["Craig",44764,null,null,null,null,"Nakyun",3.972]
["Jason",33033,null,null,null,null,"Mansa",3.1360000000000001]
["Shari",26782,null,null,null,null,"Debra",3.6779999999999999]
["Carol",12470,null,null,null,null,"Mi",4.3090000000000002]
["Nakyun",46584,null,null,null,null,"Debra",2.3090000000000002]
["Manavbir",44827,null,null,null,null,"Yla-Katrina",2.8380000000000001]
["Daniel",46347,null,null,null,null,"Mansa",2.8759999999999999]
["Debra",27946,null,null,null,null,"Sykes",3.1280000000000001]
["Daniel",42652,null,null,null,null,"Michelle",2.2309999999999999]
["Debra",36063,null,null,null,null,"Shari",2.4460000000000002]
["Michael",17278,null,null,null,null,"Jason",2.6509999999999998]
["Michael",38101,null,null,null,null,"Ewelina",4.0990000000000002]
["Mansa",16020,null,null,null,null,"Mi",3.6320000000000001]
["Gianna",18954,null,null,null,null,"Gianna",4.8380000000000001]
["Nakyun",28470,null,null,null,null,"Ewelina",4.3410000000000002]
["Yla-Katrina",37361,null,null,null,null,"Sarah",3.8079999999999998]
["Carol",21445,null,null,null,null,"Mansa",4.1769999999999996]
["Debra",24125,null,null,null,null,"Elain",4.0679999999999996]
["Shari",47917,null,null,null,null,"Shari",3.6920000000000002]
["Richard",7870,null,null,null,null,"Denise",3.5230000000000001]
["Mi",42284,null,null,null,null,"Denise",3.399]
["Mansa",26379,null,null,null,null,"Janita",3.855]
["Elain",30481,null,null,null,null,"Sykes",3.6160000000000001]

{"sheet":"Sort List","index":13,"n_rows":25,"n_cols":18,"rows_kept":25,"cut":false,"hidden":false,"merged":[]}
["Calls Made For Month","Name",null,"Sort List","Name",null,null,null,null,null,null,null,null,null,null,null,"Duplicates - array formula"]
[{"$f":"RANDBETWEEN(50000,390000)/100","v":2366.1999999999998},"Elain",null,null,null,null,null,null,null,null,null,null,null,"#?",10,null,"Names",{"$f":"\"Top \"&O2","v":"Top 10"}]
[3869.07,"Carol",null,null,null,null,null,null,null,null,null,null,null,null,null,null,{"$f":"INDEX($B$2:$B$25,SMALL(IF($A$2:$A$25=R3,ROW($B$2:$B$25)-ROW($B$2)+1),COUNTIF(R$3:R3,R3)))","v":"Carol"},{"$f":"LARGE($A$2:$A$25,ROWS(R$3:R3))","v":3869.07}]
[520.54999999999995,"Gianna",null,null,null,null,null,null,null,null,null,null,null,null,null,null,{"$f":"INDEX($B$2:$B$25,SMALL(IF($A$2:$A$25=R4,ROW($B$2:$B$25)-ROW($B$2)+1),COUNTIF(R$3:R4,R4)))","v":"Sykes"},{"$f":"LARGE($A$2:$A$25,ROWS(R$3:R4))","v":3841.03}]
[1346.13,"Jason",null,null,null,null,null,null,null,null,null,null,null,null,null,null,{"$f":"INDEX($B$2:$B$25,SMALL(IF($A$2:$A$25=R5,ROW($B$2:$B$25)-ROW($B$2)+1),COUNTIF(R$3:R5,R5)))","v":"Michael"},{"$f":"LARGE($A$2:$A$25,ROWS(R$3:R5))","v":3393.5}]
[881.24,"Michelle",null,null,null,null,null,null,null,null,null,null,null,null,null,null,{"$f":"INDEX($B$2:$B$25,SMALL(IF($A$2:$A$25=R6,ROW($B$2:$B$25)-ROW($B$2)+1),COUNTIF(R$3:R6,R6)))","v":"Craig"},{"$f":"LARGE($A$2:$A$25,ROWS(R$3:R6))","v":3302.71}]
[2600.19,"Shari",null,null,null,null,null,null,null,null,null,null,null,null,null,null,{"$f":"INDEX($B$2:$B$25,SMALL(IF($A$2:$A$25=R7,ROW($B$2:$B$25)-ROW($B$2)+1),COUNTIF(R$3:R7,R7)))","v":"Christina"},{"$f":"LARGE($A$2:$A$25,ROWS(R$3:R7))","v":3008.08}]
[1584.87,"Denise",null,null,null,null,null,null,null,null,null,null,null,null,null,null,{"$f":"INDEX($B$2:$B$25,SMALL(IF($A$2:$A$25=R8,ROW($B$2:$B$25)-ROW($B$2)+1),COUNTIF(R$3:R8,R8)))","v":"Nakyun"},{"$f":"LARGE($A$2:$A$25,ROWS(R$3:R8))","v":2967.37}]
[558.91999999999996,"Daniel",null,null,null,null,null,null,null,null,null,null,null,null,null,null,{"$f":"INDEX($B$2:$B$25,SMALL(IF($A$2:$A$25=R9,ROW($B$2:$B$25)-ROW($B$2)+1),COUNTIF(R$3:R9,R9)))","v":"Kaur"},{"$f":"LARGE($A$2:$A$25,ROWS(R$3:R9))","v":2686.98}]
[2391.37,"Sarah",null,null,null,null,null,null,null,null,null,null,null,null,null,null,{"$f":"INDEX($B$2:$B$25,SMALL(IF($A$2:$A$25=R10,ROW($B$2:$B$25)-ROW($B$2)+1),COUNTIF(R$3:R10,R10)))","v":"Janita"},{"$f":"LARGE($A$2:$A$25,ROWS(R$3:R10))","v":2638.88}]
[3008.08,"Christina",null,null,null,null,null,null,null,null,null,null,null,null,null,null,{"$f":"INDEX($B$2:$B$25,SMALL(IF($A$2:$A$25=R11,ROW($B$2:$B$25)-ROW($B$2)+1),COUNTIF(R$3:R11,R11)))","v":"Shari"},{"$f":"LARGE($A$2:$A$25,ROWS(R$3:R11))","v":2600.19}]
[2638.88,"Janita",null,null,null,null,null,null,null,null,null,null,null,null,null,null,{"$f":"INDEX($B$2:$B$25,SMALL(IF($A$2:$A$25=R12,ROW($B$2:$B$25)-ROW($B$2)+1),COUNTIF(R$3:R12,R12)))","v":"Sarah"},{"$f":"LARGE($A$2:$A$25,ROWS(R$3:R12))","v":2391.37}]
[1832.8,"Debra"]
[1269.82,"Nelia"]
[2022.31,"Manavbir"]
[1808.52,"Richard"]
[1660.88,"Yla-Katrina"]
[2686.98,"Kaur"]
[2367.9899999999998,"Mansa"]
[2245.56,"Mitchell"]
[3302.71,"Craig"]
[3841.03,"Sykes"]
[1598.8,"Ewelina"]
[3393.5,"Michael"]
[2967.37,"Nakyun"]

{"sheet":"Sort List (an)","index":14,"n_rows":25,"n_cols":18,"rows_kept":25,"cut":false,"hidden":true,"merged":[]}
["Calls Made For Month","Name",null,"Sort List","Name",null,null,null,null,null,null,null,null,null,null,null,"Duplicates - array formula"]
[{"$f":"RANDBETWEEN(50000,390000)/100","v":3678.07},"Elain",null,{"$f":"LARGE($A$2:$A$25,ROWS(D$2:D2))","v":3872.52},{"$f":"VLOOKUP(D2,$A$2:$B$25,2,0)","v":"Denise"},null,null,null,null,null,null,null,null,"#?",10,null,"Names",{"$f":"\"Top \"&O2","v":"Top 10"}]
[3733.78,"Carol",null,{"$f":"LARGE($A$2:$A$25,ROWS(D$2:D3))","v":3733.78},{"$f":"VLOOKUP(D3,$A$2:$B$25,2,0)","v":"Carol"},null,null,null,null,null,null,null,null,null,null,null,{"$f":"INDEX($B$2:$B$25,SMALL(IF($A$2:$A$25=R3,ROW($B$2:$B$25)-ROW($B$2)+1),COUNTIF(R$3:R3,R3)))","v":"Denise"},{"$f":"LARGE($A$2:$A$25,ROWS(R$3:R3))","v":3872.52}]
[2948.84,"Gianna",null,{"$f":"LARGE($A$2:$A$25,ROWS(D$2:D4))","v":3678.07},"Elain",null,null,null,null,null,null,null,null,null,null,null,{"$f":"INDEX($B$2:$B$25,SMALL(IF($A$2:$A$25=R4,ROW($B$2:$B$25)-ROW($B$2)+1),COUNTIF(R$3:R4,R4)))","v":"Carol"},{"$f":"LARGE($A$2:$A$25,ROWS(R$3:R4))","v":3733.78}]
[1265.75,"Jason",null,{"$f":"LARGE($A$2:$A$25,ROWS(D$2:D5))","v":3603.95},"Mansa",null,null,null,null,null,null,null,null,null,null,null,{"$f":"INDEX($B$2:$B$25,SMALL(IF($A$2:$A$25=R5,ROW($B$2:$B$25)-ROW($B$2)+1),COUNTIF(R$3:R5,R5)))","v":"Elain"},{"$f":"LARGE($A$2:$A$25,ROWS(R$3:R5))","v":3678.07}]
[3492.74,"Michelle",null,{"$f":"LARGE($A$2:$A$25,ROWS(D$2:D6))","v":3577.03},"Sarah",null,null,null,null,null,null,null,null,null,null,null,{"$f":"INDEX($B$2:$B$25,SMALL(IF($A$2:$A$25=R6,ROW($B$2:$B$25)-ROW($B$2)+1),COUNTIF(R$3:R6,R6)))","v":"Mansa"},{"$f":"LARGE($A$2:$A$25,ROWS(R$3:R6))","v":3603.95}]
[3444.28,"Shari",null,{"$f":"LARGE($A$2:$A$25,ROWS(D$2:D7))","v":3492.74},"Michelle",null,null,null,null,null,null,null,null,null,null,null,{"$f":"INDEX($B$2:$B$25,SMALL(IF($A$2:$A$25=R7,ROW($B$2:$B$25)-ROW($B$2)+1),COUNTIF(R$3:R7,R7)))","v":"Sarah"},{"$f":"LARGE($A$2:$A$25,ROWS(R$3:R7))","v":3577.03}]
[3872.52,"Denise",null,{"$f":"LARGE($A$2:$A$25,ROWS(D$2:D8))","v":3444.28},"Shari",null,null,null,null,null,null,null,null,null,null,null,{"$f":"INDEX($B$2:$B$25,SMALL(IF($A$2:$A$25=R8,ROW($B$2:$B$25)-ROW($B$2)+1),COUNTIF(R$3:R8,R8)))","v":"Michelle"},{"$f":"LARGE($A$2:$A$25,ROWS(R$3:R8))","v":3492.74}]
[686.93,"Daniel",null,{"$f":"LARGE($A$2:$A$25,ROWS(D$2:D9))","v":3163.42},"Yla-Katrina",null,null,null,null,null,null,null,null,null,null,null,{"$f":"INDEX($B$2:$B$25,SMALL(IF($A$2:$A$25=R9,ROW($B$2:$B$25)-ROW($B$2)+1),COUNTIF(R$3:R9,R9)))","v":"Shari"},{"$f":"LARGE($A$2:$A$25,ROWS(R$3:R9))","v":3444.28}]
[3577.03,"Sarah",null,{"$f":"LARGE($A$2:$A$25,ROWS(D$2:D10))","v":3038.22},"Richard",null,null,null,null,null,null,null,null,null,null,null,{"$f":"INDEX($B$2:$B$25,SMALL(IF($A$2:$A$25=R10,ROW($B$2:$B$25)-ROW($B$2)+1),COUNTIF(R$3:R10,R10)))","v":"Yla-Katrina"},{"$f":"LARGE($A$2:$A$25,ROWS(R$3:R10))","v":3163.42}]
[737.19,"Christina",null,{"$f":"LARGE($A$2:$A$25,ROWS(D$2:D11))","v":2948.84},"Gianna",null,null,null,null,null,null,null,null,null,null,null,{"$f":"INDEX($B$2:$B$25,SMALL(IF($A$2:$A$25=R11,ROW($B$2:$B$25)-ROW($B$2)+1),COUNTIF(R$3:R11,R11)))","v":"Richard"},{"$f":"LARGE($A$2:$A$25,ROWS(R$3:R11))","v":3038.22}]
[1254.78,"Janita",null,{"$f":"LARGE($A$2:$A$25,ROWS(D$2:D12))","v":2783.66},"Kaur",null,null,null,null,null,null,null,null,null,null,null,{"$f":"INDEX($B$2:$B$25,SMALL(IF($A$2:$A$25=R12,ROW($B$2:$B$25)-ROW($B$2)+1),COUNTIF(R$3:R12,R12)))","v":"Gianna"},{"$f":"LARGE($A$2:$A$25,ROWS(R$3:R12))","v":2948.84}]
[2194,"Debra",null,{"$f":"LARGE($A$2:$A$25,ROWS(D$2:D13))","v":2677.53},"Nakyun"]
[1464.54,"Nelia",null,{"$f":"LARGE($A$2:$A$25,ROWS(D$2:D14))","v":2359.1},"Ewelina"]
[1378.28,"Manavbir",null,{"$f":"LARGE($A$2:$A$25,ROWS(D$2:D15))","v":2194},"Debra"]
[3038.22,"Richard",null,{"$f":"LARGE($A$2:$A$25,ROWS(D$2:D16))","v":2107.02},"Mitchell"]
[3163.42,"Yla-Katrina",null,{"$f":"LARGE($A$2:$A$25,ROWS(D$2:D17))","v":1676.98},"Michael"]
[2783.66,"Kaur",null,{"$f":"LARGE($A$2:$A$25,ROWS(D$2:D18))","v":1464.54},"Nelia"]
[3603.95,"Mansa",null,{"$f":"LARGE($A$2:$A$25,ROWS(D$2:D19))","v":1378.28},"Manavbir"]
[2107.02,"Mitchell",null,{"$f":"LARGE($A$2:$A$25,ROWS(D$2:D20))","v":1353.19},"Sykes"]
[991.79,"Craig",null,{"$f":"LARGE($A$2:$A$25,ROWS(D$2:D21))","v":1265.75},"Jason"]
[1353.19,"Sykes",null,{"$f":"LARGE($A$2:$A$25,ROWS(D$2:D22))","v":1254.78},"Janita"]
[2359.1,"Ewelina",null,{"$f":"LARGE($A$2:$A$25,ROWS(D$2:D23))","v":991.79},"Craig"]
[1676.98,"Michael",null,{"$f":"LARGE($A$2:$A$25,ROWS(D$2:D24))","v":737.19},"Christina"]
[2677.53,"Nakyun",null,{"$f":"LARGE($A$2:$A$25,ROWS(D$2:D25))","v":686.93},"Daniel"]

{"sheet":"Rank","index":15,"n_rows":25,"n_cols":9,"rows_kept":25,"cut":false,"hidden":false,"merged":[]}
["Name","CPA Score","Rank",null,null,null,"Name","Time to Complete","Rank"]
["Elain",88,null,null,null,null,"Elain",1.06]
["Carol",83,null,null,null,null,"Carol",1.04]
["Gianna",83,null,null,null,null,"Gianna",1.02]
["Jason",77,null,null,null,null,"Jason",1.0900000000000001]
["Michelle",97,null,null,null,null,"Michelle",1]
["Shari",99,null,null,null,null,"Shari",1.1499999999999999]
["Denise",98,null,null,null,null,"Denise",1.02]
["Daniel",92,null,null,null,null,"Daniel",1.1399999999999999]
["Sarah",91,null,null,null,null,"Sarah",1.1499999999999999]
["Christina",87,null,null,null,null,"Christina",1.1299999999999999]
["Janita",89,null,null,null,null,"Janita",1.08]
["Debra",99,null,null,null,null,"Debra",1.03]
["Nelia",97,null,null,null,null,"Nelia",1.07]
["Manavbir",85,null,null,null,null,"Manavbir",1.08]
["Richard",87,null,null,null,null,"Richard",1.03]
["Yla-Katrina",97,null,null,null,null,"Yla-Katrina",1.03]
["Kaur",98,null,null,null,null,"Kaur",1.18]
["Mansa",92,null,null,null,null,"Mansa",1.05]
["Mitchell",96,null,null,null,null,"Mitchell",1.07]
["Craig",82,null,null,null,null,"Craig",1.1399999999999999]
["Sykes",83,null,null,null,null,"Sykes",1.04]
["Ewelina",78,null,null,null,null,"Ewelina",1.1000000000000001]
["Michael",86,null,null,null,null,"Michael",1.03]
["Nakyun",82,null,null,null,null,"Nakyun",1.03]

{"sheet":"Rank (an)","index":16,"n_rows":25,"n_cols":9,"rows_kept":25,"cut":false,"hidden":true,"merged":[]}
["Name","CPA Score","Rank",null,null,null,"Name","Time to Complete","Rank"]
["Elain",88,{"$f":"RANK(B2,$B$2:$B$25,0)","v":13},null,null,null,"Elain",1.06,{"$f":"RANK(H2,$H$2:$H$25,1)","v":12}]
["Carol",83,{"$f":"RANK(B3,$B$2:$B$25,0)","v":18},null,null,null,"Carol",1.04,9]
["Gianna",83,18,null,null,null,"Gianna",1.02,2]
["Jason",77,24,null,null,null,"Jason",1.0900000000000001,17]
["Michelle",97,5,null,null,null,"Michelle",1,1]
["Shari",99,1,null,null,null,"Shari",1.1499999999999999,22]
["Denise",98,3,null,null,null,"Denise",1.02,2]
["Daniel",92,9,null,null,null,"Daniel",1.1399999999999999,20]
["Sarah",91,11,null,null,null,"Sarah",1.1499999999999999,22]
["Christina",87,14,null,null,null,"Christina",1.1299999999999999,19]
["Janita",89,12,null,null,null,"Janita",1.08,15]
["Debra",99,1,null,null,null,"Debra",1.03,4]
["Nelia",97,5,null,null,null,"Nelia",1.07,13]
["Manavbir",85,17,null,null,null,"Manavbir",1.08,15]
["Richard",87,14,null,null,null,"Richard",1.03,4]
["Yla-Katrina",97,5,null,null,null,"Yla-Katrina",1.03,4]
["Kaur",98,3,null,null,null,"Kaur",1.18,24]
["Mansa",92,9,null,null,null,"Mansa",1.05,11]
["Mitchell",96,8,null,null,null,"Mitchell",1.07,13]
["Craig",82,21,null,null,null,"Craig",1.1399999999999999,20]
["Sykes",83,18,null,null,null,"Sykes",1.04,9]
["Ewelina",78,23,null,null,null,"Ewelina",1.1000000000000001,18]
["Michael",86,16,null,null,null,"Michael",1.03,4]
["Nakyun",82,21,null,null,null,"Nakyun",1.03,4]

{"sheet":"AVERAGEIF","index":17,"n_rows":1190,"n_cols":10,"rows_kept":1190,"cut":false,"hidden":false,"merged":[]}
["Sales Rep","Units","Sales","COGS"]
["Richard",59,5937,4215.2699999999995,null,"Sales Rep","Units","Sales","COGS","GP %"]
["Manavbir",195,19551,16227.33,null,"Richard"]
["Janita",220,22010,17167.8,null,"Manavbir"]
["Mitchell",261,26146,21178.260000000002,null,"Janita"]
["Christina",166,16621,14626.48,null,"Mitchell"]
["Nakyun",376,37653,26357.1,null,"Christina"]
["Mitchell",160,16018,12013.5,null,"Nakyun"]
["Daniel",318,31850,25161.5,null,"Daniel"]
["Mi",295,29517,23318.43,null,"Mi"]
["Richard",474,47477,36557.29,null,"Kaur"]
["Kaur",90,9008,7656.8,null,"Ewelina"]
["Ewelina",135,13547,9347.4299999999985,null,"Nelia"]
["Ewelina",491,49100,43699,null,"Craig"]
["Mitchell",263,26324,17373.839999999997,null,"Carol"]
["Nelia",386,38612,32047.96,null,"Denise"]
["Craig",409,40900,29448,null,"Sarah"]
["Carol",267,26761,21944.02,null,"Shari"]
["Nelia",215,21598,17278.400000000001,null,"Yla-Katrina"]
["Denise",66,6625,4770,null,"Michelle"]
["Richard",377,37758,31339.14,null,"Michael"]
["Nelia",454,45437,35895.230000000003,null,"Elain"]
["Nelia",181,18107,15934.16,null,"Gianna"]
["Richard",392,39241,26683.879999999997,null,"Jason"]
["Sarah",75,7544,5280.7999999999993,null,"Debra"]
["Nakyun",380,38052,30441.600000000002,null,"Sykes"]
["Janita",272,27275,19365.25,null,"Mansa"]
["Kaur",325,32573,25406.940000000002]
["Shari",323,32327,28771.03]
["Shari",152,15245,12653.349999999999]
["Yla-Katrina",386,38620,29737.4]
["Denise",264,26444,21419.640000000003]
["Richard",401,40199,34973.129999999997]
["Carol",360,36011,25207.699999999997]
["Michelle",454,45422,34974.94]
["Nakyun",402,40283,28198.1]
["Ewelina",378,37862,25367.539999999997]
["Janita",478,47855,34455.599999999999]
["Nelia",293,29383,24094.06]
["Mi",363,36334,29793.88]
["Nakyun",403,40325,27017.749999999996]
["Manavbir",72,7257,5007.33]
["Janita",64,6429,5078.91]
["Manavbir",326,32666,22212.879999999997]
["Shari",145,14516,9435.4]
["Manavbir",177,17731,14007.49]
["Mi",407,40705,28900.55]
["Craig",79,7940,7146]
["Nelia",160,16064,11084.16]
["Shari",341,34144,30729.600000000002]
["Michael",327,32784,29505.600000000002]
["Elain",99,9958,7468.5]
["Nelia",480,48074,32690.319999999996]
["Gianna",361,36132,24931.079999999998]
["Denise",112,11251,8663.27]
["Denise",479,47943,40272.119999999995]
["Jason",441,44129,30007.719999999998]
["Craig",77,7793,5299.24]
["Richard",147,14712,9709.9199999999983]
["Craig",451,45146,30699.279999999999]
["Debra",219,21954,15148.259999999998]
["Ewelina",333,33319,21990.539999999997]
["Manavbir",76,7638,5881.26]
["Richard",156,15678,10661.039999999999]
["Sarah",71,7138,5710.4000000000005]
["Gianna",408,40848,28593.599999999999]
["Nelia",327,32714,24535.5]
["Sarah",468,46889,37980.090000000004]
["Manavbir",256,25614,18698.22]
["Kaur",52,5294,3917.56]
["Elain",194,19448,16141.839999999998]
["Gianna",72,7232,5134.7199999999993]
["Debra",491,49129,41268.36]
["Jason",107,10720,9112]
["Shari",88,8892,8002.8]
["Nelia",150,15063,10995.99]
["Sarah",443,44344,38579.279999999999]
["Jason",486,48600,43254]
["Mitchell",282,28247,25422.3]
["Gianna",444,44470,36020.700000000004]
["Jason",98,9839,6887.2999999999993]
["Michael",95,9584,6900.48]
["Sarah",122,12220,10020.400000000001]
["Richard",155,15578,12773.960000000001]
["Sarah",454,45413,34968.01]
["Gianna",319,31959,22051.71]
["Mi",231,23107,15943.829999999998]
["Sarah",283,28368,22694.400000000001]
["Michael",364,36489,30285.87]
["Yla-Katrina",56,5612,3872.2799999999997]
["Christina",369,36978,28473.06]
["Craig",244,24439,18329.25]
["Mitchell",267,26715,21906.300000000003]
["Mi",238,23882,19822.059999999998]
["Craig",214,21426,18212.099999999999]
["Mitchell",383,38312,29883.360000000001]
["Mi",235,23551,17192.23]
["Nakyun",288,28866,21360.84]
["Nelia",88,8812,7754.56]
["Sarah",619,61911,45195.03]
["Manavbir",169,16958,13057.66]
["Mi",179,17952,15977.28]
["Elain",332,33291,27298.620000000003]
["Mi",68,6800,5576]
["Carol",249,24953,17716.629999999997]
["Nakyun",316,31603,20857.979999999996]
["Michael",309,30943,20731.809999999998]
["Kaur",382,38208,32476.799999999999]
["Mitchell",351,35127,31263.03]
["Sykes",435,43569,39212.1]
["Carol",416,41682,32928.78]
["Mansa",428,42821,35969.64]
["Richard",207,20726,14508.199999999999]
["Sykes",259,25969,21294.58]
["Christina",461,46134,40597.919999999998]
["Jason",438,43807,28474.55]
["Sarah",485,48593,32071.379999999997]
["Mitchell",437,43707,35839.740000000005]
["Mitchell",454,45405,30421.35]
["Debra",78,7850,6829.5]
["Manavbir",360,36076,29221.56]
["Nakyun",201,20109,17293.739999999998]
["Michelle",327,32743,22265.239999999998]
["Denise",195,19508,14435.92]
["Mitchell",160,16002,13441.68]
["Nelia",164,16402,13285.62]
["Mitchell",124,12451,10707.86]
["Michelle",466,46644,37315.200000000004]
["Carol",442,44253,35844.93]
["Christina",494,49494,36130.620000000003]
["Nakyun",473,47340,41659.199999999997]
["Carol",66,6681,5879.28]
["Nelia",409,40975,29092.25]
["Michelle",491,49190,42795.3]
["Mansa",329,32908,28300.880000000001]
["Nelia",78,7894,6552.0199999999995]
["Yla-Katrina",312,31206,23404.5]
["Mi",452,45239,33929.25]
["Jason",322,32214,28348.32]
["Richard",140,14015,10230.949999999999]
["Daniel",347,34706,25335.38]
["Janita",456,45676,39281.360000000001]
["Ewelina",74,7488,6514.56]
["Denise",304,30415,25852.75]
["Janita",197,19724,13806.8]
["Christina",52,5252,3518.8399999999997]
["Sykes",392,39222,29024.28]
["Gianna",114,11449,9960.6299999999992]
["Ewelina",398,39876,28710.719999999998]
["Michelle",417,41728,32965.120000000003]
["Kaur",487,48797,36109.78]
["Gianna",395,39504,33183.360000000001]
["Michael",143,14342,12477.539999999999]
["Jason",302,30224,26899.360000000001]
["Craig",382,38293,32166.12]
["Richard",433,43317,36386.28]
["Denise",341,34112,23196.159999999996]
["Michael",480,48024,39859.919999999998]
["Kaur",478,47831,33003.39]
["Michael",446,44663,39303.440000000002]
["Jason",367,36798,26126.579999999998]
["Yla-Katrina",213,21365,14955.499999999998]
["Nakyun",459,45944,33539.120000000003]
["Mitchell",335,33527,27156.870000000003]
["Sykes",480,48077,39423.14]
["Mi",169,16983,12737.25]
["Michelle",62,6251,4375.7]
["Kaur",209,20968,14048.559999999998]
["Mitchell",97,9759,6343.35]
["Shari",118,11835,8166.15]
["Mansa",141,14181,12337.47]
["Carol",101,10117,6778.3899999999994]
["Ewelina",484,48418,31471.7]
["Carol",362,36245,27183.75]
["Denise",313,31306,21914.199999999997]
["Daniel",72,7240,4706]
["Yla-Katrina",148,14883,11311.08]
["Carol",138,13871,10680.67]
["Mi",267,26792,22505.279999999999]
["Sarah",131,13150,9205]
["Ewelina",478,47850,31102.5]
["Denise",405,40529,34044.36]
["Debra",350,35013,31511.7]
["Janita",164,16459,12838.02]
["Nakyun",108,10897,7083.05]
["Craig",243,24361,16565.48]
["Kaur",447,44746,36244.26]
["Jason",207,20768,14329.919999999998]
["Michelle",225,22517,16662.579999999998]
["Yla-Katrina",113,11307,8254.11]
["Craig",140,14094,9302.0399999999991]
["Yla-Katrina",391,39123,32863.32]
["Kaur",280,28032,18220.8]
["Carol",102,10296,7927.92]
["Daniel",429,42922,30045.399999999998]
["Elain",379,37938,25418.459999999995]
["Richard",108,10818,7356.24]
["Mi",110,11023,8046.79]
["Yla-Katrina",239,23907,16973.969999999998]
["Mi",843,84341,55665.05999999999]
["Daniel",148,14845,10688.4]
["Debra",279,27986,22108.940000000002]
["Michael",337,33726,29341.62]
["Michelle",334,33481,27119.61]
["Sarah",465,46579,37263.200000000004]
["Denise",236,23604,17703]
["Gianna",380,38016,25470.719999999998]
["Sarah",185,18547,13168.369999999999]
["Mi",410,41094,34108.019999999997]
["Janita",105,10588,8576.2800000000007]
["Sarah",474,47493,40843.979999999996]
["Nelia",349,34971,28326.510000000002]
["Michael",234,23413,17793.88]
["Janita",498,49867,36402.909999999996]
["Elain",117,11745,9043.65]
["Mi",94,9451,6237.6599999999989]
["Mitchell",485,48527,32998.36]
["Nakyun",323,32380,28818.2]
["Denise",84,8402,7225.72]
["Christina",402,40229,32183.200000000001]
["Kaur",119,11941,7761.6500000000005]
["Craig",75,7598,5850.46]
["Mi",72,7226,4985.9399999999996]
["Elain",471,47146,37245.340000000004]
["Kaur",485,48535,33003.799999999996]
["Yla-Katrina",88,8838,6628.5]
["Daniel",138,13845,9414.5999999999985]
["Debra",439,43911,32055.03]
["Jason",489,48938,38661.020000000004]
["Craig",263,26349,21869.67]
["Daniel",465,46577,41453.53]
["Sykes",75,7542,5731.92]
["Craig",424,42462,28874.159999999996]
["Mitchell",216,21637,15145.9]
["Mitchell",238,23836,20975.68]
["Yla-Katrina",54,5407,4487.8099999999995]
["Debra",271,27142,18999.399999999998]
["Ewelina",459,45973,35858.94]
["Carol",316,31678,21857.82]
["Kaur",222,22202,17095.54]
["Jason",401,40146,34927.019999999997]
["Shari",406,40689,26854.739999999998]
["Michael",349,34941,24458.699999999997]
["Richard",57,5774,5196.6000000000004]
["Denise",229,22946,18586.260000000002]
["Kaur",107,10727,9117.9499999999989]
["Daniel",64,6427,4370.3599999999997]
["Denise",409,40983,29097.93]
["Shari",278,27878,20908.5]
["Michael",224,22496,17771.84]
["Jason",167,16731,12548.25]
["Nakyun",435,43564,33108.639999999999]
["Nakyun",208,20898,14837.58]
["Nakyun",161,16167,11478.57]
["Jason",193,19304,15250.16]
["Mi",495,49558,36672.92]
["Debra",143,14373,10348.56]
["Mi",319,31995,28795.5]
["Sykes",451,45150,36120]
["Mitchell",100,10053,8645.58]
["Craig",226,22612,19672.439999999999]
["Janita",104,10439,7202.91]
["Jason",264,26481,19066.32]
["Yla-Katrina",244,24448,20536.32]
["Gianna",136,13656,12153.84]
["Michelle",251,25184,18888]
["Denise",233,23349,18912.690000000002]
["Denise",90,9096,6458.16]
["Yla-Katrina",83,8374,7536.6]
["Craig",475,47501,42750.9]
["Debra",440,44007,30364.829999999998]
["Debra",153,15399,13859.1]
["Mi",375,37590,33831]
["Gianna",181,18199,15651.14]
["Debra",479,47968,40293.119999999995]
["Yla-Katrina",289,28941,19969.289999999997]
["Christina",423,42362,36854.94]
["Richard",336,33614,26891.200000000001]
["Nelia",60,6046,5260.0199999999995]
["Manavbir",475,47527,33268.9]
["Michelle",365,36535,29958.7]
["Denise",423,42345,36840.15]
["Craig",236,23694,18955.2]
["Nelia",94,9440,7929.5999999999995]
["Sykes",246,24657,18739.32]
["Christina",378,37870,24994.199999999997]
["Mansa",306,30641,24819.210000000003]
["Mi",173,17354,14403.82]
["Michelle",114,11498,9313.380000000001]
["Carol",280,28088,24998.32]
["Richard",103,10357,8803.4499999999989]
["Carol",383,38344,28374.560000000001]
["Mi",240,24051,20924.37]
["Mansa",139,13989,12310.32]
["Janita",314,31421,25136.800000000003]
["Nelia",336,33653,23557.1]
["Sarah",219,21935,14477.099999999999]
["Richard",155,15527,11800.52]
["Nelia",136,13689,10540.53]
["Denise",610,61035,51879.75]
["Gianna",266,26689,20550.53]
["Elain",324,32440,25627.600000000002]
["Christina",303,30375,23692.5]
["Elain",198,19863,15493.140000000001]
["Craig",87,8754,6040.2599999999993]
["Debra",92,9277,6308.36]
["Yla-Katrina",227,22707,17030.25]
["Mi",69,6965,5989.9]
["Gianna",443,44347,33260.25]
["Michael",53,5327,4581.22]
["Sarah",293,29380,21447.399999999998]
["Kaur",135,13564,9087.8799999999992]
["Manavbir",430,43079,35324.780000000006]
["Yla-Katrina",314,31417,27332.79]
["Mitchell",390,39035,26934.149999999998]
["Richard",426,42648,29000.639999999996]
["Nakyun",227,22714,17035.5]
["Carol",389,38929,28418.17]
["Mansa",496,49670,36259.1]
["Craig",355,35552,31285.759999999998]
["Manavbir",313,31306,28175.4]
["Manavbir",64,6432,4695.3599999999997]
["Elain",232,23208,18798.48]
["Elain",393,39351,27152.19]
["Carol",493,49361,40969.629999999997]
["Richard",479,47967,32617.559999999998]
["Janita",212,21203,18446.61]
["Jason",60,6019,4454.0600000000004]
["Janita",51,5159,3353.35]
["Elain",266,26631,21571.11]
["Christina",291,29166,20999.52]
["Sarah",281,28114,21928.920000000002]
["Kaur",213,21329,18769.52]
["Craig",61,6195,5141.8499999999995]
["Michael",308,30818,27428.02]
["Debra",287,28737,22989.600000000002]
["Christina",268,26855,17455.75]
["Sykes",65,6522,5152.38]
["Carol",185,18519,12778.109999999999]
["Nakyun",406,40619,36150.910000000003]
["Jason",463,46307,36582.53]
["Elain",377,37743,24532.95]
["Yla-Katrina",351,35176,30603.119999999999]
["Sarah",215,21573,18121.32]
["Denise",257,25778,16755.7]
["Sykes",73,7358,5665.66]
["Michelle",437,43754,28440.100000000002]
["Elain",67,6738,5659.92]
["Janita",270,27030,22434.899999999998]
["Jason",381,38189,32460.649999999998]
["Sykes",287,28769,22152.13]
["Denise",108,10865,9017.9499999999989]
["Nakyun",105,10587,8363.73]
["Sarah",222,22267,15809.57]
["Mansa",152,15214,13692.6]
["Nakyun",320,32041,20826.650000000001]
["Sykes",66,6664,5797.68]
["Mansa",51,5167,4030.26]
["Christina",436,43654,29248.179999999997]
["Mitchell",351,35145,27413.100000000002]
["Nakyun",154,15473,13770.97]
["Sarah",86,8635,6303.55]
["Craig",167,16770,11403.599999999999]
["Kaur",462,46271,32852.409999999996]
["Mi",119,11914,8816.36]
["Mansa",201,20113,17297.18]
["Richard",176,17645,11469.25]
["Sarah",103,10320,6914.4]
["Sykes",403,40362,33096.840000000004]
["Sykes",163,16308,11089.439999999999]
["Sarah",319,31926,21390.42]
["Mitchell",307,30781,25548.23]
["Mansa",234,23470,17837.2]
["Nelia",81,8146,5620.74]
["Mitchell",129,12907,11616.300000000001]
["Yla-Katrina",281,28110,21925.8]
["Daniel",103,10352,8592.16]
["Sarah",422,42277,34667.14]
["Manavbir",140,14040,9828]
["Debra",242,24222,20588.7]
["Carol",116,11622,8251.619999999999]
["Craig",224,22470,15054.899999999998]
["Ewelina",409,40967,27038.219999999998]
["Craig",285,28534,24253.899999999998]
["Yla-Katrina",175,17579,12832.67]
["Mi",189,18950,14970.5]
["Carol",304,30452,23448.04]
["Mi",239,23999,15839.339999999998]
["Gianna",213,21391,16898.89]
["Daniel",70,7023,4986.33]
["Jason",329,32947,27675.48]
["Carol",158,15859,10942.71]
["Debra",232,23275,16292.499999999998]
["Nakyun",478,47824,38737.440000000002]
["Mitchell",321,32143,24428.68]
["Gianna",281,28160,24499.200000000001]
["Sarah",393,39399,28367.279999999999]
["Gianna",213,21354,15801.96]
["Daniel",152,15272,12217.6]
["Elain",797,79756,59019.44]
["Mansa",351,35133,22836.45]
["Michelle",403,40375,27051.249999999996]
["Nelia",343,34345,27132.550000000003]
["Manavbir",99,9979,7484.25]
["Denise",240,24007,19205.600000000002]
["Christina",116,11615,10221.200000000001]
["Yla-Katrina",376,37605,33092.400000000001]
["Yla-Katrina",407,40732,36658.800000000003]
["Michelle",400,40034,28824.48]
["Sarah",438,43849,33325.24]
["Michelle",487,48799,33183.32]
["Richard",318,31813,21950.969999999998]
["Elain",110,11093,7210.45]
["Sykes",57,5742,4134.24]
["Kaur",401,40194,27331.919999999998]
["Christina",411,41133,27559.109999999997]
["Mitchell",194,19410,12810.599999999999]
["Mitchell",343,34376,30594.639999999999]
["Richard",360,36010,31328.7]
["Carol",186,18623,13967.25]
["Kaur",172,17280,11232]
["Richard",65,6550,5829.5]
["Daniel",316,31661,21529.48]
["Shari",120,12062,9890.84]
["Craig",274,27479,24731.100000000002]
["Craig",149,14944,12104.640000000001]
["Debra",116,11620,9412.2000000000007]
["Sarah",484,48485,36848.6]
["Michael",464,46460,35774.200000000004]
["Kaur",90,9036,6415.5599999999995]
["Mi",190,19017,14262.75]
["Mi",466,46672,33603.839999999997]
["Carol",359,35922,26941.5]
["Yla-Katrina",69,6913,5046.49]
["Ewelina",355,35569,29166.58]
["Carol",462,46275,39796.5]
["Sykes",397,39738,34572.06]
["Janita",142,14240,10822.4]
["Mansa",257,25768,16749.2]
["Mansa",396,39626,35267.14]
["Janita",335,33529,28499.649999999998]
["Carol",200,20056,15242.56]
["Michelle",275,27554,18185.64]
["Kaur",78,7803,5384.07]
["Nakyun",120,12044,8551.24]
["Carol",269,26987,24288.3]
["Carol",52,5231,3818.63]
["Janita",180,18028,14242.12]
["Mansa",227,22701,18614.82]
["Craig",280,28066,18804.219999999998]
["Yla-Katrina",212,21219,16763.010000000002]
["Shari",132,13231,8864.7699999999986]
["Kaur",453,45316,34893.32]
["Michael",272,27239,23970.32]
["Daniel",449,44965,32824.449999999997]
["Elain",145,14550,11931]
["Sarah",328,32846,27590.639999999999]
["Michelle",263,26315,17367.899999999998]
["Janita",261,26159,19096.07]
["Mansa",458,45837,35752.86]
["Debra",478,47813,32512.839999999997]
["Denise",355,35590,23845.3]
["Daniel",429,42916,29612.039999999997]
["Gianna",458,45836,37127.160000000003]
["Michael",205,20507,17430.95]
["Debra",130,13084,10728.880000000001]
["Richard",205,20582,18112.16]
["Mi",480,48001,37440.78]
["Daniel",405,40594,26386.100000000002]
["Craig",421,42154,27400.100000000002]
["Sarah",54,5460,3767.3999999999996]
["Mansa",379,37976,33039.120000000003]
["Yla-Katrina",390,39011,33159.35]
["Sykes",408,40840,32263.600000000002]
["Manavbir",402,40202,26935.339999999997]
["Debra",207,20750,17845]
["Manavbir",348,34877,23018.819999999996]
["Jason",429,42906,35611.979999999996]
["Janita",343,34359,28861.559999999998]
["Nelia",119,11938,9789.16]
["Daniel",438,43849,39025.61]
["Sykes",61,6197,5453.36]
["Michelle",383,38351,30680.800000000003]
["Nelia",119,11912,8219.2799999999988]
["Carol",238,23837,17877.75]
["Sarah",130,13045,10957.8]
["Mitchell",232,23261,19771.849999999999]
["Michael",229,22960,18597.600000000002]
["Yla-Katrina",241,24137,18585.490000000002]
["Sykes",366,36616,27828.16]
["Richard",218,21885,15757.199999999999]
["Craig",457,45796,31141.279999999999]
["Carol",413,41349,27290.339999999997]
["Ewelina",303,30315,22736.25]
["Yla-Katrina",495,49593,37194.75]
["Daniel",489,48982,37716.14]
["Carol",187,18711,14220.36]
["Nelia",203,20356,17302.599999999999]
["Mansa",493,49304,42894.48]
["Mitchell",868,86845,59923.049999999996]
["Shari",272,27261,19355.309999999998]
["Shari",211,21145,15435.85]
["Janita",155,15564,11361.72]
["Daniel",133,13391,11917.99]
["Gianna",247,24788,17351.599999999999]
["Michael",455,45520,32774.400000000001]
["Michael",349,34961,29017.629999999997]
["Christina",455,45551,34618.76]
["Craig",61,6109,5314.83]
["Christina",356,35601,24920.699999999997]
["Yla-Katrina",306,30631,21441.699999999997]
["Michelle",312,31287,20962.289999999997]
["Janita",422,42219,32930.82]
["Nakyun",209,20933,18211.71]
["Yla-Katrina",297,29736,26762.400000000001]
["Shari",368,36834,32413.920000000002]
["Sykes",95,9576,8331.1200000000008]
["Richard",307,30788,23398.880000000001]
["Denise",141,14167,10483.58]
["Craig",284,28462,21915.74]
["Christina",140,14092,10569]
["Jason",57,5707,4223.18]
["Nelia",201,20164,17341.04]
["Michelle",160,16087,11260.9]
["Nelia",217,21774,17854.68]
["Christina",105,10579,9309.52]
["Denise",425,42566,37458.080000000002]
["Sarah",323,32327,26184.870000000003]
["Manavbir",316,31600,24332]
["Janita",496,49683,35771.760000000002]
["Nakyun",240,24078,16373.039999999999]
["Kaur",498,49861,37395.75]
["Christina",82,8291,6632.8]
["Mitchell",427,42746,34624.26]
["Yla-Katrina",268,26851,18795.699999999997]
["Elain",254,25461,18841.14]
["Mansa",225,22507,20256.3]
["Daniel",257,25771,21647.64]
["Shari",150,15092,11469.92]
["Yla-Katrina",400,40001,32400.81]
["Kaur",366,36626,30033.320000000003]
["Jason",187,18727,13296.17]
["Sarah",458,45834,36667.200000000004]
["Daniel",487,48794,38059.32]
["Shari",484,48492,35399.159999999996]
["Debra",181,18196,12737.199999999999]
["Yla-Katrina",173,17338,11443.079999999998]
["Craig",203,20327,13415.819999999998]
["Nakyun",264,26406,20332.62]
["Nelia",233,23338,17736.88]
["Jason",385,38511,27727.919999999998]
["Debra",93,9359,7393.6100000000006]
["Nelia",59,5933,5102.38]
["Daniel",201,20113,13676.839999999998]
["Gianna",260,26036,20828.800000000003]
["Mi",223,22301,20070.900000000001]
["Michael",395,39584,32458.880000000001]
["Sykes",479,47969,35976.75]
["Mitchell",327,32765,25229.05]
["Kaur",495,49576,44122.64]
["Jason",442,44273,35418.400000000001]
["Christina",433,43325,34226.75]
["Kaur",494,49482,32658.119999999995]
["Carol",159,15986,11829.64]
["Elain",167,16777,12414.98]
["Mi",229,22904,19697.439999999999]
["Christina",210,21010,14917.099999999999]
["Mitchell",403,40322,26209.3]
["Michelle",235,23550,18604.5]
["Kaur",53,5347,4277.6000000000004]
["Yla-Katrina",109,10921,8736.8000000000011]
["Daniel",422,42298,32146.48]
["Kaur",313,31382,26988.52]
["Richard",244,24401,19032.78]
["Debra",263,26307,17625.689999999999]
["Carol",328,32818,23628.959999999999]
["Kaur",224,22474,17979.2]
["Nelia",155,15515,13032.6]
["Michelle",296,29624,24291.68]
["Elain",306,30686,26696.82]
["Yla-Katrina",386,38636,26658.839999999997]
["Manavbir",98,9894,6727.9199999999992]
["Yla-Katrina",56,5639,4229.25]
["Mi",65,6597,5277.6]
["Gianna",355,35547,23461.019999999997]
["Mitchell",312,31205,28084.5]
["Richard",430,43084,34467.200000000004]
["Yla-Katrina",175,17593,12842.89]
["Sarah",356,35657,28169.030000000002]
["Daniel",405,40550,34062]
["Jason",208,20846,16259.880000000001]
["Nakyun",354,35429,26571.75]
["Shari",214,21451,18662.37]
["Carol",88,8819,7055.2000000000007]
["Nelia",187,18755,14628.9]
["Michael",239,23929,17228.88]
["Craig",366,36627,24906.359999999997]
["Manavbir",70,7088,5741.2800000000007]
["Manavbir",145,14548,10620.039999999999]
["Sykes",977,97748,70378.559999999998]
["Denise",383,38305,32942.300000000003]
["Michael",134,13424,11007.68]
["Elain",264,26412,21921.96]
["Mansa",264,26415,22981.05]
["Shari",314,31459,27369.329999999998]
["Michelle",239,23910,20801.7]
["Sarah",291,29130,21847.5]
["Mi",392,39211,34505.68]
["Nakyun",78,7873,6377.13]
["Sarah",173,17355,12842.7]
["Manavbir",371,37143,29714.400000000001]
["Michael",452,45224,32109.039999999997]
["Mi",116,11659,9210.61]
["Debra",91,9144,6400.7999999999993]
["Richard",306,30654,23603.58]
["Mi",395,39597,31677.600000000002]
["Ewelina",367,36715,32676.350000000002]
["Carol",419,41954,32724.120000000003]
["Michael",215,21580,15105.999999999998]
["Michelle",226,22671,18136.8]
["Sarah",134,13493,9040.31]
["Daniel",273,27320,22129.200000000001]
["Shari",295,29524,25095.399999999998]
["Ewelina",308,30856,21290.639999999999]
["Nakyun",304,30489,19817.850000000002]
["Christina",457,45713,40684.57]
["Sarah",361,36134,23487.100000000002]
["Craig",430,43001,32250.75]
["Manavbir",150,15091,10563.699999999999]
["Ewelina",460,46081,34560.75]
["Nelia",428,42888,33023.760000000002]
["Ewelina",286,28640,22052.799999999999]
["Sykes",361,36121,32147.69]
["Janita",182,18253,13324.69]
["Ewelina",299,29915,22137.1]
["Jason",177,17790,14765.699999999999]
["Shari",99,9937,7452.75]
["Debra",111,11140,7686.5999999999995]
["Yla-Katrina",390,39064,25391.600000000002]
["Richard",236,23646,17261.579999999998]
["Yla-Katrina",107,10701,8988.84]
["Ewelina",169,16982,12566.68]
["Elain",167,16741,12555.75]
["Mitchell",276,27665,18812.199999999997]
["Yla-Katrina",101,10112,8898.56]
["Mansa",248,24839,18877.64]
["Kaur",78,7826,5086.9000000000005]
["Mitchell",327,32763,25555.14]
["Shari",388,38854,28751.96]
["Kaur",462,46268,37939.760000000002]
["Ewelina",167,16701,12358.74]
["Christina",467,46725,34109.25]
["Christina",145,14586,12981.54]
["Shari",183,18386,14341.08]
["Richard",404,40483,32791.230000000003]
["Mitchell",487,48751,43875.9]
["Daniel",481,48109,38968.29]
["Craig",271,27120,23865.599999999999]
["Richard",392,39260,30622.799999999999]
["Elain",277,27737,21634.86]
["Manavbir",148,14897,10576.869999999999]
["Daniel",210,21085,15181.199999999999]
["Craig",179,17910,13074.3]
["Jason",448,44811,32263.919999999998]
["Michelle",70,7042,5351.92]
["Carol",240,24058,16600.02]
["Shari",87,8763,6835.14]
["Janita",384,38446,29218.959999999999]
["Gianna",99,9913,7930.4000000000005]
["Yla-Katrina",468,46898,41739.22]
["Mansa",336,33652,29277.24]
["Michelle",351,35100,30537]
["Richard",230,23045,16361.949999999999]
["Mitchell",319,31972,23979]
["Shari",144,14446,12134.64]
["Mi",484,48467,35380.909999999996]
["Denise",128,12821,9743.9600000000009]
["Mi",261,26138,22478.68]
["Christina",274,27414,21657.06]
["Michael",301,30142,21400.82]
["Ewelina",109,10961,8549.58]
["Gianna",159,15946,13075.720000000001]
["Christina",268,26878,17470.7]
["Christina",443,44389,31960.079999999998]
["Nakyun",400,40017,30412.920000000002]
["Christina",155,15597,10761.929999999998]
["Shari",270,27047,23801.360000000001]
["Manavbir",141,14143,9334.3799999999992]
["Richard",400,40008,35207.040000000001]
["Ewelina",440,44096,29544.319999999996]
["Sarah",409,40983,34425.72]
["Nakyun",98,9886,8897.4]
["Sykes",231,23116,17105.84]
["Ewelina",180,18060,14628.6]
["Michael",202,20264,16211.2]
["Michael",458,45809,31608.21]
["Mi",115,11547,9814.9499999999989]
["Mansa",130,13042,10433.6]
["Mitchell",268,26800,24120]
["Janita",902,90280,63195.999999999993]
["Manavbir",91,9109,8198.1]
["Sykes",409,40932,31517.64]
["Mansa",161,16135,10810.449999999999]
["Kaur",234,23459,19940.149999999998]
["Daniel",141,14123,10874.710000000001]
["Mitchell",448,44845,36324.450000000004]
["Michelle",177,17721,14354.01]
["Richard",263,26304,22884.48]
["Carol",256,25661,18219.309999999998]
["Yla-Katrina",143,14392,12952.800000000001]
["Nakyun",161,16157,11309.9]
["Sarah",141,14132,11870.88]
["Kaur",492,49273,37447.480000000003]
["Ewelina",138,13849,9694.2999999999993]
["Nakyun",272,27291,21014.07]
["Christina",339,33921,23744.699999999997]
["Jason",404,40446,34379.1]
["Jason",170,17021,11744.49]
["Sarah",465,46580,34469.199999999997]
["Mansa",480,48066,41336.76]
["Michelle",275,27538,20378.12]
["Ewelina",321,32128,21204.479999999996]
["Craig",396,39674,25788.100000000002]
["Shari",231,23130,18504]
["Nakyun",339,33904,22715.679999999997]
["Nelia",146,14637,11270.49]
["Nakyun",474,47428,42210.92]
["Mi",138,13838,8994.7000000000007]
["Michael",168,16881,12998.37]
["Carol",143,14379,10928.04]
["Sarah",221,22124,14380.6]
["Nakyun",493,49315,43890.35]
["Gianna",119,11956,9803.92]
["Yla-Katrina",445,44574,33876.239999999998]
["Michelle",207,20756,16397.240000000002]
["Sykes",163,16312,14354.56]
["Yla-Katrina",346,34660,24955.200000000001]
["Shari",89,8942,6527.66]
["Mi",261,26128,21686.239999999998]
["Mansa",327,32722,28140.92]
["Sarah",462,46258,38394.14]
["Nelia",347,34719,28816.769999999997]
["Kaur",459,45941,34915.160000000003]
["Manavbir",269,26935,18585.149999999998]
["Christina",391,39176,28206.719999999998]
["Richard",216,21657,14943.329999999998]
["Carol",105,10570,7716.0999999999995]
["Richard",438,43862,36405.46]
["Mansa",99,9983,6988.0999999999995]
["Richard",233,23370,16125.3]
["Nakyun",438,43844,38582.720000000001]
["Denise",111,11125,9790]
["Shari",375,37519,31140.769999999997]
["Mi",270,27063,22462.289999999997]
["Daniel",353,35383,31490.87]
["Nakyun",193,19372,15303.880000000001]
["Debra",204,20448,15336]
["Shari",492,49282,32033.300000000003]
["Christina",385,38596,25859.319999999996]
["Michael",257,25703,21076.460000000003]
["Mitchell",313,31332,21619.079999999998]
["Mansa",306,30645,26048.25]
["Nelia",366,36606,29284.800000000003]
["Daniel",137,13797,11727.449999999999]
["Mitchell",314,31406,22926.38]
["Kaur",334,33411,24724.14]
["Gianna",335,33552,21808.799999999999]
["Nakyun",206,20676,14059.679999999998]
["Carol",304,30417,24333.600000000002]
["Carol",259,25995,21055.95]
["Christina",127,12739,8280.35]
["Michelle",315,31557,26192.309999999998]
["Sarah",100,10032,8928.48]
["Michelle",394,39470,25655.5]
["Michael",225,22539,17355.03]
["Debra",255,25550,20184.5]
["Nakyun",292,29257,19309.62]
["Yla-Katrina",284,28493,21084.82]
["Jason",76,7648,6424.32]
["Christina",308,30846,21592.199999999997]
["Michelle",435,43550,31791.5]
["Richard",472,47215,38716.300000000003]
["Yla-Katrina",54,5496,3792.24]
["Michael",297,29747,19930.489999999998]
["Sykes",53,5338,4804.2]
["Craig",181,18120,12321.599999999999]
["Jason",63,6392,4921.84]
["Sykes",326,32660,21555.599999999999]
["Nakyun",456,45676,29689.4]
["Kaur",77,7709,6552.65]
["Mitchell",491,49195,32960.649999999994]
["Michael",192,19299,14860.23]
["Kaur",205,20571,15839.67]
["Sykes",379,37946,26182.739999999998]
["Ewelina",101,10131,8611.35]
["Carol",134,13434,11956.26]
["Debra",314,31442,20751.719999999998]
["Debra",103,10335,7751.25]
["Manavbir",465,46598,40074.28]
["Denise",919,91999,67159.27]
["Carol",473,47327,33128.9]
["Manavbir",479,47918,42167.840000000004]
["Ewelina",484,48401,39204.810000000005]
["Kaur",192,19238,16737.060000000001]
["Gianna",309,30945,24446.550000000003]
["Debra",177,17720,15593.6]
["Debra",221,22159,17505.61]
["Debra",466,46663,31730.839999999997]
["Mansa",367,36772,26475.84]
["Mitchell",401,40136,26891.119999999995]
["Michael",271,27150,24163.5]
["Elain",129,12909,10069.02]
["Michelle",294,29454,21795.96]
["Shari",396,39636,26159.759999999998]
["Kaur",454,45453,33180.69]
["Michelle",421,42179,35008.57]
["Denise",241,24157,15943.619999999997]
["Michelle",233,23397,18483.63]
["Carol",165,16521,12886.380000000001]
["Sarah",290,29024,24960.639999999999]
["Nelia",101,10116,6878.8799999999992]
["Debra",354,35470,30504.2]
["Elain",439,43904,38196.480000000003]
["Manavbir",85,8514,7066.62]
["Ewelina",140,14068,10691.68]
["Sarah",399,39902,27931.399999999998]
["Gianna",168,16838,10944.7]
["Sykes",448,44876,30066.92]
["Nelia",197,19756,12841.4]
["Mansa",271,27188,18215.96]
["Craig",86,8612,6114.5199999999995]
["Craig",268,26813,17696.579999999998]
["Michelle",482,48273,39583.86]
["Daniel",436,43690,33204.400000000001]
["Christina",110,11032,9708.16]
["Mansa",248,24823,19361.940000000002]
["Ewelina",306,30620,23883.600000000002]
["Denise",187,18760,16508.8]
["Michelle",497,49728,36798.720000000001]
["Denise",486,48660,43794]
["Mi",98,9821,6972.91]
["Michael",322,32203,22220.07]
["Nakyun",390,39081,32437.23]
["Janita",51,5131,3540.39]
["Sarah",496,49684,35275.64]
["Sarah",469,46903,39867.549999999996]
["Sykes",118,11827,9579.8700000000008]
["Manavbir",123,12327,8628.9]
["Michelle",145,14572,10637.56]
["Janita",307,30719,23960.82]
["Sykes",281,28135,22789.350000000002]
["Debra",460,46055,35001.800000000003]
["Daniel",152,15210,13689]
["Denise",212,21207,17389.740000000002]
["Mitchell",248,24863,21879.439999999999]
["Kaur",70,7030,5764.6]
["Nelia",415,41520,34876.799999999996]
["Debra",372,37222,28288.720000000001]
["Sykes",211,21190,18435.3]
["Gianna",201,20186,18167.400000000001]
["Gianna",118,11831,9109.8700000000008]
["Sykes",199,19908,15329.16]
["Kaur",493,49350,35532]
["Jason",192,19259,14444.25]
["Shari",221,22190,14645.399999999998]
["Yla-Katrina",350,35007,28005.600000000002]
["Shari",413,41335,32654.65]
["Michael",486,48686,35540.78]
["Gianna",426,42607,37920.230000000003]
["Debra",332,33204,29551.56]
["Kaur",220,22096,14362.4]
["Nelia",343,34324,29518.639999999999]
["Jason",406,40664,30091.360000000001]
["Shari",158,15864,11739.36]
["Ewelina",105,10531,9267.2800000000007]
["Shari",391,39168,26242.559999999998]
["Denise",117,11776,9538.5600000000013]
["Michelle",294,29477,19160.05]
["Ewelina",120,12062,8202.16]
["Gianna",56,5640,4906.8]
["Jason",225,22513,17785.27]
["Mi",453,45336,36268.800000000003]
["Ewelina",247,24720,18045.599999999999]
["Nelia",306,30635,21138.149999999998]
["Mi",96,9661,6472.869999999999]
["Sarah",428,42839,38555.1]
["Sarah",255,25523,18887.02]
["Sykes",285,28504,22803.200000000001]
["Christina",62,6293,4782.68]
["Sarah",311,31146,24293.88]
["Christina",309,30955,26311.75]
["Nakyun",217,21729,14993.009999999998]
["Manavbir",492,49296,42394.559999999998]
["Yla-Katrina",261,26142,22482.12]
["Ewelina",137,13778,12124.64]
["Richard",98,9897,7026.87]
["Mi",397,39740,35368.6]
["Mitchell",135,13509,11752.83]
["Ewelina",270,27044,20283]
["Craig",743,74314,63910.04]
["Nelia",289,28920,18798]
["Yla-Katrina",99,9974,8976.6]
["Manavbir",317,31732,28241.48]
["Nelia",400,40076,27251.679999999997]
["Denise",160,16031,14267.59]
["Janita",67,6797,4893.84]
["Manavbir",420,42023,31097.02]
["Sykes",211,21100,18146]
["Daniel",284,28491,18804.059999999998]
["Sykes",156,15606,13889.34]
["Janita",415,41515,32796.85]
["Sarah",168,16873,11136.179999999998]
["Debra",387,38794,32586.959999999999]
["Craig",443,44308,38991.040000000001]
["Christina",499,49993,38494.61]
["Michael",376,37615,30092]
["Manavbir",77,7742,5109.7199999999993]
["Sarah",56,5645,5080.5]
["Yla-Katrina",56,5685,4320.6000000000004]
["Gianna",231,23159,20611.510000000002]
["Debra",69,6991,5243.25]
["Nakyun",67,6740,4718]
["Elain",406,40674,33759.42]
["Kaur",283,28314,19253.519999999997]
["Sarah",465,46574,35396.239999999998]
["Debra",310,31027,27614.03]
["Yla-Katrina",76,7656,5512.32]
["Jason",469,46970,38515.4]
["Michelle",460,46003,40482.639999999999]
["Sykes",284,28458,25327.62]
["Shari",198,19854,17272.98]
["Shari",323,32344,21993.919999999998]
["Shari",59,5994,4495.5]
["Gianna",271,27156,24168.84]
["Nakyun",142,14281,10567.94]
["Jason",149,14972,12426.76]
["Mansa",400,40097,26063.05]
["Manavbir",288,28801,21888.760000000002]
["Richard",159,15990,12312.300000000001]
["Shari",187,18752,13313.92]
["Richard",165,16506,12049.38]
["Gianna",376,37606,30084.800000000003]
["Michelle",72,7218,4691.7]
["Mitchell",319,31935,20757.75]
["Gianna",53,5315,3826.7999999999997]
["Manavbir",332,33215,29229.200000000001]
["Christina",287,28745,19834.05]
["Nelia",318,31832,24828.959999999999]
["Nelia",343,34300,22295]
["Denise",52,5225,3657.4999999999995]
["Christina",150,15047,10081.49]
["Janita",208,20898,15464.52]
["Janita",199,19952,13168.319999999998]
["Nelia",81,8172,6864.48]
["Jason",489,48908,39126.400000000001]
["Craig",106,10684,7799.32]
["Nelia",416,41622,33713.82]
["Daniel",492,49252,42356.72]
["Manavbir",348,34889,24771.19]
["Manavbir",94,9492,8163.12]
["Denise",331,33194,25559.38]
["Mansa",292,29241,25147.26]
["Mitchell",219,21907,14239.550000000001]
["Ewelina",160,16067,11246.9]
["Craig",65,6531,5812.59]
["Elain",254,25439,22640.71]
["Christina",245,24527,21583.759999999998]
["Ewelina",71,7180,5672.2]
["Nelia",220,22005,19364.400000000001]
["Gianna",117,11744,10099.84]
["Denise",144,14449,12137.16]
["Craig",105,10565,8452]
["Sarah",138,13824,10920.960000000001]
["Mitchell",241,24156,15701.4]
["Elain",181,18126,15044.58]
["Mi",72,7232,4917.7599999999993]
["Denise",461,46140,38757.599999999999]
["Ewelina",237,23787,16175.159999999998]
["Ewelina",439,43910,31176.1]
["Richard",382,38292,31399.440000000002]
["Gianna",338,33896,23388.239999999998]
["Elain",227,22753,14789.45]
["Nakyun",377,37720,29421.600000000002]
["Debra",97,9726,8267.1]
["Sykes",58,5863,5042.18]
["Yla-Katrina",164,16491,11048.97]
["Christina",206,20680,16130.400000000001]
["Manavbir",484,48427,39710.14]
["Nakyun",338,33846,26738.34]
["Christina",197,19747,16192.54]
["Michael",277,27760,19154.399999999998]
["Janita",241,24121,21467.69]
["Yla-Katrina",206,20680,16957.600000000002]
["Carol",64,6428,5078.12]
["Mansa",319,31928,27458.079999999998]
["Mansa",211,21156,17982.599999999999]
["Shari",332,33275,28283.75]
["Kaur",491,49194,39847.14]
["Daniel",440,44016,38734.080000000002]
["Sarah",808,80843,65482.83]
["Elain",146,14694,12049.080000000002]
["Elain",396,39648,28943.040000000001]
["Ewelina",265,26518,18562.599999999999]
["Sarah",349,34995,24496.5]
["Michael",76,7624,6556.64]
["Kaur",123,12384,8916.48]
["Gianna",328,32828,22979.599999999999]
["Manavbir",399,39964,27175.519999999997]
["Janita",162,16262,13009.6]
["Sarah",201,20171,18153.900000000001]
["Sykes",162,16267,14314.960000000001]
["Manavbir",65,6574,4470.32]
["Shari",224,22443,18852.12]
["Sykes",134,13408,11128.64]
["Denise",148,14887,10718.64]
["Denise",463,46397,35261.72]
["Gianna",278,27849,20608.259999999998]
["Jason",426,42605,29823.499999999996]
["Mansa",65,6518,4823.32]
["Sykes",393,39339,35405.1]
["Michael",484,48498,36858.480000000003]
["Carol",277,27777,21943.83]
["Gianna",203,20343,14240.099999999999]
["Yla-Katrina",463,46323,30109.95]
["Nelia",285,28573,25715.7]
["Jason",461,46165,37393.65]
["Mi",59,5956,3930.9599999999996]
["Kaur",141,14167,10625.25]
["Manavbir",442,44274,30106.319999999996]
["Nakyun",127,12703,8892.0999999999985]
["Janita",190,19020,16547.400000000001]
["Sykes",352,35250,23969.999999999996]
["Craig",376,37653,31251.989999999998]
["Michael",227,22742,16146.82]
["Kaur",93,9351,8322.39]
["Jason",57,5728,4811.5199999999995]
["Sarah",309,30954,20120.100000000002]
["Yla-Katrina",254,25478,17579.82]
["Nelia",329,32928,29305.920000000002]
["Michelle",445,44508,34716.239999999998]
["Sykes",73,7372,6045.0400000000009]
["Mansa",446,44681,37532.04]
["Sarah",140,14033,11928.05]
["Mitchell",371,37165,32333.55]
["Craig",330,33055,28757.85]
["Mitchell",289,28993,24933.98]
["Mitchell",384,38464,30001.920000000002]
["Gianna",191,19196,13821.119999999999]
["Kaur",58,5837,4961.45]
["Shari",97,9719,7289.25]
["Kaur",266,26689,21884.980000000003]
["Carol",450,45008,35106.239999999998]
["Mitchell",228,22865,15319.55]
["Kaur",68,6815,6133.5]
["Nelia",307,30738,25819.919999999998]
["Mi",195,19591,14693.25]
["Richard",373,37379,31772.149999999998]
["Manavbir",125,12519,10766.34]
["Shari",315,31556,23035.88]
["Mi",245,24516,19612.8]
["Shari",147,14710,12062.2]
["Mi",95,9576,8331.1200000000008]
["Mansa",350,35097,26673.72]
["Janita",193,19328,15655.68]
["Nakyun",259,25983,19747.080000000002]
["Mansa",200,20096,17483.52]
["Daniel",144,14409,10950.84]
["Gianna",311,31115,20847.05]
["Shari",228,22804,15050.639999999998]
["Sykes",394,39457,28803.61]
["Michelle",246,24621,17727.12]
["Mi",70,7003,5182.22]
["Ewelina",226,22663,15410.839999999998]
["Sykes",449,44908,31884.679999999997]
["Debra",260,26013,21070.530000000002]
["Yla-Katrina",228,22851,20108.88]
["Michael",90,9067,7706.95]
["Nelia",132,13246,11259.1]
["Manavbir",436,43687,34075.86]
["Nelia",265,26513,19089.36]
["Daniel",157,15716,12729.960000000001]
["Mitchell",239,23915,16262.199999999999]
["Janita",412,41265,35487.9]
["Gianna",209,20900,15257]
["Richard",280,28091,25000.99]
["Yla-Katrina",452,45219,38436.15]
["Richard",476,47640,34300.799999999996]
["Daniel",430,43014,37852.32]
["Denise",344,34433,30989.7]
["Nakyun",300,30018,24614.760000000002]
["Mitchell",325,32586,27046.379999999997]
["Richard",161,16165,13740.25]
["Debra",52,5217,4643.13]
["Shari",347,34784,29914.239999999998]
["Debra",419,41967,28537.559999999998]
["Janita",378,37874,28405.5]
["Daniel",134,13491,11737.17]
["Michael",499,49996,37996.959999999999]
["Gianna",166,16673,11004.179999999998]
["Michelle",693,69329,56156.490000000005]
["Mansa",134,13431,10744.800000000001]
["Mitchell",326,32621,21856.069999999996]
["Craig",76,7630,5112.0999999999995]
["Sarah",309,30935,25366.7]
["Jason",472,47240,36847.200000000004]
["Sarah",365,36560,30344.799999999999]
["Elain",294,29430,25898.400000000001]
["Manavbir",426,42684,36708.239999999998]
["Elain",348,34889,26864.53]
["Daniel",384,38484,28863]
["Daniel",334,33470,29453.599999999999]
["Michelle",129,12937,8926.5299999999988]
["Mitchell",464,46404,34803]
["Nakyun",353,35356,26517]
["Jason",459,45992,39553.120000000003]
["Mi",232,23270,20012.2]
["Mi",74,7449,5139.8099999999995]
["Craig",395,39531,34787.279999999999]
["Ewelina",388,38810,28331.3]
["Shari",311,31145,22112.949999999997]
["Manavbir",212,21299,16826.21]
["Mitchell",296,29699,20789.3]
["Jason",498,49837,44853.3]
["Elain",229,22945,14914.25]
["Sarah",216,21695,15186.499999999998]
["Carol",444,44441,39996.9]
["Mi",205,20554,16854.280000000002]
["Craig",401,40164,30926.280000000002]
["Debra",111,11115,9114.3000000000011]
["Michelle",177,17782,15114.699999999999]
["Yla-Katrina",400,40051,30038.25]
["Nelia",381,38192,28262.079999999998]
["Debra",95,9571,8135.3499999999995]
["Michael",334,33483,26451.57]
["Yla-Katrina",269,26926,23964.14]
["Nakyun",311,31142,26782.12]
["Richard",107,10784,8195.84]
["Daniel",484,48452,36823.519999999997]
["Daniel",357,35710,27139.599999999999]
["Ewelina",142,14256,9266.4]
["Kaur",240,24050,20923.5]
["Yla-Katrina",320,32077,25020.06]
["Yla-Katrina",426,42696,33729.840000000004]
["Nelia",492,49256,43837.840000000004]
["Mitchell",161,16116,10636.56]
["Richard",187,18765,15762.599999999999]
["Gianna",372,37202,28273.52]
["Daniel",238,23840,20740.8]
["Craig",376,37606,33845.4]
["Yla-Katrina",99,9972,8775.36]
["Michael",203,20391,16312.800000000001]
["Debra",423,42338,28366.459999999995]
["Mansa",488,48891,36179.339999999997]
["Mansa",370,37080,32259.599999999999]
["Christina",125,12590,10575.6]
["Christina",242,24283,20640.55]
["Richard",70,7022,5898.48]
["Richard",181,18164,15439.4]
["Ewelina",484,48405,36787.800000000003]
["Mansa",196,19688,13190.96]
["Debra",314,31466,28004.74]
["Mi",463,46330,35210.800000000003]
["Mi",131,13157,9999.32]
["Jason",403,40343,30257.25]
["Mansa",185,18595,16735.5]
["Craig",491,49116,42730.92]
["Kaur",66,6619,5229.01]
["Craig",447,44764,39392.32]
["Jason",330,33033,29399.37]
["Shari",267,26782,18479.579999999998]
["Carol",124,12470,9103.1]
["Nakyun",465,46584,38664.720000000001]
["Manavbir",448,44827,39447.760000000002]
["Daniel",463,46347,40785.360000000001]
["Debra",279,27946,20680.04]
["Daniel",426,42652,28576.839999999997]
["Debra",360,36063,27047.25]
["Michael",172,17278,12958.5]
["Michael",381,38101,27051.71]
["Mansa",160,16020,12495.6]
["Gianna",189,18954,14215.5]
["Nakyun",284,28470,24484.2]
["Yla-Katrina",373,37361,30262.410000000003]
["Carol",214,21445,16083.75]
["Debra",241,24125,16405]
["Shari",479,47917,39771.11]
["Richard",78,7870,6610.8]
["Mi",422,42284,36364.239999999998]
["Mansa",263,26379,22949.73]
["Elain",304,30481,23775.18]

{"sheet":"AVERAGEIF (an)","index":18,"n_rows":1190,"n_cols":27,"rows_kept":1190,"cut":false,"hidden":true,"merged":[]}
["Sales Rep","Units","Sales","COGS"]
["Richard",59,5937,4215.2699999999995,null,"Sales Rep","Units","Sales","COGS","GP %"]
["Manavbir",195,19551,16227.33,null,"Carol",{"$f":"AVERAGEIF($A$2:$A$1190,$F3,B$2:B$1190)","v":258.27659574468083},{"$f":"AVERAGEIF($A$2:$A$1190,$F3,C$2:C$1190)","v":25877.042553191488},{"$f":"AVERAGEIF($A$2:$A$1190,$F3,D$2:D$1190)","v":19892.524680851064},{"$f":"H3/I3-1","v":0.30084255107654778},null,null,null,null,null,null,null,null,null,null,null,null,null,"Row Labels","Average of Units","Average of Sales","Average of COGS"]
["Janita",220,22010,17167.8,null,"Christina",285.04545454545456,28560.43181818182,21668.049090909091,0.31808967657196474,null,null,null,null,null,null,null,null,null,null,null,null,null,"Carol",258.27659574468083,25877.042553191488,19892.524680851064]
["Mitchell",261,26146,21178.260000000002,null,"Craig",275.54000000000002,27600.36,21618.705600000001,0.27668883191600524,null,null,null,null,null,null,null,null,null,null,null,null,null,"Christina",285.04545454545456,28560.43181818182,21668.049090909091]
["Christina",166,16621,14626.48,null,"Daniel",304.15555555555557,30466.755555555555,23964.185333333335,0.27134534855968484,null,null,null,null,null,null,null,null,null,null,null,null,null,"Craig",275.54000000000002,27600.36,21618.705600000001]
["Nakyun",376,37653,26357.1,null,"Debra",255.91836734693877,25638.428571428572,19780.087346938773,0.2961736781913884,null,null,null,null,null,null,null,null,null,null,null,null,null,"Daniel",304.15555555555557,30466.755555555555,23964.185333333335]
["Mitchell",160,16018,12013.5,null,"Denise",280.14999999999998,28060.799999999999,22304.945750000003,0.25805282445037991,null,null,null,null,null,null,null,null,null,null,null,null,null,"Debra",255.91836734693877,25638.428571428572,19780.087346938773]
["Daniel",318,31850,25161.5,null,"Elain",273.20588235294116,27370.735294117647,21194.774705882355,0.29139071652982595,null,null,null,null,null,null,null,null,null,null,null,null,null,"Denise",280.14999999999998,28060.799999999999,22304.945750000003]
["Mi",295,29517,23318.43,null,"Ewelina",282.45238095238096,28290.928571428572,20885.99380952381,0.35454069504359342,null,null,null,null,null,null,null,null,null,null,null,null,null,"Elain",273.20588235294116,27370.735294117647,21194.774705882355]
["Richard",474,47477,36557.29,null,"Gianna",253.84090909090909,25430.977272727272,19419.810454545459,0.30953787279498512,null,null,null,null,null,null,null,null,null,null,null,null,null,"Ewelina",282.45238095238096,28290.928571428572,20885.99380952381]
["Kaur",90,9008,7656.8,null,"Janita",271.08108108108109,27156.135135135137,20953.290810810809,0.29603198754460003,null,null,null,null,null,null,null,null,null,null,null,null,null,"Gianna",253.84090909090909,25430.977272727272,19419.810454545459]
["Ewelina",135,13547,9347.4299999999985,null,"Jason",309.02272727272725,30942.454545454544,24487.056590909091,0.26362490447063536,null,null,null,null,null,null,null,null,null,null,null,null,null,"Janita",271.08108108108109,27156.135135135137,20953.290810810809]
["Ewelina",491,49100,43699,null,"Kaur",269.19607843137254,26969.568627450979,20541.285098039218,0.31294456499342282,null,null,null,null,null,null,null,null,null,null,null,null,null,"Jason",309.02272727272725,30942.454545454544,24487.056590909091]
["Mitchell",263,26324,17373.839999999997,null,"Manavbir",260.80851063829789,26131.553191489362,20331.017446808506,0.28530474482433754,null,null,null,null,null,null,null,null,null,null,null,null,null,"Kaur",269.19607843137254,26969.568627450979,20541.285098039218]
["Nelia",386,38612,32047.96,null,"Mansa",279.53333333333336,28004.577777777777,22554.02444444444,0.24166655253740887,null,null,null,null,null,null,null,null,null,null,null,null,null,"Manavbir",260.80851063829789,26131.553191489362,20331.017446808506]
["Craig",409,40900,29448,null,"Mi",250.76785714285714,25124.803571428572,19765.716607142858,0.27113041590149423,null,null,null,null,null,null,null,null,null,null,null,null,null,"Mansa",279.53333333333336,28004.577777777777,22554.02444444444]
["Carol",267,26761,21944.02,null,"Michael",290.78260869565219,29128.608695652172,22621.03282608695,0.2876781055752935,null,null,null,null,null,null,null,null,null,null,null,null,null,"Mi",250.76785714285714,25124.803571428572,19765.716607142858]
["Nelia",215,21598,17278.400000000001,null,"Michelle",313.78260869565219,31428.608695652172,24007.967391304348,0.30909077738232726,null,null,null,null,null,null,null,null,null,null,null,null,null,"Michael",290.78260869565219,29128.608695652172,22621.03282608695]
["Denise",66,6625,4770,null,"Mitchell",311.0181818181818,31141.763636363637,23805.128545454543,0.30819556705607387,null,null,null,null,null,null,null,null,null,null,null,null,null,"Michelle",313.78260869565219,31428.608695652172,24007.967391304348]
["Richard",377,37758,31339.14,null,"Nakyun",293.15384615384613,29366.673076923078,22675.897115384614,0.29506113594945993,null,null,null,null,null,null,null,null,null,null,null,null,null,"Mitchell",311.0181818181818,31141.763636363637,23805.128545454543]
["Nelia",454,45437,35895.230000000003,null,"Nelia",253.53846153846155,25397.76923076923,19897.514423076922,0.27642924089619814,null,null,null,null,null,null,null,null,null,null,null,null,null,"Nakyun",293.15384615384613,29366.673076923078,22675.897115384614]
["Nelia",181,18107,15934.16,null,"Richard",259.50980392156862,26003.333333333332,20303.61294117647,0.28072444094901061,null,null,null,null,null,null,null,null,null,null,null,null,null,"Nelia",253.53846153846155,25397.76923076923,19897.514423076922]
["Richard",392,39241,26683.879999999997,null,"Sarah",305.46666666666664,30597.7,23649.82233333333,0.29378138950642163,null,null,null,null,null,null,null,null,null,null,null,null,null,"Richard",259.50980392156862,26003.333333333332,20303.61294117647]
["Sarah",75,7544,5280.7999999999993,null,"Shari",252.38297872340425,25290.531914893618,19454.699361702129,0.29997032823235048,null,null,null,null,null,null,null,null,null,null,null,null,null,"Sarah",305.46666666666664,30597.7,23649.82233333333]
["Nakyun",380,38052,30441.600000000002,null,"Sykes",274.77777777777777,27521.955555555556,21601.479111111108,0.27407736359123414,null,null,null,null,null,null,null,null,null,null,null,null,null,"Shari",252.38297872340425,25290.531914893618,19454.699361702129]
["Janita",272,27275,19365.25,null,"Yla-Katrina",252.63333333333333,25309.25,19851.254333333331,0.27494462440601808,null,null,null,null,null,null,null,null,null,null,null,null,null,"Sykes",274.77777777777777,27521.955555555556,21601.479111111108]
["Kaur",325,32573,25406.940000000002,null,null,null,null,null,null,null,null,null,null,null,null,null,null,null,null,null,null,null,"Yla-Katrina",252.63333333333333,25309.25,19851.254333333331]
["Shari",323,32327,28771.03,null,null,null,null,null,null,null,null,null,null,null,null,null,null,null,null,null,null,null,"Grand Total",276.48444070647605,27696.707317073171,21479.470899915887]
["Shari",152,15245,12653.349999999999]
["Yla-Katrina",386,38620,29737.4]
["Denise",264,26444,21419.640000000003]
["Richard",401,40199,34973.129999999997]
["Carol",360,36011,25207.699999999997]
["Michelle",454,45422,34974.94]
["Nakyun",402,40283,28198.1]
["Ewelina",378,37862,25367.539999999997]
["Janita",478,47855,34455.599999999999]
["Nelia",293,29383,24094.06]
["Mi",363,36334,29793.88]
["Nakyun",403,40325,27017.749999999996]
["Manavbir",72,7257,5007.33]
["Janita",64,6429,5078.91]
["Manavbir",326,32666,22212.879999999997]
["Shari",145,14516,9435.4]
["Manavbir",177,17731,14007.49]
["Mi",407,40705,28900.55]
["Craig",79,7940,7146]
["Nelia",160,16064,11084.16]
["Shari",341,34144,30729.600000000002]
["Michael",327,32784,29505.600000000002]
["Elain",99,9958,7468.5]
["Nelia",480,48074,32690.319999999996]
["Gianna",361,36132,24931.079999999998]
["Denise",112,11251,8663.27]
["Denise",479,47943,40272.119999999995]
["Jason",441,44129,30007.719999999998]
["Craig",77,7793,5299.24]
["Richard",147,14712,9709.9199999999983]
["Craig",451,45146,30699.279999999999]
["Debra",219,21954,15148.259999999998]
["Ewelina",333,33319,21990.539999999997]
["Manavbir",76,7638,5881.26]
["Richard",156,15678,10661.039999999999]
["Sarah",71,7138,5710.4000000000005]
["Gianna",408,40848,28593.599999999999]
["Nelia",327,32714,24535.5]
["Sarah",468,46889,37980.090000000004]
["Manavbir",256,25614,18698.22]
["Kaur",52,5294,3917.56]
["Elain",194,19448,16141.839999999998]
["Gianna",72,7232,5134.7199999999993]
["Debra",491,49129,41268.36]
["Jason",107,10720,9112]
["Shari",88,8892,8002.8]
["Nelia",150,15063,10995.99]
["Sarah",443,44344,38579.279999999999]
["Jason",486,48600,43254]
["Mitchell",282,28247,25422.3]
["Gianna",444,44470,36020.700000000004]
["Jason",98,9839,6887.2999999999993]
["Michael",95,9584,6900.48]
["Sarah",122,12220,10020.400000000001]
["Richard",155,15578,12773.960000000001]
["Sarah",454,45413,34968.01]
["Gianna",319,31959,22051.71]
["Mi",231,23107,15943.829999999998]
["Sarah",283,28368,22694.400000000001]
["Michael",364,36489,30285.87]
["Yla-Katrina",56,5612,3872.2799999999997]
["Christina",369,36978,28473.06]
["Craig",244,24439,18329.25]
["Mitchell",267,26715,21906.300000000003]
["Mi",238,23882,19822.059999999998]
["Craig",214,21426,18212.099999999999]
["Mitchell",383,38312,29883.360000000001]
["Mi",235,23551,17192.23]
["Nakyun",288,28866,21360.84]
["Nelia",88,8812,7754.56]
["Sarah",619,61911,45195.03]
["Manavbir",169,16958,13057.66]
["Mi",179,17952,15977.28]
["Elain",332,33291,27298.620000000003]
["Mi",68,6800,5576]
["Carol",249,24953,17716.629999999997]
["Nakyun",316,31603,20857.979999999996]
["Michael",309,30943,20731.809999999998]
["Kaur",382,38208,32476.799999999999]
["Mitchell",351,35127,31263.03]
["Sykes",435,43569,39212.1]
["Carol",416,41682,32928.78]
["Mansa",428,42821,35969.64]
["Richard",207,20726,14508.199999999999]
["Sykes",259,25969,21294.58]
["Christina",461,46134,40597.919999999998]
["Jason",438,43807,28474.55]
["Sarah",485,48593,32071.379999999997]
["Mitchell",437,43707,35839.740000000005]
["Mitchell",454,45405,30421.35]
["Debra",78,7850,6829.5]
["Manavbir",360,36076,29221.56]
["Nakyun",201,20109,17293.739999999998]
["Michelle",327,32743,22265.239999999998]
["Denise",195,19508,14435.92]
["Mitchell",160,16002,13441.68]
["Nelia",164,16402,13285.62]
["Mitchell",124,12451,10707.86]
["Michelle",466,46644,37315.200000000004]
["Carol",442,44253,35844.93]
["Christina",494,49494,36130.620000000003]
["Nakyun",473,47340,41659.199999999997]
["Carol",66,6681,5879.28]
["Nelia",409,40975,29092.25]
["Michelle",491,49190,42795.3]
["Mansa",329,32908,28300.880000000001]
["Nelia",78,7894,6552.0199999999995]
["Yla-Katrina",312,31206,23404.5]
["Mi",452,45239,33929.25]
["Jason",322,32214,28348.32]
["Richard",140,14015,10230.949999999999]
["Daniel",347,34706,25335.38]
["Janita",456,45676,39281.360000000001]
["Ewelina",74,7488,6514.56]
["Denise",304,30415,25852.75]
["Janita",197,19724,13806.8]
["Christina",52,5252,3518.8399999999997]
["Sykes",392,39222,29024.28]
["Gianna",114,11449,9960.6299999999992]
["Ewelina",398,39876,28710.719999999998]
["Michelle",417,41728,32965.120000000003]
["Kaur",487,48797,36109.78]
["Gianna",395,39504,33183.360000000001]
["Michael",143,14342,12477.539999999999]
["Jason",302,30224,26899.360000000001]
["Craig",382,38293,32166.12]
["Richard",433,43317,36386.28]
["Denise",341,34112,23196.159999999996]
["Michael",480,48024,39859.919999999998]
["Kaur",478,47831,33003.39]
["Michael",446,44663,39303.440000000002]
["Jason",367,36798,26126.579999999998]
["Yla-Katrina",213,21365,14955.499999999998]
["Nakyun",459,45944,33539.120000000003]
["Mitchell",335,33527,27156.870000000003]
["Sykes",480,48077,39423.14]
["Mi",169,16983,12737.25]
["Michelle",62,6251,4375.7]
["Kaur",209,20968,14048.559999999998]
["Mitchell",97,9759,6343.35]
["Shari",118,11835,8166.15]
["Mansa",141,14181,12337.47]
["Carol",101,10117,6778.3899999999994]
["Ewelina",484,48418,31471.7]
["Carol",362,36245,27183.75]
["Denise",313,31306,21914.199999999997]
["Daniel",72,7240,4706]
["Yla-Katrina",148,14883,11311.08]
["Carol",138,13871,10680.67]
["Mi",267,26792,22505.279999999999]
["Sarah",131,13150,9205]
["Ewelina",478,47850,31102.5]
["Denise",405,40529,34044.36]
["Debra",350,35013,31511.7]
["Janita",164,16459,12838.02]
["Nakyun",108,10897,7083.05]
["Craig",243,24361,16565.48]
["Kaur",447,44746,36244.26]
["Jason",207,20768,14329.919999999998]
["Michelle",225,22517,16662.579999999998]
["Yla-Katrina",113,11307,8254.11]
["Craig",140,14094,9302.0399999999991]
["Yla-Katrina",391,39123,32863.32]
["Kaur",280,28032,18220.8]
["Carol",102,10296,7927.92]
["Daniel",429,42922,30045.399999999998]
["Elain",379,37938,25418.459999999995]
["Richard",108,10818,7356.24]
["Mi",110,11023,8046.79]
["Yla-Katrina",239,23907,16973.969999999998]
["Mi",843,84341,55665.05999999999]
["Daniel",148,14845,10688.4]
["Debra",279,27986,22108.940000000002]
["Michael",337,33726,29341.62]
["Michelle",334,33481,27119.61]
["Sarah",465,46579,37263.200000000004]
["Denise",236,23604,17703]
["Gianna",380,38016,25470.719999999998]
["Sarah",185,18547,13168.369999999999]
["Mi",410,41094,34108.019999999997]
["Janita",105,10588,8576.2800000000007]
["Sarah",474,47493,40843.979999999996]
["Nelia",349,34971,28326.510000000002]
["Michael",234,23413,17793.88]
["Janita",498,49867,36402.909999999996]
["Elain",117,11745,9043.65]
["Mi",94,9451,6237.6599999999989]
["Mitchell",485,48527,32998.36]
["Nakyun",323,32380,28818.2]
["Denise",84,8402,7225.72]
["Christina",402,40229,32183.200000000001]
["Kaur",119,11941,7761.6500000000005]
["Craig",75,7598,5850.46]
["Mi",72,7226,4985.9399999999996]
["Elain",471,47146,37245.340000000004]
["Kaur",485,48535,33003.799999999996]
["Yla-Katrina",88,8838,6628.5]
["Daniel",138,13845,9414.5999999999985]
["Debra",439,43911,32055.03]
["Jason",489,48938,38661.020000000004]
["Craig",263,26349,21869.67]
["Daniel",465,46577,41453.53]
["Sykes",75,7542,5731.92]
["Craig",424,42462,28874.159999999996]
["Mitchell",216,21637,15145.9]
["Mitchell",238,23836,20975.68]
["Yla-Katrina",54,5407,4487.8099999999995]
["Debra",271,27142,18999.399999999998]
["Ewelina",459,45973,35858.94]
["Carol",316,31678,21857.82]
["Kaur",222,22202,17095.54]
["Jason",401,40146,34927.019999999997]
["Shari",406,40689,26854.739999999998]
["Michael",349,34941,24458.699999999997]
["Richard",57,5774,5196.6000000000004]
["Denise",229,22946,18586.260000000002]
["Kaur",107,10727,9117.9499999999989]
["Daniel",64,6427,4370.3599999999997]
["Denise",409,40983,29097.93]
["Shari",278,27878,20908.5]
["Michael",224,22496,17771.84]
["Jason",167,16731,12548.25]
["Nakyun",435,43564,33108.639999999999]
["Nakyun",208,20898,14837.58]
["Nakyun",161,16167,11478.57]
["Jason",193,19304,15250.16]
["Mi",495,49558,36672.92]
["Debra",143,14373,10348.56]
["Mi",319,31995,28795.5]
["Sykes",451,45150,36120]
["Mitchell",100,10053,8645.58]
["Craig",226,22612,19672.439999999999]
["Janita",104,10439,7202.91]
["Jason",264,26481,19066.32]
["Yla-Katrina",244,24448,20536.32]
["Gianna",136,13656,12153.84]
["Michelle",251,25184,18888]
["Denise",233,23349,18912.690000000002]
["Denise",90,9096,6458.16]
["Yla-Katrina",83,8374,7536.6]
["Craig",475,47501,42750.9]
["Debra",440,44007,30364.829999999998]
["Debra",153,15399,13859.1]
["Mi",375,37590,33831]
["Gianna",181,18199,15651.14]
["Debra",479,47968,40293.119999999995]
["Yla-Katrina",289,28941,19969.289999999997]
["Christina",423,42362,36854.94]
["Richard",336,33614,26891.200000000001]
["Nelia",60,6046,5260.0199999999995]
["Manavbir",475,47527,33268.9]
["Michelle",365,36535,29958.7]
["Denise",423,42345,36840.15]
["Craig",236,23694,18955.2]
["Nelia",94,9440,7929.5999999999995]
["Sykes",246,24657,18739.32]
["Christina",378,37870,24994.199999999997]
["Mansa",306,30641,24819.210000000003]
["Mi",173,17354,14403.82]
["Michelle",114,11498,9313.380000000001]
["Carol",280,28088,24998.32]
["Richard",103,10357,8803.4499999999989]
["Carol",383,38344,28374.560000000001]
["Mi",240,24051,20924.37]
["Mansa",139,13989,12310.32]
["Janita",314,31421,25136.800000000003]
["Nelia",336,33653,23557.1]
["Sarah",219,21935,14477.099999999999]
["Richard",155,15527,11800.52]
["Nelia",136,13689,10540.53]
["Denise",610,61035,51879.75]
["Gianna",266,26689,20550.53]
["Elain",324,32440,25627.600000000002]
["Christina",303,30375,23692.5]
["Elain",198,19863,15493.140000000001]
["Craig",87,8754,6040.2599999999993]
["Debra",92,9277,6308.36]
["Yla-Katrina",227,22707,17030.25]
["Mi",69,6965,5989.9]
["Gianna",443,44347,33260.25]
["Michael",53,5327,4581.22]
["Sarah",293,29380,21447.399999999998]
["Kaur",135,13564,9087.8799999999992]
["Manavbir",430,43079,35324.780000000006]
["Yla-Katrina",314,31417,27332.79]
["Mitchell",390,39035,26934.149999999998]
["Richard",426,42648,29000.639999999996]
["Nakyun",227,22714,17035.5]
["Carol",389,38929,28418.17]
["Mansa",496,49670,36259.1]
["Craig",355,35552,31285.759999999998]
["Manavbir",313,31306,28175.4]
["Manavbir",64,6432,4695.3599999999997]
["Elain",232,23208,18798.48]
["Elain",393,39351,27152.19]
["Carol",493,49361,40969.629999999997]
["Richard",479,47967,32617.559999999998]
["Janita",212,21203,18446.61]
["Jason",60,6019,4454.0600000000004]
["Janita",51,5159,3353.35]
["Elain",266,26631,21571.11]
["Christina",291,29166,20999.52]
["Sarah",281,28114,21928.920000000002]
["Kaur",213,21329,18769.52]
["Craig",61,6195,5141.8499999999995]
["Michael",308,30818,27428.02]
["Debra",287,28737,22989.600000000002]
["Christina",268,26855,17455.75]
["Sykes",65,6522,5152.38]
["Carol",185,18519,12778.109999999999]
["Nakyun",406,40619,36150.910000000003]
["Jason",463,46307,36582.53]
["Elain",377,37743,24532.95]
["Yla-Katrina",351,35176,30603.119999999999]
["Sarah",215,21573,18121.32]
["Denise",257,25778,16755.7]
["Sykes",73,7358,5665.66]
["Michelle",437,43754,28440.100000000002]
["Elain",67,6738,5659.92]
["Janita",270,27030,22434.899999999998]
["Jason",381,38189,32460.649999999998]
["Sykes",287,28769,22152.13]
["Denise",108,10865,9017.9499999999989]
["Nakyun",105,10587,8363.73]
["Sarah",222,22267,15809.57]
["Mansa",152,15214,13692.6]
["Nakyun",320,32041,20826.650000000001]
["Sykes",66,6664,5797.68]
["Mansa",51,5167,4030.26]
["Christina",436,43654,29248.179999999997]
["Mitchell",351,35145,27413.100000000002]
["Nakyun",154,15473,13770.97]
["Sarah",86,8635,6303.55]
["Craig",167,16770,11403.599999999999]
["Kaur",462,46271,32852.409999999996]
["Mi",119,11914,8816.36]
["Mansa",201,20113,17297.18]
["Richard",176,17645,11469.25]
["Sarah",103,10320,6914.4]
["Sykes",403,40362,33096.840000000004]
["Sykes",163,16308,11089.439999999999]
["Sarah",319,31926,21390.42]
["Mitchell",307,30781,25548.23]
["Mansa",234,23470,17837.2]
["Nelia",81,8146,5620.74]
["Mitchell",129,12907,11616.300000000001]
["Yla-Katrina",281,28110,21925.8]
["Daniel",103,10352,8592.16]
["Sarah",422,42277,34667.14]
["Manavbir",140,14040,9828]
["Debra",242,24222,20588.7]
["Carol",116,11622,8251.619999999999]
["Craig",224,22470,15054.899999999998]
["Ewelina",409,40967,27038.219999999998]
["Craig",285,28534,24253.899999999998]
["Yla-Katrina",175,17579,12832.67]
["Mi",189,18950,14970.5]
["Carol",304,30452,23448.04]
["Mi",239,23999,15839.339999999998]
["Gianna",213,21391,16898.89]
["Daniel",70,7023,4986.33]
["Jason",329,32947,27675.48]
["Carol",158,15859,10942.71]
["Debra",232,23275,16292.499999999998]
["Nakyun",478,47824,38737.440000000002]
["Mitchell",321,32143,24428.68]
["Gianna",281,28160,24499.200000000001]
["Sarah",393,39399,28367.279999999999]
["Gianna",213,21354,15801.96]
["Daniel",152,15272,12217.6]
["Elain",797,79756,59019.44]
["Mansa",351,35133,22836.45]
["Michelle",403,40375,27051.249999999996]
["Nelia",343,34345,27132.550000000003]
["Manavbir",99,9979,7484.25]
["Denise",240,24007,19205.600000000002]
["Christina",116,11615,10221.200000000001]
["Yla-Katrina",376,37605,33092.400000000001]
["Yla-Katrina",407,40732,36658.800000000003]
["Michelle",400,40034,28824.48]
["Sarah",438,43849,33325.24]
["Michelle",487,48799,33183.32]
["Richard",318,31813,21950.969999999998]
["Elain",110,11093,7210.45]
["Sykes",57,5742,4134.24]
["Kaur",401,40194,27331.919999999998]
["Christina",411,41133,27559.109999999997]
["Mitchell",194,19410,12810.599999999999]
["Mitchell",343,34376,30594.639999999999]
["Richard",360,36010,31328.7]
["Carol",186,18623,13967.25]
["Kaur",172,17280,11232]
["Richard",65,6550,5829.5]
["Daniel",316,31661,21529.48]
["Shari",120,12062,9890.84]
["Craig",274,27479,24731.100000000002]
["Craig",149,14944,12104.640000000001]
["Debra",116,11620,9412.2000000000007]
["Sarah",484,48485,36848.6]
["Michael",464,46460,35774.200000000004]
["Kaur",90,9036,6415.5599999999995]
["Mi",190,19017,14262.75]
["Mi",466,46672,33603.839999999997]
["Carol",359,35922,26941.5]
["Yla-Katrina",69,6913,5046.49]
["Ewelina",355,35569,29166.58]
["Carol",462,46275,39796.5]
["Sykes",397,39738,34572.06]
["Janita",142,14240,10822.4]
["Mansa",257,25768,16749.2]
["Mansa",396,39626,35267.14]
["Janita",335,33529,28499.649999999998]
["Carol",200,20056,15242.56]
["Michelle",275,27554,18185.64]
["Kaur",78,7803,5384.07]
["Nakyun",120,12044,8551.24]
["Carol",269,26987,24288.3]
["Carol",52,5231,3818.63]
["Janita",180,18028,14242.12]
["Mansa",227,22701,18614.82]
["Craig",280,28066,18804.219999999998]
["Yla-Katrina",212,21219,16763.010000000002]
["Shari",132,13231,8864.7699999999986]
["Kaur",453,45316,34893.32]
["Michael",272,27239,23970.32]
["Daniel",449,44965,32824.449999999997]
["Elain",145,14550,11931]
["Sarah",328,32846,27590.639999999999]
["Michelle",263,26315,17367.899999999998]
["Janita",261,26159,19096.07]
["Mansa",458,45837,35752.86]
["Debra",478,47813,32512.839999999997]
["Denise",355,35590,23845.3]
["Daniel",429,42916,29612.039999999997]
["Gianna",458,45836,37127.160000000003]
["Michael",205,20507,17430.95]
["Debra",130,13084,10728.880000000001]
["Richard",205,20582,18112.16]
["Mi",480,48001,37440.78]
["Daniel",405,40594,26386.100000000002]
["Craig",421,42154,27400.100000000002]
["Sarah",54,5460,3767.3999999999996]
["Mansa",379,37976,33039.120000000003]
["Yla-Katrina",390,39011,33159.35]
["Sykes",408,40840,32263.600000000002]
["Manavbir",402,40202,26935.339999999997]
["Debra",207,20750,17845]
["Manavbir",348,34877,23018.819999999996]
["Jason",429,42906,35611.979999999996]
["Janita",343,34359,28861.559999999998]
["Nelia",119,11938,9789.16]
["Daniel",438,43849,39025.61]
["Sykes",61,6197,5453.36]
["Michelle",383,38351,30680.800000000003]
["Nelia",119,11912,8219.2799999999988]
["Carol",238,23837,17877.75]
["Sarah",130,13045,10957.8]
["Mitchell",232,23261,19771.849999999999]
["Michael",229,22960,18597.600000000002]
["Yla-Katrina",241,24137,18585.490000000002]
["Sykes",366,36616,27828.16]
["Richard",218,21885,15757.199999999999]
["Craig",457,45796,31141.279999999999]
["Carol",413,41349,27290.339999999997]
["Ewelina",303,30315,22736.25]
["Yla-Katrina",495,49593,37194.75]
["Daniel",489,48982,37716.14]
["Carol",187,18711,14220.36]
["Nelia",203,20356,17302.599999999999]
["Mansa",493,49304,42894.48]
["Mitchell",868,86845,59923.049999999996]
["Shari",272,27261,19355.309999999998]
["Shari",211,21145,15435.85]
["Janita",155,15564,11361.72]
["Daniel",133,13391,11917.99]
["Gianna",247,24788,17351.599999999999]
["Michael",455,45520,32774.400000000001]
["Michael",349,34961,29017.629999999997]
["Christina",455,45551,34618.76]
["Craig",61,6109,5314.83]
["Christina",356,35601,24920.699999999997]
["Yla-Katrina",306,30631,21441.699999999997]
["Michelle",312,31287,20962.289999999997]
["Janita",422,42219,32930.82]
["Nakyun",209,20933,18211.71]
["Yla-Katrina",297,29736,26762.400000000001]
["Shari",368,36834,32413.920000000002]
["Sykes",95,9576,8331.1200000000008]
["Richard",307,30788,23398.880000000001]
["Denise",141,14167,10483.58]
["Craig",284,28462,21915.74]
["Christina",140,14092,10569]
["Jason",57,5707,4223.18]
["Nelia",201,20164,17341.04]
["Michelle",160,16087,11260.9]
["Nelia",217,21774,17854.68]
["Christina",105,10579,9309.52]
["Denise",425,42566,37458.080000000002]
["Sarah",323,32327,26184.870000000003]
["Manavbir",316,31600,24332]
["Janita",496,49683,35771.760000000002]
["Nakyun",240,24078,16373.039999999999]
["Kaur",498,49861,37395.75]
["Christina",82,8291,6632.8]
["Mitchell",427,42746,34624.26]
["Yla-Katrina",268,26851,18795.699999999997]
["Elain",254,25461,18841.14]
["Mansa",225,22507,20256.3]
["Daniel",257,25771,21647.64]
["Shari",150,15092,11469.92]
["Yla-Katrina",400,40001,32400.81]
["Kaur",366,36626,30033.320000000003]
["Jason",187,18727,13296.17]
["Sarah",458,45834,36667.200000000004]
["Daniel",487,48794,38059.32]
["Shari",484,48492,35399.159999999996]
["Debra",181,18196,12737.199999999999]
["Yla-Katrina",173,17338,11443.079999999998]
["Craig",203,20327,13415.819999999998]
["Nakyun",264,26406,20332.62]
["Nelia",233,23338,17736.88]
["Jason",385,38511,27727.919999999998]
["Debra",93,9359,7393.6100000000006]
["Nelia",59,5933,5102.38]
["Daniel",201,20113,13676.839999999998]
["Gianna",260,26036,20828.800000000003]
["Mi",223,22301,20070.900000000001]
["Michael",395,39584,32458.880000000001]
["Sykes",479,47969,35976.75]
["Mitchell",327,32765,25229.05]
["Kaur",495,49576,44122.64]
["Jason",442,44273,35418.400000000001]
["Christina",433,43325,34226.75]
["Kaur",494,49482,32658.119999999995]
["Carol",159,15986,11829.64]
["Elain",167,16777,12414.98]
["Mi",229,22904,19697.439999999999]
["Christina",210,21010,14917.099999999999]
["Mitchell",403,40322,26209.3]
["Michelle",235,23550,18604.5]
["Kaur",53,5347,4277.6000000000004]
["Yla-Katrina",109,10921,8736.8000000000011]
["Daniel",422,42298,32146.48]
["Kaur",313,31382,26988.52]
["Richard",244,24401,19032.78]
["Debra",263,26307,17625.689999999999]
["Carol",328,32818,23628.959999999999]
["Kaur",224,22474,17979.2]
["Nelia",155,15515,13032.6]
["Michelle",296,29624,24291.68]
["Elain",306,30686,26696.82]
["Yla-Katrina",386,38636,26658.839999999997]
["Manavbir",98,9894,6727.9199999999992]
["Yla-Katrina",56,5639,4229.25]
["Mi",65,6597,5277.6]
["Gianna",355,35547,23461.019999999997]
["Mitchell",312,31205,28084.5]
["Richard",430,43084,34467.200000000004]
["Yla-Katrina",175,17593,12842.89]
["Sarah",356,35657,28169.030000000002]
["Daniel",405,40550,34062]
["Jason",208,20846,16259.880000000001]
["Nakyun",354,35429,26571.75]
["Shari",214,21451,18662.37]
["Carol",88,8819,7055.2000000000007]
["Nelia",187,18755,14628.9]
["Michael",239,23929,17228.88]
["Craig",366,36627,24906.359999999997]
["Manavbir",70,7088,5741.2800000000007]
["Manavbir",145,14548,10620.039999999999]
["Sykes",977,97748,70378.559999999998]
["Denise",383,38305,32942.300000000003]
["Michael",134,13424,11007.68]
["Elain",264,26412,21921.96]
["Mansa",264,26415,22981.05]
["Shari",314,31459,27369.329999999998]
["Michelle",239,23910,20801.7]
["Sarah",291,29130,21847.5]
["Mi",392,39211,34505.68]
["Nakyun",78,7873,6377.13]
["Sarah",173,17355,12842.7]
["Manavbir",371,37143,29714.400000000001]
["Michael",452,45224,32109.039999999997]
["Mi",116,11659,9210.61]
["Debra",91,9144,6400.7999999999993]
["Richard",306,30654,23603.58]
["Mi",395,39597,31677.600000000002]
["Ewelina",367,36715,32676.350000000002]
["Carol",419,41954,32724.120000000003]
["Michael",215,21580,15105.999999999998]
["Michelle",226,22671,18136.8]
["Sarah",134,13493,9040.31]
["Daniel",273,27320,22129.200000000001]
["Shari",295,29524,25095.399999999998]
["Ewelina",308,30856,21290.639999999999]
["Nakyun",304,30489,19817.850000000002]
["Christina",457,45713,40684.57]
["Sarah",361,36134,23487.100000000002]
["Craig",430,43001,32250.75]
["Manavbir",150,15091,10563.699999999999]
["Ewelina",460,46081,34560.75]
["Nelia",428,42888,33023.760000000002]
["Ewelina",286,28640,22052.799999999999]
["Sykes",361,36121,32147.69]
["Janita",182,18253,13324.69]
["Ewelina",299,29915,22137.1]
["Jason",177,17790,14765.699999999999]
["Shari",99,9937,7452.75]
["Debra",111,11140,7686.5999999999995]
["Yla-Katrina",390,39064,25391.600000000002]
["Richard",236,23646,17261.579999999998]
["Yla-Katrina",107,10701,8988.84]
["Ewelina",169,16982,12566.68]
["Elain",167,16741,12555.75]
["Mitchell",276,27665,18812.199999999997]
["Yla-Katrina",101,10112,8898.56]
["Mansa",248,24839,18877.64]
["Kaur",78,7826,5086.9000000000005]
["Mitchell",327,32763,25555.14]
["Shari",388,38854,28751.96]
["Kaur",462,46268,37939.760000000002]
["Ewelina",167,16701,12358.74]
["Christina",467,46725,34109.25]
["Christina",145,14586,12981.54]
["Shari",183,18386,14341.08]
["Richard",404,40483,32791.230000000003]
["Mitchell",487,48751,43875.9]
["Daniel",481,48109,38968.29]
["Craig",271,27120,23865.599999999999]
["Richard",392,39260,30622.799999999999]
["Elain",277,27737,21634.86]
["Manavbir",148,14897,10576.869999999999]
["Daniel",210,21085,15181.199999999999]
["Craig",179,17910,13074.3]
["Jason",448,44811,32263.919999999998]
["Michelle",70,7042,5351.92]
["Carol",240,24058,16600.02]
["Shari",87,8763,6835.14]
["Janita",384,38446,29218.959999999999]
["Gianna",99,9913,7930.4000000000005]
["Yla-Katrina",468,46898,41739.22]
["Mansa",336,33652,29277.24]
["Michelle",351,35100,30537]
["Richard",230,23045,16361.949999999999]
["Mitchell",319,31972,23979]
["Shari",144,14446,12134.64]
["Mi",484,48467,35380.909999999996]
["Denise",128,12821,9743.9600000000009]
["Mi",261,26138,22478.68]
["Christina",274,27414,21657.06]
["Michael",301,30142,21400.82]
["Ewelina",109,10961,8549.58]
["Gianna",159,15946,13075.720000000001]
["Christina",268,26878,17470.7]
["Christina",443,44389,31960.079999999998]
["Nakyun",400,40017,30412.920000000002]
["Christina",155,15597,10761.929999999998]
["Shari",270,27047,23801.360000000001]
["Manavbir",141,14143,9334.3799999999992]
["Richard",400,40008,35207.040000000001]
["Ewelina",440,44096,29544.319999999996]
["Sarah",409,40983,34425.72]
["Nakyun",98,9886,8897.4]
["Sykes",231,23116,17105.84]
["Ewelina",180,18060,14628.6]
["Michael",202,20264,16211.2]
["Michael",458,45809,31608.21]
["Mi",115,11547,9814.9499999999989]
["Mansa",130,13042,10433.6]
["Mitchell",268,26800,24120]
["Janita",902,90280,63195.999999999993]
["Manavbir",91,9109,8198.1]
["Sykes",409,40932,31517.64]
["Mansa",161,16135,10810.449999999999]
["Kaur",234,23459,19940.149999999998]
["Daniel",141,14123,10874.710000000001]
["Mitchell",448,44845,36324.450000000004]
["Michelle",177,17721,14354.01]
["Richard",263,26304,22884.48]
["Carol",256,25661,18219.309999999998]
["Yla-Katrina",143,14392,12952.800000000001]
["Nakyun",161,16157,11309.9]
["Sarah",141,14132,11870.88]
["Kaur",492,49273,37447.480000000003]
["Ewelina",138,13849,9694.2999999999993]
["Nakyun",272,27291,21014.07]
["Christina",339,33921,23744.699999999997]
["Jason",404,40446,34379.1]
["Jason",170,17021,11744.49]
["Sarah",465,46580,34469.199999999997]
["Mansa",480,48066,41336.76]
["Michelle",275,27538,20378.12]
["Ewelina",321,32128,21204.479999999996]
["Craig",396,39674,25788.100000000002]
["Shari",231,23130,18504]
["Nakyun",339,33904,22715.679999999997]
["Nelia",146,14637,11270.49]
["Nakyun",474,47428,42210.92]
["Mi",138,13838,8994.7000000000007]
["Michael",168,16881,12998.37]
["Carol",143,14379,10928.04]
["Sarah",221,22124,14380.6]
["Nakyun",493,49315,43890.35]
["Gianna",119,11956,9803.92]
["Yla-Katrina",445,44574,33876.239999999998]
["Michelle",207,20756,16397.240000000002]
["Sykes",163,16312,14354.56]
["Yla-Katrina",346,34660,24955.200000000001]
["Shari",89,8942,6527.66]
["Mi",261,26128,21686.239999999998]
["Mansa",327,32722,28140.92]
["Sarah",462,46258,38394.14]
["Nelia",347,34719,28816.769999999997]
["Kaur",459,45941,34915.160000000003]
["Manavbir",269,26935,18585.149999999998]
["Christina",391,39176,28206.719999999998]
["Richard",216,21657,14943.329999999998]
["Carol",105,10570,7716.0999999999995]
["Richard",438,43862,36405.46]
["Mansa",99,9983,6988.0999999999995]
["Richard",233,23370,16125.3]
["Nakyun",438,43844,38582.720000000001]
["Denise",111,11125,9790]
["Shari",375,37519,31140.769999999997]
["Mi",270,27063,22462.289999999997]
["Daniel",353,35383,31490.87]
["Nakyun",193,19372,15303.880000000001]
["Debra",204,20448,15336]
["Shari",492,49282,32033.300000000003]
["Christina",385,38596,25859.319999999996]
["Michael",257,25703,21076.460000000003]
["Mitchell",313,31332,21619.079999999998]
["Mansa",306,30645,26048.25]
["Nelia",366,36606,29284.800000000003]
["Daniel",137,13797,11727.449999999999]
["Mitchell",314,31406,22926.38]
["Kaur",334,33411,24724.14]
["Gianna",335,33552,21808.799999999999]
["Nakyun",206,20676,14059.679999999998]
["Carol",304,30417,24333.600000000002]
["Carol",259,25995,21055.95]
["Christina",127,12739,8280.35]
["Michelle",315,31557,26192.309999999998]
["Sarah",100,10032,8928.48]
["Michelle",394,39470,25655.5]
["Michael",225,22539,17355.03]
["Debra",255,25550,20184.5]
["Nakyun",292,29257,19309.62]
["Yla-Katrina",284,28493,21084.82]
["Jason",76,7648,6424.32]
["Christina",308,30846,21592.199999999997]
["Michelle",435,43550,31791.5]
["Richard",472,47215,38716.300000000003]
["Yla-Katrina",54,5496,3792.24]
["Michael",297,29747,19930.489999999998]
["Sykes",53,5338,4804.2]
["Craig",181,18120,12321.599999999999]
["Jason",63,6392,4921.84]
["Sykes",326,32660,21555.599999999999]
["Nakyun",456,45676,29689.4]
["Kaur",77,7709,6552.65]
["Mitchell",491,49195,32960.649999999994]
["Michael",192,19299,14860.23]
["Kaur",205,20571,15839.67]
["Sykes",379,37946,26182.739999999998]
["Ewelina",101,10131,8611.35]
["Carol",134,13434,11956.26]
["Debra",314,31442,20751.719999999998]
["Debra",103,10335,7751.25]
["Manavbir",465,46598,40074.28]
["Denise",919,91999,67159.27]
["Carol",473,47327,33128.9]
["Manavbir",479,47918,42167.840000000004]
["Ewelina",484,48401,39204.810000000005]
["Kaur",192,19238,16737.060000000001]
["Gianna",309,30945,24446.550000000003]
["Debra",177,17720,15593.6]
["Debra",221,22159,17505.61]
["Debra",466,46663,31730.839999999997]
["Mansa",367,36772,26475.84]
["Mitchell",401,40136,26891.119999999995]
["Michael",271,27150,24163.5]
["Elain",129,12909,10069.02]
["Michelle",294,29454,21795.96]
["Shari",396,39636,26159.759999999998]
["Kaur",454,45453,33180.69]
["Michelle",421,42179,35008.57]
["Denise",241,24157,15943.619999999997]
["Michelle",233,23397,18483.63]
["Carol",165,16521,12886.380000000001]
["Sarah",290,29024,24960.639999999999]
["Nelia",101,10116,6878.8799999999992]
["Debra",354,35470,30504.2]
["Elain",439,43904,38196.480000000003]
["Manavbir",85,8514,7066.62]
["Ewelina",140,14068,10691.68]
["Sarah",399,39902,27931.399999999998]
["Gianna",168,16838,10944.7]
["Sykes",448,44876,30066.92]
["Nelia",197,19756,12841.4]
["Mansa",271,27188,18215.96]
["Craig",86,8612,6114.5199999999995]
["Craig",268,26813,17696.579999999998]
["Michelle",482,48273,39583.86]
["Daniel",436,43690,33204.400000000001]
["Christina",110,11032,9708.16]
["Mansa",248,24823,19361.940000000002]
["Ewelina",306,30620,23883.600000000002]
["Denise",187,18760,16508.8]
["Michelle",497,49728,36798.720000000001]
["Denise",486,48660,43794]
["Mi",98,9821,6972.91]
["Michael",322,32203,22220.07]
["Nakyun",390,39081,32437.23]
["Janita",51,5131,3540.39]
["Sarah",496,49684,35275.64]
["Sarah",469,46903,39867.549999999996]
["Sykes",118,11827,9579.8700000000008]
["Manavbir",123,12327,8628.9]
["Michelle",145,14572,10637.56]
["Janita",307,30719,23960.82]
["Sykes",281,28135,22789.350000000002]
["Debra",460,46055,35001.800000000003]
["Daniel",152,15210,13689]
["Denise",212,21207,17389.740000000002]
["Mitchell",248,24863,21879.439999999999]
["Kaur",70,7030,5764.6]
["Nelia",415,41520,34876.799999999996]
["Debra",372,37222,28288.720000000001]
["Sykes",211,21190,18435.3]
["Gianna",201,20186,18167.400000000001]
["Gianna",118,11831,9109.8700000000008]
["Sykes",199,19908,15329.16]
["Kaur",493,49350,35532]
["Jason",192,19259,14444.25]
["Shari",221,22190,14645.399999999998]
["Yla-Katrina",350,35007,28005.600000000002]
["Shari",413,41335,32654.65]
["Michael",486,48686,35540.78]
["Gianna",426,42607,37920.230000000003]
["Debra",332,33204,29551.56]
["Kaur",220,22096,14362.4]
["Nelia",343,34324,29518.639999999999]
["Jason",406,40664,30091.360000000001]
["Shari",158,15864,11739.36]
["Ewelina",105,10531,9267.2800000000007]
["Shari",391,39168,26242.559999999998]
["Denise",117,11776,9538.5600000000013]
["Michelle",294,29477,19160.05]
["Ewelina",120,12062,8202.16]
["Gianna",56,5640,4906.8]
["Jason",225,22513,17785.27]
["Mi",453,45336,36268.800000000003]
["Ewelina",247,24720,18045.599999999999]
["Nelia",306,30635,21138.149999999998]
["Mi",96,9661,6472.869999999999]
["Sarah",428,42839,38555.1]
["Sarah",255,25523,18887.02]
["Sykes",285,28504,22803.200000000001]
["Christina",62,6293,4782.68]
["Sarah",311,31146,24293.88]
["Christina",309,30955,26311.75]
["Nakyun",217,21729,14993.009999999998]
["Manavbir",492,49296,42394.559999999998]
["Yla-Katrina",261,26142,22482.12]
["Ewelina",137,13778,12124.64]
["Richard",98,9897,7026.87]
["Mi",397,39740,35368.6]
["Mitchell",135,13509,11752.83]
["Ewelina",270,27044,20283]
["Craig",743,74314,63910.04]
["Nelia",289,28920,18798]
["Yla-Katrina",99,9974,8976.6]
["Manavbir",317,31732,28241.48]
["Nelia",400,40076,27251.679999999997]
["Denise",160,16031,14267.59]
["Janita",67,6797,4893.84]
["Manavbir",420,42023,31097.02]
["Sykes",211,21100,18146]
["Daniel",284,28491,18804.059999999998]
["Sykes",156,15606,13889.34]
["Janita",415,41515,32796.85]
["Sarah",168,16873,11136.179999999998]
["Debra",387,38794,32586.959999999999]
["Craig",443,44308,38991.040000000001]
["Christina",499,49993,38494.61]
["Michael",376,37615,30092]
["Manavbir",77,7742,5109.7199999999993]
["Sarah",56,5645,5080.5]
["Yla-Katrina",56,5685,4320.6000000000004]
["Gianna",231,23159,20611.510000000002]
["Debra",69,6991,5243.25]
["Nakyun",67,6740,4718]
["Elain",406,40674,33759.42]
["Kaur",283,28314,19253.519999999997]
["Sarah",465,46574,35396.239999999998]
["Debra",310,31027,27614.03]
["Yla-Katrina",76,7656,5512.32]
["Jason",469,46970,38515.4]
["Michelle",460,46003,40482.639999999999]
["Sykes",284,28458,25327.62]
["Shari",198,19854,17272.98]
["Shari",323,32344,21993.919999999998]
["Shari",59,5994,4495.5]
["Gianna",271,27156,24168.84]
["Nakyun",142,14281,10567.94]
["Jason",149,14972,12426.76]
["Mansa",400,40097,26063.05]
["Manavbir",288,28801,21888.760000000002]
["Richard",159,15990,12312.300000000001]
["Shari",187,18752,13313.92]
["Richard",165,16506,12049.38]
["Gianna",376,37606,30084.800000000003]
["Michelle",72,7218,4691.7]
["Mitchell",319,31935,20757.75]
["Gianna",53,5315,3826.7999999999997]
["Manavbir",332,33215,29229.200000000001]
["Christina",287,28745,19834.05]
["Nelia",318,31832,24828.959999999999]
["Nelia",343,34300,22295]
["Denise",52,5225,3657.4999999999995]
["Christina",150,15047,10081.49]
["Janita",208,20898,15464.52]
["Janita",199,19952,13168.319999999998]
["Nelia",81,8172,6864.48]
["Jason",489,48908,39126.400000000001]
["Craig",106,10684,7799.32]
["Nelia",416,41622,33713.82]
["Daniel",492,49252,42356.72]
["Manavbir",348,34889,24771.19]
["Manavbir",94,9492,8163.12]
["Denise",331,33194,25559.38]
["Mansa",292,29241,25147.26]
["Mitchell",219,21907,14239.550000000001]
["Ewelina",160,16067,11246.9]
["Craig",65,6531,5812.59]
["Elain",254,25439,22640.71]
["Christina",245,24527,21583.759999999998]
["Ewelina",71,7180,5672.2]
["Nelia",220,22005,19364.400000000001]
["Gianna",117,11744,10099.84]
["Denise",144,14449,12137.16]
["Craig",105,10565,8452]
["Sarah",138,13824,10920.960000000001]
["Mitchell",241,24156,15701.4]
["Elain",181,18126,15044.58]
["Mi",72,7232,4917.7599999999993]
["Denise",461,46140,38757.599999999999]
["Ewelina",237,23787,16175.159999999998]
["Ewelina",439,43910,31176.1]
["Richard",382,38292,31399.440000000002]
["Gianna",338,33896,23388.239999999998]
["Elain",227,22753,14789.45]
["Nakyun",377,37720,29421.600000000002]
["Debra",97,9726,8267.1]
["Sykes",58,5863,5042.18]
["Yla-Katrina",164,16491,11048.97]
["Christina",206,20680,16130.400000000001]
["Manavbir",484,48427,39710.14]
["Nakyun",338,33846,26738.34]
["Christina",197,19747,16192.54]
["Michael",277,27760,19154.399999999998]
["Janita",241,24121,21467.69]
["Yla-Katrina",206,20680,16957.600000000002]
["Carol",64,6428,5078.12]
["Mansa",319,31928,27458.079999999998]
["Mansa",211,21156,17982.599999999999]
["Shari",332,33275,28283.75]
["Kaur",491,49194,39847.14]
["Daniel",440,44016,38734.080000000002]
["Sarah",808,80843,65482.83]
["Elain",146,14694,12049.080000000002]
["Elain",396,39648,28943.040000000001]
["Ewelina",265,26518,18562.599999999999]
["Sarah",349,34995,24496.5]
["Michael",76,7624,6556.64]
["Kaur",123,12384,8916.48]
["Gianna",328,32828,22979.599999999999]
["Manavbir",399,39964,27175.519999999997]
["Janita",162,16262,13009.6]
["Sarah",201,20171,18153.900000000001]
["Sykes",162,16267,14314.960000000001]
["Manavbir",65,6574,4470.32]
["Shari",224,22443,18852.12]
["Sykes",134,13408,11128.64]
["Denise",148,14887,10718.64]
["Denise",463,46397,35261.72]
["Gianna",278,27849,20608.259999999998]
["Jason",426,42605,29823.499999999996]
["Mansa",65,6518,4823.32]
["Sykes",393,39339,35405.1]
["Michael",484,48498,36858.480000000003]
["Carol",277,27777,21943.83]
["Gianna",203,20343,14240.099999999999]
["Yla-Katrina",463,46323,30109.95]
["Nelia",285,28573,25715.7]
["Jason",461,46165,37393.65]
["Mi",59,5956,3930.9599999999996]
["Kaur",141,14167,10625.25]
["Manavbir",442,44274,30106.319999999996]
["Nakyun",127,12703,8892.0999999999985]
["Janita",190,19020,16547.400000000001]
["Sykes",352,35250,23969.999999999996]
["Craig",376,37653,31251.989999999998]
["Michael",227,22742,16146.82]
["Kaur",93,9351,8322.39]
["Jason",57,5728,4811.5199999999995]
["Sarah",309,30954,20120.100000000002]
["Yla-Katrina",254,25478,17579.82]
["Nelia",329,32928,29305.920000000002]
["Michelle",445,44508,34716.239999999998]
["Sykes",73,7372,6045.0400000000009]
["Mansa",446,44681,37532.04]
["Sarah",140,14033,11928.05]
["Mitchell",371,37165,32333.55]
["Craig",330,33055,28757.85]
["Mitchell",289,28993,24933.98]
["Mitchell",384,38464,30001.920000000002]
["Gianna",191,19196,13821.119999999999]
["Kaur",58,5837,4961.45]
["Shari",97,9719,7289.25]
["Kaur",266,26689,21884.980000000003]
["Carol",450,45008,35106.239999999998]
["Mitchell",228,22865,15319.55]
["Kaur",68,6815,6133.5]
["Nelia",307,30738,25819.919999999998]
["Mi",195,19591,14693.25]
["Richard",373,37379,31772.149999999998]
["Manavbir",125,12519,10766.34]
["Shari",315,31556,23035.88]
["Mi",245,24516,19612.8]
["Shari",147,14710,12062.2]
["Mi",95,9576,8331.1200000000008]
["Mansa",350,35097,26673.72]
["Janita",193,19328,15655.68]
["Nakyun",259,25983,19747.080000000002]
["Mansa",200,20096,17483.52]
["Daniel",144,14409,10950.84]
["Gianna",311,31115,20847.05]
["Shari",228,22804,15050.639999999998]
["Sykes",394,39457,28803.61]
["Michelle",246,24621,17727.12]
["Mi",70,7003,5182.22]
["Ewelina",226,22663,15410.839999999998]
["Sykes",449,44908,31884.679999999997]
["Debra",260,26013,21070.530000000002]
["Yla-Katrina",228,22851,20108.88]
["Michael",90,9067,7706.95]
["Nelia",132,13246,11259.1]
["Manavbir",436,43687,34075.86]
["Nelia",265,26513,19089.36]
["Daniel",157,15716,12729.960000000001]
["Mitchell",239,23915,16262.199999999999]
["Janita",412,41265,35487.9]
["Gianna",209,20900,15257]
["Richard",280,28091,25000.99]
["Yla-Katrina",452,45219,38436.15]
["Richard",476,47640,34300.799999999996]
["Daniel",430,43014,37852.32]
["Denise",344,34433,30989.7]
["Nakyun",300,30018,24614.760000000002]
["Mitchell",325,32586,27046.379999999997]
["Richard",161,16165,13740.25]
["Debra",52,5217,4643.13]
["Shari",347,34784,29914.239999999998]
["Debra",419,41967,28537.559999999998]
["Janita",378,37874,28405.5]
["Daniel",134,13491,11737.17]
["Michael",499,49996,37996.959999999999]
["Gianna",166,16673,11004.179999999998]
["Michelle",693,69329,56156.490000000005]
["Mansa",134,13431,10744.800000000001]
["Mitchell",326,32621,21856.069999999996]
["Craig",76,7630,5112.0999999999995]
["Sarah",309,30935,25366.7]
["Jason",472,47240,36847.200000000004]
["Sarah",365,36560,30344.799999999999]
["Elain",294,29430,25898.400000000001]
["Manavbir",426,42684,36708.239999999998]
["Elain",348,34889,26864.53]
["Daniel",384,38484,28863]
["Daniel",334,33470,29453.599999999999]
["Michelle",129,12937,8926.5299999999988]
["Mitchell",464,46404,34803]
["Nakyun",353,35356,26517]
["Jason",459,45992,39553.120000000003]
["Mi",232,23270,20012.2]
["Mi",74,7449,5139.8099999999995]
["Craig",395,39531,34787.279999999999]
["Ewelina",388,38810,28331.3]
["Shari",311,31145,22112.949999999997]
["Manavbir",212,21299,16826.21]
["Mitchell",296,29699,20789.3]
["Jason",498,49837,44853.3]
["Elain",229,22945,14914.25]
["Sarah",216,21695,15186.499999999998]
["Carol",444,44441,39996.9]
["Mi",205,20554,16854.280000000002]
["Craig",401,40164,30926.280000000002]
["Debra",111,11115,9114.3000000000011]
["Michelle",177,17782,15114.699999999999]
["Yla-Katrina",400,40051,30038.25]
["Nelia",381,38192,28262.079999999998]
["Debra",95,9571,8135.3499999999995]
["Michael",334,33483,26451.57]
["Yla-Katrina",269,26926,23964.14]
["Nakyun",311,31142,26782.12]
["Richard",107,10784,8195.84]
["Daniel",484,48452,36823.519999999997]
["Daniel",357,35710,27139.599999999999]
["Ewelina",142,14256,9266.4]
["Kaur",240,24050,20923.5]
["Yla-Katrina",320,32077,25020.06]
["Yla-Katrina",426,42696,33729.840000000004]
["Nelia",492,49256,43837.840000000004]
["Mitchell",161,16116,10636.56]
["Richard",187,18765,15762.599999999999]
["Gianna",372,37202,28273.52]
["Daniel",238,23840,20740.8]
["Craig",376,37606,33845.4]
["Yla-Katrina",99,9972,8775.36]
["Michael",203,20391,16312.800000000001]
["Debra",423,42338,28366.459999999995]
["Mansa",488,48891,36179.339999999997]
["Mansa",370,37080,32259.599999999999]
["Christina",125,12590,10575.6]
["Christina",242,24283,20640.55]
["Richard",70,7022,5898.48]
["Richard",181,18164,15439.4]
["Ewelina",484,48405,36787.800000000003]
["Mansa",196,19688,13190.96]
["Debra",314,31466,28004.74]
["Mi",463,46330,35210.800000000003]
["Mi",131,13157,9999.32]
["Jason",403,40343,30257.25]
["Mansa",185,18595,16735.5]
["Craig",491,49116,42730.92]
["Kaur",66,6619,5229.01]
["Craig",447,44764,39392.32]
["Jason",330,33033,29399.37]
["Shari",267,26782,18479.579999999998]
["Carol",124,12470,9103.1]
["Nakyun",465,46584,38664.720000000001]
["Manavbir",448,44827,39447.760000000002]
["Daniel",463,46347,40785.360000000001]
["Debra",279,27946,20680.04]
["Daniel",426,42652,28576.839999999997]
["Debra",360,36063,27047.25]
["Michael",172,17278,12958.5]
["Michael",381,38101,27051.71]
["Mansa",160,16020,12495.6]
["Gianna",189,18954,14215.5]
["Nakyun",284,28470,24484.2]
["Yla-Katrina",373,37361,30262.410000000003]
["Carol",214,21445,16083.75]
["Debra",241,24125,16405]
["Shari",479,47917,39771.11]
["Richard",78,7870,6610.8]
["Mi",422,42284,36364.239999999998]
["Mansa",263,26379,22949.73]
["Elain",304,30481,23775.18]

{"sheet":"Credit Analysis","index":19,"n_rows":18,"n_cols":12,"rows_kept":18,"cut":false,"hidden":false,"merged":[]}
["Rule 1",{"$f":"\"Account Not Suspended, No Overdue Balance and Last Year's Sales > \"&DOLLAR(F6)&\"\"","v":"Account Not Suspended, No Overdue Balance and Last Year's Sales > $50,000.00"}]
["Rule 2","Account Not Suspended and Both Credit Hurdles must be met and at least 1 of the remaining criteria must be met"]
[]
["Formula Inputs"]
["Customer Name","Account Suspended?","Rating1 Hurdle","Rating2 Hurdle","Asset Value","Last Year's Sales","Over Due Balance"]
[null,"Yes",2.5,4.5,200000,50000,"Yes"]
[]
["Customer Credit Analysis For Accounts Receivable"]
[{"$f":"A5","v":"Customer Name"},"Account Suspended?","Rating1","Rating2","Asset Value","Last Year's Sales","Over Due Balance",{"$f":"A1&CHAR(10)&B1","v":"Rule 1\nAccount Not Suspended, No Overdue Balance and Last Year's Sales > $50,000.00"},{"$f":"A2&CHAR(10)&B2","v":"Rule 2\nAccount Not Suspended and Both Credit Hurdles must be met and at least 1 of the remaining criteria must be met"},"NONE\nFail Both Rules","ONLY:  Two rules are false, but Asset Hurdle Met","Decision"]
["Cust01",null,5,7.4,208339,90550,null,{"$f":"AND(B10<>B$6,G10<>G$6,F10>F$6)","v":true},{"$f":"AND(B10<>B$6,C10>=C$6,D10>=D$6,OR(E10>=E$6,F10>=F$6,G10<>G$6))","v":true},{"$f":"NOT(OR(H10:I10))","v":false},{"$f":"AND(NOT(OR(H10:I10)),E10>=E$6)","v":false}]
["Cust02",null,5,5.9,374775,51255,"Yes",{"$f":"AND(B11<>B$6,G11<>G$6,F11>F$6)","v":false},{"$f":"AND(B11<>B$6,C11>=C$6,D11>=D$6,OR(E11>=E$6,F11>=F$6,G11<>G$6))","v":true},false,{"$f":"AND(NOT(OR(H11:I11)),E11>=E$6)","v":false}]
["Cust03",null,3.3,3.9,371040,56241,null,true,false,false,false]
["Cust04","Yes",1.2,2.4,331439,69920,null,false,false,true,true]
["Cust05","Yes",3.4,5.3,150000,58534,"Yes",false,false,true,false]
["Cust06",null,4.5,6,336794,60423,"Yes",false,true,false,false]
["Cust07",null,4.4000000000000004,2.4,500000,49850,null,false,false,true,true]
["Cust08",null,2.9,5.5,375800,62100,null,true,true,false,false]
["Cust09",null,2.5,8.9,254888,75000,null,true,true,false,false]