{"text_format":"1","workbook":"xlsx","n_sheets":10,"sheets":["IntoToExcel","Keyboard Shortcuts","1 Calculate","2 Data Analysis(1)","2 Data Analysis(2)","3 Charts","Cell References","Formatting","Percentage Calculations","Sheet1"],"not_rendered":{"charts":0,"images":0,"macros":0,"external_links":0,"defined_names":6,"comments":0,"pivot_tables":0},"unopened":[],"bounds":{"document_bytes":16777216,"sheet_cells":100000,"rows_first":2000,"rows_last":500,"rows_between":2000,"halvings":0,"cell_chars":16384,"cell_head_chars":4096},"cells_cut":0,"cells_raw":0,"read":"whole","date_system":"1900"}

{"sheet":"IntoToExcel","index":0,"n_rows":15,"n_cols":8,"rows_kept":15,"cut":false,"hidden":false,"merged":[]}
[null,{"$f":"LEFT(ADDRESS(ROW(B1),COLUMN(B1),4),1)&\" Column\"","v":"B Column"}]
[{"$f":"MID(ADDRESS(ROW(A2),COLUMN(A2),4),2,1)&\" Row\"","v":"2 Row"},{"$f":"ADDRESS(ROW(B2),COLUMN(B2),4)&\" Cell\"","v":"B2 Cell"},{"$f":"MID(ADDRESS(ROW(A2),COLUMN(A2),4),2,1)&\" Row\"","v":"2 Row"},"2 Row","2 Row","2 Row","2 Row","2 Row"]
[null,{"$f":"LEFT(ADDRESS(ROW(B3),COLUMN(B3),4),1)&\" Column\"","v":"B Column"}]
[null,"B Column"]
[null,"B Column"]
[null,"B Column"]
[null,"B Column"]
[null,"B Column"]
[null,"B Column"]
[null,"B Column"]
[]
[]
[]
[]
[null,"Install Data Analysis Add-in!!!!!"]

{"sheet":"Keyboard Shortcuts","index":1,"n_rows":72,"n_cols":6,"rows_kept":72,"cut":false,"hidden":false,"merged":[]}
["Key","Alone","Shift","Ctrl","Alt","Shift Ctrl"]
["F1","Help","What's This Help",null,"Insert Chart Sheet"]
["F2","Edit Mode","Edit Comment",null,"Save As"]
["F3","Paste Name Formula","Paste Function","Define Name",null,"Names From Labels"]
["F4","Repeat Action","Find Again","Close Window","Quit Excel"]
["F5","Goto","Find","Restore Window Size"]
["F6","Next Pane","Prev Pane","Next Workbook","Switch To VBA","Prev Workbook"]
["F7","Spell Check",null,"Move Window"]
["F8","Extend Selection","Add To Selection","Resize Window","Macro List"]
["F9","Calculate All","Calculate Worksheet","Minimize Workbook"]
["F10","Activate Menu","Context Menu","Restore Workbook"]
["F11","New Chart","New Worksheet","New Macro Sheet","VB Editor"]
["F12","Save As","Save","Open",null,"Print"]
["A",null,null,"Select All ",null,"Formula Arguments"]
["B",null,null,"Bold"]
["C",null,null,"Copy"]
["D",null,null,"Fill Down","Data Menu"]
["E",null,null,null,"Edit Menu"]
["F",null,null,"Find","File Menu","Font Name"]
["G",null,null,"Goto"]
["H",null,null,"Replace","Help Menu"]
["I",null,null,"Italics","Insert Menu"]
["J"]
["K",null,null,"Insert  Hyperlink"]
["L"]
["M"]
["N",null,null,"New Workbook"]
["O",null,null,"Open Workbook","Format Menu","Select Comments"]
["P",null,null,"Print",null,"Font Size"]
["Q"]
["R",null,null,"Fill Right"]
["S",null,null,"Save"]
["T",null,null,null,"Tools Menu"]
["U",null,null,"Underline"]
["V",null,null,"Paste"]
["W",null,null,"Close Workbook","Window Menu"]
["X",null,null,"Cut"]
["Y",null,null,"Repeat Active"]
["Z",null,null,"Undo"]
["` (~)",null,null,"Toggle Formula View",null,"General Format"]
["1 (!)",null,null,"Cell Format",null,"Number Format"]
["2 (@)",null,null,"Toggle Bold",null,"Time Format"]
["3 (#)",null,null,"Toggle Italics",null,"Date Format"]
["4 ($)",null,null,"Toggle Underline",null,"Currency Format"]
["5 (%)",null,null,"Toggle Strikethru",null,"Percent Format"]
["6 (^)",null,null,"a",null,"Exponent Format"]
["7 (&)",null,null,"a",null,"Apply Border"]
["8 (*)",null,null,"Outline",null,"Select Region"]
["9 (()",null,null,"Hide Rows",null,"Unhide Rows"]
["0 ())",null,null,"Hide Columns",null,"Unhide Columns"]
["-",null,null,"Delete Selection","Control Menu","No Border"]
["= (+)","Formula",null,null,"Auto Sum","Insert dialog"]
["[",null,null,"Direct Dependents",null,"Direct Precedents"]
["]",null,null,"All Dependents",null,"All Precedents"]
["; (semicolon)",null,null,"Insert Date","Select Visible Cells","Insert Time"]
["' (apostrophe)",null,null,null,"Style","Copy Cell Value Above"]
[": (colon)",null,null,"Insert Time"]
["/",null,null,"Select Array",null,"Select Array"]
["\\",null,null,"Select Differences",null,"Select Unequal Cells"]
["Insert","Insert Mode",null,"Copy"]
["Delete","Clear",null,"Delete To End Of Line"]
["Home","Begin Row",null,"Start Of Worksheet"]
["End","End Row",null,"End Of Worksheet"]
["Page Up","Page Up",null,"Previous Worksheet","Left 1 screen"]
["Page Down","Page Down",null,"Next Worksheet","Right 1 screen"]
["Left Arrow","Move Left","Select Left","Move Left Area"]
["Right Arrow","Move Right","Select Right","Move Right Area"]
["Up Arrow","Move Up","Select Up","Move Up Area"]
["Down Arrow","Move Down","Select Down","Move Down Area","Drop down list"]
["Space Bar","Space","Select Row","Select Column","Control Box","Select All"]
["Tab","Move Right","Move Left","Next Window","Next Application","Previous Window"]
["BackSpace",null,null,"Goto Active Cell"]

{"sheet":"1 Calculate","index":2,"n_rows":31,"n_cols":3,"rows_kept":31,"cut":false,"hidden":false,"merged":[]}
["You already know the order of operations (left to right): Parenthesis, Exponents, Multiply/Divide, Add/Subtract"]
["You must learn Excel's Operation Symbols"]
["Parenthesis"," ( )","Shift + 9 and Shift + 0"]
["Exponents"," ^","Shift + 6"]
["Multiply"," *","Number pad"]
["Divide"," /","Number pad"]
["Add"," +","Number pad"]
["Subtract"," -","Number pad"]
["Join"," &","Shift + 7"]
["Equal"," =","Left of Backspace"]
["Greater than"," >","Shift + ."]
["Greater than or equal to"," >=","2 characters next to each other"]
["Less than"," <","Shift + ,"]
["Less than or equal to"," <=","2 characters next to each other"]
["Not"," <>","2 characters next to each other"]
[]
["When you make calculations, you can use Formulas"]
["Formulas Start with the Equal Sign"]
[]
["Formula for arithmetic",null,"Formula that uses Function"]
["X",null,"Scores"]
[14,null,100]
["Average",null,69]
[10.5,null,43]
["(X-Average)^2",null,95]
[null,null,88]
[null,null,"SUM"]
[null,null,"Mean = SUM/COUNT ="]
["Text Formula",null,"Mean = Average ="]
[]
[null,null,"TRUE/FALSE formula"]

{"sheet":"2 Data Analysis(1)","index":3,"n_rows":594,"n_cols":6,"rows_kept":594,"cut":false,"hidden":false,"merged":[]}
["Sorting can be done with the A to Z or Z to A buttons on the Data Ribbon: BE SURE TO ONLY HAVE ONE CELL SELECTED IN THE COLUMNS THAT YOU WANT TO SORT UPON."]
["PivotTables are one of the  most powerful features In Excel. They can summarize data with multiple criteria. The key to Pivot Tables is to understand Columns and Rows."]
[]
["Date","Sales Rep","Customer","Sales","COGS","Region"]
["2008-02-12","Joy","Fred Myer",132,80.52,"MidWest"]
["2006-07-25","Joy","Fred Myer",88,61.6,"NorthWest"]
["2006-01-13","Tom","Safeway",70,51.8,"NorthWest"]
["2008-06-02","Joy","Safeway",119,61.88,"East"]
["2007-06-10","Chin","Whole Foods",519,285.45,"NorthWest"]
["2007-07-17","Tina","Whole Foods",58,24.36,"West"]
["2008-04-10","Tom","Safeway",184,77.28,"MidWest"]
["2006-04-26","Chin","Coop",1960,1509.2,"NorthWest"]
["2006-08-25","Joy","Whole Foods",249,129.47999999999999,"NorthWest"]
["2006-11-06","Joy","Coop",188,112.8,"NorthWest"]
["2007-12-20","Sioux","Fred Myer",69,36.57,"NorthWest"]
["2007-07-11","Sioux","Whole Foods",244,173.24,"East"]
["2005-06-19","Tina","Fred Myer",174,113.1,"MidWest"]
["2005-07-25","Tina","Fred Myer",161,98.21,"West"]
["2007-04-13","Chin","Coop",100,43,"NorthEast"]
["2006-08-11","Tina","Fred Myer",235,157.44999999999999,"East"]
["2006-02-06","Tom","Fred Myer",185,146.15,"East"]
["2005-06-16","Sioux","Safeway",1656,1275.1199999999999,"MidWest"]
["2005-12-08","Sioux","PCC",214,162.63999999999999,"NorthWest"]
["2007-05-06","Sioux","Coop",192,138.24,"MidWest"]
["2006-04-12","Tina","PCC",53,29.68,"NorthWest"]
["2006-02-28","Tina","Coop",628,263.76,"East"]
["2006-07-17","Chin","PCC",88,37.840000000000003,"East"]
["2007-12-07","Chin","PCC",75,47.25,"NorthEast"]
["2008-02-25","Joy","Fred Myer",131,96.94,"MidWest"]
["2007-01-10","Chin","Fred Myer",128,80.64,"West"]
["2007-05-12","Chin","Safeway",155,80.599999999999994,"NorthEast"]
["2008-05-06","Tom","Coop",1020,479.4,"NorthWest"]
["2006-06-26","Chin","PCC",136,108.8,"East"]
["2008-01-29","Sioux","Safeway",160,91.2,"NorthEast"]
["2007-10-23","Sioux","Coop",124,80.599999999999994,"NorthEast"]
["2007-03-31","Joy","Coop",196,148.96,"MidWest"]
["2006-05-23","Chin","Safeway",141,105.75,"MidWest"]
["2005-10-03","Chin","Fred Myer",223,115.96,"NorthWest"]
["2007-01-02","Sioux","Coop",85,61.2,"NorthWest"]
["2005-07-21","Tina","Whole Foods",248,151.28,"MidWest"]
["2007-05-14","Tom","Coop",104,61.36,"NorthWest"]
["2006-03-13","Chin","Fred Myer",1550,868,"West"]
["2007-10-17","Chin","Safeway",698,488.6,"NorthEast"]
["2007-01-14","Tom","Safeway",203,87.29,"East"]
["2008-02-10","Tom","Safeway",78,44.46,"NorthEast"]
["2006-04-20","Chin","Fred Myer",138,99.36,"NorthWest"]
["2006-05-17","Sioux","PCC",139,59.77,"NorthWest"]
["2005-08-23","Tom","Whole Foods",178,115.7,"NorthWest"]
["2006-08-18","Joy","Whole Foods",203,154.28,"NorthEast"]
["2006-03-01","Tom","Whole Foods",90,61.2,"West"]
["2007-12-27","Sioux","Coop",131,55.02,"NorthWest"]
["2008-06-22","Joy","Safeway",1407,830.13,"East"]
["2006-03-26","Tom","Safeway",160,123.2,"NorthEast"]
["2006-04-06","Tina","PCC",55,26.95,"NorthEast"]
["2007-09-10","Tina","Whole Foods",139,88.96,"MidWest"]
["2007-01-30","Joy","Whole Foods",237,123.24,"West"]
["2006-04-24","Sioux","PCC",185,138.75,"NorthEast"]
["2006-05-15","Tom","Whole Foods",222,170.94,"West"]
["2008-03-02","Chin","Safeway",77,31.57,"NorthWest"]
["2007-02-20","Joy","Fred Myer",750,502.5,"NorthWest"]
["2007-05-29","Sioux","Whole Foods",149,119.2,"East"]
["2006-04-11","Tom","Fred Myer",1779,1298.67,"East"]
["2005-10-12","Sioux","Safeway",52,38.479999999999997,"NorthWest"]
["2007-11-05","Tom","Safeway",155,120.9,"NorthWest"]
["2006-09-15","Joy","PCC",160,124.8,"West"]
["2006-04-30","Chin","Safeway",217,171.43,"NorthEast"]
["2008-04-23","Chin","Safeway",219,146.72999999999999,"East"]
["2007-10-15","Tom","Coop",68,31.28,"West"]
["2007-12-03","Joy","Coop",139,65.33,"NorthEast"]
["2006-04-02","Tom","Fred Myer",150,88.5,"East"]
["2007-01-17","Chin","Safeway",88,37.840000000000003,"MidWest"]
["2007-12-03","Tom","Coop",1336,868.4,"NorthEast"]
["2007-04-17","Chin","Safeway",163,130.4,"West"]
["2006-02-06","Tom","Coop",220,116.6,"East"]
["2005-09-19","Joy","PCC",83,60.59,"East"]
["2006-10-05","Tom","PCC",55,28.6,"MidWest"]
["2007-12-03","Joy","PCC",1028,771,"East"]
["2007-02-03","Chin","Fred Myer",63,27.09,"East"]
["2005-07-02","Tina","PCC",143,81.510000000000005,"NorthEast"]
["2008-05-21","Chin","Whole Foods",62,29.14,"NorthEast"]
["2007-07-01","Sioux","Fred Myer",55,23.1,"NorthEast"]
["2006-12-25","Chin","Whole Foods",1369,876.16,"MidWest"]
["2007-04-18","Joy","Coop",60,48,"West"]
["2007-01-08","Tom","Fred Myer",62,47.12,"NorthEast"]
["2007-12-17","Chin","Fred Myer",137,100.01,"NorthEast"]
["2007-03-01","Sioux","Fred Myer",84,59.64,"MidWest"]
["2007-08-07","Tom","Safeway",55,37.4,"NorthEast"]
["2008-02-26","Tom","Whole Foods",237,158.79,"MidWest"]
["2006-02-23","Tina","Fred Myer",127,85.09,"NorthWest"]
["2008-04-18","Tom","Fred Myer",183,78.69,"NorthEast"]
["2006-05-30","Sioux","PCC",124,79.36,"NorthEast"]
["2008-02-12","Joy","Coop",1095,558.45000000000005,"MidWest"]
["2006-02-23","Chin","Whole Foods",160,94.4,"NorthWest"]
["2008-03-20","Joy","Coop",870,609,"MidWest"]
["2006-01-07","Sioux","Coop",93,60.45,"NorthEast"]
["2008-02-17","Sioux","Safeway",193,108.08,"East"]
["2007-03-08","Tina","PCC",212,125.08,"West"]
["2007-06-19","Sioux","Fred Myer",93,68.819999999999993,"East"]
["2006-10-18","Tom","Coop",80,48.8,"East"]
["2007-11-22","Chin","Safeway",204,99.96,"NorthEast"]
["2007-05-03","Tina","Fred Myer",228,114,"NorthWest"]
["2005-11-09","Chin","Coop",1399,1077.23,"East"]
["2007-12-07","Tina","PCC",187,143.99,"East"]
["2006-10-19","Tom","Fred Myer",163,122.25,"West"]
["2008-03-30","Sioux","PCC",63,30.24,"MidWest"]
["2005-06-30","Tina","Coop",197,98.5,"East"]
["2006-10-11","Tina","Fred Myer",237,137.46,"MidWest"]
["2005-08-05","Sioux","Safeway",140,107.8,"MidWest"]
["2008-01-12","Sioux","Coop",141,83.19,"NorthWest"]
["2007-09-30","Tina","Coop",98,43.12,"MidWest"]
["2008-01-23","Tina","Fred Myer",510,280.5,"MidWest"]
["2005-10-06","Tom","Coop",1010,606,"MidWest"]
["2007-05-01","Joy","PCC",114,54.72,"East"]
["2007-06-09","Sioux","Whole Foods",220,99,"MidWest"]
["2006-03-28","Joy","PCC",92,59.8,"NorthWest"]
["2005-08-08","Tom","PCC",180,79.2,"NorthEast"]
["2006-08-17","Sioux","PCC",180,131.4,"MidWest"]
["2007-04-30","Chin","Coop",81,34.020000000000003,"NorthEast"]
["2006-01-24","Joy","PCC",178,133.5,"NorthWest"]
["2005-07-16","Sioux","Safeway",73,32.85,"East"]
{"$rows_left_out":475}
{"sheet":"2 Data Analysis(2)","index":4,"n_rows":388,"n_cols":2,"rows_kept":388,"cut":false,"hidden":false,"merged":[]}
["To Count a set of data, drop the field into the Row Labels area and the Value area. To Change the function, format or formula for a Pivot Table, Right-click the Value field in the PivotTable and point to \"Value Field Settings\"."]
[]
["Student","Phone Type"]
["Student 01",{"$f":"CHOOSE(RANDBETWEEN(1,8),\"iPhone\",\"iPhone\",\"Nokia\",\"Nokia\",\"Motorola\",\"Sony Erickson\",\"Samsung\",\"Sprint\")","v":"iPhone"}]
["Student 02",{"$f":"CHOOSE(RANDBETWEEN(1,8),\"iPhone\",\"iPhone\",\"Nokia\",\"Nokia\",\"Motorola\",\"Sony Erickson\",\"Samsung\",\"Sprint\")","v":"iPhone"}]
["Student 03","Nokia"]
["Student 04","iPhone"]
["Student 05","Sprint"]
["Student 06","Motorola"]
["Student 07","Motorola"]
["Student 08","Nokia"]
["Student 09","Nokia"]
["Student 10","Samsung"]
["Student 11","Nokia"]
["Student 12","Nokia"]
["Student 13","Nokia"]
["Student 14","Motorola"]
["Student 15","Samsung"]
["Student 16","Samsung"]
["Student 17","Sprint"]
["Student 18","Sprint"]
["Student 19","Motorola"]
["Student 20","Samsung"]
["Student 21","Samsung"]
["Student 22","Nokia"]
["Student 23","Sony Erickson"]
["Student 24","Nokia"]
["Student 25","Nokia"]
["Student 26","Nokia"]
["Student 27","Nokia"]
["Student 28","Nokia"]
["Student 29","Sony Erickson"]
["Student 30","iPhone"]
["Student 31","Nokia"]
["Student 32","Sprint"]
["Student 33","Sony Erickson"]
["Student 34","Nokia"]
["Student 35","Samsung"]
["Student 36","Sony Erickson"]
["Student 37","Sony Erickson"]
["Student 38","Nokia"]
["Student 39","Nokia"]
["Student 40","Sony Erickson"]
["Student 41","iPhone"]
["Student 42","iPhone"]
["Student 43","iPhone"]
["Student 44","Motorola"]
["Student 45","Nokia"]
["Student 46","Sony Erickson"]
["Student 47","iPhone"]
["Student 48","iPhone"]
["Student 49","Nokia"]
["Student 50","Sprint"]
["Student 51","iPhone"]
["Student 52","Sony Erickson"]
["Student 53","Sony Erickson"]
["Student 54","Motorola"]
["Student 55","iPhone"]
["Student 56","Nokia"]
["Student 57","Sony Erickson"]
["Student 58","Sprint"]
["Student 59","iPhone"]
["Student 60","Sony Erickson"]
["Student 61","Sony Erickson"]
["Student 62","Nokia"]
["Student 63","iPhone"]
["Student 64","iPhone"]
["Student 65","Samsung"]
["Student 66",{"$f":"CHOOSE(RANDBETWEEN(1,8),\"iPhone\",\"iPhone\",\"Nokia\",\"Nokia\",\"Motorola\",\"Sony Erickson\",\"Samsung\",\"Sprint\")","v":"Sprint"}]
["Student 67","Nokia"]
["Student 68","Sprint"]
["Student 69","Motorola"]
["Student 70","Samsung"]
["Student 71","iPhone"]
["Student 72","Samsung"]
["Student 73","iPhone"]
["Student 74","Nokia"]
["Student 75","iPhone"]
["Student 76","Motorola"]
["Student 77","Sprint"]
["Student 78","Nokia"]
["Student 79","Nokia"]
["Student 80","Samsung"]
["Student 81","iPhone"]
["Student 82","iPhone"]
["Student 83","Sony Erickson"]
["Student 84","Motorola"]
["Student 85","Sony Erickson"]
["Student 86","Nokia"]
["Student 87","Sony Erickson"]
["Student 88","Nokia"]
["Student 89","Nokia"]
["Student 90","Sony Erickson"]
["Student 91","Sprint"]
["Student 92","iPhone"]
["Student 93","Nokia"]
["Student 94","Samsung"]
["Student 95","Samsung"]
["Student 96","iPhone"]
["Student 97","Samsung"]
["Student 98","Samsung"]
["Student 99","iPhone"]
["Student 100","Sprint"]
["Student 101","Sprint"]
["Student 102","Samsung"]
["Student 103","Samsung"]
["Student 104","Nokia"]
["Student 105","iPhone"]
["Student 106","Nokia"]
["Student 107","Sony Erickson"]
["Student 108","iPhone"]
["Student 109","iPhone"]
["Student 110","Motorola"]
["Student 111","Nokia"]
["Student 112","Samsung"]
["Student 113","Sprint"]
["Student 114","Sony Erickson"]
["Student 115","Nokia"]
["Student 116","Sprint"]
["Student 117","iPhone"]
{"$rows_left_out":269}
{"sheet":"3 Charts","index":5,"n_rows":9,"n_cols":2,"rows_kept":9,"cut":false,"hidden":false,"merged":[]}
["Charts are on the Insert Menu"]
["Once you select a Chart, three context sensitive menus appear: Design, Layout, Format"]
[]
["Customer","Sales"]
["Fred Myer",{"$f":"SUMIF('2 Data Analysis(1)'!$C$5:$C$594,A5,'2 Data Analysis(1)'!$D$5:$D$594)","v":43668}]
["Safeway",{"$f":"SUMIF('2 Data Analysis(1)'!$C$5:$C$594,A6,'2 Data Analysis(1)'!$D$5:$D$594)","v":27875}]
["Whole Foods",{"$f":"SUMIF('2 Data Analysis(1)'!$C$5:$C$594,A7,'2 Data Analysis(1)'!$D$5:$D$594)","v":38013}]
["Coop",{"$f":"SUMIF('2 Data Analysis(1)'!$C$5:$C$594,A8,'2 Data Analysis(1)'!$D$5:$D$594)","v":36540}]
["PCC",{"$f":"SUMIF('2 Data Analysis(1)'!$C$5:$C$594,A9,'2 Data Analysis(1)'!$D$5:$D$594)","v":39527}]

{"sheet":"Cell References","index":6,"n_rows":74,"n_cols":4,"rows_kept":74,"cut":false,"hidden":false,"merged":[]}
["Cell References are used in formulas. For Example if you have the formula =A7-$A$11 in cell B7, the formula will always take the value in cell \"One to the left\" of the cell that the formula sits in  and subtract the value in cell A11."]
["In this class we will only use two of the four types of cell references"]
["Relative Cell Reference means that when you copy the formula, the cell reference moves relatively. For example if the formula is in a cell and the formula is look at a cell reference that is one cell to the left, that cell reference will always look one cell to the left."]
["Absolute Cell Reference means that when you copy the formula, the cell reference is locked. The cell reference will only point to the original cell. To Apply the $ sign code to the column and row reference, use the keyboard shortcut, F4 (F4 adds the two dollar signs to make the relative cell reference into an absolute cell reference."]
[]
["X","X - Average"]
[23]
[24]
[19]
[28]
[]
["Average"]
[{"$f":"AVERAGE(A7:A10)","v":23.5}]
[]
["CarTypes",null,"CarTypes","Frequency"]
["Honda",null,"Ford"]
["Toyota",null,"Toyota"]
["Honda",null,"Honda"]
["Toyota"]
["Honda"]
["Toyota"]
["Ford"]
["Toyota"]
["Ford"]
["Toyota"]
["Toyota"]
["Ford"]
["Honda"]
["Ford"]
["Ford"]
["Ford"]
["Honda"]
["Ford"]
["Toyota"]
["Ford"]
["Toyota"]
["Honda"]
["Ford"]
["Ford"]
["Toyota"]
["Toyota"]
["Ford"]
["Toyota"]
["Ford"]
["Ford"]
["Toyota"]
["Honda"]
["Ford"]
["Toyota"]
["Toyota"]
["Toyota"]
["Toyota"]
["Toyota"]
["Toyota"]
["Toyota"]
["Toyota"]
["Honda"]
["Toyota"]
["Ford"]
["Ford"]
["Honda"]
["Toyota"]
["Toyota"]
["Toyota"]
["Toyota"]
["Ford"]
["Honda"]
["Honda"]
["Toyota"]
["Toyota"]
["Toyota"]
["Ford"]
["Toyota"]
["Ford"]

{"sheet":"Formatting","index":7,"n_rows":11,"n_cols":3,"rows_kept":11,"cut":false,"hidden":false,"merged":[]}
["Formatting is a Façade. It sits on top of the value or text that is entered into the cell."]
["Don't get tricked by formatting. When in doubt apply the General Format in the Number tab and see what is really in the cell."]
["Format Cells Dialog Box keyboard shortcut: Ctrl + 1."]
["These are tabs in the Format Dialog Box: Number, Alignment, Font, Borders, Fill, Protection"]
[]
["Accounting Format",null,"Percentage Format"]
[]
[]
[]
[]
["Accounting Format",null,"Percentage Format"]

{"sheet":"Percentage Calculations","index":8,"n_rows":60,"n_cols":8,"rows_kept":60,"cut":false,"hidden":false,"merged":[]}
["CarTypes",null,"CarTypes","Frequency","% Frequency"]
["Toyota",null,"Ford",{"$f":"COUNTIF($A$2:$A$60,C2)","v":17}]
["Toyota",null,"Toyota",{"$f":"COUNTIF($A$2:$A$60,C3)","v":23}]
["Toyota",null,"Honda",{"$f":"COUNTIF($A$2:$A$60,C4)","v":19}]
["Honda",null,"Total"]
["Honda",null,null,null,null,null,null,"check"]
["Ford",null,"Percent that is Ford OR Toytota =",null,null,null,null,{"$f":"(COUNTIF(A2:A60,C2)+COUNTIF(A2:A60,C3))/COUNTA(A2:A60)","v":0.67796610169491522}]
["Ford",null,"<==","<=="]
["Honda",null,"Because the two categories are mutually exclusive (Each car can only fit in one category), you can just add them"]
["Honda"]
["Toyota"]
["Honda"]
["Toyota"]
["Toyota"]
["Toyota"]
["Toyota"]
["Honda"]
["Toyota"]
["Honda"]
["Toyota"]
["Toyota"]
["Toyota"]
["Toyota"]
["Ford"]
["Ford"]
["Ford"]
["Honda"]
["Toyota"]
["Toyota"]
["Honda"]
["Ford"]
["Toyota"]
["Toyota"]
["Honda"]
["Honda"]
["Ford"]
["Honda"]
["Ford"]
["Toyota"]
["Honda"]
["Ford"]
["Honda"]
["Honda"]
["Ford"]
["Toyota"]
["Honda"]
["Ford"]
["Honda"]
["Ford"]
["Honda"]
["Toyota"]
["Ford"]
["Toyota"]
["Honda"]
["Toyota"]
["Ford"]
["Toyota"]
["Ford"]
["Ford"]
["Ford"]

{"sheet":"Sheet1","index":9,"n_rows":0,"n_cols":0,"rows_kept":0,"cut":false,"hidden":false,"merged":[]}