{"text_format":"1","workbook":"xlsx","n_sheets":185,"sheets":["INDEX for Book","Setup","CopiedTable","KeyB","KeyB(2)","KeyB(3)","SUMIFS","PT2","PT","Tables","Decimals","DateMath","TimeMath","Percentage(1)","Percentage(2)","Align(1)","Align(2)","Align(3)","Store 1","Store 2","Jones - Amortization Table","Styles(1)","Styles(2)","Formula(1)","Formula(2)","MathOperators","OrderOfOperations","OOO","3WaysToGetCR","CR(1)","CR(2)","CR(3)","CR(4)","CR(5)","CR(6)","CR(7)","Assumption","Scenarios","CR(8)","C AR","CR(9)","Corp","Oak","Bur","Sea","Tac","Ranges","Functions(1)","Functions(2)","SUMPRODUCT","SP(2)","IF(1)","IF(2)","IF(3)","IF(4)","IF(5)","IF(6)","IF(7)","VLOOKUP(1)","VLOOKUP(2)","V(3)","V(4)","V(5)","CTable","2wl","MasterList","I(1)","I(2)","I(3)","ROUND","ROUND information","AVE","MED","MODE","RANK","GS","Array(1)","Array(2)","Array(3)","Array(4)","CNF(notes)","CNF(1)","Errors","S(1)","S(2)","S(3)","S(4)","S(5)","S(6)","S(7)","S(8)","S(9)","S(10)","S(11)","ST(1)","STpaste","ST(2)","ST PT C","PT1","PTData","FormulaS","PT(2)","PTWeekly","PTData (2)","PT(3)","PTData (3)","PT(4)","PTData (4)","Visualize","Bellen","Carlota","Quad","Sunset","Sunshine","PT(5)","PTData (5)","PT(6)","PTData (6)","PT(8)","PTData (7)","PT(9)","PTData (8)","PT(11)","PT(10)","PTData (9)","Filter","PFilter","FilterC","FilterT","FilterD","FilterSales","AF(1)","AF(2)","AF(3)","AF(4)","AF(5)","AF(6)","AF(7)","Extract","AF(8)","AF(9)","TTC(1)","TTC2","ID(1)","ID(2)","ID(3)","Ct(1)","Ct(3)","C(1)","C(2)","C(3)","C(4)","C(5)","C(6)","C(7)","C(8)","C(9)","CF(1)","CF(2)","Logical","CF(3)","CF(4)","CF(5)","CF(6)","F&R&GotTo","Notes(52)","Notes","M(1)","M(1.1)","M(1.2)","M(1.3)","M(1.4)","M(2)","M(2.1)","M(2.2)","M(2.3)","M(2.4)","M(2.5)","M(3.1)","M(3.2)","M(3.3)","M(4.1)","M(4.2)","M(4.3)","LastVideo"],"not_rendered":{"charts":24,"images":4,"macros":1,"external_links":0,"defined_names":63,"comments":0,"pivot_tables":23},"unopened":[],"bounds":{"document_bytes":16777216,"sheet_cells":100000,"rows_first":2000,"rows_last":500,"rows_between":2000,"halvings":0,"cell_chars":16384,"cell_head_chars":4096},"cells_cut":0,"cells_raw":0,"read":"whole","date_system":"1900"}

{"sheet":"INDEX for Book","index":0,"n_rows":25,"n_cols":20,"rows_kept":25,"cut":false,"hidden":false,"merged":[]}
["Worksheet List","Link",null,"Worksheet List","Link",null,"Worksheet List","Link",null,"Worksheet List","Link",null,"Worksheet List","Link",null,"Worksheet List","Link",null,"Worksheet List","Link"]
["Chapter 1",null,null,"Chapter 5",null,null," Functions(1):-","Click here!",null," AVE:-","Click here!",null," ST(2):-","Click here!",null," AF(4):-","Click here!",null,"Chapter 8"]
[" Setup:-","Click here!",null," Formula(1):-","Click here!",null," Functions(2):-","Click here!",null," MED:-","Click here!",null," ST PT C:-","Click here!",null," AF(5):-","Click here!",null," CF(1):-","Click here!"]
["Chapter 2",null,null," Formula(2):-","Click here!",null," SUMPRODUCT:-","Click here!",null," MODE:-","Click here!",null," PTData:-","Click here!",null," AF(6):-","Click here!",null," CF(2):-","Click here!"]
[" KeyB:-","Click here!",null," MathOperators:-","Click here!",null," SP(2):-","Click here!",null," RANK:-","Click here!",null," FormulaS:-","Click here!",null," AF(7):-","Click here!",null," Logical:-","Click here!"]
[" KeyB(2):-","Click here!",null," OrderOfOperations:-","Click here!",null," IF(1):-","Click here!",null," GS:-","Click here!",null," PTData (2):-","Click here!",null," Extract:-","Click here!",null," CF(3):-","Click here!"]
[" KeyB(3):-","Click here!",null," OOO:-","Click here!",null," IF(2):-","Click here!",null," Array(1):-","Click here!",null," PTData (3):-","Click here!",null," AF(8):-","Click here!",null," CF(4):-","Click here!"]
["Chapter 3",null,null," 3WaysToGetCR:-","Click here!",null," IF(3):-","Click here!",null," Array(2):-","Click here!",null," PTData (4):-","Click here!",null," TTC(1):-","Click here!",null," CF(5):-","Click here!"]
[" SUMIFS:-","Click here!",null," CR(1):-","Click here!",null," IF(4):-","Click here!",null," Array(3):-","Click here!",null," Visualize:-","Click here!",null," TTC2:-","Click here!",null," CF(6):-","Click here!"]
[" PT:-","Click here!",null," CR(2):-","Click here!",null," IF(5):-","Click here!",null," Array(4):-","Click here!",null," PT(5):-","Click here!",null," ID(1):-","Click here!",null," F&R&GotTo:-","Click here!"]
[" Tables:-","Click here!",null," CR(3):-","Click here!",null," IF(6):-","Click here!",null," Errors:-","Click here!",null," PTData (5):-","Click here!",null," ID(2):-","Click here!"]
[" Decimals:-","Click here!",null," CR(4):-","Click here!",null," IF(7):-","Click here!",null,"Chapter 6",null,null," PTData (6):-","Click here!",null," ID(3):-","Click here!"]
[" DateMath:-","Click here!",null," CR(5):-","Click here!",null," VLOOKUP(1):-","Click here!",null," S(1):-","Click here!",null," PTData (7):-","Click here!",null," Ct(1):-","Click here!"]
[" TimeMath:-","Click here!",null," CR(6):-","Click here!",null," VLOOKUP(2):-","Click here!",null," S(2):-","Click here!",null," PTData (8):-","Click here!",null," Ct(3):-","Click here!"]
[" Percentage(1):-","Click here!",null," CR(7):-","Click here!",null," V(3):-","Click here!",null," S(3):-","Click here!",null," PT(11):-","Click here!",null,"Chapter 7"]
[" Percentage(2):-","Click here!",null," Assumption:-","Click here!",null," V(4):-","Click here!",null," S(4):-","Click here!",null," PTData (9):-","Click here!",null," C(1):-","Click here!"]
[" Align(1):-","Click here!",null," Scenarios:-","Click here!",null," V(5):-","Click here!",null," S(5):-","Click here!",null," Filter:-","Click here!",null," C(2):-","Click here!"]
[" Align(2):-","Click here!",null," CR(8):-","Click here!",null," CTable:-","Click here!",null," S(6):-","Click here!",null," PFilter:-","Click here!",null," C(3):-","Click here!"]
[" Align(3):-","Click here!",null," CAR:-","Click here!",null," 2wl:-","Click here!",null," S(7):-","Click here!",null," FilterC:-","Click here!",null," C(4):-","Click here!"]
["Chapter 4",null,null," CR(9):-","Click here!",null," MasterList:-","Click here!",null," S(8):-","Click here!",null," FilterT:-","Click here!",null," C(5):-","Click here!"]
[" Store 1:-","Click here!",null," Corp:-","Click here!",null," I(1):-","Click here!",null," S(9):-","Click here!",null," FilterD:-","Click here!",null," C(6):-","Click here!"]
[" Store 2:-","Click here!",null," Oak:-","Click here!",null," I(2):-","Click here!",null," S(10):-","Click here!",null," FilterSales:-","Click here!",null," C(7):-","Click here!"]
[" Jones - Amortization Table:-","Click here!",null," Sea:-","Click here!",null," I(3):-","Click here!",null," S(11):-","Click here!",null," AF(1):-","Click here!",null," C(8):-","Click here!"]
[" Styles(1):-","Click here!",null," Tac:-","Click here!",null," ROUND:-","Click here!",null," ST(1):-","Click here!",null," AF(2):-","Click here!",null," C(9):-","Click here!"]
[" Styles(2):-","Click here!",null," Ranges:-","Click here!",null," ROUND information:-","Click here!",null," STpaste:-","Click here!",null," AF(3):-","Click here!"]

{"sheet":"Setup","index":1,"n_rows":0,"n_cols":0,"rows_kept":0,"cut":false,"hidden":false,"merged":[]}

{"sheet":"CopiedTable","index":2,"n_rows":16,"n_cols":7,"rows_kept":16,"cut":false,"hidden":false,"merged":[]}
["January Sales","Sales Rep1","Sales Rep2","Sales Rep3","Sales Rep4","Totals"]
["Pro1",415,244,248,417,{"$f":"SUM(B2:E2)","v":1324}]
["Pro2",279,223,321,191,1014]
["Pro3",379,382,215,304,1280]
["Pro4",181,227,150,260,818]
["Pro5",290,440,212,368,1310]
["Totals",{"$f":"SUM(B2:B6)","v":1544},{"$f":"SUM(C2:C6)","v":1516},{"$f":"SUM(D2:D6)","v":1146},{"$f":"SUM(E2:E6)","v":1540},5746]
[]
["January Sales","Pro1","Pro2","Pro3","Pro4","Pro5","Totals"]
["Sales Rep1",415,279,379,181,290,{"$f":"SUM(B10:F10)","v":1544}]
["Sales Rep2",244,223,382,227,440,{"$f":"SUM(B11:F11)","v":1516}]
["Sales Rep3",248,321,215,150,212,{"$f":"SUM(B12:F12)","v":1146}]
["Sales Rep4",417,191,304,260,368,{"$f":"SUM(B13:F13)","v":1540}]
["Totals",{"$f":"SUM(B10:B13)","v":1324},1014,1280,818,1310,5746]
[]
["Totals",1544,1516,1146,1540]

{"sheet":"KeyB","index":3,"n_rows":77,"n_cols":6,"rows_kept":77,"cut":false,"hidden":false,"merged":[]}
["January Sales","Sales Rep1","Sales Rep2","Sales Rep3","Sales Rep4","Totals"]
["Pro1",415,244,248,417,{"$f":"SUM(B2:E2)","v":1324}]
["Pro2",279,223,321,191,1014]
["Pro3",379,382,215,304,1280]
["Pro4",181,227,150,260,818]
["Pro5",290,440,212,368,1310]
["Totals",{"$f":"SUM(B2:B6)","v":1544},{"$f":"SUM(C2:C6)","v":1516},{"$f":"SUM(D2:D6)","v":1146},{"$f":"SUM(E2:E6)","v":1540},5746]
[]
[]
[null,null,"Dec Total"]
["Dec Sales",null,{"$f":"SUM(A12:A77)","v":44164}]
[563]
[719]
[477]
[601]
[773]
[926]
[373]
[537]
[387]
[657]
[811]
[704]
[353]
[875]
[866]
[989]
[907]
[771]
[581]
[308]
[370]
[950]
[715]
[847]
[930]
[755]
[861]
[477]
[707]
[504]
[670]
[540]
[735]
[413]
[925]
[650]
[725]
[569]
[413]
[441]
[686]
[519]
[429]
[750]
[581]
[696]
[476]
[450]
[794]
[932]
[927]
[446]
[568]
[861]
[477]
[605]
[499]
[395]
[860]
[872]
[967]
[860]
[321]
[925]
[914]
[979]

{"sheet":"KeyB(2)","index":4,"n_rows":8,"n_cols":8,"rows_kept":8,"cut":false,"hidden":false,"merged":[]}
["Sales",null,null,null,"Jan","Feb","Mar","Apr"]
[10,null,null,"Revenue",10000,20000,18500,21550]
[22,null,null,"Expenses",6600,13800,12025,15947]
[50,null,null,"Net Income",{"$f":"E2-E3","v":3400},{"$f":"F2-F3","v":6200},{"$f":"G2-G3","v":6475},{"$f":"H2-H3","v":5603}]
[35]
[14]
[52]
[{"$f":"SUM(A2:A7)","v":183}]

{"sheet":"KeyB(3)","index":5,"n_rows":34,"n_cols":3,"rows_kept":34,"cut":false,"hidden":false,"merged":[]}
[" Paste Formulas Only"," =","Ctrl + V, tap Ctrl, tap F "]
[" Paste Formulas and Number Formatting"," =","Ctrl + V, tap Ctrl, tap O "]
[" Keep Source Formatting"," =","Ctrl + V, tap Ctrl, tap K "]
[" Do Not Paste Borders"," =","Ctrl + V, tap Ctrl, tap B "]
[" Keep Source Column Widths"," =","Ctrl + V, tap Ctrl, tap W "]
[" Transpose Columns and Rows"," =","Ctrl + V, tap Ctrl, tap T "]
[" Paste Values Only (Convert Formulas to Values)"," =","Ctrl + V, tap Ctrl, tap V "]
[" Paste Values and Number Formatting"," =","Ctrl + V, tap Ctrl, tap A "]
[" Paste Values and Source Formatting"," =","Ctrl + V, tap Ctrl, tap E "]
[" Paste Formatting"," =","Ctrl + V, tap Ctrl, tap R "]
[" Paste Link"," =","Ctrl + V, tap Ctrl, tap N "]
[" Paste Picture (Converts Cells to an actual picture)"," =","Ctrl + V, tap Ctrl, tap U "]
[" Paste Linked Picture"," =","Ctrl + V, tap Ctrl, tap I "]
[]
[" Paste Values Only (Convert Formulas to Values)"," =","Right-click key, tap V"]
[" Paste Formulas Only"," =","Right-click key, tap F, Enter"]
[" Transpose Columns and Rows"," =","Right-click key, tap T, Enter"]
["Paste Formatting Only"," =","Right-click key, tap R"]
[" Paste Link"," =","Right-click key, tap N, Enter"]
[]
["Navigation Keyboard Shortcuts"]
["Jump to the bottom of the column of data"," =","Ctrl + Down Arrow"]
["Jump to the top of the column of data"," =","Ctrl + Up Arrow"]
["Jump to the left end of a row of data"," =","Ctrl + Left Arrow"]
["Jump to the right end of a row of data"," =","Ctrl + Right Arrow"]
["Jump to cell A1"," =","Ctrl + Home"]
["Jump to last cell used"," =","Ctrl + End"]
[]
["Highlighting or Selection Keyboard Shortcuts"]
["Highlight or select the column of data below the selected cell"," =","Ctrl + Shift + Down Arrow"]
["Highlight or select the column of data above the selected cell"," =","Ctrl + Shift + Up Arrow"]
["Highlight or select the row of data to the left of the selected cell"," =","Ctrl + Shift + Left Arrow"]
["Highlight or select the row of data to the right of the selected cell"," =","Ctrl + Shift + Right Arrow"]
["Highlight Current Region"," =","Ctrl + * (on Number Pad)"]

{"sheet":"SUMIFS","index":6,"n_rows":12,"n_cols":3,"rows_kept":12,"cut":false,"hidden":false,"merged":[]}
["Date","SalesRep","UnitsSold"]
["2010-08-09","Sioux",10]
["2010-08-09","Tina",9]
["2010-08-10","Sioux",4]
["2010-08-10","Tina",8]
["2010-08-11","Sioux",1]
["2010-08-11","Tina",3]
[]
["Sales Period","SalesRep","UnitsSold"]
["Week","Tina",{"$f":"SUMIFS(C2:C7,B2:B7,B10)","v":20}]
[]
["Weekly Quota =",20]

{"sheet":"PT2","index":7,"n_rows":7,"n_cols":2,"rows_kept":7,"cut":false,"hidden":false,"merged":[]}
[]
[]
["Row Labels","Sum of UnitsSold"]
["Chin",24]
["Sioux",25]
["Tina",31]
["Grand Total",80]

{"sheet":"PT","index":8,"n_rows":29,"n_cols":7,"rows_kept":29,"cut":false,"hidden":false,"merged":[]}
["Date","SalesRep","UnitsSold",null,null,"SalesRep","Sum of UnitsSold"]
["2010-08-09","Sioux",10,null,null,"Chin",24]
["2010-08-09","Tina",9,null,null,"Sioux",25]
["2010-08-10","Sioux",4,null,null,"Tina",31]
["2010-08-10","Tina",8,null,null,"Grand Total",80]
["2010-08-11","Sioux",1]
["2010-08-11","Tina",3]
["2010-08-12","Chin",4]
["2010-08-12","Sioux",5]
["2010-08-12","Tina",3]
["2010-08-13","Chin",6]
["2010-08-13","Sioux",5]
["2010-08-13","Tina",8]
["2010-08-14","Chin",14]
[]
[]
[]
[]
[]
[]
[]
[]
[]
[]
[]
[null,"SalesRep","Total"]
[null,"Sioux",{"$f":"SUMIFS($C$2:$C$14,$B$2:$B$14,B27)","v":25}]
[null,"Tina",31]
[null,"Chin",24]

{"sheet":"Tables","index":9,"n_rows":19,"n_cols":10,"rows_kept":19,"cut":false,"hidden":false,"merged":[]}
["Date","SalesRep","ProductSold","UnitsSold","Total Sales",null,"Criteria","Tina","Sales",{"$f":"SUMIFS(E2:E19,B2:B19,H1)","v":2641.48}]
["2010-01-08","Tina","Boom 15",27,1179.6299999999999,null,"Criteria","Bob","Sales",{"$f":"SUMIFS(BoomSales[Total Sales],BoomSales[SalesRep],H2)","v":1080.7}]
["2010-01-03","Shelia","Boom 15",20,873.8,null,"Criteria","Chin","Sales",{"$f":"SUMIFS(BoomSales[Total Sales],BoomSales[SalesRep],H3)","v":302}]
["2010-01-06","Tina","Boom 14",23,757.85]
["2010-01-01","Bob","Boom 11",26,492.7]
["2010-01-06","Tina","Boom 5",25,350]
["2010-01-08","Sioux","Boom 6",23,343.84999999999997]
["2010-01-02","Bob","Boom 5",24,336]
["2010-01-05","Donita","Boom 6",18,269.09999999999997]
["2010-01-07","Donita","Boom 11",14,265.3]
["2010-01-08","Bob","Boom 10",14,252]
["2010-01-07","Tina","Boom 10",13,234]
["2010-01-06","Chin","Boom 5",13,182]
["2010-01-03","Shelia","Boom 8",10,159.5]
["2010-01-07","Shelia","Boom 13",6,153.30000000000001]
["2010-01-06","Shelia","Boom 8",8,127.6]
["2010-01-06","Chin","Boom 2",10,120]
["2010-01-08","Tina","Boom 1",12,120]
["2010-01-09","Don","Boom 10",1,29]

{"sheet":"Decimals","index":10,"n_rows":9,"n_cols":3,"rows_kept":9,"cut":false,"hidden":false,"merged":[]}
["Tax Collected",null,"Numbers you see"]
[10.255000000000001,null,10]
[2.359,null,2]
[9.9550000000000001,null,10]
[6.333333333333333,null,6]
[3.2,null,3]
[3.65,null,4]
[4.8875000000000002,null,5]
[{"$f":"SUM(A2:A8)","v":40.639833333333335},null,{"$f":"SUM(C2:C8)","v":40}]

{"sheet":"DateMath","index":11,"n_rows":6,"n_cols":8,"rows_kept":6,"cut":false,"hidden":false,"merged":[]}
[null,"1900-01-01",null,null,null,"Loan Issue Date","2010-01-01"]
[null,"1900-01-02",null,null,null,"Term",45,"days"]
["Due Date Invoice","2009-04-26",null,null,null,"Maturity Date",{"$f":"G1+G2","v":"2010-02-15"}]
["Today","2009-05-19"]
["Days Past Due",{"$f":"B4-B3","v":23},null,null,null,"Ctrl + Shift + ~"]
[null,null,null,null,null,"Ctrl + Shift + `"]

{"sheet":"TimeMath","index":12,"n_rows":14,"n_cols":10,"rows_kept":14,"cut":false,"hidden":false,"merged":[]}
["Time In","06:00:00","06:00:00",{"$f":"6/24","v":"06:00:00"},null,null,null,null,"Number","Time"]
["Time Out","16:30:00",null,null,null,null,null,null,0,{"$f":"I2","v":"00:00:00"}]
["Proportion of day worked",{"$f":"B2-B1","v":0.4375},null,null,null,null,null,null,0.25,"06:00:00"]
["Hours worked",{"$f":"B3*24","v":10.5},null,null,null,null,null,null,{"$f":"1/3","v":0.33333333333333331},"08:00:00"]
["In One Formula",{"$f":"(B2-B1)*24","v":10.5},null,null,null,null,null,null,0.5,"12:00:00"]
[null,null,null,null,null,null,null,null,0.75,"18:00:00"]
["Time In","06:00:00",null,null,null,null,null,null,{"$f":"(24*60*60-1)/(24*60*60)","v":0.99998842592592596},"23:59:59"]
["Time Out","11:30:00",null,null,null,null,null,null,1,1]
["Time In","13:00:00"]
["Time Out","16:30:00"]
["Hours Worked",{"$f":"SUM(B8-B7,B10-B9)*24","v":9.0000000000000018}]
["Wage",15.75]
["Gross Pay",{"$f":"B12*B11","v":141.75000000000003}]
[null,{"$f":"B11*B12","v":141.75000000000003}]

{"sheet":"Percentage(1)","index":13,"n_rows":9,"n_cols":5,"rows_kept":9,"cut":false,"hidden":false,"merged":[]}
["Tax Percentage",null,"Tax Rate"]
[8.7999999999999995E-2,null,6,0.06]
[null,null,0.06,".06*100","Step 1"]
[null,null,null,6]
["Date","Time",null,"6%","Step 2"]
["2009-09-16","11:11:00"]
[]
["Sales","Tax"]
[10,{"$f":"A9*A2","v":0.87999999999999989}]

{"sheet":"Percentage(2)","index":14,"n_rows":9,"n_cols":3,"rows_kept":9,"cut":false,"hidden":false,"merged":[]}
["Situation 1:","Type .03 in cell, then add % format",0.03]
["Situation 2:","Type 3 in cell, then add % format",3]
["Situation 3:","Add % format, then type 3, Enter",0.03]
["Situation 4:","Add % format, then type .03, Enter",0.03]
["Situation 5:","Add % format as you type",0.03]
["Situation 6:","Type .025, then add % from ribbon",2.5000000000000001E-2]
[]
[null,null,100]
[null,null,{"$f":"C8*C6","v":2.5}]

{"sheet":"Align(1)","index":15,"n_rows":6,"n_cols":1,"rows_kept":6,"cut":false,"hidden":false,"merged":[]}
["By default, words are aligned left"]
["Excel"]
["By default, numbers are aligned right"]
[43]
["By default, TRUE/FALSEs are aligned center"]
[false]

{"sheet":"Align(2)","index":16,"n_rows":20,"n_cols":5,"rows_kept":20,"cut":false,"hidden":false,"merged":[]}
["Sales Data Imported as Text",null,"Dates"]
[15,null,"2009-09-23",null,"=SUM(A2:A8)"]
[25,null,"2009-09-25"]
[62,null,"2009-09-24",null,"Ctrl + Shift + 4"]
[52,null,"2009-09-30"]
[25,null,{"$f":"COUNT(C2:C5)","v":4}]
[62]
[32]
[{"$f":"SUM(A2:A8)","v":273}," <<== This cell has the General Number format before the SUM function is added. After you add the SUM function the cell adopts the Text number"]
[null,"formatting from the cells above (because the cell references in the formula are looking at the cells"]
[]
["Sales Data Imported as Text"]
["$15.00"]
["$25.00"]
["$62.00"]
["$52.00"]
["$25.00"]
["$62.00"]
["$32.00"]
[{"$f":"A13+A14+A15+A16+A17+A18+A19","v":273}]

{"sheet":"Align(3)","index":17,"n_rows":9,"n_cols":3,"rows_kept":9,"cut":false,"hidden":false,"merged":[]}
["Sales Data Imported as Text",null,"Sales Data Formatted as Text"]
[15,null,15]
[25,null,25]
[62,null,62]
[52,null,52]
[25,null,25]
[62,null,62]
[32,null,32]
[{"$f":"SUM(A2:A8)","v":273},null,{"$f":"SUM(C2:C8)","v":273}]

{"sheet":"Store 1","index":18,"n_rows":15,"n_cols":16,"rows_kept":15,"cut":false,"hidden":false,"merged":[]}
["2011 Units Sold - Wind Sport Inc.",null,null,null,null,null,null,null,null,"2011 Sales Sold - Wind Sport Inc."]
[null,"Jan","Feb","Mar","Apr","May","Jun",null,null,null,"Jan","Feb","Mar","Apr","May","Jun"]
["Boomerangs",350,273,375,500,955,1092,null,null,"Boomerangs",350,273,375,500,955,1092]
["Kites",957,925,1250,1100,2010,2290,null,null,"Kites",957,925,1250,1100,2010,2290]
["Toys",160,220,291,446,537,208,null,null,"Toys",160,220,291,446,537,208]
["Accessories",525,625,570,852,750,575,null,null,"Accessories",525,625,570,852,750,575]
["Total",{"$f":"SUM(B3:B6)","v":1992},2043,2486,2898,4252,4165,null,null,"Total",{"$f":"SUM(K3:K6)","v":1992},2043,2486,2898,4252,4165]
[]
[null,null,null,null,null,null,null,null,null,"2011 Sales Sold - Wind Sport Inc."]
[null,null,null,null,null,null,null,null,null,null,"Jan","Feb","Mar","Apr","May","Jun"]
[null,null,null,null,null,null,null,null,null,"Boomerangs",350,273,375,500,955,1092]
[null,null,null,null,null,null,null,null,null,"Kites",957,925,1250,1100,2010,2290]
[null,null,null,null,null,null,null,null,null,"Toys",160,220,291,446,537,208]
[null,null,null,null,null,null,null,null,null,"Accessories",525,625,570,852,750,575]
[null,null,null,null,null,null,null,null,null,"Total",{"$f":"SUM(K11:K14)","v":1992},2043,2486,2898,4252,4165]

{"sheet":"Store 2","index":19,"n_rows":15,"n_cols":7,"rows_kept":15,"cut":false,"hidden":false,"merged":[]}
["Wind Sport Inc."]
[null,"Jul","Aug","Sep","Oct","Nov","Dec"]
["Boomerangs",{"$f":"B11*1.075","v":376.25},293.47499999999997,403.125,537.5,1026.625,1173.8999999999999]
["Kites",1028.7749999999999,994.375,1343.75,1182.5,2160.75,2461.75]
["Toys",172,236.5,312.82499999999999,479.45,577.27499999999998,223.6]
["Accessories",564.375,671.875,612.75,915.9,806.25,618.125]
["Total",{"$f":"SUM(B3:B6)","v":2141.3999999999996},{"$f":"SUM(C3:C6)","v":2196.2249999999999},2672.45,3115.35,4570.8999999999996,4477.375]
[]
["Wind Sport Inc."]
[null,"Jan","Feb","Mar","Apr","May","Jun"]
["Boomerangs",350,273,375,500,955,1092]
["Kites",957,925,1250,1100,2010,2290]
["Toys",160,220,291,446,537,208]
["Accessories",525,625,570,852,750,575]
["Total",{"$f":"SUM(B11:B14)","v":1992},2043,2486,2898,4252,4165]

{"sheet":"Jones - Amortization Table","index":20,"n_rows":365,"n_cols":7,"rows_kept":365,"cut":false,"hidden":false,"merged":[]}
[null,"Years",null,null,null,"Periods per year"]
[null,30,null,null,null,12]
[]
["Period","PMT","Interest","Principal Paid","Balance","Annual Rate","Lump Sum (Reduces PMT)"]
[{"$f":"ROWS(A$5:A5)-1","v":0},null,null,null,100000]
[{"$f":"ROWS(A$5:A6)-1","v":1},{"$f":"-PMT(F6/$F$2,COUNT(A6:$A$365),E5)","v":840.85420717874808},{"$f":"E5*F6/$F$2","v":791.66666666666663},{"$f":"B6-C6","v":49.187540512081455},{"$f":"E5-D6-G6","v":99950.812459487919},9.5000000000000001E-2]
[{"$f":"ROWS(A$5:A7)-1","v":2},{"$f":"-PMT(F7/$F$2,COUNT(A7:$A$365),E6)","v":840.8542071787482},{"$f":"E6*F7/$F$2","v":791.27726530427935},{"$f":"B7-C7","v":49.576941874468844},99901.235517613444,9.5000000000000001E-2]
[{"$f":"ROWS(A$5:A8)-1","v":3},{"$f":"-PMT(F8/$F$2,COUNT(A8:$A$365),E7)","v":840.85420717874808},790.88478118110652,49.969425997641565,99851.266091615806,9.5000000000000001E-2]
[{"$f":"ROWS(A$5:A9)-1","v":4},{"$f":"-PMT(F9/$F$2,COUNT(A9:$A$365),E8)","v":840.8542071787482},790.48918989195852,50.36501728678968,99800.901074329013,9.5000000000000001E-2]
[{"$f":"ROWS(A$5:A10)-1","v":5},{"$f":"-PMT(F10/$F$2,COUNT(A10:$A$365),E9)","v":840.85420717874808},790.09046683843792,50.763740340310164,99750.137333988707,9.5000000000000001E-2]
[{"$f":"ROWS(A$5:A11)-1","v":6},{"$f":"-PMT(F11/$F$2,COUNT(A11:$A$365),E10)","v":840.85420717874808},789.68858722741061,51.165619951337476,74698.971714037369,9.5000000000000001E-2,25000]
[{"$f":"ROWS(A$5:A12)-1","v":7},{"$f":"-PMT(F12/$F$2,COUNT(A12:$A$365),E11)","v":630.0059424668168},591.36685940279585,38.639083064020951,74660.332630973353,9.5000000000000001E-2]
[{"$f":"ROWS(A$5:A13)-1","v":8},{"$f":"-PMT(F13/$F$2,COUNT(A13:$A$365),E12)","v":630.00594246681692},591.06096666187238,38.944975804944534,74621.387655168408,9.5000000000000001E-2]
[{"$f":"ROWS(A$5:A14)-1","v":9},{"$f":"-PMT(F14/$F$2,COUNT(A14:$A$365),E13)","v":630.00594246681692},590.75265227008322,39.253290196733701,74582.134364971673,9.5000000000000001E-2]
[{"$f":"ROWS(A$5:A15)-1","v":10},{"$f":"-PMT(F15/$F$2,COUNT(A15:$A$365),E14)","v":630.0059424668168},590.44189705602582,39.564045410790982,74542.57031956088,9.5000000000000001E-2]
[{"$f":"ROWS(A$5:A16)-1","v":11},{"$f":"-PMT(F16/$F$2,COUNT(A16:$A$365),E15)","v":630.00594246681692},590.12868169652359,39.877260770293333,74502.693058790581,9.5000000000000001E-2]
[{"$f":"ROWS(A$5:A17)-1","v":12},{"$f":"-PMT(F17/$F$2,COUNT(A17:$A$365),E16)","v":630.0059424668168},589.81298671542538,40.192955751391423,74462.500103039187,9.5000000000000001E-2]
[{"$f":"ROWS(A$5:A18)-1","v":13},{"$f":"-PMT(F18/$F$2,COUNT(A18:$A$365),E17)","v":657.11448995278238},620.52083419199323,36.593655760789147,74425.906447278394,0.1]
[{"$f":"ROWS(A$5:A19)-1","v":14},{"$f":"-PMT(F19/$F$2,COUNT(A19:$A$365),E18)","v":657.11448995278238},620.21588706065324,36.898602892129134,74389.007844386259,0.1]
[{"$f":"ROWS(A$5:A20)-1","v":15},{"$f":"-PMT(F20/$F$2,COUNT(A20:$A$365),E19)","v":657.11448995278238},619.90839870321884,37.206091249563542,74351.801753136693,0.1]
[{"$f":"ROWS(A$5:A21)-1","v":16},{"$f":"-PMT(F21/$F$2,COUNT(A21:$A$365),E20)","v":657.11448995278238},619.59834794280584,37.516142009976534,74314.285611126717,0.1]
[{"$f":"ROWS(A$5:A22)-1","v":17},{"$f":"-PMT(F22/$F$2,COUNT(A22:$A$365),E21)","v":657.11448995278238},619.28571342605608,37.828776526726301,74276.456834599987,0.1]
[{"$f":"ROWS(A$5:A23)-1","v":18},{"$f":"-PMT(F23/$F$2,COUNT(A23:$A$365),E22)","v":657.11448995278226},618.97047362166666,38.144016331115608,74238.312818268867,0.1]
[{"$f":"ROWS(A$5:A24)-1","v":19},{"$f":"-PMT(F24/$F$2,COUNT(A24:$A$365),E23)","v":657.11448995278226},618.6526068189072,38.461883133875062,74199.850935134993,0.1]
[{"$f":"ROWS(A$5:A25)-1","v":20},{"$f":"-PMT(F25/$F$2,COUNT(A25:$A$365),E24)","v":657.11448995278226},618.33209112612496,38.7823988266573,74161.068536308332,0.1]
[{"$f":"ROWS(A$5:A26)-1","v":21},{"$f":"-PMT(F26/$F$2,COUNT(A26:$A$365),E25)","v":657.11448995278226},618.0089044692362,39.105585483546065,74121.962950824789,0.1]
[{"$f":"ROWS(A$5:A27)-1","v":22},{"$f":"-PMT(F27/$F$2,COUNT(A27:$A$365),E26)","v":657.11448995278226},617.68302459020663,39.431465362575636,74082.531485462212,0.1]
[{"$f":"ROWS(A$5:A28)-1","v":23},{"$f":"-PMT(F28/$F$2,COUNT(A28:$A$365),E27)","v":657.11448995278226},617.35442904551849,39.760060907263778,74042.771424554943,0.1]
[{"$f":"ROWS(A$5:A29)-1","v":24},{"$f":"-PMT(F29/$F$2,COUNT(A29:$A$365),E28)","v":657.11448995278226},617.02309520462461,40.091394748157654,74002.680029806783,0.1]
[{"$f":"ROWS(A$5:A30)-1","v":25},{"$f":"-PMT(F30/$F$2,COUNT(A30:$A$365),E29)","v":657.11448995278215},616.6890002483899,40.425489704392248,73962.254540102396,0.1]
[{"$f":"ROWS(A$5:A31)-1","v":26},{"$f":"-PMT(F31/$F$2,COUNT(A31:$A$365),E30)","v":657.11448995278226},616.35212116752007,40.762368785262197,73921.492171317135,0.1]
[{"$f":"ROWS(A$5:A32)-1","v":27},{"$f":"-PMT(F32/$F$2,COUNT(A32:$A$365),E31)","v":657.11448995278226},616.01243476097613,41.10205519180613,73880.390116125331,0.1]
[{"$f":"ROWS(A$5:A33)-1","v":28},{"$f":"-PMT(F33/$F$2,COUNT(A33:$A$365),E32)","v":657.11448995278226},615.66991763437784,41.444572318404425,73838.945543806927,0.1]
[{"$f":"ROWS(A$5:A34)-1","v":29},{"$f":"-PMT(F34/$F$2,COUNT(A34:$A$365),E33)","v":657.11448995278226},615.32454619839109,41.789943754391174,73797.155600052531,0.1]
[{"$f":"ROWS(A$5:A35)-1","v":30},{"$f":"-PMT(F35/$F$2,COUNT(A35:$A$365),E34)","v":657.11448995278226},614.97629666710452,42.138193285677744,73755.017406766856,0.1]
[{"$f":"ROWS(A$5:A36)-1","v":31},{"$f":"-PMT(F36/$F$2,COUNT(A36:$A$365),E35)","v":657.11448995278226},614.62514505639047,42.489344896391799,73712.528061870471,0.1]
[{"$f":"ROWS(A$5:A37)-1","v":32},{"$f":"-PMT(F37/$F$2,COUNT(A37:$A$365),E36)","v":657.11448995278238},614.27106718225389,42.843422770528491,73669.684639099942,0.1]
[{"$f":"ROWS(A$5:A38)-1","v":33},{"$f":"-PMT(F38/$F$2,COUNT(A38:$A$365),E37)","v":657.11448995278238},613.91403865916618,43.200451293616197,73626.484187806331,0.1]
[{"$f":"ROWS(A$5:A39)-1","v":34},{"$f":"-PMT(F39/$F$2,COUNT(A39:$A$365),E38)","v":657.11448995278238},613.55403489838613,43.560455054396243,73582.923732751937,0.1]
[{"$f":"ROWS(A$5:A40)-1","v":35},{"$f":"-PMT(F40/$F$2,COUNT(A40:$A$365),E39)","v":657.11448995278238},613.19103110626622,43.923458846516155,73539.000273905418,0.1]
[{"$f":"ROWS(A$5:A41)-1","v":36},{"$f":"-PMT(F41/$F$2,COUNT(A41:$A$365),E40)","v":657.11448995278238},612.82500228254514,44.289487670237236,73494.710786235184,0.1]
[{"$f":"ROWS(A$5:A42)-1","v":37},{"$f":"-PMT(F42/$F$2,COUNT(A42:$A$365),E41)","v":657.11448995278238},612.45592321862659,44.658566734155784,73450.052219501027,0.1]
[{"$f":"ROWS(A$5:A43)-1","v":38},{"$f":"-PMT(F43/$F$2,COUNT(A43:$A$365),E42)","v":657.11448995278238},612.08376849584192,45.030721456940455,73405.02149804408,0.1]
[{"$f":"ROWS(A$5:A44)-1","v":39},{"$f":"-PMT(F44/$F$2,COUNT(A44:$A$365),E43)","v":657.11448995278226},611.7085124837007,45.405977469081563,73359.615520574996,0.1]
[{"$f":"ROWS(A$5:A45)-1","v":40},{"$f":"-PMT(F45/$F$2,COUNT(A45:$A$365),E44)","v":657.11448995278226},611.33012933812495,45.784360614657317,73313.831159960333,0.1]
[{"$f":"ROWS(A$5:A46)-1","v":41},{"$f":"-PMT(F46/$F$2,COUNT(A46:$A$365),E45)","v":657.11448995278226},610.94859299966947,46.165896953112792,73267.66526300722,0.1]
[{"$f":"ROWS(A$5:A47)-1","v":42},{"$f":"-PMT(F47/$F$2,COUNT(A47:$A$365),E46)","v":657.11448995278226},610.56387719172687,46.55061276105539,73221.114650246163,0.1]
[{"$f":"ROWS(A$5:A48)-1","v":43},{"$f":"-PMT(F48/$F$2,COUNT(A48:$A$365),E47)","v":657.11448995278226},610.17595541871799,46.938534534064274,73174.176115712093,0.1]
[{"$f":"ROWS(A$5:A49)-1","v":44},{"$f":"-PMT(F49/$F$2,COUNT(A49:$A$365),E48)","v":657.11448995278226},609.78480096426745,47.329688988514818,73126.846426723583,0.1]
[{"$f":"ROWS(A$5:A50)-1","v":45},{"$f":"-PMT(F50/$F$2,COUNT(A50:$A$365),E49)","v":657.11448995278226},609.39038688936319,47.724103063419079,73079.122323660165,0.1]
[{"$f":"ROWS(A$5:A51)-1","v":46},{"$f":"-PMT(F51/$F$2,COUNT(A51:$A$365),E50)","v":657.11448995278226},608.99268603050143,48.121803922280833,73031.000519737878,0.1]
[{"$f":"ROWS(A$5:A52)-1","v":47},{"$f":"-PMT(F52/$F$2,COUNT(A52:$A$365),E51)","v":657.11448995278215},608.59167099781564,48.52281895496651,72982.477700782911,0.1]
[{"$f":"ROWS(A$5:A53)-1","v":48},{"$f":"-PMT(F53/$F$2,COUNT(A53:$A$365),E52)","v":657.11448995278226},608.18731417319088,48.92717577959138,72933.550525003317,0.1]
[{"$f":"ROWS(A$5:A54)-1","v":49},{"$f":"-PMT(F54/$F$2,COUNT(A54:$A$365),E53)","v":657.11448995278215},607.77958770836096,49.334902244421187,72884.2156227589,0.1]
[{"$f":"ROWS(A$5:A55)-1","v":50},{"$f":"-PMT(F55/$F$2,COUNT(A55:$A$365),E54)","v":657.11448995278215},607.36846352299085,49.7460264297913,72834.469596329116,0.1]
[{"$f":"ROWS(A$5:A56)-1","v":51},{"$f":"-PMT(F56/$F$2,COUNT(A56:$A$365),E55)","v":657.11448995278226},606.95391330274265,50.160576650039616,72784.309019679073,0.1]
[{"$f":"ROWS(A$5:A57)-1","v":52},{"$f":"-PMT(F57/$F$2,COUNT(A57:$A$365),E56)","v":657.11448995278226},606.53590849732564,50.578581455456629,72733.730438223618,0.1]
[{"$f":"ROWS(A$5:A58)-1","v":53},{"$f":"-PMT(F58/$F$2,COUNT(A58:$A$365),E57)","v":657.11448995278226},606.11442031853016,51.0000696342521,72682.730368589371,0.1]
[{"$f":"ROWS(A$5:A59)-1","v":54},{"$f":"-PMT(F59/$F$2,COUNT(A59:$A$365),E58)","v":657.11448995278226},605.68941973824474,51.425070214537527,72631.305298374835,0.1]
[{"$f":"ROWS(A$5:A60)-1","v":55},{"$f":"-PMT(F60/$F$2,COUNT(A60:$A$365),E59)","v":657.11448995278238},605.26087748645693,51.853612466325444,72579.451685908512,0.1]
[{"$f":"ROWS(A$5:A61)-1","v":56},{"$f":"-PMT(F61/$F$2,COUNT(A61:$A$365),E60)","v":657.11448995278226},604.82876404923763,52.28572590354463,72527.165960004961,0.1]
[{"$f":"ROWS(A$5:A62)-1","v":57},{"$f":"-PMT(F62/$F$2,COUNT(A62:$A$365),E61)","v":657.11448995278226},604.39304966670807,52.721440286074198,72474.444519718891,0.1]
[{"$f":"ROWS(A$5:A63)-1","v":58},{"$f":"-PMT(F63/$F$2,COUNT(A63:$A$365),E62)","v":657.11448995278226},603.95370433099072,53.160785621791547,72421.283734097102,0.1]
[{"$f":"ROWS(A$5:A64)-1","v":59},{"$f":"-PMT(F64/$F$2,COUNT(A64:$A$365),E63)","v":657.11448995278238},603.51069778414251,53.60379216863987,72367.679941928465,0.1]
[{"$f":"ROWS(A$5:A65)-1","v":60},{"$f":"-PMT(F65/$F$2,COUNT(A65:$A$365),E64)","v":657.11448995278226},603.06399951607057,54.050490436711698,72313.629451491754,0.1]
[{"$f":"ROWS(A$5:A66)-1","v":61},{"$f":"-PMT(F66/$F$2,COUNT(A66:$A$365),E65)","v":534.39134199166938},451.96018407182345,82.43115791984593,72231.198293571913,7.4999999999999997E-2]
[{"$f":"ROWS(A$5:A67)-1","v":62},{"$f":"-PMT(F67/$F$2,COUNT(A67:$A$365),E66)","v":534.39134199166938},451.44498933482441,82.946352656844965,72148.25194091507,7.4999999999999997E-2]
[{"$f":"ROWS(A$5:A68)-1","v":63},{"$f":"-PMT(F68/$F$2,COUNT(A68:$A$365),E67)","v":534.39134199166938},450.92657463071919,83.464767360950191,72064.787173554127,7.4999999999999997E-2]
[{"$f":"ROWS(A$5:A69)-1","v":64},{"$f":"-PMT(F69/$F$2,COUNT(A69:$A$365),E68)","v":534.39134199166949},450.40491983471333,83.986422156956166,71980.800751397168,7.4999999999999997E-2]
[{"$f":"ROWS(A$5:A70)-1","v":65},{"$f":"-PMT(F70/$F$2,COUNT(A70:$A$365),E69)","v":534.39134199166938},449.88000469623233,84.511337295437045,{"$f":"E69-D70-G70","v":71896.289414101731},7.4999999999999997E-2]
[{"$f":"ROWS(A$5:A71)-1","v":66},{"$f":"-PMT(F71/$F$2,COUNT(A71:$A$365),E70)","v":534.39134199166949},{"$f":"E70*F71/$F$2","v":449.35180883813581},{"$f":"B71-C71","v":85.039533153533682},71811.249880948191,7.4999999999999997E-2]
[{"$f":"ROWS(A$5:A72)-1","v":67},{"$f":"-PMT(F72/$F$2,COUNT(A72:$A$365),E71)","v":534.39134199166938},448.82031175592618,85.571030235743194,71725.678850712444,7.4999999999999997E-2]
[{"$f":"ROWS(A$5:A73)-1","v":68},{"$f":"-PMT(F73/$F$2,COUNT(A73:$A$365),E72)","v":534.39134199166938},448.28549281695274,86.105849174716639,71639.573001537734,7.4999999999999997E-2]
[{"$f":"ROWS(A$5:A74)-1","v":69},{"$f":"-PMT(F74/$F$2,COUNT(A74:$A$365),E73)","v":534.39134199166938},447.7473312596108,86.644010732058575,71552.928990805682,7.4999999999999997E-2]
[{"$f":"ROWS(A$5:A75)-1","v":70},{"$f":"-PMT(F75/$F$2,COUNT(A75:$A$365),E74)","v":534.39134199166949},447.20580619253548,87.185535799134016,71465.743455006552,7.4999999999999997E-2]
[{"$f":"ROWS(A$5:A76)-1","v":71},{"$f":"-PMT(F76/$F$2,COUNT(A76:$A$365),E75)","v":534.39134199166938},446.66089659379094,87.730445397878441,71378.01300960868,7.4999999999999997E-2]
[{"$f":"ROWS(A$5:A77)-1","v":72},{"$f":"-PMT(F77/$F$2,COUNT(A77:$A$365),E76)","v":534.39134199166961},446.11258131005428,88.278760681615324,71289.734248927067,7.4999999999999997E-2]
[{"$f":"ROWS(A$5:A78)-1","v":73},{"$f":"-PMT(F78/$F$2,COUNT(A78:$A$365),E77)","v":534.39134199166961},445.56083905579413,88.830502935875472,71200.903745991192,7.4999999999999997E-2]
[{"$f":"ROWS(A$5:A79)-1","v":74},{"$f":"-PMT(F79/$F$2,COUNT(A79:$A$365),E78)","v":534.39134199166961},445.00564841244494,89.385693579224665,71111.518052411964,7.4999999999999997E-2]
[{"$f":"ROWS(A$5:A80)-1","v":75},{"$f":"-PMT(F80/$F$2,COUNT(A80:$A$365),E79)","v":534.39134199166949},444.44698782757473,89.944354164094761,71021.57369824787,7.4999999999999997E-2]
[{"$f":"ROWS(A$5:A81)-1","v":76},{"$f":"-PMT(F81/$F$2,COUNT(A81:$A$365),E80)","v":534.39134199166961},443.88483561404922,90.506506377620383,70931.067191870243,7.4999999999999997E-2]
[{"$f":"ROWS(A$5:A82)-1","v":77},{"$f":"-PMT(F82/$F$2,COUNT(A82:$A$365),E81)","v":534.39134199166949},443.31916994918902,91.072172042480474,70839.995019827766,7.4999999999999997E-2]
[{"$f":"ROWS(A$5:A83)-1","v":78},{"$f":"-PMT(F83/$F$2,COUNT(A83:$A$365),E82)","v":534.39134199166961},442.74996887392354,91.64137311774607,70748.35364671002,7.4999999999999997E-2]
[{"$f":"ROWS(A$5:A84)-1","v":79},{"$f":"-PMT(F84/$F$2,COUNT(A84:$A$365),E83)","v":534.39134199166949},442.17721029193763,92.214131699731865,70656.139515010291,7.4999999999999997E-2]
[{"$f":"ROWS(A$5:A85)-1","v":80},{"$f":"-PMT(F85/$F$2,COUNT(A85:$A$365),E84)","v":534.39134199166961},441.60087196881432,92.790470022855288,70563.349044987437,7.4999999999999997E-2]
[{"$f":"ROWS(A$5:A86)-1","v":81},{"$f":"-PMT(F86/$F$2,COUNT(A86:$A$365),E85)","v":534.39134199166961},441.02093153117147,93.370410460498135,70469.978634526939,7.4999999999999997E-2]
[{"$f":"ROWS(A$5:A87)-1","v":82},{"$f":"-PMT(F87/$F$2,COUNT(A87:$A$365),E86)","v":534.39134199166949},440.43736646579333,93.95397552587616,70376.024659001065,7.4999999999999997E-2]
[{"$f":"ROWS(A$5:A88)-1","v":83},{"$f":"-PMT(F88/$F$2,COUNT(A88:$A$365),E87)","v":534.39134199166961},439.85015411875662,94.541187872912985,70281.483471128158,7.4999999999999997E-2]
[{"$f":"ROWS(A$5:A89)-1","v":84},{"$f":"-PMT(F89/$F$2,COUNT(A89:$A$365),E88)","v":534.39134199166972},439.25927169455099,95.13207029711873,70186.351400831045,7.4999999999999997E-2]
[{"$f":"ROWS(A$5:A90)-1","v":85},{"$f":"-PMT(F90/$F$2,COUNT(A90:$A$365),E89)","v":534.39134199166972},438.66469625519403,95.726645736475689,70090.62475509457,7.4999999999999997E-2]
[{"$f":"ROWS(A$5:A91)-1","v":86},{"$f":"-PMT(F91/$F$2,COUNT(A91:$A$365),E90)","v":534.39134199166972},438.06640471934105,96.324937272328668,69994.299817822248,7.4999999999999997E-2]
[{"$f":"ROWS(A$5:A92)-1","v":87},{"$f":"-PMT(F92/$F$2,COUNT(A92:$A$365),E91)","v":534.39134199166972},437.46437386138905,96.92696813028067,69897.372849691965,7.4999999999999997E-2]
[{"$f":"ROWS(A$5:A93)-1","v":88},{"$f":"-PMT(F93/$F$2,COUNT(A93:$A$365),E92)","v":534.39134199166972},436.85858031057478,97.532761681094939,69799.840088010867,7.4999999999999997E-2]
[{"$f":"ROWS(A$5:A94)-1","v":89},{"$f":"-PMT(F94/$F$2,COUNT(A94:$A$365),E93)","v":534.39134199166972},436.24900055006788,98.142341441601843,69701.697746569262,7.4999999999999997E-2]
[{"$f":"ROWS(A$5:A95)-1","v":90},{"$f":"-PMT(F95/$F$2,COUNT(A95:$A$365),E94)","v":534.39134199166972},435.63561091605789,98.755731075611834,69602.942015493652,7.4999999999999997E-2]
[{"$f":"ROWS(A$5:A96)-1","v":91},{"$f":"-PMT(F96/$F$2,COUNT(A96:$A$365),E95)","v":534.39134199166972},435.01838759683528,99.372954394834437,69503.569061098824,7.4999999999999997E-2]
[{"$f":"ROWS(A$5:A97)-1","v":92},{"$f":"-PMT(F97/$F$2,COUNT(A97:$A$365),E96)","v":534.39134199166983},434.39730663186765,99.994035359802183,69403.575025739017,7.4999999999999997E-2]
[{"$f":"ROWS(A$5:A98)-1","v":93},{"$f":"-PMT(F98/$F$2,COUNT(A98:$A$365),E97)","v":534.39134199166972},433.77234391086881,100.61899808080091,69302.95602765822,7.4999999999999997E-2]
[{"$f":"ROWS(A$5:A99)-1","v":94},{"$f":"-PMT(F99/$F$2,COUNT(A99:$A$365),E98)","v":534.39134199166972},433.14347517286387,101.24786681880585,69201.708160839407,7.4999999999999997E-2]
[{"$f":"ROWS(A$5:A100)-1","v":95},{"$f":"-PMT(F100/$F$2,COUNT(A100:$A$365),E99)","v":534.39134199166961},432.5106760052463,101.88066598642331,69099.827494852987,7.4999999999999997E-2]
[{"$f":"ROWS(A$5:A101)-1","v":96},{"$f":"-PMT(F101/$F$2,COUNT(A101:$A$365),E100)","v":534.39134199166972},431.87392184283112,102.5174201488386,68997.310074704146,7.4999999999999997E-2]
[{"$f":"ROWS(A$5:A102)-1","v":97},{"$f":"-PMT(F102/$F$2,COUNT(A102:$A$365),E101)","v":534.39134199166972},431.23318796690091,103.15815402476881,68894.151920679375,7.4999999999999997E-2]
[{"$f":"ROWS(A$5:A103)-1","v":98},{"$f":"-PMT(F103/$F$2,COUNT(A103:$A$365),E102)","v":534.39134199166972},430.58844950424606,103.80289248742366,68790.349028191951,7.4999999999999997E-2]
[{"$f":"ROWS(A$5:A104)-1","v":99},{"$f":"-PMT(F104/$F$2,COUNT(A104:$A$365),E103)","v":534.39134199166972},429.93968142619968,104.45166056547004,68685.897367626487,7.4999999999999997E-2]
[{"$f":"ROWS(A$5:A105)-1","v":100},{"$f":"-PMT(F105/$F$2,COUNT(A105:$A$365),E104)","v":534.39134199166983},429.28685854766553,105.1044834440043,68580.792884182476,7.4999999999999997E-2]
[{"$f":"ROWS(A$5:A106)-1","v":101},{"$f":"-PMT(F106/$F$2,COUNT(A106:$A$365),E105)","v":534.39134199166972},428.62995552614046,105.76138646552926,68475.031497716947,7.4999999999999997E-2]
[{"$f":"ROWS(A$5:A107)-1","v":102},{"$f":"-PMT(F107/$F$2,COUNT(A107:$A$365),E106)","v":534.39134199166961},427.96894686073091,106.4223951309387,68368.609102586008,7.4999999999999997E-2]
[{"$f":"ROWS(A$5:A108)-1","v":103},{"$f":"-PMT(F108/$F$2,COUNT(A108:$A$365),E107)","v":534.39134199166972},427.30380689116254,107.08753510050718,68261.521567485499,7.4999999999999997E-2]
[{"$f":"ROWS(A$5:A109)-1","v":104},{"$f":"-PMT(F109/$F$2,COUNT(A109:$A$365),E108)","v":534.39134199166961},426.63450979678436,107.75683219488525,68153.764735290621,7.4999999999999997E-2]
[{"$f":"ROWS(A$5:A110)-1","v":105},{"$f":"-PMT(F110/$F$2,COUNT(A110:$A$365),E109)","v":534.39134199166972},425.96102959556634,108.43031239610337,68045.334422894521,7.4999999999999997E-2]
[{"$f":"ROWS(A$5:A111)-1","v":106},{"$f":"-PMT(F111/$F$2,COUNT(A111:$A$365),E110)","v":534.39134199166972},425.28334014309075,109.10800184857897,67936.22642104594,7.4999999999999997E-2]
[{"$f":"ROWS(A$5:A112)-1","v":107},{"$f":"-PMT(F112/$F$2,COUNT(A112:$A$365),E111)","v":534.39134199166983},424.60141513153712,109.78992686013271,67826.436494185808,7.4999999999999997E-2]
[{"$f":"ROWS(A$5:A113)-1","v":108},{"$f":"-PMT(F113/$F$2,COUNT(A113:$A$365),E112)","v":534.39134199166972},423.91522808866125,110.47611390300847,67715.960380282806,7.4999999999999997E-2]
[{"$f":"ROWS(A$5:A114)-1","v":109},{"$f":"-PMT(F114/$F$2,COUNT(A114:$A$365),E113)","v":534.39134199166983},423.22475237676753,111.16658961490231,67604.7937906679,7.4999999999999997E-2]
[{"$f":"ROWS(A$5:A115)-1","v":110},{"$f":"-PMT(F115/$F$2,COUNT(A115:$A$365),E114)","v":534.39134199166983},422.52996119167437,111.86138079999546,67492.932409867906,7.4999999999999997E-2]
[{"$f":"ROWS(A$5:A116)-1","v":111},{"$f":"-PMT(F116/$F$2,COUNT(A116:$A$365),E115)","v":534.39134199166983},421.83082756167437,112.56051442999546,67380.371895437915,7.4999999999999997E-2]
[{"$f":"ROWS(A$5:A117)-1","v":112},{"$f":"-PMT(F117/$F$2,COUNT(A117:$A$365),E116)","v":534.39134199166983},421.127324346487,113.26401764518283,67267.107877792732,7.4999999999999997E-2]
[{"$f":"ROWS(A$5:A118)-1","v":113},{"$f":"-PMT(F118/$F$2,COUNT(A118:$A$365),E117)","v":534.39134199166983},420.41942423620458,113.97191775546526,67153.135960037267,7.4999999999999997E-2]
[{"$f":"ROWS(A$5:A119)-1","v":114},{"$f":"-PMT(F119/$F$2,COUNT(A119:$A$365),E118)","v":534.39134199166983},419.70709975023289,114.68424224143695,67038.451717795833,7.4999999999999997E-2]
[{"$f":"ROWS(A$5:A120)-1","v":115},{"$f":"-PMT(F120/$F$2,COUNT(A120:$A$365),E119)","v":534.39134199166983},418.99032323622396,115.40101875544588,66923.050699040381,7.4999999999999997E-2]
[{"$f":"ROWS(A$5:A121)-1","v":116},{"$f":"-PMT(F121/$F$2,COUNT(A121:$A$365),E120)","v":534.39134199166983},418.26906686900242,116.12227512266742,66806.928423917707,7.4999999999999997E-2]
[{"$f":"ROWS(A$5:A122)-1","v":117},{"$f":"-PMT(F122/$F$2,COUNT(A122:$A$365),E121)","v":534.39134199166972},417.54330264948567,116.84803934218405,66690.080384575529,7.4999999999999997E-2]
[{"$f":"ROWS(A$5:A123)-1","v":118},{"$f":"-PMT(F123/$F$2,COUNT(A123:$A$365),E122)","v":534.39134199166972},416.81300240359701,117.57833958807271,66572.502044987457,7.4999999999999997E-2]
[{"$f":"ROWS(A$5:A124)-1","v":119},{"$f":"-PMT(F124/$F$2,COUNT(A124:$A$365),E123)","v":534.39134199166983},416.07813778117156,118.31320421049827,66454.188840776958,7.4999999999999997E-2]
[{"$f":"ROWS(A$5:A125)-1","v":120},{"$f":"-PMT(F125/$F$2,COUNT(A125:$A$365),E124)","v":534.39134199166972},415.33868025485594,119.05266173681377,66335.136179040142,7.4999999999999997E-2]
[{"$f":"ROWS(A$5:A126)-1","v":121},{"$f":"-PMT(F126/$F$2,COUNT(A126:$A$365),E125)","v":534.39134199166983},414.59460111900086,119.79674087266898,66215.339438167473,7.4999999999999997E-2]
[{"$f":"ROWS(A$5:A127)-1","v":122},{"$f":"-PMT(F127/$F$2,COUNT(A127:$A$365),E126)","v":534.39134199166972},413.84587148854666,120.54547050312306,66094.793967664344,7.4999999999999997E-2]
[{"$f":"ROWS(A$5:A128)-1","v":123},{"$f":"-PMT(F128/$F$2,COUNT(A128:$A$365),E127)","v":534.39134199166972},413.0924622979021,121.29887969376762,65973.495087970572,7.4999999999999997E-2]
[{"$f":"ROWS(A$5:A129)-1","v":124},{"$f":"-PMT(F129/$F$2,COUNT(A129:$A$365),E128)","v":534.39134199166961},412.33434429981611,122.0569976918535,65851.438090278723,7.4999999999999997E-2]
[{"$f":"ROWS(A$5:A130)-1","v":125},{"$f":"-PMT(F130/$F$2,COUNT(A130:$A$365),E129)","v":534.39134199166972},411.57148806424198,122.81985392742774,65728.618236351293,7.4999999999999997E-2]
[{"$f":"ROWS(A$5:A131)-1","v":126},{"$f":"-PMT(F131/$F$2,COUNT(A131:$A$365),E130)","v":534.39134199166972},410.80386397719553,123.58747801447419,65605.030758336812,7.4999999999999997E-2]
[{"$f":"ROWS(A$5:A132)-1","v":127},{"$f":"-PMT(F132/$F$2,COUNT(A132:$A$365),E131)","v":534.39134199166961},410.03144223960504,124.35989975206456,65480.670858584745,7.4999999999999997E-2]
[{"$f":"ROWS(A$5:A133)-1","v":128},{"$f":"-PMT(F133/$F$2,COUNT(A133:$A$365),E132)","v":534.39134199166961},409.25419286615465,125.13714912551495,65355.533709459232,7.4999999999999997E-2]
[{"$f":"ROWS(A$5:A134)-1","v":129},{"$f":"-PMT(F134/$F$2,COUNT(A134:$A$365),E133)","v":534.39134199166961},408.4720856841202,125.9192563075494,{"$f":"E133-D134-G134","v":65229.614453151684},7.4999999999999997E-2]
[{"$f":"ROWS(A$5:A135)-1","v":130},{"$f":"-PMT(F135/$F$2,COUNT(A135:$A$365),E134)","v":534.39134199166961},{"$f":"E134*F135/$F$2","v":407.68509033219806},{"$f":"B135-C135","v":126.70625165947155},65102.90820149221,7.4999999999999997E-2]
[{"$f":"ROWS(A$5:A136)-1","v":131},{"$f":"-PMT(F136/$F$2,COUNT(A136:$A$365),E135)","v":534.39134199166961},406.89317625932631,127.4981657323433,64975.410035759865,7.4999999999999997E-2]
[{"$f":"ROWS(A$5:A137)-1","v":132},{"$f":"-PMT(F137/$F$2,COUNT(A137:$A$365),E136)","v":534.39134199166961},406.09631272349912,128.29502926817048,64847.115006491695,7.4999999999999997E-2]
[{"$f":"ROWS(A$5:A138)-1","v":133},{"$f":"-PMT(F138/$F$2,COUNT(A138:$A$365),E137)","v":534.39134199166961},405.29446879057309,129.09687320109651,64718.0181332906,7.4999999999999997E-2]
[{"$f":"ROWS(A$5:A139)-1","v":134},{"$f":"-PMT(F139/$F$2,COUNT(A139:$A$365),E138)","v":534.39134199166961},404.48761333306624,129.90372865860337,64588.114404631997,7.4999999999999997E-2]
[{"$f":"ROWS(A$5:A140)-1","v":135},{"$f":"-PMT(F140/$F$2,COUNT(A140:$A$365),E139)","v":534.39134199166961},403.67571502894998,130.71562696271963,64457.398777669274,7.4999999999999997E-2]
[{"$f":"ROWS(A$5:A141)-1","v":136},{"$f":"-PMT(F141/$F$2,COUNT(A141:$A$365),E140)","v":534.39134199166961},402.85874236043293,131.53259963123668,64325.866178038035,7.4999999999999997E-2]
[{"$f":"ROWS(A$5:A142)-1","v":137},{"$f":"-PMT(F142/$F$2,COUNT(A142:$A$365),E141)","v":534.39134199166961},402.03666361273775,132.35467837893185,64193.5114996591,7.4999999999999997E-2]
[{"$f":"ROWS(A$5:A143)-1","v":138},{"$f":"-PMT(F143/$F$2,COUNT(A143:$A$365),E142)","v":534.39134199166949},401.20944687286936,133.18189511880013,64060.329604540297,7.4999999999999997E-2]
[{"$f":"ROWS(A$5:A144)-1","v":139},{"$f":"-PMT(F144/$F$2,COUNT(A144:$A$365),E143)","v":534.39134199166949},400.37706002837689,134.0142819632926,63926.315322577007,7.4999999999999997E-2]
[{"$f":"ROWS(A$5:A145)-1","v":140},{"$f":"-PMT(F145/$F$2,COUNT(A145:$A$365),E144)","v":534.39134199166949},399.53947076610626,134.85187122556323,63791.463451351447,7.4999999999999997E-2]
[{"$f":"ROWS(A$5:A146)-1","v":141},{"$f":"-PMT(F146/$F$2,COUNT(A146:$A$365),E145)","v":534.39134199166949},398.69664657094654,135.69469542072295,63655.768755930723,7.4999999999999997E-2]
[{"$f":"ROWS(A$5:A147)-1","v":142},{"$f":"-PMT(F147/$F$2,COUNT(A147:$A$365),E146)","v":534.39134199166949},397.84855472456701,136.54278726710248,63519.225968663624,7.4999999999999997E-2]
[{"$f":"ROWS(A$5:A148)-1","v":143},{"$f":"-PMT(F148/$F$2,COUNT(A148:$A$365),E147)","v":534.39134199166961},396.99516230414764,137.39617968752196,63381.829788976102,7.4999999999999997E-2]
[{"$f":"ROWS(A$5:A149)-1","v":144},{"$f":"-PMT(F149/$F$2,COUNT(A149:$A$365),E148)","v":534.39134199166949},396.13643618110063,138.25490581056886,63243.574883165529,7.4999999999999997E-2]
[{"$f":"ROWS(A$5:A150)-1","v":145},{"$f":"-PMT(F150/$F$2,COUNT(A150:$A$365),E149)","v":534.39134199166949},395.27234301978456,139.11899897188493,63104.455884193645,7.4999999999999997E-2]
[{"$f":"ROWS(A$5:A151)-1","v":146},{"$f":"-PMT(F151/$F$2,COUNT(A151:$A$365),E150)","v":534.39134199166949},394.40284927621025,139.98849271545924,62964.467391478189,7.4999999999999997E-2]
[{"$f":"ROWS(A$5:A152)-1","v":147},{"$f":"-PMT(F152/$F$2,COUNT(A152:$A$365),E151)","v":534.39134199166949},393.52792119673865,140.86342079493085,62823.60397068326,7.4999999999999997E-2]
[{"$f":"ROWS(A$5:A153)-1","v":148},{"$f":"-PMT(F153/$F$2,COUNT(A153:$A$365),E152)","v":534.39134199166961},392.64752481677033,141.74381717489928,62681.860153508358,7.4999999999999997E-2]
[{"$f":"ROWS(A$5:A154)-1","v":149},{"$f":"-PMT(F154/$F$2,COUNT(A154:$A$365),E153)","v":534.39134199166961},391.76162595942719,142.62971603224241,62539.230437476115,7.4999999999999997E-2]
[{"$f":"ROWS(A$5:A155)-1","v":150},{"$f":"-PMT(F155/$F$2,COUNT(A155:$A$365),E154)","v":534.39134199166949},390.87019023422567,143.52115175744382,62395.709285718673,7.4999999999999997E-2]
[{"$f":"ROWS(A$5:A156)-1","v":151},{"$f":"-PMT(F156/$F$2,COUNT(A156:$A$365),E155)","v":534.39134199166961},389.97318303574167,144.41815895592794,62251.291126762742,7.4999999999999997E-2]
[{"$f":"ROWS(A$5:A157)-1","v":152},{"$f":"-PMT(F157/$F$2,COUNT(A157:$A$365),E156)","v":534.39134199166961},389.07056954226709,145.32077244940251,62105.970354313336,7.4999999999999997E-2]
[{"$f":"ROWS(A$5:A158)-1","v":153},{"$f":"-PMT(F158/$F$2,COUNT(A158:$A$365),E157)","v":534.39134199166949},388.16231471445832,146.22902727721117,61959.741327036128,7.4999999999999997E-2]
[{"$f":"ROWS(A$5:A159)-1","v":154},{"$f":"-PMT(F159/$F$2,COUNT(A159:$A$365),E158)","v":534.39134199166949},387.24838329397579,147.1429586976937,61812.598368338433,7.4999999999999997E-2]
[{"$f":"ROWS(A$5:A160)-1","v":155},{"$f":"-PMT(F160/$F$2,COUNT(A160:$A$365),E159)","v":534.39134199166949},386.32873980211519,148.0626021895543,61664.535766148882,7.4999999999999997E-2]
[{"$f":"ROWS(A$5:A161)-1","v":156},{"$f":"-PMT(F161/$F$2,COUNT(A161:$A$365),E160)","v":534.39134199166961},385.40334853843046,148.98799345323914,61515.547772695645,7.4999999999999997E-2]
[{"$f":"ROWS(A$5:A162)-1","v":157},{"$f":"-PMT(F162/$F$2,COUNT(A162:$A$365),E161)","v":534.39134199166961},384.47217357934778,149.91916841232182,61365.628604283324,7.4999999999999997E-2]
[{"$f":"ROWS(A$5:A163)-1","v":158},{"$f":"-PMT(F163/$F$2,COUNT(A163:$A$365),E162)","v":534.39134199166961},383.53517877677081,150.8561632148988,61214.772441068424,7.4999999999999997E-2]
[{"$f":"ROWS(A$5:A164)-1","v":159},{"$f":"-PMT(F164/$F$2,COUNT(A164:$A$365),E163)","v":534.39134199166961},382.59232775667761,151.799014234992,61062.973426833429,7.4999999999999997E-2]
[{"$f":"ROWS(A$5:A165)-1","v":160},{"$f":"-PMT(F165/$F$2,COUNT(A165:$A$365),E164)","v":534.39134199166961},381.6435839177089,152.74775807396071,60910.225668759471,7.4999999999999997E-2]
[{"$f":"ROWS(A$5:A166)-1","v":161},{"$f":"-PMT(F166/$F$2,COUNT(A166:$A$365),E165)","v":534.39134199166961},380.68891042974673,153.70243156192288,60756.523237197551,7.4999999999999997E-2]
[{"$f":"ROWS(A$5:A167)-1","v":162},{"$f":"-PMT(F167/$F$2,COUNT(A167:$A$365),E166)","v":534.39134199166972},379.72827023248465,154.66307175918507,60601.860165438367,7.4999999999999997E-2]
[{"$f":"ROWS(A$5:A168)-1","v":163},{"$f":"-PMT(F168/$F$2,COUNT(A168:$A$365),E167)","v":534.39134199166972},378.76162603398978,155.62971595767993,60446.230449480689,7.4999999999999997E-2]
[{"$f":"ROWS(A$5:A169)-1","v":164},{"$f":"-PMT(F169/$F$2,COUNT(A169:$A$365),E168)","v":534.39134199166972},377.78894030925426,156.60240168241546,60289.628047798273,7.4999999999999997E-2]
[{"$f":"ROWS(A$5:A170)-1","v":165},{"$f":"-PMT(F170/$F$2,COUNT(A170:$A$365),E169)","v":534.39134199166961},376.81017529873924,157.58116669293037,60132.046881105343,7.4999999999999997E-2]
[{"$f":"ROWS(A$5:A171)-1","v":166},{"$f":"-PMT(F171/$F$2,COUNT(A171:$A$365),E170)","v":534.39134199166961},375.8252930069084,158.56604898476121,59973.480832120586,7.4999999999999997E-2]
[{"$f":"ROWS(A$5:A172)-1","v":167},{"$f":"-PMT(F172/$F$2,COUNT(A172:$A$365),E171)","v":534.39134199166961},374.83425520075366,159.55708679091595,59813.923745329666,7.4999999999999997E-2]
[{"$f":"ROWS(A$5:A173)-1","v":168},{"$f":"-PMT(F173/$F$2,COUNT(A173:$A$365),E172)","v":534.39134199166961},373.83702340831042,160.55431858335919,59653.369426746307,7.4999999999999997E-2]
[{"$f":"ROWS(A$5:A174)-1","v":169},{"$f":"-PMT(F174/$F$2,COUNT(A174:$A$365),E173)","v":534.39134199166972},372.83355891716445,161.55778307450527,59491.811643671805,7.4999999999999997E-2]
[{"$f":"ROWS(A$5:A175)-1","v":170},{"$f":"-PMT(F175/$F$2,COUNT(A175:$A$365),E174)","v":534.39134199166972},371.82382277294874,162.56751921872097,59329.244124453086,7.4999999999999997E-2]
[{"$f":"ROWS(A$5:A176)-1","v":171},{"$f":"-PMT(F176/$F$2,COUNT(A176:$A$365),E175)","v":534.39134199166972},370.80777577783175,163.58356621383797,59165.660558239244,7.4999999999999997E-2]
[{"$f":"ROWS(A$5:A177)-1","v":172},{"$f":"-PMT(F177/$F$2,COUNT(A177:$A$365),E176)","v":534.39134199166961},369.78537848899526,164.60596350267434,59001.054594736568,7.4999999999999997E-2]
[{"$f":"ROWS(A$5:A178)-1","v":173},{"$f":"-PMT(F178/$F$2,COUNT(A178:$A$365),E177)","v":534.39134199166961},368.75659121710351,165.6347507745661,58835.419843962001,7.4999999999999997E-2]
[{"$f":"ROWS(A$5:A179)-1","v":174},{"$f":"-PMT(F179/$F$2,COUNT(A179:$A$365),E178)","v":534.39134199166961},367.7213740247625,166.66996796690711,58668.749875995098,7.4999999999999997E-2]
[{"$f":"ROWS(A$5:A180)-1","v":175},{"$f":"-PMT(F180/$F$2,COUNT(A180:$A$365),E179)","v":534.39134199166972},366.67968672496932,167.7116552667004,58501.038220728398,7.4999999999999997E-2]
[{"$f":"ROWS(A$5:A181)-1","v":176},{"$f":"-PMT(F181/$F$2,COUNT(A181:$A$365),E180)","v":534.39134199166972},365.63148887955248,168.75985311211724,58332.27836761628,7.4999999999999997E-2]
[{"$f":"ROWS(A$5:A182)-1","v":177},{"$f":"-PMT(F182/$F$2,COUNT(A182:$A$365),E181)","v":534.39134199166972},364.5767397976017,169.81460219406802,58162.46376542221,7.4999999999999997E-2]
[{"$f":"ROWS(A$5:A183)-1","v":178},{"$f":"-PMT(F183/$F$2,COUNT(A183:$A$365),E182)","v":534.39134199166961},363.5153985338888,170.87594345778081,57991.587821964429,7.4999999999999997E-2]
[{"$f":"ROWS(A$5:A184)-1","v":179},{"$f":"-PMT(F184/$F$2,COUNT(A184:$A$365),E183)","v":534.39134199166972},362.44742388727764,171.94391810439208,57819.643903860037,7.4999999999999997E-2]
[{"$f":"ROWS(A$5:A185)-1","v":180},{"$f":"-PMT(F185/$F$2,COUNT(A185:$A$365),E184)","v":534.39134199166961},361.37277439912526,173.01856759254434,57646.625336267491,7.4999999999999997E-2]
[{"$f":"ROWS(A$5:A186)-1","v":181},{"$f":"-PMT(F186/$F$2,COUNT(A186:$A$365),E185)","v":534.39134199166972},360.29140835167181,174.09993363999791,57472.525402627492,7.4999999999999997E-2]
[{"$f":"ROWS(A$5:A187)-1","v":182},{"$f":"-PMT(F187/$F$2,COUNT(A187:$A$365),E186)","v":534.39134199166961},359.20328376642186,175.18805822524774,57297.337344402244,7.4999999999999997E-2]
[{"$f":"ROWS(A$5:A188)-1","v":183},{"$f":"-PMT(F188/$F$2,COUNT(A188:$A$365),E187)","v":534.39134199166961},358.10835840251406,176.28298358915555,57121.05436081309,7.4999999999999997E-2]
[{"$f":"ROWS(A$5:A189)-1","v":184},{"$f":"-PMT(F189/$F$2,COUNT(A189:$A$365),E188)","v":534.39134199166972},357.00658975508185,177.38475223658787,56943.6696085765,7.4999999999999997E-2]
[{"$f":"ROWS(A$5:A190)-1","v":185},{"$f":"-PMT(F190/$F$2,COUNT(A190:$A$365),E189)","v":534.39134199166961},355.89793505360308,178.49340693806653,56765.176201638431,7.4999999999999997E-2]
[{"$f":"ROWS(A$5:A191)-1","v":186},{"$f":"-PMT(F191/$F$2,COUNT(A191:$A$365),E190)","v":534.39134199166961},354.78235126024015,179.60899073142946,56585.567210907,7.4999999999999997E-2]
[{"$f":"ROWS(A$5:A192)-1","v":187},{"$f":"-PMT(F192/$F$2,COUNT(A192:$A$365),E191)","v":534.39134199166961},353.65979506816871,180.7315469235009,56404.835663983496,7.4999999999999997E-2]
[{"$f":"ROWS(A$5:A193)-1","v":188},{"$f":"-PMT(F193/$F$2,COUNT(A193:$A$365),E192)","v":534.39134199166949},352.53022289989684,181.86111909177265,56222.974544891724,7.4999999999999997E-2]
[{"$f":"ROWS(A$5:A194)-1","v":189},{"$f":"-PMT(F194/$F$2,COUNT(A194:$A$365),E193)","v":534.39134199166961},351.39359090557326,182.99775108609634,56039.976793805625,7.4999999999999997E-2]
[{"$f":"ROWS(A$5:A195)-1","v":190},{"$f":"-PMT(F195/$F$2,COUNT(A195:$A$365),E194)","v":534.39134199166961},350.24985496128511,184.1414870303845,55855.83530677524,7.4999999999999997E-2]
[{"$f":"ROWS(A$5:A196)-1","v":191},{"$f":"-PMT(F196/$F$2,COUNT(A196:$A$365),E195)","v":534.39134199166949},349.09897066734521,185.29237132432428,55670.542935450918,7.4999999999999997E-2]
[{"$f":"ROWS(A$5:A197)-1","v":192},{"$f":"-PMT(F197/$F$2,COUNT(A197:$A$365),E196)","v":534.39134199166961},347.9408933465682,186.4504486451014,55484.092486805814,7.4999999999999997E-2]
[{"$f":"ROWS(A$5:A198)-1","v":193},{"$f":"-PMT(F198/$F$2,COUNT(A198:$A$365),E197)","v":534.39134199166949},346.77557804253632,187.61576394913317,{"$f":"E197-D198-G198","v":55296.476722856678},7.4999999999999997E-2]
[{"$f":"ROWS(A$5:A199)-1","v":194},{"$f":"-PMT(F199/$F$2,COUNT(A199:$A$365),E198)","v":534.39134199166949},{"$f":"E198*F199/$F$2","v":345.60297951785424},{"$f":"B199-C199","v":188.78836247381525},55107.688360382861,7.4999999999999997E-2]
[{"$f":"ROWS(A$5:A200)-1","v":195},{"$f":"-PMT(F200/$F$2,COUNT(A200:$A$365),E199)","v":534.39134199166938},344.42305225239284,189.96828973927654,54917.720070643583,7.4999999999999997E-2]
[{"$f":"ROWS(A$5:A201)-1","v":196},{"$f":"-PMT(F201/$F$2,COUNT(A201:$A$365),E200)","v":534.39134199166949},343.23575044152238,191.15559155014711,54726.564479093438,7.4999999999999997E-2]
[{"$f":"ROWS(A$5:A202)-1","v":197},{"$f":"-PMT(F202/$F$2,COUNT(A202:$A$365),E201)","v":534.39134199166949},342.04102799433394,192.35031399733555,54534.214165096106,7.4999999999999997E-2]
[{"$f":"ROWS(A$5:A203)-1","v":198},{"$f":"-PMT(F203/$F$2,COUNT(A203:$A$365),E202)","v":534.39134199166949},340.83883853185063,193.55250345981887,54340.661661636288,7.4999999999999997E-2]
[{"$f":"ROWS(A$5:A204)-1","v":199},{"$f":"-PMT(F204/$F$2,COUNT(A204:$A$365),E203)","v":534.39134199166949},339.62913538522679,194.7622066064427,54145.899455029845,7.4999999999999997E-2]
[{"$f":"ROWS(A$5:A205)-1","v":200},{"$f":"-PMT(F205/$F$2,COUNT(A205:$A$365),E204)","v":534.39134199166949},338.4118715939365,195.979470397733,53949.919984632113,7.4999999999999997E-2]
[{"$f":"ROWS(A$5:A206)-1","v":201},{"$f":"-PMT(F206/$F$2,COUNT(A206:$A$365),E205)","v":534.39134199166949},337.18699990395072,197.20434208771877,53752.715642544397,7.4999999999999997E-2]
[{"$f":"ROWS(A$5:A207)-1","v":202},{"$f":"-PMT(F207/$F$2,COUNT(A207:$A$365),E206)","v":534.39134199166961},335.95447276590249,198.43686922576711,53554.278773318627,7.4999999999999997E-2]
[{"$f":"ROWS(A$5:A208)-1","v":203},{"$f":"-PMT(F208/$F$2,COUNT(A208:$A$365),E207)","v":534.39134199166961},334.71424233324143,199.67709965842818,53354.601673660196,7.4999999999999997E-2]
[{"$f":"ROWS(A$5:A209)-1","v":204},{"$f":"-PMT(F209/$F$2,COUNT(A209:$A$365),E208)","v":534.39134199166938},333.46626046037619,200.92508153129319,53153.676592128904,7.4999999999999997E-2]
[{"$f":"ROWS(A$5:A210)-1","v":205},{"$f":"-PMT(F210/$F$2,COUNT(A210:$A$365),E209)","v":534.39134199166961},332.21047870080565,202.18086329086395,52951.495728838039,7.4999999999999997E-2]
[{"$f":"ROWS(A$5:A211)-1","v":206},{"$f":"-PMT(F211/$F$2,COUNT(A211:$A$365),E210)","v":534.39134199166949},330.94684830523772,203.44449368643177,52748.051235151608,7.4999999999999997E-2]
[{"$f":"ROWS(A$5:A212)-1","v":207},{"$f":"-PMT(F212/$F$2,COUNT(A212:$A$365),E211)","v":534.39134199166938},329.67532021969754,204.71602177197184,52543.335213379636,7.4999999999999997E-2]
[{"$f":"ROWS(A$5:A213)-1","v":208},{"$f":"-PMT(F213/$F$2,COUNT(A213:$A$365),E212)","v":534.39134199166938},328.3958450836227,205.99549690804668,52337.339716471586,7.4999999999999997E-2]
[{"$f":"ROWS(A$5:A214)-1","v":209},{"$f":"-PMT(F214/$F$2,COUNT(A214:$A$365),E213)","v":534.39134199166961},327.10837322794742,207.28296876372218,52130.056747707866,7.4999999999999997E-2]
[{"$f":"ROWS(A$5:A215)-1","v":210},{"$f":"-PMT(F215/$F$2,COUNT(A215:$A$365),E214)","v":534.39134199166949},325.81285467317417,208.57848731849532,51921.478260389369,7.4999999999999997E-2]
[{"$f":"ROWS(A$5:A216)-1","v":211},{"$f":"-PMT(F216/$F$2,COUNT(A216:$A$365),E215)","v":534.39134199166949},324.50923912743355,209.88210286423595,51711.596157525135,7.4999999999999997E-2]
[{"$f":"ROWS(A$5:A217)-1","v":212},{"$f":"-PMT(F217/$F$2,COUNT(A217:$A$365),E216)","v":534.39134199166949},323.1974759845321,211.19386600713739,51500.402291517996,7.4999999999999997E-2]
[{"$f":"ROWS(A$5:A218)-1","v":213},{"$f":"-PMT(F218/$F$2,COUNT(A218:$A$365),E217)","v":534.39134199166938},321.87751432198746,212.51382766968192,51287.888463848314,7.4999999999999997E-2]
[{"$f":"ROWS(A$5:A219)-1","v":214},{"$f":"-PMT(F219/$F$2,COUNT(A219:$A$365),E218)","v":534.39134199166949},320.54930289905195,213.84203909261754,51074.046424755696,7.4999999999999997E-2]
[{"$f":"ROWS(A$5:A220)-1","v":215},{"$f":"-PMT(F220/$F$2,COUNT(A220:$A$365),E219)","v":534.39134199166938},319.21279015472311,215.17855183694627,50858.867872918752,7.4999999999999997E-2]
[{"$f":"ROWS(A$5:A221)-1","v":216},{"$f":"-PMT(F221/$F$2,COUNT(A221:$A$365),E220)","v":534.39134199166938},317.86792420574221,216.52341778592717,50642.344455132828,7.4999999999999997E-2]
[{"$f":"ROWS(A$5:A222)-1","v":217},{"$f":"-PMT(F222/$F$2,COUNT(A222:$A$365),E221)","v":534.39134199166938},316.51465284458016,217.87668914708922,50424.467765985741,7.4999999999999997E-2]
[{"$f":"ROWS(A$5:A223)-1","v":218},{"$f":"-PMT(F223/$F$2,COUNT(A223:$A$365),E222)","v":534.39134199166949},315.15292353741086,219.23841845425864,50205.22934753148,7.4999999999999997E-2]
[{"$f":"ROWS(A$5:A224)-1","v":219},{"$f":"-PMT(F224/$F$2,COUNT(A224:$A$365),E223)","v":534.39134199166961},313.78268342207173,220.60865856959788,49984.620688961884,7.4999999999999997E-2]
[{"$f":"ROWS(A$5:A225)-1","v":220},{"$f":"-PMT(F225/$F$2,COUNT(A225:$A$365),E224)","v":534.39134199166949},312.40387930601179,221.9874626856577,49762.63322627623,7.4999999999999997E-2]
[{"$f":"ROWS(A$5:A226)-1","v":221},{"$f":"-PMT(F226/$F$2,COUNT(A226:$A$365),E225)","v":534.39134199166949},311.01645766422644,223.37488432744306,49539.258341948786,7.4999999999999997E-2]
[{"$f":"ROWS(A$5:A227)-1","v":222},{"$f":"-PMT(F227/$F$2,COUNT(A227:$A$365),E226)","v":534.39134199166972},309.62036463717988,224.77097735448984,49314.487364594293,7.4999999999999997E-2]
[{"$f":"ROWS(A$5:A228)-1","v":223},{"$f":"-PMT(F228/$F$2,COUNT(A228:$A$365),E227)","v":534.39134199166949},308.2155460287143,226.17579596295519,49088.311568631339,7.4999999999999997E-2]
[{"$f":"ROWS(A$5:A229)-1","v":224},{"$f":"-PMT(F229/$F$2,COUNT(A229:$A$365),E228)","v":534.39134199166972},306.80194730394584,227.58939468772388,48860.722173943614,7.4999999999999997E-2]
[{"$f":"ROWS(A$5:A230)-1","v":225},{"$f":"-PMT(F230/$F$2,COUNT(A230:$A$365),E229)","v":534.39134199166961},305.37951358714758,229.01182840452202,48631.71034553909,7.4999999999999997E-2]
[{"$f":"ROWS(A$5:A231)-1","v":226},{"$f":"-PMT(F231/$F$2,COUNT(A231:$A$365),E230)","v":534.39134199166961},303.94818965961929,230.44315233205032,48401.267193207037,7.4999999999999997E-2]
[{"$f":"ROWS(A$5:A232)-1","v":227},{"$f":"-PMT(F232/$F$2,COUNT(A232:$A$365),E231)","v":534.39134199166949},302.50791995754395,231.88342203412554,48169.383771172914,7.4999999999999997E-2]
[{"$f":"ROWS(A$5:A233)-1","v":228},{"$f":"-PMT(F233/$F$2,COUNT(A233:$A$365),E232)","v":534.39134199166949},301.05864856983072,233.33269342183877,47936.051077751072,7.4999999999999997E-2]
[{"$f":"ROWS(A$5:A234)-1","v":229},{"$f":"-PMT(F234/$F$2,COUNT(A234:$A$365),E233)","v":534.39134199166949},299.6003192359442,234.79102275572529,47701.260054995349,7.4999999999999997E-2]
[{"$f":"ROWS(A$5:A235)-1","v":230},{"$f":"-PMT(F235/$F$2,COUNT(A235:$A$365),E234)","v":534.39134199166949},298.13287534372091,236.25846664794858,47465.001588347404,7.4999999999999997E-2]
[{"$f":"ROWS(A$5:A236)-1","v":231},{"$f":"-PMT(F236/$F$2,COUNT(A236:$A$365),E235)","v":534.39134199166949},296.65625992717128,237.73508206449822,47227.266506282904,7.4999999999999997E-2]
[{"$f":"ROWS(A$5:A237)-1","v":232},{"$f":"-PMT(F237/$F$2,COUNT(A237:$A$365),E236)","v":534.39134199166949},295.17041566426815,239.22092632740134,46988.045579955506,7.4999999999999997E-2]
[{"$f":"ROWS(A$5:A238)-1","v":233},{"$f":"-PMT(F238/$F$2,COUNT(A238:$A$365),E237)","v":534.39134199166972},293.67528487472191,240.71605711694781,46747.329522838561,7.4999999999999997E-2]
[{"$f":"ROWS(A$5:A239)-1","v":234},{"$f":"-PMT(F239/$F$2,COUNT(A239:$A$365),E238)","v":534.39134199166961},292.17080951774102,242.22053247392859,46505.108990364635,7.4999999999999997E-2]
[{"$f":"ROWS(A$5:A240)-1","v":235},{"$f":"-PMT(F240/$F$2,COUNT(A240:$A$365),E239)","v":534.39134199166961},290.65693118977896,243.73441080189065,46261.374579562747,7.4999999999999997E-2]
[{"$f":"ROWS(A$5:A241)-1","v":236},{"$f":"-PMT(F241/$F$2,COUNT(A241:$A$365),E240)","v":534.39134199166949},289.13359112226715,245.25775086940234,46016.116828693346,7.4999999999999997E-2]
[{"$f":"ROWS(A$5:A242)-1","v":237},{"$f":"-PMT(F242/$F$2,COUNT(A242:$A$365),E241)","v":534.39134199166972},287.60073017933342,246.79061181233629,45769.326216881011,7.4999999999999997E-2]
[{"$f":"ROWS(A$5:A243)-1","v":238},{"$f":"-PMT(F243/$F$2,COUNT(A243:$A$365),E242)","v":534.39134199166972},286.05828885550631,248.33305313616341,45520.993163744846,7.4999999999999997E-2]
[{"$f":"ROWS(A$5:A244)-1","v":239},{"$f":"-PMT(F244/$F$2,COUNT(A244:$A$365),E243)","v":534.39134199166961},284.50620727340527,249.88513471826434,45271.108029026582,7.4999999999999997E-2]
[{"$f":"ROWS(A$5:A245)-1","v":240},{"$f":"-PMT(F245/$F$2,COUNT(A245:$A$365),E244)","v":534.39134199166961},282.94442518141614,251.44691681025347,45019.66111221633,7.4999999999999997E-2]
[{"$f":"ROWS(A$5:A246)-1","v":241},{"$f":"-PMT(F246/$F$2,COUNT(A246:$A$365),E245)","v":534.39134199166972},281.37288195135204,253.01846004031768,44766.642652176015,7.4999999999999997E-2]
[{"$f":"ROWS(A$5:A247)-1","v":242},{"$f":"-PMT(F247/$F$2,COUNT(A247:$A$365),E246)","v":534.39134199166983},279.79151657610009,254.59982541556974,44512.042826760444,7.4999999999999997E-2]
[{"$f":"ROWS(A$5:A248)-1","v":243},{"$f":"-PMT(F248/$F$2,COUNT(A248:$A$365),E247)","v":534.39134199166972},278.20026766725277,256.19107432441695,44255.851752436029,7.4999999999999997E-2]
[{"$f":"ROWS(A$5:A249)-1","v":244},{"$f":"-PMT(F249/$F$2,COUNT(A249:$A$365),E248)","v":534.39134199166983},276.59907345272518,257.79226853894465,43998.059483897086,7.4999999999999997E-2]
[{"$f":"ROWS(A$5:A250)-1","v":245},{"$f":"-PMT(F250/$F$2,COUNT(A250:$A$365),E249)","v":534.39134199166983},274.98787177435679,259.40347021731304,43738.656013679771,7.4999999999999997E-2]
[{"$f":"ROWS(A$5:A251)-1","v":246},{"$f":"-PMT(F251/$F$2,COUNT(A251:$A$365),E250)","v":534.39134199166972},273.36660008549853,261.02474190617119,43477.6312717736,7.4999999999999997E-2]
[{"$f":"ROWS(A$5:A252)-1","v":247},{"$f":"-PMT(F252/$F$2,COUNT(A252:$A$365),E251)","v":534.39134199166972},271.73519544858499,262.65614654308473,43214.975125230514,7.4999999999999997E-2]
[{"$f":"ROWS(A$5:A253)-1","v":248},{"$f":"-PMT(F253/$F$2,COUNT(A253:$A$365),E252)","v":534.39134199166983},270.0935945326907,264.29774745897913,42950.677377771535,7.4999999999999997E-2]
[{"$f":"ROWS(A$5:A254)-1","v":249},{"$f":"-PMT(F254/$F$2,COUNT(A254:$A$365),E253)","v":534.39134199166972},268.4417336110721,265.94960838059762,42684.727769390935,7.4999999999999997E-2]
[{"$f":"ROWS(A$5:A255)-1","v":250},{"$f":"-PMT(F255/$F$2,COUNT(A255:$A$365),E254)","v":534.39134199166983},266.77954855869331,267.61179343297653,42417.11597595796,7.4999999999999997E-2]
[{"$f":"ROWS(A$5:A256)-1","v":251},{"$f":"-PMT(F256/$F$2,COUNT(A256:$A$365),E255)","v":534.39134199166983},265.10697484973724,269.28436714193259,42147.831608816028,7.4999999999999997E-2]
[{"$f":"ROWS(A$5:A257)-1","v":252},{"$f":"-PMT(F257/$F$2,COUNT(A257:$A$365),E256)","v":534.39134199166972},263.42394755510014,270.96739443656958,41876.864214379457,7.4999999999999997E-2]
[{"$f":"ROWS(A$5:A258)-1","v":253},{"$f":"-PMT(F258/$F$2,COUNT(A258:$A$365),E257)","v":534.39134199166972},261.73040133987161,272.66094065179811,41604.20327372766,7.4999999999999997E-2]
[{"$f":"ROWS(A$5:A259)-1","v":254},{"$f":"-PMT(F259/$F$2,COUNT(A259:$A$365),E258)","v":534.39134199166972},260.02627046079789,274.36507153087183,41329.838202196792,7.4999999999999997E-2]
[{"$f":"ROWS(A$5:A260)-1","v":255},{"$f":"-PMT(F260/$F$2,COUNT(A260:$A$365),E259)","v":534.39134199166983},258.31148876372993,276.07985322793991,41053.758348968855,7.4999999999999997E-2]
[{"$f":"ROWS(A$5:A261)-1","v":256},{"$f":"-PMT(F261/$F$2,COUNT(A261:$A$365),E260)","v":534.39134199166983},256.58598968105531,277.80535231061452,40775.952996658241,7.4999999999999997E-2]
[{"$f":"ROWS(A$5:A262)-1","v":257},{"$f":"-PMT(F262/$F$2,COUNT(A262:$A$365),E261)","v":534.39134199166983},254.84970622911399,279.54163576255587,{"$f":"E261-D262-G262","v":40496.411360895683},7.4999999999999997E-2]
[{"$f":"ROWS(A$5:A263)-1","v":258},{"$f":"-PMT(F263/$F$2,COUNT(A263:$A$365),E262)","v":534.39134199166983},{"$f":"E262*F263/$F$2","v":253.10257100559804},{"$f":"B263-C263","v":281.28877098607177},40215.12258990961,7.4999999999999997E-2]
[{"$f":"ROWS(A$5:A264)-1","v":259},{"$f":"-PMT(F264/$F$2,COUNT(A264:$A$365),E263)","v":534.39134199166983},251.34451618693504,283.04682580473479,39932.075764104877,7.4999999999999997E-2]
[{"$f":"ROWS(A$5:A265)-1","v":260},{"$f":"-PMT(F265/$F$2,COUNT(A265:$A$365),E264)","v":534.39134199166983},249.5754735256555,284.81586846601431,39647.259895638861,7.4999999999999997E-2]
[{"$f":"ROWS(A$5:A266)-1","v":261},{"$f":"-PMT(F266/$F$2,COUNT(A266:$A$365),E265)","v":534.39134199166983},247.79537434774286,286.595967643927,39360.66392799493,7.4999999999999997E-2]
[{"$f":"ROWS(A$5:A267)-1","v":262},{"$f":"-PMT(F267/$F$2,COUNT(A267:$A$365),E266)","v":534.39134199166983},246.00414954996833,288.38719244170147,39072.276735553227,7.4999999999999997E-2]
[{"$f":"ROWS(A$5:A268)-1","v":263},{"$f":"-PMT(F268/$F$2,COUNT(A268:$A$365),E267)","v":534.39134199166961},244.20172959720765,290.18961239446196,38782.087123158766,7.4999999999999997E-2]
[{"$f":"ROWS(A$5:A269)-1","v":264},{"$f":"-PMT(F269/$F$2,COUNT(A269:$A$365),E268)","v":534.39134199166961},242.38804451974227,292.00329747192734,38490.083825686837,7.4999999999999997E-2]
[{"$f":"ROWS(A$5:A270)-1","v":265},{"$f":"-PMT(F270/$F$2,COUNT(A270:$A$365),E269)","v":534.39134199166983},240.56302391054271,293.82831808112712,38196.255507605711,7.4999999999999997E-2]
[{"$f":"ROWS(A$5:A271)-1","v":266},{"$f":"-PMT(F271/$F$2,COUNT(A271:$A$365),E270)","v":534.39134199166961},238.72659692253569,295.66474506913391,37900.59076253658,7.4999999999999997E-2]
[{"$f":"ROWS(A$5:A272)-1","v":267},{"$f":"-PMT(F272/$F$2,COUNT(A272:$A$365),E271)","v":534.39134199166983},236.8786922658536,297.51264972581623,37603.078112810763,7.4999999999999997E-2]
[{"$f":"ROWS(A$5:A273)-1","v":268},{"$f":"-PMT(F273/$F$2,COUNT(A273:$A$365),E272)","v":534.39134199166983},235.01923820506727,299.37210378660257,37303.706009024158,7.4999999999999997E-2]
[{"$f":"ROWS(A$5:A274)-1","v":269},{"$f":"-PMT(F274/$F$2,COUNT(A274:$A$365),E273)","v":534.39134199166961},233.14816255640096,301.24317943526864,37002.462829588891,7.4999999999999997E-2]
[{"$f":"ROWS(A$5:A275)-1","v":270},{"$f":"-PMT(F275/$F$2,COUNT(A275:$A$365),E274)","v":534.39134199166972},231.26539268493056,303.12594930673913,36699.33688028215,7.4999999999999997E-2]
[{"$f":"ROWS(A$5:A276)-1","v":271},{"$f":"-PMT(F276/$F$2,COUNT(A276:$A$365),E275)","v":534.39134199166972},229.37085550176343,305.02048648990626,36394.316393792244,7.4999999999999997E-2]
[{"$f":"ROWS(A$5:A277)-1","v":272},{"$f":"-PMT(F277/$F$2,COUNT(A277:$A$365),E276)","v":534.39134199166983},227.46447746120154,306.92686453046827,36087.389529261774,7.4999999999999997E-2]
[{"$f":"ROWS(A$5:A278)-1","v":273},{"$f":"-PMT(F278/$F$2,COUNT(A278:$A$365),E277)","v":534.39134199166972},225.54618455788611,308.84515743378358,35778.544371827993,7.4999999999999997E-2]
[{"$f":"ROWS(A$5:A279)-1","v":274},{"$f":"-PMT(F279/$F$2,COUNT(A279:$A$365),E278)","v":534.39134199166972},223.61590232392496,310.77543966774476,35467.768932160245,7.4999999999999997E-2]
[{"$f":"ROWS(A$5:A280)-1","v":275},{"$f":"-PMT(F280/$F$2,COUNT(A280:$A$365),E279)","v":534.39134199166961},221.67355582600155,312.71778616566803,35155.051145994577,7.4999999999999997E-2]
[{"$f":"ROWS(A$5:A281)-1","v":276},{"$f":"-PMT(F281/$F$2,COUNT(A281:$A$365),E280)","v":534.39134199166972},219.71906966246613,314.67227232920357,34840.378873665373,7.4999999999999997E-2]
[{"$f":"ROWS(A$5:A282)-1","v":277},{"$f":"-PMT(F282/$F$2,COUNT(A282:$A$365),E281)","v":534.39134199166961},217.75236796040858,316.638974031261,34523.739899634114,7.4999999999999997E-2]
[{"$f":"ROWS(A$5:A283)-1","v":278},{"$f":"-PMT(F283/$F$2,COUNT(A283:$A$365),E282)","v":534.39134199166983},215.77337437271319,318.61796761895664,34205.121932015158,7.4999999999999997E-2]
[{"$f":"ROWS(A$5:A284)-1","v":279},{"$f":"-PMT(F284/$F$2,COUNT(A284:$A$365),E283)","v":534.39134199166972},213.78201207509471,320.60932991657501,33884.512602098584,7.4999999999999997E-2]
[{"$f":"ROWS(A$5:A285)-1","v":280},{"$f":"-PMT(F285/$F$2,COUNT(A285:$A$365),E284)","v":534.39134199166983},211.77820376311615,322.61313822855368,33561.899463870031,7.4999999999999997E-2]
[{"$f":"ROWS(A$5:A286)-1","v":281},{"$f":"-PMT(F286/$F$2,COUNT(A286:$A$365),E285)","v":534.39134199166972},209.7618716491877,324.62947034248202,33237.269993527552,7.4999999999999997E-2]
[{"$f":"ROWS(A$5:A287)-1","v":282},{"$f":"-PMT(F287/$F$2,COUNT(A287:$A$365),E286)","v":534.39134199166983},207.7329374595472,326.65840453212263,32910.611588995431,7.4999999999999997E-2]
[{"$f":"ROWS(A$5:A288)-1","v":283},{"$f":"-PMT(F288/$F$2,COUNT(A288:$A$365),E287)","v":534.39134199166983},205.69132243122144,328.70001956044837,32581.911569434982,7.4999999999999997E-2]
[{"$f":"ROWS(A$5:A289)-1","v":284},{"$f":"-PMT(F289/$F$2,COUNT(A289:$A$365),E288)","v":534.39134199166983},203.63694730896862,330.75439468270122,32251.157174752279,7.4999999999999997E-2]
[{"$f":"ROWS(A$5:A290)-1","v":285},{"$f":"-PMT(F290/$F$2,COUNT(A290:$A$365),E289)","v":534.39134199166972},201.56973234220175,332.82160964946797,31918.335565102811,7.4999999999999997E-2]
[{"$f":"ROWS(A$5:A291)-1","v":286},{"$f":"-PMT(F291/$F$2,COUNT(A291:$A$365),E290)","v":534.39134199166972},199.48959728189254,334.90174470977718,31583.433820393035,7.4999999999999997E-2]
[{"$f":"ROWS(A$5:A292)-1","v":287},{"$f":"-PMT(F292/$F$2,COUNT(A292:$A$365),E291)","v":534.39134199166983},197.39646137745646,336.99488061421334,31246.438939778822,7.4999999999999997E-2]
[{"$f":"ROWS(A$5:A293)-1","v":288},{"$f":"-PMT(F293/$F$2,COUNT(A293:$A$365),E292)","v":534.39134199166983},195.29024337361761,339.10109861805222,30907.33784116077,7.4999999999999997E-2]
[{"$f":"ROWS(A$5:A294)-1","v":289},{"$f":"-PMT(F294/$F$2,COUNT(A294:$A$365),E293)","v":534.39134199166983},193.17086150725481,341.22048048441502,30566.117360676355,7.4999999999999997E-2]
[{"$f":"ROWS(A$5:A295)-1","v":290},{"$f":"-PMT(F295/$F$2,COUNT(A295:$A$365),E294)","v":534.39134199166983},191.03823350422724,343.35310848744257,30222.764252188914,7.4999999999999997E-2]
[{"$f":"ROWS(A$5:A296)-1","v":291},{"$f":"-PMT(F296/$F$2,COUNT(A296:$A$365),E295)","v":534.39134199166983},188.89227657618071,345.4990654154891,29877.265186773424,7.4999999999999997E-2]
[{"$f":"ROWS(A$5:A297)-1","v":292},{"$f":"-PMT(F297/$F$2,COUNT(A297:$A$365),E296)","v":534.39134199166983},186.73290741733388,347.65843457433596,29529.606752199088,7.4999999999999997E-2]
[{"$f":"ROWS(A$5:A298)-1","v":293},{"$f":"-PMT(F298/$F$2,COUNT(A298:$A$365),E297)","v":534.39134199166983},184.5600422012443,349.83129979042553,29179.775452408663,7.4999999999999997E-2]
[{"$f":"ROWS(A$5:A299)-1","v":294},{"$f":"-PMT(F299/$F$2,COUNT(A299:$A$365),E298)","v":534.39134199166983},182.37359657755414,352.01774541411567,28827.757706994547,7.4999999999999997E-2]
[{"$f":"ROWS(A$5:A300)-1","v":295},{"$f":"-PMT(F300/$F$2,COUNT(A300:$A$365),E299)","v":534.39134199166972},180.1734856687159,354.21785632295382,28473.539850671594,7.4999999999999997E-2]
[{"$f":"ROWS(A$5:A301)-1","v":296},{"$f":"-PMT(F301/$F$2,COUNT(A301:$A$365),E300)","v":534.39134199166983},177.95962406669744,356.43171792497242,28117.10813274662,7.4999999999999997E-2]
[{"$f":"ROWS(A$5:A302)-1","v":297},{"$f":"-PMT(F302/$F$2,COUNT(A302:$A$365),E301)","v":534.39134199166983},175.73192582966635,358.65941616200348,27758.448716584615,7.4999999999999997E-2]
[{"$f":"ROWS(A$5:A303)-1","v":298},{"$f":"-PMT(F303/$F$2,COUNT(A303:$A$365),E302)","v":534.39134199166983},173.49030447865383,360.90103751301604,27397.547679071598,7.4999999999999997E-2]
[{"$f":"ROWS(A$5:A304)-1","v":299},{"$f":"-PMT(F304/$F$2,COUNT(A304:$A$365),E303)","v":534.39134199166983},171.23467299419747,363.15666899747237,27034.391010074127,7.4999999999999997E-2]
[{"$f":"ROWS(A$5:A305)-1","v":300},{"$f":"-PMT(F305/$F$2,COUNT(A305:$A$365),E304)","v":534.39134199166983},168.9649438129633,365.42639817870656,26668.964611895419,7.4999999999999997E-2]
[{"$f":"ROWS(A$5:A306)-1","v":301},{"$f":"-PMT(F306/$F$2,COUNT(A306:$A$365),E305)","v":534.39134199166961},166.68102882434636,367.71031316732325,26301.254298728094,7.4999999999999997E-2]
[{"$f":"ROWS(A$5:A307)-1","v":302},{"$f":"-PMT(F307/$F$2,COUNT(A307:$A$365),E306)","v":534.39134199166972},164.38283936705059,370.00850262461915,25931.245796103474,7.4999999999999997E-2]
[{"$f":"ROWS(A$5:A308)-1","v":303},{"$f":"-PMT(F308/$F$2,COUNT(A308:$A$365),E307)","v":534.39134199166972},162.0702862256467,372.32105576602305,25558.92474033745,7.4999999999999997E-2]
[{"$f":"ROWS(A$5:A309)-1","v":304},{"$f":"-PMT(F309/$F$2,COUNT(A309:$A$365),E308)","v":534.39134199166972},159.74327962710905,374.6480623645607,25184.276677972888,7.4999999999999997E-2]
[{"$f":"ROWS(A$5:A310)-1","v":305},{"$f":"-PMT(F310/$F$2,COUNT(A310:$A$365),E309)","v":534.39134199166972},157.40172923733056,376.98961275433919,24807.287065218548,7.4999999999999997E-2]
[{"$f":"ROWS(A$5:A311)-1","v":306},{"$f":"-PMT(F311/$F$2,COUNT(A311:$A$365),E310)","v":534.39134199166961},155.04554415761592,379.34579783405366,24427.941267384496,7.4999999999999997E-2]
[{"$f":"ROWS(A$5:A312)-1","v":307},{"$f":"-PMT(F312/$F$2,COUNT(A312:$A$365),E311)","v":534.39134199166961},152.67463292115309,381.71670907051652,24046.224558313981,7.4999999999999997E-2]
[{"$f":"ROWS(A$5:A313)-1","v":308},{"$f":"-PMT(F313/$F$2,COUNT(A313:$A$365),E312)","v":534.39134199166961},150.28890348946237,384.10243850220724,23662.122119811775,7.4999999999999997E-2]
[{"$f":"ROWS(A$5:A314)-1","v":309},{"$f":"-PMT(F314/$F$2,COUNT(A314:$A$365),E313)","v":534.39134199166972},147.88826324882359,386.50307874284613,23275.619041068927,7.4999999999999997E-2]
[{"$f":"ROWS(A$5:A315)-1","v":310},{"$f":"-PMT(F315/$F$2,COUNT(A315:$A$365),E314)","v":534.39134199166972},145.47261900668079,388.9187229849889,22886.700318083938,7.4999999999999997E-2]
[{"$f":"ROWS(A$5:A316)-1","v":311},{"$f":"-PMT(F316/$F$2,COUNT(A316:$A$365),E315)","v":534.39134199166983},143.0418769880246,391.34946500364526,22495.350853080294,7.4999999999999997E-2]
[{"$f":"ROWS(A$5:A317)-1","v":312},{"$f":"-PMT(F317/$F$2,COUNT(A317:$A$365),E316)","v":534.39134199166961},140.59594283175184,393.79539915991779,22101.555453920377,7.4999999999999997E-2]
[{"$f":"ROWS(A$5:A318)-1","v":313},{"$f":"-PMT(F318/$F$2,COUNT(A318:$A$365),E317)","v":534.39134199166972},138.13472158700236,396.25662040466739,21705.29883351571,7.4999999999999997E-2]
[{"$f":"ROWS(A$5:A319)-1","v":314},{"$f":"-PMT(F319/$F$2,COUNT(A319:$A$365),E318)","v":534.39134199166972},135.65811770947317,398.73322428219655,21306.565609233512,7.4999999999999997E-2]
[{"$f":"ROWS(A$5:A320)-1","v":315},{"$f":"-PMT(F320/$F$2,COUNT(A320:$A$365),E319)","v":534.39134199166972},133.16603505770945,401.22530693396027,20905.340302299552,7.4999999999999997E-2]
[{"$f":"ROWS(A$5:A321)-1","v":316},{"$f":"-PMT(F321/$F$2,COUNT(A321:$A$365),E320)","v":534.39134199166983},130.65837688937219,403.73296510229761,20501.607337197252,7.4999999999999997E-2]
[{"$f":"ROWS(A$5:A322)-1","v":317},{"$f":"-PMT(F322/$F$2,COUNT(A322:$A$365),E321)","v":534.39134199166961},128.13504585748282,406.25629613418675,20095.351041063066,7.4999999999999997E-2]
[{"$f":"ROWS(A$5:A323)-1","v":318},{"$f":"-PMT(F323/$F$2,COUNT(A323:$A$365),E322)","v":534.39134199166949},125.59594400664416,408.79539798502532,19686.555643078042,7.4999999999999997E-2]
[{"$f":"ROWS(A$5:A324)-1","v":319},{"$f":"-PMT(F324/$F$2,COUNT(A324:$A$365),E323)","v":534.39134199166961},123.04097276923777,411.35036922243182,19275.205273855609,7.4999999999999997E-2]
[{"$f":"ROWS(A$5:A325)-1","v":320},{"$f":"-PMT(F325/$F$2,COUNT(A325:$A$365),E324)","v":534.39134199166972},120.47003296159755,413.92130903007217,18861.283964825536,7.4999999999999997E-2]
[{"$f":"ROWS(A$5:A326)-1","v":321},{"$f":"-PMT(F326/$F$2,COUNT(A326:$A$365),E325)","v":534.39134199166961},117.88302478015959,416.50831721151002,{"$f":"E325-D326-G326","v":18444.775647614028},7.4999999999999997E-2]
[{"$f":"ROWS(A$5:A327)-1","v":322},{"$f":"-PMT(F327/$F$2,COUNT(A327:$A$365),E326)","v":534.39134199166961},{"$f":"E326*F327/$F$2","v":115.27984779758766},{"$f":"B327-C327","v":419.11149419408196},18025.664153419944,7.4999999999999997E-2]
[{"$f":"ROWS(A$5:A328)-1","v":323},{"$f":"-PMT(F328/$F$2,COUNT(A328:$A$365),E327)","v":534.39134199166961},112.66040095887466,421.73094103279493,17603.93321238715,7.4999999999999997E-2]
[{"$f":"ROWS(A$5:A329)-1","v":324},{"$f":"-PMT(F329/$F$2,COUNT(A329:$A$365),E328)","v":534.39134199166972},110.02458257741968,424.36675941425005,17179.5664529729,7.4999999999999997E-2]
[{"$f":"ROWS(A$5:A330)-1","v":325},{"$f":"-PMT(F330/$F$2,COUNT(A330:$A$365),E329)","v":534.39134199166972},107.37229033108063,427.01905166058907,16752.547401312309,7.4999999999999997E-2]
[{"$f":"ROWS(A$5:A331)-1","v":326},{"$f":"-PMT(F331/$F$2,COUNT(A331:$A$365),E330)","v":534.39134199166949},104.70342125820194,429.68792073346754,16322.859480578842,7.4999999999999997E-2]
[{"$f":"ROWS(A$5:A332)-1","v":327},{"$f":"-PMT(F332/$F$2,COUNT(A332:$A$365),E331)","v":534.39134199166961},102.01787175361777,432.37347023805182,15890.48601034079,7.4999999999999997E-2]
[{"$f":"ROWS(A$5:A333)-1","v":328},{"$f":"-PMT(F333/$F$2,COUNT(A333:$A$365),E332)","v":534.39134199166949},99.315537564629935,435.07580442703954,15455.410205913751,7.4999999999999997E-2]
[{"$f":"ROWS(A$5:A334)-1","v":329},{"$f":"-PMT(F334/$F$2,COUNT(A334:$A$365),E333)","v":534.39134199166961},96.596313786960934,437.79502820470867,15017.615177709042,7.4999999999999997E-2]
[{"$f":"ROWS(A$5:A335)-1","v":330},{"$f":"-PMT(F335/$F$2,COUNT(A335:$A$365),E334)","v":534.39134199166949},93.8600948606815,440.53124713098799,14577.083930578054,7.4999999999999997E-2]
[{"$f":"ROWS(A$5:A336)-1","v":331},{"$f":"-PMT(F336/$F$2,COUNT(A336:$A$365),E335)","v":534.39134199166961},91.106774566112833,443.28456742555676,14133.799363152497,7.4999999999999997E-2]
[{"$f":"ROWS(A$5:A337)-1","v":332},{"$f":"-PMT(F337/$F$2,COUNT(A337:$A$365),E336)","v":534.39134199166949},88.336246019703097,446.05509597196641,13687.744267180531,7.4999999999999997E-2]
[{"$f":"ROWS(A$5:A338)-1","v":333},{"$f":"-PMT(F338/$F$2,COUNT(A338:$A$365),E337)","v":534.39134199166972},85.548401669878317,448.84294032179139,13238.901326858741,7.4999999999999997E-2]
[{"$f":"ROWS(A$5:A339)-1","v":334},{"$f":"-PMT(F339/$F$2,COUNT(A339:$A$365),E338)","v":534.39134199166961},82.743133292867128,451.64820869880248,12787.253118159939,7.4999999999999997E-2]
[{"$f":"ROWS(A$5:A340)-1","v":335},{"$f":"-PMT(F340/$F$2,COUNT(A340:$A$365),E339)","v":534.39134199166972},79.920331988499612,454.47101000317014,12332.782108156769,7.4999999999999997E-2]
[{"$f":"ROWS(A$5:A341)-1","v":336},{"$f":"-PMT(F341/$F$2,COUNT(A341:$A$365),E340)","v":534.39134199166972},77.079888175979804,457.3114538156899,11875.470654341079,7.4999999999999997E-2]
[{"$f":"ROWS(A$5:A342)-1","v":337},{"$f":"-PMT(F342/$F$2,COUNT(A342:$A$365),E341)","v":534.39134199166961},74.221691589631746,460.16965040203786,11415.301003939041,7.4999999999999997E-2]
[{"$f":"ROWS(A$5:A343)-1","v":338},{"$f":"-PMT(F343/$F$2,COUNT(A343:$A$365),E342)","v":534.39134199166972},71.345631274619009,463.04571071705072,10952.25529322199,7.4999999999999997E-2]
[{"$f":"ROWS(A$5:A344)-1","v":339},{"$f":"-PMT(F344/$F$2,COUNT(A344:$A$365),E343)","v":534.39134199166972},68.451595582637438,465.9397464090323,10486.315546812957,7.4999999999999997E-2]
[{"$f":"ROWS(A$5:A345)-1","v":340},{"$f":"-PMT(F345/$F$2,COUNT(A345:$A$365),E344)","v":534.39134199166949},65.539472167580982,468.85186982408851,10017.463676988869,7.4999999999999997E-2]
[{"$f":"ROWS(A$5:A346)-1","v":341},{"$f":"-PMT(F346/$F$2,COUNT(A346:$A$365),E345)","v":534.39134199166972},62.609147981180428,471.78219401048932,9545.6814829783798,7.4999999999999997E-2]
[{"$f":"ROWS(A$5:A347)-1","v":342},{"$f":"-PMT(F347/$F$2,COUNT(A347:$A$365),E346)","v":534.39134199166961},59.660509268614874,474.73083272305473,9070.9506502553249,7.4999999999999997E-2]
[{"$f":"ROWS(A$5:A348)-1","v":343},{"$f":"-PMT(F348/$F$2,COUNT(A348:$A$365),E347)","v":534.39134199166961},56.693441564095785,477.69790042757381,8593.2527498277504,7.4999999999999997E-2]
[{"$f":"ROWS(A$5:A349)-1","v":344},{"$f":"-PMT(F349/$F$2,COUNT(A349:$A$365),E348)","v":534.39134199166972},53.707829686423445,480.68351230524627,8112.5692375225044,7.4999999999999997E-2]
[{"$f":"ROWS(A$5:A350)-1","v":345},{"$f":"-PMT(F350/$F$2,COUNT(A350:$A$365),E349)","v":534.39134199166961},50.703557734515648,483.68778425715396,7628.8814532653505,7.4999999999999997E-2]
[{"$f":"ROWS(A$5:A351)-1","v":346},{"$f":"-PMT(F351/$F$2,COUNT(A351:$A$365),E350)","v":534.39134199166961},47.680509082908436,486.71083290876118,7142.1706203565891,7.4999999999999997E-2]
[{"$f":"ROWS(A$5:A352)-1","v":347},{"$f":"-PMT(F352/$F$2,COUNT(A352:$A$365),E351)","v":534.39134199166961},44.638566377228678,489.75277561444091,6652.4178447421482,7.4999999999999997E-2]
[{"$f":"ROWS(A$5:A353)-1","v":348},{"$f":"-PMT(F353/$F$2,COUNT(A353:$A$365),E352)","v":534.39134199166961},41.577611529638425,492.81373046203117,6159.6041142801168,7.4999999999999997E-2]
[{"$f":"ROWS(A$5:A354)-1","v":349},{"$f":"-PMT(F354/$F$2,COUNT(A354:$A$365),E353)","v":534.39134199166949},38.497525714250727,495.89381627741875,5663.7102980026984,7.4999999999999997E-2]
[{"$f":"ROWS(A$5:A355)-1","v":350},{"$f":"-PMT(F355/$F$2,COUNT(A355:$A$365),E354)","v":534.39134199166972},35.398189362516867,498.99315262915286,5164.7171453735455,7.4999999999999997E-2]
[{"$f":"ROWS(A$5:A356)-1","v":351},{"$f":"-PMT(F356/$F$2,COUNT(A356:$A$365),E355)","v":534.39134199166961},32.279482158584656,502.11185983308496,4662.6052855404605,7.4999999999999997E-2]
[{"$f":"ROWS(A$5:A357)-1","v":352},{"$f":"-PMT(F357/$F$2,COUNT(A357:$A$365),E356)","v":534.39134199166961},29.141283034627875,505.25005895704174,4157.3552265834187,7.4999999999999997E-2]
[{"$f":"ROWS(A$5:A358)-1","v":353},{"$f":"-PMT(F358/$F$2,COUNT(A358:$A$365),E357)","v":534.39134199166961},25.983470166146365,508.40787182552322,3648.9473547578955,7.4999999999999997E-2]
[{"$f":"ROWS(A$5:A359)-1","v":354},{"$f":"-PMT(F359/$F$2,COUNT(A359:$A$365),E358)","v":534.39134199166961},22.805920967236844,511.58542102443278,3137.3619337334626,7.4999999999999997E-2]
[{"$f":"ROWS(A$5:A360)-1","v":355},{"$f":"-PMT(F360/$F$2,COUNT(A360:$A$365),E359)","v":534.39134199166949},19.608512085834139,514.78282990583534,2622.5791038276275,7.4999999999999997E-2]
[{"$f":"ROWS(A$5:A361)-1","v":356},{"$f":"-PMT(F361/$F$2,COUNT(A361:$A$365),E360)","v":534.39134199166961},16.391119398922672,518.00022259274692,2104.5788812348806,7.4999999999999997E-2]
[{"$f":"ROWS(A$5:A362)-1","v":357},{"$f":"-PMT(F362/$F$2,COUNT(A362:$A$365),E361)","v":534.39134199166949},13.153618007718002,521.23772398395147,1583.341157250929,7.4999999999999997E-2]
[{"$f":"ROWS(A$5:A363)-1","v":358},{"$f":"-PMT(F363/$F$2,COUNT(A363:$A$365),E362)","v":534.39134199166949},9.8958822328183054,524.49545975885121,1058.8456974920778,7.4999999999999997E-2]
[{"$f":"ROWS(A$5:A364)-1","v":359},{"$f":"-PMT(F364/$F$2,COUNT(A364:$A$365),E363)","v":534.39134199166961},6.6177856093254865,527.77355638234417,531.07214110973359,7.4999999999999997E-2]
[{"$f":"ROWS(A$5:A365)-1","v":360},{"$f":"-PMT(F365/$F$2,COUNT(A365:$A$365),E364)","v":534.39134199166949},3.319200881935835,531.07214110973371,-1.1368683772161603E-13,7.4999999999999997E-2]

{"sheet":"Styles(1)","index":21,"n_rows":15,"n_cols":6,"rows_kept":15,"cut":false,"hidden":false,"merged":[]}
[]
["Invoice #","Date","SalesRep","Product sold","UnitsSold","Total Sales"]
[5513,"2010-01-10","Bill","Boom 5",26,364]
[5514,"2010-01-10","Tina","Boom 1",21,210]
[5515,"2010-01-10","Bob","Boom 11",10,189.5]
[5516,"2010-01-10","Bob","Boom 2",12,144]
[5517,"2010-01-10","Bob","Boom 9",10,169.5]
[5518,"2010-01-10","Donita","Boom 11",13,246.35]
[5519,"2010-01-10","Chin","Boom 4",18,233.1]
[5520,"2010-01-10","Bill","Boom 8",8,127.6]
[5521,"2010-01-10","Sioux","Boom 8",26,414.7]
[5522,"2010-01-10","Donita","Boom 2",28,336]
[5523,"2010-01-10","Donita","Boom 7",17,271.14999999999998]
[5524,"2010-01-10","Sioux","Boom 15",13,567.97]
[5525,"2010-01-10","Shelia","Boom 1",20,200]

{"sheet":"Styles(2)","index":22,"n_rows":28,"n_cols":7,"rows_kept":28,"cut":false,"hidden":false,"merged":[[17,0,18,0],[17,1,18,1],[17,2,18,2],[17,3,17,4]]}
["Wind Sport Inc."]
[null,"Jul","Aug","Sep","Oct","Nov","Dec"]
["Boomerangs",{"$f":"B11*1.075","v":376.25},293.47499999999997,403.125,537.5,1026.625,1173.8999999999999]
["Kites",1028.7749999999999,994.375,1343.75,1182.5,2160.75,2461.75]
["Toys",172,236.5,312.82499999999999,479.45,577.27499999999998,223.6]
["Accessories",564.375,671.875,612.75,915.9,806.25,618.125]
["Total",{"$f":"SUM(B3:B6)","v":2141.3999999999996},{"$f":"SUM(C3:C6)","v":2196.2249999999999},2672.45,3115.35,4570.8999999999996,4477.375]
[]
["Wind Sport Inc."]
[null,"Jan","Feb","Mar","Apr","May","Jun"]
["Boomerangs",350,273,375,500,955,1092]
["Kites",957,925,1250,1100,2010,2290]
["Toys",160,220,291,446,537,208]
["Accessories",525,625,570,852,750,575]
["Total",{"$f":"SUM(B11:B14)","v":1992},2043,2486,2898,4252,4165]
[]
["Cash Account"]
["Date","DR","CR","Balance"]
[null,null,null,"DR","CR"]
["2010-01-12",500,null,{"$f":"IF(OR($A20=\"\",SUM($B$20:$B20)-SUM($C$20:$C20)<0),\"\",ABS(SUM($B$20:$B20)-SUM($C$20:$C20)))","v":500},{"$f":"IF(OR($A20=\"\",SUM($B$20:$B20)-SUM($C$20:$C20)>=0),\"\",ABS(SUM($B$20:$B20)-SUM($C$20:$C20)))","v":""}]
["2010-01-13",null,600,{"$f":"IF(OR($A21=\"\",SUM($B$20:$B21)-SUM($C$20:$C21)<0),\"\",ABS(SUM($B$20:$B21)-SUM($C$20:$C21)))","v":""},{"$f":"IF(OR($A21=\"\",SUM($B$20:$B21)-SUM($C$20:$C21)>=0),\"\",ABS(SUM($B$20:$B21)-SUM($C$20:$C21)))","v":100}]
["2010-01-14",750,null,{"$f":"IF(OR($A22=\"\",SUM($B$20:$B22)-SUM($C$20:$C22)<0),\"\",ABS(SUM($B$20:$B22)-SUM($C$20:$C22)))","v":650},{"$f":"IF(OR($A22=\"\",SUM($B$20:$B22)-SUM($C$20:$C22)>=0),\"\",ABS(SUM($B$20:$B22)-SUM($C$20:$C22)))","v":""}]
["2010-01-15",null,1000,{"$f":"IF(OR($A23=\"\",SUM($B$20:$B23)-SUM($C$20:$C23)<0),\"\",ABS(SUM($B$20:$B23)-SUM($C$20:$C23)))","v":""},{"$f":"IF(OR($A23=\"\",SUM($B$20:$B23)-SUM($C$20:$C23)>=0),\"\",ABS(SUM($B$20:$B23)-SUM($C$20:$C23)))","v":350}]
[null,null,null,{"$f":"IF(OR($A24=\"\",SUM($B$20:$B24)-SUM($C$20:$C24)<0),\"\",ABS(SUM($B$20:$B24)-SUM($C$20:$C24)))","v":""},{"$f":"IF(OR($A24=\"\",SUM($B$20:$B24)-SUM($C$20:$C24)>=0),\"\",ABS(SUM($B$20:$B24)-SUM($C$20:$C24)))","v":""}]
[null,null,null,{"$f":"IF(OR($A25=\"\",SUM($B$20:$B25)-SUM($C$20:$C25)<0),\"\",ABS(SUM($B$20:$B25)-SUM($C$20:$C25)))","v":""},{"$f":"IF(OR($A25=\"\",SUM($B$20:$B25)-SUM($C$20:$C25)>=0),\"\",ABS(SUM($B$20:$B25)-SUM($C$20:$C25)))","v":""}]
[null,null,"Balance",{"$f":"IF(SUM($B$20:$B$25)>=SUM($C$20:$C$25),LOOKUP(10^10,D$20:D$25),\"\")","v":""},{"$f":"IF(SUM($B$20:$B$25)<SUM($C$20:$C$25),LOOKUP(10^10,E$20:E$25),\"\")","v":350}]
[]
[null,null,"carry forward",null,{"$f":"SUM(D26:E26)","v":350}]

{"sheet":"Formula(1)","index":23,"n_rows":14,"n_cols":5,"rows_kept":14,"cut":false,"hidden":false,"merged":[]}
[{"$f":"\"Cell \"&ADDRESS(ROW(B4),COLUMN(B4),4)&\" contains a formula because the 1st character in the cell is an equal sign and the cell does not have Text Number format\"","v":"Cell B4 contains a formula because the 1st character in the cell is an equal sign and the cell does not have Text Number format"}]
["Sales",100]
["Expenses",91.25]
["Net Income",{"$f":"B2-B3","v":8.75},null,{"$f":"B2-B3","v":8.75}]
[]
[{"$f":"\"Cell \"&ADDRESS(ROW(B9),COLUMN(B9),4)&\" does NOT contain a formula because the 1st character in the cell is a space\"","v":"Cell B9 does NOT contain a formula because the 1st character in the cell is a space"}]
["Sales",100]
["Expenses",91.25,null,null,"LEN function tells how many characters are in the cell"]
["Net Income"," =B7-B8",null,{"$f":"B7-B8","v":8.75},{"$f":"LEN(B9)","v":7}]
[]
[{"$f":"\"Cell \"&ADDRESS(ROW(B9),COLUMN(B9),4)&\" does NOT contain a formula because the Text Number format has been applied to the cell\"","v":"Cell B9 does NOT contain a formula because the Text Number format has been applied to the cell"}]
["Sales",100]
["Expenses",91.25]
["Net Income","=B12-B13",null,{"$f":"B12-B13","v":8.75}]

{"sheet":"Formula(2)","index":24,"n_rows":83,"n_cols":5,"rows_kept":83,"cut":false,"hidden":false,"merged":[]}
["Equal Sign, Cell References And Math Operator (Multiply *)"]
["Item","2 x 4 pine lumber"]
[{"$f":"\"Number of \"&B2","v":"Number of 2 x 4 pine lumber"},15]
[{"$f":"\"Price per \"&B2","v":"Price per 2 x 4 pine lumber"},3.59]
["Subtotal",{"$f":"B4*B3","v":53.849999999999994}]
[]
["Equal Sign, Cell Reference, Math Operator, Number"]
["Annual Insurance",5250,12]
["Monthly Allocation",{"$f":"B8/12","v":437.5}]
[]
["Equal Sign, Built-in Function, Range of Cells"]
["Student 1",88.5]
["Student 2",92]
["Student 3",67]
["Student 4",78]
["Average",{"$f":"AVERAGE(B12:B15)","v":81.375}]
[]
["Equal Sign, Cell Reference, Math Operator, Built-in Function"]
["Revenue",15000]
["Administrative Expense",4590]
["Operational Expenses",8022]
["Other Expenses",78]
["Net Income",{"$f":"B19-SUM(B20:B22)","v":2310}]
[]
["Equal Sign, Cell Reference, Comparative Operators"]
["DR","CR"]
[200,200]
[50.01,50.01]
[22.1,22.1]
[{"$f":"SUM(A27:A29)","v":272.11},{"$f":"SUM(B27:B29)","v":272.11}]
[]
["In Balance?",{"$f":"A30=B30","v":true}]
[]
["Equal Sign, Cell Reference,\nJoin Symbol (Ampersand = Shift + 7 = &),\nText in Quotes"]
["First","Last","First & Last"]
["Bill","Masters",{"$f":"A36&\" \"&B36","v":"Bill Masters"}]
["Tina","Smith",{"$f":"A37&\" \"&B37","v":"Tina Smith"}]
["Sioux","Lim","Sioux Lim"]
["Sue","Chin","Sue Chin"]
["Luong","Pham","Luong Pham"]
[]
["Sales",null,"Hurdle"]
[512,null,600]
[400,null,{"$f":"\"Number of Sales Greater Than \"&DOLLAR(C43)","v":"Number of Sales Greater Than $600.00"},null," <== Equal Sign, Text in Quotes, Join Symbol, Cell References, DOLLAR function"]
[395,null,{"$f":"COUNTIF(A43:A48,\">\"&C43)","v":2},null," <== Equal Sign, COUNTIF Function, Cell Range, Text in Quotes, Join Symbol, Cell Reference"]
[875]
[652]
[395]
[]
["Equal Sign, SUM function, LARGE function, Cell Range, Array Constant"]
["MAXIMUM Time Aloft Score Sheet"]
["Thrower","Throw 1","Throw 2","Throw 3","SUM of Best Two"]
["Daniel",45.99,23.78,51.02,{"$f":"SUM(LARGE(B53:D53,{1,2}))","v":97.01}]
["Richard",40.22,42.32,43.69,{"$f":"SUM(LARGE(B54:D54,{1,2}))","v":86.009999999999991}]
["Matt",37.549999999999997,34.200000000000003,31.5,{"$f":"SUM(LARGE(B55:D55,{1,2}))","v":71.75}]
["Stevie",69.430000000000007,0,56.11,{"$f":"SUM(LARGE(B56:D56,{1,2}))","v":125.54}]
[]
["Not in Book at this point (we will cover thes later in this chapter, but this is a preview):"]
[]
["EmployeeName","LookupE-Mail"]
["Christina Kim",{"$f":"VLOOKUP(A61,A64:D71,4,0)","v":"Kim@gmail.com"}," <<== Lookup formula"]
[]
["EmployeeName","Department","HireDate","E-Mail"]
["Sioux Timmy","Accounting","2006-11-20","Timmy@yahoo.com"]
["John Pfeffer","Finance","2011-01-28","Pfeffer@gmail.com"]
["Fred Smith","Human Resource","2009-05-25","Smith@yahoo.com"]
["Ron Sabado","Accounting","2009-09-17","Sabado@eif.com"]
["Christina Kim","Accounting","2005-11-22","Kim@gmail.com"]
["Chin Pham","Finance","2005-05-01","Pham@yahoo.com"]
["June Sunny","Finance","2008-10-16","Sunny@yahoo.com"]
["Sheliadawn Bo","Human Resource","2005-10-21","Bo@eif.com"]
[]
["Date","Sales",null,"Criteria = Year"]
["2009-11-26",790772,null,2010]
["2010-01-25",669253,null,"Add"]
["2011-01-30",653699,null,{"$f":"SUMPRODUCT(--(YEAR(A74:A81)=D74),B74:B81)","v":3048762}]
["2010-10-05",638300,null," <\n<\n<\n<\n<\n<"]
["2010-01-26",955656,null,"Array Formula"]
["2010-11-14",785553]
["2009-10-22",682300]
["2011-01-08",623663]
[]
[null,null,{"$f":"YEAR(A74)","v":2009}]

{"sheet":"MathOperators","index":25,"n_rows":15,"n_cols":3,"rows_kept":15,"cut":false,"hidden":false,"merged":[]}
["Math Operators"]
[" ( ) represents Parentheses",null," Shift + 9 and Shift + 0"]
[" ^ represents Exponents (powers and roots)",null," Shift + 6"]
[" * represents Multiplication",null," * on Number pad"]
[" /  represents Division",null," / on Number pad"]
[" + represents Addition",null," + on Number pad"]
[" – represents Subtraction",null," - on Number pad"]
[]
["Comparative Operators"]
[" > Greater Than"]
[" >= Greater Than Or Equal To"]
[" < Less Than"]
[" <= Less Than Or Equal To"]
[" = Equal To"]
[" <> Not Equal To"]

{"sheet":"OrderOfOperations","index":26,"n_rows":26,"n_cols":15,"rows_kept":26,"cut":false,"hidden":false,"merged":[]}
["Order of Operations",null,null,null,null,"Beg Qty","End Qty","Value Each","COGS"]
[1,"Please","Parenthesis","( )",null,10,3,5,{"$f":"F2-G2*H2","v":-5}]
[2,"Excuse","Exponents"," ^",null,"Beg Qty","End Qty","Value Each","COGS",null,"COGS calculation"]
[3,"My Dear","Multiply & Divide (Left to Right)"," * , /",null,10,3,5,{"$f":"(F4-G4)*H4","v":35},null,{"$f":"F4&\" - \"&G4&\" * \"&H4&\" = \"&F4-G4*H4","v":"10 - 3 * 5 = -5"}]
[4,"Aunt Sally","Adding & Subtracting (Left To Right)"," + , -",null,null,null,null,null,null,{"$f":"M5&\" - \"&N5*O5&\" = \"&M5-N5*O5","v":"10 - 15 = -5"},null,10,3,5]
[null,null,null,null,null,null,null,null,null,null,{"$f":"M6-N6*O6&\" = \"&M6-N6*O6","v":"-5 = -5"},null,10,3,5]
[null,null,"Excel's Order of Operations:",null,null,null,null,null,"8+2*2"]
[null,null,"Parenthesis ( )",null,null,null,null,null,{"$f":"(8+2)*2","v":20}]
[null,null,"Ranges use of colon symbol \":\"",null,null,null,null,null,"8+2*2"]
[null,null,"Example: =SUM(A1:A4)",null,9,4,32,null,{"$f":"8+2*2","v":12}]
[null,null,"Evaluate intersections with spaces",null,14,30,7,null,{"$f":"8+2*2","v":12},{"$f":"(8+2)*2","v":20}]
[null,null,"Example: =E12:G12 F10:F15 (retrieve what is in F12)",null,29,29,26]
[null,null,"Evaluate unions (,)",null,11,26,30]
[null,null,"Example: =SUM(E10:G10,E14:G14)",null,27,20,12]
[null,null,"Negation (-)",null,33,27,2]
[null,null,"Example: =-2^4 è 16"]
[null,null,"Example: =-(2^4) è -16",null,"Space",{"$f":"E12:G12 F10:F15","v":29}]
[null,null,"Converts % (1% è .01)",null,"Union",{"$f":"SUM(E10:G10,E14:G14)","v":104}]
[null,null,"Exponents (^)",null,null,{"$f":"1000-SUM(F10:F15 E12:G12,E10:G10)","v":926}]
[null,null,"Example: 4^(1/2) = 2",null,null,{"$f":"1%","v":0.01}]
[null,null,"Example: 3^2 = 9"]
[null,null,"Multiplication (*) and division (/), left to right"]
[null,null,"Adding (+) and subtracting (-), left to right"]
[null,null,"Ampersand (&)"]
[null,null,"Comparative symbols: =, <>, >=, <=, <, >"]
[null,null,"If anything is still left, then left to right"]

{"sheet":"OOO","index":27,"n_rows":6,"n_cols":10,"rows_kept":6,"cut":false,"hidden":false,"merged":[]}
["Sales","Expenses","Profit Hurdle","Question","Pass Hurdle = Bonus"]
[500,392,100,{"$f":"\"Is \"&A2&\"-\"&B2&\" > \"&C2&\" TRUE or FALSE?\"","v":"Is 500-392 > 100 TRUE or FALSE?"},{"$f":"A2-B2>C2","v":true},null,"value_if_true","value_if_false",null,{"$f":"A2&\" - \"&B2&\" > \"&C2","v":"500 - 392 > 100"}]
[500,392,100,{"$f":"\"Is \"&A3&\"-\"&B3&\" > \"&C3&\", \"&G3&\" or \"&H3&\"?\"","v":"Is 500-392 > 100, Yes or No?"},{"$f":"IF(A3-B3>C3,G3,H3)","v":"Yes"},null,"Yes","No",null,{"$f":"A2-B2&\" > \"&C2","v":"108 > 100"}]
[500,392,100,{"$f":"\"Is \"&A4&\"-\"&B4&\" > \"&C4&\", \"&G4&\" or \"&H4&\"?\"","v":"Is 500-392 > 100, 10 or 0?"},{"$f":"IF(A4-B4>C4,G4,H4)","v":10},null,10,0,null,{"$f":"A2-B2>C2","v":true}]
[]
[null,null,700]

{"sheet":"3WaysToGetCR","index":28,"n_rows":14,"n_cols":10,"rows_kept":14,"cut":false,"hidden":false,"merged":[]}
["Date","Sales","COGS","Gross Profit",null,null,"Sales","Earned","Bonus","Hurdle"]
["2011-11-06",7038,{"$f":"B2*F$14","v":4574.7},{"$f":"B2-C2","v":2463.3000000000002},null,null,10000,{"$f":"IF(G2>=J2,I2,0)","v":500},500,10000]
["2011-11-07",5938,{"$f":"B3*F$14","v":3859.7000000000003},2078.2999999999997]
["2011-11-08",6578,{"$f":"B4*F$14","v":4275.7},2302.3000000000002]
["2011-11-09",7890,{"$f":"B5*F14","v":5128.5},{"$f":"B5-C5","v":2761.5}]
[]
[]
[]
[]
[]
[]
[]
[null,null,null,null,null,"COGS %"]
[null,null,null,null,null,0.65]

{"sheet":"CR(1)","index":29,"n_rows":7,"n_cols":4,"rows_kept":7,"cut":false,"hidden":false,"merged":[]}
["Month","Total Revenue","Total Expenses","Net Income"]
["Jan",20000,13050,{"$f":"B2-C2","v":6950}]
["Feb",20300,13245.75,{"$f":"B3-C3","v":7054.25}]
["Mar",20604.5,13444.449999999999,{"$f":"B4-C4","v":7160.0500000000011}]
["Apr",20913.57,13646.11,7267.4599999999991]
["May",21227.27,13850.809999999998,7376.4600000000028]
["Jun",21545.68,14058.539999999999,{"$f":"B7-C7","v":7487.1400000000012}]

{"sheet":"CR(2)","index":30,"n_rows":19,"n_cols":7,"rows_kept":19,"cut":false,"hidden":false,"merged":[]}
[null,"Retail Selling Price by Margin"]
["Items",{"$f":"B18","v":0.45},{"$f":"B2+$B19","v":0.5},{"$f":"C2+$B19","v":0.55000000000000004},"New Price","New Price","New Price"]
[{"$f":"A12","v":"Sofa"},{"$f":"$B12/(1-B$2)","v":1087.2727272727273},{"$f":"$B12/(1-C$2)","v":1196},1328.8888888888889,{"$f":"B3*$B$11","v":1141.6363636363637},1255.8,1395.3333333333335]
["Head Lamp",{"$f":"$B13/(1-B$2)","v":154.54545454545453},170,188.88888888888891,162.27272727272725,178.5,198.33333333333337]
["Table",276.36363636363632,304,337.77777777777783,290.18181818181813,319.2,354.66666666666674]
["Chair",179.99999999999997,198,220.00000000000003,188.99999999999997,207.9,231.00000000000003]
["Dining Set",1045.4545454545453,1150,1277.7777777777778,1097.7272727272725,1207.5,1341.6666666666667]
["Picture",45.454545454545453,50,55.555555555555564,47.727272727272727,52.5,58.333333333333343]
[]
["Assumption Table"]
["Increase in Price",1.05]
["Sofa",598]
["Head Lamp",85]
["Table",152]
["Chair",99]
["Dining Set",575]
["Picture",25]
[{"$f":"B1&\" Starting Point\"","v":"Retail Selling Price by Margin Starting Point"},0.45]
["Increment",0.05]

{"sheet":"CR(3)","index":31,"n_rows":52,"n_cols":3,"rows_kept":52,"cut":false,"hidden":false,"merged":[]}
["Assumption Table\ncontains\nFormula Inputs"]
["Commission Rate",0.04]
[]
["SalesRep","Sales","Earned Commision"]
["Abraham",1161,{"$f":"B5*B$2","v":46.44}]
["Hironobu",1321,{"$f":"B6*B$2","v":52.84}]
["Daniel",1039,41.56]
["Dante",1761,70.44]
["Sarah B",1561,62.440000000000005]
["Tonya",1868,74.72]
["Janita",2787,111.48]
["Debra",1849,73.960000000000008]
["Tiara",2627,105.08]
["Andrea",2165,86.600000000000009]
["Faye",1589,63.56]
["Viktor",2603,104.12]
["Na",2366,94.64]
["Ryan",2107,84.28]
["Damir",2886,115.44]
["Sunita",1886,75.44]
["Meghan",2177,87.08]
["Cynthia",1873,74.92]
["Trevor",2164,86.56]
["John",1394,55.76]
["Sang",2263,90.52]
["Dina",2242,89.68]
["Tony",1474,58.96]
["Nikolay",1998,79.92]
["Thanh",2892,115.68]
["Tracinda",1873,74.92]
["Denis",1954,78.16]
["Michael",1729,69.16]
["Svitlana Q",1140,45.6]
["Leslie",1528,61.120000000000005]
["Sarah",1659,66.36]
["Andra",2119,84.76]
["Christien",1854,74.16]
["Irina",2759,110.36]
["Chandy",1237,49.480000000000004]
["David",1653,66.12]
["Wendy",2604,104.16]
["Archie",1479,59.160000000000004]
["Desiree",2569,102.76]
["Denise",1941,77.64]
["Hillary",2793,111.72]
["Nicolas",2614,104.56]
["Ralph",1645,65.8]
["Konstanti",1733,69.320000000000007]
["Svitlana",2466,98.64]
["Ewelina",2833,113.32000000000001]
["Jori",1604,64.16]
["Abdullahi",2588,103.52]

{"sheet":"CR(4)","index":32,"n_rows":16,"n_cols":8,"rows_kept":16,"cut":false,"hidden":false,"merged":[]}
[null,"January","February","March","April","May","June"]
["Revenue",20000,{"$f":"B2*$B4","v":20299.999999999996},{"$f":"C2*$B4","v":20604.499999999993},20913.56749999999,21227.271012499987,21545.680077687484]
[]
["Increase each month",1.0149999999999999]
[null,null,null,null,null,null,null," Page 159 in Book ==>>"]
[]
[]
["Start","% Change","End"]
[1000,0.1,{"$f":"A9*(1+B9)","v":1100}]
[1000,-0.1,{"$f":"A10*(1+B10)","v":900}]
[]
["**Sometimes (1+%change) is called the \"Rate\"."]
[]
["Start","Rate","End"]
[1000,1.1000000000000001,{"$f":"A15*B15","v":1100}]
[1000,0.9,{"$f":"A16*B16","v":900}]

{"sheet":"CR(5)","index":33,"n_rows":20,"n_cols":7,"rows_kept":20,"cut":false,"hidden":false,"merged":[]}
["Yearly PMT",-3000]
[]
["What will your Pension be worth when you retire?"]
["Years/Rate",{"$f":"B17","v":0.06},{"$f":"B4+$B18","v":6.9999999999999993E-2},{"$f":"C4+$B18","v":7.9999999999999988E-2},{"$f":"D4+$B18","v":8.9999999999999983E-2},{"$f":"E4+$B18","v":9.9999999999999978E-2},{"$f":"F4+$B18","v":0.10999999999999997}]
[{"$f":"B19","v":5},{"$f":"FV(B$4,$A5,$B$1)","v":16911.278880000023},17252.217030000007,17599.802880000014,17954.13183000002,18315.300000000021,18683.404229999978]
[{"$f":"A5+B$20","v":10},39542.384827142727,41449.343883838526,43459.687397729547,45578.789153070633,47812.273803000062,50166.026892791255]
[15,69827.909654984629,75387.066030657195,81456.341782435193,88082.748656250784,95317.445082469683,103216.07695466376]
[20,110356.77361064241,122986.47696369342,137285.89289434903,153480.35892594326,171824.99847976831,192608.49643988523]
[25,164593.5359871744,189747.11314812393,219317.81985822474,254102.68868010651,295041.17830165179,343239.92189757765]
[30,237174.558645663,283382.35897122993,339849.63334025425,408922.61563770904,493482.06806659343,597062.63377939991]
[35,334304.33961561753,414710.63505494723,516950.41103702108,647132.26395054464,813073.10544192977,1024768.6643854621]
[40,464285.89685629646,598905.33596601232,777169.55612999585,1013647.3351329778,1327777.6670452824,1745478.1992436571]
[45,638230.54137205158,857247.93251459557,1159516.8521359966,1577576.2034861487,2156714.5105530987,2959915.6784147848]
[]
[]
["Assumption Table"]
["Start rate",0.06]
["increment",0.01]
["Start years",5]
["Increment",5]

{"sheet":"CR(6)","index":34,"n_rows":15,"n_cols":14,"rows_kept":15,"cut":false,"hidden":false,"merged":[[2,0,14,0]]}
[null,"Multiplication Table"]
[null,"Column Headers"]
["Row Headers",null,{"$f":"COLUMNS($C3:C3)","v":1},{"$f":"COLUMNS($C3:D3)","v":2},{"$f":"COLUMNS($C3:E3)","v":3},{"$f":"COLUMNS($C3:F3)","v":4},{"$f":"COLUMNS($C3:G3)","v":5},{"$f":"COLUMNS($C3:H3)","v":6},{"$f":"COLUMNS($C3:I3)","v":7},{"$f":"COLUMNS($C3:J3)","v":8},{"$f":"COLUMNS($C3:K3)","v":9},{"$f":"COLUMNS($C3:L3)","v":10},{"$f":"COLUMNS($C3:M3)","v":11},{"$f":"COLUMNS($C3:N3)","v":12}]
[null,{"$f":"ROWS(B$4:B4)","v":1},{"$f":"$B4*C$3","v":1},2,3,4,5,6,7,8,9,10,11,12]
[null,{"$f":"ROWS(B$4:B5)","v":2},2,4,6,8,10,12,14,16,18,20,22,24]
[null,{"$f":"ROWS(B$4:B6)","v":3},3,6,9,12,15,18,21,24,27,30,33,36]
[null,{"$f":"ROWS(B$4:B7)","v":4},4,8,12,16,20,24,28,32,36,40,44,48]
[null,{"$f":"ROWS(B$4:B8)","v":5},5,10,15,20,25,30,35,40,45,50,55,60]
[null,{"$f":"ROWS(B$4:B9)","v":6},6,12,18,24,30,36,42,48,54,60,66,72]
[null,{"$f":"ROWS(B$4:B10)","v":7},7,14,21,28,35,42,49,56,63,70,77,84]
[null,{"$f":"ROWS(B$4:B11)","v":8},8,16,24,32,40,48,56,64,72,80,88,96]
[null,{"$f":"ROWS(B$4:B12)","v":9},9,18,27,36,45,54,63,72,81,90,99,108]
[null,{"$f":"ROWS(B$4:B13)","v":10},10,20,30,40,50,60,70,80,90,100,110,120]
[null,{"$f":"ROWS(B$4:B14)","v":11},11,22,33,44,55,66,77,88,99,110,121,132]
[null,{"$f":"ROWS(B$4:B15)","v":12},12,24,36,48,60,72,84,96,108,120,132,144]

{"sheet":"CR(7)","index":35,"n_rows":127,"n_cols":14,"rows_kept":127,"cut":false,"hidden":false,"merged":[]}
["Date","SalesRep","ProductSold","UnitsSold","Sales",null,"SalesRep","Total Sales",null,"2003 and earlier formula"]
["2010-01-08","Tina","Boom 15",27,1179.6299999999999,null,"Tina",{"$f":"SUMIFS(E$2:E$19,B$2:B$19,G2)","v":2641.48},null,{"$f":"SUMIF(B$2:B$19,G2,E$2:E$19)","v":2641.48},null,{"$f":"SUMIF(B$2:B$19,G2,E$2)","v":2641.48}]
["2010-01-03","Shelia","Boom 15",20,873.8,null,"Shelia",{"$f":"SUMIFS(E$2:E$19,B$2:B$19,G3)","v":1314.1999999999998},null,{"$f":"SUMIF(B$2:B$19,G3,E$2:E$19)","v":1314.1999999999998},null,{"$f":"SUMIF(B$2:B$19,G3,E$2)","v":1314.1999999999998}]
["2010-01-06","Tina","Boom 14",23,757.85,null,"Bob",1080.7,null,1080.7,"or",1080.7]
["2010-01-01","Bob","Boom 11",26,492.7,null,"Sioux",343.84999999999997,null,343.84999999999997,null,343.84999999999997]
["2010-01-06","Tina","Boom 5",25,350,null,"Donita",534.4,null,534.4,null,534.4]
["2010-01-08","Sioux","Boom 6",23,343.84999999999997,null,"Chin",302,null,302,null,302]
["2010-01-02","Bob","Boom 5",24,336,null,"Don",{"$f":"SUMIFS(E$2:E$19,B$2:B$19,G8)","v":29},null,29,null,29]
["2010-01-05","Donita","Boom 6",18,269.09999999999997]
["2010-01-07","Donita","Boom 11",14,265.3]
["2010-01-08","Bob","Boom 10",14,252]
["2010-01-07","Tina","Boom 10",13,234]
["2010-01-06","Chin","Boom 5",13,182]
["2010-01-03","Shelia","Boom 8",10,159.5]
["2010-01-07","Shelia","Boom 13",6,153.30000000000001]
["2010-01-06","Shelia","Boom 8",8,127.6]
["2010-01-06","Chin","Boom 2",10,120]
["2010-01-08","Tina","Boom 1",12,120]
["2010-01-09","Don","Boom 10",1,29]
[]
[]
["Date","Product","Region","SalesRep","Customer","Units","Sales","COGS",null,"Product/Region","East","MidWest","West","South"]
["2011-01-13","Sunshine","East","Franks","KBTB",58,1102,464,null,"Sunshine",{"$f":"SUMIFS($G$23:$G$127,$B$23:$B$127,$J23,$C$23:$C$127,K$22)","v":4313},{"$f":"SUMIFS($G$23:$G$127,$B$23:$B$127,$J23,$C$23:$C$127,L$22)","v":3933},5415,2812]
["2011-01-15","Sunshine","MidWest","Sioux","MNGD",17,323,136,null,"Carlota",{"$f":"SUMIFS($G$23:$G$127,$B$23:$B$127,$J24,$C$23:$C$127,K$22)","v":2530},7981,4485,4876]
["2011-01-25","Sunshine","West","Franks","JAQ",59,1121,472,null,"Sunset",420,6216,2058,3486]
["2011-01-03","Carlota","MidWest","Chin","FRED",55,1265,605,null,"Quad",5805,7749,5454,3078]
["2011-01-27","Sunset","MidWest","Franks","WFMI",44,924,407,null,"Bellen",3586,1276,4400,2090]
["2011-01-14","Quad","MidWest","Smith","TTT",61,1647,884.5]
["2011-01-08","Quad","MidWest","Franks","ET",50,1350,725]
["2011-01-16","Quad","East","Pham","FM",59,1593,855.5]
["2011-01-07","Quad","East","Sioux","EPP",36,972,522]
["2011-01-15","Sunset","East","Chin","FRED",14,294,129.5]
["2011-01-20","Quad","South","Pham","T",38,1026,551,null,"2003 and earlier formula"]
["2011-01-27","Carlota","MidWest","Sioux","LOP",63,1449,693,null,"Product/Region","East","MidWest","West","South"]
["2011-01-08","Sunshine","East","Gault","PSA",9,171,72,null,"Sunshine",{"$f":"SUMPRODUCT($G$23:$G$127,--($B$23:$B$127=$J35),--($C$23:$C$127=K$34))","v":4313},3933,5415,2812]
["2011-01-20","Carlota","MidWest","Chin","T",65,1495,715,null,"Carlota",2530,7981,4485,4876]
["2011-01-05","Quad","East","Pham","AST",35,945,507.5,null,"Sunset",420,6216,2058,3486]
["2011-01-12","Sunshine","West","Chin","EPP",37,703,296,null,"Quad",5805,7749,5454,3078]
["2011-01-04","Sunshine","East","Pham","SFWK",55,1045,440,null,"Bellen",3586,1276,4400,2090]
["2011-01-28","Sunshine","South","Smith","KBTB",33,627,264]
["2011-01-04","Carlota","East","Chin","WSD",28,644,308]
["2011-01-18","Quad","East","Sioux","WFMI",10,270,145]
["2011-01-21","Bellen","East","Chin","QT",30,660,300]
["2011-01-01","Sunshine","West","Pham","TTT",26,494,208]
["2011-01-23","Sunset","East","Chin","DFR",6,126,55.5]
["2011-01-25","Quad","MidWest","Franks","EPP",41,1107,594.5]
["2011-01-19","Quad","West","Smith","HII",26,702,377]
["2011-01-29","Sunshine","MidWest","Gault","SFWK",45,855,360]
["2011-01-29","Sunset","South","Gault","ITW",15,315,138.75]
["2011-01-22","Carlota","West","Chin","KBTB",65,1495,715]
["2011-01-30","Quad","East","Franks","HII",14,378,203]
["2011-01-18","Bellen","West","Chin","MNGD",56,1232,560]
["2011-01-01","Sunshine","West","Franks","FM",11,209,88]
["2011-01-18","Quad","West","Smith","AA",40,1080,580]
["2011-01-21","Quad","MidWest","Sioux","KBTB",58,1566,841]
["2011-01-12","Carlota","MidWest","Chin","WT",40,920,440]
["2011-01-16","Quad","West","Chin","PCC",40,1080,580]
["2011-01-05","Carlota","South","Franks","FM",11,253,121]
["2011-01-30","Bellen","West","Franks","ZAT",17,374,170]
["2011-01-15","Quad","East","Gault","WT",19,513,275.5]
["2011-01-30","Quad","MidWest","Gault","EPP",15,405,217.5]
["2011-01-16","Sunshine","East","Gault","WSD",57,1083,456]
["2011-01-24","Sunset","MidWest","Franks","WSD",17,357,157.25]
["2011-01-26","Carlota","South","Smith","TTT",31,713,341]
["2011-01-11","Sunset","South","Gault","MBG",28,588,259]
["2011-01-06","Bellen","MidWest","Smith","TRU",11,242,110]
["2011-01-09","Bellen","East","Smith","EPP",20,440,200]
["2011-01-16","Quad","East","Sioux","PLOT",8,216,116]
["2011-01-12","Quad","West","Franks","EPP",34,918,493]
["2011-01-14","Carlota","MidWest","Sioux","TRU",34,782,374]
["2011-01-02","Sunshine","West","Franks","BBT",16,304,128]
["2011-01-10","Carlota","East","Chin","TTT",32,736,352]
["2011-01-28","Sunset","MidWest","Sioux","QT",61,1281,564.25]
["2011-01-11","Sunset","South","Franks","TTT",59,1239,545.75]
["2011-01-03","Bellen","South","Chin","TTT",30,660,300]
["2011-01-15","Bellen","MidWest","Pham","LOP",22,484,220]
["2011-01-14","Carlota","West","Franks","ET",6,138,66]
["2011-01-28","Quad","MidWest","Smith","DFGH",16,432,232]
["2011-01-04","Quad","East","Sioux","MBG",19,513,275.5]
["2011-01-13","Carlota","South","Chin","AA",30,690,330]
["2011-01-12","Sunshine","West","Pham","WFMI",62,1178,496]
["2011-01-24","Bellen","MidWest","Franks","EPP",25,550,250]
["2011-01-14","Sunshine","West","Sioux","FM",13,247,104]
["2011-01-06","Sunset","MidWest","Chin","DFR",24,504,222]
["2011-01-19","Carlota","South","Pham","GRR",51,1173,561]
["2011-01-27","Sunshine","East","Franks","ITW",23,437,184]
["2011-01-21","Carlota","West","Pham","WSD",41,943,451]
["2011-01-04","Sunshine","West","Pham","FM",11,209,88]
["2011-01-04","Quad","MidWest","Franks","TRU",19,513,275.5]
["2011-01-27","Bellen","West","Smith","TRU",62,1364,620]
["2011-01-19","Sunshine","South","Pham","ITW",48,912,384]
["2011-01-11","Bellen","East","Franks","MNGD",34,748,340]
["2011-01-01","Carlota","MidWest","Franks","JAQ",37,851,407]
["2011-01-05","Sunshine","West","Sioux","WT",50,950,400]
["2011-01-15","Carlota","West","Smith","TTT",51,1173,561]
["2011-01-23","Carlota","West","Pham","ET",32,736,352]
["2011-01-07","Carlota","South","Chin","JAQ",22,506,242]
["2011-01-16","Carlota","South","Sioux","ZAT",33,759,363]
["2011-01-19","Bellen","South","Pham","TTT",18,396,180]
["2011-01-28","Sunshine","East","Sioux","QT",17,323,136]
["2011-01-16","Sunshine","South","Chin","T",14,266,112]
["2011-01-15","Sunshine","MidWest","Pham","DFGH",54,1026,432]
["2011-01-27","Bellen","East","Franks","TTT",56,1232,560]
["2011-01-28","Bellen","South","Sioux","WT",47,1034,470]
["2011-01-28","Bellen","West","Chin","KPSA",65,1430,650]
["2011-01-15","Sunset","MidWest","Franks","FM",56,1176,518]
["2011-01-14","Quad","South","Pham","AA",64,1728,928]
["2011-01-19","Sunset","MidWest","Smith","DDH",63,1323,582.75]
["2011-01-29","Sunset","West","Smith","TTT",25,525,231.25]
["2011-01-17","Quad","East","Franks","SFWK",15,405,217.5]
["2011-01-30","Sunshine","MidWest","Franks","LOP",42,798,336]
["2011-01-16","Sunset","MidWest","Pham","JAQ",31,651,286.75]
["2011-01-19","Sunset","West","Gault","QT",32,672,296]
["2011-01-05","Carlota","South","Sioux","WSD",34,782,374]
["2011-01-18","Carlota","East","Chin","TRU",50,1150,550]
["2011-01-08","Sunshine","South","Sioux","ZAT",53,1007,424]
["2011-01-10","Quad","MidWest","Sioux","KPSA",27,729,391.5]
["2011-01-05","Bellen","East","Gault","WSD",23,506,230]
["2011-01-15","Quad","West","Chin","MBG",12,324,174]
["2011-01-17","Quad","West","Chin","HII",50,1350,725]
["2011-01-26","Sunshine","MidWest","Smith","TRU",49,931,392]
["2011-01-11","Sunset","South","Smith","HII",17,357,157.25]
["2011-01-04","Quad","South","Sioux","ET",12,324,174]
["2011-01-21","Carlota","MidWest","Chin","BBT",53,1219,583]
["2011-01-22","Sunset","West","Franks","AA",41,861,379.25]
["2011-01-10","Sunshine","East","Franks","JAQ",8,152,64]
["2011-01-12","Sunset","South","Franks","QT",47,987,434.75]

{"sheet":"Assumption","index":36,"n_rows":23,"n_cols":8,"rows_kept":23,"cut":false,"hidden":false,"merged":[]}
["Budget"]
[null,"Jan","Feb","Mar","Apr","May","Jun","Total"]
["Revenue",1000,1250,1370,1250,2000,2215,{"$f":"SUM(B3:G3)","v":9085}]
[{"$f":"A14","v":"Expense1"},{"$f":"B$3*$B14","v":300},{"$f":"C$3*$B14","v":375},411,375,600,664.5,2725.5]
["Expense2",{"$f":"B$3*$B15","v":30},37.5,41.1,37.5,60,66.45,272.55]
["Expense3",30,37.5,41.1,37.5,60,66.45,272.55]
["Expense4",30,37.5,41.1,37.5,60,66.45,272.55]
["Expense5",30,37.5,41.1,37.5,60,66.45,272.55]
["Expense6",10,12.5,13.700000000000001,12.5,20,{"$f":"G$3*$B19","v":22.150000000000002},90.850000000000009]
["Total Expenses",{"$f":"SUM(B4:B9)","v":430},537.5,589.10000000000014,537.5,860,952.45000000000016,3906.5500000000006]
["Net Income",{"$f":"B3-B10","v":570},712.5,780.89999999999986,712.5,1140,1262.5499999999997,5178.4499999999989]
[]
["Assumptions - Formula Inputs"]
["Expense1",0.3]
["Expense2",0.03]
["Expense3",0.03]
["Expense4",0.03]
["Expense5",0.03]
["Expense6",0.01]
[]
["Assumptions - Formula Inputs"]
["Expense1","Expense2","Expense3","Expense4","Expense5","Expense6"]
[0.05,7.4999999999999997E-2,0.155,0.22500000000000001,4.4999999999999998E-2,0.12]

{"sheet":"Scenarios","index":37,"n_rows":23,"n_cols":8,"rows_kept":23,"cut":false,"hidden":false,"merged":[]}
["Budget"]
[null,"Jan","Feb","Mar","Apr","May","Jun","Total"]
["Revenue",1000,1250,1370,1250,2000,2215,{"$f":"SUM(B3:G3)","v":9085}]
[{"$f":"A14","v":"Expense1"},{"$f":"B$3*$B14","v":70},87.500000000000014,95.9,87.500000000000014,140,155.05000000000001,635.95000000000005]
["Expense2",70,87.500000000000014,95.9,87.500000000000014,140,155.05000000000001,635.95000000000005]
["Expense3",180,225,246.6,225,360,398.7,1635.3]
["Expense4",220,275,301.39999999999998,275,440,487.3,1998.7]
["Expense5",80,100,109.60000000000001,100,160,177.20000000000002,726.80000000000007]
["Expense6",160,200,219.20000000000002,200,320,354.40000000000003,1453.6000000000001]
["Total Expenses",{"$f":"SUM(B4:B9)","v":780},975,1068.5999999999999,975,1560,1727.7,7086.3]
["Net Income",{"$f":"B3-B10","v":220},275,301.40000000000009,275,440,487.29999999999995,1998.6999999999998]
[]
["Assumptions - Formula Inputs"]
["Expense1",7.0000000000000007E-2]
["Expense2",7.0000000000000007E-2]
["Expense3",0.18]
["Expense4",0.22]
["Expense5",0.08]
["Expense6",0.16]
[]
["Assumptions - Formula Inputs"]
["Expense1","Expense2","Expense3","Expense4","Expense5","Expense6"]
[0.05,7.4999999999999997E-2,0.155,0.22500000000000001,4.4999999999999998E-2,0.12]

{"sheet":"CR(8)","index":38,"n_rows":17,"n_cols":2,"rows_kept":17,"cut":false,"hidden":false,"merged":[]}
["Schedule Of Accounts Receivable"]
["Name","Amount"]
["Name1",50]
["Name2",601]
["Name3",845]
["Name4",32]
["Name5",155]
["Name6",45]
["Name7",87]
["Name8",22]
["Total AR",{"$f":"SUM(B3:B10)","v":1837}]
[]
["Check to See If In Balance",{"$f":"B11='C AR'!A5","v":false}]
[]
[]
[]
["Check to See If In Balance",{"$f":"IF(B11='C AR'!A5,\"In Balance\",\"Not In Balance\")","v":"Not In Balance"}]

{"sheet":"C AR","index":39,"n_rows":5,"n_cols":2,"rows_kept":5,"cut":false,"hidden":false,"merged":[]}
["Controling AR Account"]
["DR","CR"]
[1682]
[154]
[{"$f":"SUM(A3:A4)","v":1836}]

{"sheet":"CR(9)","index":40,"n_rows":11,"n_cols":8,"rows_kept":11,"cut":false,"hidden":false,"merged":[]}
[null,null,null,null,null,null,"Rev",10000]
[null,null,null,null,null,null,"E1",500]
[null,null,null,null,null,null,"E2",654]
[null,null,null,null,null,null,"E3",85]
[null,null,null,null,null,null,"E4",958]
[null,null,null,null,null,null,"E5",6522]
[null,null,null,null,null,null,"E6",12]
[]
["Current Net Income",{"$f":"H1-SUM(H2:H7)","v":1269}]
["May Net Income"," =[MayNetIncome.xlsm]May'!B8"]
["Change"]

{"sheet":"Corp","index":41,"n_rows":9,"n_cols":6,"rows_kept":9,"cut":false,"hidden":false,"merged":[]}
[{"$f":"REPLACE(CELL(\"filename\",A1),1,FIND(\"]\",CELL(\"filename\",A1)),\"\")&\"oration Totals\"","v":"Corporation Totals"}]
[null,"Jan","Feb","Mar","Apr","Total"]
["Pro1",{"$f":"SUM(Oak:Tac!B3)","v":131},{"$f":"SUM(Oak:Tac!C3)","v":26},{"$f":"SUM(Oak:Tac!D3)","v":15},{"$f":"SUM(Oak:Tac!E3)","v":18},{"$f":"SUM(B3:E3)","v":190}]
["Pro2",{"$f":"SUM(Oak:Tac!B4)","v":13},{"$f":"SUM(Oak:Tac!C4)","v":30},{"$f":"SUM(Oak:Tac!D4)","v":22},{"$f":"SUM(Oak:Tac!E4)","v":28},93]
["Pro3",{"$f":"SUM(Oak:Tac!B5)","v":34},{"$f":"SUM(Oak:Tac!C5)","v":16},{"$f":"SUM(Oak:Tac!D5)","v":18},{"$f":"SUM(Oak:Tac!E5)","v":21},89]
["Pro4",{"$f":"SUM(Oak:Tac!B6)","v":19},{"$f":"SUM(Oak:Tac!C6)","v":34},{"$f":"SUM(Oak:Tac!D6)","v":11},{"$f":"SUM(Oak:Tac!E6)","v":8},72]
["Pro5",{"$f":"SUM(Oak:Tac!B7)","v":19},{"$f":"SUM(Oak:Tac!C7)","v":23},{"$f":"SUM(Oak:Tac!D7)","v":28},{"$f":"SUM(Oak:Tac!E7)","v":13},83]
["Pro6",{"$f":"SUM(Oak:Tac!B8)","v":25},{"$f":"SUM(Oak:Tac!C8)","v":9},{"$f":"SUM(Oak:Tac!D8)","v":7},{"$f":"SUM(Oak:Tac!E8)","v":29},70]
["Total",{"$f":"SUM(B3:B8)","v":241},{"$f":"SUM(C3:C8)","v":138},{"$f":"SUM(D3:D8)","v":101},{"$f":"SUM(E3:E8)","v":117},597]

{"sheet":"Oak","index":42,"n_rows":9,"n_cols":6,"rows_kept":9,"cut":false,"hidden":false,"merged":[]}
[{"$f":"REPLACE(CELL(\"filename\",A1),1,FIND(\"]\",CELL(\"filename\",A1)),\"\")&\" Totals\"","v":"Oak Totals"}]
[null,"Jan","Feb","Mar","Apr","Total"]
["Pro1",14,8,0,1,{"$f":"SUM(B3:E3)","v":23}]
["Pro2",8,8,2,11,29]
["Pro3",6,6,13,7,32]
["Pro4",13,12,5,2,32]
["Pro5",9,5,10,1,25]
["Pro6",9,3,2,12,26]
["Total",{"$f":"SUM(B3:B8)","v":59},{"$f":"SUM(C3:C8)","v":42},{"$f":"SUM(D3:D8)","v":32},{"$f":"SUM(E3:E8)","v":34},167]

{"sheet":"Bur","index":43,"n_rows":9,"n_cols":6,"rows_kept":9,"cut":false,"hidden":false,"merged":[]}
[{"$f":"REPLACE(CELL(\"filename\",A1),1,FIND(\"]\",CELL(\"filename\",A1)),\"\")&\" Totals\"","v":"Bur Totals"}]
[null,"Jan","Feb","Mar","Apr","Total"]
["Pro1",100,1,1,1,{"$f":"SUM(B3:E3)","v":103}]
["Pro2",1,1,1,1,4]
["Pro3",1,1,1,1,4]
["Pro4",1,1,1,1,4]
["Pro5",1,1,1,1,4]
["Pro6",1,1,1,1,4]
["Total",{"$f":"SUM(B3:B8)","v":105},{"$f":"SUM(C3:C8)","v":6},{"$f":"SUM(D3:D8)","v":6},{"$f":"SUM(E3:E8)","v":6},123]

{"sheet":"Sea","index":44,"n_rows":9,"n_cols":6,"rows_kept":9,"cut":false,"hidden":false,"merged":[]}
[{"$f":"REPLACE(CELL(\"filename\",A1),1,FIND(\"]\",CELL(\"filename\",A1)),\"\")&\" Totals\"","v":"Sea Totals"}]
[null,"Jan","Feb","Mar","Apr","Total"]
["Pro1",9,3,14,9,{"$f":"SUM(B3:E3)","v":35}]
["Pro2",0,8,13,2,23]
["Pro3",13,7,2,7,29]
["Pro4",1,13,3,5,22]
["Pro5",3,12,10,11,36]
["Pro6",3,0,2,11,16]
["Total",{"$f":"SUM(B3:B8)","v":29},{"$f":"SUM(C3:C8)","v":43},{"$f":"SUM(D3:D8)","v":44},{"$f":"SUM(E3:E8)","v":45},161]

{"sheet":"Tac","index":45,"n_rows":9,"n_cols":6,"rows_kept":9,"cut":false,"hidden":false,"merged":[]}
[{"$f":"REPLACE(CELL(\"filename\",A1),1,FIND(\"]\",CELL(\"filename\",A1)),\"\")&\" Totals\"","v":"Tac Totals"}]
[null,"Jan","Feb","Mar","Apr","Total"]
["Pro1",8,14,0,7,{"$f":"SUM(B3:E3)","v":29}]
["Pro2",4,13,6,14,37]
["Pro3",14,2,2,6,24]
["Pro4",4,8,2,0,14]
["Pro5",6,5,7,0,18]
["Pro6",12,5,2,5,24]
["Total",{"$f":"SUM(B3:B8)","v":48},{"$f":"SUM(C3:C8)","v":47},{"$f":"SUM(D3:D8)","v":19},{"$f":"SUM(E3:E8)","v":32},146]

{"sheet":"Ranges","index":46,"n_rows":8,"n_cols":7,"rows_kept":8,"cut":false,"hidden":false,"merged":[]}
["Sales",null,"Inefficient formula because formula will not update when structural changes like inserting rows are made",{"$f":"A2+A3+A4+A6+A7+A8","v":{"$error":"#VALUE!"}},{"$f":"TextFormula","v":"=A2+A3+A4+A6+A7+A8"},null," <<== Special Formula automatically will show you how formula changes."]
["none",null,"Inefficient formula because formula will not update when structural changes like inserting rows are made",{"$f":"SUM(A2,A3,A4,A6,A7,A8)","v":164},{"$f":"TextFormula","v":"=SUM(A2,A3,A4,A6,A7,A8)"},null," <<== Special Formula automatically will show you how formula changes."]
[45,null,"Efficient formula because formula will update when structural changes like inserting rows are made",{"$f":"SUM(A2:A8)","v":184},{"$f":"TextFormula","v":"=SUM(A2:A8)"},null," <<== Special Formula automatically will show you how formula changes."]
[32]
[20]
[25]
[10]
[52]

{"sheet":"Functions(1)","index":47,"n_rows":37,"n_cols":8,"rows_kept":37,"cut":false,"hidden":false,"merged":[]}
["We got a lump sum of money ($14,000) that we don't need to use for five years. The CD contact says it will pay 5.5% annual interest compounded quarterly. Our goal is to find a built-in function that will calculate what this CD will be worth when we withdraw it."]
["Yearly Contribution",14000]
["Assumed Annual Rate",0.04]
["Years Invested",5]
["Number of periods per year",4]
["Period Rate",{"$f":"B3/B5","v":0.01}]
["Total Periods",{"$f":"B4*B5","v":20}]
["Investment Worth",{"$f":"FV(B6,B7,,-B2)","v":17082.660559271539}]
[]
["Names","Scores",null,null,"Names","Scores"]
["Student 1",88.5,null,null,"Student 1",88.5]
["Student 2",52,null,null,"Student 2",52]
["Student 3",null,null,null,"Student 3",0]
["Student 4",68,null,null,"Student 4",68]
["Student 5",78,null,null,"Student 5",78]
["Student 6",81,null,null,"Student 6",81]
["Student 7",82,null,null,"Student 7",82]
["Student 8",null,null,null,"Student 8",0]
["Student 9",55,null,null,"Student 9",55]
["Student 10",85,null,null,"Student 10",85]
["Student 11",79,null,null,"Student 11",79]
["Student 12",74,null,null,"Student 12",74]
["Student 13",91,null,null,"Student 13",91]
["Student 14",null,null,null,"Student 14",0]
["Student 15",null,null,null,"Student 15",0]
["Student 16",null,null,null,"Student 16",0]
["Student 17",67,null,null,"Student 17",67]
["Student 18",78,null,null,"Student 18",78,null,"2003 or earlier formula"]
["Average",{"$f":"AVERAGE(B11:B28)","v":75.269230769230774},null,null,"Average",{"$f":"AVERAGEIF(F11:F28,\"<>0\")","v":75.269230769230774},null,{"$f":"SUMIF(F11:F28,\"<>0\")/COUNTIF(F11:F28,\"<>0\")","v":75.269230769230774}]
[]
["Loan Amount",175000]
["Assumed Annual Rate",5.5E-2]
["Years To Pay Off Loan",30]
["Number of periods per year",12]
["Period Rate",{"$f":"B32/B34","v":4.5833333333333334E-3}]
["Total Periods",{"$f":"B33*B34","v":360}]
["Monthly Paymnet",{"$f":"PMT(B35,B36,B31)","v":-993.63075235725512}]

{"sheet":"Functions(2)","index":48,"n_rows":106,"n_cols":16,"rows_kept":106,"cut":false,"hidden":false,"merged":[]}
["Date","Product","Region","SalesRep","Customer","Units","Sales","COGS",null,"MAX",{"$f":"MAX(Sales)","v":{"$error":"#NAME?"}},"MAX for finding the largest value",null,null,null,"Formulas in this column are alternatives that will work in earlier versions of Excel."]
["2011-01-26","Bellen","West","Pham","FRED",61,5000,610,null,"MIN",{"$f":"MIN(Sales)","v":{"$error":"#NAME?"}},"MIN for finding the smallest value"]
["2011-01-10","Bellen","MidWest","Gault","FM",7,154,70,null,"COUNTA",{"$f":"COUNTA(Region)","v":105},"COUNTA for counting the total number of text entries (non-empty cells)"]
["2011-01-03","Sunshine","South","Sioux","PCC",6,114,48,null,"SUMIFS",{"$f":"SUMIFS(Sales,SalesRep,K5,Customer,K6)","v":{"$error":"#NAME?"}},"SUMIFS for adding with two criteria",null,null,null,{"$f":"SUMPRODUCT(--(D2:D106=K5),--(E2:E106=K6),G2:G106)","v":3201}]
["2011-01-07","Sunset","West","Pham","T",61,1281,564.25,null,"Criteria 1","Sioux"]
["2011-01-18","Sunshine","West","Sioux","AST",8,152,64,null,"Criteria 2","PCC"]
["2011-01-20","Carlota","East","Chin","ET",59,1357,649,null,"COUNTIFS",{"$f":"COUNTIFS(Sales,K8,Sales,K9)","v":{"$error":"#NAME?"}},"COUNTIFS for counting with two criteria"]
["2011-01-26","Bellen","MidWest","Gault","PSA",21,462,210,null,"Criteria 1",">=1000"]
["2011-01-07","Carlota","MidWest","Franks","HHH",12,276,132,null,"Criteria 2","<1500"]
["2011-01-05","Carlota","West","Franks","ITTW",60,1380,660,null,"COUNTIFS",{"$f":"COUNTIFS(Sales,\">=\"&K11,Sales,\"<\"&K12)","v":{"$error":"#NAME?"}},"COUNTIFS for counting with two criteria",null,null,null,{"$f":"SUMPRODUCT(--(G2:G106>=K11),--(G2:G106<K12))","v":30}]
["2011-01-17","Quad","East","Franks","HII",62,1674,899,null,"Criteria 1",500]
["2011-01-28","Sunshine","South","Smith","FRED",51,969,408,null,"Criteria 2",1000]
["2011-01-17","Quad","East","Gault","SFWK",43,1161,623.5,null,"AVERAGEIFS",{"$f":"AVERAGEIFS(Sales,Product,K14,Region,K15)","v":{"$error":"#NAME?"}},"AVERAGEIFS for averaging with two criteria",null,null,null,{"$f":"SUMPRODUCT(--(B2:B106=K14),--(C2:C106=K15),F2:F106)/SUMPRODUCT(--(B2:B106=K14),--(C2:C106=K15))","v":33.5}]
["2011-01-16","Bellen","MidWest","Sioux","YTR",56,1232,560,null,"Criteria 1","Bellen"]
["2011-01-15","Sunshine","MidWest","Chin","YTR",11,209,88,null,"Criteria 2","West"]
["2011-01-12","Bellen","South","Chin","WT",7,154,70,null,"SUMIFS",{"$f":"SUMIFS(Sales,Region,K17)+SUMIFS(Sales,Region,K18)","v":{"$error":"#NAME?"}},"OR (One Or The Other) Criteria",null,null,null,{"$f":"SUMIF(C2:C106,K17,G2:G106)+SUMIF(C2:C106,K18,G2:G106)","v":40454}]
["2011-01-03","Sunset","South","Pham","WSD",23,483,212.75,null,"OR Criteria 1","West"]
["2011-01-22","Carlota","South","Smith","KBTB",29,667,319,null,"OR Criteria 2","MidWest"]
["2011-01-21","Quad","West","Gault","ITW",56,1512,812,null,"COUNTIFS",{"$f":"COUNTIFS(Region,K20)+COUNTIFS(Region,K21)","v":48},"OR (One Or The Other) Criteria",null,null,null,{"$f":"COUNTIF(C2:C106,K20)+COUNTIF(C2:C106,K21)","v":48}]
["2011-01-13","Sunshine","MidWest","Pham","PSA",33,627,264,null,"OR Criteria 1","West"]
["2011-01-10","Quad","West","Smith","KBTB",65,1755,942.5,null,"OR Criteria 2","MidWest"]
["2011-01-08","Quad","West","Chin","HII",16,432,232,null,"Average",{"$f":"K16/K19","v":{"$error":"#NAME?"}},{"$f":"(SUMIFS(Sales,Region,K17)+SUMIFS(Sales,Region,K18))/(COUNTIFS(Region,K20)+COUNTIFS(Region,K21))","v":{"$error":"#NAME?"}},null,null,null,{"$f":"(SUMIF(C2:C106,K17,G2:G106)+SUMIF(C2:C106,K18,G2:G106))/(COUNTIF(C2:C106,K20)+COUNTIF(C2:C106,K21))","v":842.79166666666663}]
["2011-01-06","Quad","West","Sioux","PCC",64,1728,928,null,"OR Criteria 1","West"]
["2011-01-26","Sunset","South","Sioux","DFGH",44,924,407,null,"OR Criteria 2","MidWest"]
["2011-01-21","Sunshine","MidWest","Smith","QT",64,1216,512]
["2011-01-07","Bellen","West","Smith","T",27,594,270,null,"Region","COUNTIF"]
["2011-01-20","Bellen","East","Gault","PSA",10,220,100,null,"West",{"$f":"COUNTIF(Region,J27)","v":24}]
["2011-01-09","Bellen","South","Chin","WSD",26,572,260,null,"MidWest",{"$f":"COUNTIF(Region,J28)","v":24}]
["2011-01-07","Sunset","MidWest","Sioux","PCC",22,462,203.5,null,"South",{"$f":"COUNTIF(Region,J29)","v":27}]
["2011-01-29","Bellen","East","Chin","AST",50,1100,500,null,"East",{"$f":"COUNTIF(Region,J30)","v":30}]
["2011-01-30","Sunshine","South","Sioux","TTT",23,437,184]
["2011-01-30","Sunshine","West","Gault","DFR",49,931,392]
["2011-01-28","Carlota","West","Smith","LOP",15,345,165]
["2011-01-01","Quad","East","Sioux","AA",16,432,232]
["2011-01-30","Quad","South","Sioux","TTT",25,675,362.5]
["2011-01-16","Carlota","South","Smith","QT",31,713,341]
["2011-01-24","Quad","West","Gault","HII",63,1701,913.5]
["2011-01-25","Sunshine","MidWest","Franks","JAQ",21,399,168]
["2011-01-21","Sunshine","MidWest","Pham","DFR",23,437,184]
["2011-01-18","Bellen","East","Pham","DFR",59,1298,590]
["2011-01-13","Bellen","MidWest","Pham","PLOT",57,1254,570]
["2011-01-21","Quad","East","Chin","FM",58,1566,841]
["2011-01-09","Sunshine","East","Smith","PCC",42,798,336]
["2011-01-09","Bellen","South","Sioux","QT",15,330,150]
["2011-01-27","Carlota","West","Gault","QT",10,230,110]
["2011-01-06","Carlota","West","Sioux","KPSA",18,414,198]
["2011-01-10","Sunset","East","Gault","TRU",27,567,249.75]
["2011-01-21","Sunset","South","Pham","HHH",13,273,120.25]
["2011-01-22","Bellen","West","Sioux","YTR",35,770,350]
["2011-01-03","Sunshine","East","Pham","FM",38,722,304]
["2011-01-10","Carlota","East","Pham","AA",63,1449,693]
["2011-01-22","Quad","South","Franks","FM",29,783,420.5]
["2011-01-28","Sunset","East","Smith","ZAT",36,756,333]
["2011-01-10","Quad","East","Smith","DFR",17,459,246.5]
["2011-01-17","Bellen","MidWest","Smith","PCC",16,352,160]
["2011-01-20","Sunshine","West","Sioux","YTR",58,1102,464]
["2011-01-18","Bellen","East","Franks","DFGH",20,440,200]
["2011-01-13","Bellen","MidWest","Pham","PSA",40,880,400]
["2011-01-14","Carlota","East","Franks","JAQ",34,782,374]
["2011-01-17","Quad","MidWest","Chin","EPP",61,1647,884.5]
["2011-01-12","Sunset","MidWest","Gault","ITW",19,399,175.75]
["2011-01-06","Sunshine","South","Smith","QT",40,760,320]
["2011-01-19","Bellen","South","Sioux","T",35,770,350]
["2011-01-26","Bellen","East","Chin","KPSA",17,374,170]
["2011-01-05","Sunset","South","Pham","TTT",57,1197,527.25]
["2011-01-28","Carlota","South","Franks","MNGD",46,1058,506]
["2011-01-10","Sunshine","South","Chin","TRU",30,570,240]
["2011-01-07","Sunset","West","Pham","WT",53,1113,490.25]
["2011-01-28","Quad","MidWest","Smith","YTR",42,1134,609]
["2011-01-02","Quad","West","Pham","AST",30,810,435]
["2011-01-15","Sunset","East","Gault","AST",63,1323,582.75]
["2011-01-10","Sunset","East","Smith","MBG",17,357,157.25]
["2011-01-23","Quad","East","Pham","WT",22,594,319]
["2011-01-06","Sunshine","East","Franks","PSA",54,1026,432]
["2011-01-18","Carlota","South","Smith","YTR",53,1219,583]
["2011-01-11","Quad","East","Smith","BBT",49,1323,710.5]
["2011-01-21","Bellen","South","Smith","TRU",11,242,110]
["2011-01-18","Sunset","East","Gault","MNGD",12,252,111]
["2011-01-10","Sunshine","MidWest","Smith","TTT",8,152,64]
["2011-01-17","Sunshine","MidWest","Franks","HHH",59,1121,472]
["2011-01-23","Sunshine","South","Chin","T",49,931,392]
["2011-01-23","Quad","East","Franks","PCC",44,1188,638]
["2011-01-28","Sunset","West","Chin","FM",62,1302,573.5]
["2011-01-29","Quad","MidWest","Gault","PLOT",10,270,145]
["2011-01-13","Carlota","South","Smith","FM",52,1196,572]
["2011-01-18","Quad","MidWest","Smith","PLOT",17,459,246.5]
["2011-01-04","Sunset","MidWest","Sioux","BBT",29,609,268.25]
["2011-01-28","Bellen","South","Sioux","QT",25,550,250]
["2011-01-11","Quad","East","Franks","ITW",14,378,203]
["2011-01-22","Bellen","West","Pham","AST",53,1166,530]
["2011-01-10","Sunset","South","Sioux","MBG",47,987,434.75]
["2011-01-24","Carlota","MidWest","Franks","BBT",13,299,143]
["2011-01-05","Sunshine","West","Franks","ET",12,228,96]
["2011-01-03","Carlota","MidWest","Chin","FM",20,460,220]
["2011-01-09","Bellen","East","Pham","EPP",40,880,400]
["2011-01-23","Bellen","East","Gault","DFGH",9,198,90]
["2011-01-09","Carlota","East","Franks","WSD",38,874,418]
["2011-01-02","Bellen","South","Gault","KBTB",24,528,240]
["2011-01-17","Quad","West","Chin","PCC",10,270,145]
["2011-01-28","Quad","South","Gault","KBTB",56,1512,812]
["2011-01-18","Sunshine","MidWest","Chin","PCC",62,1178,496]
["2011-01-28","Quad","South","Franks","YTR",44,1188,638]
["2011-01-17","Carlota","East","Sioux","PCC",39,897,429]
["2011-01-18","Sunshine","East","Franks","AA",24,456,192]
["2011-01-22","Bellen","West","Smith","WT",6,132,60]
["2011-01-02","Bellen","West","Pham","SFWK",19,418,190]

{"sheet":"SUMPRODUCT","index":49,"n_rows":682,"n_cols":33,"rows_kept":682,"cut":false,"hidden":false,"merged":[]}
["Date","Product","PriceOfProduct","Units",null,"Total Sales",null,null,null,null,null,null,"Date","Product","Qrt Purchased","Price Each",null,"Product","WAC",null,null,"Date","SalesRep","Customer","Time of Phone Call",null,"Max Date",{"$f":"MAX(V2:V682)","v":"2012-04-08"}]
["2010-11-04","Sunset",21,220,null,{"$f":"D2*C2","v":4620},null,{"$f":"DOLLAR(C2*D2,0)","v":"$4,620"},{"$f":"DOLLAR(C2,0)&\" * \"&D2&\" = \"&H2","v":"$21 * 220 = $4,620"},null,null,null,"2010-01-08","Product9",10,10.3,null,"Product9",{"$f":"SUMPRODUCT(--($N$2:$N$166=R2),$O$2:$O$166,$P$2:$P$166)/SUMIF($N$2:$N$166,R2,$O$2:$O$166)","v":10.495985401459855},null,null,"2011-04-21","Luong","Cs3",20,null,"Min Date",{"$f":"MIN(V2:V682)","v":"2010-05-10"}]
["2010-11-05","Carlota",23,202,null,4646,null,"$4,646",{"$f":"DOLLAR(C3,0)&\" * \"&D3&\" = \"&H3","v":"$23 * 202 = $4,646"},null,null,null,"2010-01-11","Product8",8,8.8000000000000007,null,"Product8",{"$f":"SUMPRODUCT(--($N$2:$N$166=R3),$O$2:$O$166,$P$2:$P$166)/SUMIF($N$2:$N$166,R3,$O$2:$O$166)","v":8.43921568627451},null,null,"2012-03-11","Luong","Cs4",14,null,"Start Date","2010-06-01"," <<= enter start date for template"]
["2010-11-06","Carlota",23,189,null,4347,null,"$4,347","$23 * 189 = $4,347",null,null,null,"2010-01-12","Product7",9,5.7,null,"Product7",5.3963114754098367,null,null,"2011-01-06","Sioux","Cs3",8,null,"1st of month",{"$f":"DATE(YEAR(AB3),MONTH(AB3),1)","v":"2010-06-01"}]
["2010-11-07","Quad",27,224,null,6048,null,"$6,048","$27 * 224 = $6,048",null,null,null,"2010-01-13","Product4",13,4,null,"Product6",6.3640316205533596,null,null,"2010-06-14","Sioux","Cs3",19]
["2010-11-08","Bellen",22,236,null,5192,null,"$5,192","$22 * 236 = $5,192",null,null,null,"2010-01-14","Product8",15,8.4,null,"Product5",5.5180156657963462,null,null,"2012-03-15","Sheliadawn","Cs2",6,null,"Month/Sales Rep","Chin","Moe","Tina","Luong","Sheliadawn","Sioux"]
["2010-11-09","Quad",27,137,null,3699,null,"$3,699","$27 * 137 = $3,699",null,null,null,"2010-01-15","Product9",12,10,null,"Product4",4.4223350253807103,null,null,"2010-10-10","Chin","Cs3",19,null,{"$f":"AB4","v":"2010-06-01"},{"$f":"SUMPRODUCT(--(TEXT($V$2:$V$682,\"mmyyy\")=TEXT($AA7,\"mmyyy\")),--($W$2:$W$682=AB$6))","v":10},{"$f":"SUMPRODUCT(--(TEXT($V$2:$V$682,\"mmyyy\")=TEXT($AA7,\"mmyyy\")),--($W$2:$W$682=AC$6))","v":3},7,8,6,6]
["2010-11-10","Sunshine",19,228,null,4332,null,"$4,332","$19 * 228 = $4,332",null,null,null,"2010-01-18","Product2",22,5.9,null,"Product3",3.5450980392156861,null,null,"2011-07-17","Chin","Cs3",24,null,{"$f":"EDATE(AA7,1)","v":"2010-07-01"},7,5,4,3,8,4]
[null,null,null,null,null,{"$f":"SUM(F2:F8)","v":32884},null,null,null,null,null,null,"2010-01-19","Product6",23,6.3,null,"Product2",5.427304964539009,null,null,"2011-12-11","Luong","Cs6",11,null,{"$f":"EDATE(AA8,1)","v":"2010-08-01"},3,7,7,5,4,7]
[null,null,"Total Sales",{"$f":"SUMPRODUCT(C2:C8,D2:D8)","v":32884},null,null,null,null,null,{"$f":"\"$4,620 + $4,646 + $4,347 + $6,048 + $5,192 + $3,699 + $4,332\"&\" = \"&DOLLAR(SUMPRODUCT(C2:C8,D2:D8),0)","v":"$4,620 + $4,646 + $4,347 + $6,048 + $5,192 + $3,699 + $4,332 = $32,884"},null,null,"2010-01-20","Product2",24,5.5,null,"Product1",2.3780104712041883,null,null,"2012-03-25","Chin","Cs1",5,null,"2010-09-01",7,4,5,5,5,4]
[null,null,null,null,null,null,null,null,null,null,null,null,"2010-01-21","Product7",11,5,null,null,null,null,null,"2010-10-31","Chin","Cs6",5,null,"2010-10-01",6,4,6,5,5,4]
["State of Economy","Prob. Of State of Economy","Stock A Return",null,null,null,null,null,null,null,null,null,"2010-01-22","Product1",6,2,null,null,null,null,null,"2011-02-03","Moe","Cs4",5,null,"2010-11-01",2,5,5,3,1,6]
["Boom",{"$f":"1-SUM(B14:B16)","v":3.0000000000000027E-2},0.15,null,{"$f":"B13*C13","v":4.500000000000004E-3},null,null,null,null,null,null,null,"2010-01-25","Product2",22,5,null,null,null,null,null,"2011-06-23","Tina","Cs3",17,null,"2010-12-01",1,3,7,10,3,2]
["Normal",0.25,9.5000000000000001E-2,null,2.375E-2,null,null,null,null,null,null,null,"2010-01-26","Product7",7,5.8,null,null,null,null,null,"2011-07-10","Moe","Cs1",3,null,"2011-01-01",4,8,6,3,4,7]
["Reccession",0.65,2.5000000000000001E-2,null,1.6250000000000001E-2,null,null,null,null,null,null,null,"2010-01-27","Product5",11,5.9,null,null,null,null,null,"2011-09-10","Moe","Cs5",17,null,"2011-02-01",4,5,1,1,7,4]
["Depression",7.0000000000000007E-2,-0.16,null,-1.1200000000000002E-2,null,null,null,null,null,null,null,"2010-01-28","Product1",7,2.1,null,null,null,null,null,"2010-08-30","Sheliadawn","Cs4",4,null,"2011-03-01",5,4,5,4,6,8]
[null,"E(Ri)",{"$f":"SUMPRODUCT(B13:B16,C13:C16)","v":3.3300000000000003E-2},null,{"$f":"SUM(E13:E16)","v":3.3300000000000003E-2},null,null,null,null,null,null,null,"2010-01-29","Product8",20,8.3000000000000007,null,null,null,null,null,"2010-09-08","Sheliadawn","Cs3",22,null,"2011-04-01",8,4,5,3,5,{"$f":"SUMPRODUCT(--(TEXT($V$2:$V$682,\"mmyyy\")=TEXT($AA17,\"mmyyy\")),--($W$2:$W$682=AG$6))","v":5}]
[null,null,null,null,null,null,null,null,null,null,null,null,"2010-02-01","Product7",14,5.0999999999999996,null,null,null,null,null,"2011-11-18","Luong","Cs1",6]
[null,null,null,null,null,null,null,null,null,null,null,null,"2010-02-02","Product7",22,5.3,null,null,null,null,null,"2010-11-05","Moe","Cs5",4]
["State of Economy",{"$f":"\"Prob. Of \"&A20","v":"Prob. Of State of Economy"},"Stock A Return if State Occurs","Stock B Return if State Occurs","Stock C Return if State Occurs",null,null,null,null,null,null,null,"2010-02-03","Product9",9,10.1,null,null,null,null,null,"2010-06-29","Tina","Cs5",22]
["Weight","Weight",0.3,0.4,0.3,null,null,null,null,null,null,null,"2010-02-04","Product1",10,2,null,null,null,null,null,"2011-06-08","Moe","Cs5",22]
["Boom",0.15,0.3,0.45,0.33,{"$f":"C22*C$21*$B22","v":1.35E-2},2.7000000000000003E-2,1.485E-2,null,null,null,null,"2010-02-05","Product7",13,5.0999999999999996,null,null,null,null,null,"2011-05-12","Chin","Cs6",14]
["Good",0.45,0.12,0.1,0.15,1.6199999999999999E-2,1.8000000000000006E-2,2.0250000000000001E-2,null,null,null,null,"2010-02-08","Product8",20,8,null,null,null,null,null,"2010-08-05","Chin","Cs3",25]
["Poor",0.35,0.01,-0.15,-0.05,1.0499999999999999E-3,-2.0999999999999998E-2,-5.2499999999999995E-3,null,null,null,null,"2010-02-09","Product8",10,8.1,null,null,null,null,null,"2010-09-17","Chin","Cs5",10]
["Bust",0.05,-0.2,-0.3,-0.09,-3.0000000000000001E-3,-6.0000000000000001E-3,{"$f":"E25*E$21*$B25","v":-1.3500000000000001E-3},null,null,null,null,"2010-02-10","Product2",11,5.9,null,null,null,null,null,"2011-05-24","Luong","Cs3",11]
[null,null,null,null,null,null,null,{"$f":"SUM(F22:H25)","v":7.4249999999999997E-2},null,null,null,null,"2010-02-11","Product8",8,8.4,null,null,null,null,null,"2011-06-14","Tina","Cs3",25]
[null,"Expected Return for Portfolio",null,{"$f":"SUMPRODUCT(B22:B25*C21:E21*C22:E25)","v":7.4249999999999997E-2},{"$f":"TextFormula","v":"=SUMPRODUCT(B22:B25*C21:E21*C22:E25)"},null,null,null,null,null,null,null,"2010-02-12","Product5",11,5.4,null,null,null,null,null,"2011-04-12","Sheliadawn","Cs3",25]
[null,null,null,{"$f":"SUMPRODUCT(B22:B25,C21:E21,C22:E25)","v":{"$error":"#VALUE!"}},{"$f":"TextFormula","v":"=SUMPRODUCT(B22:B25,C21:E21,C22:E25)"},null,null,null,null,null,null,null,"2010-02-15","Product9",7,10.7,null,null,null,null,null,"2011-01-21","Moe","Cs4",16]
["SUMPRODUCT function can only handle arrays that are the same size, so you must use * instead of commas,",null,null,null,null,null,null,null,null,null,null,null,"2010-02-16","Product9",11,10.6,null,null,null,null,null,"2010-12-29","Sheliadawn","Cs5",7]
[null,null,null,null,null,null,null,null,null,null,null,null,"2010-02-17","Product8",16,8.3000000000000007,null,null,null,null,null,"2011-12-08","Sioux","Cs1",6]
[null,null,null,null,null,null,null,null,null,null,null,null,"2010-02-18","Product6",13,6.6,null,null,null,null,null,"2011-12-31","Sheliadawn","Cs1",3]
["Date","Sales",null,"Criteria = Year",null,null,null,null,null,null,null,null,"2010-02-19","Product3",10,3.6,null,null,null,null,null,"2011-01-21","Sheliadawn","Cs3",11]
["2009-11-26",790772,null,2009,null,{"$f":"YEAR(A33)","v":2009},null,null,null,null,null,null,"2010-02-22","Product5",17,5.8,null,null,null,null,null,"2011-05-23","Moe","Cs4",15]
["2010-01-25",669253,null,"Add",null,2010,null,null,null,null,null,null,"2010-02-23","Product6",14,6.1,null,null,null,null,null,"2010-12-06","Moe","Cs5",16]
["2011-01-30",653699,null,{"$f":"SUMPRODUCT(--(YEAR(A33:A40)=D33),B33:B40)","v":1473072},null,2011,null,null,null,null,null,null,"2010-02-24","Product1",15,2,null,null,null,null,null,"2011-06-25","Moe","Cs2",18]
["2010-10-05",638300,null," <\n<\n<\n<\n<\n<",null,2010,null,null,null,null,null,null,"2010-02-25","Product9",7,10.1,null,null,null,null,null,"2010-09-12","Chin","Cs6",3]
["2010-01-26",955656,null,"Array Formula",null,2010,null,null,null,null,null,null,"2010-02-26","Product4",9,4.5999999999999996,null,null,null,null,null,"2010-05-31","Tina","Cs4",1]
["2010-11-14",785553,null,null,null,2010,null,null,null,null,null,null,"2010-03-01","Product3",10,3.1,null,null,null,null,null,"2010-06-12","Sioux","Cs1",7]
["2009-10-22",682300,null,null,null,2009,null,null,null,null,null,null,"2010-03-02","Product1",6,2.2999999999999998,null,null,null,null,null,"2010-08-06","Sheliadawn","Cs5",16]
["2011-01-08",623663,null,null,null,2011,null,null,null,null,null,null,"2010-03-03","Product3",6,3.5,null,null,null,null,null,"2012-01-30","Tina","Cs3",24]
[null,null,null,null,null,null,null,null,null,null,null,null,"2010-03-04","Product3",8,3,null,null,null,null,null,"2011-02-12","Sioux","Cs6",25]
[null,null,null,null,null,null,null,null,null,null,null,null,"2010-03-05","Product6",24,6.4,null,null,null,null,null,"2011-03-30","Luong","Cs2",6]
[null,null,null,null,null,null,null,null,null,null,null,null,"2010-03-08","Product4",23,4.0999999999999996,null,null,null,null,null,"2010-10-24","Chin","Cs3",4]
[null,null,null,null,null,null,null,null,null,null,null,null,"2010-03-09","Product6",25,6.7,null,null,null,null,null,"2011-12-25","Moe","Cs3",8]
[null,null,null,null,null,null,null,null,null,null,null,null,"2010-03-10","Product2",10,5.7,null,null,null,null,null,"2010-06-29","Tina","Cs3",7]
[null,null,null,null,null,null,null,null,null,null,null,null,"2010-03-11","Product1",18,2.2999999999999998,null,null,null,null,null,"2011-05-25","Luong","Cs1",7]
[null,null,null,null,null,null,null,null,null,null,null,null,"2010-03-12","Product4",24,4.5999999999999996,null,null,null,null,null,"2011-11-26","Chin","Cs4",9]
[null,null,null,null,null,null,null,null,null,null,null,null,"2010-03-15","Product7",8,5.4,null,null,null,null,null,"2010-05-11","Tina","Cs6",3]
[null,null,null,null,null,null,null,null,null,null,null,null,"2010-03-16","Product5",9,5,null,null,null,null,null,"2011-02-11","Sheliadawn","Cs2",10]
[null,null,null,null,null,null,null,null,null,null,null,null,"2010-03-17","Product9",25,10.9,null,null,null,null,null,"2011-09-01","Chin","Cs3",14]
[null,null,null,null,null,null,null,null,null,null,null,null,"2010-03-18","Product5",22,5.4,null,null,null,null,null,"2011-04-09","Sheliadawn","Cs4",1]
[null,null,null,null,null,null,null,null,null,null,null,null,"2010-03-19","Product2",24,5.3,null,null,null,null,null,"2010-10-02","Sheliadawn","Cs5",11]
[null,null,null,null,null,null,null,null,null,null,null,null,"2010-03-22","Product4",10,4.0999999999999996,null,null,null,null,null,"2010-10-17","Luong","Cs1",17]
[null,null,null,null,null,null,null,null,null,null,null,null,"2010-03-23","Product3",9,3.5,null,null,null,null,null,"2011-03-26","Sioux","Cs5",4]
[null,null,null,null,null,null,null,null,null,null,null,null,"2010-03-24","Product9",24,10.4,null,null,null,null,null,"2012-02-01","Luong","Cs6",14]
[null,null,null,null,null,null,null,null,null,null,null,null,"2010-03-25","Product2",8,5.3,null,null,null,null,null,"2011-10-27","Sheliadawn","Cs3",19]
[null,null,null,null,null,null,null,null,null,null,null,null,"2010-03-26","Product3",18,3.4,null,null,null,null,null,"2011-03-26","Sioux","Cs3",19]
[null,null,null,null,null,null,null,null,null,null,null,null,"2010-03-29","Product5",25,5.8,null,null,null,null,null,"2011-07-31","Chin","Cs1",8]
[null,null,null,null,null,null,null,null,null,null,null,null,"2010-03-30","Product5",17,5.2,null,null,null,null,null,"2010-08-20","Tina","Cs5",23]
[null,null,null,null,null,null,null,null,null,null,null,null,"2010-03-31","Product5",25,5.7,null,null,null,null,null,"2011-03-08","Sioux","Cs5",9]
[null,null,null,null,null,null,null,null,null,null,null,null,"2010-04-01","Product8",8,8.6,null,null,null,null,null,"2012-01-27","Moe","Cs4",23]
[null,null,null,null,null,null,null,null,null,null,null,null,"2010-04-02","Product9",19,10.9,null,null,null,null,null,"2011-05-21","Luong","Cs6",6]
[null,null,null,null,null,null,null,null,null,null,null,null,"2010-04-05","Product3",15,3.6,null,null,null,null,null,"2011-03-31","Sheliadawn","Cs4",3]
[null,null,null,null,null,null,null,null,null,null,null,null,"2010-04-06","Product3",17,3.9,null,null,null,null,null,"2011-06-20","Luong","Cs1",7]
[null,null,null,null,null,null,null,null,null,null,null,null,"2010-04-07","Product6",15,6,null,null,null,null,null,"2011-08-29","Moe","Cs3",20]
[null,null,null,null,null,null,null,null,null,null,null,null,"2010-04-08","Product6",11,6.8,null,null,null,null,null,"2012-02-25","Moe","Cs3",19]
[null,null,null,null,null,null,null,null,null,null,null,null,"2010-04-09","Product8",16,8.8000000000000007,null,null,null,null,null,"2011-06-29","Moe","Cs4",1]
[null,null,null,null,null,null,null,null,null,null,null,null,"2010-04-12","Product5",20,5.8,null,null,null,null,null,"2012-03-17","Sheliadawn","Cs6",20]
[null,null,null,null,null,null,null,null,null,null,null,null,"2010-04-13","Product6",13,6.5,null,null,null,null,null,"2012-01-17","Tina","Cs1",5]
[null,null,null,null,null,null,null,null,null,null,null,null,"2010-04-14","Product1",11,2.5,null,null,null,null,null,"2010-05-25","Sioux","Cs2",16]
[null,null,null,null,null,null,null,null,null,null,null,null,"2010-04-15","Product6",18,6.1,null,null,null,null,null,"2010-08-01","Sioux","Cs5",25]
[null,null,null,null,null,null,null,null,null,null,null,null,"2010-04-16","Product2",7,5.0999999999999996,null,null,null,null,null,"2011-06-24","Sheliadawn","Cs5",23]
[null,null,null,null,null,null,null,null,null,null,null,null,"2010-04-19","Product2",8,5,null,null,null,null,null,"2010-08-21","Sioux","Cs3",18]
[null,null,null,null,null,null,null,null,null,null,null,null,"2010-04-20","Product9",13,10.5,null,null,null,null,null,"2012-01-10","Sioux","Cs2",17]
[null,null,null,null,null,null,null,null,null,null,null,null,"2010-04-21","Product8",22,8.1999999999999993,null,null,null,null,null,"2011-05-28","Chin","Cs5",10]
[null,null,null,null,null,null,null,null,null,null,null,null,"2010-04-22","Product7",7,5.0999999999999996,null,null,null,null,null,"2010-07-01","Sioux","Cs1",14]
[null,null,null,null,null,null,null,null,null,null,null,null,"2010-04-23","Product1",7,2,null,null,null,null,null,"2012-01-18","Sheliadawn","Cs6",9]
[null,null,null,null,null,null,null,null,null,null,null,null,"2010-04-26","Product4",21,4.5,null,null,null,null,null,"2010-08-26","Moe","Cs6",19]
[null,null,null,null,null,null,null,null,null,null,null,null,"2010-04-27","Product8",25,8.8000000000000007,null,null,null,null,null,"2011-07-08","Sheliadawn","Cs4",21]
[null,null,null,null,null,null,null,null,null,null,null,null,"2010-04-28","Product1",20,2.8,null,null,null,null,null,"2011-03-28","Chin","Cs3",22]
[null,null,null,null,null,null,null,null,null,null,null,null,"2010-04-29","Product3",12,3,null,null,null,null,null,"2012-04-08","Sioux","Cs3",24]
[null,null,null,null,null,null,null,null,null,null,null,null,"2010-04-30","Product9",13,10.6,null,null,null,null,null,"2011-06-07","Sheliadawn","Cs6",13]
[null,null,null,null,null,null,null,null,null,null,null,null,"2010-05-03","Product4",16,4.7,null,null,null,null,null,"2012-03-16","Luong","Cs5",15]
[null,null,null,null,null,null,null,null,null,null,null,null,"2010-05-04","Product9",25,10.8,null,null,null,null,null,"2011-07-17","Luong","Cs6",24]
[null,null,null,null,null,null,null,null,null,null,null,null,"2010-05-05","Product8",14,8.6999999999999993,null,null,null,null,null,"2011-02-01","Sheliadawn","Cs1",14]
[null,null,null,null,null,null,null,null,null,null,null,null,"2010-05-06","Product3",7,3.4,null,null,null,null,null,"2010-08-19","Luong","Cs4",16]
[null,null,null,null,null,null,null,null,null,null,null,null,"2010-05-07","Product2",7,5.8,null,null,null,null,null,"2011-09-15","Sheliadawn","Cs6",3]
[null,null,null,null,null,null,null,null,null,null,null,null,"2010-05-10","Product2",16,5.0999999999999996,null,null,null,null,null,"2011-03-29","Tina","Cs3",20]
[null,null,null,null,null,null,null,null,null,null,null,null,"2010-05-11","Product3",20,3.9,null,null,null,null,null,"2011-11-09","Luong","Cs2",20]
[null,null,null,null,null,null,null,null,null,null,null,null,"2010-05-12","Product5",24,5.7,null,null,null,null,null,"2011-04-28","Chin","Cs5",21]
[null,null,null,null,null,null,null,null,null,null,null,null,"2010-05-13","Product8",17,8.1999999999999993,null,null,null,null,null,"2011-12-21","Luong","Cs1",6]
[null,null,null,null,null,null,null,null,null,null,null,null,"2010-05-14","Product9",7,10.5,null,null,null,null,null,"2011-04-19","Sioux","Cs6",23]
[null,null,null,null,null,null,null,null,null,null,null,null,"2010-05-17","Product5",19,5.4,null,null,null,null,null,"2011-06-16","Tina","Cs2",20]
[null,null,null,null,null,null,null,null,null,null,null,null,"2010-05-18","Product7",8,5.2,null,null,null,null,null,"2010-10-24","Tina","Cs3",7]
[null,null,null,null,null,null,null,null,null,null,null,null,"2010-05-19","Product3",10,3.5,null,null,null,null,null,"2010-05-31","Sioux","Cs6",2]
[null,null,null,null,null,null,null,null,null,null,null,null,"2010-05-20","Product1",10,2,null,null,null,null,null,"2011-09-03","Sheliadawn","Cs1",1]
[null,null,null,null,null,null,null,null,null,null,null,null,"2010-05-21","Product8",16,8,null,null,null,null,null,"2011-04-02","Moe","Cs4",2]
[null,null,null,null,null,null,null,null,null,null,null,null,"2010-05-24","Product2",25,5.7,null,null,null,null,null,"2011-10-31","Moe","Cs6",19]
[null,null,null,null,null,null,null,null,null,null,null,null,"2010-05-25","Product2",18,5,null,null,null,null,null,"2011-01-19","Sioux","Cs6",15]
[null,null,null,null,null,null,null,null,null,null,null,null,"2010-05-26","Product2",13,5.3,null,null,null,null,null,"2012-03-20","Sioux","Cs2",24]
[null,null,null,null,null,null,null,null,null,null,null,null,"2010-05-27","Product9",17,10.4,null,null,null,null,null,"2011-07-14","Sheliadawn","Cs5",15]
[null,null,null,null,null,null,null,null,null,null,null,null,"2010-05-28","Product5",14,5.6,null,null,null,null,null,"2011-08-22","Luong","Cs1",21]
[null,null,null,null,null,null,null,null,null,null,null,null,"2010-05-31","Product5",24,5.6,null,null,null,null,null,"2010-07-18","Chin","Cs6",7]
[null,null,null,null,null,null,null,null,null,null,null,null,"2010-06-01","Product5",20,5.9,null,null,null,null,null,"2010-05-13","Tina","Cs1",19]
[null,null,null,null,null,null,null,null,null,null,null,null,"2010-06-02","Product3",25,3.3,null,null,null,null,null,"2011-09-29","Sioux","Cs5",18]
[null,null,null,null,null,null,null,null,null,null,null,null,"2010-06-03","Product1",10,2.6,null,null,null,null,null,"2010-07-20","Moe","Cs3",9]
[null,null,null,null,null,null,null,null,null,null,null,null,"2010-06-04","Product5",19,5.6,null,null,null,null,null,"2011-04-30","Moe","Cs3",7]
[null,null,null,null,null,null,null,null,null,null,null,null,"2010-06-07","Product3",19,3.5,null,null,null,null,null,"2010-07-22","Moe","Cs3",10]
[null,null,null,null,null,null,null,null,null,null,null,null,"2010-06-08","Product7",12,5.7,null,null,null,null,null,"2011-03-22","Sioux","Cs6",15]
[null,null,null,null,null,null,null,null,null,null,null,null,"2010-06-09","Product6",25,6.1,null,null,null,null,null,"2011-05-13","Moe","Cs4",6]
[null,null,null,null,null,null,null,null,null,null,null,null,"2010-06-10","Product1",13,2.1,null,null,null,null,null,"2010-06-09","Luong","Cs5",7]
[null,null,null,null,null,null,null,null,null,null,null,null,"2010-06-11","Product6",10,6.2,null,null,null,null,null,"2011-08-11","Sioux","Cs4",20]
[null,null,null,null,null,null,null,null,null,null,null,null,"2010-06-14","Product1",9,2.1,null,null,null,null,null,"2011-02-26","Sioux","Cs3",7]
[null,null,null,null,null,null,null,null,null,null,null,null,"2010-06-15","Product4",18,4.3,null,null,null,null,null,"2010-05-15","Tina","Cs3",24]
[null,null,null,null,null,null,null,null,null,null,null,null,"2010-06-16","Product3",24,3.9,null,null,null,null,null,"2011-01-12","Moe","Cs3",16]
[null,null,null,null,null,null,null,null,null,null,null,null,"2010-06-17","Product9",18,10.1,null,null,null,null,null,"2012-01-31","Sheliadawn","Cs1",20]
[null,null,null,null,null,null,null,null,null,null,null,null,"2010-06-18","Product1",15,2.7,null,null,null,null,null,"2011-05-20","Moe","Cs3",23]
[null,null,null,null,null,null,null,null,null,null,null,null,"2010-06-21","Product7",17,5.9,null,null,null,null,null,"2012-03-11","Tina","Cs2",13]
[null,null,null,null,null,null,null,null,null,null,null,null,"2010-06-22","Product7",25,5.5,null,null,null,null,null,"2011-01-24","Chin","Cs3",23]
[null,null,null,null,null,null,null,null,null,null,null,null,"2010-06-23","Product3",19,3.1,null,null,null,null,null,"2011-12-19","Chin","Cs3",16]
[null,null,null,null,null,null,null,null,null,null,null,null,"2010-06-24","Product2",15,5.3,null,null,null,null,null,"2010-09-26","Sioux","Cs3",5]
[null,null,null,null,null,null,null,null,null,null,null,null,"2010-06-25","Product8",24,8.9,null,null,null,null,null,"2012-01-17","Chin","Cs4",20]
[null,null,null,null,null,null,null,null,null,null,null,null,"2010-06-28","Product5",10,5.8,null,null,null,null,null,"2012-01-05","Moe","Cs1",23]
[null,null,null,null,null,null,null,null,null,null,null,null,"2010-06-29","Product8",7,8,null,null,null,null,null,"2010-07-01","Sioux","Cs3",9]
[null,null,null,null,null,null,null,null,null,null,null,null,"2010-06-30","Product9",17,10.1,null,null,null,null,null,"2010-07-18","Chin","Cs3",8]
[null,null,null,null,null,null,null,null,null,null,null,null,"2010-07-01","Product7",10,5.5,null,null,null,null,null,"2011-01-27","Sioux","Cs2",7]
[null,null,null,null,null,null,null,null,null,null,null,null,"2010-07-02","Product5",23,5.0999999999999996,null,null,null,null,null,"2012-03-17","Moe","Cs1",20]
[null,null,null,null,null,null,null,null,null,null,null,null,"2010-07-05","Product2",16,5.5,null,null,null,null,null,"2010-07-15","Tina","Cs6",14]
[null,null,null,null,null,null,null,null,null,null,null,null,"2010-07-06","Product6",23,6.5,null,null,null,null,null,"2010-11-23","Sioux","Cs5",22]
[null,null,null,null,null,null,null,null,null,null,null,null,"2010-07-07","Product5",25,5,null,null,null,null,null,"2011-09-01","Chin","Cs6",21]
[null,null,null,null,null,null,null,null,null,null,null,null,"2010-07-08","Product4",8,4.8,null,null,null,null,null,"2012-03-01","Sheliadawn","Cs1",17]
[null,null,null,null,null,null,null,null,null,null,null,null,"2010-07-09","Product6",8,6.9,null,null,null,null,null,"2010-12-09","Tina","Cs4",13]
[null,null,null,null,null,null,null,null,null,null,null,null,"2010-07-12","Product7",9,5,null,null,null,null,null,"2011-05-28","Sioux","Cs5",11]
[null,null,null,null,null,null,null,null,null,null,null,null,"2010-07-13","Product3",23,3.7,null,null,null,null,null,"2010-12-05","Luong","Cs4",17]
[null,null,null,null,null,null,null,null,null,null,null,null,"2010-07-14","Product2",16,5.9,null,null,null,null,null,"2011-10-01","Chin","Cs4",23]
[null,null,null,null,null,null,null,null,null,null,null,null,"2010-07-15","Product9",9,10.9,null,null,null,null,null,"2011-05-28","Chin","Cs2",18]
[null,null,null,null,null,null,null,null,null,null,null,null,"2010-07-16","Product4",20,4.7,null,null,null,null,null,"2011-04-27","Chin","Cs6",4]
[null,null,null,null,null,null,null,null,null,null,null,null,"2010-07-19","Product4",6,4.7,null,null,null,null,null,"2011-05-07","Sioux","Cs5",14]
[null,null,null,null,null,null,null,null,null,null,null,null,"2010-07-20","Product7",8,5.0999999999999996,null,null,null,null,null,"2012-01-12","Sioux","Cs3",5]
[null,null,null,null,null,null,null,null,null,null,null,null,"2010-07-21","Product3",15,3.6,null,null,null,null,null,"2011-02-15","Sheliadawn","Cs4",12]
[null,null,null,null,null,null,null,null,null,null,null,null,"2010-07-22","Product9",11,10.4,null,null,null,null,null,"2010-10-28","Chin","Cs6",15]
[null,null,null,null,null,null,null,null,null,null,null,null,"2010-07-23","Product5",12,5.2,null,null,null,null,null,"2011-08-07","Tina","Cs3",12]
[null,null,null,null,null,null,null,null,null,null,null,null,"2010-07-26","Product4",6,4.9000000000000004,null,null,null,null,null,"2011-08-20","Moe","Cs1",1]
[null,null,null,null,null,null,null,null,null,null,null,null,"2010-07-27","Product3",9,3.5,null,null,null,null,null,"2010-12-17","Tina","Cs5",5]
[null,null,null,null,null,null,null,null,null,null,null,null,"2010-07-28","Product1",21,2.9,null,null,null,null,null,"2011-07-01","Moe","Cs5",22]
[null,null,null,null,null,null,null,null,null,null,null,null,"2010-07-29","Product4",15,4.2,null,null,null,null,null,"2011-10-24","Sioux","Cs2",19]
[null,null,null,null,null,null,null,null,null,null,null,null,"2010-07-30","Product5",25,5.4,null,null,null,null,null,"2011-09-25","Sheliadawn","Cs5",15]
[null,null,null,null,null,null,null,null,null,null,null,null,"2010-08-02","Product1",13,2.4,null,null,null,null,null,"2012-02-14","Sheliadawn","Cs3",9]
[null,null,null,null,null,null,null,null,null,null,null,null,"2010-08-03","Product7",8,5.7,null,null,null,null,null,"2010-08-04","Moe","Cs2",14]
[null,null,null,null,null,null,null,null,null,null,null,null,"2010-08-04","Product6",13,6.2,null,null,null,null,null,"2010-12-22","Tina","Cs1",1]
[null,null,null,null,null,null,null,null,null,null,null,null,"2010-08-05","Product7",9,5.2,null,null,null,null,null,"2010-05-24","Tina","Cs5",25]
[null,null,null,null,null,null,null,null,null,null,null,null,"2010-08-06","Product3",23,3.9,null,null,null,null,null,"2011-06-28","Sioux","Cs2",22]
[null,null,null,null,null,null,null,null,null,null,null,null,"2010-08-09","Product7",20,5.2,null,null,null,null,null,"2010-06-22","Luong","Cs5",19]
[null,null,null,null,null,null,null,null,null,null,null,null,"2010-08-10","Product6",8,6,null,null,null,null,null,"2012-01-04","Moe","Cs5",1]
[null,null,null,null,null,null,null,null,null,null,null,null,"2010-08-11","Product8",21,8.5,null,null,null,null,null,"2011-12-14","Sioux","Cs2",14]
[null,null,null,null,null,null,null,null,null,null,null,null,"2010-08-12","Product9",20,10.5,null,null,null,null,null,"2011-07-31","Sioux","Cs3",2]
[null,null,null,null,null,null,null,null,null,null,null,null,"2010-08-13","Product8",17,8.9,null,null,null,null,null,"2011-06-09","Luong","Cs3",20]
[null,null,null,null,null,null,null,null,null,null,null,null,"2010-08-16","Product8",22,8.1999999999999993,null,null,null,null,null,"2010-12-23","Moe","Cs2",4]
[null,null,null,null,null,null,null,null,null,null,null,null,"2010-08-17","Product3",7,3.6,null,null,null,null,null,"2011-11-02","Moe","Cs4",14]
[null,null,null,null,null,null,null,null,null,null,null,null,"2010-08-18","Product7",10,5.9,null,null,null,null,null,"2011-02-13","Moe","Cs3",9]
[null,null,null,null,null,null,null,null,null,null,null,null,"2010-08-19","Product4",8,4,null,null,null,null,null,"2011-03-10","Tina","Cs6",4]
[null,null,null,null,null,null,null,null,null,null,null,null,"2010-08-20","Product7",6,5.9,null,null,null,null,null,"2011-06-20","Luong","Cs1",17]
[null,null,null,null,null,null,null,null,null,null,null,null,"2010-08-23","Product5",11,5.5,null,null,null,null,null,"2011-10-18","Moe","Cs1",23]
[null,null,null,null,null,null,null,null,null,null,null,null,"2010-08-24","Product2",20,5.3,null,null,null,null,null,"2010-06-18","Luong","Cs2",2]
[null,null,null,null,null,null,null,null,null,null,null,null,"2010-08-25","Product6",10,6.6,null,null,null,null,null,"2011-09-11","Sioux","Cs1",20]
[null,null,null,null,null,null,null,null,null,null,null,null,"2010-08-26","Product7",11,5.2,null,null,null,null,null,"2011-08-30","Chin","Cs4",1]
[null,null,null,null,null,null,null,null,null,null,null,null,null,null,null,null,null,null,null,null,null,"2010-09-19","Chin","Cs2",4]
[null,null,null,null,null,null,null,null,null,null,null,null,null,null,null,null,null,null,null,null,null,"2011-03-16","Sioux","Cs6",17]
[null,null,null,null,null,null,null,null,null,null,null,null,null,null,null,null,null,null,null,null,null,"2011-05-26","Luong","Cs3",8]
[null,null,null,null,null,null,null,null,null,null,null,null,null,null,null,null,null,null,null,null,null,"2011-12-23","Tina","Cs2",4]
[null,null,null,null,null,null,null,null,null,null,null,null,null,null,null,null,null,null,null,null,null,"2012-02-22","Sioux","Cs3",18]
[null,null,null,null,null,null,null,null,null,null,null,null,null,null,null,null,null,null,null,null,null,"2011-05-21","Luong","Cs3",11]
[null,null,null,null,null,null,null,null,null,null,null,null,null,null,null,null,null,null,null,null,null,"2010-10-12","Sioux","Cs4",21]
[null,null,null,null,null,null,null,null,null,null,null,null,null,null,null,null,null,null,null,null,null,"2012-01-31","Luong","Cs1",21]
[null,null,null,null,null,null,null,null,null,null,null,null,null,null,null,null,null,null,null,null,null,"2010-06-09","Chin","Cs5",3]
[null,null,null,null,null,null,null,null,null,null,null,null,null,null,null,null,null,null,null,null,null,"2010-08-23","Sioux","Cs2",24]
[null,null,null,null,null,null,null,null,null,null,null,null,null,null,null,null,null,null,null,null,null,"2010-10-02","Tina","Cs2",14]
[null,null,null,null,null,null,null,null,null,null,null,null,null,null,null,null,null,null,null,null,null,"2011-04-19","Chin","Cs1",14]
[null,null,null,null,null,null,null,null,null,null,null,null,null,null,null,null,null,null,null,null,null,"2010-11-27","Sioux","Cs6",1]
[null,null,null,null,null,null,null,null,null,null,null,null,null,null,null,null,null,null,null,null,null,"2011-03-08","Sheliadawn","Cs4",24]
[null,null,null,null,null,null,null,null,null,null,null,null,null,null,null,null,null,null,null,null,null,"2011-09-21","Moe","Cs5",7]
[null,null,null,null,null,null,null,null,null,null,null,null,null,null,null,null,null,null,null,null,null,"2010-06-04","Sioux","Cs3",12]
[null,null,null,null,null,null,null,null,null,null,null,null,null,null,null,null,null,null,null,null,null,"2011-11-14","Chin","Cs2",2]
[null,null,null,null,null,null,null,null,null,null,null,null,null,null,null,null,null,null,null,null,null,"2010-07-28","Chin","Cs3",3]
[null,null,null,null,null,null,null,null,null,null,null,null,null,null,null,null,null,null,null,null,null,"2011-10-02","Tina","Cs4",12]
[null,null,null,null,null,null,null,null,null,null,null,null,null,null,null,null,null,null,null,null,null,"2010-07-09","Chin","Cs2",1]
[null,null,null,null,null,null,null,null,null,null,null,null,null,null,null,null,null,null,null,null,null,"2011-10-03","Sheliadawn","Cs6",1]
[null,null,null,null,null,null,null,null,null,null,null,null,null,null,null,null,null,null,null,null,null,"2012-02-04","Moe","Cs5",22]
[null,null,null,null,null,null,null,null,null,null,null,null,null,null,null,null,null,null,null,null,null,"2011-05-22","Moe","Cs2",7]
[null,null,null,null,null,null,null,null,null,null,null,null,null,null,null,null,null,null,null,null,null,"2010-09-11","Chin","Cs6",3]
[null,null,null,null,null,null,null,null,null,null,null,null,null,null,null,null,null,null,null,null,null,"2012-02-02","Moe","Cs5",2]
[null,null,null,null,null,null,null,null,null,null,null,null,null,null,null,null,null,null,null,null,null,"2011-02-12","Chin","Cs5",16]
[null,null,null,null,null,null,null,null,null,null,null,null,null,null,null,null,null,null,null,null,null,"2011-11-27","Sheliadawn","Cs1",25]
[null,null,null,null,null,null,null,null,null,null,null,null,null,null,null,null,null,null,null,null,null,"2011-02-22","Sheliadawn","Cs3",22]
[null,null,null,null,null,null,null,null,null,null,null,null,null,null,null,null,null,null,null,null,null,"2011-12-04","Tina","Cs6",6]
[null,null,null,null,null,null,null,null,null,null,null,null,null,null,null,null,null,null,null,null,null,"2011-03-04","Luong","Cs4",13]
[null,null,null,null,null,null,null,null,null,null,null,null,null,null,null,null,null,null,null,null,null,"2011-04-06","Tina","Cs5",22]
[null,null,null,null,null,null,null,null,null,null,null,null,null,null,null,null,null,null,null,null,null,"2012-01-08","Sioux","Cs5",9]
[null,null,null,null,null,null,null,null,null,null,null,null,null,null,null,null,null,null,null,null,null,"2011-12-03","Sheliadawn","Cs6",6]
[null,null,null,null,null,null,null,null,null,null,null,null,null,null,null,null,null,null,null,null,null,"2011-03-11","Sioux","Cs2",1]
[null,null,null,null,null,null,null,null,null,null,null,null,null,null,null,null,null,null,null,null,null,"2010-05-13","Sioux","Cs1",14]
[null,null,null,null,null,null,null,null,null,null,null,null,null,null,null,null,null,null,null,null,null,"2010-06-14","Sheliadawn","Cs3",22]
[null,null,null,null,null,null,null,null,null,null,null,null,null,null,null,null,null,null,null,null,null,"2011-10-19","Sioux","Cs2",14]
[null,null,null,null,null,null,null,null,null,null,null,null,null,null,null,null,null,null,null,null,null,"2011-10-12","Tina","Cs6",14]
[null,null,null,null,null,null,null,null,null,null,null,null,null,null,null,null,null,null,null,null,null,"2011-12-17","Luong","Cs6",1]
[null,null,null,null,null,null,null,null,null,null,null,null,null,null,null,null,null,null,null,null,null,"2011-05-06","Luong","Cs3",6]
[null,null,null,null,null,null,null,null,null,null,null,null,null,null,null,null,null,null,null,null,null,"2011-12-23","Chin","Cs5",16]
[null,null,null,null,null,null,null,null,null,null,null,null,null,null,null,null,null,null,null,null,null,"2012-01-02","Chin","Cs5",19]
[null,null,null,null,null,null,null,null,null,null,null,null,null,null,null,null,null,null,null,null,null,"2011-12-27","Moe","Cs1",8]
[null,null,null,null,null,null,null,null,null,null,null,null,null,null,null,null,null,null,null,null,null,"2010-10-19","Moe","Cs2",20]
[null,null,null,null,null,null,null,null,null,null,null,null,null,null,null,null,null,null,null,null,null,"2011-06-09","Chin","Cs1",16]
[null,null,null,null,null,null,null,null,null,null,null,null,null,null,null,null,null,null,null,null,null,"2010-10-31","Chin","Cs5",19]
[null,null,null,null,null,null,null,null,null,null,null,null,null,null,null,null,null,null,null,null,null,"2010-06-23","Tina","Cs6",21]
[null,null,null,null,null,null,null,null,null,null,null,null,null,null,null,null,null,null,null,null,null,"2010-05-10","Sioux","Cs4",21]
[null,null,null,null,null,null,null,null,null,null,null,null,null,null,null,null,null,null,null,null,null,"2011-02-08","Moe","Cs6",7]
[null,null,null,null,null,null,null,null,null,null,null,null,null,null,null,null,null,null,null,null,null,"2010-07-21","Sheliadawn","Cs4",24]
[null,null,null,null,null,null,null,null,null,null,null,null,null,null,null,null,null,null,null,null,null,"2011-09-26","Moe","Cs2",23]
[null,null,null,null,null,null,null,null,null,null,null,null,null,null,null,null,null,null,null,null,null,"2012-03-15","Sioux","Cs4",16]
[null,null,null,null,null,null,null,null,null,null,null,null,null,null,null,null,null,null,null,null,null,"2011-12-30","Tina","Cs2",21]
[null,null,null,null,null,null,null,null,null,null,null,null,null,null,null,null,null,null,null,null,null,"2010-08-01","Tina","Cs2",5]
[null,null,null,null,null,null,null,null,null,null,null,null,null,null,null,null,null,null,null,null,null,"2010-09-13","Chin","Cs4",6]
[null,null,null,null,null,null,null,null,null,null,null,null,null,null,null,null,null,null,null,null,null,"2011-05-30","Moe","Cs1",24]
[null,null,null,null,null,null,null,null,null,null,null,null,null,null,null,null,null,null,null,null,null,"2010-07-31","Luong","Cs3",13]
[null,null,null,null,null,null,null,null,null,null,null,null,null,null,null,null,null,null,null,null,null,"2011-10-18","Chin","Cs5",16]
[null,null,null,null,null,null,null,null,null,null,null,null,null,null,null,null,null,null,null,null,null,"2011-09-15","Chin","Cs5",12]
[null,null,null,null,null,null,null,null,null,null,null,null,null,null,null,null,null,null,null,null,null,"2011-12-08","Sioux","Cs2",7]
[null,null,null,null,null,null,null,null,null,null,null,null,null,null,null,null,null,null,null,null,null,"2010-09-09","Moe","Cs1",2]
[null,null,null,null,null,null,null,null,null,null,null,null,null,null,null,null,null,null,null,null,null,"2010-12-10","Tina","Cs6",23]
[null,null,null,null,null,null,null,null,null,null,null,null,null,null,null,null,null,null,null,null,null,"2010-10-28","Chin","Cs2",7]
[null,null,null,null,null,null,null,null,null,null,null,null,null,null,null,null,null,null,null,null,null,"2011-04-08","Tina","Cs5",21]
[null,null,null,null,null,null,null,null,null,null,null,null,null,null,null,null,null,null,null,null,null,"2011-05-26","Sioux","Cs1",1]
[null,null,null,null,null,null,null,null,null,null,null,null,null,null,null,null,null,null,null,null,null,"2010-07-16","Tina","Cs1",15]
[null,null,null,null,null,null,null,null,null,null,null,null,null,null,null,null,null,null,null,null,null,"2012-02-19","Tina","Cs4",16]
[null,null,null,null,null,null,null,null,null,null,null,null,null,null,null,null,null,null,null,null,null,"2010-07-21","Sheliadawn","Cs3",11]
[null,null,null,null,null,null,null,null,null,null,null,null,null,null,null,null,null,null,null,null,null,"2010-06-10","Moe","Cs5",3]
[null,null,null,null,null,null,null,null,null,null,null,null,null,null,null,null,null,null,null,null,null,"2011-03-28","Sheliadawn","Cs2",1]
[null,null,null,null,null,null,null,null,null,null,null,null,null,null,null,null,null,null,null,null,null,"2011-09-22","Chin","Cs4",21]
[null,null,null,null,null,null,null,null,null,null,null,null,null,null,null,null,null,null,null,null,null,"2011-04-12","Sheliadawn","Cs1",12]
[null,null,null,null,null,null,null,null,null,null,null,null,null,null,null,null,null,null,null,null,null,"2010-11-04","Sheliadawn","Cs3",25]
[null,null,null,null,null,null,null,null,null,null,null,null,null,null,null,null,null,null,null,null,null,"2011-05-11","Luong","Cs3",8]
[null,null,null,null,null,null,null,null,null,null,null,null,null,null,null,null,null,null,null,null,null,"2012-03-05","Tina","Cs5",20]
[null,null,null,null,null,null,null,null,null,null,null,null,null,null,null,null,null,null,null,null,null,"2010-07-13","Sheliadawn","Cs2",14]
[null,null,null,null,null,null,null,null,null,null,null,null,null,null,null,null,null,null,null,null,null,"2011-06-22","Moe","Cs1",2]
[null,null,null,null,null,null,null,null,null,null,null,null,null,null,null,null,null,null,null,null,null,"2010-06-22","Tina","Cs4",18]
[null,null,null,null,null,null,null,null,null,null,null,null,null,null,null,null,null,null,null,null,null,"2011-04-26","Luong","Cs2",18]
[null,null,null,null,null,null,null,null,null,null,null,null,null,null,null,null,null,null,null,null,null,"2010-06-27","Sheliadawn","Cs6",7]
[null,null,null,null,null,null,null,null,null,null,null,null,null,null,null,null,null,null,null,null,null,"2011-12-12","Moe","Cs5",25]
[null,null,null,null,null,null,null,null,null,null,null,null,null,null,null,null,null,null,null,null,null,"2011-08-30","Sioux","Cs3",13]
[null,null,null,null,null,null,null,null,null,null,null,null,null,null,null,null,null,null,null,null,null,"2011-01-10","Moe","Cs5",4]
[null,null,null,null,null,null,null,null,null,null,null,null,null,null,null,null,null,null,null,null,null,"2011-09-03","Moe","Cs6",18]
[null,null,null,null,null,null,null,null,null,null,null,null,null,null,null,null,null,null,null,null,null,"2010-08-19","Sheliadawn","Cs6",4]
[null,null,null,null,null,null,null,null,null,null,null,null,null,null,null,null,null,null,null,null,null,"2010-09-26","Sheliadawn","Cs5",13]
[null,null,null,null,null,null,null,null,null,null,null,null,null,null,null,null,null,null,null,null,null,"2011-07-25","Moe","Cs5",5]
[null,null,null,null,null,null,null,null,null,null,null,null,null,null,null,null,null,null,null,null,null,"2010-06-30","Sheliadawn","Cs3",9]
[null,null,null,null,null,null,null,null,null,null,null,null,null,null,null,null,null,null,null,null,null,"2012-03-27","Sheliadawn","Cs1",1]
[null,null,null,null,null,null,null,null,null,null,null,null,null,null,null,null,null,null,null,null,null,"2010-10-16","Tina","Cs5",21]
[null,null,null,null,null,null,null,null,null,null,null,null,null,null,null,null,null,null,null,null,null,"2011-04-14","Sheliadawn","Cs6",19]
[null,null,null,null,null,null,null,null,null,null,null,null,null,null,null,null,null,null,null,null,null,"2010-05-10","Sheliadawn","Cs5",7]
[null,null,null,null,null,null,null,null,null,null,null,null,null,null,null,null,null,null,null,null,null,"2010-08-10","Sioux","Cs1",5]
[null,null,null,null,null,null,null,null,null,null,null,null,null,null,null,null,null,null,null,null,null,"2011-12-21","Chin","Cs3",23]
[null,null,null,null,null,null,null,null,null,null,null,null,null,null,null,null,null,null,null,null,null,"2012-01-19","Moe","Cs4",8]
[null,null,null,null,null,null,null,null,null,null,null,null,null,null,null,null,null,null,null,null,null,"2011-06-13","Tina","Cs1",10]
[null,null,null,null,null,null,null,null,null,null,null,null,null,null,null,null,null,null,null,null,null,"2010-12-06","Luong","Cs6",10]
[null,null,null,null,null,null,null,null,null,null,null,null,null,null,null,null,null,null,null,null,null,"2011-12-29","Chin","Cs3",24]
[null,null,null,null,null,null,null,null,null,null,null,null,null,null,null,null,null,null,null,null,null,"2012-02-08","Sioux","Cs3",5]
[null,null,null,null,null,null,null,null,null,null,null,null,null,null,null,null,null,null,null,null,null,"2011-03-23","Chin","Cs4",25]
[null,null,null,null,null,null,null,null,null,null,null,null,null,null,null,null,null,null,null,null,null,"2011-11-09","Sioux","Cs2",5]
[null,null,null,null,null,null,null,null,null,null,null,null,null,null,null,null,null,null,null,null,null,"2011-08-26","Luong","Cs4",3]
[null,null,null,null,null,null,null,null,null,null,null,null,null,null,null,null,null,null,null,null,null,"2011-09-22","Chin","Cs1",4]
[null,null,null,null,null,null,null,null,null,null,null,null,null,null,null,null,null,null,null,null,null,"2012-04-02","Sioux","Cs4",1]
[null,null,null,null,null,null,null,null,null,null,null,null,null,null,null,null,null,null,null,null,null,"2011-12-23","Sheliadawn","Cs5",20]
[null,null,null,null,null,null,null,null,null,null,null,null,null,null,null,null,null,null,null,null,null,"2010-09-09","Sioux","Cs1",5]
[null,null,null,null,null,null,null,null,null,null,null,null,null,null,null,null,null,null,null,null,null,"2010-10-08","Luong","Cs1",18]
[null,null,null,null,null,null,null,null,null,null,null,null,null,null,null,null,null,null,null,null,null,"2010-12-19","Luong","Cs2",4]
[null,null,null,null,null,null,null,null,null,null,null,null,null,null,null,null,null,null,null,null,null,"2010-06-07","Tina","Cs3",11]
[null,null,null,null,null,null,null,null,null,null,null,null,null,null,null,null,null,null,null,null,null,"2011-07-13","Chin","Cs5",16]
[null,null,null,null,null,null,null,null,null,null,null,null,null,null,null,null,null,null,null,null,null,"2010-06-03","Sheliadawn","Cs6",22]
[null,null,null,null,null,null,null,null,null,null,null,null,null,null,null,null,null,null,null,null,null,"2011-04-03","Chin","Cs6",6]
[null,null,null,null,null,null,null,null,null,null,null,null,null,null,null,null,null,null,null,null,null,"2011-07-03","Luong","Cs1",11]
[null,null,null,null,null,null,null,null,null,null,null,null,null,null,null,null,null,null,null,null,null,"2010-06-04","Chin","Cs5",24]
[null,null,null,null,null,null,null,null,null,null,null,null,null,null,null,null,null,null,null,null,null,"2011-12-25","Luong","Cs2",18]
[null,null,null,null,null,null,null,null,null,null,null,null,null,null,null,null,null,null,null,null,null,"2011-01-27","Sheliadawn","Cs3",3]
[null,null,null,null,null,null,null,null,null,null,null,null,null,null,null,null,null,null,null,null,null,"2010-05-18","Tina","Cs1",1]
[null,null,null,null,null,null,null,null,null,null,null,null,null,null,null,null,null,null,null,null,null,"2012-02-21","Sheliadawn","Cs6",13]
[null,null,null,null,null,null,null,null,null,null,null,null,null,null,null,null,null,null,null,null,null,"2011-12-29","Sioux","Cs1",2]
[null,null,null,null,null,null,null,null,null,null,null,null,null,null,null,null,null,null,null,null,null,"2012-01-15","Sheliadawn","Cs2",22]
[null,null,null,null,null,null,null,null,null,null,null,null,null,null,null,null,null,null,null,null,null,"2010-06-02","Luong","Cs6",21]
[null,null,null,null,null,null,null,null,null,null,null,null,null,null,null,null,null,null,null,null,null,"2011-12-04","Luong","Cs4",11]
[null,null,null,null,null,null,null,null,null,null,null,null,null,null,null,null,null,null,null,null,null,"2011-05-13","Luong","Cs4",21]
[null,null,null,null,null,null,null,null,null,null,null,null,null,null,null,null,null,null,null,null,null,"2011-09-23","Moe","Cs2",1]
[null,null,null,null,null,null,null,null,null,null,null,null,null,null,null,null,null,null,null,null,null,"2010-12-31","Sioux","Cs1",18]
[null,null,null,null,null,null,null,null,null,null,null,null,null,null,null,null,null,null,null,null,null,"2010-08-27","Chin","Cs3",7]
[null,null,null,null,null,null,null,null,null,null,null,null,null,null,null,null,null,null,null,null,null,"2011-12-10","Tina","Cs5",13]
[null,null,null,null,null,null,null,null,null,null,null,null,null,null,null,null,null,null,null,null,null,"2012-04-01","Luong","Cs5",7]
[null,null,null,null,null,null,null,null,null,null,null,null,null,null,null,null,null,null,null,null,null,"2011-07-14","Sheliadawn","Cs3",18]
[null,null,null,null,null,null,null,null,null,null,null,null,null,null,null,null,null,null,null,null,null,"2011-05-19","Sioux","Cs2",14]
[null,null,null,null,null,null,null,null,null,null,null,null,null,null,null,null,null,null,null,null,null,"2011-08-04","Sheliadawn","Cs3",17]
[null,null,null,null,null,null,null,null,null,null,null,null,null,null,null,null,null,null,null,null,null,"2010-07-29","Chin","Cs5",20]
[null,null,null,null,null,null,null,null,null,null,null,null,null,null,null,null,null,null,null,null,null,"2011-08-13","Moe","Cs5",17]
[null,null,null,null,null,null,null,null,null,null,null,null,null,null,null,null,null,null,null,null,null,"2011-03-19","Tina","Cs2",3]
[null,null,null,null,null,null,null,null,null,null,null,null,null,null,null,null,null,null,null,null,null,"2011-11-20","Chin","Cs3",20]
[null,null,null,null,null,null,null,null,null,null,null,null,null,null,null,null,null,null,null,null,null,"2010-07-01","Chin","Cs5",14]
[null,null,null,null,null,null,null,null,null,null,null,null,null,null,null,null,null,null,null,null,null,"2011-11-18","Moe","Cs6",24]
[null,null,null,null,null,null,null,null,null,null,null,null,null,null,null,null,null,null,null,null,null,"2012-01-02","Moe","Cs6",7]
[null,null,null,null,null,null,null,null,null,null,null,null,null,null,null,null,null,null,null,null,null,"2011-06-11","Sioux","Cs5",16]
[null,null,null,null,null,null,null,null,null,null,null,null,null,null,null,null,null,null,null,null,null,"2012-03-12","Luong","Cs6",3]
[null,null,null,null,null,null,null,null,null,null,null,null,null,null,null,null,null,null,null,null,null,"2011-11-16","Luong","Cs6",10]
[null,null,null,null,null,null,null,null,null,null,null,null,null,null,null,null,null,null,null,null,null,"2011-03-19","Luong","Cs2",1]
[null,null,null,null,null,null,null,null,null,null,null,null,null,null,null,null,null,null,null,null,null,"2011-10-27","Tina","Cs4",1]
[null,null,null,null,null,null,null,null,null,null,null,null,null,null,null,null,null,null,null,null,null,"2010-05-25","Chin","Cs2",10]
[null,null,null,null,null,null,null,null,null,null,null,null,null,null,null,null,null,null,null,null,null,"2010-07-09","Luong","Cs3",12]
[null,null,null,null,null,null,null,null,null,null,null,null,null,null,null,null,null,null,null,null,null,"2011-11-24","Luong","Cs6",15]
[null,null,null,null,null,null,null,null,null,null,null,null,null,null,null,null,null,null,null,null,null,"2010-06-27","Chin","Cs4",5]
[null,null,null,null,null,null,null,null,null,null,null,null,null,null,null,null,null,null,null,null,null,"2010-11-15","Chin","Cs3",5]
[null,null,null,null,null,null,null,null,null,null,null,null,null,null,null,null,null,null,null,null,null,"2011-01-05","Tina","Cs2",6]
[null,null,null,null,null,null,null,null,null,null,null,null,null,null,null,null,null,null,null,null,null,"2011-03-18","Moe","Cs1",13]
[null,null,null,null,null,null,null,null,null,null,null,null,null,null,null,null,null,null,null,null,null,"2010-10-27","Moe","Cs1",18]
[null,null,null,null,null,null,null,null,null,null,null,null,null,null,null,null,null,null,null,null,null,"2011-02-05","Chin","Cs4",3]
[null,null,null,null,null,null,null,null,null,null,null,null,null,null,null,null,null,null,null,null,null,"2011-09-16","Sioux","Cs4",5]
[null,null,null,null,null,null,null,null,null,null,null,null,null,null,null,null,null,null,null,null,null,"2011-07-01","Luong","Cs6",20]
[null,null,null,null,null,null,null,null,null,null,null,null,null,null,null,null,null,null,null,null,null,"2011-12-20","Luong","Cs4",14]
[null,null,null,null,null,null,null,null,null,null,null,null,null,null,null,null,null,null,null,null,null,"2010-12-05","Luong","Cs5",13]
[null,null,null,null,null,null,null,null,null,null,null,null,null,null,null,null,null,null,null,null,null,"2011-08-03","Chin","Cs3",13]
[null,null,null,null,null,null,null,null,null,null,null,null,null,null,null,null,null,null,null,null,null,"2010-08-22","Chin","Cs3",11]
[null,null,null,null,null,null,null,null,null,null,null,null,null,null,null,null,null,null,null,null,null,"2011-06-19","Sioux","Cs5",25]
[null,null,null,null,null,null,null,null,null,null,null,null,null,null,null,null,null,null,null,null,null,"2010-12-17","Sioux","Cs2",14]
[null,null,null,null,null,null,null,null,null,null,null,null,null,null,null,null,null,null,null,null,null,"2010-09-29","Tina","Cs4",7]
[null,null,null,null,null,null,null,null,null,null,null,null,null,null,null,null,null,null,null,null,null,"2011-04-26","Moe","Cs5",7]
[null,null,null,null,null,null,null,null,null,null,null,null,null,null,null,null,null,null,null,null,null,"2011-03-21","Moe","Cs3",17]
[null,null,null,null,null,null,null,null,null,null,null,null,null,null,null,null,null,null,null,null,null,"2011-12-22","Chin","Cs5",18]
[null,null,null,null,null,null,null,null,null,null,null,null,null,null,null,null,null,null,null,null,null,"2010-08-15","Sioux","Cs3",20]
[null,null,null,null,null,null,null,null,null,null,null,null,null,null,null,null,null,null,null,null,null,"2010-06-09","Luong","Cs5",7]
[null,null,null,null,null,null,null,null,null,null,null,null,null,null,null,null,null,null,null,null,null,"2010-12-10","Tina","Cs6",20]
[null,null,null,null,null,null,null,null,null,null,null,null,null,null,null,null,null,null,null,null,null,"2011-12-27","Sheliadawn","Cs4",11]
[null,null,null,null,null,null,null,null,null,null,null,null,null,null,null,null,null,null,null,null,null,"2012-01-11","Moe","Cs1",14]
[null,null,null,null,null,null,null,null,null,null,null,null,null,null,null,null,null,null,null,null,null,"2011-11-25","Chin","Cs5",4]
[null,null,null,null,null,null,null,null,null,null,null,null,null,null,null,null,null,null,null,null,null,"2010-08-12","Moe","Cs4",2]
[null,null,null,null,null,null,null,null,null,null,null,null,null,null,null,null,null,null,null,null,null,"2011-08-20","Moe","Cs4",13]
[null,null,null,null,null,null,null,null,null,null,null,null,null,null,null,null,null,null,null,null,null,"2011-03-25","Chin","Cs3",2]
[null,null,null,null,null,null,null,null,null,null,null,null,null,null,null,null,null,null,null,null,null,"2010-06-13","Chin","Cs6",13]
[null,null,null,null,null,null,null,null,null,null,null,null,null,null,null,null,null,null,null,null,null,"2012-03-02","Sheliadawn","Cs4",11]
[null,null,null,null,null,null,null,null,null,null,null,null,null,null,null,null,null,null,null,null,null,"2010-06-18","Sheliadawn","Cs5",9]
[null,null,null,null,null,null,null,null,null,null,null,null,null,null,null,null,null,null,null,null,null,"2010-07-11","Sioux","Cs2",18]
[null,null,null,null,null,null,null,null,null,null,null,null,null,null,null,null,null,null,null,null,null,"2011-10-14","Tina","Cs5",25]
[null,null,null,null,null,null,null,null,null,null,null,null,null,null,null,null,null,null,null,null,null,"2010-08-20","Luong","Cs1",18]
[null,null,null,null,null,null,null,null,null,null,null,null,null,null,null,null,null,null,null,null,null,"2011-05-01","Sheliadawn","Cs5",3]
[null,null,null,null,null,null,null,null,null,null,null,null,null,null,null,null,null,null,null,null,null,"2011-12-18","Tina","Cs1",1]
[null,null,null,null,null,null,null,null,null,null,null,null,null,null,null,null,null,null,null,null,null,"2011-11-18","Tina","Cs5",13]
[null,null,null,null,null,null,null,null,null,null,null,null,null,null,null,null,null,null,null,null,null,"2012-03-30","Luong","Cs2",11]
[null,null,null,null,null,null,null,null,null,null,null,null,null,null,null,null,null,null,null,null,null,"2010-09-06","Sheliadawn","Cs4",24]
[null,null,null,null,null,null,null,null,null,null,null,null,null,null,null,null,null,null,null,null,null,"2012-01-25","Sioux","Cs2",15]
[null,null,null,null,null,null,null,null,null,null,null,null,null,null,null,null,null,null,null,null,null,"2010-10-27","Tina","Cs6",19]
[null,null,null,null,null,null,null,null,null,null,null,null,null,null,null,null,null,null,null,null,null,"2010-07-01","Sioux","Cs2",10]
[null,null,null,null,null,null,null,null,null,null,null,null,null,null,null,null,null,null,null,null,null,"2011-07-25","Sioux","Cs5",14]
[null,null,null,null,null,null,null,null,null,null,null,null,null,null,null,null,null,null,null,null,null,"2011-03-30","Luong","Cs6",16]
[null,null,null,null,null,null,null,null,null,null,null,null,null,null,null,null,null,null,null,null,null,"2011-03-12","Tina","Cs2",9]
[null,null,null,null,null,null,null,null,null,null,null,null,null,null,null,null,null,null,null,null,null,"2010-10-19","Sheliadawn","Cs5",1]
[null,null,null,null,null,null,null,null,null,null,null,null,null,null,null,null,null,null,null,null,null,"2010-06-06","Chin","Cs2",18]
[null,null,null,null,null,null,null,null,null,null,null,null,null,null,null,null,null,null,null,null,null,"2010-05-14","Luong","Cs3",23]
[null,null,null,null,null,null,null,null,null,null,null,null,null,null,null,null,null,null,null,null,null,"2011-05-11","Luong","Cs4",8]
[null,null,null,null,null,null,null,null,null,null,null,null,null,null,null,null,null,null,null,null,null,"2010-12-05","Luong","Cs4",5]
[null,null,null,null,null,null,null,null,null,null,null,null,null,null,null,null,null,null,null,null,null,"2011-06-06","Sheliadawn","Cs2",14]
[null,null,null,null,null,null,null,null,null,null,null,null,null,null,null,null,null,null,null,null,null,"2010-10-05","Tina","Cs1",1]
[null,null,null,null,null,null,null,null,null,null,null,null,null,null,null,null,null,null,null,null,null,"2011-09-18","Luong","Cs5",23]
[null,null,null,null,null,null,null,null,null,null,null,null,null,null,null,null,null,null,null,null,null,"2011-02-17","Luong","Cs6",13]
[null,null,null,null,null,null,null,null,null,null,null,null,null,null,null,null,null,null,null,null,null,"2011-07-02","Tina","Cs6",6]
[null,null,null,null,null,null,null,null,null,null,null,null,null,null,null,null,null,null,null,null,null,"2011-03-08","Moe","Cs5",4]
[null,null,null,null,null,null,null,null,null,null,null,null,null,null,null,null,null,null,null,null,null,"2010-06-21","Chin","Cs2",19]
[null,null,null,null,null,null,null,null,null,null,null,null,null,null,null,null,null,null,null,null,null,"2011-09-26","Moe","Cs2",3]
[null,null,null,null,null,null,null,null,null,null,null,null,null,null,null,null,null,null,null,null,null,"2011-12-13","Luong","Cs4",24]
[null,null,null,null,null,null,null,null,null,null,null,null,null,null,null,null,null,null,null,null,null,"2011-01-03","Moe","Cs5",11]
[null,null,null,null,null,null,null,null,null,null,null,null,null,null,null,null,null,null,null,null,null,"2011-09-24","Moe","Cs6",18]
[null,null,null,null,null,null,null,null,null,null,null,null,null,null,null,null,null,null,null,null,null,"2011-01-02","Chin","Cs1",15]
[null,null,null,null,null,null,null,null,null,null,null,null,null,null,null,null,null,null,null,null,null,"2011-05-24","Sioux","Cs1",3]
[null,null,null,null,null,null,null,null,null,null,null,null,null,null,null,null,null,null,null,null,null,"2012-01-11","Luong","Cs6",22]
[null,null,null,null,null,null,null,null,null,null,null,null,null,null,null,null,null,null,null,null,null,"2011-01-13","Luong","Cs3",16]
[null,null,null,null,null,null,null,null,null,null,null,null,null,null,null,null,null,null,null,null,null,"2011-08-22","Tina","Cs6",12]
[null,null,null,null,null,null,null,null,null,null,null,null,null,null,null,null,null,null,null,null,null,"2011-05-03","Tina","Cs2",25]
[null,null,null,null,null,null,null,null,null,null,null,null,null,null,null,null,null,null,null,null,null,"2010-09-22","Sheliadawn","Cs5",12]
[null,null,null,null,null,null,null,null,null,null,null,null,null,null,null,null,null,null,null,null,null,"2011-07-05","Tina","Cs6",21]
[null,null,null,null,null,null,null,null,null,null,null,null,null,null,null,null,null,null,null,null,null,"2011-03-29","Chin","Cs1",24]
[null,null,null,null,null,null,null,null,null,null,null,null,null,null,null,null,null,null,null,null,null,"2011-12-13","Sheliadawn","Cs2",15]
[null,null,null,null,null,null,null,null,null,null,null,null,null,null,null,null,null,null,null,null,null,"2011-04-25","Tina","Cs5",20]
[null,null,null,null,null,null,null,null,null,null,null,null,null,null,null,null,null,null,null,null,null,"2010-11-21","Sioux","Cs4",7]
[null,null,null,null,null,null,null,null,null,null,null,null,null,null,null,null,null,null,null,null,null,"2011-05-25","Tina","Cs3",13]
[null,null,null,null,null,null,null,null,null,null,null,null,null,null,null,null,null,null,null,null,null,"2010-11-25","Tina","Cs1",6]
[null,null,null,null,null,null,null,null,null,null,null,null,null,null,null,null,null,null,null,null,null,"2012-02-09","Moe","Cs4",13]
[null,null,null,null,null,null,null,null,null,null,null,null,null,null,null,null,null,null,null,null,null,"2011-09-02","Moe","Cs4",22]
[null,null,null,null,null,null,null,null,null,null,null,null,null,null,null,null,null,null,null,null,null,"2010-07-13","Chin","Cs5",2]
[null,null,null,null,null,null,null,null,null,null,null,null,null,null,null,null,null,null,null,null,null,"2011-08-12","Sioux","Cs3",17]
[null,null,null,null,null,null,null,null,null,null,null,null,null,null,null,null,null,null,null,null,null,"2010-09-01","Chin","Cs5",2]
[null,null,null,null,null,null,null,null,null,null,null,null,null,null,null,null,null,null,null,null,null,"2011-01-22","Sioux","Cs2",6]
[null,null,null,null,null,null,null,null,null,null,null,null,null,null,null,null,null,null,null,null,null,"2011-12-24","Moe","Cs1",1]
[null,null,null,null,null,null,null,null,null,null,null,null,null,null,null,null,null,null,null,null,null,"2012-01-02","Tina","Cs2",2]
[null,null,null,null,null,null,null,null,null,null,null,null,null,null,null,null,null,null,null,null,null,"2010-10-30","Luong","Cs6",8]
[null,null,null,null,null,null,null,null,null,null,null,null,null,null,null,null,null,null,null,null,null,"2012-03-12","Sheliadawn","Cs4",11]
[null,null,null,null,null,null,null,null,null,null,null,null,null,null,null,null,null,null,null,null,null,"2012-02-18","Moe","Cs6",24]
[null,null,null,null,null,null,null,null,null,null,null,null,null,null,null,null,null,null,null,null,null,"2011-07-20","Tina","Cs6",19]
[null,null,null,null,null,null,null,null,null,null,null,null,null,null,null,null,null,null,null,null,null,"2010-06-13","Luong","Cs5",15]
[null,null,null,null,null,null,null,null,null,null,null,null,null,null,null,null,null,null,null,null,null,"2010-07-28","Tina","Cs2",2]
[null,null,null,null,null,null,null,null,null,null,null,null,null,null,null,null,null,null,null,null,null,"2011-04-14","Sioux","Cs6",24]
[null,null,null,null,null,null,null,null,null,null,null,null,null,null,null,null,null,null,null,null,null,"2011-10-22","Tina","Cs5",4]
[null,null,null,null,null,null,null,null,null,null,null,null,null,null,null,null,null,null,null,null,null,"2010-12-20","Moe","Cs1",25]
[null,null,null,null,null,null,null,null,null,null,null,null,null,null,null,null,null,null,null,null,null,"2010-05-28","Sheliadawn","Cs2",4]
[null,null,null,null,null,null,null,null,null,null,null,null,null,null,null,null,null,null,null,null,null,"2010-12-07","Luong","Cs6",14]
[null,null,null,null,null,null,null,null,null,null,null,null,null,null,null,null,null,null,null,null,null,"2011-10-27","Luong","Cs4",18]
[null,null,null,null,null,null,null,null,null,null,null,null,null,null,null,null,null,null,null,null,null,"2011-12-28","Luong","Cs1",20]
[null,null,null,null,null,null,null,null,null,null,null,null,null,null,null,null,null,null,null,null,null,"2011-09-21","Sioux","Cs1",11]
[null,null,null,null,null,null,null,null,null,null,null,null,null,null,null,null,null,null,null,null,null,"2011-09-01","Luong","Cs4",21]
[null,null,null,null,null,null,null,null,null,null,null,null,null,null,null,null,null,null,null,null,null,"2010-06-02","Chin","Cs1",12]
[null,null,null,null,null,null,null,null,null,null,null,null,null,null,null,null,null,null,null,null,null,"2012-01-30","Moe","Cs2",7]
[null,null,null,null,null,null,null,null,null,null,null,null,null,null,null,null,null,null,null,null,null,"2012-02-01","Tina","Cs5",16]
[null,null,null,null,null,null,null,null,null,null,null,null,null,null,null,null,null,null,null,null,null,"2011-07-30","Sheliadawn","Cs6",3]
[null,null,null,null,null,null,null,null,null,null,null,null,null,null,null,null,null,null,null,null,null,"2011-01-29","Tina","Cs3",2]
[null,null,null,null,null,null,null,null,null,null,null,null,null,null,null,null,null,null,null,null,null,"2011-12-30","Tina","Cs5",9]
[null,null,null,null,null,null,null,null,null,null,null,null,null,null,null,null,null,null,null,null,null,"2012-04-07","Chin","Cs2",10]
[null,null,null,null,null,null,null,null,null,null,null,null,null,null,null,null,null,null,null,null,null,"2011-07-08","Moe","Cs1",15]
[null,null,null,null,null,null,null,null,null,null,null,null,null,null,null,null,null,null,null,null,null,"2011-02-13","Sheliadawn","Cs5",8]
[null,null,null,null,null,null,null,null,null,null,null,null,null,null,null,null,null,null,null,null,null,"2012-01-13","Sheliadawn","Cs2",25]
[null,null,null,null,null,null,null,null,null,null,null,null,null,null,null,null,null,null,null,null,null,"2011-01-30","Sheliadawn","Cs3",22]
[null,null,null,null,null,null,null,null,null,null,null,null,null,null,null,null,null,null,null,null,null,"2012-02-17","Chin","Cs5",24]
[null,null,null,null,null,null,null,null,null,null,null,null,null,null,null,null,null,null,null,null,null,"2010-10-09","Sioux","Cs4",2]
[null,null,null,null,null,null,null,null,null,null,null,null,null,null,null,null,null,null,null,null,null,"2012-01-15","Moe","Cs2",12]
[null,null,null,null,null,null,null,null,null,null,null,null,null,null,null,null,null,null,null,null,null,"2010-06-18","Luong","Cs3",10]
[null,null,null,null,null,null,null,null,null,null,null,null,null,null,null,null,null,null,null,null,null,"2011-12-03","Sioux","Cs6",2]
[null,null,null,null,null,null,null,null,null,null,null,null,null,null,null,null,null,null,null,null,null,"2012-03-17","Sheliadawn","Cs5",25]
[null,null,null,null,null,null,null,null,null,null,null,null,null,null,null,null,null,null,null,null,null,"2011-01-12","Luong","Cs2",14]
[null,null,null,null,null,null,null,null,null,null,null,null,null,null,null,null,null,null,null,null,null,"2010-06-19","Chin","Cs1",25]
[null,null,null,null,null,null,null,null,null,null,null,null,null,null,null,null,null,null,null,null,null,"2011-01-17","Sioux","Cs1",1]
[null,null,null,null,null,null,null,null,null,null,null,null,null,null,null,null,null,null,null,null,null,"2012-03-14","Moe","Cs4",1]
[null,null,null,null,null,null,null,null,null,null,null,null,null,null,null,null,null,null,null,null,null,"2011-12-07","Sioux","Cs1",10]
[null,null,null,null,null,null,null,null,null,null,null,null,null,null,null,null,null,null,null,null,null,"2010-06-18","Moe","Cs5",19]
[null,null,null,null,null,null,null,null,null,null,null,null,null,null,null,null,null,null,null,null,null,"2010-09-10","Luong","Cs6",4]
[null,null,null,null,null,null,null,null,null,null,null,null,null,null,null,null,null,null,null,null,null,"2012-03-24","Moe","Cs6",22]
[null,null,null,null,null,null,null,null,null,null,null,null,null,null,null,null,null,null,null,null,null,"2011-09-17","Moe","Cs2",17]
[null,null,null,null,null,null,null,null,null,null,null,null,null,null,null,null,null,null,null,null,null,"2011-10-22","Sheliadawn","Cs3",18]
[null,null,null,null,null,null,null,null,null,null,null,null,null,null,null,null,null,null,null,null,null,"2011-05-02","Sheliadawn","Cs1",21]
[null,null,null,null,null,null,null,null,null,null,null,null,null,null,null,null,null,null,null,null,null,"2011-08-12","Sioux","Cs1",7]
[null,null,null,null,null,null,null,null,null,null,null,null,null,null,null,null,null,null,null,null,null,"2011-06-07","Sheliadawn","Cs4",16]
[null,null,null,null,null,null,null,null,null,null,null,null,null,null,null,null,null,null,null,null,null,"2011-06-20","Sioux","Cs2",25]
[null,null,null,null,null,null,null,null,null,null,null,null,null,null,null,null,null,null,null,null,null,"2010-07-03","Moe","Cs2",1]
[null,null,null,null,null,null,null,null,null,null,null,null,null,null,null,null,null,null,null,null,null,"2011-01-06","Luong","Cs3",13]
[null,null,null,null,null,null,null,null,null,null,null,null,null,null,null,null,null,null,null,null,null,"2010-06-02","Tina","Cs4",1]
[null,null,null,null,null,null,null,null,null,null,null,null,null,null,null,null,null,null,null,null,null,"2011-04-26","Chin","Cs5",13]
[null,null,null,null,null,null,null,null,null,null,null,null,null,null,null,null,null,null,null,null,null,"2012-02-02","Tina","Cs1",13]
[null,null,null,null,null,null,null,null,null,null,null,null,null,null,null,null,null,null,null,null,null,"2012-03-26","Chin","Cs1",2]
[null,null,null,null,null,null,null,null,null,null,null,null,null,null,null,null,null,null,null,null,null,"2012-03-31","Moe","Cs5",13]
[null,null,null,null,null,null,null,null,null,null,null,null,null,null,null,null,null,null,null,null,null,"2012-01-14","Sioux","Cs6",8]
[null,null,null,null,null,null,null,null,null,null,null,null,null,null,null,null,null,null,null,null,null,"2011-04-14","Chin","Cs1",4]
[null,null,null,null,null,null,null,null,null,null,null,null,null,null,null,null,null,null,null,null,null,"2011-10-13","Sheliadawn","Cs3",23]
[null,null,null,null,null,null,null,null,null,null,null,null,null,null,null,null,null,null,null,null,null,"2011-01-23","Moe","Cs6",7]
[null,null,null,null,null,null,null,null,null,null,null,null,null,null,null,null,null,null,null,null,null,"2011-05-07","Moe","Cs3",19]
[null,null,null,null,null,null,null,null,null,null,null,null,null,null,null,null,null,null,null,null,null,"2011-12-16","Moe","Cs2",17]
[null,null,null,null,null,null,null,null,null,null,null,null,null,null,null,null,null,null,null,null,null,"2010-07-13","Moe","Cs4",4]
[null,null,null,null,null,null,null,null,null,null,null,null,null,null,null,null,null,null,null,null,null,"2010-05-15","Chin","Cs1",11]
[null,null,null,null,null,null,null,null,null,null,null,null,null,null,null,null,null,null,null,null,null,"2011-12-19","Sheliadawn","Cs6",6]
[null,null,null,null,null,null,null,null,null,null,null,null,null,null,null,null,null,null,null,null,null,"2012-02-13","Luong","Cs2",23]
[null,null,null,null,null,null,null,null,null,null,null,null,null,null,null,null,null,null,null,null,null,"2011-03-29","Tina","Cs4",19]
[null,null,null,null,null,null,null,null,null,null,null,null,null,null,null,null,null,null,null,null,null,"2010-09-06","Luong","Cs3",20]
[null,null,null,null,null,null,null,null,null,null,null,null,null,null,null,null,null,null,null,null,null,"2010-08-15","Tina","Cs4",11]
[null,null,null,null,null,null,null,null,null,null,null,null,null,null,null,null,null,null,null,null,null,"2010-10-05","Luong","Cs4",5]
[null,null,null,null,null,null,null,null,null,null,null,null,null,null,null,null,null,null,null,null,null,"2011-02-13","Sioux","Cs2",16]
[null,null,null,null,null,null,null,null,null,null,null,null,null,null,null,null,null,null,null,null,null,"2011-01-01","Moe","Cs4",2]
[null,null,null,null,null,null,null,null,null,null,null,null,null,null,null,null,null,null,null,null,null,"2011-07-08","Chin","Cs4",11]
[null,null,null,null,null,null,null,null,null,null,null,null,null,null,null,null,null,null,null,null,null,"2010-07-27","Luong","Cs4",9]
[null,null,null,null,null,null,null,null,null,null,null,null,null,null,null,null,null,null,null,null,null,"2011-01-02","Moe","Cs5",3]
[null,null,null,null,null,null,null,null,null,null,null,null,null,null,null,null,null,null,null,null,null,"2011-02-19","Tina","Cs5",13]
[null,null,null,null,null,null,null,null,null,null,null,null,null,null,null,null,null,null,null,null,null,"2010-07-06","Sheliadawn","Cs3",18]
[null,null,null,null,null,null,null,null,null,null,null,null,null,null,null,null,null,null,null,null,null,"2010-10-23","Sheliadawn","Cs3",9]
[null,null,null,null,null,null,null,null,null,null,null,null,null,null,null,null,null,null,null,null,null,"2011-03-01","Chin","Cs2",5]
[null,null,null,null,null,null,null,null,null,null,null,null,null,null,null,null,null,null,null,null,null,"2011-07-03","Sioux","Cs4",1]
[null,null,null,null,null,null,null,null,null,null,null,null,null,null,null,null,null,null,null,null,null,"2012-03-31","Chin","Cs4",6]
[null,null,null,null,null,null,null,null,null,null,null,null,null,null,null,null,null,null,null,null,null,"2010-07-13","Sheliadawn","Cs6",7]
[null,null,null,null,null,null,null,null,null,null,null,null,null,null,null,null,null,null,null,null,null,"2010-05-17","Luong","Cs5",24]
[null,null,null,null,null,null,null,null,null,null,null,null,null,null,null,null,null,null,null,null,null,"2011-07-02","Chin","Cs3",15]
[null,null,null,null,null,null,null,null,null,null,null,null,null,null,null,null,null,null,null,null,null,"2011-01-22","Tina","Cs2",12]
[null,null,null,null,null,null,null,null,null,null,null,null,null,null,null,null,null,null,null,null,null,"2011-07-10","Moe","Cs1",1]
[null,null,null,null,null,null,null,null,null,null,null,null,null,null,null,null,null,null,null,null,null,"2011-03-26","Sheliadawn","Cs1",12]
[null,null,null,null,null,null,null,null,null,null,null,null,null,null,null,null,null,null,null,null,null,"2010-08-10","Tina","Cs6",9]
[null,null,null,null,null,null,null,null,null,null,null,null,null,null,null,null,null,null,null,null,null,"2010-08-22","Moe","Cs3",1]
[null,null,null,null,null,null,null,null,null,null,null,null,null,null,null,null,null,null,null,null,null,"2012-01-06","Tina","Cs1",4]
[null,null,null,null,null,null,null,null,null,null,null,null,null,null,null,null,null,null,null,null,null,"2011-05-03","Luong","Cs2",20]
[null,null,null,null,null,null,null,null,null,null,null,null,null,null,null,null,null,null,null,null,null,"2012-03-27","Sioux","Cs2",19]
[null,null,null,null,null,null,null,null,null,null,null,null,null,null,null,null,null,null,null,null,null,"2011-08-14","Sheliadawn","Cs4",4]
[null,null,null,null,null,null,null,null,null,null,null,null,null,null,null,null,null,null,null,null,null,"2010-12-07","Tina","Cs6",4]
[null,null,null,null,null,null,null,null,null,null,null,null,null,null,null,null,null,null,null,null,null,"2011-05-25","Sioux","Cs3",23]
[null,null,null,null,null,null,null,null,null,null,null,null,null,null,null,null,null,null,null,null,null,"2010-11-22","Luong","Cs3",17]
[null,null,null,null,null,null,null,null,null,null,null,null,null,null,null,null,null,null,null,null,null,"2011-04-17","Chin","Cs1",21]
[null,null,null,null,null,null,null,null,null,null,null,null,null,null,null,null,null,null,null,null,null,"2012-03-18","Moe","Cs3",19]
[null,null,null,null,null,null,null,null,null,null,null,null,null,null,null,null,null,null,null,null,null,"2010-09-23","Moe","Cs1",17]
[null,null,null,null,null,null,null,null,null,null,null,null,null,null,null,null,null,null,null,null,null,"2011-07-25","Chin","Cs5",24]
[null,null,null,null,null,null,null,null,null,null,null,null,null,null,null,null,null,null,null,null,null,"2011-07-23","Chin","Cs1",21]
[null,null,null,null,null,null,null,null,null,null,null,null,null,null,null,null,null,null,null,null,null,"2011-09-29","Sheliadawn","Cs4",20]
[null,null,null,null,null,null,null,null,null,null,null,null,null,null,null,null,null,null,null,null,null,"2010-08-07","Sioux","Cs3",19]
[null,null,null,null,null,null,null,null,null,null,null,null,null,null,null,null,null,null,null,null,null,"2010-08-29","Luong","Cs1",19]
[null,null,null,null,null,null,null,null,null,null,null,null,null,null,null,null,null,null,null,null,null,"2010-11-09","Sioux","Cs6",25]
[null,null,null,null,null,null,null,null,null,null,null,null,null,null,null,null,null,null,null,null,null,"2011-10-26","Tina","Cs4",8]
[null,null,null,null,null,null,null,null,null,null,null,null,null,null,null,null,null,null,null,null,null,"2011-09-17","Moe","Cs2",7]
[null,null,null,null,null,null,null,null,null,null,null,null,null,null,null,null,null,null,null,null,null,"2011-02-14","Sioux","Cs4",22]
[null,null,null,null,null,null,null,null,null,null,null,null,null,null,null,null,null,null,null,null,null,"2011-02-09","Chin","Cs6",16]
[null,null,null,null,null,null,null,null,null,null,null,null,null,null,null,null,null,null,null,null,null,"2012-02-02","Sheliadawn","Cs1",10]
[null,null,null,null,null,null,null,null,null,null,null,null,null,null,null,null,null,null,null,null,null,"2010-06-02","Luong","Cs1",16]
[null,null,null,null,null,null,null,null,null,null,null,null,null,null,null,null,null,null,null,null,null,"2010-11-28","Tina","Cs3",6]
[null,null,null,null,null,null,null,null,null,null,null,null,null,null,null,null,null,null,null,null,null,"2010-08-16","Moe","Cs4",13]
[null,null,null,null,null,null,null,null,null,null,null,null,null,null,null,null,null,null,null,null,null,"2011-09-13","Tina","Cs4",14]
[null,null,null,null,null,null,null,null,null,null,null,null,null,null,null,null,null,null,null,null,null,"2011-07-05","Moe","Cs5",2]
[null,null,null,null,null,null,null,null,null,null,null,null,null,null,null,null,null,null,null,null,null,"2011-05-21","Sheliadawn","Cs6",19]
[null,null,null,null,null,null,null,null,null,null,null,null,null,null,null,null,null,null,null,null,null,"2010-08-13","Tina","Cs3",7]
[null,null,null,null,null,null,null,null,null,null,null,null,null,null,null,null,null,null,null,null,null,"2012-02-15","Sheliadawn","Cs6",8]
[null,null,null,null,null,null,null,null,null,null,null,null,null,null,null,null,null,null,null,null,null,"2010-11-17","Moe","Cs4",4]
[null,null,null,null,null,null,null,null,null,null,null,null,null,null,null,null,null,null,null,null,null,"2011-06-24","Moe","Cs6",9]
[null,null,null,null,null,null,null,null,null,null,null,null,null,null,null,null,null,null,null,null,null,"2010-09-07","Sioux","Cs2",24]
[null,null,null,null,null,null,null,null,null,null,null,null,null,null,null,null,null,null,null,null,null,"2010-12-14","Tina","Cs4",15]
[null,null,null,null,null,null,null,null,null,null,null,null,null,null,null,null,null,null,null,null,null,"2010-05-14","Luong","Cs1",10]
[null,null,null,null,null,null,null,null,null,null,null,null,null,null,null,null,null,null,null,null,null,"2011-01-27","Moe","Cs5",14]
[null,null,null,null,null,null,null,null,null,null,null,null,null,null,null,null,null,null,null,null,null,"2011-04-23","Sioux","Cs6",24]
[null,null,null,null,null,null,null,null,null,null,null,null,null,null,null,null,null,null,null,null,null,"2011-09-09","Sioux","Cs2",9]
[null,null,null,null,null,null,null,null,null,null,null,null,null,null,null,null,null,null,null,null,null,"2011-02-11","Moe","Cs5",21]
[null,null,null,null,null,null,null,null,null,null,null,null,null,null,null,null,null,null,null,null,null,"2010-12-18","Chin","Cs1",7]
[null,null,null,null,null,null,null,null,null,null,null,null,null,null,null,null,null,null,null,null,null,"2011-06-19","Chin","Cs6",2]
[null,null,null,null,null,null,null,null,null,null,null,null,null,null,null,null,null,null,null,null,null,"2010-12-01","Luong","Cs4",4]
[null,null,null,null,null,null,null,null,null,null,null,null,null,null,null,null,null,null,null,null,null,"2010-11-17","Chin","Cs5",6]
[null,null,null,null,null,null,null,null,null,null,null,null,null,null,null,null,null,null,null,null,null,"2011-09-06","Sioux","Cs1",2]
[null,null,null,null,null,null,null,null,null,null,null,null,null,null,null,null,null,null,null,null,null,"2012-01-28","Sheliadawn","Cs3",23]
[null,null,null,null,null,null,null,null,null,null,null,null,null,null,null,null,null,null,null,null,null,"2012-01-11","Luong","Cs4",5]
[null,null,null,null,null,null,null,null,null,null,null,null,null,null,null,null,null,null,null,null,null,"2011-02-19","Sheliadawn","Cs5",11]
[null,null,null,null,null,null,null,null,null,null,null,null,null,null,null,null,null,null,null,null,null,"2010-09-22","Tina","Cs1",24]
[null,null,null,null,null,null,null,null,null,null,null,null,null,null,null,null,null,null,null,null,null,"2010-05-14","Tina","Cs2",22]
[null,null,null,null,null,null,null,null,null,null,null,null,null,null,null,null,null,null,null,null,null,"2010-10-08","Luong","Cs4",18]
[null,null,null,null,null,null,null,null,null,null,null,null,null,null,null,null,null,null,null,null,null,"2010-09-30","Moe","Cs3",3]
[null,null,null,null,null,null,null,null,null,null,null,null,null,null,null,null,null,null,null,null,null,"2011-08-30","Moe","Cs4",9]
[null,null,null,null,null,null,null,null,null,null,null,null,null,null,null,null,null,null,null,null,null,"2010-11-16","Tina","Cs6",23]
[null,null,null,null,null,null,null,null,null,null,null,null,null,null,null,null,null,null,null,null,null,"2010-10-26","Sheliadawn","Cs5",10]
[null,null,null,null,null,null,null,null,null,null,null,null,null,null,null,null,null,null,null,null,null,"2011-11-03","Luong","Cs3",24]
[null,null,null,null,null,null,null,null,null,null,null,null,null,null,null,null,null,null,null,null,null,"2011-07-27","Tina","Cs6",24]
[null,null,null,null,null,null,null,null,null,null,null,null,null,null,null,null,null,null,null,null,null,"2011-03-28","Sheliadawn","Cs1",25]
[null,null,null,null,null,null,null,null,null,null,null,null,null,null,null,null,null,null,null,null,null,"2011-02-05","Chin","Cs1",2]
[null,null,null,null,null,null,null,null,null,null,null,null,null,null,null,null,null,null,null,null,null,"2011-08-19","Sheliadawn","Cs6",2]
[null,null,null,null,null,null,null,null,null,null,null,null,null,null,null,null,null,null,null,null,null,"2011-12-18","Sheliadawn","Cs3",3]
[null,null,null,null,null,null,null,null,null,null,null,null,null,null,null,null,null,null,null,null,null,"2012-03-13","Tina","Cs5",2]
[null,null,null,null,null,null,null,null,null,null,null,null,null,null,null,null,null,null,null,null,null,"2010-05-30","Tina","Cs5",13]
[null,null,null,null,null,null,null,null,null,null,null,null,null,null,null,null,null,null,null,null,null,"2011-04-10","Moe","Cs1",10]
[null,null,null,null,null,null,null,null,null,null,null,null,null,null,null,null,null,null,null,null,null,"2011-01-05","Chin","Cs1",19]
[null,null,null,null,null,null,null,null,null,null,null,null,null,null,null,null,null,null,null,null,null,"2011-08-21","Sheliadawn","Cs1",3]
[null,null,null,null,null,null,null,null,null,null,null,null,null,null,null,null,null,null,null,null,null,"2012-03-03","Moe","Cs2",10]
[null,null,null,null,null,null,null,null,null,null,null,null,null,null,null,null,null,null,null,null,null,"2011-11-03","Sheliadawn","Cs6",13]
[null,null,null,null,null,null,null,null,null,null,null,null,null,null,null,null,null,null,null,null,null,"2011-10-04","Sioux","Cs3",19]
[null,null,null,null,null,null,null,null,null,null,null,null,null,null,null,null,null,null,null,null,null,"2011-04-29","Tina","Cs4",13]
[null,null,null,null,null,null,null,null,null,null,null,null,null,null,null,null,null,null,null,null,null,"2011-02-09","Sheliadawn","Cs1",17]
[null,null,null,null,null,null,null,null,null,null,null,null,null,null,null,null,null,null,null,null,null,"2010-06-01","Moe","Cs6",4]
[null,null,null,null,null,null,null,null,null,null,null,null,null,null,null,null,null,null,null,null,null,"2011-11-21","Moe","Cs2",7]
[null,null,null,null,null,null,null,null,null,null,null,null,null,null,null,null,null,null,null,null,null,"2010-05-31","Tina","Cs3",16]
[null,null,null,null,null,null,null,null,null,null,null,null,null,null,null,null,null,null,null,null,null,"2011-09-16","Tina","Cs5",14]
[null,null,null,null,null,null,null,null,null,null,null,null,null,null,null,null,null,null,null,null,null,"2011-04-04","Luong","Cs3",6]
[null,null,null,null,null,null,null,null,null,null,null,null,null,null,null,null,null,null,null,null,null,"2011-09-03","Luong","Cs3",1]
[null,null,null,null,null,null,null,null,null,null,null,null,null,null,null,null,null,null,null,null,null,"2010-08-07","Moe","Cs3",15]
[null,null,null,null,null,null,null,null,null,null,null,null,null,null,null,null,null,null,null,null,null,"2011-01-15","Sioux","Cs4",17]
[null,null,null,null,null,null,null,null,null,null,null,null,null,null,null,null,null,null,null,null,null,"2010-09-30","Tina","Cs2",23]
[null,null,null,null,null,null,null,null,null,null,null,null,null,null,null,null,null,null,null,null,null,"2012-04-04","Luong","Cs1",14]
[null,null,null,null,null,null,null,null,null,null,null,null,null,null,null,null,null,null,null,null,null,"2010-11-24","Sioux","Cs6",5]
[null,null,null,null,null,null,null,null,null,null,null,null,null,null,null,null,null,null,null,null,null,"2010-08-15","Luong","Cs6",18]
[null,null,null,null,null,null,null,null,null,null,null,null,null,null,null,null,null,null,null,null,null,"2011-09-19","Moe","Cs3",3]
[null,null,null,null,null,null,null,null,null,null,null,null,null,null,null,null,null,null,null,null,null,"2012-02-28","Tina","Cs4",6]
[null,null,null,null,null,null,null,null,null,null,null,null,null,null,null,null,null,null,null,null,null,"2011-09-08","Luong","Cs4",3]
[null,null,null,null,null,null,null,null,null,null,null,null,null,null,null,null,null,null,null,null,null,"2012-02-13","Sioux","Cs6",24]
[null,null,null,null,null,null,null,null,null,null,null,null,null,null,null,null,null,null,null,null,null,"2011-11-29","Sheliadawn","Cs6",10]
[null,null,null,null,null,null,null,null,null,null,null,null,null,null,null,null,null,null,null,null,null,"2011-03-02","Sioux","Cs5",15]
[null,null,null,null,null,null,null,null,null,null,null,null,null,null,null,null,null,null,null,null,null,"2011-01-13","Chin","Cs3",21]
[null,null,null,null,null,null,null,null,null,null,null,null,null,null,null,null,null,null,null,null,null,"2011-08-07","Sioux","Cs1",3]
[null,null,null,null,null,null,null,null,null,null,null,null,null,null,null,null,null,null,null,null,null,"2011-06-07","Tina","Cs5",20]
[null,null,null,null,null,null,null,null,null,null,null,null,null,null,null,null,null,null,null,null,null,"2010-11-04","Moe","Cs5",17]
[null,null,null,null,null,null,null,null,null,null,null,null,null,null,null,null,null,null,null,null,null,"2010-12-22","Luong","Cs2",22]
[null,null,null,null,null,null,null,null,null,null,null,null,null,null,null,null,null,null,null,null,null,"2011-03-06","Sioux","Cs5",12]
[null,null,null,null,null,null,null,null,null,null,null,null,null,null,null,null,null,null,null,null,null,"2011-01-29","Tina","Cs4",12]
[null,null,null,null,null,null,null,null,null,null,null,null,null,null,null,null,null,null,null,null,null,"2010-05-30","Luong","Cs3",11]
[null,null,null,null,null,null,null,null,null,null,null,null,null,null,null,null,null,null,null,null,null,"2012-02-20","Moe","Cs5",8]
[null,null,null,null,null,null,null,null,null,null,null,null,null,null,null,null,null,null,null,null,null,"2011-12-11","Moe","Cs2",11]
[null,null,null,null,null,null,null,null,null,null,null,null,null,null,null,null,null,null,null,null,null,"2010-11-18","Sioux","Cs3",3]
[null,null,null,null,null,null,null,null,null,null,null,null,null,null,null,null,null,null,null,null,null,"2010-09-29","Sioux","Cs4",15]
[null,null,null,null,null,null,null,null,null,null,null,null,null,null,null,null,null,null,null,null,null,"2010-11-25","Moe","Cs4",12]
[null,null,null,null,null,null,null,null,null,null,null,null,null,null,null,null,null,null,null,null,null,"2011-06-01","Sioux","Cs6",1]
[null,null,null,null,null,null,null,null,null,null,null,null,null,null,null,null,null,null,null,null,null,"2010-07-03","Moe","Cs3",8]
[null,null,null,null,null,null,null,null,null,null,null,null,null,null,null,null,null,null,null,null,null,"2010-10-08","Moe","Cs1",9]
[null,null,null,null,null,null,null,null,null,null,null,null,null,null,null,null,null,null,null,null,null,"2011-10-31","Moe","Cs6",5]
[null,null,null,null,null,null,null,null,null,null,null,null,null,null,null,null,null,null,null,null,null,"2012-01-05","Chin","Cs4",11]
[null,null,null,null,null,null,null,null,null,null,null,null,null,null,null,null,null,null,null,null,null,"2012-02-13","Tina","Cs1",15]
[null,null,null,null,null,null,null,null,null,null,null,null,null,null,null,null,null,null,null,null,null,"2010-12-24","Luong","Cs6",5]
[null,null,null,null,null,null,null,null,null,null,null,null,null,null,null,null,null,null,null,null,null,"2012-02-20","Luong","Cs1",4]
[null,null,null,null,null,null,null,null,null,null,null,null,null,null,null,null,null,null,null,null,null,"2010-10-03","Tina","Cs2",23]
[null,null,null,null,null,null,null,null,null,null,null,null,null,null,null,null,null,null,null,null,null,"2011-12-25","Luong","Cs5",13]
[null,null,null,null,null,null,null,null,null,null,null,null,null,null,null,null,null,null,null,null,null,"2011-01-06","Tina","Cs1",25]
[null,null,null,null,null,null,null,null,null,null,null,null,null,null,null,null,null,null,null,null,null,"2012-03-26","Sioux","Cs2",25]
[null,null,null,null,null,null,null,null,null,null,null,null,null,null,null,null,null,null,null,null,null,"2010-12-25","Sheliadawn","Cs2",9]
[null,null,null,null,null,null,null,null,null,null,null,null,null,null,null,null,null,null,null,null,null,"2011-04-22","Sioux","Cs2",12]
[null,null,null,null,null,null,null,null,null,null,null,null,null,null,null,null,null,null,null,null,null,"2012-01-04","Sheliadawn","Cs2",4]
[null,null,null,null,null,null,null,null,null,null,null,null,null,null,null,null,null,null,null,null,null,"2011-03-20","Moe","Cs4",7]
[null,null,null,null,null,null,null,null,null,null,null,null,null,null,null,null,null,null,null,null,null,"2012-03-18","Moe","Cs1",23]
[null,null,null,null,null,null,null,null,null,null,null,null,null,null,null,null,null,null,null,null,null,"2010-08-28","Sheliadawn","Cs1",25]
[null,null,null,null,null,null,null,null,null,null,null,null,null,null,null,null,null,null,null,null,null,"2010-11-03","Luong","Cs2",11]
[null,null,null,null,null,null,null,null,null,null,null,null,null,null,null,null,null,null,null,null,null,"2010-05-25","Tina","Cs2",18]
[null,null,null,null,null,null,null,null,null,null,null,null,null,null,null,null,null,null,null,null,null,"2010-06-09","Sioux","Cs3",11]
[null,null,null,null,null,null,null,null,null,null,null,null,null,null,null,null,null,null,null,null,null,"2012-02-21","Sheliadawn","Cs4",5]
[null,null,null,null,null,null,null,null,null,null,null,null,null,null,null,null,null,null,null,null,null,"2012-02-19","Tina","Cs4",8]
[null,null,null,null,null,null,null,null,null,null,null,null,null,null,null,null,null,null,null,null,null,"2010-08-17","Luong","Cs2",10]
[null,null,null,null,null,null,null,null,null,null,null,null,null,null,null,null,null,null,null,null,null,"2010-09-06","Moe","Cs4",13]
[null,null,null,null,null,null,null,null,null,null,null,null,null,null,null,null,null,null,null,null,null,"2010-07-28","Sheliadawn","Cs6",9]
[null,null,null,null,null,null,null,null,null,null,null,null,null,null,null,null,null,null,null,null,null,"2011-10-25","Tina","Cs5",24]
[null,null,null,null,null,null,null,null,null,null,null,null,null,null,null,null,null,null,null,null,null,"2010-06-07","Sioux","Cs4",12]
[null,null,null,null,null,null,null,null,null,null,null,null,null,null,null,null,null,null,null,null,null,"2012-02-09","Sheliadawn","Cs5",24]
[null,null,null,null,null,null,null,null,null,null,null,null,null,null,null,null,null,null,null,null,null,"2011-12-16","Sioux","Cs5",16]
[null,null,null,null,null,null,null,null,null,null,null,null,null,null,null,null,null,null,null,null,null,"2011-06-05","Moe","Cs3",3]
[null,null,null,null,null,null,null,null,null,null,null,null,null,null,null,null,null,null,null,null,null,"2011-04-06","Sioux","Cs4",23]
[null,null,null,null,null,null,null,null,null,null,null,null,null,null,null,null,null,null,null,null,null,"2010-07-16","Sheliadawn","Cs6",20]
[null,null,null,null,null,null,null,null,null,null,null,null,null,null,null,null,null,null,null,null,null,"2011-09-19","Moe","Cs2",18]
[null,null,null,null,null,null,null,null,null,null,null,null,null,null,null,null,null,null,null,null,null,"2011-11-22","Sheliadawn","Cs1",9]
[null,null,null,null,null,null,null,null,null,null,null,null,null,null,null,null,null,null,null,null,null,"2010-09-29","Sheliadawn","Cs2",2]
[null,null,null,null,null,null,null,null,null,null,null,null,null,null,null,null,null,null,null,null,null,"2012-01-23","Moe","Cs5",9]
[null,null,null,null,null,null,null,null,null,null,null,null,null,null,null,null,null,null,null,null,null,"2011-06-02","Moe","Cs5",1]
[null,null,null,null,null,null,null,null,null,null,null,null,null,null,null,null,null,null,null,null,null,"2011-08-30","Tina","Cs4",16]
[null,null,null,null,null,null,null,null,null,null,null,null,null,null,null,null,null,null,null,null,null,"2010-08-29","Tina","Cs4",18]
[null,null,null,null,null,null,null,null,null,null,null,null,null,null,null,null,null,null,null,null,null,"2010-10-26","Sioux","Cs3",18]
[null,null,null,null,null,null,null,null,null,null,null,null,null,null,null,null,null,null,null,null,null,"2011-05-05","Luong","Cs6",9]
[null,null,null,null,null,null,null,null,null,null,null,null,null,null,null,null,null,null,null,null,null,"2012-01-19","Tina","Cs2",25]
[null,null,null,null,null,null,null,null,null,null,null,null,null,null,null,null,null,null,null,null,null,"2011-04-22","Chin","Cs1",4]
[null,null,null,null,null,null,null,null,null,null,null,null,null,null,null,null,null,null,null,null,null,"2011-11-20","Tina","Cs1",12]
[null,null,null,null,null,null,null,null,null,null,null,null,null,null,null,null,null,null,null,null,null,"2010-09-05","Luong","Cs6",6]
[null,null,null,null,null,null,null,null,null,null,null,null,null,null,null,null,null,null,null,null,null,"2010-09-28","Luong","Cs2",9]
[null,null,null,null,null,null,null,null,null,null,null,null,null,null,null,null,null,null,null,null,null,"2010-10-15","Sheliadawn","Cs4",16]
[null,null,null,null,null,null,null,null,null,null,null,null,null,null,null,null,null,null,null,null,null,"2010-10-30","Sioux","Cs5",17]
[null,null,null,null,null,null,null,null,null,null,null,null,null,null,null,null,null,null,null,null,null,"2010-06-01","Chin","Cs3",21]
[null,null,null,null,null,null,null,null,null,null,null,null,null,null,null,null,null,null,null,null,null,"2011-09-28","Tina","Cs2",23]
[null,null,null,null,null,null,null,null,null,null,null,null,null,null,null,null,null,null,null,null,null,"2011-03-09","Sheliadawn","Cs1",6]
[null,null,null,null,null,null,null,null,null,null,null,null,null,null,null,null,null,null,null,null,null,"2010-08-25","Moe","Cs5",17]
[null,null,null,null,null,null,null,null,null,null,null,null,null,null,null,null,null,null,null,null,null,"2011-07-19","Sheliadawn","Cs4",11]
[null,null,null,null,null,null,null,null,null,null,null,null,null,null,null,null,null,null,null,null,null,"2010-05-10","Luong","Cs1",13]
[null,null,null,null,null,null,null,null,null,null,null,null,null,null,null,null,null,null,null,null,null,"2011-10-23","Tina","Cs6",9]
[null,null,null,null,null,null,null,null,null,null,null,null,null,null,null,null,null,null,null,null,null,"2010-06-07","Sioux","Cs5",23]
[null,null,null,null,null,null,null,null,null,null,null,null,null,null,null,null,null,null,null,null,null,"2011-09-17","Chin","Cs5",17]
[null,null,null,null,null,null,null,null,null,null,null,null,null,null,null,null,null,null,null,null,null,"2010-06-01","Tina","Cs3",14]
[null,null,null,null,null,null,null,null,null,null,null,null,null,null,null,null,null,null,null,null,null,"2010-09-13","Chin","Cs3",15]
[null,null,null,null,null,null,null,null,null,null,null,null,null,null,null,null,null,null,null,null,null,"2010-06-02","Chin","Cs5",25]
[null,null,null,null,null,null,null,null,null,null,null,null,null,null,null,null,null,null,null,null,null,"2011-07-08","Moe","Cs4",3]
[null,null,null,null,null,null,null,null,null,null,null,null,null,null,null,null,null,null,null,null,null,"2011-12-20","Sioux","Cs1",18]
[null,null,null,null,null,null,null,null,null,null,null,null,null,null,null,null,null,null,null,null,null,"2010-11-14","Tina","Cs2",25]
[null,null,null,null,null,null,null,null,null,null,null,null,null,null,null,null,null,null,null,null,null,"2011-06-03","Luong","Cs6",20]
[null,null,null,null,null,null,null,null,null,null,null,null,null,null,null,null,null,null,null,null,null,"2010-11-28","Luong","Cs1",4]
[null,null,null,null,null,null,null,null,null,null,null,null,null,null,null,null,null,null,null,null,null,"2011-10-18","Chin","Cs2",22]
[null,null,null,null,null,null,null,null,null,null,null,null,null,null,null,null,null,null,null,null,null,"2010-12-20","Sheliadawn","Cs5",9]
[null,null,null,null,null,null,null,null,null,null,null,null,null,null,null,null,null,null,null,null,null,"2010-07-27","Tina","Cs4",12]
[null,null,null,null,null,null,null,null,null,null,null,null,null,null,null,null,null,null,null,null,null,"2010-09-25","Luong","Cs1",23]
[null,null,null,null,null,null,null,null,null,null,null,null,null,null,null,null,null,null,null,null,null,"2010-06-06","Sheliadawn","Cs1",22]
[null,null,null,null,null,null,null,null,null,null,null,null,null,null,null,null,null,null,null,null,null,"2012-01-16","Sheliadawn","Cs4",19]
[null,null,null,null,null,null,null,null,null,null,null,null,null,null,null,null,null,null,null,null,null,"2010-11-02","Tina","Cs1",18]
[null,null,null,null,null,null,null,null,null,null,null,null,null,null,null,null,null,null,null,null,null,"2010-09-19","Tina","Cs4",5]
[null,null,null,null,null,null,null,null,null,null,null,null,null,null,null,null,null,null,null,null,null,"2011-01-14","Tina","Cs4",25]
[null,null,null,null,null,null,null,null,null,null,null,null,null,null,null,null,null,null,null,null,null,"2010-09-06","Tina","Cs6",11]
[null,null,null,null,null,null,null,null,null,null,null,null,null,null,null,null,null,null,null,null,null,"2011-07-03","Chin","Cs6",21]
[null,null,null,null,null,null,null,null,null,null,null,null,null,null,null,null,null,null,null,null,null,"2011-02-07","Moe","Cs1",11]
[null,null,null,null,null,null,null,null,null,null,null,null,null,null,null,null,null,null,null,null,null,"2012-02-03","Chin","Cs2",20]
[null,null,null,null,null,null,null,null,null,null,null,null,null,null,null,null,null,null,null,null,null,"2011-12-12","Moe","Cs5",9]
[null,null,null,null,null,null,null,null,null,null,null,null,null,null,null,null,null,null,null,null,null,"2010-12-15","Luong","Cs1",10]
[null,null,null,null,null,null,null,null,null,null,null,null,null,null,null,null,null,null,null,null,null,"2011-01-20","Sioux","Cs1",19]
[null,null,null,null,null,null,null,null,null,null,null,null,null,null,null,null,null,null,null,null,null,"2011-04-03","Tina","Cs4",3]
[null,null,null,null,null,null,null,null,null,null,null,null,null,null,null,null,null,null,null,null,null,"2011-11-03","Sioux","Cs4",14]
[null,null,null,null,null,null,null,null,null,null,null,null,null,null,null,null,null,null,null,null,null,"2011-12-07","Luong","Cs4",12]
[null,null,null,null,null,null,null,null,null,null,null,null,null,null,null,null,null,null,null,null,null,"2011-12-04","Tina","Cs4",4]
[null,null,null,null,null,null,null,null,null,null,null,null,null,null,null,null,null,null,null,null,null,"2011-08-30","Chin","Cs1",13]
[null,null,null,null,null,null,null,null,null,null,null,null,null,null,null,null,null,null,null,null,null,"2012-01-09","Tina","Cs3",24]
[null,null,null,null,null,null,null,null,null,null,null,null,null,null,null,null,null,null,null,null,null,"2010-07-08","Sheliadawn","Cs3",24]
[null,null,null,null,null,null,null,null,null,null,null,null,null,null,null,null,null,null,null,null,null,"2010-08-09","Sioux","Cs2",1]
[null,null,null,null,null,null,null,null,null,null,null,null,null,null,null,null,null,null,null,null,null,"2011-09-19","Chin","Cs2",16]
[null,null,null,null,null,null,null,null,null,null,null,null,null,null,null,null,null,null,null,null,null,"2012-02-02","Sheliadawn","Cs1",24]
[null,null,null,null,null,null,null,null,null,null,null,null,null,null,null,null,null,null,null,null,null,"2010-08-26","Tina","Cs1",7]
[null,null,null,null,null,null,null,null,null,null,null,null,null,null,null,null,null,null,null,null,null,"2011-01-20","Sheliadawn","Cs1",4]
[null,null,null,null,null,null,null,null,null,null,null,null,null,null,null,null,null,null,null,null,null,"2010-10-07","Moe","Cs5",23]
[null,null,null,null,null,null,null,null,null,null,null,null,null,null,null,null,null,null,null,null,null,"2010-11-15","Moe","Cs5",19]
[null,null,null,null,null,null,null,null,null,null,null,null,null,null,null,null,null,null,null,null,null,"2011-05-05","Chin","Cs6",10]
[null,null,null,null,null,null,null,null,null,null,null,null,null,null,null,null,null,null,null,null,null,"2011-04-11","Sheliadawn","Cs1",1]
[null,null,null,null,null,null,null,null,null,null,null,null,null,null,null,null,null,null,null,null,null,"2012-04-08","Sioux","Cs6",19]
[null,null,null,null,null,null,null,null,null,null,null,null,null,null,null,null,null,null,null,null,null,"2011-11-15","Chin","Cs5",13]
[null,null,null,null,null,null,null,null,null,null,null,null,null,null,null,null,null,null,null,null,null,"2011-12-31","Luong","Cs2",20]
[null,null,null,null,null,null,null,null,null,null,null,null,null,null,null,null,null,null,null,null,null,"2011-11-16","Luong","Cs4",4]

{"sheet":"SP(2)","index":50,"n_rows":18,"n_cols":7,"rows_kept":18,"cut":false,"hidden":false,"merged":[]}
["SalesRep","Customer","Sales",null,"Count with COUNTIFS",{"$f":"COUNTIFS($A$2:$A$16,F3,B2:B16,F4)","v":4},{"$f":"TextFormula","v":"=COUNTIFS($A$2:$A$16,F3,B2:B16,F4)"}]
["Pham","ET",152,null,"Count with SUMPRODUCT",{"$f":"SUMPRODUCT(--(A2:A16=F3),--(B2:B16=F4))","v":4},{"$f":"TextFormula","v":"=SUMPRODUCT(--(A2:A16=F3),--(B2:B16=F4))"}]
["Gault","PCC",220,null,"SalesRep Criteria 1","Gault"]
["Gault","ET",132,null,"Customer Criteria 2","PCC"]
["Pham","ET",154]
["Pham","PSA",1449,null,"Sum with SUMIFS",null,{"$f":"TextFormula","v":""}]
["Pham","PCC",783,null,"Sum with SUMPRODUCT",{"$f":"SUMPRODUCT(--(A2:A16=F8),--(B2:B16=F9),C2:C16)","v":1572},{"$f":"TextFormula","v":"=SUMPRODUCT(--(A2:A16=F8),--(B2:B16=F9),C2:C16)"}]
["Gault","ET",594,null,"SalesRep Criteria 1","Gault"]
["Gault","ET",352,null,"Customer Criteria 2","PCC"]
["Pham","PCC",299]
["Gault","PCC",924,null,null,{"$f":"COUNTIFS(A2:A16,F3,B2:B16,F4)","v":4},{"$f":"TextFormula","v":"=COUNTIFS(A2:A16,F3,B2:B16,F4)"}]
["Gault","PSA",459,null,null,{"$f":"SUMPRODUCT(--(A2:A16=F3),--(B2:B16=F4))","v":4},{"$f":"TextFormula","v":"=SUMPRODUCT(--(A2:A16=F3),--(B2:B16=F4))"}]
["Gault","PCC",230,null,null,{"$f":"SUMPRODUCT((A2:A16=F3)*(B2:B16=F4))","v":4},{"$f":"TextFormula","v":"=SUMPRODUCT((A2:A16=F3)*(B2:B16=F4))"}]
["Pham","PCC",675,null,null,{"$f":"SUMPRODUCT((A2:A16=F3)*1,(B2:B16=F4)*1)","v":4},{"$f":"TextFormula","v":"=SUMPRODUCT((A2:A16=F3)*1,(B2:B16=F4)*1)"}]
["Gault","PCC",198,null,null,{"$f":"SUMPRODUCT((A2:A16=F3)^1,(B2:B16=F4)^1)","v":4},{"$f":"TextFormula","v":"=SUMPRODUCT((A2:A16=F3)^1,(B2:B16=F4)^1)"}]
["Gault","AST",459,null,null,{"$f":"SUM((A2:A16=F3)*(B2:B16=F4))","v":4},{"$f":"\"{\"&TextFormula&\"}\"","v":"{=SUM((A2:A16=F3)*(B2:B16=F4))}"}]
[null,null,null,null,null,{"$f":"SUMPRODUCT((A2:A16=F3)+0,(B2:B16=F4)+0)","v":4},{"$f":"TextFormula","v":"=SUMPRODUCT((A2:A16=F3)+0,(B2:B16=F4)+0)"}]
[null,null,null,null,null,null,{"$f":"TextFormula","v":""}]

{"sheet":"IF(1)","index":51,"n_rows":4,"n_cols":11,"rows_kept":4,"cut":false,"hidden":false,"merged":[]}
["Sales","Expenses","Profit Hurdle","Question","Pass Hurdle = Bonus","Formula from E column"]
[500,700,100,{"$f":"\"Is \"&A2&\" -\"&B2&\" > \"&C2&\" TRUE or FALSE?\"","v":"Is 500 -700 > 100 TRUE or FALSE?"},{"$f":"A2-B2>C2","v":false},{"$f":"\"Logical Formula:\"&CHAR(10)&CHAR(10)&TextFormula","v":"Logical Formula:\n\n=A2-B2>C2"},null,"value_if_true","value_if_false",null,{"$f":"A2&\" - \"&B2&\" > \"&C2","v":"500 - 700 > 100"}]
[{"$f":"A2","v":500},700,100,{"$f":"\"Is \"&A3&\" -\"&B3&\" > \"&C3&\", \"&H3&\" or \"&I3&\"?\"","v":"Is 500 -700 > 100, Yes or No?"},{"$f":"IF(A3-B3>C3,H3,I3)","v":"No"},{"$f":"\"IF function that puts one of two words in a cell:\"&CHAR(10)&CHAR(10)&TextFormula","v":"IF function that puts one of two words in a cell:\n\n=IF(A3-B3>C3,H3,I3)"},null,"Yes","No",null,{"$f":"A2-B2&\" > \"&C2","v":"-200 > 100"}]
[500,700,100,{"$f":"\"Is \"&A4&\" -\"&B4&\" > \"&C4&\", \"&H4&\" or \"&I4&\"?\"","v":"Is 500 -700 > 100, 10 or 0?"},{"$f":"IF(A4-B4>C4,H4,I4)","v":0},{"$f":"\"IF function that puts one of two numbers in a cell:\"&CHAR(10)&CHAR(10)&TextFormula","v":"IF function that puts one of two numbers in a cell:\n\n=IF(A4-B4>C4,H4,I4)"},null,10,0,null,{"$f":"A2-B2>C2","v":false}]

{"sheet":"IF(2)","index":52,"n_rows":10,"n_cols":5,"rows_kept":10,"cut":false,"hidden":false,"merged":[]}
[null,null,"Logical Formula or\nlogical_test","IF used to put 1 of 2 words in cell","IF used to put 1 of 2 numbers in cell"]
["Employee","Sales","Bonus:\nTRUE or FALSE","Bonus:\n\"Yes\" or \"No\"","Bonus Amount"]
["Rod Barbaria",20382,{"$f":"B3>=B$9","v":false},{"$f":"IF(B3>=B$9,\"Yes\",\"No\")","v":"No"},{"$f":"IF(B3>=B$9,B$10,0)","v":0}]
["Elinore Cromedy",19504,{"$f":"B4>=B$9","v":false},{"$f":"IF(B4>=B$9,\"Yes\",\"No\")","v":"No"},{"$f":"IF(B4>=B$9,B$10,0)","v":0}]
["Twanda Spruce",21579,true,"Yes",500]
["Darius Raffety",12117,false,"No",0]
["Frida Vickerson",26081,true,"Yes",500]
[]
["Bonus Hurdle",21000]
["Bonus Amount If Hurdle Equaled or Passed",500]

{"sheet":"IF(3)","index":53,"n_rows":16,"n_cols":5,"rows_kept":16,"cut":false,"hidden":false,"merged":[]}
["Schedule Of Accounts Receivable",null,null,"Controling AR Account"]
["Name","Amount",null,"DR","CR"]
["Name1",50,null,1682]
["Name2",600,null,154]
["Name3",845,null,{"$f":"SUM(D3:D4)","v":1836}]
["Name4",32]
["Name5",155]
["Name6",45]
["Name7",87]
["Name8",22]
["Total AR",{"$f":"SUM(B3:B10)","v":1836}]
[]
["Check to See If In Balance",{"$f":"IF(B11=D5,\"In Balance\",\"Not In Balance\")","v":"In Balance"}]
[]
[]
["IF function using = comparative operator and cell reference to put one of two \"text strings\" in a cell"]

{"sheet":"IF(4)","index":54,"n_rows":67,"n_cols":5,"rows_kept":67,"cut":false,"hidden":false,"merged":[]}
["Sale","Product","IN/OUT House",null,"Out"]
[10,"Pro1",{"$f":"IF(OR(B2=E$2,B2=E$3),\"Out\",\"In\")","v":"In"},null,"Pro5"]
[19,"Pro5","Out",null,"Pro6"]
[15,"Pro6","Out"]
[5,"Pro1","In"]
[3,"Pro6","Out"]
[18,"Pro2","In"]
[5,"Pro2","In"]
[8,"Pro5","Out"]
[13,"Pro1","In"]
[16,"Pro2","In"]
[5,"Pro4","In"]
[6,"Pro6","Out"]
[10,"Pro6","Out"]
[19,"Pro1","In"]
[9,"Pro2","In"]
[5,"Pro3","In"]
[4,"Pro3","In"]
[3,"Pro3","In"]
[14,"Pro4","In"]
[17,"Pro6","Out"]
[14,"Pro1","In"]
[4,"Pro5","Out"]
[13,"Pro4","In"]
[14,"Pro2","In"]
[19,"Pro4","In"]
[10,"Pro3","In"]
[14,"Pro5","Out"]
[17,"Pro4","In"]
[1,"Pro3","In"]
[4,"Pro6","Out"]
[9,"Pro5","Out"]
[11,"Pro1","In"]
[9,"Pro3",{"$f":"IF(OR(B34=E$2,B34=E$3),\"Out\",\"In\")","v":"In"}]
[4,"Pro2","In"]
[19,"Pro6","Out"]
[18,"Pro2","In"]
[14,"Pro6","Out"]
[1,"Pro4","In"]
[17,"Pro5","Out"]
[11,"Pro6","Out"]
[12,"Pro1","In"]
[2,"Pro2","In"]
[1,"Pro4","In"]
[1,"Pro1","In"]
[13,"Pro6","Out"]
[14,"Pro6","Out"]
[9,"Pro2","In"]
[8,"Pro6","Out"]
[12,"Pro3","In"]
[11,"Pro6","Out"]
[1,"Pro6","Out"]
[14,"Pro4","In"]
[11,"Pro3","In"]
[17,"Pro6","Out"]
[1,"Pro5","Out"]
[11,"Pro5","Out"]
[15,"Pro3","In"]
[12,"Pro4","In"]
[15,"Pro3","In"]
[2,"Pro4","In"]
[13,"Pro6","Out"]
[4,"Pro5","Out"]
[15,"Pro1","In"]
[14,"Pro4","In"]
[3,"Pro5",{"$f":"IF(OR(B66=E$2,B66=E$3),\"Out\",\"In\")","v":"Out"}]
[12,"Pro1","In"]

{"sheet":"IF(5)","index":55,"n_rows":13,"n_cols":7,"rows_kept":13,"cut":false,"hidden":false,"merged":[]}
["Customer Credit Analysis"]
["Customer","Net Worth","Ave Yearly Sales","Credit Score","Pass Hurdles?","Extend Credit? *All Tests = TRUE"]
["PCC",100000,1500000,4,{"$f":"AND(B3>=B$11,C3>=B$12,D3>B$13)","v":true},{"$f":"IF(AND(B3>=B$11,C3>=B$12,D3>B$13),\"Extend Credit\",\"DON'T Extend Credit\")","v":"Extend Credit"},{"$f":"OR(AND(B3>=E$11,C3>=E$12),D3>=E$13)","v":true}]
["WFMI",1000000,5000000,2,{"$f":"AND(B4>=B$11,C4>=B$12,D4>B$13)","v":false},{"$f":"IF(AND(B4>=B$11,C4>=B$12,D4>B$13),\"Extend Credit\",\"DON'T Extend Credit\")","v":"DON'T Extend Credit"},{"$f":"OR(AND(B4>=E$11,C4>=E$12),D4>=E$13)","v":true}]
["FM",250000,1250000,3.5,true,"Extend Credit",true]
["AMZ",6000000,35000000,3.5,true,"Extend Credit",true]
["EIF",95000,52000,5,false,"DON'T Extend Credit",true]
["ME",125000,95000,5,false,"DON'T Extend Credit",true]
[]
["Hurdles",null,null,"Hurdles"]
["Net Worth",100000,null,"Net Worth",100000]
["Ave Yearly Sales",500000,null,"Ave Yearly Sales",500000]
["Credit Score",3,null,"Credit Score",4]

{"sheet":"IF(6)","index":56,"n_rows":11,"n_cols":5,"rows_kept":11,"cut":false,"hidden":false,"merged":[]}
["Name","Sales","Comission",null,"Hurdle"]
["Cleo Gajate",5018,{"$f":"IF(B2>=E$2,E$4,0)*B2","v":0},null,7000]
["Lane Haruta",5651,0,null,"Com Rate"]
["Carlo Warrenfeltz",7000,210,null,0.03]
["Dick Thackaberry",9623,288.69]
["Lurlene Caira",9008,270.24]
["Cleotilde Metting",5220,0]
["Porsche Artola",5417,0]
["Aurelio Broody",6436,0]
["Win Aydt",8407,252.20999999999998]
["Collin Mesteth",5815,0]

{"sheet":"IF(7)","index":57,"n_rows":33,"n_cols":7,"rows_kept":33,"cut":false,"hidden":false,"merged":[]}
["Rule For Commission","Hurdle","Com. Rate"]
[{"$f":"DOLLAR(B2,0)&\" <= \"&B$6&\" < \"&DOLLAR(B3,0)","v":"$0 <= Sales < $5,000"},0,0]
[{"$f":"DOLLAR(B3,0)&\" <= \"&B$6&\" < \"&DOLLAR(B4,0)","v":"$5,000 <= Sales < $7,000"},5000,0.02]
[{"$f":"B6&\" >= \"&DOLLAR(B4,0)","v":"Sales >= $7,000"},7000,0.03]
[]
["Name","Sales","Comission"]
["Mike Tello",5018,{"$f":"IF(B7>=B$4,C$4,IF(B7>=B$3,C$3,C$2))*B7","v":100.36},null," \u001b We need 0.02 because $5,000 <= $5,018 < $7,000",null,"One of two items in cell or formula: 1 IF function in formula"]
["Samuel George",4125,{"$f":"IF(B8>=B$4,C$4,IF(B8>=B$3,C$3,C$2))*B8","v":0},null," \u001b We need 0.00 because $0 <= $4,125 < $5,000",null,"One of three items in cell or formula: 2 IF functions in formula"]
["Jeff Pannell",7000,210,null," \u001b We need 0.03 because $7,000 >= $7,000",null,"One of four items in cell or formula: 3 IF functions in formula"]
["Bruce Urrutia",3012,0,null," \u001b We need 0.00 because $0 <= $3,012 < $5,000",null,"Etc…"]
["Keith Reno",9558,286.74,null," \u001b We need 0.03 because $9,558 >= $7,000"]
[]
[]
[]
[null,null,null,null,null,null,{"$f":"\" \"&CHAR(27)&\" We need \"&VLOOKUP(B7,$B$2:$C$4,2)&\" because\"&CHAR(10)&SUBSTITUTE(LOOKUP(B7,$B$2:$B$4,$A$2:$A$4),\"Sales\",DOLLAR(B7,0))","v":" \u001b We need 0.02 because\n$5,000 <= $5,018 < $7,000"}]
[null,null,null,null,null,null,{"$f":"\" \"&CHAR(27)&\" We need \"&VLOOKUP(B8,$B$2:$C$4,2)&\" because\"&CHAR(10)&SUBSTITUTE(LOOKUP(B8,$B$2:$B$4,$A$2:$A$4),\"Sales\",DOLLAR(B8,0))","v":" \u001b We need 0 because\n$0 <= $4,125 < $5,000"}]
[null,null,null,null,null,null," \u001b We need 0.03 because\n$7,000 >= $7,000"]
[null,null,null,null,null,null," \u001b We need 0 because\n$0 <= $3,012 < $5,000"]
[null,null,null,null,null,null," \u001b We need 0.03 because\n$9,558 >= $7,000"]
["Rule For Commission","Hurdle","Com. Rate"]
[{"$f":"DOLLAR(B21,0)&\" <= \"&B$6&\" < \"&DOLLAR(B22,0)","v":"$0 <= Sales < $2,000"},0,0]
[{"$f":"DOLLAR(B22,0)&\" <= \"&B$6&\" < \"&DOLLAR(B23,0)","v":"$2,000 <= Sales < $3,000"},2000,0.01]
["$3,000 <= Sales < $4,000",3000,0.02]
["$4,000 <= Sales < $5,000",4000,0.03]
["$5,000 <= Sales < $7,000",5000,0.04]
[{"$f":"B28&\" >= \"&DOLLAR(B26,0)","v":"Sales >= $7,000"},7000,0.05]
[]
["Name","Sales","Comission"]
["Mike Tello",5018,{"$f":"IF(B29>=B$26,C$26,IF(B29>=B$25,C$25,IF(B29>=B$24,C$24,IF(B29>=B$23,C$23,IF(B29>=B$22,C$22,C$21)))))*B29","v":200.72},null,{"$f":"VLOOKUP(B29,$B$21:$C$26,2)*B29","v":200.72}]
["Samuel George",1000,{"$f":"IF(B30>=B$26,C$26,IF(B30>=B$25,C$25,IF(B30>=B$24,C$24,IF(B30>=B$23,C$23,IF(B30>=B$22,C$22,C$21)))))*B30","v":0},null,{"$f":"VLOOKUP(B30,$B$21:$C$26,2)*B30","v":0}]
["Jeff Pannell",7000,350,null,350]
["Bruce Urrutia",3012,60.24,null,60.24]
["Keith Reno",9558,477.90000000000003,null,477.90000000000003]

{"sheet":"VLOOKUP(1)","index":58,"n_rows":106,"n_cols":20,"rows_kept":106,"cut":false,"hidden":false,"merged":[[1,14,5,14]]}
["Date","Product","Region","SalesRep","Customer","Units","COGS","Sales","Sales Category",null,"Math Categories to help understand VLOOKUP","Category Lower Limit","Sales Category",null,null,null,0,{"$f":"Q2","v":100},null,{"$f":"MIN(H2:H106)","v":132}]
["2011-01-26","Bellen","West","Pham","FRED",7,70,154,{"$f":"VLOOKUP(H2,$L$2:$M$6,2)","v":"OK"},null,{"$f":"Q1&\" <= Sales < \"&R1","v":"0 <= Sales < 100"},{"$f":"Q1","v":0},"Subpar",null,"Lookup Table",null,100,{"$f":"Q3","v":500}]
["2011-01-10","Bellen","MidWest","Gault","FM",61,610,555,{"$f":"VLOOKUP(H3,$L$2:$M$6,2)","v":"Good"},null,{"$f":"Q2&\" <= Sales < \"&R2","v":"100 <= Sales < 500"},{"$f":"Q2","v":100},"OK",null,null,null,500,750]
["2011-01-03","Sunshine","South","Sioux","DDH",6,48,800,"Great",null,{"$f":"Q3&\" <= Sales < \"&R3","v":"500 <= Sales < 750"},{"$f":"Q3","v":500},"Good",null,null,null,750,1000]
["2011-01-07","Sunset","West","Pham","T",61,564.25,1281,"Exceptional",null,{"$f":"Q4&\" <= Sales < \"&R4","v":"750 <= Sales < 1000"},{"$f":"Q4","v":750},"Great",null,null,null,1000]
["2011-01-18","Sunshine","West","Sioux","AST",8,64,152,"OK",null,{"$f":"\"Sales >= \"&Q5","v":"Sales >= 1000"},{"$f":"Q5","v":1000},"Exceptional"]
["2011-01-20","Carlota","East","Chin","ET",59,649,1357,"Exceptional"]
["2011-01-26","Bellen","MidWest","Gault","PSA",21,210,462,"OK"]
["2011-01-07","Carlota","MidWest","Franks","HHH",12,132,276,"OK"]
["2011-01-05","Carlota","West","Franks","ITTW",60,660,1380,"Exceptional"]
["2011-01-17","Quad","East","Franks","HII",62,899,1674,"Exceptional"]
["2011-01-28","Sunshine","South","Smith","FRED",51,408,969,"Great"]
["2011-01-17","Quad","East","Gault","SFWK",43,623.5,1161,"Exceptional"]
["2011-01-16","Bellen","MidWest","Sioux","YTR",56,560,1232,"Exceptional"]
["2011-01-15","Sunshine","MidWest","Chin","YTR",11,88,209,"OK"]
["2011-01-12","Bellen","South","Chin","WT",7,70,154,"OK"]
["2011-01-03","Sunset","South","Pham","WSD",23,212.75,483,"OK"]
["2011-01-22","Carlota","South","Smith","KBTB",29,319,667,"Good"]
["2011-01-21","Quad","West","Gault","ITW",56,812,1512,"Exceptional"]
["2011-01-13","Sunshine","MidWest","Pham","PSA",33,264,627,"Good"]
["2011-01-10","Quad","West","Smith","KBTB",65,942.5,1755,"Exceptional"]
["2011-01-08","Quad","West","Chin","HII",16,232,432,"OK"]
["2011-01-06","Quad","West","Sioux","PCC",64,928,1728,"Exceptional"]
["2011-01-26","Sunset","South","Sioux","DFGH",44,407,924,"Great"]
["2011-01-21","Sunshine","MidWest","Smith","QT",64,512,1216,"Exceptional"]
["2011-01-07","Bellen","West","Smith","T",27,270,594,"Good"]
["2011-01-20","Bellen","East","Gault","PSA",10,100,220,"OK"]
["2011-01-09","Bellen","South","Chin","WSD",26,260,572,"Good"]
["2011-01-07","Sunset","MidWest","Smith","PCC",22,203.5,462,"OK"]
["2011-01-29","Bellen","East","Chin","AST",50,500,1100,"Exceptional"]
["2011-01-30","Sunshine","South","Sioux","TTT",23,184,437,"OK"]
["2011-01-30","Sunshine","West","Gault","DFR",49,392,931,"Great"]
["2011-01-28","Carlota","West","Smith","LOP",15,165,345,"OK"]
["2011-01-01","Quad","East","Sioux","AA",16,232,432,"OK"]
["2011-01-30","Quad","South","Sioux","TTT",25,362.5,675,"Good"]
["2011-01-16","Carlota","South","Smith","QT",31,341,713,"Good"]
["2011-01-24","Quad","West","Gault","HII",63,913.5,1701,"Exceptional"]
["2011-01-25","Sunshine","MidWest","Franks","JAQ",21,168,399,"OK"]
["2011-01-21","Sunshine","MidWest","Pham","DFR",23,184,437,"OK"]
["2011-01-18","Bellen","East","Pham","DFR",59,590,1298,"Exceptional"]
["2011-01-13","Bellen","MidWest","Pham","PLOT",57,570,1254,"Exceptional"]
["2011-01-21","Quad","East","Chin","FM",58,841,1566,"Exceptional"]
["2011-01-09","Sunshine","East","Smith","PCC",42,336,798,"Great"]
["2011-01-09","Bellen","South","Sioux","QT",15,150,330,"OK"]
["2011-01-27","Carlota","West","Gault","QT",10,110,230,"OK"]
["2011-01-06","Carlota","West","Sioux","KPSA",18,198,414,"OK"]
["2011-01-10","Sunset","East","Gault","TRU",27,249.75,567,"Good"]
["2011-01-21","Sunset","South","Pham","HHH",13,120.25,273,"OK"]
["2011-01-22","Bellen","West","Sioux","YTR",35,350,770,"Great"]
["2011-01-03","Sunshine","East","Pham","FM",38,304,722,"Good"]
["2011-01-10","Carlota","East","Pham","AA",63,693,1449,"Exceptional"]
["2011-01-22","Quad","South","Franks","FM",29,420.5,783,"Great"]
["2011-01-28","Sunset","East","Smith","ZAT",36,333,756,"Great"]
["2011-01-10","Quad","East","Smith","DFR",17,246.5,459,"OK"]
["2011-01-17","Bellen","MidWest","Smith","PCC",16,160,352,"OK"]
["2011-01-20","Sunshine","West","Sioux","YTR",58,464,1102,"Exceptional"]
["2011-01-18","Bellen","East","Franks","DFGH",20,200,440,"OK"]
["2011-01-13","Bellen","MidWest","Pham","PSA",40,400,880,"Great"]
["2011-01-14","Carlota","East","Franks","JAQ",34,374,782,"Great"]
["2011-01-17","Quad","MidWest","Chin","EPP",61,884.5,1647,"Exceptional"]
["2011-01-12","Sunset","MidWest","Gault","ITW",19,175.75,399,"OK"]
["2011-01-06","Sunshine","South","Smith","QT",40,320,760,"Great"]
["2011-01-19","Bellen","South","Sioux","T",35,350,770,"Great"]
["2011-01-26","Bellen","East","Chin","KPSA",17,170,374,"OK"]
["2011-01-05","Sunset","South","Pham","TTT",57,527.25,1197,"Exceptional"]
["2011-01-28","Carlota","South","Franks","MNGD",46,506,1058,"Exceptional"]
["2011-01-10","Sunshine","South","Chin","TRU",30,240,570,{"$f":"VLOOKUP(H67,$L$2:$M$6,2)","v":"Good"}]
["2011-01-07","Sunset","West","Pham","WT",53,490.25,1113,"Exceptional"]
["2011-01-28","Quad","MidWest","Smith","YTR",42,609,1134,"Exceptional"]
["2011-01-02","Quad","West","Pham","AST",30,435,810,"Great"]
["2011-01-15","Sunset","East","Gault","AST",63,582.75,1323,"Exceptional"]
["2011-01-10","Sunset","East","Smith","MBG",17,157.25,357,"OK"]
["2011-01-23","Quad","East","Pham","WT",22,319,594,"Good"]
["2011-01-06","Sunshine","East","Franks","PSA",54,432,1026,"Exceptional"]
["2011-01-18","Carlota","South","Smith","YTR",53,583,1219,"Exceptional"]
["2011-01-11","Quad","East","Smith","BBT",49,710.5,1323,"Exceptional"]
["2011-01-21","Bellen","South","Smith","TRU",11,110,242,"OK"]
["2011-01-18","Sunset","East","Gault","MNGD",12,111,252,"OK"]
["2011-01-10","Sunshine","MidWest","Smith","TTT",8,64,152,"OK"]
["2011-01-17","Sunshine","MidWest","Franks","HHH",59,472,1121,"Exceptional"]
["2011-01-23","Sunshine","South","Chin","T",49,392,931,"Great"]
["2011-01-23","Quad","East","Franks","PCC",44,638,1188,"Exceptional"]
["2011-01-28","Sunset","West","Chin","FM",62,573.5,1302,"Exceptional"]
["2011-01-29","Quad","MidWest","Gault","PLOT",10,145,270,"OK"]
["2011-01-13","Carlota","South","Smith","FM",52,572,1196,"Exceptional"]
["2011-01-18","Quad","MidWest","Smith","PLOT",17,246.5,459,"OK"]
["2011-01-04","Sunset","MidWest","Sioux","BBT",29,268.25,609,"Good"]
["2011-01-28","Bellen","South","Sioux","QT",25,250,550,"Good"]
["2011-01-11","Quad","East","Franks","ITW",14,203,378,"OK"]
["2011-01-22","Bellen","West","Pham","AST",53,530,1166,"Exceptional"]
["2011-01-10","Sunset","South","Sioux","MBG",47,434.75,987,"Great"]
["2011-01-24","Carlota","MidWest","Franks","BBT",13,143,299,"OK"]
["2011-01-05","Sunshine","West","Franks","ET",12,96,228,"OK"]
["2011-01-03","Carlota","MidWest","Chin","FM",20,220,460,"OK"]
["2011-01-09","Bellen","East","Pham","EPP",40,400,880,"Great"]
["2011-01-23","Bellen","East","Gault","DFGH",9,90,198,"OK"]
["2011-01-09","Carlota","East","Franks","WSD",38,418,874,"Great"]
["2011-01-02","Bellen","South","Gault","KBTB",24,240,528,"Good"]
["2011-01-17","Quad","West","Chin","TTT",10,145,270,"OK"]
["2011-01-28","Quad","South","Gault","KBTB",56,812,1512,"Exceptional"]
["2011-01-18","Sunshine","MidWest","Chin","LOP",62,496,1178,"Exceptional"]
["2011-01-28","Quad","South","Franks","YTR",44,638,1188,"Exceptional"]
["2011-01-17","Carlota","East","Sioux","GRR",39,429,897,"Great"]
["2011-01-18","Sunshine","East","Franks","AA",24,192,456,"OK"]
["2011-01-22","Bellen","West","Smith","WT",6,60,132,"OK"]
["2011-01-02","Bellen","West","Pham","SFWK",19,190,418,"OK"]

{"sheet":"VLOOKUP(2)","index":59,"n_rows":15,"n_cols":4,"rows_kept":15,"cut":false,"hidden":false,"merged":[]}
["VLOOKUP to calculate Commission Earned"]
["Rule For Commission","Hurdle","Com. Rate"]
[{"$f":"DOLLAR(B3,0)&\" <= Sales < \"&DOLLAR(B4,0)","v":"$0 <= Sales < $2,000"},0,0]
[{"$f":"DOLLAR(B4,0)&\" <= Sales < \"&DOLLAR(B5,0)","v":"$2,000 <= Sales < $3,000"},2000,0.01]
["$3,000 <= Sales < $4,000",3000,0.02]
["$4,000 <= Sales < $5,000",4000,0.03]
["$5,000 <= Sales < $7,000",5000,0.04]
[{"$f":"\"Sales >= \"&DOLLAR(B8,0)","v":"Sales >= $7,000"},7000,0.05]
[]
["Name","Sales","Comission","Comission"]
["Mike Tello",5018,{"$f":"VLOOKUP(B11,$B$3:$C$8,2)*B11","v":200.72},{"$f":"IF(B11>=B$8,C$8,IF(B11>=B$7,C$7,IF(B11>=B$6,C$6,IF(B11>=B$5,C$5,IF(B11>=B$4,C$4,C$3)))))*B11","v":200.72}]
["Samuel George",1000,0,{"$f":"IF(B12>=B$8,C$8,IF(B12>=B$7,C$7,IF(B12>=B$6,C$6,IF(B12>=B$5,C$5,IF(B12>=B$4,C$4,C$3)))))*B12","v":0}]
["Jeff Pannell",7000,350,{"$f":"IF(B13>=B$8,C$8,IF(B13>=B$7,C$7,IF(B13>=B$6,C$6,IF(B13>=B$5,C$5,IF(B13>=B$4,C$4,C$3)))))*B13","v":350}]
["Bruce Urrutia",3012,60.24,{"$f":"IF(B14>=B$8,C$8,IF(B14>=B$7,C$7,IF(B14>=B$6,C$6,IF(B14>=B$5,C$5,IF(B14>=B$4,C$4,C$3)))))*B14","v":60.24}]
["Keith Reno",9558,477.90000000000003,{"$f":"IF(B15>=B$8,C$8,IF(B15>=B$7,C$7,IF(B15>=B$6,C$6,IF(B15>=B$5,C$5,IF(B15>=B$4,C$4,C$3)))))*B15","v":477.90000000000003}]

{"sheet":"V(3)","index":60,"n_rows":16,"n_cols":4,"rows_kept":16,"cut":false,"hidden":false,"merged":[]}
["VLOOKUP to assign a grade"]
["Rule For Grade","Score",null,"Grade"]
[{"$f":"B3&\" <= Sales < \"&B4","v":"0 <= Sales < 90"},0,"Fail","F"]
[{"$f":"B4&\" <= Sales < \"&B5","v":"90 <= Sales < 110"},90,"Below Ave.","D"]
["110 <= Sales < 130",110,"Ave.","C"]
["130 <= Sales < 150",130,"Above Ave.","B"]
["150 <= Sales < 160",150,"High Ach.","A"]
[{"$f":"\"Sales >= \"&B8","v":"Sales >= 160"},160,"Top","A+"]
[]
["Name","Sales","Grade"]
["Leah Gamboa",118,{"$f":"VLOOKUP(B11,$B$3:$D$8,3)","v":"C"}]
["Patrick Dahlberg",88,{"$f":"VLOOKUP(B12,$B$3:$D$8,3)","v":"F"}]
["Kristen Sharpe",147,"B"]
["Sean Mullens",53,"F"]
["Gina Coronado",143,"B"]
["Daisy Shepherd",168,"A+"]

{"sheet":"V(4)","index":61,"n_rows":23,"n_cols":6,"rows_kept":23,"cut":false,"hidden":false,"merged":[]}
["VLOOKUP to look up product information for invoice"]
["ProductID","Name","Description","Price","Cost"]
["Pro-650","Bellen","20 meters - 2",25,12]
["Pro-643","Carlota","20 meters - 3",27,14.5]
["Pro-187","Sunshine","30 meters",22,11]
["Pro-901","Sunbell","35 meters",24,13]
["Pro-711","Sunset","45 meters",23,12]
[]
[{"$f":"A2","v":"ProductID"},{"$f":"B2","v":"Name"},{"$f":"D2","v":"Price"},"Units","Total"]
["Pro-901",{"$f":"VLOOKUP($A10,$A$3:$E$7,2,0)","v":"Sunbell"},{"$f":"VLOOKUP($A10,$A$3:$E$7,4,0)","v":24},5,{"$f":"D10*C10","v":120}]
[]
[]
["VLOOKUP & MATCH to look up product information for invoice"]
[{"$f":"MATCH(A15,$A$15:$E$15,0)","v":1},2,3,4,5," <<== Relative Position (or Ordinal Position) of Field Names"]
["ProductID","Name","Description","Price","Cost"," <<== Field Names"]
["Pro-650","Bellen","20 meters - 2",25,12]
["Pro-643","Carlota","20 meters - 3",27,14.5]
["Pro-187","Sunshine","30 meters",22,11]
["Pro-901","Sunbell","35 meters",24,13]
["Pro-711","Sunset","45 meters",23,12]
[]
[{"$f":"A15","v":"ProductID"},{"$f":"B15","v":"Name"},"Price","Units","Total"]
["Pro-901",{"$f":"VLOOKUP($A23,$A$16:$E$20,MATCH(B22,$A$15:$E$15,0),0)","v":"Sunbell"},{"$f":"VLOOKUP($A23,$A$16:$E$20,MATCH(C22,$A$15:$E$15,0),0)","v":24},2,{"$f":"C23*D23","v":48}]

{"sheet":"V(5)","index":62,"n_rows":3,"n_cols":5,"rows_kept":3,"cut":false,"hidden":false,"merged":[]}
["Data Validation, VLOOKUP & MATCH to lookup customer information when data is on different sheet."]
["Account#","Fname","Lname","Balance","E-mail"]
["1258-ViHo-1321",{"$f":"VLOOKUP($A3,CustomerDataV,MATCH(B2,FieldM,0),0)","v":"Victor"},{"$f":"VLOOKUP($A3,CustomerDataV,MATCH(C2,FieldM,0),0)","v":"Horvath"},{"$f":"VLOOKUP($A3,CustomerDataV,MATCH(D2,FieldM,0),0)","v":3676.61},{"$f":"VLOOKUP($A3,CustomerDataV,MATCH(E2,FieldM,0),0)","v":"ViHo@gmail.com"}]

{"sheet":"CTable","index":63,"n_rows":37,"n_cols":22,"rows_kept":37,"cut":false,"hidden":false,"merged":[]}
[]
[null,null,{"$f":"MATCH(C3,$C$3:$G$3,0)","v":1},{"$f":"MATCH(D3,$C$3:$G$3,0)","v":2},{"$f":"MATCH(E3,$C$3:$G$3,0)","v":3},{"$f":"MATCH(F3,$C$3:$G$3,0)","v":4},{"$f":"MATCH(G3,$C$3:$G$3,0)","v":5}]
[null,null,"Account#","Fname","Lname","Balance","E-mail",null,null,null,null,null,null,null,null,null,null,{"$f":"\"1258-\"&LEFT(S3,2)&LEFT(T3,2)&\"-\"&INT(RAND()*8000+1001)","v":"1258-DaDo-8947"},"Danielle","Dowell",{"$f":"1000+ROUND(RAND()*8000,2)","v":8843.49},{"$f":"LEFT(S3,2)&LEFT(T3,2)&\"@gmail.com\"","v":"DaDo@gmail.com"}]
[null,null,"1258-DaDo-7418","Danielle","Dowell",4191.5599999999995,"DaDo@gmail.com"]
[null,null,"1258-ViHo-1321","Victor","Horvath",3676.61,"ViHo@gmail.com"]
[null,null,"1258-HoSh-4750","Howard","Shah",7350.44,"HoSh@gmail.com"]
[null,null,"1258-MaKo-6449","Mark","Koehler",1367.3600000000001,"MaKo@gmail.com"]
[null,null,"1258-DeSt-7389","Debbie","Stephen",3196.24,"DeSt@gmail.com"]
[null,null,"1258-KuWe-1748","Kurt","Weckerly",7052.93,"KuWe@gmail.com"]
[null,null,"1258-GuSu-6102","Guy","Sur",1445.17,"GuSu@gmail.com"]
[null,null,"1258-OdLa-8740","Odessa","Lauria",7812.45,"OdLa@gmail.com"]
[null,null,"1258-ElRh-4436","Elinor","Rhames",6225.46,"ElRh@gmail.com"]
[null,null,"1258-NeSu-3274","Neva","Sumler",4749.54,"NeSu@gmail.com"]
[null,null,"1258-TyBr-8211","Tyrone","Brite",6943.25,"TyBr@gmail.com"]
[null,null,"1258-JaSe-8984","Javier","Segers",8101.48,"JaSe@gmail.com"]
[null,null,"1258-ClWi-5671","Clare","Wimbush",6647.43,"ClWi@gmail.com"]
[null,null,"1258-HiHi-3444","Hillary","Hillen",5095.71,"HiHi@gmail.com"]
[null,null,"1258-MaZo-8107","Mathew","Zobel",6533.32,"MaZo@gmail.com"]
[null,null,"1258-JeSo-6445","Jeanie","Solley",4790.2800000000007,"JeSo@gmail.com"]
[null,null,"1258-MaLe-7052","Marcie","Levis",3611.78,"MaLe@gmail.com"]
[null,null,"1258-ZeSe-6140","Zelma","Semones",1844.15,"ZeSe@gmail.com"]
[null,null,"1258-DaCa-8640","Darryl","Canela",8910.2000000000007,"DaCa@gmail.com"]
[null,null,"1258-JuGo-1604","Julio","Gondek",7341.38,"JuGo@gmail.com"]
[null,null,"1258-LoSt-8418","Louisa","Strecker",7140.8,"LoSt@gmail.com"]
[null,null,"1258-JaCl-8766","Javier","Claflin",5994.36,"JaCl@gmail.com"]
[null,null,"1258-AnEv-6862","Annabelle","Everest",1556.44,"AnEv@gmail.com"]
[null,null,"1258-ElMe-1003","Elinor","Meinke",6420.78,"ElMe@gmail.com"]
[null,null,"1258-MaOp-8230","Max","Opp",1989.48,"MaOp@gmail.com"]
[null,null,"1258-TeOs-1454","Ted","Oscar",8832.36,"TeOs@gmail.com"]
[null,null,"1258-LoDe-6705","Lonnie","Debus",1623.9299999999998,"LoDe@gmail.com"]
[null,null,"1258-TaWa-4457","Tania","Warburton",7312.21,"TaWa@gmail.com"]
[null,null,"1258-HuPa-4126","Hugh","Patron",7792.32,"HuPa@gmail.com"]
[null,null,"1258-KeCa-5697","Kelly","Carn",4898.3999999999996,"KeCa@gmail.com"]
[null,null,"1258-JaEp-1979","Jamie","Epperly",1810.45,"JaEp@gmail.com"]
[null,null,"1258-ClMe-7851","Clinton","Mellen",2813.8199999999997,"ClMe@gmail.com"]
[null,null,"1258-JeKa-3017","Jessie","Kappler",1135.83,"JeKa@gmail.com"]
[null,null,"1258-JeKa-3825","Jessie","Kappler",6875.03,"JeKa@gmail.com"]

{"sheet":"2wl","index":64,"n_rows":37,"n_cols":22,"rows_kept":37,"cut":false,"hidden":false,"merged":[[0,5,1,5]]}
[null,null,null,null,null,{"$f":"MATCH(F3,$C$3:$G$3,0)&\" column ==>>\"","v":"4 column ==>>"}]
[null,null,1,2,3,null,5]
[null,null,"Account#","Fname","Lname","Balance","E-mail",null,null,null,null,null,null,null,null,null,null,{"$f":"\"1258-\"&LEFT(S3,2)&LEFT(T3,2)&\"-\"&INT(RAND()*8000+1001)","v":"1258-DaDo-5833"},"Danielle","Dowell",{"$f":"1000+ROUND(RAND()*8000,2)","v":4607.1000000000004},{"$f":"LEFT(S3,2)&LEFT(T3,2)&\"@gmail.com\"","v":"DaDo@gmail.com"}]
[null,1,"1258-DaDo-7418","Danielle","Dowell",4191.5599999999995,"DaDo@gmail.com"]
["2 row ==>>",null,"1258-ViHo-1321","Victor","Horvath",3676.61,"ViHo@gmail.com"]
[null,3,"1258-HoSh-4750","Howard","Shah",7350.44,"HoSh@gmail.com"]
[null,4,"1258-MaKo-6449","Mark","Koehler",1367.3600000000001,"MaKo@gmail.com"]
[null,5,"1258-DeSt-7389","Debbie","Stephen",3196.24,"DeSt@gmail.com"]
[null,6,"1258-KuWe-1748","Kurt","Weckerly",7052.93,"KuWe@gmail.com"]
[null,7,"1258-GuSu-6102","Guy","Sur",1445.17,"GuSu@gmail.com"]
[null,8,"1258-OdLa-8740","Odessa","Lauria",7812.45,"OdLa@gmail.com"]
[null,9,"1258-ElRh-4436","Elinor","Rhames",6225.46,"ElRh@gmail.com"]
[null,10,"1258-NeSu-3274","Neva","Sumler",4749.54,"NeSu@gmail.com"]
[null,11,"1258-TyBr-8211","Tyrone","Brite",6943.25,"TyBr@gmail.com"]
[null,12,"1258-JaSe-8984","Javier","Segers",8101.48,"JaSe@gmail.com"]
[null,13,"1258-ClWi-5671","Clare","Wimbush",6647.43,"ClWi@gmail.com"]
[null,14,"1258-HiHi-3444","Hillary","Hillen",5095.71,"HiHi@gmail.com"]
[null,15,"1258-MaZo-8107","Mathew","Zobel",6533.32,"MaZo@gmail.com"]
[null,16,"1258-JeSo-6445","Jeanie","Solley",4790.2800000000007,"JeSo@gmail.com"]
[null,17,"1258-MaLe-7052","Marcie","Levis",3611.78,"MaLe@gmail.com"]
[null,18,"1258-ZeSe-6140","Zelma","Semones",1844.15,"ZeSe@gmail.com"]
[null,19,"1258-DaCa-8640","Darryl","Canela",8910.2000000000007,"DaCa@gmail.com"]
[null,20,"1258-JuGo-1604","Julio","Gondek",7341.38,"JuGo@gmail.com"]
[null,21,"1258-LoSt-8418","Louisa","Strecker",7140.8,"LoSt@gmail.com"]
[null,22,"1258-JaCl-8766","Javier","Claflin",5994.36,"JaCl@gmail.com"]
[null,23,"1258-AnEv-6862","Annabelle","Everest",1556.44,"AnEv@gmail.com"]
[null,24,"1258-ElMe-1003","Elinor","Meinke",6420.78,"ElMe@gmail.com"]
[null,25,"1258-MaOp-8230","Max","Opp",1989.48,"MaOp@gmail.com"]
[null,26,"1258-TeOs-1454","Ted","Oscar",8832.36,"TeOs@gmail.com"]
[null,27,"1258-LoDe-6705","Lonnie","Debus",1623.9299999999998,"LoDe@gmail.com"]
[null,28,"1258-TaWa-4457","Tania","Warburton",7312.21,"TaWa@gmail.com"]
[29,null,"1258-HuPa-4126","Hugh","Patron",7792.32,"HuPa@gmail.com"]
[30,null,"1258-KeCa-5697","Kelly","Carn",4898.3999999999996,"KeCa@gmail.com"]
[31,null,"1258-JaEp-1979","Jamie","Epperly",1810.45,"JaEp@gmail.com"]
[32,null,"1258-ClMe-7851","Clinton","Mellen",2813.8199999999997,"ClMe@gmail.com"]
[33,null,"1258-JeKa-3017","Jessie","Kappler",1135.83,"JeKa@gmail.com"]
[34,null,"1258-JeKa-3825","Jessie","Kappler",6875.03,"JeKa@gmail.com"]

{"sheet":"MasterList","index":65,"n_rows":47,"n_cols":14,"rows_kept":47,"cut":false,"hidden":false,"merged":[]}
["Master List",null,"Current List","New Item",null,null,null,null,null,null,null,null,null,{"$f":"TRIM(RIGHT(A2,LEN(A2)-5))&\" \"&INDEX({\"Inc.\",\"Com.\",\"Bus.\"},INT(RAND()*3+1))","v":"ntina Compiseno Inc. Com."}]
["Clementina Compiseno Inc.",null,"Clementina Compiseno Inc.",{"$f":"IF(ISNA(MATCH(C2,$A$2:$A$31,0)),\"Adding To List\",\"Nevermind\")","v":"Nevermind"},null,"<== Finds"]
["Rolf Detterich Inc.",null,"Rolf Detterich Inc.",{"$f":"IF(ISNA(MATCH(C3,$A$2:$A$31,0)),\"Adding To List\",\"Nevermind\")","v":"Nevermind"},null,"all records"]
["Cedrick Dings Inc.",null,"Happy Hair Inc.","Adding To List",null,"not in"]
["Cortez Emperor Bus.",null,"Cortez Emperor Bus.","Nevermind",null,"Master"]
["Leuze Inc.",null,"Leuze Inc.","Nevermind",null,"List"]
["Manda Guiao Com.",null,"Manda Guiao Com.","Nevermind"]
["Elizbeth Latus Bus.",null,"Elizbeth Latus Bus.","Nevermind"]
["Delta Depippo Com.",null,"Fran Grin Bus.","Adding To List"]
["Kristofer Laios Com.",null,"Kristofer Laios Com.","Nevermind"]
["Delana Andalora Bus.",null,"Delana Andalora Bus.","Nevermind"]
["Altha Pauza Com.",null,"Altha Pauza Com.","Nevermind"]
["Mckenzie Jaggie Com.",null,"Mine Spinner Inc.","Adding To List"]
["Samara Freedland Bus.",null,"Samara Freedland Bus.","Nevermind"]
["Jospeh Melstrom Bus."]
["Porter Part Bus."]
["Jazmine Brechbill Bus."]
["Malik Machak Bus.",null,"Current List","New Item"]
["Kenyetta Heggins Inc.",null,"Happy Hair Inc.",{"$f":"ISNUMBER(MATCH(C19,$A$2:$A$31,0))","v":false},null,"<== Finds"]
["Shu Alimo Bus.",null,"Fran Grin Bus.",{"$f":"ISNUMBER(MATCH(C20,$A$2:$A$31,0))","v":false},null,"all"]
["Heide Birnberg Bus.",null,"Mine Spinner Inc.",false,null,"records in"]
["Rachele Marquina Bus.",null,"Samara Freedland Bus.",true,null,"Master"]
["Kasey Aninion Bus.",null,"Altha Pauza Com.",true,null,"List"]
["Hana Alsing Inc.",null,"Delana Andalora Bus.",true]
["Leandro Haerr Bus.",null,"Kristofer Laios Com.",true]
["Tomika Gazdecki Bus.",null,"Elizbeth Latus Bus.",true]
["Flavia Marque Bus.",null,"Manda Guiao Com.",true]
["Jin Nemani Inc.",null,"Leuze Inc.",true]
["Shu Marchizano Inc.",null,"Cortez Emperor Bus.",true]
["Gaston Elgar Inc.",null,"Rolf Detterich Inc.",true]
["Maida Melaro Inc.",null,"Clementina Compiseno Inc.",true]
[]
[]
[null,null,"Current List","New Item"]
[null,null,"Samara Freedland Bus.",{"$f":"ISNUMBER(MATCH(C35,$A$2:$A$31,0))","v":true},null," <== Finds all records in Master List"]
[null,null,"Altha Pauza Com.",true]
[null,null,"Delana Andalora Bus.",true]
[null,null,"Kristofer Laios Com.",true]
[null,null,"Elizbeth Latus Bus.",true]
[null,null,"Manda Guiao Com.",true]
[null,null,"Leuze Inc.",true]
[null,null,"Cortez Emperor Bus.",true]
[null,null,"Rolf Detterich Inc.",true]
[null,null,"Clementina Compiseno Inc.",true]
[null,null,"Happy Hair Inc.",false]
[null,null,"Fran Grin Bus.",false]
[null,null,"Mine Spinner Inc.",false]

{"sheet":"I(1)","index":66,"n_rows":16,"n_cols":14,"rows_kept":16,"cut":false,"hidden":false,"merged":[[3,0,9,0]]}
[null,null,null,"Product Commission Rate"]
[null,null,null,{"$f":"IF(D3=$C$12,COUNTA($D3:D3)&\" column ====>>\",\"\")","v":""},{"$f":"IF(E3=$C$12,COUNTA($D3:E3)&\" column ====>>\",\"\")","v":""},{"$f":"IF(F3=$C$12,COUNTA($D3:F3)&\" column ====>>\",\"\")","v":""},{"$f":"IF(G3=$C$12,COUNTA($D3:G3)&\" column ====>>\",\"\")","v":""},{"$f":"IF(H3=$C$12,COUNTA($D3:H3)&\" column ====>>\",\"\")","v":"5 column ====>>"}]
[null,null,null,"Pro1","Pro2","Pro3","Pro4","Pro5",null,null,"Jan","Feb","Mar","Apr"]
["Sales",{"$f":"IF(MATCH(C$13,$C$4:$C$10,1)=COUNT(C$4:C4),COUNT(C$4:C4)&\" row =>\",\"\")","v":""},0,{"$f":"(ROW()+COLUMN())/1000","v":8.0000000000000002E-3},8.9999999999999993E-3,0.01,1.0999999999999999E-2,1.2E-2,null,"Pro1",16,12,25,12]
[null,{"$f":"IF(MATCH(C$13,$C$4:$C$10,1)=COUNT(C$4:C5),COUNT(C$4:C5)&\" row =>\",\"\")","v":""},{"$f":"C4+1500","v":1500},8.9999999999999993E-3,0.01,1.0999999999999999E-2,1.2E-2,1.2999999999999999E-2,null,"Pro2",22,18,12,17]
[null,{"$f":"IF(MATCH(C$13,$C$4:$C$10,1)=COUNT(C$4:C6),COUNT(C$4:C6)&\" row =>\",\"\")","v":""},{"$f":"C5+1500","v":3000},0.01,1.0999999999999999E-2,1.2E-2,1.2999999999999999E-2,1.4E-2,null,"Pro3",24,16,25,16]
[null,{"$f":"IF(MATCH(C$13,$C$4:$C$10,1)=COUNT(C$4:C7),COUNT(C$4:C7)&\" row =>\",\"\")","v":""},4500,1.0999999999999999E-2,1.2E-2,1.2999999999999999E-2,1.4E-2,1.4999999999999999E-2,null,"Pro4",25,19,11,24]
[null,{"$f":"IF(MATCH(C$13,$C$4:$C$10,1)=COUNT(C$4:C8),COUNT(C$4:C8)&\" row =>\",\"\")","v":"5 row =>"},6000,1.2E-2,1.2999999999999999E-2,1.4E-2,1.4999999999999999E-2,1.6E-2,null,"Pro5",19,13,25,17]
[null,{"$f":"IF(MATCH(C$13,$C$4:$C$10,1)=COUNT(C$4:C9),COUNT(C$4:C9)&\" row =>\",\"\")","v":""},7500,1.2999999999999999E-2,1.4E-2,1.4999999999999999E-2,1.6E-2,1.7000000000000001E-2,null,"Pro6",15,12,12,12]
[null,{"$f":"IF(MATCH(C$13,$C$4:$C$10,1)=COUNT(C$4:C10),COUNT(C$4:C10)&\" row =>\",\"\")","v":""},9000,1.4E-2,1.4999999999999999E-2,1.6E-2,1.7000000000000001E-2,1.7999999999999999E-2]
[null,null,null,null,null,null,null,null,null,"INDEX to do 2-way lookup"]
[null,"Pro","Pro5",null,"column",{"$f":"MATCH(C12,D3:H3,0)","v":5},null,null,null,"Start Cell",{"$f":"INDEX($K$4:$N$9,MATCH(K13,$J$4:$J$9,0),MATCH(K14,$K$3:$N$3,0))","v":16},"End Cell",{"$f":"INDEX($K$4:$N$9,MATCH(M13,$J$4:$J$9,0),MATCH(M14,$K$3:$N$3,0))","v":11}]
[null,{"$f":"A4","v":"Sales"},6000,null,"row",{"$f":"MATCH(C13,C4:C10)","v":5},null,null,null,"Pro","Pro3","Pro","Pro4"]
[null,"Tax",{"$f":"INDEX(D4:H10,MATCH(C13,C4:C10),MATCH(C12,D3:H3,0))","v":1.6E-2},null,null,null,null,null,null,"Month","Feb","Month","Mar"]
[null,null,null,null,null,null,null,null,null,"INDEX to create Dynamic Range"]
[null,"VLOOKUP:",{"$f":"VLOOKUP(C13,C4:H10,MATCH(C12,C3:H3,0))","v":1.6E-2},null,null,null,null,null,null,"Sum",{"$f":"SUM(INDEX($K$4:$N$9,MATCH(K13,$J$4:$J$9,0),MATCH(K14,$K$3:$N$3,0)):INDEX($K$4:$N$9,MATCH(M13,$J$4:$J$9,0),MATCH(M14,$K$3:$N$3,0)))","v":71}]

{"sheet":"I(2)","index":67,"n_rows":10,"n_cols":7,"rows_kept":10,"cut":false,"hidden":false,"merged":[]}
["Use INDEX / MATCH as a substitute for VLOOKUP when the value you want to return is to the left of the lookup column.",null,null,null,"Customer Asks For a Boomerang That Flies A Certain Range"]
["Product","Price","Description",null,"Description","Product","Price"]
["Carlota",23,"Flying Range is 20",null,"Flying Range is 20",{"$f":"INDEX(A3:A8,MATCH($E3,$C$3:$C$8,0))","v":"Carlota"},{"$f":"INDEX(B3:B8,MATCH($E3,$C$3:$C$8,0))","v":23}]
["Quad",30,"Flying Range is 15"]
["Bellen",22,"Flying Range is 25"]
["Sunshine",25,"Flying Range is 30"]
["Majestic Beaut",23.5,"Flying Range is 40"]
["Phenolic Sunshine",45,"Flying Range is 60"]
[]
["We need to return an item\nfrom this\n\ncolumn ==>>",null,"Lookup\n\nColumn ==>>"]

{"sheet":"I(3)","index":68,"n_rows":26,"n_cols":13,"rows_kept":26,"cut":false,"hidden":false,"merged":[]}
["Use INDEX, MIN & MATCH to find vendor name with low bid",null,null,null,null,null,null,null,null,"Jan","Feb","Mar"]
["Products/Vendors","Vendor1","Vendor2","Vendor3","Vendor4","Low Bid","Vendor for Low Bid",null,"Pro 1",40,44,73]
["Product1",47.629999999999995,58.769999999999996,59.760000000000005,42,{"$f":"MIN(B3:E3)","v":42},{"$f":"INDEX($B$2:$E$2,MATCH(F3,B3:E3,0))","v":"Vendor4"},null,"Pro 2",42,20,51]
["Product2",48.36,38.1,52.94,55.81,38.1,{"$f":"INDEX($B$2:$E$2,MATCH(F4,B4:E4,0))","v":"Vendor2"},null,"Pro 3",65,11,56]
["Product3",43.61,32.11,42.37,59.739999999999995,32.11,"Vendor2",null,"Pro 4",20,48,30]
["Product4",47.06,43.89,49.22,33.67,33.67,"Vendor4",null,"Pro 5",20,40,12]
["Product5",37.869999999999997,58.75,31.58,45.230000000000004,31.58,"Vendor3",null,"Pro 6",42,41,66]
["Product6",46.93,59.379999999999995,49.61,57.81,46.93,"Vendor1",null,"Pro 7",18,29,34]
["Product7",59.379999999999995,41.13,38.880000000000003,36.130000000000003,36.130000000000003,"Vendor4"]
["Product8",51.68,34.04,42,40.130000000000003,34.04,"Vendor2",null,"Lookup Row",null,"Lookup Column"]
["Product9",34.269999999999996,49.92,32.71,34.53,32.71,"Vendor3",null,"Criteria",null,"Criteria"]
["Product10",48.97,34.909999999999997,57.230000000000004,58.44,34.909999999999997,"Vendor2",null,"Pro 4",null,"Jan"]
["Product11",48.9,42.95,43.42,53.83,42.95,"Vendor2",null,"Total",null,"Total"]
["Product12",46.120000000000005,40.21,58.03,57.6,40.21,"Vendor2",null,{"$f":"SUM(INDEX(J2:L8,MATCH(I12,I2:I8,0),))","v":98},null,{"$f":"SUM(INDEX(J2:L8,,MATCH(K12,J1:L1,0)))","v":247}]
[]
[null,null,null,null,null,null,null,null,"** Leave the column_num empty and it returns all the columns"]
[null,null,null,null,null,null,null,null,"** Leave the row_num empty and it returns all the rows"]
[]
[null,null,null,null,null,null,null,null,"Pro 1",40,null,"Pro 4",20]
[null,null,null,null,null,null,null,null,"Pro 2",42,null,"Pro 5",20]
[null,null,null,null,null,null,null,null,"Pro 3",65,null,"Pro 6",42]
[]
[null,null,null,null,null,null,null,null,"lookup from 2 or more tables (CHOOSE lookup function can lookup two or more tables)"]
[null,null,null,null,null,null,null,null,"Table",2]
[null,null,null,null,null,null,null,null,"Product","Pro 4"]
[null,null,null,null,null,null,null,null,"Value",{"$f":"IFERROR(INDEX(CHOOSE(J24,J19:J21,M19:M21),MATCH(J25,CHOOSE(J24,I19:I21,L19:L21),0)),\"\")","v":20}]

{"sheet":"ROUND","index":69,"n_rows":14,"n_cols":4,"rows_kept":14,"cut":false,"hidden":false,"merged":[]}
["Tax Rate",1.4500000000000001E-2]
[]
["Employee","Before Tax","Tax (column not rounded)","After Tax"]
["Sioux",127.33,{"$f":"ROUND(B4*B$1,2)","v":1.85},{"$f":"B4-C4","v":125.48}]
["Sue",257.87,{"$f":"ROUND(B5*B$1,2)","v":3.74},{"$f":"B5-C5","v":254.13}]
["Jo",198.35,2.88,195.47]
["Joe",243.19,3.53,239.66]
["Totals",{"$f":"SUM(B4:B7)","v":826.74},{"$f":"SUM(C4:C7)","v":11.999999999999998},{"$f":"SUM(D4:D7)","v":814.74}]
[]
[null,null,1.85]
[null,null,3.74]
[null,null,2.88]
[null,null,3.53]
[null,null,{"$f":"SUM(C10:C13)","v":11.999999999999998}]

{"sheet":"ROUND information","index":70,"n_rows":28,"n_cols":6,"rows_kept":28,"cut":false,"hidden":false,"merged":[]}
["Tax Rate",1.4500000000000001E-2]
[]
["Employee","Before Tax","Tax (column not rounded)","After Tax"]
["Sioux",127.33,{"$f":"B4*B$1","v":1.8462850000000002},{"$f":"B4-C4","v":125.483715},null,{"$f":"\"Value in \"&ADDRESS(ROW(C4),COLUMN(C4),4)&\" = \"&C4&\" is formatted to look like: \"&DOLLAR(C4)","v":"Value in C4 = 1.846285 is formatted to look like: $1.85"}]
["Sue",257.87,3.7391150000000004,{"$f":"B5-C5","v":254.13088500000001},null,{"$f":"\"Value in \"&ADDRESS(ROW(C5),COLUMN(C5),4)&\" = \"&C5&\" is formatted to look like: \"&DOLLAR(C5)","v":"Value in C5 = 3.739115 is formatted to look like: $3.74"}]
["Jo",198.35,2.8760750000000002,195.47392500000001,null,"Value in C6 = 2.876075 is formatted to look like: $2.88"]
["Joe",243.19,3.5262550000000004,239.66374500000001,null,"Value in C7 = 3.526255 is formatted to look like: $3.53"]
["Totals",{"$f":"SUM(B4:B7)","v":826.74},{"$f":"SUM(C4:C7)","v":11.987730000000001},{"$f":"SUM(D4:D7)","v":814.75226999999995},null," <<==Incorrect total because tax calculations were not rounded correctly"]
[]
[null,null,{"$f":"DOLLAR(C4)&\" + \"&DOLLAR(C5)&\" + \"&DOLLAR(C6)&\" + \"&DOLLAR(C7)&\" = \"&DOLLAR(SUM(ROUND(C4:C7,2)))&\". NOT \"&DOLLAR(C8)&\".\"","v":"$1.85 + $3.74 + $2.88 + $3.53 = $12.00. NOT $11.99."}]
[]
[null,null,{"$f":"ROUND(B4*B$1,2)","v":1.85},{"$f":"B4-C12","v":125.48},null,{"$f":"\"Value in \"&ADDRESS(ROW(C12),COLUMN(C12),4)&\" = \"&C12&\" and is formatted to look like: \"&DOLLAR(C12)","v":"Value in C12 = 1.85 and is formatted to look like: $1.85"}]
[null,null,{"$f":"ROUND(B5*B$1,2)","v":3.74},{"$f":"B5-C13","v":254.13},null,{"$f":"\"Value in \"&ADDRESS(ROW(C13),COLUMN(C13),4)&\" = \"&C13&\" and is formatted to look like: \"&DOLLAR(C13)","v":"Value in C13 = 3.74 and is formatted to look like: $3.74"}]
[null,null,2.88,195.47,null,"Value in C14 = 2.88 and is formatted to look like: $2.88"]
[null,null,{"$f":"ROUND(B7*B$1,2)","v":3.53},239.66,null,"Value in C15 = 3.53 and is formatted to look like: $3.53"]
[null,"Correct total ==>>",{"$f":"SUM(C12:C15)","v":11.999999999999998},{"$f":"SUM(D12:D15)","v":814.74}]
[]
["Rules For Rounding:"]
["1) Choose 'position you want to round to'"]
["2) Look at decimal to right of 'position you want to round to':\nif >= 5, add 1 to 'position you want to round to'\nif < 5, add 0 to 'position you want to round to'"]
["3) Drop all decimals to right of 'position you want to round to'"]
[{"$f":"\"Example of how rounding works for a tax calculation =>\"&CHAR(10)&DOLLAR(B4)&\" * \"&B1&\" = \"&B4*B1&CHAR(10)&\" 'position you want to round to' is 2 places to right of decimal (penny)\"&CHAR(10)&MID(B4*B1,5,1)&\" \"&IF(MID(B4*B1,5,1)+0>=5,\">=\",\"<\")&\" 5 \"&CHAR(10)&B4*B1&\" becomes \"&ROUND(B4*B1,2)","v":"Example of how rounding works for a tax calculation =>\n$127.33 * 0.0145 = 1.846285\n 'position you want to round to' is 2 places to right of decimal (penny)\n6 >= 5 \n1.846285 becomes 1.85"}]
[]
[]
["Example","Number To Round","ROUND function rounds","Formula","ROUND function 2nd argument\n\n 'position you want to round to'"]
["Round to penny",12.555,{"$f":"ROUND(B26,2)","v":12.56},{"$f":"\" Formula in \"&ADDRESS(ROW(C26),COLUMN(C26),4)&\" \"&TextFormula","v":" Formula in C26 =ROUND(B26,2)"},2,"positive rounds to right of decimal"]
["Round to dollar",12.5,{"$f":"ROUND(B27,0)","v":13},{"$f":"\" Formula in \"&ADDRESS(ROW(C27),COLUMN(C27),4)&\" \"&TextFormula","v":" Formula in C27 =ROUND(B27,0)"},0,"0 (zero) rounds to integer (ones position)"]
["Round to thousands position",58900,{"$f":"ROUND(B28,-3)","v":59000},{"$f":"\" Formula in \"&ADDRESS(ROW(C28),COLUMN(C28),4)&\" \"&TextFormula","v":" Formula in C28 =ROUND(B28,-3)"},-3,"negative rounds to left of decimal"]

{"sheet":"AVE","index":71,"n_rows":116,"n_cols":8,"rows_kept":116,"cut":false,"hidden":false,"merged":[]}
[null,"AVERAGE",null,"SUM",{"$f":"SUM(B5:B13)","v":524}]
[null,{"$f":"AVERAGE(B5:B13)","v":65.5},null,"COUNT",{"$f":"COUNT(B5:B13)","v":8}]
[null,null,null,{"$f":"D1&\"/\"&D2&\" = \"&E1&\"/\"&E2","v":"SUM/COUNT = 524/8"},{"$f":"E1/E2","v":65.5},null,{"$f":"(B5+B6+B7+B9+B10+B11+B12+B13)/COUNT(B5:B7,B9:B13)","v":65.5}]
["Names","Test Scores"]
["Chin",59]
["Tina",78]
["Bill",92]
["Tom"]
["Sioux",74]
["Shelia",0]
["Pham",81]
["Mike",42]
["Your Name",98]
[]
[]
[]
[]
[]
[]
[]
[]
[]
[]
[]
[]
[]
[]
[]
[]
[]
[]
[]
[]
[]
[]
[]
[]
[]
[]
[]
[]
[]
[]
[]
[]
[]
[]
[]
[]
[]
[]
[]
[]
[]
[]
[]
[]
[]
[]
[]
[]
[]
[]
[]
[]
[]
[]
[]
[]
[]
[]
[]
[]
[]
[]
[]
[]
[]
[]
[]
[]
[]
[]
[]
[]
[]
[]
[]
[]
[]
[]
[]
[]
[]
[]
[]
[]
[]
[]
[]
[]
[]
[]
[]
[]
[]
[]
[]
[]
[]
[]
[]
[]
[]
[null,null,null,"The reason that we have averages is so that we can have one number that will represent all the numbers in a data set. An average is a \"typical value\" that we can use in discussions, reports and for comparative purposes. For example, an average score on a test is a useful number for comparing how well you did on the test; an average miles/gallon for a car number is useful for advertising; and the medain house price in a neighborhood can be a guide for making a purchase decision."]
[null,null,null,"AVERAGE for calculating arithmetic mean - sum/count. Example: Average Score on a test.",null,"MEDIAN for finding the value in the middle of a sorted list (good when there are a few unusually large or small values). Example: For real esate values, it is better to calculate the median because the average might be too large if you have a few $1,000,000 houses (a few values would pull the average up).",null,"MODE finds the one that occurs most often (good when you need an average for counting situations). Example: Counts for Below Par, OK, Good, Great categories. You could not calculate an average (arithmetic mean) bwcasue the sum/count always equals 1."]

{"sheet":"MED","index":72,"n_rows":116,"n_cols":6,"rows_kept":116,"cut":false,"hidden":false,"merged":[[6,4,11,7]]}
["AVERAGE > MEDIAN.\nWhy?\nBecause the million dollar houses are\n'pulling' the average up.",null,null,"MEDIAN"]
["MEDIAN","AVERAGE",null,{"$f":"MEDIAN(D5:D14)","v":307000},{"$f":"AVERAGE(D9:D10)","v":307000}]
[{"$f":"MEDIAN(A6:A14)","v":312500},{"$f":"AVERAGE(A6:A14)","v":560466.66666666663}]
[null,null,null,"House Values"]
["House Values",null,null,2000000]
[2000000,null,null,1000800]
[1000800,null,null,339500,{"$f":"\"When there is an even number of numbers, MEDIAN takes the average of the middle two = (\"&TEXT(D9,\"#,###\")&\" + \"&TEXT(D10,\"#,###\")&\")/2 = \"&TEXT(AVERAGE(D9:D10),\"#,###\")","v":"When there is an even number of numbers, MEDIAN takes the average of the middle two = (312,500 + 301,500)/2 = 307,000"}]
[339500,null,null,325000]
[325000,null,null,312500]
[312500,null,null,301500]
[295800,null,null,295800]
[275000,null,null,275000]
[250000,null,null,250000]
[245600,null,null,245600]
[]
[]
[]
[]
[]
[]
[]
[]
[]
[]
[]
[]
[]
[]
[]
[]
[]
[]
[]
[]
[]
[]
[]
[]
[]
[]
[]
[]
[]
[]
[]
[]
[]
[]
[]
[]
[]
[]
[]
[]
[]
[]
[]
[]
[]
[]
[]
[]
[]
[]
[]
[]
[]
[]
[]
[]
[]
[]
[]
[]
[]
[]
[]
[]
[]
[]
[]
[]
[]
[]
[]
[]
[]
[]
[]
[]
[]
[]
[]
[]
[]
[]
[]
[]
[]
[]
[]
[]
[]
[]
[]
[]
[]
[]
[]
[]
[]
[]
[]
[]
[null,"The reason that we have averages is so that we can have one number that will represent all the numbers in a data set. An average is a \"typical value\" that we can use in discussions, reports and for comparative purposes. For example, an average score on a test is a useful number for comparing how well you did on the test; an average miles/gallon for a car number is useful for advertising; and the medain house price in a neighborhood can be a guide for making a purchase decision."]
[null,"AVERAGE for calculating arithmetic mean - sum/count. Example: Average Score on a test.",null,"MEDIAN for finding the value in the middle of a sorted list (good when there are a few unusually large or small values). Example: For real esate values, it is better to calculate the median because the average might be too large if you have a few $1,000,000 houses (a few values would pull the average up).",null,"MODE finds the one that occurs most often (good when you need an average for counting situations). Example: Counts for Below Par, OK, Good, Great categories. You could not calculate an average (arithmetic mean) bwcasue the sum/count always equals 1."]

{"sheet":"MODE","index":73,"n_rows":117,"n_cols":13,"rows_kept":117,"cut":false,"hidden":false,"merged":[]}
[{"$f":"\"The AVEARGE for 'Below Par' is\"&CHAR(10)&C9&\" / \"&C9&\" = \"&C9/C9","v":"The AVEARGE for 'Below Par' is\n42 / 42 = 1"}]
["MODE"]
[{"$f":"MODE($B$13:$B$112)","v":1}]
[]
["Categories for Survey","Num","Count"]
["Great",4,{"$f":"COUNTIF($A$13:$A$112,A6)","v":13}]
["Good",3,{"$f":"COUNTIF($A$13:$A$112,A7)","v":16}]
["OK",2,29]
["Below Par",1,42,{"$f":"42/42","v":1}]
[]
[{"$f":"COUNT(B13:B112)&\" people were asked how they liked the new Soda Pop.\"","v":"100 people were asked how they liked the new Soda Pop."}]
["Survey Results","Num",null,{"$f":"A6&\" = \"&B6","v":"Great = 4"}]
[{"$f":"INDEX({\"Great\";\"Good\";\"OK\";\"Below Par\"},MATCH(B13,{4;3;2;1},0))","v":"Below Par"},1,null,{"$f":"A7&\" = \"&B7","v":"Good = 3"}]
[{"$f":"INDEX({\"Great\";\"Good\";\"OK\";\"Below Par\"},MATCH(B14,{4;3;2;1},0))","v":"Below Par"},1,null,{"$f":"A8&\" = \"&B8","v":"OK = 2"}]
[{"$f":"INDEX({\"Great\";\"Good\";\"OK\";\"Below Par\"},MATCH(B15,{4;3;2;1},0))","v":"OK"},2,null,{"$f":"A9&\" = \"&B9","v":"Below Par = 1"}]
[{"$f":"INDEX({\"Great\";\"Good\";\"OK\";\"Below Par\"},MATCH(B16,{4;3;2;1},0))","v":"Below Par"},1]
[{"$f":"INDEX({\"Great\";\"Good\";\"OK\";\"Below Par\"},MATCH(B17,{4;3;2;1},0))","v":"Great"},4]
[{"$f":"INDEX({\"Great\";\"Good\";\"OK\";\"Below Par\"},MATCH(B18,{4;3;2;1},0))","v":"Good"},3]
[{"$f":"INDEX({\"Great\";\"Good\";\"OK\";\"Below Par\"},MATCH(B19,{4;3;2;1},0))","v":"Below Par"},1]
[{"$f":"INDEX({\"Great\";\"Good\";\"OK\";\"Below Par\"},MATCH(B20,{4;3;2;1},0))","v":"Below Par"},1]
[{"$f":"INDEX({\"Great\";\"Good\";\"OK\";\"Below Par\"},MATCH(B21,{4;3;2;1},0))","v":"Great"},4]
[{"$f":"INDEX({\"Great\";\"Good\";\"OK\";\"Below Par\"},MATCH(B22,{4;3;2;1},0))","v":"OK"},2]
[{"$f":"INDEX({\"Great\";\"Good\";\"OK\";\"Below Par\"},MATCH(B23,{4;3;2;1},0))","v":"OK"},2]
[{"$f":"INDEX({\"Great\";\"Good\";\"OK\";\"Below Par\"},MATCH(B24,{4;3;2;1},0))","v":"OK"},2]
[{"$f":"INDEX({\"Great\";\"Good\";\"OK\";\"Below Par\"},MATCH(B25,{4;3;2;1},0))","v":"Good"},3]
[{"$f":"INDEX({\"Great\";\"Good\";\"OK\";\"Below Par\"},MATCH(B26,{4;3;2;1},0))","v":"Below Par"},1]
[{"$f":"INDEX({\"Great\";\"Good\";\"OK\";\"Below Par\"},MATCH(B27,{4;3;2;1},0))","v":"Good"},3]
[{"$f":"INDEX({\"Great\";\"Good\";\"OK\";\"Below Par\"},MATCH(B28,{4;3;2;1},0))","v":"Below Par"},1]
[{"$f":"INDEX({\"Great\";\"Good\";\"OK\";\"Below Par\"},MATCH(B29,{4;3;2;1},0))","v":"Great"},4]
[{"$f":"INDEX({\"Great\";\"Good\";\"OK\";\"Below Par\"},MATCH(B30,{4;3;2;1},0))","v":"Good"},3]
[{"$f":"INDEX({\"Great\";\"Good\";\"OK\";\"Below Par\"},MATCH(B31,{4;3;2;1},0))","v":"Below Par"},1]
[{"$f":"INDEX({\"Great\";\"Good\";\"OK\";\"Below Par\"},MATCH(B32,{4;3;2;1},0))","v":"Great"},4]
[{"$f":"INDEX({\"Great\";\"Good\";\"OK\";\"Below Par\"},MATCH(B33,{4;3;2;1},0))","v":"Below Par"},1]
[{"$f":"INDEX({\"Great\";\"Good\";\"OK\";\"Below Par\"},MATCH(B34,{4;3;2;1},0))","v":"Great"},4]
[{"$f":"INDEX({\"Great\";\"Good\";\"OK\";\"Below Par\"},MATCH(B35,{4;3;2;1},0))","v":"OK"},2]
[{"$f":"INDEX({\"Great\";\"Good\";\"OK\";\"Below Par\"},MATCH(B36,{4;3;2;1},0))","v":"OK"},2]
[{"$f":"INDEX({\"Great\";\"Good\";\"OK\";\"Below Par\"},MATCH(B37,{4;3;2;1},0))","v":"Below Par"},1]
[{"$f":"INDEX({\"Great\";\"Good\";\"OK\";\"Below Par\"},MATCH(B38,{4;3;2;1},0))","v":"Below Par"},1]
[{"$f":"INDEX({\"Great\";\"Good\";\"OK\";\"Below Par\"},MATCH(B39,{4;3;2;1},0))","v":"Below Par"},1]
[{"$f":"INDEX({\"Great\";\"Good\";\"OK\";\"Below Par\"},MATCH(B40,{4;3;2;1},0))","v":"Below Par"},1]
[{"$f":"INDEX({\"Great\";\"Good\";\"OK\";\"Below Par\"},MATCH(B41,{4;3;2;1},0))","v":"OK"},2]
[{"$f":"INDEX({\"Great\";\"Good\";\"OK\";\"Below Par\"},MATCH(B42,{4;3;2;1},0))","v":"OK"},2]
[{"$f":"INDEX({\"Great\";\"Good\";\"OK\";\"Below Par\"},MATCH(B43,{4;3;2;1},0))","v":"Below Par"},1]
[{"$f":"INDEX({\"Great\";\"Good\";\"OK\";\"Below Par\"},MATCH(B44,{4;3;2;1},0))","v":"Below Par"},1]
[{"$f":"INDEX({\"Great\";\"Good\";\"OK\";\"Below Par\"},MATCH(B45,{4;3;2;1},0))","v":"Below Par"},1]
[{"$f":"INDEX({\"Great\";\"Good\";\"OK\";\"Below Par\"},MATCH(B46,{4;3;2;1},0))","v":"Good"},3]
[{"$f":"INDEX({\"Great\";\"Good\";\"OK\";\"Below Par\"},MATCH(B47,{4;3;2;1},0))","v":"Below Par"},1]
[{"$f":"INDEX({\"Great\";\"Good\";\"OK\";\"Below Par\"},MATCH(B48,{4;3;2;1},0))","v":"Below Par"},1]
[{"$f":"INDEX({\"Great\";\"Good\";\"OK\";\"Below Par\"},MATCH(B49,{4;3;2;1},0))","v":"Great"},4]
[{"$f":"INDEX({\"Great\";\"Good\";\"OK\";\"Below Par\"},MATCH(B50,{4;3;2;1},0))","v":"Great"},4]
[{"$f":"INDEX({\"Great\";\"Good\";\"OK\";\"Below Par\"},MATCH(B51,{4;3;2;1},0))","v":"Good"},3]
[{"$f":"INDEX({\"Great\";\"Good\";\"OK\";\"Below Par\"},MATCH(B52,{4;3;2;1},0))","v":"OK"},2]
[{"$f":"INDEX({\"Great\";\"Good\";\"OK\";\"Below Par\"},MATCH(B53,{4;3;2;1},0))","v":"Good"},3]
[{"$f":"INDEX({\"Great\";\"Good\";\"OK\";\"Below Par\"},MATCH(B54,{4;3;2;1},0))","v":"OK"},2]
[{"$f":"INDEX({\"Great\";\"Good\";\"OK\";\"Below Par\"},MATCH(B55,{4;3;2;1},0))","v":"OK"},2]
[{"$f":"INDEX({\"Great\";\"Good\";\"OK\";\"Below Par\"},MATCH(B56,{4;3;2;1},0))","v":"OK"},2]
[{"$f":"INDEX({\"Great\";\"Good\";\"OK\";\"Below Par\"},MATCH(B57,{4;3;2;1},0))","v":"Below Par"},1]
[{"$f":"INDEX({\"Great\";\"Good\";\"OK\";\"Below Par\"},MATCH(B58,{4;3;2;1},0))","v":"Great"},4]
[{"$f":"INDEX({\"Great\";\"Good\";\"OK\";\"Below Par\"},MATCH(B59,{4;3;2;1},0))","v":"OK"},2]
[{"$f":"INDEX({\"Great\";\"Good\";\"OK\";\"Below Par\"},MATCH(B60,{4;3;2;1},0))","v":"OK"},2]
[{"$f":"INDEX({\"Great\";\"Good\";\"OK\";\"Below Par\"},MATCH(B61,{4;3;2;1},0))","v":"Below Par"},1]
[{"$f":"INDEX({\"Great\";\"Good\";\"OK\";\"Below Par\"},MATCH(B62,{4;3;2;1},0))","v":"Great"},4]
[{"$f":"INDEX({\"Great\";\"Good\";\"OK\";\"Below Par\"},MATCH(B63,{4;3;2;1},0))","v":"Great"},4]
[{"$f":"INDEX({\"Great\";\"Good\";\"OK\";\"Below Par\"},MATCH(B64,{4;3;2;1},0))","v":"Good"},3]
[{"$f":"INDEX({\"Great\";\"Good\";\"OK\";\"Below Par\"},MATCH(B65,{4;3;2;1},0))","v":"Great"},4]
[{"$f":"INDEX({\"Great\";\"Good\";\"OK\";\"Below Par\"},MATCH(B66,{4;3;2;1},0))","v":"Good"},3]
[{"$f":"INDEX({\"Great\";\"Good\";\"OK\";\"Below Par\"},MATCH(B67,{4;3;2;1},0))","v":"Good"},3]
[{"$f":"INDEX({\"Great\";\"Good\";\"OK\";\"Below Par\"},MATCH(B68,{4;3;2;1},0))","v":"Below Par"},1]
[{"$f":"INDEX({\"Great\";\"Good\";\"OK\";\"Below Par\"},MATCH(B69,{4;3;2;1},0))","v":"Good"},3]
[{"$f":"INDEX({\"Great\";\"Good\";\"OK\";\"Below Par\"},MATCH(B70,{4;3;2;1},0))","v":"Great"},4]
[{"$f":"INDEX({\"Great\";\"Good\";\"OK\";\"Below Par\"},MATCH(B71,{4;3;2;1},0))","v":"Below Par"},1]
[{"$f":"INDEX({\"Great\";\"Good\";\"OK\";\"Below Par\"},MATCH(B72,{4;3;2;1},0))","v":"Good"},3]
[{"$f":"INDEX({\"Great\";\"Good\";\"OK\";\"Below Par\"},MATCH(B73,{4;3;2;1},0))","v":"Below Par"},1]
[{"$f":"INDEX({\"Great\";\"Good\";\"OK\";\"Below Par\"},MATCH(B74,{4;3;2;1},0))","v":"OK"},2]
[{"$f":"INDEX({\"Great\";\"Good\";\"OK\";\"Below Par\"},MATCH(B75,{4;3;2;1},0))","v":"Below Par"},1]
[{"$f":"INDEX({\"Great\";\"Good\";\"OK\";\"Below Par\"},MATCH(B76,{4;3;2;1},0))","v":"Below Par"},1]
[{"$f":"INDEX({\"Great\";\"Good\";\"OK\";\"Below Par\"},MATCH(B77,{4;3;2;1},0))","v":"Below Par"},1]
[{"$f":"INDEX({\"Great\";\"Good\";\"OK\";\"Below Par\"},MATCH(B78,{4;3;2;1},0))","v":"OK"},2]
[{"$f":"INDEX({\"Great\";\"Good\";\"OK\";\"Below Par\"},MATCH(B79,{4;3;2;1},0))","v":"Below Par"},1]
[{"$f":"INDEX({\"Great\";\"Good\";\"OK\";\"Below Par\"},MATCH(B80,{4;3;2;1},0))","v":"OK"},2]
[{"$f":"INDEX({\"Great\";\"Good\";\"OK\";\"Below Par\"},MATCH(B81,{4;3;2;1},0))","v":"Below Par"},1]
[{"$f":"INDEX({\"Great\";\"Good\";\"OK\";\"Below Par\"},MATCH(B82,{4;3;2;1},0))","v":"OK"},2]
[{"$f":"INDEX({\"Great\";\"Good\";\"OK\";\"Below Par\"},MATCH(B83,{4;3;2;1},0))","v":"Below Par"},1]
[{"$f":"INDEX({\"Great\";\"Good\";\"OK\";\"Below Par\"},MATCH(B84,{4;3;2;1},0))","v":"Below Par"},1]
[{"$f":"INDEX({\"Great\";\"Good\";\"OK\";\"Below Par\"},MATCH(B85,{4;3;2;1},0))","v":"Below Par"},1]
[{"$f":"INDEX({\"Great\";\"Good\";\"OK\";\"Below Par\"},MATCH(B86,{4;3;2;1},0))","v":"Below Par"},1]
[{"$f":"INDEX({\"Great\";\"Good\";\"OK\";\"Below Par\"},MATCH(B87,{4;3;2;1},0))","v":"OK"},2]
[{"$f":"INDEX({\"Great\";\"Good\";\"OK\";\"Below Par\"},MATCH(B88,{4;3;2;1},0))","v":"Good"},3]
[{"$f":"INDEX({\"Great\";\"Good\";\"OK\";\"Below Par\"},MATCH(B89,{4;3;2;1},0))","v":"OK"},2]
[{"$f":"INDEX({\"Great\";\"Good\";\"OK\";\"Below Par\"},MATCH(B90,{4;3;2;1},0))","v":"OK"},2]
[{"$f":"INDEX({\"Great\";\"Good\";\"OK\";\"Below Par\"},MATCH(B91,{4;3;2;1},0))","v":"Below Par"},1]
[{"$f":"INDEX({\"Great\";\"Good\";\"OK\";\"Below Par\"},MATCH(B92,{4;3;2;1},0))","v":"Below Par"},1]
[{"$f":"INDEX({\"Great\";\"Good\";\"OK\";\"Below Par\"},MATCH(B93,{4;3;2;1},0))","v":"OK"},2]
[{"$f":"INDEX({\"Great\";\"Good\";\"OK\";\"Below Par\"},MATCH(B94,{4;3;2;1},0))","v":"Below Par"},1]
[{"$f":"INDEX({\"Great\";\"Good\";\"OK\";\"Below Par\"},MATCH(B95,{4;3;2;1},0))","v":"Below Par"},1]
[{"$f":"INDEX({\"Great\";\"Good\";\"OK\";\"Below Par\"},MATCH(B96,{4;3;2;1},0))","v":"Below Par"},1]
[{"$f":"INDEX({\"Great\";\"Good\";\"OK\";\"Below Par\"},MATCH(B97,{4;3;2;1},0))","v":"OK"},2]
[{"$f":"INDEX({\"Great\";\"Good\";\"OK\";\"Below Par\"},MATCH(B98,{4;3;2;1},0))","v":"Below Par"},1]
[{"$f":"INDEX({\"Great\";\"Good\";\"OK\";\"Below Par\"},MATCH(B99,{4;3;2;1},0))","v":"OK"},2]
[{"$f":"INDEX({\"Great\";\"Good\";\"OK\";\"Below Par\"},MATCH(B100,{4;3;2;1},0))","v":"OK"},2]
[{"$f":"INDEX({\"Great\";\"Good\";\"OK\";\"Below Par\"},MATCH(B101,{4;3;2;1},0))","v":"Good"},3]
[{"$f":"INDEX({\"Great\";\"Good\";\"OK\";\"Below Par\"},MATCH(B102,{4;3;2;1},0))","v":"Below Par"},1]
[{"$f":"INDEX({\"Great\";\"Good\";\"OK\";\"Below Par\"},MATCH(B103,{4;3;2;1},0))","v":"OK"},2]
[{"$f":"INDEX({\"Great\";\"Good\";\"OK\";\"Below Par\"},MATCH(B104,{4;3;2;1},0))","v":"Below Par"},1]
[{"$f":"INDEX({\"Great\";\"Good\";\"OK\";\"Below Par\"},MATCH(B105,{4;3;2;1},0))","v":"OK"},2]
[{"$f":"INDEX({\"Great\";\"Good\";\"OK\";\"Below Par\"},MATCH(B106,{4;3;2;1},0))","v":"Good"},3]
[{"$f":"INDEX({\"Great\";\"Good\";\"OK\";\"Below Par\"},MATCH(B107,{4;3;2;1},0))","v":"OK"},2]
[{"$f":"INDEX({\"Great\";\"Good\";\"OK\";\"Below Par\"},MATCH(B108,{4;3;2;1},0))","v":"Great"},4]
[{"$f":"INDEX({\"Great\";\"Good\";\"OK\";\"Below Par\"},MATCH(B109,{4;3;2;1},0))","v":"OK"},2]
[{"$f":"INDEX({\"Great\";\"Good\";\"OK\";\"Below Par\"},MATCH(B110,{4;3;2;1},0))","v":"Good"},3]
[{"$f":"INDEX({\"Great\";\"Good\";\"OK\";\"Below Par\"},MATCH(B111,{4;3;2;1},0))","v":"Below Par"},1]
[{"$f":"INDEX({\"Great\";\"Good\";\"OK\";\"Below Par\"},MATCH(B112,{4;3;2;1},0))","v":"Below Par"},1]
[]
[]
[]
[null,null,null,null,null,null,null,null,"The reason that we have averages is so that we can have one number that will represent all the numbers in a data set. An average is a \"typical value\" that we can use in discussions, reports and for comparative purposes. For example, an average score on a test is a useful number for comparing how well you did on the test; an average miles/gallon for a car number is useful for advertising; and the medain house price in a neighborhood can be a guide for making a purchase decision."]
[null,null,null,null,null,null,null,null,"AVERAGE for calculating arithmetic mean - sum/count. Example: Average Score on a test.",null,"MEDIAN for finding the value in the middle of a sorted list (good when there are a few unusually large or small values). Example: For real esate values, it is better to calculate the median because the average might be too large if you have a few $1,000,000 houses (a few values would pull the average up).",null,"MODE finds the one that occurs most often (good when you need an average for counting situations). Example: Counts for Below Par, OK, Good, Great categories. You could not calculate an average (arithmetic mean) bwcasue the sum/count always equals 1."]

{"sheet":"RANK","index":74,"n_rows":8,"n_cols":8,"rows_kept":8,"cut":false,"hidden":false,"merged":[]}
["Date","Sales","RANK.EQ","RANK","RANK.AVE",null,"Assembling Product Times (Hours)","RANK.AVE"]
["2010-11-19",9349,{"$f":"_xlfn.RANK.EQ(B2,$B$2:$B$8,0)","v":6},{"$f":"RANK(B2,$B$2:$B$8,0)","v":6},{"$f":"_xlfn.RANK.AVG(B2,$B$2:$B$8,0)","v":6},null,5.5,{"$f":"_xlfn.RANK.AVG(G2,$G$2:$G$8,1)","v":6}]
["2010-11-20",9316,{"$f":"_xlfn.RANK.EQ(B3,$B$2:$B$8,0)","v":7},{"$f":"RANK(B3,$B$2:$B$8,0)","v":7},{"$f":"_xlfn.RANK.AVG(B3,$B$2:$B$8,0)","v":7},null,4.8499999999999996,{"$f":"_xlfn.RANK.AVG(G3,$G$2:$G$8,1)","v":2.5}]
["2010-11-21",15850,4,4,4,null,4.55,1]
["2010-11-22",{"$f":"B6","v":15973},2,2,2.5,null,6.05,7]
["2010-11-23",15973,2,2,2.5,null,5.0999999999999996,5]
["2010-11-24",12435,5,5,5,null,5.05,4]
["2010-11-25",16783,1,1,1,null,4.8499999999999996,2.5]

{"sheet":"GS","index":75,"n_rows":4,"n_cols":2,"rows_kept":4,"cut":false,"hidden":false,"merged":[]}
["Sales"]
["Sell Price of Boomerang",25]
["Units Sold",20000]
["Total Revenue",{"$f":"B3*B2","v":500000}]

{"sheet":"Array(1)","index":76,"n_rows":132,"n_cols":16,"rows_kept":132,"cut":false,"hidden":false,"merged":[]}
["Date","Product","COGS","Sales","Gross Profit",null,null,null,null,null,null,null,"formulas for rand"]
["2010-09-13","Mchn 2",7740,21500,{"$f":"D2-C2","v":13760},null,null,null,null,null,null,null,"Date","Product","COGS","Sales"]
["2010-07-17","Mchn 3",9460,21500,{"$f":"D3-C3","v":12040},null,null,null,null,null,null,null,{"$f":"40357+INT(RAND()*40)","v":"2010-07-30"},{"$f":"INDEX({\"Machine 1\";\"Machine 2\";\"Machine 3\"},INT(RAND()*3+1))","v":"Machine 3"},{"$f":"ROUND(P3*VLOOKUP(N3,{\"Machine 1\",15000,0.45,0.29,0.47;\"Machine 2\",21500,0.44,0.36,0.45;\"Machine 3\",32100,0.37,0.3,0.47},3+INT(RAND()*3)),2)","v":11520.69},{"$f":"ROUND(VLOOKUP(N3,{\"Machine 1\",15000;\"Machine 2\",21500;\"Machine 3\",32100},2,0)*INT(RAND()*10+91)/100,2)","v":31137}]
["2010-07-30","Mchn 4",4350,15000,{"$f":"D4-C4","v":10650}]
["2010-08-27","Mchn 5",4350,15000,10650]
["2010-09-25","Mchn 6",14785,31458,16673]
["2010-08-28","Mchn 7",4176,14400,10224]
["2010-07-29","Mchn 8",8859,29532,20673]
[]
[null,null,null,"Total",{"$f":"SUM(E2:E8)","v":94670}]
[]
["Date","Product","COGS","Sales"]
["2010-09-13","Mchn 2",7740,21500,null,null,null,{"$f":"FIXED(D13,0)&\" - \"&FIXED(C13,0)&\" = \"&FIXED(D13-C13,0)","v":"21,500 - 7,740 = 13,760"}]
["2010-07-17","Mchn 3",9460,21500,null,null,null,{"$f":"FIXED(D14,0)&\" - \"&FIXED(C14,0)&\" = \"&FIXED(D14-C14,0)","v":"21,500 - 9,460 = 12,040"}]
["2010-07-30","Mchn 4",4350,15000,null,null,null,"15,000 - 4,350 = 10,650"]
["2010-08-27","Mchn 5",4350,15000,null,null,null,"15,000 - 4,350 = 10,650"]
["2010-09-25","Mchn 6",14785,31458,null,null,null,"31,458 - 14,785 = 16,673"]
["2010-08-28","Mchn 7",4176,14400,null,null,null,"14,400 - 4,176 = 10,224"]
["2010-07-29","Mchn 8",8859,29532,null,null,null,"29,532 - 8,859 = 20,673"]
[]
["Total Gross Profit",null,null,{"$f":"SUM(D13:D19-C13:C19)","v":94670}]
[]
["Date","Product","COGS","Sales"]
["2010-09-13","Mchn 2",7740,21500]
["2010-07-17","Mchn 3",9460,21500]
["2010-07-30","Mchn 4",4350,15000]
["2010-08-27","Mchn 5",4350,15000]
["2010-09-25","Mchn 6",14785,31458]
["2010-08-28","Mchn 7",4176,14400]
["2010-07-29","Mchn 8",8859,29532]
[]
["Total Gross Profit",null,null,{"$f":"SUMPRODUCT(D24:D30-C24:C30)","v":94670}]
[]
[]
[]
[]
[]
[]
[]
[]
[]
[]
[]
[]
[]
[]
[]
[]
[]
[]
[]
[]
[]
[]
[]
[]
[]
[]
[]
[]
[]
[]
[]
[]
[]
[]
[]
[]
[]
[]
[]
[]
[]
[]
[]
[]
[]
[]
[]
[]
[]
[]
[]
[]
[]
[]
[]
[]
[]
[]
[]
[]
[]
[]
[]
[]
[]
[]
[]
[]
[]
[]
[]
[]
[]
[]
[]
[]
[]
[]
[]
[]
[]
[]
[]
[]
[]
[]
[]
[]
[]
[]
[]
[]
[]
[]
[]
[]
[]
[]
[]
[null,null,null,null,{"$f":"SUM(E2:E131)","v":189340}]

{"sheet":"Array(2)","index":77,"n_rows":161,"n_cols":14,"rows_kept":161,"cut":false,"hidden":false,"merged":[]}
["Location","Time (Minutes) To Assemble Product",null,"Location","AVERAGE Time","MIN Time","MAX Time","MODE Time",null,"Names","Count Unique Records",null,"formulas for rand"]
["Seattle",6.7,null,"Seattle",{"$f":"AVERAGEIF($A$2:$A$162,D2,$B$2:$B$162)","v":5.8877551020408179},{"$f":"MIN(IF($A$2:$A$161=D2,$B$2:$B$161))","v":4.2},{"$f":"MAX(IF($A$2:$A$161=D2,$B$2:$B$161))","v":7},{"$f":"MODE(IF($A$2:$A$161=D2,$B$2:$B$161))","v":6.6},null,"Tom",{"$f":"SUMPRODUCT(--(J2:J8<>\"\"),1/COUNTIF(J2:J8,J2:J8&\"\"))","v":5},null,"Location","Time (Mins) To Assemble Product"]
["Oakland",5.4,null,"Oakland",{"$f":"AVERAGEIF($A$2:$A$162,D3,$B$2:$B$162)","v":5.2615384615384624},{"$f":"MIN(IF($A$2:$A$161=D3,$B$2:$B$161))","v":4},{"$f":"MAX(IF($A$2:$A$161=D3,$B$2:$B$161))","v":6.8},{"$f":"MODE(IF($A$2:$A$161=D3,$B$2:$B$161))","v":5.4},null,"Sioux",null,null,{"$f":"INDEX({\"Oakland\";\"SF\";\"Seattle\"},INT(RAND()*3+1))","v":"Seattle"},{"$f":"IF(M3=\"SF\",INT(RAND()*500+501)/100,INT(RAND()*300+401)/100)","v":4.33}]
["Oakland",4.7,null,"SF",{"$f":"AVERAGEIF($A$2:$A$162,D4,$B$2:$B$162)","v":7.7677966101694942},{"$f":"MIN(IF($A$2:$A$161=D4,$B$2:$B$161))","v":5.2},{"$f":"MAX(IF($A$2:$A$161=D4,$B$2:$B$161))","v":10},{"$f":"MODE(IF($A$2:$A$161=D4,$B$2:$B$161))","v":9.5},null,"Sue"]
["SF",7.7,null,null,null,null,null,null,null,"Sioux",null,{"$f":"COUNTA(J2:J8)","v":6}]
["SF",5.2]
["SF",9.5,null,null,null,null,null,null,null,"Jo"]
["Oakland",4.5999999999999996,null,null,null,null,null,null,null,"Mo"]
["Oakland",4.4000000000000004]
["Seattle",5.9]
["Oakland",6.7,null,null,null,null,null,null,null,"Names","Count Unique Records if * included"]
["Oakland",6.3,null,null,null,null,null,null,null,"Tom",{"$f":"SUM(IF(FREQUENCY(IF(J12:J18<>\"\",MATCH(\"~\"&J12:J18,J12:J18&\"\",0)),ROW(J12:J18)-ROW(J12)+1),1))","v":6}]
["Oakland",5.6,null,null,null,null,null,null,null,"*Tom"]
["SF",5.7,null,null,null,null,null,null,null,"Sue"]
["SF",6.2,null,null,null,null,null,null,null,"Sioux"]
["Oakland",4.5]
["SF",7.9,null,null,null,null,null,null,null,"Jo"]
["SF",5.2,null,null,null,null,null,null,null,"Mo"]
["SF",7.2]
["Seattle",6.7]
["Oakland",5.2]
["SF",7.9]
["SF",6]
["Seattle",4.2]
["SF",7.9]
["Seattle",6.3]
["SF",9.4]
["SF",7.4]
["Seattle",6.4]
["SF",9]
["SF",5.9]
["Seattle",6.9]
["Oakland",5.7]
["SF",7.1]
["Seattle",4.4000000000000004]
["SF",8.9]
["Seattle",6.6]
["SF",9.1]
["SF",7.2]
["SF",9.8000000000000007]
["Oakland",4.7]
["Seattle",6.2]
["SF",8.3000000000000007]
["SF",9.9]
["SF",5.7]
["Oakland",6]
["Oakland",6.8]
["Oakland",6.2]
["Oakland",4.3]
["Seattle",4.4000000000000004]
["Oakland",4.8]
["SF",8.9]
["Seattle",5.2]
["Seattle",5.7]
["SF",9.5]
["Seattle",6.1]
["Seattle",6.7]
["Oakland",5]
["Seattle",6.7]
["SF",7.5]
["Seattle",6.1]
["Oakland",4.2]
["SF",9.4]
["Oakland",6.1]
["Seattle",4.2]
["Oakland",4.3]
["Seattle",7]
["Seattle",6.1]
["Oakland",6.7]
["Seattle",6.3]
["Oakland",4.5999999999999996]
["SF",7.3]
["SF",9]
["Oakland",5.8]
["SF",7.4]
["Seattle",5.7]
["Seattle",5.7]
["SF",5.9]
["SF",7.8]
["SF",9.5]
["SF",9.5]
["Oakland",4.2]
["Oakland",4.5999999999999996]
["Oakland",4]
["Seattle",6]
["Oakland",4.5]
["SF",6.7]
["SF",7.6]
["Seattle",6.8]
["SF",10]
["Oakland",4.8]
["SF",6.1]
["SF",7.6]
["SF",8.1999999999999993]
["Oakland",5.4]
["Seattle",6.9]
["Seattle",6.3]
["Oakland",6.1]
["Oakland",6.8]
["Oakland",4.0999999999999996]
["SF",5.9]
["Oakland",4.7]
["Oakland",5.4]
["SF",7]
["Oakland",5.0999999999999996]
["Oakland",5.0999999999999996]
["Oakland",5.8]
["Oakland",5.7]
["SF",5.8]
["Seattle",5.6]
["Seattle",4.8]
["SF",5.4]
["Seattle",5.7]
["Seattle",5.2]
["Seattle",6.5]
["Oakland",4.9000000000000004]
["SF",8.6999999999999993]
["SF",9.6999999999999993]
["Seattle",5.5]
["SF",6.2]
["Seattle",4.2]
["SF",8]
["Oakland",5.7]
["Oakland",5]
["SF",8.6]
["SF",9.3000000000000007]
["Seattle",4.5999999999999996]
["Oakland",5.0999999999999996]
["Seattle",5]
["Oakland",5.4]
["Seattle",6.5]
["Seattle",4.3]
["SF",8.5]
["Seattle",5]
["SF",5.8]
["Oakland",4.8]
["Oakland",4.2]
["Oakland",5.6]
["Seattle",6.6]
["Seattle",6.6]
["SF",9.3000000000000007]
["Oakland",6.8]
["SF",7.6]
["Seattle",6.4]
["Seattle",5.4]
["Seattle",6.5]
["SF",8.1]
["SF",6.7]
["SF",7.5]
["Seattle",7]
["SF",9.6]
["Oakland",6.8]
["Oakland",4.2]
["Oakland",4.4000000000000004]
["SF",8.6]
["Oakland",5.3]
["Oakland",6.5]
["Seattle",6.6]
["Seattle",6.8]
["Seattle",6.6]
["Seattle",4.9000000000000004]

{"sheet":"Array(3)","index":78,"n_rows":35,"n_cols":14,"rows_kept":35,"cut":false,"hidden":false,"merged":[]}
["Sales",null,"Category","Upper Limit","Frequency"]
[249.99,null,{"$f":"\"Sales <= \"&DOLLAR(D2,0)","v":"Sales <= $250"},250,{"$f":"FREQUENCY(A2:A14,D2:D5)","v":2}]
[250,null,{"$f":"DOLLAR(D2,0)&\" < Sales <= \"&DOLLAR(D3,0)","v":"$250 < Sales <= $500"},500,4]
[250.01,null,{"$f":"DOLLAR(D3,0)&\" < Sales <= \"&DOLLAR(D4,0)","v":"$500 < Sales <= $750"},750,1]
[450,null,"$750 < Sales <= $1,000",1000,5,null,null,null,null,null,"Technically, the PivotTable engine and the FREQUENCY function calculate differently:"]
[499.99,null,{"$f":"\"Sales > \"&DOLLAR(D5,0)","v":"Sales > $1,000"},null,1]
[500]
[500.01,null,null,null,null,null,null,null,null,null,"Row Labels","Count of Sales"]
[800,null,null,null,null,null,null,null,null,{"$f":"L31&\" <= Sales < \"&M31","v":"0 <= Sales < 250"},"0-250",1]
[900,null,null,null,null,null,null,null,null,{"$f":"L32&\" <= Sales < \"&M32","v":"250 <= Sales < 500"},"250-500",4]
[850,null,null,null,null,null,null,null,null,{"$f":"L33&\" <= Sales < \"&M33","v":"500 <= Sales < 750"},"500-750",2]
[800,null,null,null,null,null,null,null,null,{"$f":"L34&\" <= Sales < \"&M34","v":"750 <= Sales < 1000"},"750-1000",5]
[1000,null,null,null,null,null,null,null,null,{"$f":"L35&\" < Sales\"","v":"1000 < Sales"},">1000",1]
[2000,null,null,null,null,null,null,null,null,null,"Grand Total",13]
[]
[null,null,null,null,null,null,null,null,null,null,"Sales"]
[null,null,null,null,null,null,null,null,null,null,249.99]
[null,null,null,null,null,null,null,null,null,null,250]
[null,null,null,null,null,null,null,null,null,null,250.01]
[null,null,null,null,null,null,null,null,null,null,450]
[null,null,null,null,null,null,null,null,null,null,499.99]
[null,null,null,null,null,null,null,null,null,null,500]
[null,null,null,null,null,null,null,null,null,null,500.01]
[null,null,null,null,null,null,null,null,null,null,800]
[null,null,null,null,null,null,null,null,null,null,900]
[null,null,null,null,null,null,null,null,null,null,850]
[null,null,null,null,null,null,null,null,null,null,800]
[null,null,null,null,null,null,null,null,null,null,1000]
[null,null,null,null,null,null,null,null,null,null,2000]
[]
[null,null,null,null,null,null,null,null,null,null,{"$f":"L31&\" < Sales <= \"&M31","v":"0 < Sales <= 250"},0,250,{"$f":"COUNTIFS($A$2:$A$14,\">=\"&L31,$A$2:$A$14,\"<\"&M31)","v":1}]
[null,null,null,null,null,null,null,null,null,null,{"$f":"L32&\" < Sales <= \"&M32","v":"250 < Sales <= 500"},{"$f":"M31","v":250},{"$f":"M31+250","v":500},{"$f":"COUNTIFS($A$2:$A$14,\">=\"&L32,$A$2:$A$14,\"<\"&M32)","v":4}]
[null,null,null,null,null,null,null,null,null,null,"500 < Sales <= 750",{"$f":"M32","v":500},{"$f":"M32+250","v":750},2]
[null,null,null,null,null,null,null,null,null,null,"750 < Sales <= 1000",750,1000,4]
[null,null,null,null,null,null,null,null,null,null,"1000 < Sales <= 1250",1000,1250,{"$f":"COUNTIFS($A$2:$A$14,\">\"&L35)","v":1}]

{"sheet":"Array(4)","index":79,"n_rows":14,"n_cols":7,"rows_kept":14,"cut":false,"hidden":false,"merged":[]}
["January Sales","Sales Rep1","Sales Rep2","Sales Rep3","Sales Rep4","Totals"]
["Pro1",415,244,248,417,{"$f":"SUM(B2:E2)","v":1324}]
["Pro2",279,223,321,191,1014]
["Pro3",379,382,215,304,1280]
["Pro4",181,227,150,260,818]
["Pro5",290,440,212,368,1310]
["Totals",{"$f":"SUM(B2:B6)","v":1544},{"$f":"SUM(C2:C6)","v":1516},{"$f":"SUM(D2:D6)","v":1146},{"$f":"SUM(E2:E6)","v":1540},5746]
[]
[{"$f":"TRANSPOSE(A1:F7)","v":"January Sales"},"Pro1","Pro2","Pro3","Pro4","Pro5","Totals"]
["Sales Rep1",415,279,379,181,290,1544]
["Sales Rep2",244,223,382,227,440,1516]
["Sales Rep3",248,321,215,150,212,1146]
["Sales Rep4",417,191,304,260,368,1540]
["Totals",1324,1014,1280,818,1310,5746]

{"sheet":"CNF(notes)","index":80,"n_rows":48,"n_cols":6,"rows_kept":48,"cut":false,"hidden":false,"merged":[]}
[{"$f":"ROW()&\")\"","v":"1)"},"Ctrl + 1 is the keyboard shortcut for the Format Cells Dialog Box"]
[{"$f":"ROW()&\")\"","v":"2)"},"The Number Tab has many EXCELlent number formats"]
["3)","The Custom section let's you create custom Number Formatting"]
["4)","Before the 1st semi-colon is how to display positive numbers"]
["5)","Before the 2nd semi-colon and after the 1st semi-colon is how to display negative numbers"]
["6)","Before the 3rd semi-colon and after the 2nd semi-colon is how to display zeros"]
["7)","After the 3rd semi-colon is whether or not and how to display text"]
["8)","If you just have formatting symbols before the 1st semi-colon, the formatting will apply to positive, negative and zero numbers and text will display"]
["9)","When General Number Format is applied, all Custom Number Formatting will be removed"]
["10)","The TEXT function converts a number to text with a Custom Number Format that you specify. TEXT(number, \"Custom Number Format in quotes\")"]
[]
["Symbol","Usage","Typed digits","Displayed value"]
["#","Digit placeholder that displays significant digits only; example ####.#",12.77,12.77]
[null,null,5,5]
[0,"Digit placeholder that displays significant and insignificant zeroes; example: 0.00",0.35,0.35]
[null,null,23,23]
[0,"Zeros before digit like 00345; example: 00000",345,345]
[0,"display many digits 0.000000000000000",".125489632586635",0.12548963258663501]
["?","Acts as a digit placeholder that does not display insignificant digits but does hold a place so that decimal points will align; example: 0.00?",27.3,27.3]
[null,null,5.1319999999999997,5.1319999999999997]
["?","Scoots the decimal over; example: 0.00????",27.3,27.3]
[null,null,5.1319999999999997,5.1319999999999997]
["%","Rules for formatting a % (times 100 and add symbol); example 0.00%",0.3,0.3]
[",","Inserts a comma for thousands; example: #,###",1000000,1000000]
[",","Use as a scaling operator; example #,,",1000000,1000000]
["*","Tells the cell to put enough of the character (space) after it to fill the column; example $* 0.00",548,548]
["*","Tells the cell to put enough of the character (^) after it to fill the column; example $*^0.01",548,548]
["_","Skip the width of the next character - often used with ) to help positive numbers align with negative numbers; example: _($* #,###0.00_);_($* (#,###0.00);_(* \"-\"??_);_(@_)",256.36,256.36]
["_","example: _($* #,###0.00_);_($* (#,###0.00);_(* \"-\"??_);_(@_)",-256.36,-256.36]
["_","example: _($* #,###0.00_);_($* (#,###0.00);_(* \"-\"??_);_(@_)",0,0]
[]
["\" \"","adds text; example: 0.00\" Rad\"",23,23]
["\" \"","\"surplus\";\"deficit\"",5,5]
[null,null,-10,-10]
["@","Indicates the location where text should be inserted in cells formatted with custom format; if the @ is not included in the code, the text will not be displayed; example: _($@_)","none","none"]
["@","Use formatting to hide words; example: 0.00;-0.00;\"--\";","none","none"]
["@","How to put a single character in front of a word; example: _(* #,##0.00_);_(* (#,##0.00);_(* \"-\"??_);_(^@_)","rad","rad"]
["@","This scoots the text over one width of a parenthesis; example: _($* #,###0.00_);_($* (#,###0.00);_(* \"-\"??_);_(@_)","rad","rad"]
["d","day; example: dddd","2006-12-31","2006-12-31"]
["m","month; example: mmm.","2006-12-31","2006-12-31"]
["y","year; example: yy","2006-12-31","2006-12-31"]
["d","day; example: d","2006-12-31","2006-12-31"]
["m","month; example: m","2006-12-31","2006-12-31","Be careful ==>",{"$f":"12*D43","v":468984}]
["y","year; example: yyyy","2006-12-31","2006-12-31"]
["hh:mm:ss AM/PM","Time","08:00:00",{"$f":"C45","v":"08:00:00"}]
["[h]:mm","Show time greater than 24 hours",2,{"$f":"C46","v":2}]
["Note 1==>","If you specify only two formats, the first is used for positive and zero"]
["Note 2==>","If you specify only one formats, it is used for all numbers"]

{"sheet":"CNF(1)","index":81,"n_rows":43,"n_cols":6,"rows_kept":43,"cut":false,"hidden":false,"merged":[]}
["Date","2009-01-01","format: mmmm d, yyyy"]
["Time","08:00:00","format: hh:mm:ss AM/PM"]
["Time Greater than 24 hours",1.5,"format: [h]:mm"]
["Percents",0.24399999999999999,"format: 0.00000%"]
["Fraction",2.2000000000000002,"format: ?/?"]
["Words with numbers",25,"format: $#,##0.00\" per unit\""]
["Four Sections","Rad","format: 0.00;-0.00;0;"]
["Blank","RAD","format: ;;;"]
["General: keyboard: Ctrl + Shift + ~",2,"format: General"]
[]
["Custom Number Format to have word appear in cell with number. This allows you to still use the number in a formula"]
[25]
["Units","Sales"]
[12,{"$f":"A14*A$12","v":300}]
[15,{"$f":"A15*A$12","v":375}]
[9,225]
[25,625]
[]
["The TEXT function converts a number to text with a Custom Number Format that you specify. TEXT(number, \"Custom Number Format in quotes\")",null,"For more about the TEXT function, see this video:",null,null,"Excel Magic Trick #40: TEXT Function Formula: Dynamic Label"]
["TEXT function with custom number format and & (ampersand) to make label"]
["17:00:00",{"$f":"\"All times before \"&TEXT(A21,\"h:mm AM/PM\")","v":"All times before 5:00 PM"},"All times before 02:00 PM"]
["TEXT function with custom number format and & (ampersand) to make label"]
["2011-02-21",{"$f":"\"The criteria to match is \"&TEXT(A23,\"m/d/y\")","v":"The criteria to match is 2/21/11"},"The Criteria to match is 12/15/2010"]
["TEXT function with custom number format and & (ampersand) to make label"]
[0.22750000000000001,{"$f":"\"Your rate is \"&TEXT(A25,\"0.00%\")","v":"Your rate is 22.75%"},"Your rate is 25.55%"]
["TEXT function with custom number format to check criteria"]
[{"$f":"\"Does \"&A30&\" match \"&B28&\" \"&B29&\"?\"","v":"Does Date match Dec 2009?"},{"$f":"TEXT(B30,\"mmmyyyy\")=B28&B29","v":true}]
["Criteria 1","Dec"]
["Criteria 2",2009]
["Date","2009-12-20"]
[{"$f":"\"TEXT function with custom number format to count Dates in \"&B32&\" \"&B33","v":"TEXT function with custom number format to count Dates in Jan 2009"}]
["Criteria 1","Jan"]
["Criteria 2",2009]
["Count",{"$f":"SUMPRODUCT(--(TEXT(B37:B43,\"mmmyyy\")=B32&B33))","v":4}]
[]
[null,"Dates"]
[null,"2009-01-25"]
[null,"2009-01-20"]
[null,"2009-07-01"]
[null,"2009-05-02"]
[null,"2009-01-02"]
[null,"2009-01-18"]
[null,"2009-04-23"]

{"sheet":"Errors","index":82,"n_rows":10,"n_cols":2,"rows_kept":10,"cut":false,"hidden":false,"merged":[]}
["Error Message","Description of Error"]
["#######","Column width not wide enough to display data (value), or negative date or time."]
[{"$error":"#NAME?"},"Text in a formula that is not a built-in function or a Excel Defined Name."]
[{"$error":"#N/A"},"Not Available/ No Answer. Like when a lookup function cannot find what you are looking for."]
[{"$error":"#REF!"},"Formula is using cell reference that has been deleted, or other invalid cell reference."]
[{"$error":"#VALUE!"},"Invalid operator or argument type in a formula, or array formula was not entered with Ctrl + Shift + Enter."]
[{"$error":"#NUM!"},"Invalid numeric values in a formula or function, or an iterative function like IRR cannot find an answer, or the number is too big or small (number must be between (-10^307 and 10^307)."]
[{"$error":"#DIV/0!"},"Formula divides by zero."]
["Circular Cell Reference","Cell reference in formula refers to the formulas result (itself)."]
[{"$error":"#NULL!"},"No Intersection."]

{"sheet":"S(1)","index":83,"n_rows":31,"n_cols":1,"rows_kept":31,"cut":false,"hidden":false,"merged":[]}
["Sample Times For Assemply Process (minutes)"]
[8.870000000000001]
[8.75]
[8.6900000000000013]
[8.61]
[8.58]
[8.370000000000001]
[8.2800000000000011]
[8.2100000000000009]
[8.14]
[7.95]
[7.6899999999999995]
[7.62]
[7.51]
[7.43]
[7.1899999999999995]
[6.95]
[6.83]
[6.4399999999999995]
[5.65]
[5.64]
[5.5600000000000005]
[5.16]
[5.0600000000000005]
[4.8600000000000003]
[4.8100000000000005]
[4.76]
[4.63]
[4.43]
[4.18]
[4.03]

{"sheet":"S(2)","index":84,"n_rows":32,"n_cols":9,"rows_kept":32,"cut":false,"hidden":false,"merged":[]}
[null,null,null,null,null,null,null,null,{"$f":"REPT(CHAR(42),INT(RAND()*4+1))","v":"*"}]
[null,"Sample Times For Assemply Process (minutes)","Quality of Assembly Rating","dd"]
[null,6.95,"***",{"$f":"RAND()","v":0.49744309821851063}]
[null,4.8600000000000003,"**",0.32726527001986705]
[null,5.5600000000000005,"**",0.3728899312959113]
[null,8.2800000000000011,"****",0.67265694100693385]
[null,6.4399999999999995,"**",0.94407455773714555]
[null,4.76,"*",0.86980147791326312]
[null,8.370000000000001,"**",0.91739351532803814]
[null,4.43,"***",0.45951658605361501]
[null,5.16,"*",0.39153314539524287]
[null,8.75,"****",0.34089355914082509]
[null,5.65,"**",0.60884647329388886]
[null,8.58,"***",0.70995195067499284]
[null,7.1899999999999995,"***",0.11146236291573719]
[null,7.51,"**",0.97950462474572264]
[null,7.6899999999999995,"***",0.8253813939988901]
[null,6.83,"**",0.27740359016796878]
[null,4.18,"****",0.23200988527734201]
[null,8.6900000000000013,"*",0.91760697617014597]
[null,4.03,"**",1.0039097458414581E-2]
[null,4.63,"***",8.6946273543629826E-2]
[null,8.870000000000001,"**",0.5912899447019565]
[null,4.8100000000000005,"***",0.57833610358802534]
[null,8.61,"**",0.87027122147575131]
[null,5.64,"***",8.2442420724292864E-2]
[null,8.2100000000000009,"**",0.95405626015609857]
[null,7.62,"****",0.21194161668174327]
[null,8.14,"****",0.45998709271447391]
[null,7.95,"****",0.45364399500192376]
[null,7.43,"****",0.37309649906826414]
[null,5.0600000000000005,"*",0.59532377554926974]

{"sheet":"S(3)","index":85,"n_rows":31,"n_cols":20,"rows_kept":31,"cut":false,"hidden":false,"merged":[]}
["Customers","Address","City","State","Zip","E-mail",null,null,null,null,null,null,null,null,null,{"$f":"INT(RAND()*8000+101)&\" \"&CHOOSE(INT(RAND()*10+1),\"1st\",\"2nd\",\"4th\",\"13th\",\"23rd\",\"66th\",\"151st\",\"23rd\",\"15th\",\"173rd\")&\" \"&CHOOSE(INT(RAND()*4+1),\"Ave.\",\"St.\",\"Blvd.\",\"Lane\")","v":"5231 66th Lane"},{"$f":"CHOOSE(INT(RAND()*3+1),\"Seattle\",\"Tacoma\",\"Kent\")","v":"Seattle"},"WA",{"$f":"981&INT(RAND()*250+101)","v":"981285"},{"$f":"CHAR(65+INT(RAND()*25))&CHAR(65+INT(RAND()*25))&CHAR(65+INT(RAND()*25))&\"@\"&CHOOSE(INT(RAND()*3+1),\"yahoo.com\",\"gmail.com\",\"fun.edu\")","v":"HFY@fun.edu"}]
["Ghrist, Annita","313 173rd Blvd.","Kent","WA","981215","FSO485@gmail.com"]
["Dahnke, Georgeann","316 66th Blvd.","Kent","WA","981244","RWN@fun.edu"]
["Herry, Bryon","4358 23rd St.","Kent","WA","981225","LGQ756@gmail.com"]
["Zeiser, Keren","4907 13th Ave.","Kent","WA","981232","FRF676@yahoo.com"]
["Lomasney, Lavenia","4047 15th Ave.","Kent","WA","981228","HHU@fun.edu"]
["General, Marlin","7900 173rd Lane","Kent","WA","981266","KFP@yahoo.com"]
["Dillaman, Darius","965 151st St.","Kent","WA","981162","MJG@yahoo.com"]
["Spezio, Bryon","7096 15th Lane","Seattle","WA","981259","HCR176@yahoo.com"]
["Scrabeck, Keren","2977 66th Lane","Seattle","WA","981171","EBA@gmail.com"]
["Reffett, Marcel","267 4th Lane","Seattle","WA","981266","CHI751@yahoo.com"]
["Patrum, Ali","4254 23rd Blvd.","Seattle","WA","981234","NNR752@fun.edu"]
["Musco, Lianne","3341 173rd Blvd.","Seattle","WA","981185","HEW@fun.edu"]
["Matar, Son","2466 4th Ave.","Seattle","WA","981328","QFY278@yahoo.com"]
["Jayson, Dane","3392 23rd St.","Seattle","WA","981131","CLU@fun.edu"]
["Hudnell, Rod","3789 4th Blvd.","Seattle","WA","981152","IGJ150@gmail.com"]
["Fukumoto, Marvis","3653 4th Blvd.","Seattle","WA","981280","PKF@yahoo.com"]
["Fila, Bryon","1654 66th St.","Seattle","WA","981143","QKC@gmail.com"]
["Bruess, Natisha","7149 1st Ave.","Seattle","WA","981335","YSE222@fun.edu"]
[", Aler","3557 1st St.","Seattle","WA","981147","JNV@yahoo.com"]
["Zeiss, Son","4817 13th St.","Tacoma","WA","981112","DTT@yahoo.com"]
["Walenta, Bryon","7932 23rd St.","Tacoma","WA","981263","JKO209@fun.edu"]
["Vuono, Nolan","5789 13th Lane","Tacoma","WA","981341","CUU@fun.edu"]
["Stolt, Hal","7021 1st Ave.","Tacoma","WA","981185","FSI@yahoo.com"]
["Savini, Quinton","3861 2nd Blvd.","Tacoma","WA","981178","WGD789@gmail.com"]
["Pofahl, Quinton","1103 15th Lane","Tacoma","WA","981225","WFK@fun.edu"]
["Kalahiki, Rod","5054 1st St.","Tacoma","WA","981171","VWQ301@gmail.com"]
["Gonnella, Marcel","6699 13th St.","Tacoma","WA","981152","THH325@yahoo.com"]
["Durtschi, Dane","7582 4th Lane","Tacoma","WA","981177","KVC@gmail.com"]
["Chukes, Hal","7726 66th Ave.","Tacoma","WA","981118","MGF675@fun.edu"]
["Acero, Natisha","6281 173rd St.","Tacoma","WA","981317","HDT641@fun.edu"]

{"sheet":"S(4)","index":86,"n_rows":256,"n_cols":9,"rows_kept":256,"cut":false,"hidden":false,"merged":[]}
["Data",null,null,null,null,null,null,"ASCII character","ASCII number"]
[3,null,{"$f":"IFERROR(IF(A2=\"\",\"<== blank cell\",\"\"),\"\")","v":""},null,{"$f":"LEFT(A2,1)","v":"3"},{"$f":"CODE(E2)","v":51},null,{"$f":"CHAR(ROWS(H$2:H2))","v":"\u0001"},{"$f":"CODE(H2)","v":1}]
[4,null,"",null,"4",52,null,{"$f":"CHAR(ROWS(H$2:H3))","v":"\u0002"},2]
["#",null,"",null,"#",35,null,{"$f":"CHAR(ROWS(H$2:H4))","v":"\u0003"},3]
[")",null,"",null,")",41,null,{"$f":"CHAR(ROWS(H$2:H5))","v":"\u0004"},4]
["*",null,"",null,"*",42,null,{"$f":"CHAR(ROWS(H$2:H6))","v":"\u0005"},5]
["Cool",null,"",null,"C",{"$f":"CODE(E7)","v":67},null,{"$f":"CHAR(ROWS(H$2:H7))","v":"\u0006"},6]
["cool",null,"",null,"c",{"$f":"CODE(E8)","v":99},null,{"$f":"CHAR(ROWS(H$2:H8))","v":"\u0007"},7]
["rad",null,"",null,"r",{"$f":"CODE(E9)","v":114},null,{"$f":"CHAR(ROWS(H$2:H9))","v":"\b"},8]
[false,null,"",null,null,null,null,{"$f":"CHAR(ROWS(H$2:H10))","v":"\t"},9]
[true,null,"",null,null,null,null,{"$f":"CHAR(ROWS(H$2:H11))","v":"\n"},10]
[{"$f":"1/0","v":{"$error":"#DIV/0!"}},null,"",null,null,null,null,{"$f":"CHAR(ROWS(H$2:H12))","v":"\u000b"},11]
[null,null,"<== blank cell",null,null,null,null,{"$f":"CHAR(ROWS(H$2:H13))","v":"\f"},12]
[null,null,null,null,null,null,null,{"$f":"CHAR(ROWS(H$2:H14))","v":"\r"},13]
[null,null,null,null,null,null,null,{"$f":"CHAR(ROWS(H$2:H15))","v":"\u000e"},14]
[null,null,null,null,null,null,null,{"$f":"CHAR(ROWS(H$2:H16))","v":"\u000f"},15]
[null,null,null,null,null,null,null,{"$f":"CHAR(ROWS(H$2:H17))","v":"\u0010"},16]
[null,null,null,null,null,null,null,{"$f":"CHAR(ROWS(H$2:H18))","v":"\u0011"},17]
[null,null,null,null,null,null,null,{"$f":"CHAR(ROWS(H$2:H19))","v":"\u0012"},18]
[null,null,null,null,null,null,null,{"$f":"CHAR(ROWS(H$2:H20))","v":"\u0013"},19]
[null,null,null,null,null,null,null,{"$f":"CHAR(ROWS(H$2:H21))","v":"\u0014"},20]
[null,null,null,null,null,null,null,{"$f":"CHAR(ROWS(H$2:H22))","v":"\u0015"},21]
[null,null,null,null,null,null,null,{"$f":"CHAR(ROWS(H$2:H23))","v":"\u0016"},22]
[null,null,null,null,null,null,null,{"$f":"CHAR(ROWS(H$2:H24))","v":"\u0017"},23]
[null,null,null,null,null,null,null,{"$f":"CHAR(ROWS(H$2:H25))","v":"\u0018"},24]
[null,null,null,null,null,null,null,{"$f":"CHAR(ROWS(H$2:H26))","v":"\u0019"},25]
[null,null,null,null,null,null,null,{"$f":"CHAR(ROWS(H$2:H27))","v":"\u001a"},26]
[null,null,null,null,null,null,null,{"$f":"CHAR(ROWS(H$2:H28))","v":"\u001b"},27]
[null,null,null,null,null,null,null,{"$f":"CHAR(ROWS(H$2:H29))","v":"\u001c"},28]
[null,null,null,null,null,null,null,{"$f":"CHAR(ROWS(H$2:H30))","v":"\u001d"},29]
[null,null,null,null,null,null,null,{"$f":"CHAR(ROWS(H$2:H31))","v":"\u001e"},30]
[null,null,null,null,null,null,null,{"$f":"CHAR(ROWS(H$2:H32))","v":"\u001f"},31]
[null,null,null,null,null,null,null,{"$f":"CHAR(ROWS(H$2:H33))","v":" "},32]
[null,null,null,null,null,null,null,{"$f":"CHAR(ROWS(H$2:H34))","v":"!"},33]
[null,null,null,null,null,null,null,{"$f":"CHAR(ROWS(H$2:H35))","v":"\""},34]
[null,null,null,null,null,null,null,{"$f":"CHAR(ROWS(H$2:H36))","v":"#"},35]
[null,null,null,null,null,null,null,{"$f":"CHAR(ROWS(H$2:H37))","v":"$"},36]
[null,null,null,null,null,null,null,{"$f":"CHAR(ROWS(H$2:H38))","v":"%"},37]
[null,null,null,null,null,null,null,{"$f":"CHAR(ROWS(H$2:H39))","v":"&"},38]
[null,null,null,null,null,null,null,{"$f":"CHAR(ROWS(H$2:H40))","v":"'"},39]
[null,null,null,null,null,null,null,{"$f":"CHAR(ROWS(H$2:H41))","v":"("},40]
[null,null,null,null,null,null,null,{"$f":"CHAR(ROWS(H$2:H42))","v":")"},41]
[null,null,null,null,null,null,null,{"$f":"CHAR(ROWS(H$2:H43))","v":"*"},42]
[null,null,null,null,null,null,null,{"$f":"CHAR(ROWS(H$2:H44))","v":"+"},43]
[null,null,null,null,null,null,null,{"$f":"CHAR(ROWS(H$2:H45))","v":","},44]
[null,null,null,null,null,null,null,{"$f":"CHAR(ROWS(H$2:H46))","v":"-"},45]
[null,null,null,null,null,null,null,{"$f":"CHAR(ROWS(H$2:H47))","v":"."},46]
[null,null,null,null,null,null,null,{"$f":"CHAR(ROWS(H$2:H48))","v":"/"},47]
[null,null,null,null,null,null,null,{"$f":"CHAR(ROWS(H$2:H49))","v":"0"},48]
[null,null,null,null,null,null,null,{"$f":"CHAR(ROWS(H$2:H50))","v":"1"},49]
[null,null,null,null,null,null,null,{"$f":"CHAR(ROWS(H$2:H51))","v":"2"},50]
[null,null,null,null,null,null,null,{"$f":"CHAR(ROWS(H$2:H52))","v":"3"},51]
[null,null,null,null,null,null,null,{"$f":"CHAR(ROWS(H$2:H53))","v":"4"},52]
[null,null,null,null,null,null,null,{"$f":"CHAR(ROWS(H$2:H54))","v":"5"},53]
[null,null,null,null,null,null,null,{"$f":"CHAR(ROWS(H$2:H55))","v":"6"},54]
[null,null,null,null,null,null,null,{"$f":"CHAR(ROWS(H$2:H56))","v":"7"},55]
[null,null,null,null,null,null,null,{"$f":"CHAR(ROWS(H$2:H57))","v":"8"},56]
[null,null,null,null,null,null,null,{"$f":"CHAR(ROWS(H$2:H58))","v":"9"},57]
[null,null,null,null,null,null,null,{"$f":"CHAR(ROWS(H$2:H59))","v":":"},58]
[null,null,null,null,null,null,null,{"$f":"CHAR(ROWS(H$2:H60))","v":";"},59]
[null,null,null,null,null,null,null,{"$f":"CHAR(ROWS(H$2:H61))","v":"<"},60]
[null,null,null,null,null,null,null,{"$f":"CHAR(ROWS(H$2:H62))","v":"="},61]
[null,null,null,null,null,null,null,{"$f":"CHAR(ROWS(H$2:H63))","v":">"},62]
[null,null,null,null,null,null,null,{"$f":"CHAR(ROWS(H$2:H64))","v":"?"},63]
[null,null,null,null,null,null,null,{"$f":"CHAR(ROWS(H$2:H65))","v":"@"},64]
[null,null,null,null,null,null,null,{"$f":"CHAR(ROWS(H$2:H66))","v":"A"},{"$f":"CODE(H66)","v":65}]
[null,null,null,null,null,null,null,{"$f":"CHAR(ROWS(H$2:H67))","v":"B"},66]
[null,null,null,null,null,null,null,{"$f":"CHAR(ROWS(H$2:H68))","v":"C"},67]
[null,null,null,null,null,null,null,{"$f":"CHAR(ROWS(H$2:H69))","v":"D"},68]
[null,null,null,null,null,null,null,{"$f":"CHAR(ROWS(H$2:H70))","v":"E"},69]
[null,null,null,null,null,null,null,{"$f":"CHAR(ROWS(H$2:H71))","v":"F"},70]
[null,null,null,null,null,null,null,{"$f":"CHAR(ROWS(H$2:H72))","v":"G"},71]
[null,null,null,null,null,null,null,{"$f":"CHAR(ROWS(H$2:H73))","v":"H"},72]
[null,null,null,null,null,null,null,{"$f":"CHAR(ROWS(H$2:H74))","v":"I"},73]
[null,null,null,null,null,null,null,{"$f":"CHAR(ROWS(H$2:H75))","v":"J"},74]
[null,null,null,null,null,null,null,{"$f":"CHAR(ROWS(H$2:H76))","v":"K"},75]
[null,null,null,null,null,null,null,{"$f":"CHAR(ROWS(H$2:H77))","v":"L"},76]
[null,null,null,null,null,null,null,{"$f":"CHAR(ROWS(H$2:H78))","v":"M"},77]
[null,null,null,null,null,null,null,{"$f":"CHAR(ROWS(H$2:H79))","v":"N"},78]
[null,null,null,null,null,null,null,{"$f":"CHAR(ROWS(H$2:H80))","v":"O"},79]
[null,null,null,null,null,null,null,{"$f":"CHAR(ROWS(H$2:H81))","v":"P"},80]
[null,null,null,null,null,null,null,{"$f":"CHAR(ROWS(H$2:H82))","v":"Q"},81]
[null,null,null,null,null,null,null,{"$f":"CHAR(ROWS(H$2:H83))","v":"R"},82]
[null,null,null,null,null,null,null,{"$f":"CHAR(ROWS(H$2:H84))","v":"S"},83]
[null,null,null,null,null,null,null,{"$f":"CHAR(ROWS(H$2:H85))","v":"T"},84]
[null,null,null,null,null,null,null,{"$f":"CHAR(ROWS(H$2:H86))","v":"U"},85]
[null,null,null,null,null,null,null,{"$f":"CHAR(ROWS(H$2:H87))","v":"V"},86]
[null,null,null,null,null,null,null,{"$f":"CHAR(ROWS(H$2:H88))","v":"W"},87]
[null,null,null,null,null,null,null,{"$f":"CHAR(ROWS(H$2:H89))","v":"X"},88]
[null,null,null,null,null,null,null,{"$f":"CHAR(ROWS(H$2:H90))","v":"Y"},89]
[null,null,null,null,null,null,null,{"$f":"CHAR(ROWS(H$2:H91))","v":"Z"},90]
[null,null,null,null,null,null,null,{"$f":"CHAR(ROWS(H$2:H92))","v":"["},91]
[null,null,null,null,null,null,null,{"$f":"CHAR(ROWS(H$2:H93))","v":"\\"},92]
[null,null,null,null,null,null,null,{"$f":"CHAR(ROWS(H$2:H94))","v":"]"},93]
[null,null,null,null,null,null,null,{"$f":"CHAR(ROWS(H$2:H95))","v":"^"},94]
[null,null,null,null,null,null,null,{"$f":"CHAR(ROWS(H$2:H96))","v":"_"},95]
[null,null,null,null,null,null,null,{"$f":"CHAR(ROWS(H$2:H97))","v":"`"},96]
[null,null,null,null,null,null,null,{"$f":"CHAR(ROWS(H$2:H98))","v":"a"},97]
[null,null,null,null,null,null,null,{"$f":"CHAR(ROWS(H$2:H99))","v":"b"},98]
[null,null,null,null,null,null,null,{"$f":"CHAR(ROWS(H$2:H100))","v":"c"},99]
[null,null,null,null,null,null,null,{"$f":"CHAR(ROWS(H$2:H101))","v":"d"},100]
[null,null,null,null,null,null,null,{"$f":"CHAR(ROWS(H$2:H102))","v":"e"},101]
[null,null,null,null,null,null,null,{"$f":"CHAR(ROWS(H$2:H103))","v":"f"},102]
[null,null,null,null,null,null,null,{"$f":"CHAR(ROWS(H$2:H104))","v":"g"},103]
[null,null,null,null,null,null,null,{"$f":"CHAR(ROWS(H$2:H105))","v":"h"},104]
[null,null,null,null,null,null,null,{"$f":"CHAR(ROWS(H$2:H106))","v":"i"},105]
[null,null,null,null,null,null,null,{"$f":"CHAR(ROWS(H$2:H107))","v":"j"},106]
[null,null,null,null,null,null,null,{"$f":"CHAR(ROWS(H$2:H108))","v":"k"},107]
[null,null,null,null,null,null,null,{"$f":"CHAR(ROWS(H$2:H109))","v":"l"},108]
[null,null,null,null,null,null,null,{"$f":"CHAR(ROWS(H$2:H110))","v":"m"},109]
[null,null,null,null,null,null,null,{"$f":"CHAR(ROWS(H$2:H111))","v":"n"},110]
[null,null,null,null,null,null,null,{"$f":"CHAR(ROWS(H$2:H112))","v":"o"},111]
[null,null,null,null,null,null,null,{"$f":"CHAR(ROWS(H$2:H113))","v":"p"},112]
[null,null,null,null,null,null,null,{"$f":"CHAR(ROWS(H$2:H114))","v":"q"},113]
[null,null,null,null,null,null,null,{"$f":"CHAR(ROWS(H$2:H115))","v":"r"},114]
[null,null,null,null,null,null,null,{"$f":"CHAR(ROWS(H$2:H116))","v":"s"},115]
[null,null,null,null,null,null,null,{"$f":"CHAR(ROWS(H$2:H117))","v":"t"},116]
[null,null,null,null,null,null,null,{"$f":"CHAR(ROWS(H$2:H118))","v":"u"},117]
[null,null,null,null,null,null,null,{"$f":"CHAR(ROWS(H$2:H119))","v":"v"},118]
[null,null,null,null,null,null,null,{"$f":"CHAR(ROWS(H$2:H120))","v":"w"},119]
[null,null,null,null,null,null,null,{"$f":"CHAR(ROWS(H$2:H121))","v":"x"},120]
[null,null,null,null,null,null,null,{"$f":"CHAR(ROWS(H$2:H122))","v":"y"},121]
[null,null,null,null,null,null,null,{"$f":"CHAR(ROWS(H$2:H123))","v":"z"},122]
[null,null,null,null,null,null,null,{"$f":"CHAR(ROWS(H$2:H124))","v":"{"},123]
[null,null,null,null,null,null,null,{"$f":"CHAR(ROWS(H$2:H125))","v":"|"},124]
[null,null,null,null,null,null,null,{"$f":"CHAR(ROWS(H$2:H126))","v":"}"},125]
[null,null,null,null,null,null,null,{"$f":"CHAR(ROWS(H$2:H127))","v":"~"},126]
[null,null,null,null,null,null,null,{"$f":"CHAR(ROWS(H$2:H128))","v":"\u007f"},127]
[null,null,null,null,null,null,null,{"$f":"CHAR(ROWS(H$2:H129))","v":"€"},128]
[null,null,null,null,null,null,null,{"$f":"CHAR(ROWS(H$2:H130))","v":"\u0081"},{"$f":"CODE(H130)","v":129}]
[null,null,null,null,null,null,null,{"$f":"CHAR(ROWS(H$2:H131))","v":"‚"},130]
[null,null,null,null,null,null,null,{"$f":"CHAR(ROWS(H$2:H132))","v":"ƒ"},131]
[null,null,null,null,null,null,null,{"$f":"CHAR(ROWS(H$2:H133))","v":"„"},132]
[null,null,null,null,null,null,null,{"$f":"CHAR(ROWS(H$2:H134))","v":"…"},133]
[null,null,null,null,null,null,null,{"$f":"CHAR(ROWS(H$2:H135))","v":"†"},134]
[null,null,null,null,null,null,null,{"$f":"CHAR(ROWS(H$2:H136))","v":"‡"},135]
[null,null,null,null,null,null,null,{"$f":"CHAR(ROWS(H$2:H137))","v":"ˆ"},136]
[null,null,null,null,null,null,null,{"$f":"CHAR(ROWS(H$2:H138))","v":"‰"},137]
[null,null,null,null,null,null,null,{"$f":"CHAR(ROWS(H$2:H139))","v":"Š"},138]
[null,null,null,null,null,null,null,{"$f":"CHAR(ROWS(H$2:H140))","v":"‹"},139]
[null,null,null,null,null,null,null,{"$f":"CHAR(ROWS(H$2:H141))","v":"Œ"},140]
[null,null,null,null,null,null,null,{"$f":"CHAR(ROWS(H$2:H142))","v":"\u008d"},141]
[null,null,null,null,null,null,null,{"$f":"CHAR(ROWS(H$2:H143))","v":"Ž"},142]
[null,null,null,null,null,null,null,{"$f":"CHAR(ROWS(H$2:H144))","v":"\u008f"},143]
[null,null,null,null,null,null,null,{"$f":"CHAR(ROWS(H$2:H145))","v":"\u0090"},144]
[null,null,null,null,null,null,null,{"$f":"CHAR(ROWS(H$2:H146))","v":"‘"},145]
[null,null,null,null,null,null,null,{"$f":"CHAR(ROWS(H$2:H147))","v":"’"},146]
[null,null,null,null,null,null,null,{"$f":"CHAR(ROWS(H$2:H148))","v":"“"},147]
[null,null,null,null,null,null,null,{"$f":"CHAR(ROWS(H$2:H149))","v":"”"},148]
[null,null,null,null,null,null,null,{"$f":"CHAR(ROWS(H$2:H150))","v":"•"},149]
[null,null,null,null,null,null,null,{"$f":"CHAR(ROWS(H$2:H151))","v":"–"},150]
[null,null,null,null,null,null,null,{"$f":"CHAR(ROWS(H$2:H152))","v":"—"},151]
[null,null,null,null,null,null,null,{"$f":"CHAR(ROWS(H$2:H153))","v":"˜"},152]
[null,null,null,null,null,null,null,{"$f":"CHAR(ROWS(H$2:H154))","v":"™"},153]
[null,null,null,null,null,null,null,{"$f":"CHAR(ROWS(H$2:H155))","v":"š"},154]
[null,null,null,null,null,null,null,{"$f":"CHAR(ROWS(H$2:H156))","v":"›"},155]
[null,null,null,null,null,null,null,{"$f":"CHAR(ROWS(H$2:H157))","v":"œ"},156]
[null,null,null,null,null,null,null,{"$f":"CHAR(ROWS(H$2:H158))","v":"\u009d"},157]
[null,null,null,null,null,null,null,{"$f":"CHAR(ROWS(H$2:H159))","v":"ž"},158]
[null,null,null,null,null,null,null,{"$f":"CHAR(ROWS(H$2:H160))","v":"Ÿ"},159]
[null,null,null,null,null,null,null,{"$f":"CHAR(ROWS(H$2:H161))","v":" "},160]
[null,null,null,null,null,null,null,{"$f":"CHAR(ROWS(H$2:H162))","v":"¡"},161]
[null,null,null,null,null,null,null,{"$f":"CHAR(ROWS(H$2:H163))","v":"¢"},162]
[null,null,null,null,null,null,null,{"$f":"CHAR(ROWS(H$2:H164))","v":"£"},163]
[null,null,null,null,null,null,null,{"$f":"CHAR(ROWS(H$2:H165))","v":"¤"},164]
[null,null,null,null,null,null,null,{"$f":"CHAR(ROWS(H$2:H166))","v":"¥"},165]
[null,null,null,null,null,null,null,{"$f":"CHAR(ROWS(H$2:H167))","v":"¦"},166]
[null,null,null,null,null,null,null,{"$f":"CHAR(ROWS(H$2:H168))","v":"§"},167]
[null,null,null,null,null,null,null,{"$f":"CHAR(ROWS(H$2:H169))","v":"¨"},168]
[null,null,null,null,null,null,null,{"$f":"CHAR(ROWS(H$2:H170))","v":"©"},169]
[null,null,null,null,null,null,null,{"$f":"CHAR(ROWS(H$2:H171))","v":"ª"},170]
[null,null,null,null,null,null,null,{"$f":"CHAR(ROWS(H$2:H172))","v":"«"},171]
[null,null,null,null,null,null,null,{"$f":"CHAR(ROWS(H$2:H173))","v":"¬"},172]
[null,null,null,null,null,null,null,{"$f":"CHAR(ROWS(H$2:H174))","v":"­"},173]
[null,null,null,null,null,null,null,{"$f":"CHAR(ROWS(H$2:H175))","v":"®"},174]
[null,null,null,null,null,null,null,{"$f":"CHAR(ROWS(H$2:H176))","v":"¯"},175]
[null,null,null,null,null,null,null,{"$f":"CHAR(ROWS(H$2:H177))","v":"°"},176]
[null,null,null,null,null,null,null,{"$f":"CHAR(ROWS(H$2:H178))","v":"±"},177]
[null,null,null,null,null,null,null,{"$f":"CHAR(ROWS(H$2:H179))","v":"²"},178]
[null,null,null,null,null,null,null,{"$f":"CHAR(ROWS(H$2:H180))","v":"³"},179]
[null,null,null,null,null,null,null,{"$f":"CHAR(ROWS(H$2:H181))","v":"´"},180]
[null,null,null,null,null,null,null,{"$f":"CHAR(ROWS(H$2:H182))","v":"µ"},181]
[null,null,null,null,null,null,null,{"$f":"CHAR(ROWS(H$2:H183))","v":"¶"},182]
[null,null,null,null,null,null,null,{"$f":"CHAR(ROWS(H$2:H184))","v":"·"},183]
[null,null,null,null,null,null,null,{"$f":"CHAR(ROWS(H$2:H185))","v":"¸"},184]
[null,null,null,null,null,null,null,{"$f":"CHAR(ROWS(H$2:H186))","v":"¹"},185]
[null,null,null,null,null,null,null,{"$f":"CHAR(ROWS(H$2:H187))","v":"º"},186]
[null,null,null,null,null,null,null,{"$f":"CHAR(ROWS(H$2:H188))","v":"»"},187]
[null,null,null,null,null,null,null,{"$f":"CHAR(ROWS(H$2:H189))","v":"¼"},188]
[null,null,null,null,null,null,null,{"$f":"CHAR(ROWS(H$2:H190))","v":"½"},189]
[null,null,null,null,null,null,null,{"$f":"CHAR(ROWS(H$2:H191))","v":"¾"},190]
[null,null,null,null,null,null,null,{"$f":"CHAR(ROWS(H$2:H192))","v":"¿"},191]
[null,null,null,null,null,null,null,{"$f":"CHAR(ROWS(H$2:H193))","v":"À"},192]
[null,null,null,null,null,null,null,{"$f":"CHAR(ROWS(H$2:H194))","v":"Á"},{"$f":"CODE(H194)","v":193}]
[null,null,null,null,null,null,null,{"$f":"CHAR(ROWS(H$2:H195))","v":"Â"},194]
[null,null,null,null,null,null,null,{"$f":"CHAR(ROWS(H$2:H196))","v":"Ã"},195]
[null,null,null,null,null,null,null,{"$f":"CHAR(ROWS(H$2:H197))","v":"Ä"},196]
[null,null,null,null,null,null,null,{"$f":"CHAR(ROWS(H$2:H198))","v":"Å"},197]
[null,null,null,null,null,null,null,{"$f":"CHAR(ROWS(H$2:H199))","v":"Æ"},198]
[null,null,null,null,null,null,null,{"$f":"CHAR(ROWS(H$2:H200))","v":"Ç"},199]
[null,null,null,null,null,null,null,{"$f":"CHAR(ROWS(H$2:H201))","v":"È"},200]
[null,null,null,null,null,null,null,{"$f":"CHAR(ROWS(H$2:H202))","v":"É"},201]
[null,null,null,null,null,null,null,{"$f":"CHAR(ROWS(H$2:H203))","v":"Ê"},202]
[null,null,null,null,null,null,null,{"$f":"CHAR(ROWS(H$2:H204))","v":"Ë"},203]
[null,null,null,null,null,null,null,{"$f":"CHAR(ROWS(H$2:H205))","v":"Ì"},204]
[null,null,null,null,null,null,null,{"$f":"CHAR(ROWS(H$2:H206))","v":"Í"},205]
[null,null,null,null,null,null,null,{"$f":"CHAR(ROWS(H$2:H207))","v":"Î"},206]
[null,null,null,null,null,null,null,{"$f":"CHAR(ROWS(H$2:H208))","v":"Ï"},207]
[null,null,null,null,null,null,null,{"$f":"CHAR(ROWS(H$2:H209))","v":"Ð"},208]
[null,null,null,null,null,null,null,{"$f":"CHAR(ROWS(H$2:H210))","v":"Ñ"},209]
[null,null,null,null,null,null,null,{"$f":"CHAR(ROWS(H$2:H211))","v":"Ò"},210]
[null,null,null,null,null,null,null,{"$f":"CHAR(ROWS(H$2:H212))","v":"Ó"},211]
[null,null,null,null,null,null,null,{"$f":"CHAR(ROWS(H$2:H213))","v":"Ô"},212]
[null,null,null,null,null,null,null,{"$f":"CHAR(ROWS(H$2:H214))","v":"Õ"},213]
[null,null,null,null,null,null,null,{"$f":"CHAR(ROWS(H$2:H215))","v":"Ö"},214]
[null,null,null,null,null,null,null,{"$f":"CHAR(ROWS(H$2:H216))","v":"×"},215]
[null,null,null,null,null,null,null,{"$f":"CHAR(ROWS(H$2:H217))","v":"Ø"},216]
[null,null,null,null,null,null,null,{"$f":"CHAR(ROWS(H$2:H218))","v":"Ù"},217]
[null,null,null,null,null,null,null,{"$f":"CHAR(ROWS(H$2:H219))","v":"Ú"},218]
[null,null,null,null,null,null,null,{"$f":"CHAR(ROWS(H$2:H220))","v":"Û"},219]
[null,null,null,null,null,null,null,{"$f":"CHAR(ROWS(H$2:H221))","v":"Ü"},220]
[null,null,null,null,null,null,null,{"$f":"CHAR(ROWS(H$2:H222))","v":"Ý"},221]
[null,null,null,null,null,null,null,{"$f":"CHAR(ROWS(H$2:H223))","v":"Þ"},222]
[null,null,null,null,null,null,null,{"$f":"CHAR(ROWS(H$2:H224))","v":"ß"},223]
[null,null,null,null,null,null,null,{"$f":"CHAR(ROWS(H$2:H225))","v":"à"},224]
[null,null,null,null,null,null,null,{"$f":"CHAR(ROWS(H$2:H226))","v":"á"},225]
[null,null,null,null,null,null,null,{"$f":"CHAR(ROWS(H$2:H227))","v":"â"},226]
[null,null,null,null,null,null,null,{"$f":"CHAR(ROWS(H$2:H228))","v":"ã"},227]
[null,null,null,null,null,null,null,{"$f":"CHAR(ROWS(H$2:H229))","v":"ä"},228]
[null,null,null,null,null,null,null,{"$f":"CHAR(ROWS(H$2:H230))","v":"å"},229]
[null,null,null,null,null,null,null,{"$f":"CHAR(ROWS(H$2:H231))","v":"æ"},230]
[null,null,null,null,null,null,null,{"$f":"CHAR(ROWS(H$2:H232))","v":"ç"},231]
[null,null,null,null,null,null,null,{"$f":"CHAR(ROWS(H$2:H233))","v":"è"},232]
[null,null,null,null,null,null,null,{"$f":"CHAR(ROWS(H$2:H234))","v":"é"},233]
[null,null,null,null,null,null,null,{"$f":"CHAR(ROWS(H$2:H235))","v":"ê"},234]
[null,null,null,null,null,null,null,{"$f":"CHAR(ROWS(H$2:H236))","v":"ë"},235]
[null,null,null,null,null,null,null,{"$f":"CHAR(ROWS(H$2:H237))","v":"ì"},236]
[null,null,null,null,null,null,null,{"$f":"CHAR(ROWS(H$2:H238))","v":"í"},237]
[null,null,null,null,null,null,null,{"$f":"CHAR(ROWS(H$2:H239))","v":"î"},238]
[null,null,null,null,null,null,null,{"$f":"CHAR(ROWS(H$2:H240))","v":"ï"},239]
[null,null,null,null,null,null,null,{"$f":"CHAR(ROWS(H$2:H241))","v":"ð"},240]
[null,null,null,null,null,null,null,{"$f":"CHAR(ROWS(H$2:H242))","v":"ñ"},241]
[null,null,null,null,null,null,null,{"$f":"CHAR(ROWS(H$2:H243))","v":"ò"},242]
[null,null,null,null,null,null,null,{"$f":"CHAR(ROWS(H$2:H244))","v":"ó"},243]
[null,null,null,null,null,null,null,{"$f":"CHAR(ROWS(H$2:H245))","v":"ô"},244]
[null,null,null,null,null,null,null,{"$f":"CHAR(ROWS(H$2:H246))","v":"õ"},245]
[null,null,null,null,null,null,null,{"$f":"CHAR(ROWS(H$2:H247))","v":"ö"},246]
[null,null,null,null,null,null,null,{"$f":"CHAR(ROWS(H$2:H248))","v":"÷"},247]
[null,null,null,null,null,null,null,{"$f":"CHAR(ROWS(H$2:H249))","v":"ø"},248]
[null,null,null,null,null,null,null,{"$f":"CHAR(ROWS(H$2:H250))","v":"ù"},249]
[null,null,null,null,null,null,null,{"$f":"CHAR(ROWS(H$2:H251))","v":"ú"},250]
[null,null,null,null,null,null,null,{"$f":"CHAR(ROWS(H$2:H252))","v":"û"},251]
[null,null,null,null,null,null,null,{"$f":"CHAR(ROWS(H$2:H253))","v":"ü"},252]
[null,null,null,null,null,null,null,{"$f":"CHAR(ROWS(H$2:H254))","v":"ý"},253]
[null,null,null,null,null,null,null,{"$f":"CHAR(ROWS(H$2:H255))","v":"þ"},254]
[null,null,null,null,null,null,null,{"$f":"CHAR(ROWS(H$2:H256))","v":"ÿ"},{"$f":"CODE(H256)","v":255}]

{"sheet":"S(5)","index":87,"n_rows":17,"n_cols":3,"rows_kept":17,"cut":false,"hidden":false,"merged":[]}
["Invoice #","Sales","City"]
[23004,280,"Seattle"]
[23005,691,"Kent"]
[23006,713,"Seattle"]
[23007,305,"Kent"]
[23008,178,"Seattle"]
[23009,512,"Kent"]
[23010,893,"Kent"]
[23011,645,"Kent"]
[23012,907,"Kent"]
[23013,615,"Tacoma"]
[23014,834,"Seattle"]
[23015,670,"Tacoma"]
[23016,146,"Seattle"]
[23017,666,"Tacoma"]
[23018,598,"Kent"]
[23019,821,"Kent"]

{"sheet":"S(6)","index":88,"n_rows":12,"n_cols":4,"rows_kept":12,"cut":false,"hidden":false,"merged":[]}
["Prospective Customers","Is Name In Master List?",null,"Master List"]
["Acquaviva Company",{"$f":"MATCH(A2,$D$2:$D$12,0)","v":{"$error":"#N/A"}},null,"Manfre Company"]
["Grabenstein Company",{"$error":"#N/A"},null,"Degen Company"]
["Rana Company",{"$error":"#N/A"},null,"Farthing Company"]
["Shiroma Company",{"$error":"#N/A"},null,"Blose Company"]
["Wootton Company",{"$error":"#N/A"},null,"Spafford Company"]
["Yarrington Company",{"$error":"#N/A"},null,"Tarnowski Company"]
[null,null,null,"Alameda Company"]
[null,null,null,"Prestwich Company"]
[null,null,null,"Rommel Company"]
[null,null,null,"Haecker Company"]
[null,null,null,"Jeong Company"]

{"sheet":"S(7)","index":89,"n_rows":11,"n_cols":4,"rows_kept":11,"cut":false,"hidden":false,"merged":[]}
["Names For Presetations",null,"Names For Presetations","Order - RAND()"]
["Steve Stephan",null,"Eugene Deutsch",{"$f":"RAND()","v":0.22588984739812024}]
["Roy Mattingly",null,"Elaine Lash",0.71258908083474004]
["Matthew Mosley",null,"Jerry Wertz",9.1627186425351281E-2]
["Juan Singley",null,"Audrey Hinton",0.29287814430285142]
["Jerry Wertz",null,"Amy Burnell",0.19220106145010518]
["Eugene Deutsch",null,"Matthew Mosley",0.31738332763720678]
["Elaine Lash",null,"Roy Mattingly",0.24854090054051436]
["Charles Feeney",null,"Charles Feeney",0.66007783809908827]
["Audrey Hinton",null,"Steve Stephan",4.4874224805215301E-2]
["Amy Burnell",null,"Juan Singley",0.85891366628326138]

{"sheet":"S(8)","index":90,"n_rows":1,"n_cols":11,"rows_kept":1,"cut":false,"hidden":false,"merged":[]}
["Sample Data",1.1000000000000001,1.3,1.7,2.2999999999999998,2.2999999999999998,2.7,4.3,5.2,6.4,6.8]

{"sheet":"S(9)","index":91,"n_rows":11,"n_cols":4,"rows_kept":11,"cut":false,"hidden":false,"merged":[]}
["Date","Customer","Sales","E-mail"]
["2011-01-17","Cust3",{"$f":"INT(RAND()*800+80)","v":732},"DZ[@ourbiz.com"]
["2011-01-21","Cust7",253,"NZE@ourbiz.com"]
["2011-01-16","Cust2",574,"HTS@ourbiz.com"]
["2011-01-19","Cust5",517,"IQH@ourbiz.com"]
["2011-01-22","Cust8",467,"NUR@ourbiz.com"]
["2011-01-15","Cust1",662,"CJP@ourbiz.com"]
["2011-01-18","Cust4",439,"JPJ@ourbiz.com"]
["2011-01-20","Cust6",829,"ODL@ourbiz.com"]
["2011-01-23","Cust9",774,"CZU@ourbiz.com"]
["2011-01-24","Cust10",588,"PYL@ourbiz.com"]

{"sheet":"S(10)","index":92,"n_rows":106,"n_cols":8,"rows_kept":106,"cut":false,"hidden":false,"merged":[]}
["Date","Product","Region","SalesRep","Customer","Units","Sales","COGS"]
["2011-01-28","Sunset","West","Chin","FM",62,1302,573.5]
["2011-01-08","Quad","West","Chin","HII",16,432,232]
["2011-01-17","Quad","West","Chin","PCC",10,270,145]
["2011-01-05","Carlota","West","Franks","ITTW",60,1380,660]
["2011-01-05","Sunshine","West","Franks","ET",12,228,96]
["2011-01-24","Quad","West","Gault","HII",63,1701,913.5]
["2011-01-21","Quad","West","Gault","ITW",56,1512,812]
["2011-01-30","Sunshine","West","Gault","DFR",49,931,392]
["2011-01-27","Carlota","West","Gault","QT",10,230,110]
["2011-01-26","Bellen","West","Pham","FRED",61,5000,610]
["2011-01-07","Sunset","West","Pham","T",61,1281,564.25]
["2011-01-22","Bellen","West","Pham","AST",53,1166,530]
["2011-01-07","Sunset","West","Pham","WT",53,1113,490.25]
["2011-01-02","Quad","West","Pham","AST",30,810,435]
["2011-01-02","Bellen","West","Pham","SFWK",19,418,190]
["2011-01-06","Quad","West","Sioux","PCC",64,1728,928]
["2011-01-20","Sunshine","West","Sioux","YTR",58,1102,464]
["2011-01-22","Bellen","West","Sioux","YTR",35,770,350]
["2011-01-06","Carlota","West","Sioux","KPSA",18,414,198]
["2011-01-18","Sunshine","West","Sioux","AST",8,152,64]
["2011-01-10","Quad","West","Smith","KBTB",65,1755,942.5]
["2011-01-07","Bellen","West","Smith","T",27,594,270]
["2011-01-28","Carlota","West","Smith","LOP",15,345,165]
["2011-01-22","Bellen","West","Smith","WT",6,132,60]
["2011-01-23","Sunshine","South","Chin","T",49,931,392]
["2011-01-09","Bellen","South","Chin","WSD",26,572,260]
["2011-01-10","Sunshine","South","Chin","TRU",30,570,240]
["2011-01-12","Bellen","South","Chin","WT",7,154,70]
["2011-01-28","Quad","South","Franks","YTR",44,1188,638]
["2011-01-28","Carlota","South","Franks","MNGD",46,1058,506]
["2011-01-22","Quad","South","Franks","FM",29,783,420.5]
["2011-01-28","Quad","South","Gault","KBTB",56,1512,812]
["2011-01-02","Bellen","South","Gault","KBTB",24,528,240]
["2011-01-05","Sunset","South","Pham","TTT",57,1197,527.25]
["2011-01-03","Sunset","South","Pham","WSD",23,483,212.75]
["2011-01-21","Sunset","South","Pham","HHH",13,273,120.25]
["2011-01-10","Sunset","South","Sioux","MBG",47,987,434.75]
["2011-01-26","Sunset","South","Sioux","DFGH",44,924,407]
["2011-01-19","Bellen","South","Sioux","T",35,770,350]
["2011-01-30","Quad","South","Sioux","TTT",25,675,362.5]
["2011-01-28","Bellen","South","Sioux","QT",25,550,250]
["2011-01-30","Sunshine","South","Sioux","TTT",23,437,184]
["2011-01-09","Bellen","South","Sioux","QT",15,330,150]
["2011-01-03","Sunshine","South","Sioux","PCC",6,114,48]
["2011-01-18","Carlota","South","Smith","YTR",53,1219,583]
["2011-01-13","Carlota","South","Smith","FM",52,1196,572]
["2011-01-28","Sunshine","South","Smith","FRED",51,969,408]
["2011-01-06","Sunshine","South","Smith","QT",40,760,320]
["2011-01-16","Carlota","South","Smith","QT",31,713,341]
["2011-01-22","Carlota","South","Smith","KBTB",29,667,319]
["2011-01-21","Bellen","South","Smith","TRU",11,242,110]
["2011-01-17","Quad","MidWest","Chin","EPP",61,1647,884.5]
["2011-01-18","Sunshine","MidWest","Chin","PCC",62,1178,496]
["2011-01-03","Carlota","MidWest","Chin","FM",20,460,220]
["2011-01-15","Sunshine","MidWest","Chin","YTR",11,209,88]
["2011-01-17","Sunshine","MidWest","Franks","HHH",59,1121,472]
["2011-01-25","Sunshine","MidWest","Franks","JAQ",21,399,168]
["2011-01-24","Carlota","MidWest","Franks","BBT",13,299,143]
["2011-01-07","Carlota","MidWest","Franks","HHH",12,276,132]
["2011-01-26","Bellen","MidWest","Gault","PSA",21,462,210]
["2011-01-12","Sunset","MidWest","Gault","ITW",19,399,175.75]
["2011-01-29","Quad","MidWest","Gault","PLOT",10,270,145]
["2011-01-10","Bellen","MidWest","Gault","FM",7,154,70]
["2011-01-13","Bellen","MidWest","Pham","PLOT",57,1254,570]
["2011-01-13","Bellen","MidWest","Pham","PSA",40,880,400]
["2011-01-13","Sunshine","MidWest","Pham","PSA",33,627,264]
["2011-01-21","Sunshine","MidWest","Pham","DFR",23,437,184]
["2011-01-16","Bellen","MidWest","Sioux","YTR",56,1232,560]
["2011-01-04","Sunset","MidWest","Sioux","BBT",29,609,268.25]
["2011-01-07","Sunset","MidWest","Sioux","PCC",22,462,203.5]
["2011-01-21","Sunshine","MidWest","Smith","QT",64,1216,512]
["2011-01-28","Quad","MidWest","Smith","YTR",42,1134,609]
["2011-01-18","Quad","MidWest","Smith","PLOT",17,459,246.5]
["2011-01-17","Bellen","MidWest","Smith","PCC",16,352,160]
["2011-01-10","Sunshine","MidWest","Smith","TTT",8,152,64]
["2011-01-21","Quad","East","Chin","FM",58,1566,841]
["2011-01-20","Carlota","East","Chin","ET",59,1357,649]
["2011-01-29","Bellen","East","Chin","AST",50,1100,500]
["2011-01-26","Bellen","East","Chin","KPSA",17,374,170]
["2011-01-17","Quad","East","Franks","HII",62,1674,899]
["2011-01-23","Quad","East","Franks","PCC",44,1188,638]
["2011-01-06","Sunshine","East","Franks","PSA",54,1026,432]
["2011-01-09","Carlota","East","Franks","WSD",38,874,418]
["2011-01-14","Carlota","East","Franks","JAQ",34,782,374]
["2011-01-18","Sunshine","East","Franks","AA",24,456,192]
["2011-01-18","Bellen","East","Franks","DFGH",20,440,200]
["2011-01-11","Quad","East","Franks","ITW",14,378,203]
["2011-01-15","Sunset","East","Gault","AST",63,1323,582.75]
["2011-01-17","Quad","East","Gault","SFWK",43,1161,623.5]
["2011-01-10","Sunset","East","Gault","TRU",27,567,249.75]
["2011-01-18","Sunset","East","Gault","MNGD",12,252,111]
["2011-01-20","Bellen","East","Gault","PSA",10,220,100]
["2011-01-23","Bellen","East","Gault","DFGH",9,198,90]
["2011-01-10","Carlota","East","Pham","AA",63,1449,693]
["2011-01-18","Bellen","East","Pham","DFR",59,1298,590]
["2011-01-09","Bellen","East","Pham","EPP",40,880,400]
["2011-01-03","Sunshine","East","Pham","FM",38,722,304]
["2011-01-23","Quad","East","Pham","WT",22,594,319]
["2011-01-17","Carlota","East","Sioux","PCC",39,897,429]
["2011-01-01","Quad","East","Sioux","AA",16,432,232]
["2011-01-11","Quad","East","Smith","BBT",49,1323,710.5]
["2011-01-09","Sunshine","East","Smith","PCC",42,798,336]
["2011-01-28","Sunset","East","Smith","ZAT",36,756,333]
["2011-01-10","Quad","East","Smith","DFR",17,459,246.5]
["2011-01-10","Sunset","East","Smith","MBG",17,357,157.25]

{"sheet":"S(11)","index":93,"n_rows":11,"n_cols":1,"rows_kept":11,"cut":false,"hidden":false,"merged":[]}
["Names For Presetations"]
["Steve Stephan"]
["Audrey Hinton"]
["Eugene Deutsch"]
["Elaine Lash"]
["Jerry Wertz"]
["Amy Burnell"]
["Charles Feeney"]
["Juan Singley"]
["Roy Mattingly"]
["Matthew Mosley"]

{"sheet":"ST(1)","index":94,"n_rows":113,"n_cols":8,"rows_kept":113,"cut":false,"hidden":false,"merged":[]}
["Date","Product","Region","SalesRep","Customer","Units","Sales","COGS"]
["2011-01-20","Carlota","East","Chin","ET",59,1357,649]
["2011-01-21","Quad","East","Chin","FM",58,1566,841]
["2011-01-26","Bellen","East","Chin","KPSA",17,374,170]
["2011-01-29","Bellen","East","Chin","AST",50,1100,500]
["2011-01-03","Carlota","MidWest","Chin","FM",20,460,220]
["2011-01-15","Sunshine","MidWest","Chin","YTR",11,209,88]
["2011-01-17","Quad","MidWest","Chin","EPP",61,1647,884.5]
["2011-01-18","Sunshine","MidWest","Chin","PCC",62,1178,496]
["2011-01-09","Bellen","South","Chin","WSD",26,572,260]
["2011-01-10","Sunshine","South","Chin","TRU",30,570,240]
["2011-01-12","Bellen","South","Chin","WT",7,154,70]
["2011-01-23","Sunshine","South","Chin","T",49,931,392]
["2011-01-08","Quad","West","Chin","HII",16,432,232]
["2011-01-17","Quad","West","Chin","PCC",10,270,145]
["2011-01-28","Sunset","West","Chin","FM",62,1302,573.5]
[null,null,"Chin Count",{"$f":"SUBTOTAL(3,D2:D16)","v":15}]
["2011-01-06","Sunshine","East","Franks","PSA",54,1026,432]
["2011-01-09","Carlota","East","Franks","WSD",38,874,418]
["2011-01-11","Quad","East","Franks","ITW",14,378,203]
["2011-01-14","Carlota","East","Franks","JAQ",34,782,374]
["2011-01-17","Quad","East","Franks","HII",62,1674,899]
["2011-01-18","Bellen","East","Franks","DFGH",20,440,200]
["2011-01-18","Sunshine","East","Franks","AA",24,456,192]
["2011-01-23","Quad","East","Franks","PCC",44,1188,638]
["2011-01-07","Carlota","MidWest","Franks","HHH",12,276,132]
["2011-01-17","Sunshine","MidWest","Franks","HHH",59,1121,472]
["2011-01-24","Carlota","MidWest","Franks","BBT",13,299,143]
["2011-01-25","Sunshine","MidWest","Franks","JAQ",21,399,168]
["2011-01-22","Quad","South","Franks","FM",29,783,420.5]
["2011-01-28","Carlota","South","Franks","MNGD",46,1058,506]
["2011-01-28","Quad","South","Franks","YTR",44,1188,638]
["2011-01-05","Carlota","West","Franks","ITTW",60,1380,660]
["2011-01-05","Sunshine","West","Franks","ET",12,228,96]
[null,null,"Franks Count",{"$f":"SUBTOTAL(3,D18:D34)","v":17}]
["2011-01-10","Sunset","East","Gault","TRU",27,567,249.75]
["2011-01-15","Sunset","East","Gault","AST",63,1323,582.75]
["2011-01-17","Quad","East","Gault","SFWK",43,1161,623.5]
["2011-01-18","Sunset","East","Gault","MNGD",12,252,111]
["2011-01-20","Bellen","East","Gault","PSA",10,220,100]
["2011-01-23","Bellen","East","Gault","DFGH",9,198,90]
["2011-01-10","Bellen","MidWest","Gault","FM",7,154,70]
["2011-01-12","Sunset","MidWest","Gault","ITW",19,399,175.75]
["2011-01-26","Bellen","MidWest","Gault","PSA",21,462,210]
["2011-01-29","Quad","MidWest","Gault","PLOT",10,270,145]
["2011-01-02","Bellen","South","Gault","KBTB",24,528,240]
["2011-01-28","Quad","South","Gault","KBTB",56,1512,812]
["2011-01-21","Quad","West","Gault","ITW",56,1512,812]
["2011-01-24","Quad","West","Gault","HII",63,1701,913.5]
["2011-01-27","Carlota","West","Gault","QT",10,230,110]
["2011-01-30","Sunshine","West","Gault","DFR",49,931,392]
[null,null,"Gault Count",{"$f":"SUBTOTAL(3,D36:D51)","v":16}]
["2011-01-03","Sunshine","East","Pham","FM",38,722,304]
["2011-01-09","Bellen","East","Pham","EPP",40,880,400]
["2011-01-10","Carlota","East","Pham","AA",63,1449,693]
["2011-01-18","Bellen","East","Pham","DFR",59,1298,590]
["2011-01-23","Quad","East","Pham","WT",22,594,319]
["2011-01-13","Bellen","MidWest","Pham","PLOT",57,1254,570]
["2011-01-13","Bellen","MidWest","Pham","PSA",40,880,400]
["2011-01-13","Sunshine","MidWest","Pham","PSA",33,627,264]
["2011-01-21","Sunshine","MidWest","Pham","DFR",23,437,184]
["2011-01-03","Sunset","South","Pham","WSD",23,483,212.75]
["2011-01-05","Sunset","South","Pham","TTT",57,1197,527.25]
["2011-01-21","Sunset","South","Pham","HHH",13,273,120.25]
["2011-01-02","Bellen","West","Pham","SFWK",19,418,190]
["2011-01-02","Quad","West","Pham","AST",30,810,435]
["2011-01-07","Sunset","West","Pham","T",61,1281,564.25]
["2011-01-07","Sunset","West","Pham","WT",53,1113,490.25]
["2011-01-22","Bellen","West","Pham","AST",53,1166,530]
["2011-01-26","Bellen","West","Pham","FRED",61,5000,610]
[null,null,"Pham Count",{"$f":"SUBTOTAL(3,D53:D70)","v":18}]
["2011-01-01","Quad","East","Sioux","AA",16,432,232]
["2011-01-17","Carlota","East","Sioux","PCC",39,897,429]
["2011-01-04","Sunset","MidWest","Sioux","BBT",29,609,268.25]
["2011-01-07","Sunset","MidWest","Sioux","PCC",22,462,203.5]
["2011-01-16","Bellen","MidWest","Sioux","YTR",56,1232,560]
["2011-01-03","Sunshine","South","Sioux","PCC",6,114,48]
["2011-01-09","Bellen","South","Sioux","QT",15,330,150]
["2011-01-10","Sunset","South","Sioux","MBG",47,987,434.75]
["2011-01-19","Bellen","South","Sioux","T",35,770,350]
["2011-01-26","Sunset","South","Sioux","DFGH",44,924,407]
["2011-01-28","Bellen","South","Sioux","QT",25,550,250]
["2011-01-30","Quad","South","Sioux","TTT",25,675,362.5]
["2011-01-30","Sunshine","South","Sioux","TTT",23,437,184]
["2011-01-06","Carlota","West","Sioux","KPSA",18,414,198]
["2011-01-06","Quad","West","Sioux","PCC",64,1728,928]
["2011-01-18","Sunshine","West","Sioux","AST",8,152,64]
["2011-01-20","Sunshine","West","Sioux","YTR",58,1102,464]
["2011-01-22","Bellen","West","Sioux","YTR",35,770,350]
[null,null,"Sioux Count",{"$f":"SUBTOTAL(3,D72:D89)","v":18}]
["2011-01-09","Sunshine","East","Smith","PCC",42,798,336]
["2011-01-10","Quad","East","Smith","DFR",17,459,246.5]
["2011-01-10","Sunset","East","Smith","MBG",17,357,157.25]
["2011-01-11","Quad","East","Smith","BBT",49,1323,710.5]
["2011-01-28","Sunset","East","Smith","ZAT",36,756,333]
["2011-01-10","Sunshine","MidWest","Smith","TTT",8,152,64]
["2011-01-17","Bellen","MidWest","Smith","PCC",16,352,160]
["2011-01-18","Quad","MidWest","Smith","PLOT",17,459,246.5]
["2011-01-21","Sunshine","MidWest","Smith","QT",64,1216,512]
["2011-01-28","Quad","MidWest","Smith","YTR",42,1134,609]
["2011-01-06","Sunshine","South","Smith","QT",40,760,320]
["2011-01-13","Carlota","South","Smith","FM",52,1196,572]
["2011-01-16","Carlota","South","Smith","QT",31,713,341]
["2011-01-18","Carlota","South","Smith","YTR",53,1219,583]
["2011-01-21","Bellen","South","Smith","TRU",11,242,110]
["2011-01-22","Carlota","South","Smith","KBTB",29,667,319]
["2011-01-28","Sunshine","South","Smith","FRED",51,969,408]
["2011-01-07","Bellen","West","Smith","T",27,594,270]
["2011-01-10","Quad","West","Smith","KBTB",65,1755,942.5]
["2011-01-22","Bellen","West","Smith","WT",6,132,60]
["2011-01-28","Carlota","West","Smith","LOP",15,345,165]
[null,null,"Smith Count",{"$f":"SUBTOTAL(3,D91:D111)","v":21}]
[null,null,"Grand Count",{"$f":"SUBTOTAL(3,D2:D111)","v":105}]

{"sheet":"STpaste","index":95,"n_rows":6,"n_cols":8,"rows_kept":6,"cut":false,"hidden":false,"merged":[]}
["Date","Product","Region","SalesRep","Customer","Units","Sales","COGS"]
[null,null,"East Total",null,null,1076,24901,12023.25]
[null,null,"MidWest Total",null,null,723,15688,7245.5]
[null,null,"South Total",null,null,891,19802,9278]
[null,null,"West Total",null,null,911,24766,10195]
[null,null,"Grand Total",null,null,3601,85157,38741.75]

{"sheet":"ST(2)","index":96,"n_rows":106,"n_cols":8,"rows_kept":106,"cut":false,"hidden":false,"merged":[]}
["Date","Product","Region","SalesRep","Customer","Units","Sales","COGS"]
["2011-01-20","Carlota","East","Chin","ET",59,1357,649]
["2011-01-21","Quad","East","Chin","FM",58,1566,841]
["2011-01-26","Bellen","East","Chin","KPSA",17,374,170]
["2011-01-29","Bellen","East","Chin","AST",50,1100,500]
["2011-01-06","Sunshine","East","Franks","PSA",54,1026,432]
["2011-01-09","Carlota","East","Franks","WSD",38,874,418]
["2011-01-11","Quad","East","Franks","ITW",14,378,203]
["2011-01-14","Carlota","East","Franks","JAQ",34,782,374]
["2011-01-17","Quad","East","Franks","HII",62,1674,899]
["2011-01-18","Sunshine","East","Franks","AA",24,456,192]
["2011-01-18","Bellen","East","Franks","DFGH",20,440,200]
["2011-01-23","Quad","East","Franks","PCC",44,1188,638]
["2011-01-10","Sunset","East","Gault","TRU",27,567,249.75]
["2011-01-15","Sunset","East","Gault","AST",63,1323,582.75]
["2011-01-17","Quad","East","Gault","SFWK",43,1161,623.5]
["2011-01-18","Sunset","East","Gault","MNGD",12,252,111]
["2011-01-20","Bellen","East","Gault","PSA",10,220,100]
["2011-01-23","Bellen","East","Gault","DFGH",9,198,90]
["2011-01-03","Sunshine","East","Pham","FM",38,722,304]
["2011-01-09","Bellen","East","Pham","EPP",40,880,400]
["2011-01-10","Carlota","East","Pham","AA",63,1449,693]
["2011-01-18","Bellen","East","Pham","DFR",59,1298,590]
["2011-01-23","Quad","East","Pham","WT",22,594,319]
["2011-01-01","Quad","East","Sioux","AA",16,432,232]
["2011-01-17","Carlota","East","Sioux","PCC",39,897,429]
["2011-01-09","Sunshine","East","Smith","PCC",42,798,336]
["2011-01-10","Quad","East","Smith","DFR",17,459,246.5]
["2011-01-10","Sunset","East","Smith","MBG",17,357,157.25]
["2011-01-11","Quad","East","Smith","BBT",49,1323,710.5]
["2011-01-28","Sunset","East","Smith","ZAT",36,756,333]
["2011-01-03","Carlota","MidWest","Chin","FM",20,460,220]
["2011-01-15","Sunshine","MidWest","Chin","YTR",11,209,88]
["2011-01-17","Quad","MidWest","Chin","EPP",61,1647,884.5]
["2011-01-18","Sunshine","MidWest","Chin","PCC",62,1178,496]
["2011-01-07","Carlota","MidWest","Franks","HHH",12,276,132]
["2011-01-17","Sunshine","MidWest","Franks","HHH",59,1121,472]
["2011-01-24","Carlota","MidWest","Franks","BBT",13,299,143]
["2011-01-25","Sunshine","MidWest","Franks","JAQ",21,399,168]
["2011-01-10","Bellen","MidWest","Gault","FM",7,154,70]
["2011-01-12","Sunset","MidWest","Gault","ITW",19,399,175.75]
["2011-01-26","Bellen","MidWest","Gault","PSA",21,462,210]
["2011-01-29","Quad","MidWest","Gault","PLOT",10,270,145]
["2011-01-13","Bellen","MidWest","Pham","PLOT",57,1254,570]
["2011-01-13","Sunshine","MidWest","Pham","PSA",33,627,264]
["2011-01-13","Bellen","MidWest","Pham","PSA",40,880,400]
["2011-01-21","Sunshine","MidWest","Pham","DFR",23,437,184]
["2011-01-04","Sunset","MidWest","Sioux","BBT",29,609,268.25]
["2011-01-07","Sunset","MidWest","Sioux","PCC",22,462,203.5]
["2011-01-16","Bellen","MidWest","Sioux","YTR",56,1232,560]
["2011-01-10","Sunshine","MidWest","Smith","TTT",8,152,64]
["2011-01-17","Bellen","MidWest","Smith","PCC",16,352,160]
["2011-01-18","Quad","MidWest","Smith","PLOT",17,459,246.5]
["2011-01-21","Sunshine","MidWest","Smith","QT",64,1216,512]
["2011-01-28","Quad","MidWest","Smith","YTR",42,1134,609]
["2011-01-09","Bellen","South","Chin","WSD",26,572,260]
["2011-01-10","Sunshine","South","Chin","TRU",30,570,240]
["2011-01-12","Bellen","South","Chin","WT",7,154,70]
["2011-01-23","Sunshine","South","Chin","T",49,931,392]
["2011-01-22","Quad","South","Franks","FM",29,783,420.5]
["2011-01-28","Carlota","South","Franks","MNGD",46,1058,506]
["2011-01-28","Quad","South","Franks","YTR",44,1188,638]
["2011-01-02","Bellen","South","Gault","KBTB",24,528,240]
["2011-01-28","Quad","South","Gault","KBTB",56,1512,812]
["2011-01-03","Sunset","South","Pham","WSD",23,483,212.75]
["2011-01-05","Sunset","South","Pham","TTT",57,1197,527.25]
["2011-01-21","Sunset","South","Pham","HHH",13,273,120.25]
["2011-01-03","Sunshine","South","Sioux","PCC",6,114,48]
["2011-01-09","Bellen","South","Sioux","QT",15,330,150]
["2011-01-10","Sunset","South","Sioux","MBG",47,987,434.75]
["2011-01-19","Bellen","South","Sioux","T",35,770,350]
["2011-01-26","Sunset","South","Sioux","DFGH",44,924,407]
["2011-01-28","Bellen","South","Sioux","QT",25,550,250]
["2011-01-30","Sunshine","South","Sioux","TTT",23,437,184]
["2011-01-30","Quad","South","Sioux","TTT",25,675,362.5]
["2011-01-06","Sunshine","South","Smith","QT",40,760,320]
["2011-01-13","Carlota","South","Smith","FM",52,1196,572]
["2011-01-16","Carlota","South","Smith","QT",31,713,341]
["2011-01-18","Carlota","South","Smith","YTR",53,1219,583]
["2011-01-21","Bellen","South","Smith","TRU",11,242,110]
["2011-01-22","Carlota","South","Smith","KBTB",29,667,319]
["2011-01-28","Sunshine","South","Smith","FRED",51,969,408]
["2011-01-08","Quad","West","Chin","HII",16,432,232]
["2011-01-17","Quad","West","Chin","PCC",10,270,145]
["2011-01-28","Sunset","West","Chin","FM",62,1302,573.5]
["2011-01-05","Sunshine","West","Franks","ET",12,228,96]
["2011-01-05","Carlota","West","Franks","ITTW",60,1380,660]
["2011-01-21","Quad","West","Gault","ITW",56,1512,812]
["2011-01-24","Quad","West","Gault","HII",63,1701,913.5]
["2011-01-27","Carlota","West","Gault","QT",10,230,110]
["2011-01-30","Sunshine","West","Gault","DFR",49,931,392]
["2011-01-02","Quad","West","Pham","AST",30,810,435]
["2011-01-02","Bellen","West","Pham","SFWK",19,418,190]
["2011-01-07","Sunset","West","Pham","T",61,1281,564.25]
["2011-01-07","Sunset","West","Pham","WT",53,1113,490.25]
["2011-01-22","Bellen","West","Pham","AST",53,1166,530]
["2011-01-26","Bellen","West","Pham","FRED",61,5000,610]
["2011-01-06","Carlota","West","Sioux","KPSA",18,414,198]
["2011-01-06","Quad","West","Sioux","PCC",64,1728,928]
["2011-01-18","Sunshine","West","Sioux","AST",8,152,64]
["2011-01-20","Sunshine","West","Sioux","YTR",58,1102,464]
["2011-01-22","Bellen","West","Sioux","YTR",35,770,350]
["2011-01-07","Bellen","West","Smith","T",27,594,270]
["2011-01-10","Quad","West","Smith","KBTB",65,1755,942.5]
["2011-01-22","Bellen","West","Smith","WT",6,132,60]
["2011-01-28","Carlota","West","Smith","LOP",15,345,165]

{"sheet":"ST PT C","index":97,"n_rows":27,"n_cols":9,"rows_kept":27,"cut":false,"hidden":false,"merged":[]}
["11 Functions for SUBTOTAL function"]
["Function_num\n(includes hidden values)","Function_num\n(ignores hidden values)","What you see in Subtotal \"Use function\" drop-down","Function","What it does"]
[1,101,"Average","AVERAGE","Calculates arithmetic mean"]
[2,102,"Count Numbers","COUNT","Counts numbers"]
[3,103,"Count","COUNTA","Counts non empty cells"]
[4,104,"Max","MAX","Finds largest value"]
[5,105,"Min","MIN","Finds smallest value"]
[6,106,"Product","PRODUCT","Multiplies"]
[7,107,"Stdev","STDEV","Standard Deviation for a sample"]
[8,108,"Stdevp","STDEVP","Standard Deviation for a population"]
[9,109,"Sum","SUM","Adds"]
[10,110,"Var","VAR","Variation for a sample"]
[11,111,"Varp","VARP","Variation for a population"]
[]
[null,null,null,null,null,null,"11 Functions available in a PivotTable"]
[null,null,null,null,null,null,"What you see in Value Field Settings dialog box","Function","What it does"]
[null,null,null,null,null,null,"Average","AVERAGE","Calculates arithmetic mean"]
[null,null,null,null,null,null,"Count Numbers","COUNT","Counts numbers"]
[null,null,null,null,null,null,"Count","COUNTA","Counts non empty cells"]
[null,null,null,null,null,null,"Max","MAX","Finds largest value"]
[null,null,null,null,null,null,"Min","MIN","Finds smallest value"]
[null,null,null,null,null,null,"Product","PRODUCT","Multiplies"]
[null,null,null,null,null,null,"Stdev","STDEV","Standard Deviation for a sample"]
[null,null,null,null,null,null,"Stdevp","STDEVP","Standard Deviation for a population"]
[null,null,null,null,null,null,"Sum","SUM","Adds"]
[null,null,null,null,null,null,"Var","VAR","Variation for a sample"]
[null,null,null,null,null,null,"Varp","VARP","Variation for a population"]

{"sheet":"PT1","index":98,"n_rows":11,"n_cols":6,"rows_kept":11,"cut":false,"hidden":false,"merged":[]}
[]
[]
["Sum of Sales","Region"]
["SalesRep","East","MidWest","South","West","Grand Total"]
["Chin",4397,3494,2227,2004,12122]
["Franks",6818,2095,3029,1608,13550]
["Gault",3721,1285,2040,4374,11420]
["Pham",4943,3198,1953,9788,19882]
["Sioux",1329,2303,4787,4166,12585]
["Smith",3693,3313,5766,2826,15598]
["Grand Total",24901,15688,19802,24766,85157]

{"sheet":"PTData","index":99,"n_rows":106,"n_cols":8,"rows_kept":106,"cut":false,"hidden":false,"merged":[]}
["Date","Product","Region","SalesRep","Customer","Units","Sales","COGS"]
["2011-01-01","Quad","East","Sioux","AA",16,432,232]
["2011-01-02","Bellen","South","Gault","KBTB",24,528,240]
["2011-01-02","Quad","West","Pham","AST",30,810,435]
["2011-01-02","Bellen","West","Pham","SFWK",19,418,190]
["2011-01-03","Sunshine","East","Pham","FM",38,722,304]
["2011-01-03","Carlota","MidWest","Chin","FM",20,460,220]
["2011-01-03","Sunset","South","Pham","WSD",23,483,212.75]
["2011-01-03","Sunshine","South","Sioux","PCC",6,114,48]
["2011-01-04","Sunset","MidWest","Sioux","BBT",29,609,268.25]
["2011-01-05","Sunset","South","Pham","TTT",57,1197,527.25]
["2011-01-05","Sunshine","West","Franks","ET",12,228,96]
["2011-01-05","Carlota","West","Franks","ITTW",60,1380,660]
["2011-01-06","Sunshine","East","Franks","PSA",54,1026,432]
["2011-01-06","Sunshine","South","Smith","QT",40,760,320]
["2011-01-06","Carlota","West","Sioux","KPSA",18,414,198]
["2011-01-06","Quad","West","Sioux","PCC",64,1728,928]
["2011-01-07","Carlota","MidWest","Franks","HHH",12,276,132]
["2011-01-07","Sunset","MidWest","Sioux","PCC",22,462,203.5]
["2011-01-07","Sunset","West","Pham","T",61,1281,564.25]
["2011-01-07","Sunset","West","Pham","WT",53,1113,490.25]
["2011-01-07","Bellen","West","Smith","T",27,594,270]
["2011-01-08","Quad","West","Chin","HII",16,432,232]
["2011-01-09","Carlota","East","Franks","WSD",38,874,418]
["2011-01-09","Bellen","East","Pham","EPP",40,880,400]
["2011-01-09","Sunshine","East","Smith","PCC",42,798,336]
["2011-01-09","Bellen","South","Chin","WSD",26,572,260]
["2011-01-09","Bellen","South","Sioux","QT",15,330,150]
["2011-01-10","Sunset","East","Gault","TRU",27,567,249.75]
["2011-01-10","Carlota","East","Pham","AA",63,1449,693]
["2011-01-10","Quad","East","Smith","DFR",17,459,246.5]
["2011-01-10","Sunset","East","Smith","MBG",17,357,157.25]
["2011-01-10","Bellen","MidWest","Gault","FM",7,154,70]
["2011-01-10","Sunshine","MidWest","Smith","TTT",8,152,64]
["2011-01-10","Sunshine","South","Chin","TRU",30,570,240]
["2011-01-10","Sunset","South","Sioux","MBG",47,987,434.75]
["2011-01-10","Quad","West","Smith","KBTB",65,1755,942.5]
["2011-01-11","Quad","East","Franks","ITW",14,378,203]
["2011-01-11","Quad","East","Smith","BBT",49,1323,710.5]
["2011-01-12","Sunset","MidWest","Gault","ITW",19,399,175.75]
["2011-01-12","Bellen","South","Chin","WT",7,154,70]
["2011-01-13","Bellen","MidWest","Pham","PLOT",57,1254,570]
["2011-01-13","Sunshine","MidWest","Pham","PSA",33,627,264]
["2011-01-13","Bellen","MidWest","Pham","PSA",40,880,400]
["2011-01-13","Carlota","South","Smith","FM",52,1196,572]
["2011-01-14","Carlota","East","Franks","JAQ",34,782,374]
["2011-01-15","Sunset","East","Gault","AST",63,1323,582.75]
["2011-01-15","Sunshine","MidWest","Chin","YTR",11,209,88]
["2011-01-16","Bellen","MidWest","Sioux","YTR",56,1232,560]
["2011-01-16","Carlota","South","Smith","QT",31,713,341]
["2011-01-17","Quad","East","Franks","HII",62,1674,899]
["2011-01-17","Quad","East","Gault","SFWK",43,1161,623.5]
["2011-01-17","Carlota","East","Sioux","PCC",39,897,429]
["2011-01-17","Quad","MidWest","Chin","EPP",61,1647,884.5]
["2011-01-17","Sunshine","MidWest","Franks","HHH",59,1121,472]
["2011-01-17","Bellen","MidWest","Smith","PCC",16,352,160]
["2011-01-17","Quad","West","Chin","PCC",10,270,145]
["2011-01-18","Sunshine","East","Franks","AA",24,456,192]
["2011-01-18","Bellen","East","Franks","DFGH",20,440,200]
["2011-01-18","Sunset","East","Gault","MNGD",12,252,111]
["2011-01-18","Bellen","East","Pham","DFR",59,1298,590]
["2011-01-18","Sunshine","MidWest","Chin","PCC",62,1178,496]
["2011-01-18","Quad","MidWest","Smith","PLOT",17,459,246.5]
["2011-01-18","Carlota","South","Smith","YTR",53,1219,583]
["2011-01-18","Sunshine","West","Sioux","AST",8,152,64]
["2011-01-19","Bellen","South","Sioux","T",35,770,350]
["2011-01-20","Carlota","East","Chin","ET",59,1357,649]
["2011-01-20","Bellen","East","Gault","PSA",10,220,100]
["2011-01-20","Sunshine","West","Sioux","YTR",58,1102,464]
["2011-01-21","Quad","East","Chin","FM",58,1566,841]
["2011-01-21","Sunshine","MidWest","Pham","DFR",23,437,184]
["2011-01-21","Sunshine","MidWest","Smith","QT",64,1216,512]
["2011-01-21","Sunset","South","Pham","HHH",13,273,120.25]
["2011-01-21","Bellen","South","Smith","TRU",11,242,110]
["2011-01-21","Quad","West","Gault","ITW",56,1512,812]
["2011-01-22","Quad","South","Franks","FM",29,783,420.5]
["2011-01-22","Carlota","South","Smith","KBTB",29,667,319]
["2011-01-22","Bellen","West","Pham","AST",53,1166,530]
["2011-01-22","Bellen","West","Sioux","YTR",35,770,350]
["2011-01-22","Bellen","West","Smith","WT",6,132,60]
["2011-01-23","Quad","East","Franks","PCC",44,1188,638]
["2011-01-23","Bellen","East","Gault","DFGH",9,198,90]
["2011-01-23","Quad","East","Pham","WT",22,594,319]
["2011-01-23","Sunshine","South","Chin","T",49,931,392]
["2011-01-24","Carlota","MidWest","Franks","BBT",13,299,143]
["2011-01-24","Quad","West","Gault","HII",63,1701,913.5]
["2011-01-25","Sunshine","MidWest","Franks","JAQ",21,399,168]
["2011-01-26","Bellen","East","Chin","KPSA",17,374,170]
["2011-01-26","Bellen","MidWest","Gault","PSA",21,462,210]
["2011-01-26","Sunset","South","Sioux","DFGH",44,924,407]
["2011-01-26","Bellen","West","Pham","FRED",61,5000,610]
["2011-01-27","Carlota","West","Gault","QT",10,230,110]
["2011-01-28","Sunset","East","Smith","ZAT",36,756,333]
["2011-01-28","Quad","MidWest","Smith","YTR",42,1134,609]
["2011-01-28","Carlota","South","Franks","MNGD",46,1058,506]
["2011-01-28","Quad","South","Franks","YTR",44,1188,638]
["2011-01-28","Quad","South","Gault","KBTB",56,1512,812]
["2011-01-28","Bellen","South","Sioux","QT",25,550,250]
["2011-01-28","Sunshine","South","Smith","FRED",51,969,408]
["2011-01-28","Sunset","West","Chin","FM",62,1302,573.5]
["2011-01-28","Carlota","West","Smith","LOP",15,345,165]
["2011-01-29","Bellen","East","Chin","AST",50,1100,500]
["2011-01-29","Quad","MidWest","Gault","PLOT",10,270,145]
["2011-01-30","Sunshine","South","Sioux","TTT",23,437,184]
["2011-01-30","Quad","South","Sioux","TTT",25,675,362.5]
["2011-01-30","Sunshine","West","Gault","DFR",49,931,392]

{"sheet":"FormulaS","index":100,"n_rows":8,"n_cols":6,"rows_kept":8,"cut":false,"hidden":false,"merged":[]}
[null,"East","MidWest","South","West","Grand Total"]
["Jan",{"$f":"SUMPRODUCT(--(TEXT('PTData (2)'!$A$2:$A$1227,\"mmm\")=$A2),--('PTData (2)'!$C$2:$C$1227=B$1),'PTData (2)'!$G$2:$G$1227)","v":38438},{"$f":"SUMPRODUCT(--(TEXT('PTData (2)'!$A$2:$A$1227,\"mmm\")=$A2),--('PTData (2)'!$C$2:$C$1227=C$1),'PTData (2)'!$G$2:$G$1227)","v":47995},{"$f":"SUMPRODUCT(--(TEXT('PTData (2)'!$A$2:$A$1227,\"mmm\")=$A2),--('PTData (2)'!$C$2:$C$1227=D$1),'PTData (2)'!$G$2:$G$1227)","v":49374},{"$f":"SUMPRODUCT(--(TEXT('PTData (2)'!$A$2:$A$1227,\"mmm\")=$A2),--('PTData (2)'!$C$2:$C$1227=E$1),'PTData (2)'!$G$2:$G$1227)","v":36487},{"$f":"SUM(B2:E2)","v":172294}]
["Feb",{"$f":"SUMPRODUCT(--(TEXT('PTData (2)'!$A$2:$A$1227,\"mmm\")=$A3),--('PTData (2)'!$C$2:$C$1227=B$1),'PTData (2)'!$G$2:$G$1227)","v":37044},{"$f":"SUMPRODUCT(--(TEXT('PTData (2)'!$A$2:$A$1227,\"mmm\")=$A3),--('PTData (2)'!$C$2:$C$1227=C$1),'PTData (2)'!$G$2:$G$1227)","v":39134},{"$f":"SUMPRODUCT(--(TEXT('PTData (2)'!$A$2:$A$1227,\"mmm\")=$A3),--('PTData (2)'!$C$2:$C$1227=D$1),'PTData (2)'!$G$2:$G$1227)","v":31851},{"$f":"SUMPRODUCT(--(TEXT('PTData (2)'!$A$2:$A$1227,\"mmm\")=$A3),--('PTData (2)'!$C$2:$C$1227=E$1),'PTData (2)'!$G$2:$G$1227)","v":34005},142034]
["Mar",{"$f":"SUMPRODUCT(--(TEXT('PTData (2)'!$A$2:$A$1227,\"mmm\")=$A4),--('PTData (2)'!$C$2:$C$1227=B$1),'PTData (2)'!$G$2:$G$1227)","v":35064},{"$f":"SUMPRODUCT(--(TEXT('PTData (2)'!$A$2:$A$1227,\"mmm\")=$A4),--('PTData (2)'!$C$2:$C$1227=C$1),'PTData (2)'!$G$2:$G$1227)","v":38162},{"$f":"SUMPRODUCT(--(TEXT('PTData (2)'!$A$2:$A$1227,\"mmm\")=$A4),--('PTData (2)'!$C$2:$C$1227=D$1),'PTData (2)'!$G$2:$G$1227)","v":41283},{"$f":"SUMPRODUCT(--(TEXT('PTData (2)'!$A$2:$A$1227,\"mmm\")=$A4),--('PTData (2)'!$C$2:$C$1227=E$1),'PTData (2)'!$G$2:$G$1227)","v":37155},151664]
["Apr",{"$f":"SUMPRODUCT(--(TEXT('PTData (2)'!$A$2:$A$1227,\"mmm\")=$A5),--('PTData (2)'!$C$2:$C$1227=B$1),'PTData (2)'!$G$2:$G$1227)","v":43693},{"$f":"SUMPRODUCT(--(TEXT('PTData (2)'!$A$2:$A$1227,\"mmm\")=$A5),--('PTData (2)'!$C$2:$C$1227=C$1),'PTData (2)'!$G$2:$G$1227)","v":29520},{"$f":"SUMPRODUCT(--(TEXT('PTData (2)'!$A$2:$A$1227,\"mmm\")=$A5),--('PTData (2)'!$C$2:$C$1227=D$1),'PTData (2)'!$G$2:$G$1227)","v":40505},{"$f":"SUMPRODUCT(--(TEXT('PTData (2)'!$A$2:$A$1227,\"mmm\")=$A5),--('PTData (2)'!$C$2:$C$1227=E$1),'PTData (2)'!$G$2:$G$1227)","v":43495},157213]
["May",{"$f":"SUMPRODUCT(--(TEXT('PTData (2)'!$A$2:$A$1227,\"mmm\")=$A6),--('PTData (2)'!$C$2:$C$1227=B$1),'PTData (2)'!$G$2:$G$1227)","v":35750},{"$f":"SUMPRODUCT(--(TEXT('PTData (2)'!$A$2:$A$1227,\"mmm\")=$A6),--('PTData (2)'!$C$2:$C$1227=C$1),'PTData (2)'!$G$2:$G$1227)","v":39905},{"$f":"SUMPRODUCT(--(TEXT('PTData (2)'!$A$2:$A$1227,\"mmm\")=$A6),--('PTData (2)'!$C$2:$C$1227=D$1),'PTData (2)'!$G$2:$G$1227)","v":47170},{"$f":"SUMPRODUCT(--(TEXT('PTData (2)'!$A$2:$A$1227,\"mmm\")=$A6),--('PTData (2)'!$C$2:$C$1227=E$1),'PTData (2)'!$G$2:$G$1227)","v":45793},168618]
["Jun",{"$f":"SUMPRODUCT(--(TEXT('PTData (2)'!$A$2:$A$1227,\"mmm\")=$A7),--('PTData (2)'!$C$2:$C$1227=B$1),'PTData (2)'!$G$2:$G$1227)","v":37706},{"$f":"SUMPRODUCT(--(TEXT('PTData (2)'!$A$2:$A$1227,\"mmm\")=$A7),--('PTData (2)'!$C$2:$C$1227=C$1),'PTData (2)'!$G$2:$G$1227)","v":45037},{"$f":"SUMPRODUCT(--(TEXT('PTData (2)'!$A$2:$A$1227,\"mmm\")=$A7),--('PTData (2)'!$C$2:$C$1227=D$1),'PTData (2)'!$G$2:$G$1227)","v":46967},{"$f":"SUMPRODUCT(--(TEXT('PTData (2)'!$A$2:$A$1227,\"mmm\")=$A7),--('PTData (2)'!$C$2:$C$1227=E$1),'PTData (2)'!$G$2:$G$1227)","v":39288},168998]
["Grand Total",{"$f":"SUM(B2:B7)","v":227695},239753,257150,236223,960821]

{"sheet":"PT(2)","index":101,"n_rows":11,"n_cols":7,"rows_kept":11,"cut":false,"hidden":false,"merged":[]}
[]
[]
["Sum of Sales",null,"Region"]
["Years","Date","East","MidWest","South","West","Grand Total"]
["2011","Jan",38438,47995,49374,36487,172294]
[null,"Feb",37044,39134,31851,34005,142034]
[null,"Mar",35064,38162,41283,37155,151664]
[null,"Apr",43693,29520,40505,43495,157213]
[null,"May",35750,39905,47170,45793,168618]
[null,"Jun",37706,45037,46967,39288,168998]
["Grand Total",null,227695,239753,257150,236223,960821]

{"sheet":"PTWeekly","index":102,"n_rows":31,"n_cols":2,"rows_kept":31,"cut":false,"hidden":false,"merged":[]}
[]
[]
["Row Labels","Sum of Sales"]
["<1/3/2011",9738]
["1/3/2011 - 1/9/2011",47038]
["1/10/2011 - 1/16/2011",27746]
["1/17/2011 - 1/23/2011",44708]
["1/24/2011 - 1/30/2011",40309]
["1/31/2011 - 2/6/2011",29439]
["2/7/2011 - 2/13/2011",41456]
["2/14/2011 - 2/20/2011",49411]
["2/21/2011 - 2/27/2011",21933]
["2/28/2011 - 3/6/2011",28995]
["3/7/2011 - 3/13/2011",29032]
["3/14/2011 - 3/20/2011",43109]
["3/21/2011 - 3/27/2011",34375]
["3/28/2011 - 4/3/2011",31240]
["4/4/2011 - 4/10/2011",40355]
["4/11/2011 - 4/17/2011",37415]
["4/18/2011 - 4/24/2011",33197]
["4/25/2011 - 5/1/2011",39252]
["5/2/2011 - 5/8/2011",35666]
["5/9/2011 - 5/15/2011",41177]
["5/16/2011 - 5/22/2011",40267]
["5/23/2011 - 5/29/2011",36467]
["5/30/2011 - 6/5/2011",42780]
["6/6/2011 - 6/12/2011",32585]
["6/13/2011 - 6/19/2011",50626]
["6/20/2011 - 6/26/2011",36210]
["6/27/2011 - 6/30/2011",16295]
["Grand Total",960821]

{"sheet":"PTData (2)","index":103,"n_rows":1227,"n_cols":8,"rows_kept":1227,"cut":false,"hidden":false,"merged":[]}
["Date","Product","Region","SalesRep","Customer","Units","Sales","COGS"]
["2011-01-23","Quad","West","Sioux","DFR",23,621,333.5]
["2011-01-18","Sunshine","West","Pham","TTT",65,1235,520]
["2011-06-19","Sunset","West","Pham","FM",47,987,434.75]
["2011-06-13","Quad","MidWest","Smith","PLOT",24,648,348]
["2011-04-06","Sunshine","South","Pham","JAQ",58,1102,464]
["2011-03-02","Quad","West","Franks","ET",22,594,319]
["2011-03-24","Quad","East","Smith","JAQ",8,216,116]
["2011-02-27","Sunshine","South","Smith","ET",29,551,232]
["2011-06-19","Carlota","West","Chin","ZAT",55,1265,605]
["2011-05-17","Carlota","MidWest","Franks","ZAT",39,897,429]
["2011-04-11","Sunshine","MidWest","Pham","DFGH",49,931,392]
["2011-02-15","Carlota","MidWest","Pham","KBTB",63,1449,693]
["2011-02-20","Quad","South","Smith","ITTW",19,513,275.5]
["2011-01-09","Quad","MidWest","Chin","LOP",40,1080,580]
["2011-04-04","Quad","East","Smith","YTR",60,1620,870]
["2011-04-17","Sunset","South","Chin","WT",24,504,222]
["2011-01-22","Bellen","West","Pham","BBT",10,220,100]
["2011-02-09","Sunshine","East","Smith","GRR",26,494,208]
["2011-05-15","Sunshine","West","Pham","WFMI",65,1235,520]
["2011-05-19","Carlota","MidWest","Sioux","TTT",43,989,473]
["2011-05-07","Sunshine","South","Gault","AA",20,380,160]
["2011-04-20","Bellen","West","Gault","WFMI",39,858,390]
["2011-04-09","Sunset","MidWest","Gault","ET",33,693,305.25]
["2011-05-05","Sunshine","East","Chin","HII",6,114,48]
["2011-05-05","Carlota","East","Chin","KPSA",33,759,363]
["2011-03-14","Bellen","MidWest","Pham","TTT",34,748,340]
["2011-01-11","Bellen","MidWest","Smith","KPSA",23,506,230]
["2011-05-13","Carlota","MidWest","Gault","QT",6,138,66]
["2011-04-23","Sunset","South","Smith","FM",15,315,138.75]
["2011-03-22","Carlota","South","Pham","ITTW",27,621,297]
["2011-01-18","Sunset","South","Pham","DFGH",36,756,333]
["2011-06-24","Bellen","MidWest","Gault","SFWK",64,1408,640]
["2011-02-07","Sunset","MidWest","Gault","JAQ",44,924,407]
["2011-03-19","Carlota","South","Pham","TTT",54,1242,594]
["2011-06-03","Quad","MidWest","Smith","HII",21,567,304.5]
["2011-03-26","Sunset","East","Franks","DFGH",40,840,370]
["2011-04-26","Carlota","South","Smith","AST",22,506,242]
["2011-04-26","Sunset","MidWest","Gault","MNGD",51,1071,471.75]
["2011-02-04","Quad","West","Sioux","DFGH",25,675,362.5]
["2011-06-05","Sunshine","East","Gault","HII",63,1197,504]
["2011-01-19","Bellen","East","Pham","ITTW",40,880,400]
["2011-05-20","Bellen","West","Smith","ZAT",47,1034,470]
["2011-06-28","Sunset","East","Smith","KBTB",12,252,111]
["2011-06-02","Sunshine","MidWest","Chin","WT",24,456,192]
["2011-01-01","Quad","West","Sioux","EPP",33,891,478.5]
["2011-02-19","Bellen","South","Gault","EPP",39,858,390]
["2011-01-03","Sunshine","MidWest","Smith","LOP",51,969,408]
["2011-01-22","Carlota","MidWest","Franks","DFGH",29,667,319]
["2011-06-25","Bellen","South","Franks","WFMI",33,726,330]
["2011-06-05","Carlota","South","Smith","SFWK",30,690,330]
["2011-01-28","Sunshine","South","Gault","HII",59,1121,472]
["2011-02-16","Quad","East","Franks","GRR",26,702,377]
["2011-05-03","Quad","West","Pham","ITTW",11,297,159.5]
["2011-05-19","Sunshine","West","Gault","DDH",13,247,104]
["2011-05-08","Sunset","MidWest","Franks","JAQ",58,1218,536.5]
["2011-05-07","Bellen","South","Franks","WSD",25,550,250]
["2011-06-26","Quad","West","Chin","DFGH",55,1485,797.5]
["2011-04-25","Sunshine","South","Pham","KBTB",8,152,64]
["2011-03-02","Quad","East","Pham","DDH",8,216,116]
["2011-04-11","Bellen","South","Chin","ITTW",13,286,130]
["2011-03-20","Sunset","West","Pham","GRR",31,651,286.75]
["2011-02-02","Sunshine","South","Sioux","WSD",60,1140,480]
["2011-06-26","Bellen","MidWest","Smith","WT",9,198,90]
["2011-01-27","Bellen","West","Gault","AST",12,264,120]
["2011-03-12","Sunset","East","Pham","AA",65,1365,601.25]
["2011-02-18","Sunset","South","Pham","AA",50,1050,462.5]
["2011-05-29","Sunset","East","Sioux","ITTW",57,1197,527.25]
["2011-06-05","Bellen","West","Smith","YTR",65,1430,650]
["2011-06-18","Bellen","South","Gault","TTT",40,880,400]
["2011-04-01","Sunshine","South","Gault","HII",62,1178,496]
["2011-04-18","Sunset","South","Sioux","FRED",47,987,434.75]
["2011-03-12","Quad","East","Chin","TTT",18,486,261]
["2011-04-30","Bellen","West","Pham","JAQ",63,1386,630]
["2011-04-02","Sunshine","West","Smith","PCC",42,798,336]
["2011-06-25","Bellen","East","Franks","ITTW",12,264,120]
["2011-04-08","Sunshine","South","Chin","YTR",19,361,152]
["2011-05-07","Sunset","South","Smith","ITTW",14,294,129.5]
["2011-01-25","Carlota","West","Chin","ITTW",7,161,77]
["2011-02-16","Sunshine","West","Pham","EPP",51,969,408]
["2011-02-22","Carlota","MidWest","Franks","KPSA",25,575,275]
["2011-03-01","Bellen","East","Franks","DFGH",49,1078,490]
["2011-04-29","Sunset","West","Gault","FRED",36,756,333]
["2011-05-28","Carlota","MidWest","Franks","KBTB",10,230,110]
["2011-04-23","Sunset","East","Chin","TRU",6,126,55.5]
["2011-04-16","Carlota","MidWest","Sioux","HII",55,1265,605]
["2011-01-25","Quad","East","Pham","DFR",31,837,449.5]
["2011-05-18","Bellen","South","Pham","KBTB",43,946,430]
["2011-04-19","Sunshine","West","Pham","KBTB",17,323,136]
["2011-01-24","Carlota","South","Franks","EPP",38,874,418]
["2011-05-31","Sunshine","East","Sioux","WT",42,798,336]
["2011-02-04","Sunset","MidWest","Smith","LOP",6,126,55.5]
["2011-01-08","Quad","East","Smith","GRR",23,621,333.5]
["2011-02-17","Bellen","West","Smith","WT",41,902,410]
["2011-05-06","Carlota","East","Pham","DFR",41,943,451]
["2011-03-05","Quad","South","Franks","QT",14,378,203]
["2011-01-29","Carlota","West","Smith","ITW",40,920,440]
["2011-03-31","Sunshine","East","Gault","KBTB",36,684,288]
["2011-01-04","Carlota","South","Chin","YTR",43,989,473]
["2011-03-24","Carlota","MidWest","Chin","TRU",18,414,198]
["2011-02-19","Sunset","South","Pham","QT",60,1260,555]
["2011-02-01","Quad","West","Smith","HHH",23,621,333.5]
["2011-06-12","Bellen","West","Chin","GRR",40,880,400]
["2011-05-10","Quad","West","Franks","HHH",23,621,333.5]
["2011-06-08","Sunshine","West","Chin","KPSA",38,722,304]
["2011-05-07","Quad","MidWest","Pham","HHH",48,1296,696]
["2011-04-26","Carlota","East","Sioux","YTR",36,828,396]
["2011-05-26","Sunshine","West","Franks","DFR",26,494,208]
["2011-05-09","Bellen","West","Chin","TRU",19,418,190]
["2011-04-03","Quad","MidWest","Franks","FM",39,1053,565.5]
["2011-03-22","Sunshine","South","Sioux","TRU",28,532,224]
["2011-05-03","Carlota","South","Smith","ITTW",17,391,187]
["2011-01-23","Sunshine","East","Chin","WSD",39,741,312]
["2011-01-18","Sunshine","MidWest","Gault","ITW",58,1102,464]
["2011-06-17","Bellen","South","Gault","TTT",38,836,380]
["2011-01-17","Carlota","South","Franks","PLOT",34,782,374]
["2011-05-23","Bellen","East","Gault","ET",59,1298,590]
["2011-01-20","Quad","South","Gault","TTT",28,756,406]
["2011-04-07","Sunshine","South","Sioux","QT",62,1178,496]
["2011-05-25","Quad","West","Gault","YTR",65,1755,942.5]
["2011-05-14","Sunset","West","Pham","BBT",6,126,55.5]
["2011-06-07","Bellen","MidWest","Smith","BBT",34,748,340]
["2011-05-13","Carlota","West","Franks","DFR",60,1380,660]
["2011-05-01","Sunshine","West","Pham","PSA",50,950,400]
["2011-01-12","Quad","MidWest","Smith","MBG",40,1080,580]
["2011-05-13","Sunset","West","Chin","TTT",24,504,222]
["2011-01-26","Bellen","MidWest","Sioux","TTT",65,1430,650]
["2011-02-06","Quad","East","Franks","FM",52,1404,754]
["2011-06-06","Sunshine","West","Gault","WT",60,1140,480]
["2011-04-12","Carlota","East","Smith","PCC",46,1058,506]
["2011-06-02","Carlota","East","Sioux","SFWK",41,943,451]
["2011-01-22","Sunshine","South","Franks","WT",29,551,232]
["2011-03-14","Sunshine","East","Smith","HHH",65,1235,520]
["2011-05-28","Carlota","East","Pham","HII",37,851,407]
["2011-03-24","Sunshine","MidWest","Smith","WT",14,266,112]
["2011-02-01","Bellen","East","Pham","WFMI",18,396,180]
["2011-04-14","Carlota","West","Smith","AA",44,1012,484]
["2011-03-27","Bellen","West","Sioux","FRED",62,1364,620]
["2011-01-16","Sunshine","MidWest","Gault","WSD",21,399,168]
["2011-01-23","Bellen","South","Smith","JAQ",56,1232,560]
["2011-05-02","Bellen","MidWest","Gault","BBT",64,1408,640]
["2011-02-20","Sunshine","South","Pham","T",22,418,176]
["2011-05-22","Sunset","MidWest","Franks","AST",21,441,194.25]
["2011-02-08","Sunset","East","Gault","DFGH",22,462,203.5]
["2011-04-18","Sunshine","East","Pham","WSD",40,760,320]
["2011-01-26","Sunshine","South","Pham","TTT",24,456,192]
["2011-01-07","Carlota","MidWest","Sioux","FM",14,322,154]
["2011-02-19","Sunshine","West","Pham","FRED",61,1159,488]
["2011-05-22","Sunshine","East","Franks","BBT",12,228,96]
["2011-01-16","Sunset","East","Pham","BBT",34,714,314.5]
["2011-02-09","Quad","MidWest","Franks","DFR",8,216,116]
["2011-01-15","Sunshine","MidWest","Franks","AA",44,836,352]
["2011-03-31","Sunset","MidWest","Smith","DDH",25,525,231.25]
["2011-01-25","Quad","West","Pham","WSD",56,1512,812]
["2011-03-10","Carlota","West","Pham","LOP",13,299,143]
["2011-03-23","Quad","South","Gault","T",6,162,87]
["2011-04-08","Quad","East","Pham","KPSA",23,621,333.5]
["2011-01-17","Carlota","West","Smith","TTT",21,483,231]
["2011-04-06","Sunshine","East","Chin","ET",50,950,400]
["2011-06-13","Carlota","South","Sioux","EPP",54,1242,594]
["2011-03-16","Bellen","West","Chin","PCC",8,176,80]
["2011-06-11","Sunshine","South","Gault","FRED",53,1007,424]
["2011-06-03","Sunset","East","Pham","ET",55,1155,508.75]
["2011-06-01","Carlota","West","Chin","ITW",64,1472,704]
["2011-03-18","Sunset","East","Sioux","TRU",53,1113,490.25]
["2011-03-10","Quad","West","Franks","YTR",58,1566,841]
["2011-04-01","Sunset","West","Smith","MNGD",46,966,425.5]
["2011-04-11","Bellen","MidWest","Pham","ITW",19,418,190]
["2011-02-18","Bellen","South","Pham","TTT",47,1034,470]
["2011-05-11","Sunset","West","Smith","KBTB",13,273,120.25]
["2011-02-06","Sunshine","West","Pham","PCC",10,190,80]
["2011-06-18","Carlota","MidWest","Franks","ET",65,1495,715]
["2011-06-20","Sunshine","MidWest","Chin","T",37,703,296]
["2011-03-30","Bellen","West","Gault","ET",45,990,450]
["2011-06-19","Bellen","South","Franks","AA",20,440,200]
["2011-02-09","Quad","South","Franks","AA",30,810,435]
["2011-02-20","Bellen","East","Franks","DDH",58,1276,580]
["2011-01-18","Carlota","West","Chin","TTT",16,368,176]
["2011-04-03","Bellen","MidWest","Gault","MBG",18,396,180]
["2011-03-17","Carlota","South","Smith","TRU",42,966,462]
["2011-06-23","Sunset","MidWest","Smith","GRR",47,987,434.75]
["2011-03-17","Bellen","South","Chin","SFWK",29,638,290]
["2011-06-24","Carlota","MidWest","Gault","ITW",13,299,143]
["2011-01-15","Sunshine","West","Franks","FM",21,399,168]
["2011-01-09","Carlota","MidWest","Smith","DFR",41,943,451]
["2011-01-12","Quad","East","Gault","WFMI",62,1674,899]
["2011-06-03","Bellen","South","Gault","ITW",19,418,190]
["2011-03-14","Sunshine","West","Gault","AST",65,1235,520]
["2011-05-15","Bellen","MidWest","Gault","T",29,638,290]
["2011-03-27","Sunset","East","Franks","BBT",26,546,240.5]
["2011-02-09","Bellen","South","Pham","T",53,1166,530]
["2011-02-24","Sunset","MidWest","Smith","ZAT",25,525,231.25]
["2011-01-07","Carlota","East","Smith","BBT",47,1081,517]
["2011-06-04","Bellen","MidWest","Gault","AA",48,1056,480]
["2011-02-08","Sunshine","MidWest","Smith","JAQ",65,1235,520]
["2011-04-12","Quad","East","Sioux","AA",56,1512,812]
["2011-04-30","Sunshine","South","Smith","HII",51,969,408]
["2011-03-24","Bellen","MidWest","Gault","PCC",57,1254,570]
["2011-04-11","Carlota","South","Franks","TTT",23,529,253]
["2011-03-19","Carlota","South","Chin","ET",43,989,473]
["2011-05-06","Sunset","South","Chin","BBT",22,462,203.5]
["2011-06-20","Carlota","East","Gault","HHH",10,230,110]
["2011-05-01","Sunshine","MidWest","Gault","ITW",28,532,224]
["2011-03-28","Quad","East","Smith","EPP",17,459,246.5]
["2011-06-11","Quad","South","Chin","MNGD",43,1161,623.5]
["2011-05-26","Quad","East","Sioux","MBG",19,513,275.5]
["2011-03-09","Sunshine","West","Gault","AST",19,361,152]
["2011-03-06","Bellen","East","Chin","KPSA",9,198,90]
["2011-01-30","Quad","MidWest","Franks","KPSA",28,756,406]
["2011-03-02","Bellen","West","Sioux","HHH",15,330,150]
["2011-05-15","Quad","South","Pham","ET",46,1242,667]
["2011-05-11","Bellen","South","Franks","ITW",39,858,390]
["2011-03-22","Bellen","West","Franks","ET",14,308,140]
["2011-01-19","Sunshine","South","Gault","WT",33,627,264]
["2011-06-28","Quad","MidWest","Smith","LOP",45,1215,652.5]
["2011-01-12","Carlota","East","Franks","WSD",24,552,264]
["2011-05-17","Sunshine","South","Smith","ITW",37,703,296]
["2011-02-17","Sunset","South","Sioux","QT",30,630,277.5]
["2011-05-25","Quad","MidWest","Chin","ET",30,810,435]
["2011-06-21","Bellen","South","Smith","YTR",61,1342,610]
["2011-02-08","Carlota","West","Pham","HHH",32,736,352]
["2011-06-02","Bellen","South","Gault","QT",6,132,60]
["2011-06-27","Sunset","East","Franks","MBG",38,798,351.5]
["2011-06-18","Carlota","South","Franks","KPSA",11,253,121]
["2011-03-06","Sunset","East","Chin","WSD",43,903,397.75]
["2011-05-23","Bellen","South","Pham","TRU",56,1232,560]
["2011-05-13","Quad","West","Pham","PCC",28,756,406]
["2011-06-01","Carlota","West","Sioux","AST",25,575,275]
["2011-06-19","Quad","West","Chin","JAQ",54,1458,783]
["2011-06-15","Sunshine","MidWest","Gault","TRU",27,513,216]
["2011-04-26","Sunshine","South","Chin","JAQ",17,323,136]
["2011-03-22","Carlota","MidWest","Pham","TRU",59,1357,649]
["2011-05-25","Bellen","West","Franks","DFR",50,1100,500]
["2011-03-28","Carlota","East","Chin","FM",32,736,352]
["2011-04-25","Sunshine","South","Chin","FM",52,988,416]
["2011-05-14","Carlota","MidWest","Gault","ZAT",27,621,297]
["2011-04-25","Quad","West","Pham","AST",59,1593,855.5]
["2011-03-17","Quad","MidWest","Chin","WSD",33,891,478.5]
["2011-06-28","Quad","East","Gault","FM",46,1242,667]
["2011-02-24","Quad","MidWest","Chin","BBT",26,702,377]
["2011-03-18","Bellen","MidWest","Sioux","EPP",37,814,370]
["2011-06-28","Sunshine","East","Pham","AA",56,1064,448]
["2011-03-05","Sunset","MidWest","Gault","PLOT",18,378,166.5]
["2011-04-08","Sunshine","West","Gault","BBT",37,703,296]
["2011-03-19","Sunshine","West","Sioux","AST",10,190,80]
["2011-06-24","Sunset","MidWest","Smith","SFWK",20,420,185]
["2011-05-18","Sunset","West","Smith","LOP",26,546,240.5]
["2011-01-07","Carlota","South","Pham","BBT",22,506,242]
["2011-02-20","Bellen","MidWest","Sioux","PSA",13,286,130]
["2011-04-05","Bellen","MidWest","Gault","BBT",34,748,340]
["2011-02-10","Bellen","MidWest","Pham","PLOT",11,242,110]
["2011-03-16","Quad","East","Gault","MBG",23,621,333.5]
["2011-03-23","Sunshine","MidWest","Sioux","HII",45,855,360]
["2011-01-24","Sunset","East","Gault","WT",26,546,240.5]
["2011-04-18","Carlota","West","Chin","ITTW",35,805,385]
["2011-05-21","Quad","West","Sioux","TRU",17,459,246.5]
["2011-01-17","Sunshine","East","Franks","T",35,665,280]
["2011-05-05","Sunset","MidWest","Franks","ET",39,819,360.75]
["2011-01-01","Carlota","East","Chin","KPSA",23,529,253]
["2011-06-05","Sunshine","East","Pham","MNGD",53,1007,424]
["2011-03-19","Sunset","West","Chin","EPP",39,819,360.75]
["2011-02-10","Carlota","East","Franks","MNGD",46,1058,506]
["2011-03-02","Sunset","South","Pham","GRR",44,924,407]
["2011-06-11","Carlota","MidWest","Smith","MNGD",48,1104,528]
["2011-04-05","Carlota","West","Pham","GRR",23,529,253]
["2011-01-23","Carlota","MidWest","Gault","KBTB",12,276,132]
["2011-06-26","Bellen","MidWest","Chin","KBTB",62,1364,620]
["2011-06-20","Sunshine","West","Gault","HII",21,399,168]
["2011-02-12","Sunset","MidWest","Franks","FM",35,735,323.75]
["2011-06-05","Quad","East","Sioux","ZAT",35,945,507.5]
["2011-04-06","Sunshine","West","Smith","AST",53,1007,424]
["2011-06-05","Quad","West","Franks","DFR",38,1026,551]
["2011-06-05","Carlota","South","Sioux","DFR",60,1380,660]
["2011-01-07","Sunshine","MidWest","Franks","ITW",36,684,288]
["2011-05-27","Quad","West","Sioux","PLOT",27,729,391.5]
["2011-05-04","Carlota","West","Smith","QT",30,690,330]
["2011-02-01","Carlota","East","Chin","GRR",28,644,308]
["2011-06-08","Bellen","MidWest","Franks","HHH",61,1342,610]
["2011-01-08","Carlota","South","Chin","FM",59,1357,649]
["2011-01-04","Bellen","West","Gault","WSD",11,242,110]
["2011-04-30","Sunshine","East","Franks","AA",41,779,328]
["2011-06-05","Carlota","South","Smith","PLOT",14,322,154]
["2011-05-20","Carlota","MidWest","Franks","JAQ",34,782,374]
["2011-06-28","Quad","South","Gault","LOP",33,891,478.5]
["2011-04-23","Sunset","West","Franks","QT",29,609,268.25]
["2011-02-18","Sunset","MidWest","Franks","AST",23,483,212.75]
["2011-02-09","Bellen","South","Franks","JAQ",45,990,450]
["2011-02-06","Quad","MidWest","Pham","WFMI",29,783,420.5]
["2011-03-30","Bellen","East","Franks","JAQ",31,682,310]
["2011-02-13","Sunset","West","Sioux","PSA",60,1260,555]
["2011-05-31","Sunshine","South","Gault","FRED",10,190,80]
["2011-01-04","Bellen","East","Smith","TTT",13,286,130]
["2011-05-25","Carlota","West","Sioux","TTT",17,391,187]
["2011-04-12","Sunset","MidWest","Chin","KPSA",65,1365,601.25]
["2011-06-28","Carlota","South","Gault","ET",34,782,374]
["2011-02-14","Sunset","West","Gault","ZAT",30,630,277.5]
["2011-02-18","Bellen","South","Smith","HII",22,484,220]
["2011-01-29","Sunshine","East","Pham","GRR",58,1102,464]
["2011-02-14","Sunshine","West","Gault","KBTB",50,950,400]
["2011-02-13","Sunshine","East","Gault","KPSA",39,741,312]
["2011-05-27","Quad","West","Smith","SFWK",36,972,522]
["2011-02-19","Carlota","MidWest","Gault","ITTW",41,943,451]
["2011-01-04","Carlota","West","Gault","HHH",37,851,407]
["2011-06-03","Carlota","East","Pham","PCC",35,805,385]
["2011-05-06","Bellen","MidWest","Gault","KBTB",55,1210,550]
["2011-06-06","Sunset","MidWest","Chin","PCC",43,903,397.75]
["2011-03-01","Carlota","West","Pham","MNGD",20,460,220]
["2011-02-20","Carlota","West","Gault","KPSA",47,1081,517]
["2011-01-04","Carlota","South","Franks","AST",53,1219,583]
["2011-06-11","Carlota","South","Gault","WT",55,1265,605]
["2011-06-04","Sunset","MidWest","Pham","KBTB",61,1281,564.25]
["2011-05-01","Sunset","South","Chin","PCC",57,1197,527.25]
["2011-01-11","Sunshine","MidWest","Franks","TTT",48,912,384]
["2011-01-27","Sunshine","South","Smith","MNGD",39,741,312]
["2011-04-06","Sunset","South","Chin","SFWK",23,483,212.75]
["2011-04-25","Sunshine","East","Chin","ITW",22,418,176]
["2011-03-03","Carlota","West","Sioux","GRR",48,1104,528]
["2011-01-09","Bellen","West","Sioux","WT",43,946,430]
["2011-05-15","Sunshine","East","Gault","HII",46,874,368]
["2011-03-21","Quad","West","Gault","GRR",56,1512,812]
["2011-03-17","Carlota","South","Pham","TTT",27,621,297]
["2011-02-14","Quad","MidWest","Franks","AST",47,1269,681.5]
["2011-01-26","Bellen","West","Smith","HII",41,902,410]
["2011-06-19","Quad","West","Pham","HII",41,1107,594.5]
["2011-02-17","Carlota","East","Smith","AST",45,1035,495]
["2011-03-22","Sunset","MidWest","Gault","SFWK",12,252,111]
["2011-01-09","Quad","East","Franks","FRED",47,1269,681.5]
["2011-06-20","Sunshine","MidWest","Sioux","GRR",50,950,400]
["2011-04-11","Bellen","South","Smith","ZAT",28,616,280]
["2011-03-02","Sunshine","MidWest","Sioux","DFR",11,209,88]
["2011-04-26","Carlota","East","Pham","T",64,1472,704]
["2011-04-21","Carlota","South","Sioux","BBT",22,506,242]
["2011-06-03","Quad","East","Pham","TTT",7,189,101.5]
["2011-01-21","Carlota","East","Pham","BBT",39,897,429]
["2011-03-02","Quad","East","Sioux","DDH",49,1323,710.5]
["2011-04-25","Sunshine","East","Gault","MNGD",13,247,104]
["2011-05-14","Bellen","South","Franks","WSD",26,572,260]
["2011-06-19","Quad","South","Chin","AA",22,594,319]
["2011-06-18","Bellen","MidWest","Gault","DFGH",65,1430,650]
["2011-05-21","Bellen","West","Gault","GRR",18,396,180]
["2011-05-15","Quad","South","Chin","DDH",61,1647,884.5]
["2011-03-08","Sunshine","MidWest","Smith","TTT",38,722,304]
["2011-04-19","Quad","East","Gault","ITTW",28,756,406]
["2011-04-18","Carlota","West","Pham","KBTB",17,391,187]
["2011-03-22","Carlota","MidWest","Smith","TRU",28,644,308]
["2011-02-14","Quad","MidWest","Sioux","AST",37,999,536.5]
["2011-02-27","Sunset","MidWest","Smith","LOP",51,1071,471.75]
["2011-05-09","Sunset","MidWest","Sioux","KPSA",51,1071,471.75]
["2011-04-14","Sunshine","West","Pham","PSA",32,608,256]
["2011-06-12","Quad","MidWest","Franks","DFR",34,918,493]
["2011-06-27","Bellen","West","Franks","BBT",35,770,350]
["2011-05-28","Quad","South","Chin","MBG",10,270,145]
["2011-04-09","Bellen","MidWest","Franks","DFR",16,352,160]
["2011-06-23","Quad","East","Chin","ZAT",26,702,377]
["2011-04-20","Quad","MidWest","Smith","AST",64,1728,928]
["2011-03-19","Sunset","West","Gault","ITTW",45,945,416.25]
["2011-01-01","Sunset","West","Chin","GRR",40,840,370]
["2011-01-19","Sunset","MidWest","Smith","SFWK",32,672,296]
["2011-01-21","Quad","West","Gault","HII",36,972,522]
["2011-02-03","Sunset","MidWest","Smith","YTR",17,357,157.25]
["2011-04-10","Bellen","MidWest","Gault","PLOT",7,154,70]
["2011-01-24","Sunset","West","Franks","DDH",49,1029,453.25]
["2011-03-03","Quad","West","Gault","TRU",33,891,478.5]
["2011-02-27","Bellen","West","Franks","AST",22,484,220]
["2011-06-05","Quad","South","Gault","DDH",16,432,232]
["2011-03-25","Sunset","MidWest","Gault","PSA",18,378,166.5]
["2011-03-24","Carlota","East","Gault","WFMI",51,1173,561]
["2011-06-16","Sunshine","South","Franks","MBG",34,646,272]
["2011-02-22","Carlota","East","Gault","ITW",63,1449,693]
["2011-05-13","Carlota","East","Sioux","HHH",28,644,308]
["2011-06-18","Quad","West","Gault","TTT",44,1188,638]
["2011-03-15","Carlota","MidWest","Sioux","FRED",55,1265,605]
["2011-02-23","Carlota","MidWest","Pham","FM",63,1449,693]
["2011-03-20","Bellen","MidWest","Sioux","ZAT",6,132,60]
["2011-03-27","Carlota","East","Franks","MBG",22,506,242]
["2011-01-16","Sunset","West","Smith","TTT",30,630,277.5]
["2011-03-12","Sunset","South","Pham","AST",31,651,286.75]
["2011-04-06","Sunset","MidWest","Chin","TTT",55,1155,508.75]
["2011-03-24","Bellen","South","Chin","MNGD",50,1100,500]
["2011-04-30","Quad","South","Gault","WSD",55,1485,797.5]
["2011-05-22","Sunshine","South","Chin","PSA",64,1216,512]
["2011-03-24","Carlota","East","Franks","KPSA",45,1035,495]
["2011-02-18","Sunshine","South","Pham","FM",31,589,248]
["2011-03-07","Bellen","East","Chin","LOP",14,308,140]
["2011-04-02","Sunshine","West","Gault","YTR",49,931,392]
["2011-05-26","Carlota","East","Gault","MBG",41,943,451]
["2011-05-22","Bellen","West","Sioux","TTT",56,1232,560]
["2011-01-29","Sunshine","West","Sioux","ITW",14,266,112]
["2011-03-14","Sunshine","West","Chin","GRR",39,741,312]
["2011-05-30","Bellen","East","Pham","EPP",42,924,420]
["2011-03-17","Sunset","MidWest","Franks","EPP",40,840,370]
["2011-02-28","Quad","South","Chin","KPSA",15,405,217.5]
["2011-02-02","Sunshine","West","Chin","SFWK",26,494,208]
["2011-02-27","Sunset","South","Gault","HHH",6,126,55.5]
["2011-03-04","Sunset","South","Sioux","PSA",7,147,64.75]
["2011-06-14","Sunshine","South","Sioux","DDH",50,950,400]
["2011-06-23","Carlota","West","Franks","SFWK",57,1311,627]
["2011-03-30","Sunset","South","Chin","MNGD",31,651,286.75]
["2011-02-28","Sunshine","MidWest","Chin","HHH",40,760,320]
["2011-05-06","Quad","MidWest","Sioux","EPP",61,1647,884.5]
["2011-02-06","Sunset","East","Franks","ZAT",27,567,249.75]
["2011-01-26","Sunset","East","Smith","ITW",41,861,379.25]
["2011-05-25","Bellen","East","Franks","FM",51,1122,510]
["2011-03-13","Quad","South","Sioux","BBT",61,1647,884.5]
["2011-05-09","Sunshine","South","Smith","AST",30,570,240]
["2011-01-05","Sunset","West","Pham","MNGD",28,588,259]
["2011-04-22","Quad","East","Smith","YTR",63,1701,913.5]
["2011-01-13","Sunshine","South","Sioux","ITTW",61,1159,488]
["2011-01-08","Sunshine","MidWest","Smith","AA",45,855,360]
["2011-01-10","Quad","MidWest","Franks","SFWK",49,1323,710.5]
["2011-05-07","Bellen","South","Smith","KBTB",16,352,160]
["2011-04-22","Quad","East","Sioux","DDH",16,432,232]
["2011-05-11","Sunshine","MidWest","Franks","HHH",15,285,120]
["2011-05-30","Bellen","East","Gault","ITTW",20,440,200]
["2011-04-16","Sunshine","West","Smith","LOP",36,684,288]
["2011-06-13","Sunset","East","Smith","ET",45,945,416.25]
["2011-04-13","Sunset","East","Smith","PLOT",30,630,277.5]
["2011-02-23","Bellen","East","Smith","ITW",14,308,140]
["2011-06-11","Quad","South","Chin","PCC",17,459,246.5]
["2011-02-16","Bellen","West","Sioux","MNGD",55,1210,550]
["2011-03-17","Bellen","West","Gault","MNGD",23,506,230]
["2011-06-03","Sunset","South","Smith","DDH",55,1155,508.75]
["2011-04-25","Sunset","MidWest","Pham","LOP",44,924,407]
["2011-05-26","Quad","East","Pham","WFMI",36,972,522]
["2011-05-08","Bellen","South","Gault","TTT",55,1210,550]
["2011-06-06","Sunshine","South","Pham","YTR",32,608,256]
["2011-06-16","Sunset","MidWest","Chin","GRR",21,441,194.25]
["2011-05-12","Sunset","South","Smith","ET",46,966,425.5]
["2011-03-25","Bellen","West","Gault","WT",32,704,320]
["2011-02-18","Quad","MidWest","Pham","SFWK",22,594,319]
["2011-06-08","Quad","MidWest","Gault","PSA",48,1296,696]
["2011-04-22","Carlota","West","Chin","WSD",49,1127,539]
["2011-03-08","Bellen","MidWest","Pham","GRR",21,462,210]
["2011-06-11","Carlota","MidWest","Chin","SFWK",23,529,253]
["2011-06-16","Sunset","MidWest","Sioux","DFGH",38,798,351.5]
["2011-05-26","Carlota","MidWest","Smith","TTT",9,207,99]
["2011-04-17","Sunset","West","Franks","DFGH",37,777,342.25]
["2011-05-12","Carlota","East","Pham","GRR",19,437,209]
["2011-02-09","Sunset","East","Franks","DFR",8,168,74]
["2011-01-21","Sunshine","South","Smith","GRR",63,1197,504]
["2011-02-12","Quad","East","Sioux","TTT",24,648,348]
["2011-03-16","Bellen","MidWest","Pham","EPP",25,550,250]
["2011-01-23","Bellen","West","Smith","PLOT",12,264,120]
["2011-03-20","Carlota","West","Franks","MNGD",65,1495,715]
["2011-04-28","Sunset","West","Pham","AST",12,252,111]
["2011-06-17","Quad","South","Pham","TTT",49,1323,710.5]
["2011-02-04","Sunset","MidWest","Gault","WSD",32,672,296]
["2011-05-10","Sunset","MidWest","Franks","DFGH",13,273,120.25]
["2011-06-17","Carlota","West","Pham","MNGD",8,184,88]
["2011-02-08","Quad","East","Sioux","FRED",19,513,275.5]
["2011-03-30","Carlota","South","Franks","EPP",36,828,396]
["2011-04-19","Sunshine","West","Chin","AST",24,456,192]
["2011-06-06","Sunset","MidWest","Sioux","DDH",8,168,74]
["2011-03-24","Sunset","South","Pham","LOP",45,945,416.25]
["2011-03-17","Quad","South","Sioux","FRED",64,1728,928]
["2011-03-18","Sunshine","South","Chin","FRED",27,513,216]
["2011-01-28","Quad","MidWest","Sioux","LOP",60,1620,870]
["2011-05-19","Quad","South","Smith","TTT",54,1458,783]
["2011-01-31","Sunshine","West","Chin","HII",21,399,168]
["2011-04-17","Quad","West","Sioux","SFWK",63,1701,913.5]
["2011-06-19","Quad","South","Gault","DDH",52,1404,754]
["2011-04-08","Sunset","East","Franks","AA",39,819,360.75]
["2011-01-27","Sunset","South","Smith","SFWK",15,315,138.75]
["2011-05-15","Sunset","South","Smith","KBTB",34,714,314.5]
["2011-01-07","Bellen","MidWest","Gault","T",54,1188,540]
["2011-03-11","Carlota","West","Sioux","KBTB",57,1311,627]
["2011-01-20","Quad","MidWest","Chin","BBT",7,189,101.5]
["2011-06-12","Bellen","East","Pham","LOP",20,440,200]
["2011-04-08","Sunshine","East","Pham","MBG",55,1045,440]
["2011-01-15","Bellen","South","Smith","GRR",27,594,270]
["2011-01-25","Sunset","East","Gault","BBT",54,1134,499.5]
["2011-04-20","Bellen","West","Pham","YTR",10,220,100]
["2011-06-11","Sunset","West","Chin","FRED",20,420,185]
["2011-04-15","Quad","MidWest","Franks","DFGH",47,1269,681.5]
["2011-05-24","Sunset","South","Gault","KPSA",15,315,138.75]
["2011-01-04","Sunset","West","Franks","GRR",28,588,259]
["2011-05-23","Sunset","West","Pham","KBTB",30,630,277.5]
["2011-05-18","Carlota","West","Franks","TTT",57,1311,627]
["2011-01-03","Carlota","East","Pham","FRED",24,552,264]
["2011-03-03","Bellen","West","Pham","AA",16,352,160]
["2011-05-12","Bellen","West","Gault","ITTW",46,1012,460]
["2011-02-08","Quad","West","Chin","DDH",52,1404,754]
["2011-05-20","Bellen","South","Gault","ET",29,638,290]
["2011-03-16","Bellen","West","Chin","TTT",9,198,90]
["2011-03-20","Sunshine","West","Franks","JAQ",13,247,104]
["2011-04-10","Sunset","South","Pham","ET",8,168,74]
["2011-04-15","Sunshine","South","Smith","DFR",26,494,208]
["2011-03-26","Sunset","South","Sioux","MBG",12,252,111]
["2011-02-13","Sunshine","East","Franks","WT",24,456,192]
["2011-06-27","Quad","South","Smith","ITW",47,1269,681.5]
["2011-06-12","Bellen","East","Franks","SFWK",11,242,110]
["2011-05-09","Sunset","South","Sioux","DFGH",45,945,416.25]
["2011-04-19","Quad","East","Sioux","PCC",18,486,261]
["2011-05-19","Quad","West","Smith","WFMI",64,1728,928]
["2011-03-23","Bellen","MidWest","Chin","ITW",42,924,420]
["2011-06-17","Sunshine","East","Chin","PSA",41,779,328]
["2011-04-04","Quad","West","Sioux","KPSA",10,270,145]
["2011-01-30","Quad","West","Chin","FM",59,1593,855.5]
["2011-05-02","Quad","South","Sioux","BBT",45,1215,652.5]
["2011-05-10","Sunshine","South","Smith","PSA",26,494,208]
["2011-05-16","Quad","South","Chin","KPSA",9,243,130.5]
["2011-01-27","Carlota","South","Smith","AA",20,460,220]
["2011-01-12","Bellen","West","Sioux","KPSA",18,396,180]
["2011-02-04","Quad","West","Gault","GRR",12,324,174]
["2011-02-04","Bellen","MidWest","Smith","WT",65,1430,650]
["2011-05-23","Quad","South","Sioux","FRED",20,540,290]
["2011-06-14","Quad","South","Gault","PCC",40,1080,580]
["2011-05-01","Sunshine","West","Pham","DFR",52,988,416]
["2011-01-11","Carlota","MidWest","Franks","FM",53,1219,583]
["2011-06-17","Carlota","South","Pham","FRED",19,437,209]
["2011-01-06","Quad","West","Pham","FRED",13,351,188.5]
["2011-04-09","Bellen","West","Sioux","DFGH",43,946,430]
["2011-05-15","Quad","MidWest","Chin","ITW",18,486,261]
["2011-01-01","Quad","South","Pham","KBTB",45,1215,652.5]
["2011-05-30","Quad","South","Smith","GRR",50,1350,725]
["2011-02-09","Bellen","MidWest","Sioux","DFR",64,1408,640]
["2011-03-21","Carlota","South","Sioux","LOP",28,644,308]
["2011-03-24","Bellen","MidWest","Sioux","WSD",30,660,300]
["2011-06-01","Quad","West","Chin","WFMI",28,756,406]
["2011-04-28","Carlota","South","Gault","KBTB",15,345,165]
["2011-01-06","Sunset","South","Smith","DFGH",64,1344,592]
["2011-06-08","Carlota","West","Franks","WSD",19,437,209]
["2011-05-03","Bellen","MidWest","Smith","AA",22,484,220]
["2011-05-17","Carlota","West","Pham","QT",60,1380,660]
["2011-05-29","Sunshine","South","Gault","ET",63,1197,504]
["2011-02-19","Bellen","South","Pham","EPP",64,1408,640]
["2011-02-09","Bellen","South","Pham","DFR",40,880,400]
["2011-05-19","Sunset","West","Franks","AST",19,399,175.75]
["2011-06-20","Sunset","South","Smith","LOP",14,294,129.5]
["2011-01-31","Quad","MidWest","Chin","PLOT",40,1080,580]
["2011-01-07","Bellen","South","Franks","AA",18,396,180]
["2011-04-01","Carlota","MidWest","Chin","ZAT",22,506,242]
["2011-06-05","Sunset","West","Pham","TTT",20,420,185]
["2011-03-25","Sunset","MidWest","Franks","SFWK",13,273,120.25]
["2011-02-18","Bellen","West","Smith","TRU",50,1100,500]
["2011-04-19","Sunshine","MidWest","Chin","AST",9,171,72]
["2011-05-05","Sunshine","MidWest","Gault","BBT",58,1102,464]
["2011-06-02","Bellen","MidWest","Sioux","SFWK",57,1254,570]
["2011-06-21","Carlota","MidWest","Chin","LOP",30,690,330]
["2011-02-05","Sunset","MidWest","Franks","ZAT",27,567,249.75]
["2011-01-23","Quad","South","Franks","AA",60,1620,870]
["2011-02-18","Bellen","West","Sioux","HHH",30,660,300]
["2011-01-07","Quad","MidWest","Chin","T",15,405,217.5]
["2011-02-18","Sunset","MidWest","Smith","TRU",11,231,101.75]
["2011-03-28","Sunshine","MidWest","Smith","HII",34,646,272]
["2011-04-20","Bellen","East","Chin","TTT",56,1232,560]
["2011-01-03","Quad","South","Sioux","ET",41,1107,594.5]
["2011-04-13","Quad","West","Gault","AA",46,1242,667]
["2011-02-18","Sunset","West","Pham","FRED",32,672,296]
["2011-04-20","Bellen","MidWest","Franks","KBTB",55,1210,550]
["2011-05-19","Bellen","South","Smith","MNGD",56,1232,560]
["2011-02-27","Bellen","East","Chin","WFMI",34,748,340]
["2011-05-16","Sunshine","East","Franks","BBT",37,703,296]
["2011-05-29","Bellen","West","Franks","TTT",11,242,110]
["2011-02-19","Carlota","East","Gault","ZAT",56,1288,616]
["2011-03-13","Bellen","South","Gault","LOP",36,792,360]
["2011-02-20","Sunset","East","Sioux","YTR",27,567,249.75]
["2011-05-15","Quad","MidWest","Pham","TTT",55,1485,797.5]
["2011-01-16","Bellen","East","Smith","AST",54,1188,540]
["2011-01-08","Bellen","MidWest","Gault","PCC",60,1320,600]
["2011-05-06","Quad","East","Gault","PSA",28,756,406]
["2011-05-29","Bellen","West","Franks","DDH",37,814,370]
["2011-03-26","Sunshine","West","Smith","FRED",6,114,48]
["2011-06-19","Bellen","West","Pham","ITW",33,726,330]
["2011-01-18","Sunshine","South","Gault","AA",21,399,168]
["2011-05-20","Quad","East","Gault","PCC",39,1053,565.5]
["2011-04-08","Sunshine","West","Gault","ITTW",59,1121,472]
["2011-05-05","Carlota","West","Gault","QT",43,989,473]
["2011-02-21","Carlota","West","Smith","PLOT",64,1472,704]
["2011-03-15","Sunset","East","Sioux","FM",48,1008,444]
["2011-02-09","Sunshine","West","Sioux","TTT",33,627,264]
["2011-01-04","Carlota","South","Smith","DFGH",50,1150,550]
["2011-02-03","Quad","West","Pham","TRU",43,1161,623.5]
["2011-01-19","Sunshine","East","Pham","SFWK",37,703,296]
["2011-01-18","Sunshine","South","Chin","HII",14,266,112]
["2011-06-05","Sunset","East","Smith","AA",19,399,175.75]
["2011-01-10","Quad","West","Chin","PCC",33,891,478.5]
["2011-03-14","Quad","West","Sioux","SFWK",62,1674,899]
["2011-01-03","Carlota","South","Franks","WT",56,1288,616]
["2011-01-06","Sunshine","South","Chin","LOP",20,380,160]
["2011-03-04","Quad","MidWest","Pham","DDH",45,1215,652.5]
["2011-03-21","Carlota","West","Pham","KBTB",26,598,286]
["2011-02-28","Quad","West","Franks","PSA",14,378,203]
["2011-05-27","Bellen","East","Pham","LOP",46,1012,460]
["2011-05-20","Carlota","South","Smith","WT",10,230,110]
["2011-06-04","Sunset","West","Smith","YTR",56,1176,518]
["2011-02-25","Sunset","MidWest","Sioux","ITW",31,651,286.75]
["2011-02-16","Sunset","East","Pham","FRED",51,1071,471.75]
["2011-06-27","Bellen","West","Pham","TTT",52,1144,520]
["2011-04-08","Bellen","East","Franks","TTT",65,1430,650]
["2011-01-15","Bellen","East","Smith","TTT",52,1144,520]
["2011-04-26","Sunset","MidWest","Sioux","LOP",42,882,388.5]
["2011-04-24","Bellen","MidWest","Chin","PSA",55,1210,550]
["2011-05-25","Quad","MidWest","Sioux","AA",27,729,391.5]
["2011-05-23","Sunshine","East","Franks","FM",29,551,232]
["2011-02-06","Carlota","MidWest","Pham","KBTB",41,943,451]
["2011-04-24","Bellen","East","Gault","ITTW",42,924,420]
["2011-04-25","Sunshine","East","Gault","FRED",57,1083,456]
["2011-02-19","Carlota","East","Chin","GRR",35,805,385]
["2011-01-22","Bellen","South","Smith","PCC",42,924,420]
["2011-02-20","Bellen","MidWest","Chin","ITW",9,198,90]
["2011-03-23","Quad","South","Chin","T",58,1566,841]
["2011-05-03","Sunset","MidWest","Smith","WT",17,357,157.25]
["2011-02-12","Bellen","MidWest","Sioux","AST",30,660,300]
["2011-05-09","Bellen","South","Sioux","QT",44,968,440]
["2011-06-15","Sunshine","South","Gault","BBT",38,722,304]
["2011-01-17","Sunshine","MidWest","Pham","PCC",29,551,232]
["2011-01-24","Quad","East","Chin","ITW",14,378,203]
["2011-01-10","Bellen","West","Franks","FM",31,682,310]
["2011-06-22","Sunset","East","Smith","PLOT",63,1323,582.75]
["2011-02-05","Bellen","South","Pham","YTR",21,462,210]
["2011-01-02","Quad","West","Pham","DFR",27,729,391.5]
["2011-01-17","Quad","MidWest","Chin","HHH",58,1566,841]
["2011-06-18","Sunshine","East","Pham","PCC",42,798,336]
["2011-06-16","Carlota","East","Smith","WSD",39,897,429]
["2011-06-06","Sunshine","East","Franks","PCC",9,171,72]
["2011-05-21","Sunset","South","Franks","T",31,651,286.75]
["2011-04-19","Carlota","South","Pham","GRR",60,1380,660]
["2011-03-01","Quad","South","Franks","ITTW",14,378,203]
["2011-04-13","Sunshine","MidWest","Chin","HII",48,912,384]
["2011-04-17","Sunset","South","Sioux","TRU",58,1218,536.5]
["2011-03-02","Bellen","South","Smith","ITW",22,484,220]
["2011-05-30","Sunset","South","Chin","ITW",39,819,360.75]
["2011-01-13","Sunshine","West","Gault","KPSA",48,912,384]
["2011-04-07","Quad","MidWest","Franks","WT",46,1242,667]
["2011-04-19","Carlota","East","Pham","WSD",10,230,110]
["2011-02-14","Sunshine","East","Smith","HII",26,494,208]
["2011-03-06","Sunset","East","Chin","GRR",34,714,314.5]
["2011-06-16","Sunset","East","Sioux","DFGH",47,987,434.75]
["2011-03-31","Sunshine","West","Smith","DDH",16,304,128]
["2011-01-17","Quad","South","Smith","MNGD",31,837,449.5]
["2011-03-03","Bellen","West","Sioux","WT",30,660,300]
["2011-04-23","Quad","West","Franks","QT",44,1188,638]
["2011-03-29","Bellen","South","Chin","TRU",15,330,150]
["2011-03-20","Bellen","MidWest","Gault","DDH",30,660,300]
["2011-06-24","Sunset","South","Franks","QT",9,189,83.25]
["2011-03-13","Bellen","MidWest","Sioux","SFWK",30,660,300]
["2011-02-10","Sunset","South","Sioux","KBTB",28,588,259]
["2011-05-30","Sunset","South","Chin","WFMI",26,546,240.5]
["2011-05-18","Carlota","West","Sioux","TTT",13,299,143]
["2011-04-14","Quad","South","Sioux","PLOT",60,1620,870]
["2011-04-30","Quad","South","Smith","DDH",60,1620,870]
["2011-04-23","Quad","West","Sioux","PCC",11,297,159.5]
["2011-03-07","Sunset","South","Sioux","FM",16,336,148]
["2011-02-19","Sunshine","South","Pham","PLOT",61,1159,488]
["2011-03-14","Sunshine","West","Sioux","GRR",35,665,280]
["2011-03-30","Sunshine","South","Sioux","DFR",48,912,384]
["2011-04-12","Sunset","East","Smith","YTR",44,924,407]
["2011-06-04","Quad","South","Pham","EPP",46,1242,667]
["2011-05-28","Sunshine","East","Smith","WT",9,171,72]
["2011-01-08","Carlota","West","Pham","ITTW",23,529,253]
["2011-06-29","Sunshine","South","Franks","EPP",31,589,248]
["2011-01-26","Carlota","South","Gault","FM",63,1449,693]
["2011-06-18","Sunset","MidWest","Sioux","GRR",51,1071,471.75]
["2011-03-22","Sunset","East","Franks","WFMI",55,1155,508.75]
["2011-03-31","Sunshine","MidWest","Sioux","FM",19,361,152]
["2011-03-26","Carlota","West","Pham","KBTB",11,253,121]
["2011-01-09","Sunset","South","Franks","FM",65,1365,601.25]
["2011-01-14","Quad","South","Pham","TRU",34,918,493]
["2011-06-12","Quad","East","Sioux","ET",64,1728,928]
["2011-05-07","Bellen","South","Pham","TTT",41,902,410]
["2011-01-26","Sunshine","MidWest","Smith","ITW",42,798,336]
["2011-03-07","Carlota","East","Sioux","TRU",41,943,451]
["2011-04-28","Bellen","South","Gault","AST",7,154,70]
["2011-01-06","Quad","East","Franks","TRU",18,486,261]
["2011-01-14","Quad","South","Franks","QT",56,1512,812]
["2011-02-20","Sunshine","West","Smith","WFMI",10,190,80]
["2011-02-15","Carlota","East","Chin","AA",19,437,209]
["2011-06-28","Carlota","East","Smith","JAQ",15,345,165]
["2011-02-08","Bellen","East","Sioux","WT",53,1166,530]
["2011-05-23","Quad","MidWest","Smith","AA",42,1134,609]
["2011-03-15","Bellen","South","Franks","KBTB",51,1122,510]
["2011-05-12","Carlota","West","Franks","WT",52,1196,572]
["2011-03-09","Bellen","West","Gault","WT",16,352,160]
["2011-04-20","Sunshine","South","Franks","MBG",64,1216,512]
["2011-01-19","Bellen","South","Smith","TRU",26,572,260]
["2011-05-12","Sunshine","West","Sioux","ZAT",49,931,392]
["2011-04-21","Carlota","West","Smith","TTT",61,1403,671]
["2011-01-19","Quad","MidWest","Smith","JAQ",37,999,536.5]
["2011-06-11","Sunset","South","Pham","FM",36,756,333]
["2011-03-01","Quad","East","Gault","WFMI",41,1107,594.5]
["2011-06-20","Sunshine","MidWest","Sioux","EPP",29,551,232]
["2011-01-19","Bellen","South","Franks","BBT",18,396,180]
["2011-01-30","Sunset","South","Gault","ZAT",23,483,212.75]
["2011-06-21","Quad","East","Franks","KBTB",30,810,435]
["2011-02-18","Sunshine","South","Pham","MNGD",15,285,120]
["2011-03-28","Quad","MidWest","Gault","JAQ",59,1593,855.5]
["2011-04-18","Sunset","East","Smith","TTT",57,1197,527.25]
["2011-03-11","Sunshine","MidWest","Pham","DFR",8,152,64]
["2011-01-16","Carlota","South","Pham","KBTB",33,759,363]
["2011-04-05","Carlota","West","Sioux","TTT",37,851,407]
["2011-06-28","Sunshine","MidWest","Smith","FM",60,1140,480]
["2011-03-05","Quad","MidWest","Chin","ITW",26,702,377]
["2011-03-16","Sunshine","MidWest","Smith","PCC",11,209,88]
["2011-06-26","Sunset","West","Smith","SFWK",23,483,212.75]
["2011-03-27","Carlota","East","Pham","ZAT",57,1311,627]
["2011-04-20","Bellen","South","Smith","FRED",20,440,200]
["2011-02-25","Quad","East","Chin","MBG",38,1026,551]
["2011-06-12","Bellen","MidWest","Pham","KPSA",6,132,60]
["2011-02-02","Sunshine","South","Sioux","YTR",39,741,312]
["2011-04-11","Quad","South","Sioux","HHH",10,270,145]
["2011-03-30","Quad","South","Sioux","DDH",45,1215,652.5]
["2011-04-26","Bellen","East","Chin","PCC",55,1210,550]
["2011-03-28","Sunshine","East","Sioux","FM",25,475,200]
["2011-05-01","Quad","MidWest","Smith","ITW",44,1188,638]
["2011-01-25","Carlota","East","Gault","TRU",21,483,231]
["2011-03-31","Bellen","MidWest","Pham","WT",13,286,130]
["2011-02-03","Carlota","MidWest","Franks","SFWK",17,391,187]
["2011-06-04","Bellen","West","Sioux","WSD",52,1144,520]
["2011-02-26","Bellen","South","Sioux","HII",29,638,290]
["2011-03-23","Sunset","East","Gault","KPSA",63,1323,582.75]
["2011-04-10","Bellen","West","Pham","ITW",19,418,190]
["2011-06-09","Sunset","South","Smith","AST",51,1071,471.75]
["2011-03-13","Carlota","West","Chin","AA",9,207,99]
["2011-06-06","Sunshine","East","Smith","TTT",57,1083,456]
["2011-02-01","Sunset","East","Franks","HHH",46,966,425.5]
["2011-05-17","Carlota","East","Smith","FRED",51,1173,561]
["2011-05-09","Sunshine","East","Gault","ITTW",48,912,384]
["2011-05-29","Quad","South","Gault","MBG",34,918,493]
["2011-02-27","Quad","South","Pham","EPP",16,432,232]
["2011-06-23","Carlota","West","Gault","PLOT",54,1242,594]
["2011-06-28","Sunshine","MidWest","Pham","DFR",22,418,176]
["2011-06-04","Sunset","West","Smith","TRU",28,588,259]
["2011-03-07","Bellen","MidWest","Gault","KBTB",30,660,300]
["2011-02-03","Carlota","South","Chin","MNGD",37,851,407]
["2011-02-15","Bellen","East","Gault","LOP",27,594,270]
["2011-06-20","Sunset","MidWest","Chin","WSD",10,210,92.5]
["2011-03-31","Bellen","MidWest","Chin","ET",51,1122,510]
["2011-01-07","Quad","East","Sioux","FRED",56,1512,812]
["2011-06-16","Sunshine","MidWest","Pham","HHH",52,988,416]
["2011-04-18","Sunset","West","Franks","ITTW",11,231,101.75]
["2011-03-12","Quad","South","Sioux","KBTB",45,1215,652.5]
["2011-02-14","Sunset","MidWest","Chin","TRU",49,1029,453.25]
["2011-06-11","Sunshine","East","Gault","JAQ",25,475,200]
["2011-03-03","Sunshine","MidWest","Gault","HHH",12,228,96]
["2011-02-20","Sunshine","West","Smith","AST",42,798,336]
["2011-04-02","Sunshine","East","Pham","ZAT",46,874,368]
["2011-03-04","Sunset","West","Sioux","TRU",25,525,231.25]
["2011-03-28","Sunset","West","Gault","KBTB",19,399,175.75]
["2011-06-04","Sunshine","East","Smith","WFMI",31,589,248]
["2011-05-09","Bellen","South","Chin","WSD",23,506,230]
["2011-01-21","Carlota","MidWest","Smith","AST",49,1127,539]
["2011-01-24","Quad","MidWest","Smith","MBG",65,1755,942.5]
["2011-06-22","Carlota","MidWest","Sioux","ET",60,1380,660]
["2011-06-14","Bellen","East","Franks","HII",53,1166,530]
["2011-06-10","Sunshine","West","Chin","QT",20,380,160]
["2011-03-01","Carlota","West","Smith","KBTB",18,414,198]
["2011-02-23","Quad","East","Sioux","HHH",64,1728,928]
["2011-05-08","Carlota","MidWest","Chin","DFR",24,552,264]
["2011-04-07","Carlota","MidWest","Franks","T",21,483,231]
["2011-01-18","Sunshine","East","Sioux","SFWK",39,741,312]
["2011-05-31","Sunshine","East","Smith","GRR",55,1045,440]
["2011-02-07","Quad","East","Chin","TRU",57,1539,826.5]
["2011-02-01","Quad","West","Gault","HII",30,810,435]
["2011-04-10","Bellen","West","Franks","KBTB",62,1364,620]
["2011-03-04","Sunset","South","Franks","PSA",56,1176,518]
["2011-04-15","Carlota","East","Smith","LOP",28,644,308]
["2011-01-18","Sunset","East","Gault","TRU",23,483,212.75]
["2011-06-08","Bellen","MidWest","Franks","GRR",9,198,90]
["2011-05-06","Quad","South","Gault","DDH",42,1134,609]
["2011-03-17","Sunset","South","Franks","PSA",11,231,101.75]
["2011-01-08","Bellen","MidWest","Franks","PCC",39,858,390]
["2011-03-25","Carlota","South","Smith","BBT",19,437,209]
["2011-05-17","Sunshine","MidWest","Pham","AA",25,475,200]
["2011-05-20","Sunset","MidWest","Sioux","HHH",18,378,166.5]
["2011-04-13","Quad","West","Sioux","KPSA",33,891,478.5]
["2011-03-17","Sunset","MidWest","Pham","ITW",31,651,286.75]
["2011-05-20","Sunshine","East","Chin","TTT",61,1159,488]
["2011-06-22","Bellen","West","Smith","PCC",26,572,260]
["2011-05-07","Sunset","South","Chin","KBTB",63,1323,582.75]
["2011-03-25","Quad","East","Smith","FRED",10,270,145]
["2011-04-27","Sunset","East","Smith","PCC",34,714,314.5]
["2011-04-16","Bellen","South","Smith","ITTW",38,836,380]
["2011-05-15","Carlota","West","Gault","ITW",49,1127,539]
["2011-06-17","Sunset","West","Smith","HII",54,1134,499.5]
["2011-03-30","Bellen","MidWest","Sioux","TTT",16,352,160]
["2011-05-15","Quad","West","Sioux","DFR",32,864,464]
["2011-03-18","Sunshine","West","Gault","DFGH",10,190,80]
["2011-01-23","Bellen","South","Franks","AST",60,1320,600]
["2011-05-20","Sunshine","South","Chin","KPSA",19,361,152]
["2011-04-18","Carlota","South","Chin","TTT",24,552,264]
["2011-02-21","Sunshine","West","Chin","TTT",14,266,112]
["2011-02-21","Quad","East","Smith","BBT",10,270,145]
["2011-01-08","Sunset","MidWest","Chin","BBT",30,630,277.5]
["2011-01-17","Carlota","East","Chin","AA",52,1196,572]
["2011-06-19","Sunset","West","Franks","EPP",16,336,148]
["2011-05-22","Quad","South","Pham","WSD",60,1620,870]
["2011-04-06","Carlota","East","Pham","PCC",20,460,220]
["2011-05-22","Carlota","West","Chin","PCC",17,391,187]
["2011-05-25","Sunset","South","Chin","WT",23,483,212.75]
["2011-01-12","Sunset","MidWest","Gault","YTR",48,1008,444]
["2011-06-05","Carlota","West","Franks","DDH",57,1311,627]
["2011-04-29","Bellen","West","Chin","ET",48,1056,480]
["2011-01-07","Sunset","South","Sioux","DFR",39,819,360.75]
["2011-02-20","Bellen","South","Sioux","FRED",62,1364,620]
["2011-02-06","Sunshine","MidWest","Sioux","MBG",65,1235,520]
["2011-01-17","Bellen","MidWest","Smith","DFGH",22,484,220]
["2011-05-09","Sunshine","West","Gault","WFMI",27,513,216]
["2011-04-02","Quad","West","Sioux","FM",63,1701,913.5]
["2011-05-04","Sunshine","South","Franks","TRU",43,817,344]
["2011-03-06","Sunset","West","Smith","WSD",60,1260,555]
["2011-02-14","Quad","South","Gault","MBG",15,405,217.5]
["2011-04-04","Bellen","MidWest","Franks","BBT",43,946,430]
["2011-05-25","Bellen","MidWest","Chin","QT",51,1122,510]
["2011-06-28","Bellen","East","Chin","WSD",41,902,410]
["2011-01-17","Carlota","West","Pham","DDH",42,966,462]
["2011-05-23","Bellen","East","Chin","WFMI",21,462,210]
["2011-02-07","Sunshine","West","Smith","HII",36,684,288]
["2011-05-18","Bellen","East","Pham","KBTB",56,1232,560]
["2011-06-09","Bellen","East","Gault","PCC",28,616,280]
["2011-06-20","Carlota","East","Franks","QT",35,805,385]
["2011-05-02","Quad","South","Sioux","KBTB",27,729,391.5]
["2011-06-27","Quad","MidWest","Gault","WT",29,783,420.5]
["2011-05-16","Sunshine","West","Smith","SFWK",64,1216,512]
["2011-02-02","Sunset","East","Chin","DDH",22,462,203.5]
["2011-03-05","Sunshine","East","Smith","YTR",47,893,376]
["2011-04-30","Bellen","South","Sioux","WT",43,946,430]
["2011-05-13","Sunset","MidWest","Gault","PSA",20,420,185]
["2011-01-07","Carlota","MidWest","Pham","KPSA",21,483,231]
["2011-06-16","Sunset","West","Sioux","TTT",23,483,212.75]
["2011-03-20","Sunshine","East","Smith","DDH",31,589,248]
["2011-05-01","Bellen","East","Sioux","FM",7,154,70]
["2011-02-05","Quad","East","Chin","T",28,756,406]
["2011-02-07","Quad","West","Chin","PSA",43,1161,623.5]
["2011-04-30","Sunset","MidWest","Chin","JAQ",23,483,212.75]
["2011-01-05","Sunset","West","Smith","DFR",8,168,74]
["2011-01-12","Carlota","South","Franks","TTT",22,506,242]
["2011-05-15","Carlota","West","Smith","AA",39,897,429]
["2011-06-07","Sunshine","West","Chin","T",44,836,352]
["2011-02-17","Bellen","South","Sioux","TRU",9,198,90]
["2011-05-24","Quad","East","Gault","KPSA",53,1431,768.5]
["2011-05-30","Carlota","East","Chin","PLOT",43,989,473]
["2011-06-23","Carlota","MidWest","Pham","FRED",60,1380,660]
["2011-03-24","Carlota","South","Chin","DFGH",27,621,297]
["2011-06-21","Carlota","South","Pham","QT",27,621,297]
["2011-02-07","Carlota","South","Gault","WT",48,1104,528]
["2011-02-09","Sunshine","MidWest","Chin","MNGD",42,798,336]
["2011-02-22","Sunshine","MidWest","Smith","MNGD",39,741,312]
["2011-03-18","Sunset","West","Franks","HII",11,231,101.75]
["2011-02-08","Carlota","East","Franks","TTT",38,874,418]
["2011-01-08","Carlota","East","Smith","ZAT",53,1219,583]
["2011-06-25","Sunset","South","Gault","WSD",7,147,64.75]
["2011-02-07","Bellen","East","Gault","TRU",41,902,410]
["2011-04-29","Carlota","East","Gault","ITTW",13,299,143]
["2011-03-18","Bellen","East","Sioux","WT",15,330,150]
["2011-04-02","Carlota","South","Chin","DFR",42,966,462]
["2011-01-04","Carlota","West","Chin","PSA",40,920,440]
["2011-05-29","Carlota","East","Sioux","FM",30,690,330]
["2011-03-01","Sunset","West","Chin","BBT",27,567,249.75]
["2011-06-15","Carlota","East","Smith","HHH",8,184,88]
["2011-02-12","Carlota","MidWest","Sioux","SFWK",22,506,242]
["2011-03-27","Quad","South","Franks","EPP",23,621,333.5]
["2011-01-26","Quad","MidWest","Franks","QT",61,1647,884.5]
["2011-06-12","Quad","MidWest","Chin","DFGH",58,1566,841]
["2011-03-16","Quad","South","Pham","HII",33,891,478.5]
["2011-01-27","Sunset","South","Chin","WT",45,945,416.25]
["2011-05-02","Sunshine","MidWest","Smith","TTT",32,608,256]
["2011-03-29","Sunshine","MidWest","Chin","DFGH",65,1235,520]
["2011-01-12","Sunset","West","Chin","GRR",15,315,138.75]
["2011-06-20","Carlota","MidWest","Sioux","WSD",38,874,418]
["2011-06-10","Carlota","South","Gault","LOP",42,966,462]
["2011-02-23","Quad","East","Franks","LOP",23,621,333.5]
["2011-04-29","Bellen","West","Smith","DFGH",54,1188,540]
["2011-06-10","Carlota","West","Sioux","QT",61,1403,671]
["2011-01-05","Bellen","East","Chin","JAQ",34,748,340]
["2011-04-17","Sunset","South","Sioux","KPSA",50,1050,462.5]
["2011-04-06","Quad","East","Chin","WT",37,999,536.5]
["2011-03-13","Quad","MidWest","Franks","WFMI",58,1566,841]
["2011-03-13","Quad","South","Gault","WT",60,1620,870]
["2011-03-02","Sunset","South","Gault","PSA",36,756,333]
["2011-01-22","Sunshine","MidWest","Sioux","PLOT",43,817,344]
["2011-02-08","Sunset","East","Franks","GRR",48,1008,444]
["2011-05-22","Sunset","East","Sioux","FRED",65,1365,601.25]
["2011-03-09","Carlota","MidWest","Sioux","FRED",34,782,374]
["2011-04-07","Quad","South","Smith","HHH",9,243,130.5]
["2011-04-17","Sunset","South","Chin","T",37,777,342.25]
["2011-06-17","Quad","South","Smith","KBTB",61,1647,884.5]
["2011-04-16","Quad","South","Smith","JAQ",54,1458,783]
["2011-05-10","Sunshine","West","Gault","DDH",14,266,112]
["2011-03-30","Bellen","South","Smith","T",23,506,230]
["2011-02-14","Bellen","East","Chin","PSA",10,220,100]
["2011-06-19","Bellen","South","Smith","MNGD",46,1012,460]
["2011-02-11","Sunset","West","Smith","TTT",56,1176,518]
["2011-06-25","Bellen","East","Franks","TTT",18,396,180]
["2011-04-05","Bellen","South","Pham","WSD",59,1298,590]
["2011-01-25","Sunshine","South","Chin","MBG",30,570,240]
["2011-05-19","Sunshine","MidWest","Smith","PLOT",48,912,384]
["2011-04-28","Sunset","East","Pham","FM",28,588,259]
["2011-04-11","Carlota","West","Franks","KBTB",15,345,165]
["2011-01-27","Quad","South","Franks","AA",58,1566,841]
["2011-01-18","Bellen","West","Chin","MNGD",58,1276,580]
["2011-04-12","Sunset","South","Smith","BBT",61,1281,564.25]
["2011-04-24","Bellen","MidWest","Gault","TTT",45,990,450]
["2011-03-18","Carlota","East","Sioux","TTT",65,1495,715]
["2011-06-13","Bellen","East","Sioux","HII",47,1034,470]
["2011-04-21","Bellen","South","Sioux","TTT",12,264,120]
["2011-04-23","Carlota","West","Smith","KPSA",51,1173,561]
["2011-02-18","Sunshine","MidWest","Franks","DFGH",50,950,400]
["2011-01-30","Sunshine","West","Sioux","TTT",58,1102,464]
["2011-02-02","Sunshine","West","Smith","ET",56,1064,448]
["2011-03-05","Carlota","MidWest","Pham","EPP",45,1035,495]
["2011-06-20","Bellen","West","Pham","KPSA",10,220,100]
["2011-04-27","Bellen","East","Sioux","DDH",16,352,160]
["2011-01-30","Bellen","West","Chin","EPP",52,1144,520]
["2011-01-26","Carlota","East","Sioux","BBT",51,1173,561]
["2011-02-21","Sunset","MidWest","Chin","AA",36,756,333]
["2011-04-23","Bellen","South","Franks","DFR",19,418,190]
["2011-05-13","Sunset","South","Franks","ITW",45,945,416.25]
["2011-05-18","Carlota","West","Gault","T",17,391,187]
["2011-04-02","Carlota","MidWest","Pham","ZAT",30,690,330]
["2011-04-04","Quad","East","Sioux","BBT",12,324,174]
["2011-01-26","Sunset","West","Gault","QT",43,903,397.75]
["2011-06-16","Sunset","MidWest","Chin","GRR",8,168,74]
["2011-01-15","Sunshine","MidWest","Sioux","WT",6,114,48]
["2011-04-20","Sunset","West","Sioux","WT",14,294,129.5]
["2011-01-02","Sunset","West","Chin","TTT",61,1281,564.25]
["2011-01-31","Bellen","MidWest","Chin","FRED",58,1276,580]
["2011-02-20","Bellen","West","Pham","ITTW",7,154,70]
["2011-03-09","Carlota","South","Franks","T",55,1265,605]
["2011-02-16","Carlota","East","Smith","ZAT",58,1334,638]
["2011-06-14","Sunshine","East","Smith","DFR",51,969,408]
["2011-03-01","Quad","East","Smith","TTT",21,567,304.5]
["2011-01-28","Carlota","East","Sioux","FRED",49,1127,539]
["2011-05-26","Sunset","MidWest","Sioux","FM",58,1218,536.5]
["2011-03-16","Quad","West","Pham","KBTB",51,1377,739.5]
["2011-03-15","Sunshine","West","Sioux","MBG",58,1102,464]
["2011-04-12","Carlota","MidWest","Pham","JAQ",31,713,341]
["2011-02-22","Carlota","South","Pham","SFWK",25,575,275]
["2011-04-03","Sunshine","East","Smith","TRU",23,437,184]
["2011-04-01","Sunshine","West","Franks","KPSA",49,931,392]
["2011-03-01","Sunshine","South","Gault","WSD",53,1007,424]
["2011-01-11","Quad","East","Gault","TTT",52,1404,754]
["2011-01-21","Quad","East","Franks","WFMI",29,783,420.5]
["2011-02-06","Quad","West","Franks","WT",23,621,333.5]
["2011-03-23","Bellen","MidWest","Pham","AST",16,352,160]
["2011-04-23","Sunset","South","Smith","ET",10,210,92.5]
["2011-02-14","Quad","West","Gault","DFR",15,405,217.5]
["2011-05-13","Quad","MidWest","Smith","TTT",47,1269,681.5]
["2011-02-02","Quad","MidWest","Gault","TRU",8,216,116]
["2011-05-20","Bellen","South","Franks","PSA",48,1056,480]
["2011-01-30","Sunset","South","Franks","TRU",6,126,55.5]
["2011-02-10","Bellen","South","Gault","TTT",17,374,170]
["2011-02-14","Sunshine","MidWest","Smith","JAQ",38,722,304]
["2011-03-22","Sunshine","MidWest","Pham","HHH",52,988,416]
["2011-04-10","Sunset","East","Smith","HHH",23,483,212.75]
["2011-03-08","Sunset","South","Pham","TTT",50,1050,462.5]
["2011-02-05","Sunshine","MidWest","Gault","HII",11,209,88]
["2011-01-11","Sunshine","East","Pham","TTT",14,266,112]
["2011-03-10","Quad","East","Chin","GRR",30,810,435]
["2011-06-17","Quad","MidWest","Smith","PSA",6,162,87]
["2011-01-23","Sunshine","West","Sioux","BBT",41,779,328]
["2011-02-15","Bellen","South","Chin","PCC",14,308,140]
["2011-06-27","Quad","East","Sioux","WT",48,1296,696]
["2011-02-06","Carlota","South","Chin","FRED",52,1196,572]
["2011-06-14","Sunshine","South","Sioux","HII",31,589,248]
["2011-05-14","Sunshine","East","Gault","LOP",59,1121,472]
["2011-06-26","Carlota","West","Chin","ET",38,874,418]
["2011-02-10","Sunset","South","Sioux","BBT",57,1197,527.25]
["2011-04-23","Sunshine","South","Smith","FRED",63,1197,504]
["2011-04-11","Sunset","MidWest","Franks","WT",38,798,351.5]
["2011-02-23","Bellen","East","Chin","KPSA",8,176,80]
["2011-04-25","Sunset","South","Pham","WSD",47,987,434.75]
["2011-02-18","Bellen","West","Sioux","GRR",50,1100,500]
["2011-03-15","Sunshine","West","Gault","PLOT",36,684,288]
["2011-02-16","Carlota","MidWest","Pham","PCC",37,851,407]
["2011-04-07","Sunset","West","Franks","PLOT",51,1071,471.75]
["2011-03-30","Carlota","MidWest","Gault","PCC",65,1495,715]
["2011-03-09","Carlota","West","Smith","WT",46,1058,506]
["2011-02-17","Carlota","East","Pham","TTT",8,184,88]
["2011-04-27","Bellen","East","Pham","LOP",35,770,350]
["2011-06-17","Bellen","MidWest","Sioux","DFGH",56,1232,560]
["2011-04-26","Sunset","East","Sioux","PLOT",7,147,64.75]
["2011-04-11","Sunshine","South","Smith","ZAT",41,779,328]
["2011-06-11","Sunset","South","Pham","PLOT",42,882,388.5]
["2011-03-15","Carlota","East","Gault","ITTW",40,920,440]
["2011-04-06","Sunshine","East","Sioux","BBT",36,684,288]
["2011-02-20","Carlota","East","Chin","HII",14,322,154]
["2011-03-17","Sunshine","MidWest","Pham","KBTB",12,228,96]
["2011-05-13","Carlota","MidWest","Sioux","DFR",56,1288,616]
["2011-03-16","Quad","East","Pham","LOP",8,216,116]
["2011-04-27","Bellen","East","Sioux","TTT",17,374,170]
["2011-01-09","Quad","East","Franks","SFWK",8,216,116]
["2011-04-16","Sunset","East","Smith","T",23,483,212.75]
["2011-04-17","Sunshine","South","Sioux","AST",36,684,288]
["2011-05-18","Quad","South","Sioux","T",20,540,290]
["2011-04-06","Bellen","West","Gault","BBT",63,1386,630]
["2011-02-04","Quad","MidWest","Franks","TTT",24,648,348]
["2011-06-17","Bellen","West","Gault","GRR",14,308,140]
["2011-05-03","Sunshine","West","Franks","TTT",22,418,176]
["2011-05-30","Sunset","South","Gault","TTT",22,462,203.5]
["2011-04-09","Bellen","South","Franks","TRU",10,220,100]
["2011-02-19","Sunset","South","Gault","DFR",17,357,157.25]
["2011-06-14","Carlota","East","Sioux","SFWK",48,1104,528]
["2011-06-08","Carlota","MidWest","Pham","FRED",18,414,198]
["2011-06-02","Quad","East","Chin","KPSA",62,1674,899]
["2011-06-19","Quad","South","Chin","YTR",65,1755,942.5]
["2011-04-19","Sunset","MidWest","Sioux","GRR",22,462,203.5]
["2011-03-03","Bellen","South","Pham","DFR",48,1056,480]
["2011-05-02","Sunshine","MidWest","Sioux","FRED",39,741,312]
["2011-02-08","Bellen","South","Pham","ZAT",54,1188,540]
["2011-04-10","Carlota","West","Pham","QT",35,805,385]
["2011-02-02","Sunshine","West","Chin","T",42,798,336]
["2011-05-30","Quad","South","Gault","MNGD",29,783,420.5]
["2011-06-18","Quad","East","Gault","WSD",20,540,290]
["2011-01-02","Sunset","South","Sioux","BBT",54,1134,499.5]
["2011-01-20","Sunset","West","Franks","HII",62,1302,573.5]
["2011-06-12","Bellen","South","Franks","YTR",6,132,60]
["2011-06-12","Bellen","East","Smith","WSD",17,374,170]
["2011-02-09","Carlota","West","Franks","DFR",35,805,385]
["2011-05-11","Sunshine","West","Sioux","BBT",36,684,288]
["2011-05-31","Sunset","West","Chin","EPP",14,294,129.5]
["2011-04-11","Bellen","South","Chin","HII",36,792,360]
["2011-06-12","Sunset","South","Sioux","BBT",22,462,203.5]
["2011-04-04","Sunshine","South","Chin","GRR",39,741,312]
["2011-03-18","Sunset","East","Chin","HHH",46,966,425.5]
["2011-05-07","Sunset","East","Franks","TTT",47,987,434.75]
["2011-01-22","Bellen","MidWest","Chin","JAQ",58,1276,580]
["2011-05-08","Sunset","MidWest","Chin","WFMI",19,399,175.75]
["2011-02-23","Carlota","East","Franks","TTT",12,276,132]
["2011-05-22","Quad","East","Smith","FM",35,945,507.5]
["2011-01-19","Bellen","South","Franks","HII",50,1100,500]
["2011-06-20","Sunset","West","Pham","ZAT",7,147,64.75]
["2011-05-29","Carlota","East","Franks","MBG",55,1265,605]
["2011-01-08","Quad","MidWest","Pham","DDH",63,1701,913.5]
["2011-06-15","Sunset","South","Gault","TRU",13,273,120.25]
["2011-03-23","Sunshine","MidWest","Smith","DFR",12,228,96]
["2011-03-23","Carlota","West","Pham","HII",23,529,253]
["2011-06-02","Carlota","East","Gault","KPSA",56,1288,616]
["2011-02-28","Sunshine","South","Chin","MNGD",53,1007,424]
["2011-01-02","Bellen","MidWest","Sioux","HHH",62,1364,620]
["2011-03-12","Sunset","East","Pham","GRR",26,546,240.5]
["2011-06-03","Bellen","MidWest","Pham","DDH",22,484,220]
["2011-01-03","Carlota","East","Gault","AST",65,1495,715]
["2011-06-18","Bellen","MidWest","Smith","GRR",23,506,230]
["2011-06-09","Quad","South","Chin","JAQ",7,189,101.5]
["2011-04-01","Sunshine","East","Franks","WT",26,494,208]
["2011-05-13","Sunset","West","Gault","DFGH",35,735,323.75]
["2011-06-03","Sunset","East","Smith","HHH",34,714,314.5]
["2011-05-04","Bellen","West","Pham","HHH",62,1364,620]
["2011-04-29","Bellen","East","Franks","PSA",63,1386,630]
["2011-05-07","Carlota","West","Franks","ET",36,828,396]
["2011-04-09","Carlota","East","Smith","PSA",40,920,440]
["2011-03-21","Sunshine","East","Sioux","ET",9,171,72]
["2011-04-13","Bellen","West","Chin","JAQ",7,154,70]
["2011-04-26","Bellen","East","Sioux","QT",55,1210,550]
["2011-01-28","Quad","MidWest","Smith","ITW",29,783,420.5]
["2011-02-06","Quad","East","Chin","TTT",6,162,87]
["2011-03-20","Bellen","MidWest","Sioux","PSA",65,1430,650]
["2011-02-24","Carlota","West","Gault","DFR",14,322,154]
["2011-01-09","Sunset","East","Sioux","TTT",54,1134,499.5]
["2011-03-07","Carlota","West","Sioux","HHH",11,253,121]
["2011-05-05","Sunset","West","Pham","GRR",61,1281,564.25]
["2011-01-29","Carlota","East","Pham","HII",60,1380,660]
["2011-06-22","Carlota","East","Gault","ITTW",20,460,220]
["2011-01-07","Sunset","South","Sioux","ZAT",19,399,175.75]
["2011-01-02","Quad","South","Sioux","PCC",65,1755,942.5]
["2011-04-13","Sunset","West","Sioux","T",10,210,92.5]
["2011-02-13","Sunset","West","Sioux","EPP",59,1239,545.75]
["2011-03-25","Sunset","West","Pham","YTR",28,588,259]
["2011-01-26","Sunshine","East","Smith","KBTB",26,494,208]
["2011-06-12","Carlota","MidWest","Pham","SFWK",11,253,121]
["2011-02-09","Quad","MidWest","Franks","PCC",56,1512,812]
["2011-05-03","Carlota","West","Smith","AA",48,1104,528]
["2011-04-06","Sunshine","MidWest","Franks","MBG",58,1102,464]
["2011-06-27","Sunshine","MidWest","Chin","AST",48,912,384]
["2011-06-01","Sunset","South","Franks","ET",17,357,157.25]
["2011-03-06","Bellen","South","Smith","KPSA",18,396,180]
["2011-01-19","Carlota","East","Chin","PCC",10,230,110]
["2011-01-22","Sunset","West","Pham","HII",11,231,101.75]
["2011-02-17","Sunshine","East","Pham","ET",47,893,376]
["2011-06-18","Quad","South","Franks","FM",58,1566,841]
["2011-03-31","Sunshine","MidWest","Gault","PSA",27,513,216]
["2011-02-06","Sunset","South","Gault","YTR",56,1176,518]
["2011-05-26","Sunset","East","Chin","WFMI",6,126,55.5]
["2011-03-15","Bellen","West","Gault","TTT",27,594,270]
["2011-06-25","Carlota","West","Sioux","ITW",45,1035,495]
["2011-06-15","Bellen","South","Chin","TTT",43,946,430]
["2011-04-15","Sunset","East","Chin","ET",12,252,111]
["2011-04-17","Bellen","West","Smith","YTR",49,1078,490]
["2011-01-10","Bellen","South","Sioux","HHH",28,616,280]
["2011-04-03","Bellen","East","Franks","PSA",28,616,280]
["2011-05-01","Bellen","South","Smith","ZAT",9,198,90]
["2011-05-09","Sunset","MidWest","Franks","WFMI",30,630,277.5]
["2011-04-10","Sunshine","South","Gault","DFGH",11,209,88]
["2011-02-24","Sunshine","MidWest","Sioux","AA",64,1216,512]
["2011-04-13","Bellen","East","Pham","PLOT",39,858,390]
["2011-03-08","Sunset","East","Gault","DFGH",11,231,101.75]
["2011-04-25","Bellen","South","Chin","PSA",51,1122,510]
["2011-05-20","Sunset","East","Franks","HHH",18,378,166.5]
["2011-04-30","Sunshine","West","Pham","DFGH",52,988,416]
["2011-04-29","Carlota","South","Sioux","PLOT",24,552,264]
["2011-06-06","Sunset","West","Gault","ITTW",20,420,185]
["2011-02-08","Sunshine","East","Pham","BBT",26,494,208]
["2011-01-25","Quad","MidWest","Smith","SFWK",28,756,406]
["2011-04-10","Sunshine","South","Smith","KBTB",28,532,224]
["2011-06-05","Sunset","South","Pham","EPP",29,609,268.25]
["2011-06-11","Sunshine","West","Franks","KBTB",11,209,88]
["2011-03-27","Bellen","East","Smith","KPSA",11,242,110]
["2011-06-07","Sunshine","South","Gault","PLOT",28,532,224]
["2011-05-12","Carlota","East","Pham","SFWK",25,575,275]
["2011-04-30","Sunshine","West","Sioux","AA",28,532,224]
["2011-05-19","Carlota","South","Sioux","TTT",42,966,462]
["2011-03-24","Sunshine","South","Gault","DFGH",10,190,80]
["2011-03-15","Quad","South","Smith","WFMI",29,783,420.5]
["2011-03-24","Bellen","West","Franks","KPSA",31,682,310]
["2011-03-08","Quad","South","Franks","DFGH",64,1728,928]
["2011-05-02","Carlota","West","Gault","PLOT",46,1058,506]
["2011-02-20","Sunshine","West","Franks","TRU",54,1026,432]
["2011-06-22","Sunshine","West","Pham","DDH",6,114,48]
["2011-06-12","Quad","West","Sioux","ZAT",6,162,87]
["2011-05-09","Quad","West","Sioux","DFGH",9,243,130.5]
["2011-06-25","Carlota","South","Pham","TRU",56,1288,616]
["2011-05-29","Sunset","East","Chin","KPSA",45,945,416.25]
["2011-03-22","Sunshine","South","Pham","DDH",50,950,400]
["2011-03-17","Sunshine","MidWest","Sioux","QT",21,399,168]
["2011-04-07","Carlota","East","Gault","DFR",59,1357,649]
["2011-04-17","Sunshine","West","Sioux","TTT",15,285,120]
["2011-01-22","Carlota","West","Pham","GRR",17,391,187]
["2011-04-23","Carlota","West","Gault","ZAT",44,1012,484]
["2011-06-24","Sunset","West","Pham","FM",58,1218,536.5]
["2011-02-14","Bellen","East","Gault","ITTW",27,594,270]
["2011-01-10","Quad","MidWest","Sioux","TTT",11,297,159.5]
["2011-06-13","Bellen","South","Sioux","TTT",41,902,410]
["2011-01-03","Carlota","MidWest","Sioux","ET",10,230,110]
["2011-02-25","Bellen","South","Pham","PSA",49,1078,490]
["2011-04-24","Sunset","East","Franks","TTT",57,1197,527.25]
["2011-05-20","Sunset","South","Gault","ITW",40,840,370]
["2011-04-04","Sunset","East","Smith","YTR",58,1218,536.5]
["2011-05-20","Sunset","MidWest","Smith","AST",48,1008,444]
["2011-05-19","Quad","South","Smith","T",25,675,362.5]
["2011-01-09","Quad","MidWest","Gault","DFGH",10,270,145]
["2011-04-05","Quad","MidWest","Sioux","DFGH",41,1107,594.5]
["2011-02-15","Quad","East","Smith","KPSA",49,1323,710.5]
["2011-04-20","Sunshine","MidWest","Franks","YTR",27,513,216]
["2011-01-09","Carlota","West","Gault","HII",60,1380,660]
["2011-05-19","Sunshine","MidWest","Gault","WT",23,437,184]
["2011-05-25","Bellen","West","Sioux","DFGH",34,748,340]
["2011-02-23","Sunset","MidWest","Sioux","WFMI",30,630,277.5]
["2011-02-08","Bellen","West","Franks","ITW",10,220,100]
["2011-03-30","Quad","West","Franks","PCC",52,1404,754]
["2011-03-26","Quad","MidWest","Chin","ET",35,945,507.5]
["2011-04-05","Sunset","MidWest","Gault","AST",28,588,259]
["2011-04-16","Sunset","MidWest","Smith","FM",20,420,185]
["2011-06-20","Sunset","MidWest","Gault","ITW",51,1071,471.75]
["2011-01-08","Sunshine","West","Chin","WSD",6,114,48]
["2011-06-20","Sunset","West","Gault","AA",22,462,203.5]
["2011-01-11","Sunshine","MidWest","Smith","EPP",6,114,48]
["2011-04-17","Sunset","East","Smith","TTT",9,189,83.25]
["2011-01-22","Bellen","MidWest","Franks","KBTB",16,352,160]
["2011-01-27","Sunshine","MidWest","Franks","T",9,171,72]
["2011-01-06","Carlota","MidWest","Gault","ITW",26,598,286]
["2011-02-13","Sunset","MidWest","Chin","HII",53,1113,490.25]
["2011-01-20","Sunshine","South","Gault","WSD",65,1235,520]
["2011-06-20","Carlota","East","Chin","FRED",60,1380,660]
["2011-04-26","Bellen","West","Gault","YTR",26,572,260]
["2011-01-09","Quad","MidWest","Smith","GRR",61,1647,884.5]
["2011-01-24","Sunset","East","Sioux","AST",19,399,175.75]
["2011-06-29","Sunset","MidWest","Chin","BBT",23,483,212.75]
["2011-02-09","Sunshine","MidWest","Chin","PSA",61,1159,488]
["2011-06-09","Bellen","South","Pham","DFGH",63,1386,630]
["2011-06-22","Sunshine","West","Chin","MBG",25,475,200]
["2011-01-05","Sunshine","West","Pham","SFWK",63,1197,504]
["2011-05-13","Sunshine","MidWest","Chin","KPSA",29,551,232]
["2011-02-05","Carlota","South","Chin","WFMI",8,184,88]
["2011-03-06","Quad","MidWest","Smith","TTT",9,243,130.5]
["2011-05-24","Quad","West","Sioux","FRED",57,1539,826.5]
["2011-04-14","Sunshine","MidWest","Smith","DFR",7,133,56]
["2011-05-25","Carlota","South","Pham","GRR",46,1058,506]
["2011-01-13","Sunset","East","Gault","WSD",41,861,379.25]
["2011-05-11","Bellen","MidWest","Gault","AA",12,264,120]
["2011-02-14","Sunset","South","Franks","BBT",15,315,138.75]
["2011-06-26","Sunshine","South","Pham","JAQ",31,589,248]
["2011-03-26","Sunset","East","Gault","ITW",11,231,101.75]
["2011-01-16","Sunshine","South","Chin","KPSA",61,1159,488]
["2011-05-25","Sunshine","MidWest","Gault","DFGH",59,1121,472]
["2011-06-16","Quad","South","Gault","PSA",18,486,261]
["2011-04-16","Carlota","East","Sioux","AA",20,460,220]
["2011-02-23","Sunset","MidWest","Pham","DDH",51,1071,471.75]
["2011-01-15","Sunset","West","Pham","BBT",16,336,148]
["2011-02-08","Sunshine","East","Franks","ET",61,1159,488]
["2011-02-06","Bellen","East","Smith","BBT",12,264,120]
["2011-04-04","Carlota","East","Smith","PSA",18,414,198]
["2011-06-17","Carlota","MidWest","Chin","DFGH",28,644,308]
["2011-03-10","Sunshine","East","Chin","BBT",51,969,408]
["2011-06-26","Bellen","MidWest","Franks","WFMI",40,880,400]
["2011-04-06","Carlota","MidWest","Smith","PLOT",19,437,209]
["2011-03-20","Carlota","East","Sioux","YTR",14,322,154]
["2011-01-22","Quad","South","Franks","GRR",63,1701,913.5]
["2011-05-01","Sunset","East","Pham","GRR",16,336,148]
["2011-02-06","Sunset","South","Smith","TTT",17,357,157.25]
["2011-05-09","Carlota","MidWest","Gault","ITW",54,1242,594]
["2011-05-10","Bellen","South","Chin","TTT",26,572,260]
["2011-01-04","Sunset","West","Chin","SFWK",48,1008,444]
["2011-04-09","Sunshine","South","Smith","DFGH",17,323,136]
["2011-01-29","Carlota","MidWest","Franks","PCC",62,1426,682]
["2011-05-17","Sunshine","West","Sioux","ZAT",18,342,144]
["2011-01-10","Quad","South","Franks","LOP",13,351,188.5]
["2011-02-09","Carlota","MidWest","Smith","TTT",18,414,198]
["2011-03-23","Sunset","East","Smith","HII",13,273,120.25]
["2011-02-07","Carlota","West","Gault","HII",33,759,363]
["2011-06-01","Carlota","South","Franks","TTT",28,644,308]
["2011-01-20","Carlota","East","Pham","WSD",53,1219,583]
["2011-03-03","Sunshine","MidWest","Gault","HII",21,399,168]
["2011-05-20","Carlota","West","Sioux","QT",42,966,462]
["2011-01-09","Carlota","East","Franks","AA",45,1035,495]
["2011-02-07","Bellen","MidWest","Gault","T",22,484,220]
["2011-04-07","Quad","South","Chin","YTR",25,675,362.5]
["2011-05-13","Carlota","MidWest","Gault","LOP",51,1173,561]
["2011-05-26","Quad","South","Chin","YTR",23,621,333.5]
["2011-03-09","Sunset","South","Smith","WFMI",13,273,120.25]
["2011-05-31","Bellen","East","Sioux","YTR",39,858,390]
["2011-05-02","Bellen","South","Franks","HII",39,858,390]
["2011-06-18","Sunset","MidWest","Smith","MNGD",34,714,314.5]
["2011-02-15","Sunshine","West","Chin","WSD",33,627,264]
["2011-03-13","Carlota","East","Chin","MBG",50,1150,550]
["2011-03-01","Sunshine","MidWest","Smith","TRU",62,1178,496]
["2011-03-15","Sunshine","MidWest","Gault","PSA",44,836,352]
["2011-05-25","Carlota","East","Franks","TTT",13,299,143]
["2011-01-22","Carlota","MidWest","Chin","MBG",31,713,341]
["2011-03-07","Bellen","West","Smith","WT",51,1122,510]
["2011-01-28","Quad","MidWest","Franks","JAQ",13,351,188.5]
["2011-05-06","Quad","MidWest","Chin","PCC",60,1620,870]
["2011-02-06","Quad","West","Gault","JAQ",23,621,333.5]
["2011-06-18","Bellen","West","Franks","YTR",57,1254,570]
["2011-03-15","Sunset","South","Smith","SFWK",57,1197,527.25]
["2011-06-22","Carlota","MidWest","Gault","GRR",54,1242,594]
["2011-03-07","Sunshine","East","Smith","MNGD",6,114,48]

{"sheet":"PT(3)","index":104,"n_rows":8,"n_cols":2,"rows_kept":8,"cut":false,"hidden":false,"merged":[]}
[]
[]
["Row Labels","Sum of Sales"]
["Carlota",3611]
["Quad",2079]
["Sunset",987]
["Sunshine",2717]
["Grand Total",9394]

{"sheet":"PTData (3)","index":105,"n_rows":13,"n_cols":8,"rows_kept":13,"cut":false,"hidden":false,"merged":[]}
["Date","Product","Region","SalesRep","Customer","Units","Sales","COGS"]
["2011-01-23","Quad","West","Sioux","DFR",23,621,333.5]
["2011-01-18","Sunshine","West","Pham","TTT",65,1235,520]
["2011-06-19","Sunset","West","Pham","FM",47,987,434.75]
["2011-06-13","Quad","MidWest","Smith","PLOT",24,648,348]
["2011-04-05","Sunshine","South","Pham","JAQ",58,null,464]
["2011-03-02","Quad","West","Franks","ET",22,594,319]
["2011-03-24","Quad","East","Smith","JAQ",8,216,116]
["2011-02-27","Sunshine","South","Smith","ET",29,551,232]
["2011-06-19","Carlota","West","Chin","ZAT",55,1265,605]
["2011-05-17","Carlota","MidWest","Franks","ZAT",39,897,429]
["2011-04-11","Sunshine","MidWest","Pham","DFGH",49,931,392]
["2011-02-15","Carlota","MidWest","Pham","KBTB",63,1449,693]

{"sheet":"PT(4)","index":106,"n_rows":11,"n_cols":2,"rows_kept":11,"cut":false,"hidden":false,"merged":[]}
[]
[]
["Row Labels","Sum of Units"]
["2011"]
["Jan",88]
["Feb",92]
["Mar",30]
["Apr",49]
["May",39]
["Jun",184]
["Grand Total",482]

{"sheet":"PTData (4)","index":107,"n_rows":13,"n_cols":8,"rows_kept":13,"cut":false,"hidden":false,"merged":[]}
["Date","Product","Region","SalesRep","Customer","Units","Sales","COGS"]
["2011-01-23","Quad","West","Sioux","DFR",23,621,333.5]
["2011-01-18","Sunshine","West","Pham","TTT",65,1235,520]
["2011-06-19","Sunset","West","Pham","FM",47,987,434.75]
["2011-06-13","Quad","MidWest","Smith","PLOT",24,648,348]
["2011-06-10","Sunshine","South","Pham","JAQ",58,1102,464]
["2011-03-02","Quad","West","Franks","ET",22,594,319]
["2011-03-24","Quad","East","Smith","JAQ",8,216,116]
["2011-02-27","Sunshine","South","Smith","ET",29,551,232]
["2011-06-19","Carlota","West","Chin","ZAT",55,1265,605]
["2011-05-17","Carlota","MidWest","Franks","ZAT",39,897,429]
["2011-04-11","Sunshine","MidWest","Pham","DFGH",49,931,392]
["2011-02-15","Carlota","MidWest","Pham","KBTB",63,1449,693]

{"sheet":"Visualize","index":108,"n_rows":17,"n_cols":19,"rows_kept":17,"cut":false,"hidden":false,"merged":[[0,2,0,5],[2,0,7,0]]}
[null,null,"Region -- Column Headers or \"Column Labels\"",null,null,null,null,null,null,null,null,null,null,null,null,null,null,null,"This is called the 'Value' area because will  be making a"]
[null,null,"East","MidWest","South","West",null,null,null,null,null,null,null,null,null,null,null,null,"calculation in this area - we will be adding."]
["SalesRep -- Row Headers or \"Row Labels\"","Chin"]
[null,"Franks"]
[null,"Gault",null,{"$f":"\"Add all sales for \"&B5&\" in the \"&D2&\" region from the Sales field\"","v":"Add all sales for Gault in the MidWest region from the Sales field"}]
[null,"Pham"]
[null,"Sioux"]
[null,"Smith"]
[]
[]
[]
[]
[]
[]
[]
[]
[null,"SalesRep"]

{"sheet":"Bellen","index":109,"n_rows":11,"n_cols":6,"rows_kept":11,"cut":false,"hidden":false,"merged":[]}
["Product","Bellen"]
[]
["Sum of Sales","Region"]
["SalesRep","East","MidWest","South","West","Grand Total"]
["Chin",null,1310.4299999999998,null,1310.4299999999998,2620.8599999999997]
["Franks",null,505.78,null,551.76,1057.54]
["Gault",null,3701.39,1425.38,null,5126.7700000000004]
["Pham",597.74,459.79999999999995,1080.5299999999997,null,2138.0699999999997]
["Sioux",null,null,1149.5,null,1149.5]
["Smith",1264.4499999999998,298.87,2184.0499999999997,597.74,4345.1099999999997]
["Grand Total",1862.1899999999998,6276.2699999999995,5839.4599999999991,2459.9299999999998,16437.849999999999]

{"sheet":"Carlota","index":110,"n_rows":11,"n_cols":6,"rows_kept":11,"cut":false,"hidden":false,"merged":[]}
["Product","Carlota"]
[]
["Sum of Sales","Region"]
["SalesRep","East","MidWest","South","West","Grand Total"]
["Chin",null,311.87,335.85999999999996,null,647.73]
["Franks",null,1271.47,455.80999999999995,null,1727.28]
["Gault",1799.25,1391.42,3358.5999999999995,null,6549.2699999999995]
["Pham",215.91,1487.3799999999999,null,1079.55,2782.84]
["Sioux",1439.3999999999999,239.89999999999998,1151.52,527.78,3358.5999999999995]
["Smith",191.92,null,null,383.84,575.76]
["Grand Total",3646.48,4702.04,5301.7899999999991,1991.1699999999998,15641.479999999998]

{"sheet":"Quad","index":111,"n_rows":11,"n_cols":6,"rows_kept":11,"cut":false,"hidden":false,"merged":[]}
["Product","Quad"]
[]
["Sum of Sales","Region"]
["SalesRep","East","MidWest","South","West","Grand Total"]
["Chin",1592.4099999999999,1457.4599999999998,1160.57,1754.35,5964.7899999999991]
["Franks",1349.5,1646.3899999999999,1376.49,1538.4299999999998,5910.8099999999995]
["Gault",971.64,1754.35,null,836.68999999999994,3562.68]
["Pham",1889.2999999999997,755.72,863.68,1484.4499999999998,4993.1499999999996]
["Sioux",1349.5,null,998.62999999999988,null,2348.13]
["Smith",1673.3799999999999,2159.1999999999998,1511.4399999999998,1970.27,7314.2899999999991]
["Grand Total",8825.73,7773.119999999999,5910.8099999999995,7584.1899999999987,30093.85]

{"sheet":"Sunset","index":112,"n_rows":10,"n_cols":6,"rows_kept":10,"cut":false,"hidden":false,"merged":[]}
["Product","Sunset"]
[]
["Sum of Sales","Region"]
["SalesRep","East","MidWest","South","West","Grand Total"]
["Franks",608.70999999999992,null,null,null,608.70999999999992]
["Gault",755.63999999999987,null,1112.47,null,1868.11]
["Pham",null,1112.4699999999998,440.78999999999996,null,1553.2599999999998]
["Sioux",null,null,1700.1899999999998,1049.5,2749.6899999999996]
["Smith",null,null,818.6099999999999,482.77,1301.3799999999999]
["Grand Total",1364.35,1112.4699999999998,4072.0599999999995,1532.27,8081.1499999999987]

{"sheet":"Sunshine","index":113,"n_rows":10,"n_cols":6,"rows_kept":10,"cut":false,"hidden":false,"merged":[]}
["Product","Sunshine"]
[]
["Sum of Sales","Region"]
["SalesRep","East","MidWest","South","West","Grand Total"]
["Franks",1215.3599999999999,265.85999999999996,null,854.55,2335.7699999999995]
["Gault",1158.3899999999999,null,null,null,1158.3899999999999]
["Pham",2050.9199999999996,null,1177.3799999999999,778.58999999999992,4006.8899999999994]
["Sioux",759.59999999999991,1747.08,null,303.83999999999997,2810.52]
["Smith",null,1044.4499999999998,2601.6299999999997,1215.3599999999999,4861.4399999999996]
["Grand Total",5184.2700000000004,3057.3899999999994,3779.0099999999993,3152.3399999999997,15173.009999999998]

{"sheet":"PT(5)","index":114,"n_rows":11,"n_cols":3,"rows_kept":11,"cut":false,"hidden":false,"merged":[]}
[]
[]
["Sum of Sales","Region"]
["SalesRep","East","Grand Total"]
["Chin",1592.4099999999999,1592.4099999999999]
["Franks",3173.5699999999997,3173.5699999999997]
["Gault",4684.92,4684.92]
["Pham",4753.87,4753.87]
["Sioux",3548.5,3548.5]
["Smith",3129.75,3129.75]
["Grand Total",20883.02,20883.02]

{"sheet":"PTData (5)","index":115,"n_rows":106,"n_cols":8,"rows_kept":106,"cut":false,"hidden":false,"merged":[]}
["Date","Product","Region","SalesRep","Customer","Units","Sales","COGS"]
["2011-01-12","Quad","East","Gault","TTT",36,971.64,522]
["2011-01-11","Quad","East","Smith","HII",62,1673.3799999999999,899]
["2011-01-06","Quad","East","Franks","FM",50,1349.5,725]
["2011-01-03","Carlota","South","Gault","MBG",59,1415.4099999999999,649]
["2011-01-16","Carlota","MidWest","Franks","JAQ",53,1271.47,583]
["2011-01-24","Sunshine","West","Pham","ITTW",41,778.58999999999992,328]
["2011-01-10","Bellen","MidWest","Smith","HHH",13,298.87,130]
["2011-01-24","Quad","South","Smith","TTT",56,1511.4399999999998,812]
["2011-01-13","Sunshine","East","Gault","WT",50,949.49999999999989,400]
["2011-01-25","Sunshine","MidWest","Smith","PSA",26,493.73999999999995,208]
["2011-01-10","Bellen","East","Pham","HII",26,597.74,260]
["2011-01-29","Sunset","South","Gault","TRU",53,1112.47,490.25]
["2011-01-17","Quad","East","Pham","DFR",43,1160.57,623.5]
["2011-01-03","Quad","MidWest","Gault","FM",36,971.64,522]
["2011-01-24","Quad","South","Franks","KBTB",9,242.91,130.5]
["2011-01-23","Carlota","South","Gault","ET",60,1439.3999999999999,660]
["2011-01-20","Sunset","East","Gault","WSD",7,146.92999999999998,64.75]
["2011-01-25","Quad","East","Sioux","PSA",50,1349.5,725]
["2011-01-15","Carlota","West","Smith","DFR",16,383.84,176]
["2011-01-25","Bellen","MidWest","Gault","WFMI",28,643.71999999999991,280]
["2011-01-06","Sunshine","South","Smith","TRU",53,1006.4699999999999,424]
["2011-01-24","Quad","MidWest","Franks","AA",61,1646.3899999999999,884.5]
["2011-01-23","Sunset","MidWest","Pham","ITTW",23,482.77,212.75]
["2011-01-02","Sunshine","West","Sioux","TTT",16,303.83999999999997,128]
["2011-01-14","Quad","West","Chin","TRU",43,1160.57,623.5]
["2011-01-26","Sunset","East","Franks","TTT",29,608.70999999999992,268.25]
["2011-01-13","Carlota","East","Sioux","ET",60,1439.3999999999999,660]
["2011-01-28","Carlota","South","Franks","FRED",19,455.80999999999995,209]
["2011-01-14","Quad","MidWest","Gault","ET",29,782.70999999999992,420.5]
["2011-01-25","Carlota","South","Gault","FRED",21,503.78999999999996,231]
["2011-01-20","Bellen","South","Pham","ZAT",28,643.71999999999991,280]
["2011-01-09","Sunshine","West","Franks","EPP",45,854.55,360]
["2011-01-25","Quad","MidWest","Pham","ITTW",11,296.89,159.5]
["2011-01-02","Sunset","South","Sioux","KPSA",58,1217.4199999999998,536.5]
["2011-01-05","Bellen","MidWest","Chin","AA",57,1310.4299999999998,570]
["2011-01-05","Sunset","South","Smith","KPSA",39,818.6099999999999,360.75]
["2011-01-25","Carlota","MidWest","Chin","MNGD",13,311.87,143]
["2011-01-05","Quad","MidWest","Chin","PSA",54,1457.4599999999998,783]
["2011-01-09","Carlota","East","Gault","FM",10,239.89999999999998,110]
["2011-01-13","Sunshine","South","Pham","WFMI",62,1177.3799999999999,496]
["2011-01-18","Sunshine","East","Pham","WSD",51,968.4899999999999,408]
["2011-01-12","Bellen","MidWest","Franks","EPP",22,505.78,220]
["2011-01-12","Bellen","South","Sioux","AST",50,1149.5,500]
["2011-01-10","Carlota","East","Pham","TTT",9,215.91,99]
["2011-01-01","Bellen","West","Franks","PSA",24,551.76,240]
["2011-01-17","Quad","South","Franks","SFWK",42,1133.58,609]
["2011-01-02","Bellen","South","Smith","KBTB",17,390.83,170]
["2011-01-29","Bellen","West","Smith","EPP",20,459.79999999999995,200]
["2011-01-26","Quad","South","Sioux","ITW",20,539.79999999999995,290]
["2011-01-13","Sunshine","East","Gault","T",11,208.89,88]
["2011-01-02","Quad","West","Chin","TTT",22,593.78,319]
["2011-01-23","Bellen","South","Pham","QT",19,436.80999999999995,190]
["2011-01-21","Carlota","East","Gault","AA",32,767.68,352]
["2011-01-08","Quad","West","Smith","BBT",26,701.74,377]
["2011-01-19","Quad","West","Franks","PLOT",57,1538.4299999999998,826.5]
["2011-01-24","Sunshine","East","Pham","EPP",57,1082.4299999999998,456]
["2011-01-12","Quad","East","Chin","YTR",59,1592.4099999999999,855.5]
["2011-01-11","Bellen","South","Smith","LOP",15,344.84999999999997,150]
["2011-01-23","Quad","MidWest","Smith","MBG",50,1349.5,725]
["2011-01-23","Sunset","East","Gault","AST",29,608.70999999999992,268.25]
["2011-01-30","Sunset","West","Smith","DFGH",23,482.77,212.75]
["2011-01-05","Bellen","East","Smith","GRR",10,229.89999999999998,100]
["2011-01-29","Sunshine","East","Sioux","EPP",40,759.59999999999991,320]
["2011-01-05","Sunset","South","Sioux","AST",23,482.77,212.75]
["2011-01-25","Bellen","MidWest","Pham","MBG",10,229.89999999999998,100]
["2011-01-17","Quad","West","Smith","KBTB",47,1268.53,681.5]
["2011-01-22","Sunshine","West","Smith","WT",64,1215.3599999999999,512]
["2011-01-30","Bellen","MidWest","Pham","FRED",10,229.89999999999998,100]
["2011-01-08","Bellen","South","Smith","DDH",63,1448.37,630]
["2011-01-14","Bellen","South","Gault","JAQ",52,1195.48,520]
["2011-01-09","Sunshine","South","Smith","AA",22,417.78,176]
["2011-01-22","Sunshine","MidWest","Smith","MNGD",29,550.70999999999992,232]
["2011-01-10","Bellen","MidWest","Gault","TTT",50,1149.5,500]
["2011-01-26","Sunset","West","Sioux","FM",50,1049.5,462.5]
["2011-01-14","Carlota","South","Sioux","ITW",48,1151.52,528]
["2011-01-13","Quad","East","Pham","SFWK",27,728.7299999999999,391.5]
["2011-01-12","Bellen","West","Smith","PCC",6,137.94,60]
["2011-01-28","Carlota","MidWest","Pham","PLOT",62,1487.3799999999999,682]
["2011-01-22","Carlota","MidWest","Sioux","TRU",10,239.89999999999998,110]
["2011-01-04","Carlota","East","Gault","MBG",33,791.67,363]
["2011-01-26","Quad","South","Sioux","QT",17,458.83,246.5]
["2011-01-19","Bellen","South","Gault","DFGH",10,229.89999999999998,100]
["2011-01-01","Carlota","East","Smith","MBG",8,191.92,88]
["2011-01-06","Sunset","MidWest","Pham","TRU",30,629.69999999999993,277.5]
["2011-01-08","Carlota","West","Sioux","TTT",22,527.78,242]
["2011-01-28","Quad","MidWest","Smith","FM",30,809.69999999999993,435]
["2011-01-12","Bellen","MidWest","Gault","MNGD",64,1471.36,640]
["2011-01-10","Quad","South","Chin","PLOT",43,1160.57,623.5]
["2011-01-28","Bellen","East","Smith","TTT",45,1034.55,450]
["2011-01-22","Carlota","West","Pham","LOP",45,1079.55,495]
["2011-01-25","Sunshine","MidWest","Sioux","T",55,1044.4499999999998,440]
["2011-01-18","Sunshine","South","Smith","ET",62,1177.3799999999999,496]
["2011-01-06","Carlota","MidWest","Gault","FM",11,263.89,121]
["2011-01-26","Quad","MidWest","Pham","EPP",17,458.83,246.5]
["2011-01-11","Bellen","West","Chin","MBG",57,1310.4299999999998,570]
["2011-01-20","Sunshine","East","Franks","MNGD",64,1215.3599999999999,512]
["2011-01-23","Quad","West","Gault","KPSA",31,836.68999999999994,449.5]
["2011-01-20","Sunset","South","Pham","AA",21,440.78999999999996,194.25]
["2011-01-03","Quad","South","Pham","WSD",32,863.68,464]
["2011-01-05","Carlota","MidWest","Gault","EPP",47,1127.53,517]
["2011-01-11","Bellen","MidWest","Gault","TRU",19,436.80999999999995,190]
["2011-01-28","Carlota","South","Chin","KBTB",14,335.85999999999996,154]
["2011-01-05","Sunshine","MidWest","Franks","PLOT",14,265.85999999999996,112]
["2011-01-15","Quad","West","Pham","ET",55,1484.4499999999998,797.5]
["2011-01-04","Sunshine","MidWest","Sioux","QT",37,702.63,296]

{"sheet":"PT(6)","index":116,"n_rows":21,"n_cols":10,"rows_kept":21,"cut":false,"hidden":false,"merged":[]}
[]
[]
["Product","Frequency",null,null,null,null,"Sales","Frequency"]
["Bellen",24,null,null,null,null,"0-250",12]
["Carlota",21,null,null,null,null,"250-500",22]
["Quad",29,null,null,null,null,"500-750",16]
["Sunset",12,null,null,null,null,"750-1000",14]
["Sunshine",19,null,null,null,null,"1000-1250",21]
["Grand Total",105,null,null,null,null,"1250-1500",15]
[null,null,null,null,null,null,"1500-1750",5]
[null,null,null,null,null,null,"Grand Total",105]
[]
[]
[]
[null,null,null,null,null,null,0,250,{"$f":"G15&\" <= Sales < \"&H15","v":"0 <= Sales < 250"},{"$f":"COUNTIFS('PTData (5)'!$G$2:$G$106,\">=\"&G15,'PTData (5)'!$G$2:$G$106,\"<\"&H15)","v":12}]
[null,null,null,null,null,null,{"$f":"H15","v":250},{"$f":"H15+250","v":500},"250 <= Sales < 500",{"$f":"COUNTIFS('PTData (5)'!$G$2:$G$106,\">=\"&G16,'PTData (5)'!$G$2:$G$106,\"<\"&H16)","v":22}]
[null,null,null,null,null,null,{"$f":"H16","v":500},{"$f":"H16+250","v":750},"500 <= Sales < 750",{"$f":"COUNTIFS('PTData (5)'!$G$2:$G$106,\">=\"&G17,'PTData (5)'!$G$2:$G$106,\"<\"&H17)","v":16}]
[null,null,null,null,null,null,750,1000,"750 <= Sales < 1000",{"$f":"COUNTIFS('PTData (5)'!$G$2:$G$106,\">=\"&G18,'PTData (5)'!$G$2:$G$106,\"<\"&H18)","v":14}]
[null,null,null,null,null,null,1000,1250,"1000 <= Sales < 1250",{"$f":"COUNTIFS('PTData (5)'!$G$2:$G$106,\">=\"&G19,'PTData (5)'!$G$2:$G$106,\"<\"&H19)","v":21}]
[null,null,null,null,null,null,1250,1500,"1250 <= Sales < 1500",{"$f":"COUNTIFS('PTData (5)'!$G$2:$G$106,\">=\"&G20,'PTData (5)'!$G$2:$G$106,\"<\"&H20)","v":15}]
[null,null,null,null,null,null,1500,1750,"1500 <= Sales < 1750",{"$f":"COUNTIFS('PTData (5)'!$G$2:$G$106,\">=\"&G21,'PTData (5)'!$G$2:$G$106,\"<\"&H21)","v":5}]

{"sheet":"PTData (6)","index":117,"n_rows":106,"n_cols":8,"rows_kept":106,"cut":false,"hidden":false,"merged":[]}
["Date","Product","Region","SalesRep","Customer","Units","Sales","COGS"]
["2011-01-12","Quad","East","Gault","TTT",36,971.64,522]
["2011-01-11","Quad","East","Smith","HII",62,1673.3799999999999,899]
["2011-01-06","Quad","East","Franks","FM",50,1349.5,725]
["2011-01-03","Carlota","South","Gault","MBG",59,1415.4099999999999,649]
["2011-01-16","Carlota","MidWest","Franks","JAQ",53,1271.47,583]
["2011-01-24","Sunshine","West","Pham","ITTW",41,778.58999999999992,328]
["2011-01-10","Bellen","MidWest","Smith","HHH",13,298.87,130]
["2011-01-24","Quad","South","Smith","TTT",56,1511.4399999999998,812]
["2011-01-13","Sunshine","East","Gault","WT",50,949.49999999999989,400]
["2011-01-25","Sunshine","MidWest","Smith","PSA",26,493.73999999999995,208]
["2011-01-10","Bellen","East","Pham","HII",26,597.74,260]
["2011-01-29","Sunset","South","Gault","TRU",53,1112.47,490.25]
["2011-01-17","Quad","East","Pham","DFR",43,1160.57,623.5]
["2011-01-03","Quad","MidWest","Gault","FM",36,971.64,522]
["2011-01-24","Quad","South","Franks","KBTB",9,242.91,130.5]
["2011-01-23","Carlota","South","Gault","ET",60,1439.3999999999999,660]
["2011-01-20","Sunset","East","Gault","WSD",7,146.92999999999998,64.75]
["2011-01-25","Quad","East","Sioux","PSA",50,1349.5,725]
["2011-01-15","Carlota","West","Smith","DFR",16,383.84,176]
["2011-01-25","Bellen","MidWest","Gault","WFMI",28,643.71999999999991,280]
["2011-01-06","Sunshine","South","Smith","TRU",53,1006.4699999999999,424]
["2011-01-24","Quad","MidWest","Franks","AA",61,1646.3899999999999,884.5]
["2011-01-23","Sunset","MidWest","Pham","ITTW",23,482.77,212.75]
["2011-01-02","Sunshine","West","Sioux","TTT",16,303.83999999999997,128]
["2011-01-14","Quad","West","Chin","TRU",43,1160.57,623.5]
["2011-01-26","Sunset","East","Franks","TTT",29,608.70999999999992,268.25]
["2011-01-13","Carlota","East","Sioux","ET",60,1439.3999999999999,660]
["2011-01-28","Carlota","South","Franks","FRED",19,455.80999999999995,209]
["2011-01-14","Quad","MidWest","Gault","ET",29,782.70999999999992,420.5]
["2011-01-25","Carlota","South","Gault","FRED",21,503.78999999999996,231]
["2011-01-20","Bellen","South","Pham","ZAT",28,643.71999999999991,280]
["2011-01-09","Sunshine","West","Franks","EPP",45,854.55,360]
["2011-01-25","Quad","MidWest","Pham","ITTW",11,296.89,159.5]
["2011-01-02","Sunset","South","Sioux","KPSA",58,1217.4199999999998,536.5]
["2011-01-05","Bellen","MidWest","Chin","AA",57,1310.4299999999998,570]
["2011-01-05","Sunset","South","Smith","KPSA",39,818.6099999999999,360.75]
["2011-01-25","Carlota","MidWest","Chin","MNGD",13,311.87,143]
["2011-01-05","Quad","MidWest","Chin","PSA",54,1457.4599999999998,783]
["2011-01-09","Carlota","East","Gault","FM",10,239.89999999999998,110]
["2011-01-13","Sunshine","South","Pham","WFMI",62,1177.3799999999999,496]
["2011-01-18","Sunshine","East","Pham","WSD",51,968.4899999999999,408]
["2011-01-12","Bellen","MidWest","Franks","EPP",22,505.78,220]
["2011-01-12","Bellen","South","Sioux","AST",50,1149.5,500]
["2011-01-10","Carlota","East","Pham","TTT",9,215.91,99]
["2011-01-01","Bellen","West","Franks","PSA",24,551.76,240]
["2011-01-17","Quad","South","Franks","SFWK",42,1133.58,609]
["2011-01-02","Bellen","South","Smith","KBTB",17,390.83,170]
["2011-01-29","Bellen","West","Smith","EPP",20,459.79999999999995,200]
["2011-01-26","Quad","South","Sioux","ITW",20,539.79999999999995,290]
["2011-01-13","Sunshine","East","Gault","T",11,208.89,88]
["2011-01-02","Quad","West","Chin","TTT",22,593.78,319]
["2011-01-23","Bellen","South","Pham","QT",19,436.80999999999995,190]
["2011-01-21","Carlota","East","Gault","AA",32,767.68,352]
["2011-01-08","Quad","West","Smith","BBT",26,701.74,377]
["2011-01-19","Quad","West","Franks","PLOT",57,1538.4299999999998,826.5]
["2011-01-24","Sunshine","East","Pham","EPP",57,1082.4299999999998,456]
["2011-01-12","Quad","East","Chin","YTR",59,1592.4099999999999,855.5]
["2011-01-11","Bellen","South","Smith","LOP",15,344.84999999999997,150]
["2011-01-23","Quad","MidWest","Smith","MBG",50,1349.5,725]
["2011-01-23","Sunset","East","Gault","AST",29,608.70999999999992,268.25]
["2011-01-30","Sunset","West","Smith","DFGH",23,482.77,212.75]
["2011-01-05","Bellen","East","Smith","GRR",10,229.89999999999998,100]
["2011-01-29","Sunshine","East","Sioux","EPP",40,759.59999999999991,320]
["2011-01-05","Sunset","South","Sioux","AST",23,482.77,212.75]
["2011-01-25","Bellen","MidWest","Pham","MBG",10,229.89999999999998,100]
["2011-01-17","Quad","West","Smith","KBTB",47,1268.53,681.5]
["2011-01-22","Sunshine","West","Smith","WT",64,1215.3599999999999,512]
["2011-01-30","Bellen","MidWest","Pham","FRED",10,229.89999999999998,100]
["2011-01-08","Bellen","South","Smith","DDH",63,1448.37,630]
["2011-01-14","Bellen","South","Gault","JAQ",52,1195.48,520]
["2011-01-09","Sunshine","South","Smith","AA",22,417.78,176]
["2011-01-22","Sunshine","MidWest","Smith","MNGD",29,550.70999999999992,232]
["2011-01-10","Bellen","MidWest","Gault","TTT",50,1149.5,500]
["2011-01-26","Sunset","West","Sioux","FM",50,1049.5,462.5]
["2011-01-14","Carlota","South","Sioux","ITW",48,1151.52,528]
["2011-01-13","Quad","East","Pham","SFWK",27,728.7299999999999,391.5]
["2011-01-12","Bellen","West","Smith","PCC",6,137.94,60]
["2011-01-28","Carlota","MidWest","Pham","PLOT",62,1487.3799999999999,682]
["2011-01-22","Carlota","MidWest","Sioux","TRU",10,239.89999999999998,110]
["2011-01-04","Carlota","East","Gault","MBG",33,791.67,363]
["2011-01-26","Quad","South","Sioux","QT",17,458.83,246.5]
["2011-01-19","Bellen","South","Gault","DFGH",10,229.89999999999998,100]
["2011-01-01","Carlota","East","Smith","MBG",8,191.92,88]
["2011-01-06","Sunset","MidWest","Pham","TRU",30,629.69999999999993,277.5]
["2011-01-08","Carlota","West","Sioux","TTT",22,527.78,242]
["2011-01-28","Quad","MidWest","Smith","FM",30,809.69999999999993,435]
["2011-01-12","Bellen","MidWest","Gault","MNGD",64,1471.36,640]
["2011-01-10","Quad","South","Chin","PLOT",43,1160.57,623.5]
["2011-01-28","Bellen","East","Smith","TTT",45,1034.55,450]
["2011-01-22","Carlota","West","Pham","LOP",45,1079.55,495]
["2011-01-25","Sunshine","MidWest","Sioux","T",55,1044.4499999999998,440]
["2011-01-18","Sunshine","South","Smith","ET",62,1177.3799999999999,496]
["2011-01-06","Carlota","MidWest","Gault","FM",11,263.89,121]
["2011-01-26","Quad","MidWest","Pham","EPP",17,458.83,246.5]
["2011-01-11","Bellen","West","Chin","MBG",57,1310.4299999999998,570]
["2011-01-20","Sunshine","East","Franks","MNGD",64,1215.3599999999999,512]
["2011-01-23","Quad","West","Gault","KPSA",31,836.68999999999994,449.5]
["2011-01-20","Sunset","South","Pham","AA",21,440.78999999999996,194.25]
["2011-01-03","Quad","South","Pham","WSD",32,863.68,464]
["2011-01-05","Carlota","MidWest","Gault","EPP",47,1127.53,517]
["2011-01-11","Bellen","MidWest","Gault","TRU",19,436.80999999999995,190]
["2011-01-28","Carlota","South","Chin","KBTB",14,335.85999999999996,154]
["2011-01-05","Sunshine","MidWest","Franks","PLOT",14,265.85999999999996,112]
["2011-01-15","Quad","West","Pham","ET",55,1484.4499999999998,797.5]
["2011-01-04","Sunshine","MidWest","Sioux","QT",37,702.63,296]

{"sheet":"PT(8)","index":118,"n_rows":10,"n_cols":3,"rows_kept":10,"cut":false,"hidden":false,"merged":[]}
[]
[]
["SalesRep","Sum of Sales","Performance"]
["Chin",9233.3799999999992,0.1080846014870649]
["Franks",11640.110000000002,0.13625743233957657]
["Gault",18265.219999999998,0.21381000508736428]
["Pham",15474.21,0.18113884852320111]
["Sioux",12416.44,0.14534503825122028]
["Smith",18397.980000000003,0.2153640743115729]
["Grand Total",85427.34,1]

{"sheet":"PTData (7)","index":119,"n_rows":106,"n_cols":8,"rows_kept":106,"cut":false,"hidden":false,"merged":[]}
["Date","Product","Region","SalesRep","Customer","Units","Sales","COGS"]
["2011-01-12","Quad","East","Gault","TTT",36,971.64,522]
["2011-01-11","Quad","East","Smith","HII",62,1673.3799999999999,899]
["2011-01-06","Quad","East","Franks","FM",50,1349.5,725]
["2011-01-03","Carlota","South","Gault","MBG",59,1415.4099999999999,649]
["2011-01-16","Carlota","MidWest","Franks","JAQ",53,1271.47,583]
["2011-01-24","Sunshine","West","Pham","ITTW",41,778.58999999999992,328]
["2011-01-10","Bellen","MidWest","Smith","HHH",13,298.87,130]
["2011-01-24","Quad","South","Smith","TTT",56,1511.4399999999998,812]
["2011-01-13","Sunshine","East","Gault","WT",50,949.49999999999989,400]
["2011-01-25","Sunshine","MidWest","Smith","PSA",26,493.73999999999995,208]
["2011-01-10","Bellen","East","Pham","HII",26,597.74,260]
["2011-01-29","Sunset","South","Gault","TRU",53,1112.47,490.25]
["2011-01-17","Quad","East","Pham","DFR",43,1160.57,623.5]
["2011-01-03","Quad","MidWest","Gault","FM",36,971.64,522]
["2011-01-24","Quad","South","Franks","KBTB",9,242.91,130.5]
["2011-01-23","Carlota","South","Gault","ET",60,1439.3999999999999,660]
["2011-01-20","Sunset","East","Gault","WSD",7,146.92999999999998,64.75]
["2011-01-25","Quad","East","Sioux","PSA",50,1349.5,725]
["2011-01-15","Carlota","West","Smith","DFR",16,383.84,176]
["2011-01-25","Bellen","MidWest","Gault","WFMI",28,643.71999999999991,280]
["2011-01-06","Sunshine","South","Smith","TRU",53,1006.4699999999999,424]
["2011-01-24","Quad","MidWest","Franks","AA",61,1646.3899999999999,884.5]
["2011-01-23","Sunset","MidWest","Pham","ITTW",23,482.77,212.75]
["2011-01-02","Sunshine","West","Sioux","TTT",16,303.83999999999997,128]
["2011-01-14","Quad","West","Chin","TRU",43,1160.57,623.5]
["2011-01-26","Sunset","East","Franks","TTT",29,608.70999999999992,268.25]
["2011-01-13","Carlota","East","Sioux","ET",60,1439.3999999999999,660]
["2011-01-28","Carlota","South","Franks","FRED",19,455.80999999999995,209]
["2011-01-14","Quad","MidWest","Gault","ET",29,782.70999999999992,420.5]
["2011-01-25","Carlota","South","Gault","FRED",21,503.78999999999996,231]
["2011-01-20","Bellen","South","Pham","ZAT",28,643.71999999999991,280]
["2011-01-09","Sunshine","West","Franks","EPP",45,854.55,360]
["2011-01-25","Quad","MidWest","Pham","ITTW",11,296.89,159.5]
["2011-01-02","Sunset","South","Sioux","KPSA",58,1217.4199999999998,536.5]
["2011-01-05","Bellen","MidWest","Chin","AA",57,1310.4299999999998,570]
["2011-01-05","Sunset","South","Smith","KPSA",39,818.6099999999999,360.75]
["2011-01-25","Carlota","MidWest","Chin","MNGD",13,311.87,143]
["2011-01-05","Quad","MidWest","Chin","PSA",54,1457.4599999999998,783]
["2011-01-09","Carlota","East","Gault","FM",10,239.89999999999998,110]
["2011-01-13","Sunshine","South","Pham","WFMI",62,1177.3799999999999,496]
["2011-01-18","Sunshine","East","Pham","WSD",51,968.4899999999999,408]
["2011-01-12","Bellen","MidWest","Franks","EPP",22,505.78,220]
["2011-01-12","Bellen","South","Sioux","AST",50,1149.5,500]
["2011-01-10","Carlota","East","Pham","TTT",9,215.91,99]
["2011-01-01","Bellen","West","Franks","PSA",24,551.76,240]
["2011-01-17","Quad","South","Franks","SFWK",42,1133.58,609]
["2011-01-02","Bellen","South","Smith","KBTB",17,390.83,170]
["2011-01-29","Bellen","West","Smith","EPP",20,459.79999999999995,200]
["2011-01-26","Quad","South","Sioux","ITW",20,539.79999999999995,290]
["2011-01-13","Sunshine","East","Gault","T",11,208.89,88]
["2011-01-02","Quad","West","Chin","TTT",22,593.78,319]
["2011-01-23","Bellen","South","Pham","QT",19,436.80999999999995,190]
["2011-01-21","Carlota","East","Gault","AA",32,767.68,352]
["2011-01-08","Quad","West","Smith","BBT",26,701.74,377]
["2011-01-19","Quad","West","Franks","PLOT",57,1538.4299999999998,826.5]
["2011-01-24","Sunshine","East","Pham","EPP",57,1082.4299999999998,456]
["2011-01-12","Quad","East","Chin","YTR",59,1592.4099999999999,855.5]
["2011-01-11","Bellen","South","Smith","LOP",15,344.84999999999997,150]
["2011-01-23","Quad","MidWest","Smith","MBG",50,1349.5,725]
["2011-01-23","Sunset","East","Gault","AST",29,608.70999999999992,268.25]
["2011-01-30","Sunset","West","Smith","DFGH",23,482.77,212.75]
["2011-01-05","Bellen","East","Smith","GRR",10,229.89999999999998,100]
["2011-01-29","Sunshine","East","Sioux","EPP",40,759.59999999999991,320]
["2011-01-05","Sunset","South","Sioux","AST",23,482.77,212.75]
["2011-01-25","Bellen","MidWest","Pham","MBG",10,229.89999999999998,100]
["2011-01-17","Quad","West","Smith","KBTB",47,1268.53,681.5]
["2011-01-22","Sunshine","West","Smith","WT",64,1215.3599999999999,512]
["2011-01-30","Bellen","MidWest","Pham","FRED",10,229.89999999999998,100]
["2011-01-08","Bellen","South","Smith","DDH",63,1448.37,630]
["2011-01-14","Bellen","South","Gault","JAQ",52,1195.48,520]
["2011-01-09","Sunshine","South","Smith","AA",22,417.78,176]
["2011-01-22","Sunshine","MidWest","Smith","MNGD",29,550.70999999999992,232]
["2011-01-10","Bellen","MidWest","Gault","TTT",50,1149.5,500]
["2011-01-26","Sunset","West","Sioux","FM",50,1049.5,462.5]
["2011-01-14","Carlota","South","Sioux","ITW",48,1151.52,528]
["2011-01-13","Quad","East","Pham","SFWK",27,728.7299999999999,391.5]
["2011-01-12","Bellen","West","Smith","PCC",6,137.94,60]
["2011-01-28","Carlota","MidWest","Pham","PLOT",62,1487.3799999999999,682]
["2011-01-22","Carlota","MidWest","Sioux","TRU",10,239.89999999999998,110]
["2011-01-04","Carlota","East","Gault","MBG",33,791.67,363]
["2011-01-26","Quad","South","Sioux","QT",17,458.83,246.5]
["2011-01-19","Bellen","South","Gault","DFGH",10,229.89999999999998,100]
["2011-01-01","Carlota","East","Smith","MBG",8,191.92,88]
["2011-01-06","Sunset","MidWest","Pham","TRU",30,629.69999999999993,277.5]
["2011-01-08","Carlota","West","Sioux","TTT",22,527.78,242]
["2011-01-28","Quad","MidWest","Smith","FM",30,809.69999999999993,435]
["2011-01-12","Bellen","MidWest","Gault","MNGD",64,1471.36,640]
["2011-01-10","Quad","South","Chin","PLOT",43,1160.57,623.5]
["2011-01-28","Bellen","East","Smith","TTT",45,1034.55,450]
["2011-01-22","Carlota","West","Pham","LOP",45,1079.55,495]
["2011-01-25","Sunshine","MidWest","Sioux","T",55,1044.4499999999998,440]
["2011-01-18","Sunshine","South","Smith","ET",62,1177.3799999999999,496]
["2011-01-06","Carlota","MidWest","Gault","FM",11,263.89,121]
["2011-01-26","Quad","MidWest","Pham","EPP",17,458.83,246.5]
["2011-01-11","Bellen","West","Chin","MBG",57,1310.4299999999998,570]
["2011-01-20","Sunshine","East","Franks","MNGD",64,1215.3599999999999,512]
["2011-01-23","Quad","West","Gault","KPSA",31,836.68999999999994,449.5]
["2011-01-20","Sunset","South","Pham","AA",21,440.78999999999996,194.25]
["2011-01-03","Quad","South","Pham","WSD",32,863.68,464]
["2011-01-05","Carlota","MidWest","Gault","EPP",47,1127.53,517]
["2011-01-11","Bellen","MidWest","Gault","TRU",19,436.80999999999995,190]
["2011-01-28","Carlota","South","Chin","KBTB",14,335.85999999999996,154]
["2011-01-05","Sunshine","MidWest","Franks","PLOT",14,265.85999999999996,112]
["2011-01-15","Quad","West","Pham","ET",55,1484.4499999999998,797.5]
["2011-01-04","Sunshine","MidWest","Sioux","QT",37,702.63,296]

{"sheet":"PT(9)","index":120,"n_rows":10,"n_cols":3,"rows_kept":10,"cut":false,"hidden":false,"merged":[]}
[]
[]
["Date","Sum of Sales","Running Total"]
["2011-01-01",743.68,743.68]
["2011-01-02",2505.87,3249.5499999999997]
["2011-01-03",3250.7299999999996,6500.2799999999988]
["2011-01-04",1494.3,7994.579999999999]
["2011-01-05",5692.5599999999995,13687.14]
["2011-01-06",3249.5599999999995,16936.699999999997]
["Grand Total",16936.699999999997]

{"sheet":"PTData (8)","index":121,"n_rows":23,"n_cols":8,"rows_kept":23,"cut":false,"hidden":false,"merged":[]}
["Date","Product","Region","SalesRep","Customer","Units","Sales","COGS"]
["2011-01-01","Bellen","West","Franks","PSA",24,551.76,240]
["2011-01-01","Carlota","East","Smith","MBG",8,191.92,88]
["2011-01-02","Sunshine","West","Sioux","TTT",16,303.83999999999997,128]
["2011-01-02","Sunset","South","Sioux","KPSA",58,1217.4199999999998,536.5]
["2011-01-02","Bellen","South","Smith","KBTB",17,390.83,170]
["2011-01-02","Quad","West","Chin","TTT",22,593.78,319]
["2011-01-03","Carlota","South","Gault","MBG",59,1415.4099999999999,649]
["2011-01-03","Quad","MidWest","Gault","FM",36,971.64,522]
["2011-01-03","Quad","South","Pham","WSD",32,863.68,464]
["2011-01-04","Carlota","East","Gault","MBG",33,791.67,363]
["2011-01-04","Sunshine","MidWest","Sioux","QT",37,702.63,296]
["2011-01-05","Bellen","MidWest","Chin","AA",57,1310.4299999999998,570]
["2011-01-05","Sunset","South","Smith","KPSA",39,818.6099999999999,360.75]
["2011-01-05","Quad","MidWest","Chin","PSA",54,1457.4599999999998,783]
["2011-01-05","Bellen","East","Smith","GRR",10,229.89999999999998,100]
["2011-01-05","Sunset","South","Sioux","AST",23,482.77,212.75]
["2011-01-05","Carlota","MidWest","Gault","EPP",47,1127.53,517]
["2011-01-05","Sunshine","MidWest","Franks","PLOT",14,265.85999999999996,112]
["2011-01-06","Quad","East","Franks","FM",50,1349.5,725]
["2011-01-06","Sunshine","South","Smith","TRU",53,1006.4699999999999,424]
["2011-01-06","Sunset","MidWest","Pham","TRU",30,629.69999999999993,277.5]
["2011-01-06","Carlota","MidWest","Gault","FM",11,263.89,121]

{"sheet":"PT(11)","index":122,"n_rows":10,"n_cols":2,"rows_kept":10,"cut":false,"hidden":false,"merged":[]}
[]
[]
["SalesRep","Sum of Sales"]
["Chin",9233.3799999999992]
["Franks",11640.110000000002]
["Gault",517293.58]
["Pham",15474.21]
["Sioux",12416.44]
["Smith",18397.980000000003]
["Grand Total",584455.69999999995]

{"sheet":"PT(10)","index":123,"n_rows":10,"n_cols":4,"rows_kept":10,"cut":false,"hidden":false,"merged":[]}
[]
[]
["SalesRep","Average of Sales","Max of Sales","Min of Sales"]
["Chin",1025.931111111111,1592.4099999999999,311.87]
["Franks",895.39307692307716,1646.3899999999999,242.91]
["Gault",22491.025217391307,500000,146.92999999999998]
["Pham",736.86714285714277,1487.3799999999999,215.91]
["Sioux",827.76266666666675,1439.3999999999999,239.89999999999998]
["Smith",766.5825000000001,1673.3799999999999,137.94]
["Grand Total",5566.2447619047634,500000,137.94]

{"sheet":"PTData (9)","index":124,"n_rows":106,"n_cols":10,"rows_kept":106,"cut":false,"hidden":false,"merged":[]}
["Date","SalesRep","Sales",null,null,"Integers",null,"Decimals"]
["2011-01-12","Gault",500000,null,null,5,null,{"$f":"F2+0.25","v":5.25}]
["2011-01-11","Smith",1673.3799999999999,null,null,8,null,8.25]
["2011-01-06","Franks",1349.5,null,null,9,null,9.25]
["2011-01-03","Gault",1415.4099999999999,null,null,10,null,10.25]
["2011-01-16","Franks",1271.47,null,null,11,null,11.25]
["2011-01-24","Pham",778.58999999999992,null,null,20,null,20.25]
["2011-01-10","Smith",298.87,null,null,19,null,19.25]
["2011-01-24","Smith",1511.4399999999998]
["2011-01-13","Gault",949.49999999999989]
["2011-01-25","Smith",493.73999999999995,null,"Row Labels","Count of Integers",null,null,"Row Labels","Count of Decimals"]
["2011-01-10","Pham",597.74,null,"0-9",3,null,"0 <= Number < 10","0-10",3]
["2011-01-29","Gault",1112.47,null,"10-20",4,null,"10 <= Number < 20","10-20",3]
["2011-01-17","Pham",1160.57,null,"Grand Total",7,null,"Number > 20",">20",1]
["2011-01-03","Gault",971.64,null,null,null,null,null,"Grand Total",7]
["2011-01-24","Franks",242.91]
["2011-01-23","Gault",1439.3999999999999]
["2011-01-20","Gault",146.92999999999998]
["2011-01-25","Sioux",1349.5]
["2011-01-15","Smith",383.84]
["2011-01-25","Gault",643.71999999999991]
["2011-01-06","Smith",1006.4699999999999]
["2011-01-24","Franks",1646.3899999999999]
["2011-01-23","Pham",482.77]
["2011-01-02","Sioux",303.83999999999997]
["2011-01-14","Chin",1160.57]
["2011-01-26","Franks",608.70999999999992]
["2011-01-13","Sioux",1439.3999999999999]
["2011-01-28","Franks",455.80999999999995]
["2011-01-14","Gault",782.70999999999992]
["2011-01-25","Gault",503.78999999999996]
["2011-01-20","Pham",643.71999999999991]
["2011-01-09","Franks",854.55]
["2011-01-25","Pham",296.89]
["2011-01-02","Sioux",1217.4199999999998]
["2011-01-05","Chin",1310.4299999999998]
["2011-01-05","Smith",818.6099999999999]
["2011-01-25","Chin",311.87]
["2011-01-05","Chin",1457.4599999999998]
["2011-01-09","Gault",239.89999999999998]
["2011-01-13","Pham",1177.3799999999999]
["2011-01-18","Pham",968.4899999999999]
["2011-01-12","Franks",505.78]
["2011-01-12","Sioux",1149.5]
["2011-01-10","Pham",215.91]
["2011-01-01","Franks",551.76]
["2011-01-17","Franks",1133.58]
["2011-01-02","Smith",390.83]
["2011-01-29","Smith",459.79999999999995]
["2011-01-26","Sioux",539.79999999999995]
["2011-01-13","Gault",208.89]
["2011-01-02","Chin",593.78]
["2011-01-23","Pham",436.80999999999995]
["2011-01-21","Gault",767.68]
["2011-01-08","Smith",701.74]
["2011-01-19","Franks",1538.4299999999998]
["2011-01-24","Pham",1082.4299999999998]
["2011-01-12","Chin",1592.4099999999999]
["2011-01-11","Smith",344.84999999999997]
["2011-01-23","Smith",1349.5]
["2011-01-23","Gault",608.70999999999992]
["2011-01-30","Smith",482.77]
["2011-01-05","Smith",229.89999999999998]
["2011-01-29","Sioux",759.59999999999991]
["2011-01-05","Sioux",482.77]
["2011-01-25","Pham",229.89999999999998]
["2011-01-17","Smith",1268.53]
["2011-01-22","Smith",1215.3599999999999]
["2011-01-30","Pham",229.89999999999998]
["2011-01-08","Smith",1448.37]
["2011-01-14","Gault",1195.48]
["2011-01-09","Smith",417.78]
["2011-01-22","Smith",550.70999999999992]
["2011-01-10","Gault",1149.5]
["2011-01-26","Sioux",1049.5]
["2011-01-14","Sioux",1151.52]
["2011-01-13","Pham",728.7299999999999]
["2011-01-12","Smith",137.94]
["2011-01-28","Pham",1487.3799999999999]
["2011-01-22","Sioux",239.89999999999998]
["2011-01-04","Gault",791.67]
["2011-01-26","Sioux",458.83]
["2011-01-19","Gault",229.89999999999998]
["2011-01-01","Smith",191.92]
["2011-01-06","Pham",629.69999999999993]
["2011-01-08","Sioux",527.78]
["2011-01-28","Smith",809.69999999999993]
["2011-01-12","Gault",1471.36]
["2011-01-10","Chin",1160.57]
["2011-01-28","Smith",1034.55]
["2011-01-22","Pham",1079.55]
["2011-01-25","Sioux",1044.4499999999998]
["2011-01-18","Smith",1177.3799999999999]
["2011-01-06","Gault",263.89]
["2011-01-26","Pham",458.83]
["2011-01-11","Chin",1310.4299999999998]
["2011-01-20","Franks",1215.3599999999999]
["2011-01-23","Gault",836.68999999999994]
["2011-01-20","Pham",440.78999999999996]
["2011-01-03","Pham",863.68]
["2011-01-05","Gault",1127.53]
["2011-01-11","Gault",436.80999999999995]
["2011-01-28","Chin",335.85999999999996]
["2011-01-05","Franks",265.85999999999996]
["2011-01-15","Pham",1484.4499999999998]
["2011-01-04","Sioux",702.63]

{"sheet":"Filter","index":125,"n_rows":106,"n_cols":11,"rows_kept":106,"cut":false,"hidden":false,"merged":[]}
["Date","Product","Region","SalesRep","Customer","Units","Sales","COGS",null,"Average",{"$f":"AVERAGE(G2:G106)","v":813.59371428571421}]
["2011-01-12","Quad","East","Gault","TTT",36,971.64,522]
["2011-01-11","Quad","East","Smith","HII",62,1673.3799999999999,899]
["2011-01-06","Quad","East","Franks","FM",50,1349.5,725]
["2011-01-03","Carlota","South","Gault","MBG",59,1415.4099999999999,649,null,"Stuff"]
["2011-01-16","Carlota","MidWest","Franks","JAQ",53,1271.47,583,null,"Stuff"]
["2011-01-24","Sunshine","West","Pham","ITTW",41,778.58999999999992,328,null,"Stuff"]
["2011-01-10","Bellen","MidWest","Smith","HHH",13,298.87,130,null,"Stuff"]
["2011-01-24","Quad","MidWest","Franks","AA",61,1646.3899999999999,884.5,null,"Stuff"]
["2011-01-13","Sunshine","East","Gault","WT",50,949.49999999999989,400,null,"Stuff"]
["2011-01-25","Sunshine","MidWest","Smith","PSA",26,493.73999999999995,208]
["2011-01-10","Bellen","East","Pham","HII",26,597.74,260]
["2011-01-29","Sunset","South","Gault","TRU",53,1112.47,490.25]
["2011-01-17","Quad","East","Pham","DFR",43,1160.57,623.5]
["2011-01-03","Quad","MidWest","Gault","FM",36,971.64,522]
["2011-01-24","Quad","South","Franks","KBTB",9,242.91,130.5]
["2011-01-23","Carlota","South","Gault","ET",60,1439.3999999999999,660]
["2011-01-20","Sunset","East","Gault","WSD",7,146.92999999999998,64.75]
["2011-01-25","Quad","East","Sioux","PSA",50,1349.5,725]
["2011-01-15","Carlota","West","Smith","DFR",16,383.84,176]
["2011-01-25","Bellen","MidWest","Gault","WFMI",28,643.71999999999991,280]
["2011-01-06","Sunshine","South","Smith","TRU",53,1006.4699999999999,424]
["2011-01-12","Quad","East","Chin","YTR",59,1592.4099999999999,855.5]
["2011-01-23","Sunset","MidWest","Pham","ITTW",23,482.77,212.75]
["2011-01-02","Sunshine","West","Sioux","TTT",16,303.83999999999997,128]
["2011-01-14","Quad","West","Chin","TRU",43,1160.57,623.5]
["2011-01-26","Sunset","East","Franks","TTT",29,608.70999999999992,268.25]
["2011-01-13","Carlota","East","Sioux","ET",60,1439.3999999999999,660]
["2011-01-28","Carlota","South","Franks","FRED",19,455.80999999999995,209]
["2011-01-14","Quad","MidWest","Gault","ET",29,782.70999999999992,420.5]
["2011-01-25","Carlota","South","Gault","FRED",21,503.78999999999996,231]
["2011-01-20","Bellen","South","Pham","ZAT",28,643.71999999999991,280]
["2011-01-09","Sunshine","West","Franks","EPP",45,854.55,360]
["2011-01-25","Quad","MidWest","Pham","ITTW",11,296.89,159.5]
["2011-01-02","Sunset","South","Sioux","KPSA",58,1217.4199999999998,536.5]
["2011-01-05","Bellen","MidWest","Chin","AA",57,1310.4299999999998,570]
["2011-01-05","Sunset","South","Smith","KPSA",39,818.6099999999999,360.75]
["2011-01-25","Carlota","MidWest","Chin","MNGD",13,311.87,143]
["2011-01-05","Quad","MidWest","Chin","PSA",54,1457.4599999999998,783]
["2011-01-09","Carlota","East","Gault","FM",10,239.89999999999998,110]
["2011-01-13","Sunshine","South","Pham","WFMI",62,1177.3799999999999,496]
["2011-01-18","Sunshine","East","Pham","WSD",51,968.4899999999999,408]
["2011-01-12","Bellen","MidWest","Franks","EPP",22,505.78,220]
["2011-01-12","Bellen","South","Sioux","AST",50,1149.5,500]
["2011-01-10","Carlota","East","Pham","TTT",9,215.91,99]
["2011-01-01","Bellen","West","Franks","PSA",24,551.76,240]
["2011-01-17","Quad","South","Franks","SFWK",42,1133.58,609]
["2011-01-02","Bellen","South","Smith","KBTB",17,390.83,170]
["2011-01-29","Bellen","West","Smith","EPP",20,459.79999999999995,200]
["2011-01-26","Quad","South","Sioux","ITW",20,539.79999999999995,290]
["2011-01-13","Sunshine","East","Gault","T",11,208.89,88]
["2011-01-02","Quad","West","Chin","TTT",22,593.78,319]
["2011-01-23","Bellen","South","Pham","QT",19,436.80999999999995,190]
["2011-01-21","Carlota","East","Gault","AA",32,767.68,352]
["2011-01-08","Quad","West","Smith","BBT",26,701.74,377]
["2011-01-19","Quad","West","Franks","PLOT",57,1538.4299999999998,826.5]
["2011-01-24","Sunshine","East","Pham","EPP",57,1082.4299999999998,456]
["2011-01-24","Quad","South","Smith","TTT",56,1511.4399999999998,812]
["2011-01-11","Bellen","South","Smith","LOP",15,344.84999999999997,150]
["2011-01-23","Quad","MidWest","Smith","MBG",50,1349.5,725]
["2011-01-23","Sunset","East","Gault","AST",29,608.70999999999992,268.25]
["2011-01-30","Sunset","West","Smith","DFGH",23,482.77,212.75]
["2011-01-05","Bellen","East","Smith","GRR",10,229.89999999999998,100]
["2011-01-29","Sunshine","East","Sioux","EPP",40,759.59999999999991,320]
["2011-01-05","Sunset","South","Sioux","AST",23,482.77,212.75]
["2011-01-25","Bellen","MidWest","Pham","MBG",10,229.89999999999998,100]
["2011-01-17","Quad","West","Smith","KBTB",47,1268.53,681.5]
["2011-01-22","Sunshine","West","Smith","WT",64,1215.3599999999999,512]
["2011-01-30","Bellen","MidWest","Pham","FRED",10,229.89999999999998,100]
["2011-01-08","Bellen","South","Smith","DDH",63,1448.37,630]
["2011-01-14","Bellen","South","Gault","JAQ",52,1195.48,520]
["2011-01-09","Sunshine","South","Smith","AA",22,417.78,176]
["2011-01-22","Sunshine","MidWest","Smith","MNGD",29,550.70999999999992,232]
["2011-01-10","Bellen","MidWest","Gault","TTT",50,1149.5,500]
["2011-01-26","Sunset","West","Sioux","FM",50,1049.5,462.5]
["2011-01-14","Carlota","South","Sioux","ITW",48,1151.52,528]
["2011-01-13","Quad","East","Pham","SFWK",27,728.7299999999999,391.5]
["2011-01-12","Bellen","West","Smith","PCC",6,137.94,60]
["2011-01-28","Carlota","MidWest","Pham","PLOT",62,1487.3799999999999,682]
["2011-01-22","Carlota","MidWest","Sioux","TRU",10,239.89999999999998,110]
["2011-01-04","Carlota","East","Gault","MBG",33,791.67,363]
["2011-01-26","Quad","South","Sioux","QT",17,458.83,246.5]
["2011-01-19","Bellen","South","Gault","DFGH",10,229.89999999999998,100]
["2011-01-01","Carlota","East","Smith","MBG",8,191.92,88]
["2011-01-06","Sunset","MidWest","Pham","TRU",30,629.69999999999993,277.5]
["2011-01-08","Carlota","West","Sioux","TTT",22,527.78,242]
["2011-01-28","Quad","MidWest","Smith","FM",30,809.69999999999993,435]
["2011-01-12","Bellen","MidWest","Gault","MNGD",64,1471.36,640]
["2011-01-10","Quad","South","Chin","PLOT",43,1160.57,623.5]
["2011-01-28","Bellen","East","Smith","TTT",45,1034.55,450]
["2011-01-22","Carlota","West","Pham","LOP",45,1079.55,495]
["2011-01-25","Sunshine","MidWest","Sioux","T",55,1044.4499999999998,440]
["2011-01-18","Sunshine","South","Smith","ET",62,1177.3799999999999,496]
["2011-01-06","Carlota","MidWest","Gault","FM",11,263.89,121]
["2011-01-26","Quad","MidWest","Pham","EPP",17,458.83,246.5]
["2011-01-11","Bellen","West","Chin","MBG",57,1310.4299999999998,570]
["2011-01-20","Sunshine","East","Franks","MNGD",64,1215.3599999999999,512]
["2011-01-23","Quad","West","Gault","KPSA",31,836.68999999999994,449.5]
["2011-01-20","Sunset","South","Pham","AA",21,440.78999999999996,194.25]
["2011-01-03","Quad","South","Pham","WSD",32,863.68,464]
["2011-01-05","Carlota","MidWest","Gault","EPP",47,1127.53,517]
["2011-01-11","Bellen","MidWest","Gault","TRU",19,436.80999999999995,190]
["2011-01-28","Carlota","South","Chin","KBTB",14,335.85999999999996,154]
["2011-01-05","Sunshine","MidWest","Franks","PLOT",14,265.85999999999996,112]
["2011-01-15","Quad","West","Pham","ET",55,1484.4499999999998,797.5]
["2011-01-04","Sunshine","MidWest","Sioux","QT",37,702.63,296]

{"sheet":"PFilter","index":126,"n_rows":12,"n_cols":8,"rows_kept":12,"cut":false,"hidden":false,"merged":[]}
["Date","Product","Region","SalesRep","Customer","Units","Sales","COGS"]
["2011-01-24","Quad","South","Smith","TTT",56,1511.4399999999998,812]
["2011-01-24","Quad","South","Franks","KBTB",9,242.91,130.5]
["2011-01-06","Sunshine","South","Smith","TRU",53,1006.4699999999999,424]
["2011-01-13","Sunshine","South","Pham","WFMI",62,1177.3799999999999,496]
["2011-01-17","Quad","South","Franks","SFWK",42,1133.58,609]
["2011-01-26","Quad","South","Sioux","ITW",20,539.79999999999995,290]
["2011-01-09","Sunshine","South","Smith","AA",22,417.78,176]
["2011-01-26","Quad","South","Sioux","QT",17,458.83,246.5]
["2011-01-10","Quad","South","Chin","PLOT",43,1160.57,623.5]
["2011-01-18","Sunshine","South","Smith","ET",62,1177.3799999999999,496]
["2011-01-03","Quad","South","Pham","WSD",32,863.68,464]

{"sheet":"FilterC","index":127,"n_rows":48,"n_cols":8,"rows_kept":48,"cut":false,"hidden":false,"merged":[]}
["Date","Product","Region","SalesRep","Customer","Units","Sales","COGS"]
["2011-01-12","Quad","East","Gault","TTT",36,971.64,522]
["2011-01-11","Quad","East","Smith","HII",62,1673.3799999999999,899]
["2011-01-06","Quad","East","Franks","FM",50,1349.5,725]
["2011-01-03","Carlota","South","Gault","MBG",59,1415.4099999999999,649]
["2011-01-16","Carlota","MidWest","Franks","JAQ",53,1271.47,583]
["2011-01-24","Sunshine","West","Pham","ITTW",41,778.58999999999992,328]
["2011-01-25","Carlota","MidWest","Chin","MNGD",13,311.87,143]
["2011-01-05","Quad","MidWest","Chin","PSA",54,1457.4599999999998,783]
["2011-01-09","Carlota","East","Gault","FM",10,239.89999999999998,110]
["2011-01-13","Sunshine","South","Pham","WFMI",62,1177.3799999999999,496]
["2011-01-18","Sunshine","East","Pham","WSD",51,968.4899999999999,408]
["2011-01-12","Bellen","MidWest","Franks","EPP",22,505.78,220]
["2011-01-13","Sunshine","East","Gault","T",11,208.89,88]
["2011-01-02","Quad","West","Chin","TTT",22,593.78,319]
["2011-01-23","Bellen","South","Pham","QT",19,436.80999999999995,190]
["2011-01-21","Carlota","East","Gault","AA",32,767.68,352]
["2011-01-08","Quad","West","Smith","BBT",26,701.74,377]
["2011-01-19","Quad","West","Franks","PLOT",57,1538.4299999999998,826.5]
["2011-01-12","Bellen","West","Smith","PCC",6,137.94,60]
["2011-01-28","Carlota","MidWest","Pham","PLOT",62,1487.3799999999999,682]
["2011-01-22","Carlota","MidWest","Sioux","TRU",10,239.89999999999998,110]
["2011-01-04","Carlota","East","Gault","MBG",33,791.67,363]
["2011-01-26","Quad","South","Sioux","QT",17,458.83,246.5]
["2011-01-19","Bellen","South","Gault","DFGH",10,229.89999999999998,100]
["2011-01-01","Carlota","East","Smith","MBG",8,191.92,88]
["2011-01-06","Sunset","MidWest","Pham","TRU",30,629.69999999999993,277.5]
["2011-01-08","Carlota","West","Sioux","TTT",22,527.78,242]
["2011-01-28","Quad","MidWest","Smith","FM",30,809.69999999999993,435]
["2011-01-12","Bellen","MidWest","Gault","MNGD",64,1471.36,640]
["2011-01-10","Quad","South","Chin","PLOT",43,1160.57,623.5]
["2011-01-28","Bellen","East","Smith","TTT",45,1034.55,450]
["2011-01-22","Carlota","West","Pham","LOP",45,1079.55,495]
["2011-01-25","Sunshine","MidWest","Sioux","T",55,1044.4499999999998,440]
["2011-01-18","Sunshine","South","Smith","ET",62,1177.3799999999999,496]
["2011-01-06","Carlota","MidWest","Gault","FM",11,263.89,121]
["2011-01-26","Quad","MidWest","Pham","EPP",17,458.83,246.5]
["2011-01-11","Bellen","West","Chin","MBG",57,1310.4299999999998,570]
["2011-01-20","Sunshine","East","Franks","MNGD",64,1215.3599999999999,512]
["2011-01-23","Quad","West","Gault","KPSA",31,836.68999999999994,449.5]
["2011-01-20","Sunset","South","Pham","AA",21,440.78999999999996,194.25]
["2011-01-03","Quad","South","Pham","WSD",32,863.68,464]
["2011-01-05","Carlota","MidWest","Gault","EPP",47,1127.53,517]
["2011-01-11","Bellen","MidWest","Gault","TRU",19,436.80999999999995,190]
["2011-01-28","Carlota","South","Chin","KBTB",14,335.85999999999996,154]
["2011-01-05","Sunshine","MidWest","Franks","PLOT",14,265.85999999999996,112]
["2011-01-15","Quad","West","Pham","ET",55,1484.4499999999998,797.5]
["2011-01-04","Sunshine","MidWest","Sioux","QT",37,702.63,296]

{"sheet":"FilterT","index":128,"n_rows":31,"n_cols":6,"rows_kept":31,"cut":false,"hidden":false,"merged":[]}
["Customers","Address","City","State","Zip","E-mail"]
[", Aler","3557 1st St.","Seattle","WA",981147,"JNV@yahoo.com"]
["Acero, Natisha","6281 173rd St.","Tacoma","WA",981317,"HDT641@fun.edu"]
["Bruess, Natisha","7149 1st Ave.","Seattle","WA",981335,"YSE222@fun.edu"]
["Chukes, Hal","7726 66th Ave.","Tacoma","WA",981118,"MGF675@fun.edu"]
["Dahnke, Georgeann","316 66th Blvd. 151st St.","Kent","WA",981244,"RWN@fun.edu"]
["Dillaman, Darius","965 151st St.","Kent","WA",981162,"MJG@yahoo.com"]
["Durtschi, Dane","7582 4th Lane","Tacoma","WA",981177,"KVC@gmail.com"]
["Fila, Bryon","1654 66th St.","Seattle","WA",981143,"QKC@gmail.com"]
["Fukumoto, Marvis","3653 4th Blvd.","Seattle","WA",981280,"PKF@yahoo.com"]
["General, Marlin","7900 173rd Lane","Kent","WA",981266,"KFP@yahoo.com"]
["Ghrist, Annita","313 173rd Blvd.","Kent","WA",981215,"FSO485@gmail.com"]
["Gonnella, Marcel","6699 13th St.","Tacoma","WA",981152,"THH325@yahoo.com"]
["Herry, Bryon","4358 66th Blvd.","Kent","WA",981225,"LGQ756@gmail.com"]
["Hudnell, Rod","3789 4th Blvd.","Seattle","WA",981152,"IGJ150@gmail.com"]
["Jayson, Dane","3392 23rd St.","Seattle","WA",981131,"CLU@fun.edu"]
["Kalahiki, Rod","5054 1st St.","Tacoma","WA",981171,"VWQ301@gmail.com"]
["Lomasney, Lavenia","4047 15th Ave.","Kent","WA",981228,"HHU@fun.edu"]
["Matar, Son","2466 4th Ave.","Seattle","WA",981328,"QFY278@yahoo.com"]
["Musco, Lianne","3341 173rd Blvd.","Seattle","WA",981185,"HEW@fun.edu"]
["Patrum, Ali","4254 23rd Blvd.","Seattle","WA",981234,"NNR752@fun.edu"]
["Pofahl, Quinton","1103 15th Lane","Tacoma","WA",981225,"WFK@fun.edu"]
["Reffett, Marcel","267 4th Lane","Seattle","WA",981266,"CHI751@yahoo.com"]
["Savini, Quinton","3861 2nd Blvd.","Tacoma","WA",981178,"WGD789@gmail.com"]
["Scrabeck, Keren","2977 66th Lane","Seattle","WA",981171,"EBA@gmail.com"]
["Spezio, Bryon","7096 15th Lane","Seattle","WA",981259,"HCR176@yahoo.com"]
["Stolt, Hal","7021 1st Ave.","Tacoma","WA",981185,"FSI@yahoo.com"]
["Vuono, Nolan","5789 13th Lane","Tacoma","WA",981341,"CUU@fun.edu"]
["Walenta, Bryon","7932 23rd St.","Tacoma","WA",981263,"JKO209@fun.edu"]
["Zeiser, Keren","4907 13th Ave.","Kent","WA",981232,"FRF676@yahoo.com"]
["Zeiss, Son","4817 13th St.","Tacoma","WA",981112,"DTT@yahoo.com"]

{"sheet":"FilterD","index":129,"n_rows":106,"n_cols":3,"rows_kept":106,"cut":false,"hidden":false,"merged":[]}
["Date","SalesRep","Project"]
["2009-12-25","Gault","Project 9"]
["2009-12-15","Smith","Project 22"]
["2009-12-11","Franks","Project 19"]
["2009-12-01","Gault","Project 20"]
["2009-12-11","Franks","Project 9"]
["2010-02-12","Pham","Project 21"]
["2009-12-07","Smith","Project 9"]
["2009-11-23","Smith","Project 13"]
["2009-11-23","Gault","Project 12"]
["2010-01-23","Smith","Project 8"]
["2010-01-21","Pham","Project 22"]
["2009-12-20","Gault","Project 21"]
["2009-12-07","Pham","Project 16"]
["2010-02-11","Gault","Project 14"]
["2010-01-13","Franks","Project 18"]
["2010-01-28","Gault","Project 16"]
["2010-01-25","Gault","Project 10"]
["2010-02-10","Sioux","Project 11"]
["2009-12-26","Smith","Project 16"]
["2009-12-14","Gault","Project 22"]
["2010-02-12","Smith","Project 4"]
["2010-01-19","Franks","Project 9"]
["2010-02-16","Pham","Project 21"]
["2010-01-07","Sioux","Project 20"]
["2010-01-16","Chin","Project 1"]
["2010-02-15","Franks","Project 20"]
["2009-12-13","Sioux","Project 14"]
["2010-01-04","Franks","Project 13"]
["2009-12-14","Gault","Project 21"]
["2010-02-01","Gault","Project 2"]
["2009-11-25","Pham","Project 2"]
["2010-02-07","Franks","Project 6"]
["2009-12-22","Pham","Project 2"]
["2009-12-07","Sioux","Project 7"]
["2009-12-12","Chin","Project 6"]
["2009-12-30","Smith","Project 17"]
["2009-12-27","Chin","Project 15"]
["2009-12-29","Chin","Project 5"]
["2010-01-05","Gault","Project 11"]
["2009-12-15","Pham","Project 11"]
["2009-12-01","Pham","Project 10"]
["2010-02-07","Franks","Project 18"]
["2009-11-26","Sioux","Project 16"]
["2010-01-04","Pham","Project 17"]
["2010-01-29","Franks","Project 16"]
["2010-01-19","Franks","Project 21"]
["2010-02-14","Smith","Project 16"]
["2009-12-03","Smith","Project 1"]
["2010-01-02","Sioux","Project 3"]
["2009-12-29","Gault","Project 4"]
["2009-11-26","Chin","Project 18"]
["2009-12-24","Pham","Project 5"]
["2009-12-10","Gault","Project 2"]
["2009-12-31","Smith","Project 10"]
["2009-12-16","Franks","Project 9"]
["2010-01-03","Pham","Project 14"]
["2009-12-26","Chin","Project 4"]
["2010-01-05","Smith","Project 16"]
["2009-12-19","Smith","Project 21"]
["2009-11-20","Gault","Project 21"]
["2010-01-03","Smith","Project 18"]
["2009-12-14","Smith","Project 4"]
["2010-01-01","Sioux","Project 18"]
["2009-11-27","Sioux","Project 3"]
["2010-01-01","Pham","Project 13"]
["2009-12-03","Smith","Project 10"]
["2009-11-25","Smith","Project 12"]
["2010-01-07","Pham","Project 22"]
["2010-02-02","Smith","Project 12"]
["2010-02-08","Gault","Project 16"]
["2010-01-13","Smith","Project 12"]
["2009-11-20","Smith","Project 2"]
["2009-12-23","Gault","Project 16"]
["2009-11-26","Sioux","Project 15"]
["2009-12-01","Sioux","Project 13"]
["2009-11-29","Pham","Project 17"]
["2010-01-13","Smith","Project 16"]
["2010-01-09","Pham","Project 1"]
["2010-01-30","Sioux","Project 13"]
["2010-02-04","Gault","Project 9"]
["2010-01-02","Sioux","Project 20"]
["2010-01-16","Gault","Project 22"]
["2009-12-28","Smith","Project 14"]
["2009-12-26","Pham","Project 8"]
["2009-11-28","Sioux","Project 3"]
["2010-02-02","Smith","Project 6"]
["2009-12-27","Gault","Project 22"]
["2010-02-01","Chin","Project 18"]
["2009-12-25","Smith","Project 11"]
["2010-01-17","Pham","Project 6"]
["2010-01-15","Sioux","Project 16"]
["2010-01-10","Smith","Project 18"]
["2010-01-05","Gault","Project 12"]
["2010-01-20","Pham","Project 18"]
["2009-12-08","Chin","Project 12"]
["2010-01-16","Franks","Project 5"]
["2009-12-19","Gault","Project 13"]
["2009-12-17","Pham","Project 7"]
["2010-01-19","Pham","Project 10"]
["2009-11-21","Gault","Project 7"]
["2010-02-18","Gault","Project 15"]
["2009-12-09","Chin","Project 11"]
["2010-01-04","Franks","Project 4"]
["2009-12-29","Pham","Project 2"]
["2009-12-29","Sioux","Project 3"]

{"sheet":"FilterSales","index":130,"n_rows":115,"n_cols":3,"rows_kept":115,"cut":false,"hidden":false,"merged":[]}
["Date","SalesRep","Sales"]
["2009-12-25","Gault",94.69]
["2009-12-15","Smith",130.19999999999999]
["2009-12-11","Franks",149.94999999999999]
["2009-12-01","Gault",94.11]
["2009-12-11","Franks",136.13999999999999]
["2010-02-12","Pham",133.16999999999999]
["2009-12-07","Smith",80.81]
["2009-11-23","Smith",125.38]
["2009-11-23","Gault",78.95]
["2010-01-23","Smith",113.86]
["2010-01-21","Pham",139.38]
["2009-12-20","Gault",98.71]
["2009-12-07","Pham",76.650000000000006]
["2010-02-11","Gault",126.62]
["2010-01-13","Franks",107.9]
["2010-01-28","Gault",130.54]
["2010-01-25","Gault",140.71]
["2010-02-10","Sioux",108.72]
["2009-12-26","Smith",135.18]
["2009-12-14","Gault",142.55000000000001]
["2010-02-12","Smith",140.54]
["2010-01-19","Franks",75.040000000000006]
["2010-02-16","Pham",93.15]
["2010-01-07","Sioux",132.51]
["2010-01-16","Chin",85.14]
["2010-02-15","Franks",108.85]
["2009-12-13","Sioux",139.91999999999999]
["2010-01-04","Franks",104.35]
["2009-12-14","Gault",88.51]
["2010-02-01","Gault",136.76]
["2009-11-25","Pham",109.57]
["2010-02-07","Franks",125.81]
["2009-12-22","Pham",150.09]
["2009-12-07","Sioux",147.53]
["2009-12-12","Chin",102.17]
["2009-12-30","Smith",114.4]
["2009-12-27","Chin",129.65]
["2009-12-29","Chin",128.94999999999999]
["2010-01-05","Gault",121.33]
["2009-12-15","Pham",102.64]
["2009-12-01","Pham",132.12]
["2010-02-07","Franks",100.83]
["2009-11-26","Sioux",79.42]
["2010-01-04","Pham",100.09]
["2010-01-29","Franks",83.37]
["2010-01-19","Franks",89.11]
["2010-02-14","Smith",126.97]
["2009-12-03","Smith",154.31]
["2010-01-02","Sioux",76.59]
["2009-12-29","Gault",106.94]
["2009-11-26","Chin",129.86000000000001]
["2009-12-24","Pham",100.76]
["2009-12-10","Gault",124.59]
["2009-12-31","Smith",150.31]
["2009-12-16","Franks",119.78]
["2010-01-03","Pham",93.37]
["2009-12-26","Chin",87.06]
["2010-01-05","Smith",147.49]
["2009-12-19","Smith",136.94]
["2009-11-20","Gault",93.33]
["2010-01-03","Smith",128.97]
["2009-12-14","Smith",114.93]
["2010-01-01","Sioux",104.57]
["2009-11-27","Sioux",119.53]
["2010-01-01","Pham",127.99]
["2009-12-03","Smith",88.69]
["2009-11-25","Smith",115.67]
["2010-01-07","Pham",114.54]
["2010-02-02","Smith",128.15]
["2010-02-08","Gault",126.33]
["2010-01-13","Smith",112.03]
["2009-11-20","Smith",145.33000000000001]
["2009-12-23","Gault",109.7]
["2009-11-26","Sioux",139.13]
["2009-12-01","Sioux",112.5]
["2009-11-29","Pham",122.21]
["2010-01-13","Smith",135.77000000000001]
["2010-01-09","Pham",75.17]
["2010-01-30","Sioux",104.5]
["2010-02-04","Gault",86.1]
["2010-01-02","Sioux",143.85]
["2010-01-16","Gault",104.36]
["2009-12-28","Smith",135.02000000000001]
["2009-12-26","Pham",83.26]
["2009-11-28","Sioux",114.53]
["2010-02-02","Smith",117.63]
["2009-12-27","Gault",102.24]
["2010-02-01","Chin",139.21]
["2009-12-25","Smith",119.09]
["2010-01-17","Pham",134.11000000000001]
["2010-01-15","Sioux",96.17]
["2010-01-10","Smith",108.54]
["2010-01-05","Gault",78.89]
["2010-01-20","Pham",130.37]
["2009-12-08","Chin",130.5]
["2010-01-16","Franks",123.13]
["2009-12-19","Gault",131.04]
["2009-12-17","Pham",76.260000000000005]
["2010-01-19","Pham",78.459999999999994]
["2009-11-21","Gault",79.11]
["2010-02-18","Gault",75.349999999999994]
["2009-12-09","Chin",90.38]
["2010-01-04","Franks",99.94]
["2009-12-29","Pham",130.94999999999999]
["2009-12-29","Sioux",152.56]
["Total",null,{"$f":"SUBTOTAL(101,Table5[Sales])","v":123.69166666666668}]
[]
[null,null,{"$f":"SUMPRODUCT(--(YEAR(Table5[Date])=YEAR(TODAY())-1),--((Table5[SalesRep]=\"Smith\")+(Table5[SalesRep]=\"Chin\")),Table5[Sales])/SUMPRODUCT(--(YEAR(Table5[Date])=YEAR(TODAY())-1),--((Table5[SalesRep]=\"Smith\")+(Table5[SalesRep]=\"Chin\")))","v":{"$error":"#DIV/0!"}}]
[]
[]
[]
[]
[]
[{"$f":"SMALL(Table5[Sales],2)","v":75.17},{"$f":"_xlfn.AGGREGATE(15,6,Table5[Sales]/((YEAR(Table5[Date])=YEAR(TODAY())-1)*((Table5[SalesRep]=\"Smith\")+(Table5[SalesRep]=\"Chin\"))),2)","v":{"$error":"#NUM!"}}]

{"sheet":"AF(1)","index":131,"n_rows":24,"n_cols":4,"rows_kept":24,"cut":false,"hidden":false,"merged":[]}
["Criteria Area"]
[]
["Date","Product","SalesRep","Sales"]
[null,"Bellen"]
[]
[]
["Data Set"]
[]
["Date","Product","SalesRep","Sales"]
["2012-09-24","Sunset","Gault",315]
["2012-03-31","Carlota","Smith",966]
["2012-11-29","Bellen","Chin",1188]
["2011-08-30","Sunset","Gault",1239]
["2012-08-19","Bellen","Pham",682]
["2011-02-09","Sunset","Chin",504]
["2012-05-17","Quad","Sioux",1323]
["2012-07-16","Sunshine","Sioux",988]
["2011-09-21","Quad","Sioux",621]
[]
["Extract Area After running Advanced Filter"]
[]
["Date","Product","SalesRep","Sales"]
["2012-11-29","Bellen","Chin",1188]
["2012-08-19","Bellen","Pham",682]

{"sheet":"AF(2)","index":132,"n_rows":24,"n_cols":4,"rows_kept":24,"cut":false,"hidden":false,"merged":[]}
["Criteria Area"]
[]
["Date","Product","SalesRep","Sales"]
[null,"Sunset",null,">500"]
[]
[]
["Data Set"]
[]
["Date","Product","SalesRep","Sales"]
["2012-09-24","Sunset","Gault",315]
["2012-03-31","Carlota","Smith",966]
["2012-11-29","Bellen","Chin",1188]
["2011-08-30","Sunset","Gault",1239]
["2012-08-19","Bellen","Pham",682]
["2011-02-09","Sunset","Chin",504]
["2012-05-17","Quad","Sioux",1323]
["2012-07-16","Sunshine","Sioux",988]
["2011-09-21","Quad","Sioux",621]
[]
["Extract Area After running Advanced Filter"]
[]
["Date","Product","SalesRep","Sales"]
["2011-08-30","Sunset","Gault",1239]
["2011-02-09","Sunset","Chin",504]

{"sheet":"AF(3)","index":133,"n_rows":25,"n_cols":4,"rows_kept":25,"cut":false,"hidden":false,"merged":[]}
["Criteria Area"]
[]
["Date","Product","SalesRep","Sales"]
[null,"Carlota"]
[null,"Bellen"]
[]
["Data Set"]
[]
["Date","Product","SalesRep","Sales"]
["2012-09-24","Sunset","Gault",315]
["2012-03-31","Carlota","Smith",966]
["2012-11-29","Bellen","Chin",1188]
["2011-08-30","Sunset","Gault",1239]
["2012-08-19","Bellen","Pham",682]
["2011-02-09","Sunset","Chin",504]
["2012-05-17","Quad","Sioux",1323]
["2012-07-16","Sunshine","Sioux",988]
["2011-09-21","Quad","Sioux",621]
[]
["Extract Area After running Advanced Filter"]
[]
["Date","Product","SalesRep","Sales"]
["2012-03-31","Carlota","Smith",966]
["2012-11-29","Bellen","Chin",1188]
["2012-08-19","Bellen","Pham",682]

{"sheet":"AF(4)","index":134,"n_rows":24,"n_cols":4,"rows_kept":24,"cut":false,"hidden":false,"merged":[]}
["Criteria Area"]
[]
["Date","Product","SalesRep","Sales"]
[null,"Quad",null,">1000"]
[null,"Bellen",null,">1000"]
[]
["Data Set"]
[]
["Date","Product","SalesRep","Sales"]
["2012-09-24","Sunset","Gault",315]
["2012-03-31","Carlota","Smith",966]
["2012-11-29","Bellen","Chin",1188]
["2011-08-30","Sunset","Gault",1239]
["2012-08-19","Bellen","Pham",682]
["2011-02-09","Sunset","Chin",504]
["2012-05-17","Quad","Sioux",1323]
["2012-07-16","Sunshine","Sioux",988]
["2011-09-21","Quad","Sioux",621]
[]
["Extract Area After running Advanced Filter"]
[]
["Date","Product","SalesRep","Sales"]
["2012-11-29","Bellen","Chin",1188]
["2012-05-17","Quad","Sioux",1323]

{"sheet":"AF(5)","index":135,"n_rows":25,"n_cols":5,"rows_kept":25,"cut":false,"hidden":false,"merged":[]}
["Criteria Area"]
[]
["Date","Product","SalesRep","Sales","Sales"]
[null,null,null,">=900","<1200"]
[]
[]
["Data Set"]
[]
["Date","Product","SalesRep","Sales"]
["2012-09-24","Sunset","Gault",315]
["2012-03-31","Carlota","Smith",966]
["2012-11-29","Bellen","Chin",1188]
["2011-08-30","Sunset","Gault",1239]
["2012-08-19","Bellen","Pham",682]
["2011-02-09","Sunset","Chin",504]
["2012-05-17","Quad","Sioux",1323]
["2012-07-16","Sunshine","Sioux",988]
["2011-09-21","Quad","Sioux",621]
[]
["Extract Area After running Advanced Filter"]
[]
["Date","Product","SalesRep","Sales"]
["2012-03-31","Carlota","Smith",966]
["2012-11-29","Bellen","Chin",1188]
["2012-07-16","Sunshine","Sioux",988]

{"sheet":"AF(6)","index":136,"n_rows":26,"n_cols":5,"rows_kept":26,"cut":false,"hidden":false,"merged":[]}
["Criteria Area"]
[]
["Date","Date","Product","SalesRep","Sales"]
[">=2/1/2011","<=5/31/2012"]
[]
["Data Set"]
[]
["Date","Product","SalesRep","Sales"]
["2012-09-24","Sunset","Gault",315]
["2011-03-31","Carlota","Smith",966]
["2012-11-29","Bellen","Chin",1188]
["2011-08-30","Sunset","Gault",1239]
["2012-08-19","Bellen","Pham",682]
["2011-02-09","Sunset","Chin",504]
["2011-05-17","Quad","Sioux",1323]
["2012-07-16","Sunshine","Sioux",988]
["2011-09-21","Quad","Sioux",621]
[]
["Extract Area Before running Advanced Filter"]
[]
["Date","Product","SalesRep","Sales"]
["2011-03-31","Carlota","Smith",966]
["2011-08-30","Sunset","Gault",1239]
["2011-02-09","Sunset","Chin",504]
["2011-05-17","Quad","Sioux",1323]
["2011-09-21","Quad","Sioux",621]

{"sheet":"AF(7)","index":137,"n_rows":12,"n_cols":4,"rows_kept":12,"cut":false,"hidden":false,"merged":[]}
["Data Set"]
[]
["Date","Product","SalesRep","Sales"]
["2012-09-24","Sunset","Gault",315]
["2011-03-31","Carlota","Smith",966]
["2012-11-29","Bellen","Chin",1188]
["2011-08-30","Sunset","Gault",1239]
["2012-08-19","Bellen","Pham",682]
["2011-02-09","Sunset","Chin",504]
["2011-05-17","Quad","Sioux",1323]
["2012-07-16","Sunshine","Sioux",988]
["2011-09-21","Quad","Sioux",621]

{"sheet":"Extract","index":138,"n_rows":10,"n_cols":4,"rows_kept":10,"cut":false,"hidden":false,"merged":[]}
["Criteria Area"]
[]
["Date","Product","SalesRep","Sales"]
[null,"Quad"]
[]
["Extract Area Before running Advanced Filter"]
[]
["Date","Product","SalesRep","Sales"]
["2011-05-17","Quad","Sioux",1323]
["2011-09-21","Quad","Sioux",621]

{"sheet":"AF(8)","index":139,"n_rows":106,"n_cols":20,"rows_kept":106,"cut":false,"hidden":false,"merged":[]}
["Date","Customer","Sales",null,"Customer",{"$f":"\"Count Sales > \"&DOLLAR(H5,0)","v":"Count Sales > $1,000"},null,null,null,null,null,null,null,null,null,null,null,null,null,{"$f":"VLOOKUP(INT(RAND()*12+1),{1,\"Shakia Warning Inc.\";2,\"Rod Kloer Firm\";3,\"Lashon Yerhot Manufacturers\";4,\"Rob Swearegene Company\";5,\"Rob Schiesher LLP\";6,\"Cliff Stalworth Firm\";7,\"Kit Krumme Inc.\";8,\"Carey Mews Manufacturers\";9,\"Hal Hinchliff Firm\";10,\"Jackson Kings LLP\";11,\"Marcel Mittelsteadt Firm\";12,\"Raphael Huh Inc.\"},2)","v":"Cliff Stalworth Firm"}]
["2011-01-01","Rod Kloer Firm",621,null,"Rod Kloer Firm",{"$f":"COUNTIFS($B$2:$B$106,E2,$C$2:$C$106,\">\"&H$5)","v":5}]
["2011-01-09","Hal Hinchliff Firm",1197,null,"Hal Hinchliff Firm",{"$f":"COUNTIFS($B$2:$B$106,E3,$C$2:$C$106,\">\"&H$5)","v":3}]
["2011-01-03","Hal Hinchliff Firm",1058,null,"Shakia Warning Inc.",8,null,"Hurdle"]
["2011-01-11","Shakia Warning Inc.",1144,null,"Cliff Stalworth Firm",3,null,1000]
["2011-01-15","Cliff Stalworth Firm",1449,null,"Jackson Kings LLP",3]
["2011-01-03","Jackson Kings LLP",1092,null,"Rob Swearegene Company",5]
["2011-01-15","Jackson Kings LLP",736,null,"Marcel Mittelsteadt Firm",4]
["2011-01-17","Rob Swearegene Company",567,null,"Rob Schiesher LLP",6]
["2011-01-03","Marcel Mittelsteadt Firm",638,null,"Kit Krumme Inc.",4]
["2011-01-18","Rob Schiesher LLP",352,null,"Raphael Huh Inc.",5]
["2011-01-06","Jackson Kings LLP",456,null,"Lashon Yerhot Manufacturers",1]
["2011-01-01","Kit Krumme Inc.",1178,null,"Carey Mews Manufacturers",0]
["2011-01-11","Rod Kloer Firm",462]
["2011-01-16","Shakia Warning Inc.",924]
["2011-01-13","Kit Krumme Inc.",1058]
["2011-01-29","Shakia Warning Inc.",1215]
["2011-01-20","Rod Kloer Firm",552]
["2011-01-14","Jackson Kings LLP",1296]
["2011-01-15","Raphael Huh Inc.",299]
["2011-01-27","Raphael Huh Inc.",1242]
["2011-01-12","Hal Hinchliff Firm",114]
["2011-01-10","Lashon Yerhot Manufacturers",575]
["2011-01-26","Rob Schiesher LLP",1008]
["2011-01-16","Rob Schiesher LLP",897]
["2011-01-08","Rob Swearegene Company",1593]
["2011-01-03","Kit Krumme Inc.",462]
["2011-01-17","Kit Krumme Inc.",682]
["2011-01-29","Shakia Warning Inc.",1050]
["2011-01-22","Carey Mews Manufacturers",966]
["2011-01-03","Rob Schiesher LLP",1178]
["2011-01-18","Rod Kloer Firm",1166]
["2011-01-23","Rob Swearegene Company",1364]
["2011-01-08","Rob Schiesher LLP",1012]
["2011-01-01","Hal Hinchliff Firm",230]
["2011-01-20","Carey Mews Manufacturers",969]
["2011-01-12","Lashon Yerhot Manufacturers",315]
["2011-01-27","Cliff Stalworth Firm",1380]
["2011-01-22","Hal Hinchliff Firm",651]
["2011-01-17","Rod Kloer Firm",171]
["2011-01-05","Shakia Warning Inc.",1242]
["2011-01-30","Rod Kloer Firm",819]
["2011-01-21","Carey Mews Manufacturers",253]
["2011-01-03","Raphael Huh Inc.",1122]
["2011-01-07","Cliff Stalworth Firm",1188]
["2011-01-15","Lashon Yerhot Manufacturers",247]
["2011-01-12","Rob Schiesher LLP",1012]
["2011-01-29","Hal Hinchliff Firm",399]
["2011-01-04","Rob Swearegene Company",437]
["2011-01-07","Jackson Kings LLP",1458]
["2011-01-24","Kit Krumme Inc.",243]
["2011-01-07","Jackson Kings LLP",609]
["2011-01-16","Kit Krumme Inc.",1485]
["2011-01-25","Cliff Stalworth Firm",184]
["2011-01-23","Shakia Warning Inc.",1323]
["2011-01-16","Rod Kloer Firm",1026]
["2011-01-13","Cliff Stalworth Firm",630]
["2011-01-04","Rob Schiesher LLP",1113]
["2011-01-08","Lashon Yerhot Manufacturers",378]
["2011-01-12","Kit Krumme Inc.",589]
["2011-01-11","Raphael Huh Inc.",608]
["2011-01-23","Hal Hinchliff Firm",988]
["2011-01-07","Shakia Warning Inc.",513]
["2011-01-24","Kit Krumme Inc.",969]
["2011-01-19","Raphael Huh Inc.",713]
["2011-01-13","Cliff Stalworth Firm",551]
["2011-01-09","Shakia Warning Inc.",1134]
["2011-01-28","Lashon Yerhot Manufacturers",675]
["2011-01-15","Rob Swearegene Company",1104]
["2011-01-03","Jackson Kings LLP",247]
["2011-01-08","Raphael Huh Inc.",1134]
["2011-01-27","Rob Schiesher LLP",594]
["2011-01-28","Rob Swearegene Company",1029]
["2011-01-11","Kit Krumme Inc.",798]
["2011-01-09","Raphael Huh Inc.",588]
["2011-01-03","Rod Kloer Firm",1196]
["2011-01-08","Shakia Warning Inc.",638]
["2011-01-30","Shakia Warning Inc.",462]
["2011-01-24","Kit Krumme Inc.",627]
["2011-01-12","Cliff Stalworth Firm",285]
["2011-01-25","Hal Hinchliff Firm",819]
["2011-01-29","Rod Kloer Firm",1260]
["2011-01-22","Shakia Warning Inc.",1380]
["2011-01-14","Marcel Mittelsteadt Firm",220]
["2011-01-07","Hal Hinchliff Firm",1127]
["2011-01-27","Rob Schiesher LLP",330]
["2011-01-04","Rob Swearegene Company",440]
["2011-01-27","Raphael Huh Inc.",1426]
["2011-01-09","Rod Kloer Firm",1178]
["2011-01-14","Rob Swearegene Company",1155]
["2011-01-19","Kit Krumme Inc.",1408]
["2011-01-16","Shakia Warning Inc.",1472]
["2011-01-24","Marcel Mittelsteadt Firm",1755]
["2011-01-12","Marcel Mittelsteadt Firm",897]
["2011-01-21","Lashon Yerhot Manufacturers",1235]
["2011-01-05","Raphael Huh Inc.",1102]
["2011-01-03","Rob Schiesher LLP",1121]
["2011-01-22","Marcel Mittelsteadt Firm",1298]
["2011-01-03","Marcel Mittelsteadt Firm",253]
["2011-01-23","Lashon Yerhot Manufacturers",475]
["2011-01-21","Lashon Yerhot Manufacturers",528]
["2011-01-04","Marcel Mittelsteadt Firm",1210]
["2011-01-26","Shakia Warning Inc.",266]
["2011-01-27","Cliff Stalworth Firm",315]
["2011-01-22","Lashon Yerhot Manufacturers",506]
["2011-01-25","Marcel Mittelsteadt Firm",1232]

{"sheet":"AF(9)","index":140,"n_rows":24,"n_cols":7,"rows_kept":24,"cut":false,"hidden":false,"merged":[]}
["Criteria Area"]
[]
[null,null,"Increment For Record extraction"]
[{"$f":"MOD(ROWS(A$9:A9),C$4)=0","v":false},null,3]
[]
["Data Set"]
[]
["Date","Product","SalesRep","Sales",null,null,"TF"]
["2012-09-24","Sunset","Gault",315,null,null,{"$f":"MOD(ROWS(A$9:A9),C$4)=0","v":false}]
["2011-03-31","Carlota","Smith",966,null,null,{"$f":"MOD(ROWS(A$9:A10),C$4)=0","v":false}]
["2012-11-29","Bellen","Chin",1188,null,null,{"$f":"MOD(ROWS(A$9:A11),C$4)=0","v":true}]
["2011-08-30","Sunset","Gault",1239,null,null,{"$f":"MOD(ROWS(A$9:A12),C$4)=0","v":false}]
["2012-08-19","Bellen","Pham",682,null,null,{"$f":"MOD(ROWS(A$9:A13),C$4)=0","v":false}]
["2011-02-09","Sunset","Chin",504,null,null,{"$f":"MOD(ROWS(A$9:A14),C$4)=0","v":true}]
["2011-05-17","Quad","Sioux",1323,null,null,{"$f":"MOD(ROWS(A$9:A15),C$4)=0","v":false}]
["2012-07-16","Sunshine","Sioux",988,null,null,{"$f":"MOD(ROWS(A$9:A16),C$4)=0","v":false}]
["2011-09-21","Quad","Sioux",621,null,null,{"$f":"MOD(ROWS(A$9:A17),C$4)=0","v":true}]
[]
["Extract Area Before running Advanced Filter"]
[]
["Date","Product","SalesRep","Sales"]
["2012-11-29","Bellen","Chin",1188]
["2011-02-09","Sunset","Chin",504]
["2011-09-21","Quad","Sioux",621]

{"sheet":"TTC(1)","index":141,"n_rows":25,"n_cols":3,"rows_kept":25,"cut":false,"hidden":false,"merged":[]}
["1.   Hal Estacion"]
["2.   Ali Botto"]
["3.   Lashon Charbonnet"]
["4.   Darius Buehl"]
["5.   Brain Kepp"]
["6.   Frida Kulish"]
["7.   Jayna Dearmitt"]
["8.   Hal Duch"]
["9.   Quinton Raj"]
["10.   Raphael Varriale"]
[]
[]
[]
[]
[null,"Formula For First","Formula for Last"]
["Hal Estacion",{"$f":"LEFT(A16,SEARCH(\" \",A16)-1)","v":"Hal"},{"$f":"REPLACE(A16,1,SEARCH(\" \",A16),\"\")","v":"Estacion"}]
["Your Name",{"$f":"LEFT(A17,SEARCH(\" \",A17)-1)","v":"Your"},{"$f":"REPLACE(A17,1,SEARCH(\" \",A17),\"\")","v":"Name"}]
["Lashon Charbonnet","Lashon","Charbonnet"]
["Darius Buehl","Darius","Buehl"]
["Brain Kepp","Brain","Kepp"]
["Frida Kulish","Frida","Kulish"]
["Jayna Dearmitt","Jayna","Dearmitt"]
["Hal Duch","Hal","Duch"]
["Quinton Raj","Quinton","Raj"]
["Raphael Varriale","Raphael","Varriale"]

{"sheet":"TTC2","index":142,"n_rows":11,"n_cols":6,"rows_kept":11,"cut":false,"hidden":false,"merged":[]}
["Addresses",null,"Address","City","State","Zip"]
["313 173rd Blvd, Kent, WA 981215",null,"313 173rd Blvd","Kent","WA",981215]
["316 66th Blvd, Kent, WA 981244",null,"316 66th Blvd","Kent","WA",981244]
["4358 23rd St, Kent, WA 981225",null,"4358 23rd St","Kent","WA",981225]
["965 151st St, Kent, WA 981162",null,"965 151st St","Kent","WA",981162]
["7900 173rd Lane, Kent, WA 981266",null,"7900 173rd Lane","Kent","WA",981266]
["4047 15th Ave, Kent, WA 981228",null,"4047 15th Ave","Kent","WA",981228]
["4907 13th Ave, Kent, WA 981232",null,"4907 13th Ave","Kent","WA",981232]
["3789 4th Blvd, Seattle, WA 981152",null,"3789 4th Blvd","Seattle","WA",981152]
["2977 66th Lane, Seattle, WA 981171",null,"2977 66th Lane","Seattle","WA",981171]
["3392 23rd St, Seattle, WA 981131",null,"3392 23rd St","Seattle","WA",981131]

{"sheet":"ID(1)","index":143,"n_rows":11,"n_cols":13,"rows_kept":11,"cut":false,"hidden":false,"merged":[]}
["ProductID","Product","Description","Supplier","Suggested Price",null,null,null,"ProductID","Product","Description","Supplier","Suggested Price"]
["Be-BF-001","Bellen","20 meter Juggler","Gel Booms",24,null,null,null,"Be-BF-001","Bellen","20 meter Juggler","Gel Booms",24]
["Ca-BF-002","Carlota","20 meter Trick Catch","Gel Booms",25,null,null,null,"Ca-BF-002","Carlota","20 meter Trick Catch","Gel Booms",25]
["Su-BF-003","Sunshine","30 meter Accuracy","Gel Booms",27,null,null,null,"Su-BF-003","Sunshine","30 meter Accuracy","Gel Booms",27]
["Ma-BF-004","Majestic Beaut","40 Meter Aussie Round","Gel Booms",32,null,null,null,"Ma-BF-004","Majestic Beaut","40 Meter Aussie Round","Gel Booms",32]
["Ya-BF-005","Yanaki","25 meter Beginner","Colorado",22,null,null,null,"Ya-BF-005","Yanaki","25 meter Beginner","Colorado",22]
["As-BF-006","Aspen","15 meter Reversable","Colorado",29,null,null,null,"As-BF-006","Aspen","15 meter Reversable","Colorado",29]
["Ea-BF-007","Eagle","50 Meter Aussie Round","Roger Perry",45,null,null,null,"Ea-BF-007","Eagle","50 Meter Aussie Round","Roger Perry",45]
["Vr-BF-008","Vrang","Traditional","Channel Craft",1,null,null,null,"Vr-BF-008","Vrang","Traditional","Channel Craft",15]
["dsadsa","dsadsa","dsadsa","dsadsa"]
["4545","4545","4545","4545",4545]

{"sheet":"ID(2)","index":144,"n_rows":10,"n_cols":5,"rows_kept":10,"cut":false,"hidden":false,"merged":[]}
["ProductID","Product","Description","Supplier","Suggested Price"]
["Be-BF-001","Bellen","20 meter Juggler","Gel Booms",24]
["Ca-BF-002","Carlota","20 meter Trick Catch","Gel Booms",25]
["Su-BF-003","Sunshine","30 meter Accuracy","Gel Booms",27]
["Ma-BF-004","Majestic Beaut","40 Meter Aussie Round","Gel Booms",32]
["Ya-BF-005","Yanaki","25 meter Beginner","Colorado",22]
["As-BF-006","Aspen","15 meter Reversable","Colorado",29]
["Ea-BF-007","Eagle","50 Meter Aussie Round","Roger Perry",45]
["Vr-BF-008","Vrang","Traditional","Channel Craft",15]
["Ti-BF-009","TriFly","1 meter","Turning Point",5]

{"sheet":"ID(3)","index":145,"n_rows":26,"n_cols":16,"rows_kept":26,"cut":false,"hidden":false,"merged":[[25,0,25,15],[26,0,26,15],[11,0,11,15],[12,0,12,15],[22,2,22,4],[22,6,22,8],[23,2,23,4],[23,6,23,8]]}
["Stock Gain and Loss Table"]
["Stocks","Price Paid 6/1/2007","Quantity","Historic Value","Stock Value Now","Current Value","Gain Loss"]
["GOOG",500.39699999999999,100,{"$f":"C3*B3","v":50039.7},{"$f":"D15","v":610.04},{"$f":"E3*C3","v":61004},{"$f":"F3/D3-1","v":0.21911202505210881}]
["MSFT",30.59,100,3059,26.55,2655,-0.1320693036940177]
["YHOO",28.78,100,2878,16.5,1650,-0.42668519805420435]
["WFMI",41.67,100,4167,57.88,5788,0.38900887928965688]
["C",54.51,100,5451,4.7,470,-0.91377728857090446]
["BAC",50.78,100,5078,14.2,1420,-0.72036234738085858]
["DELL",27.3,100,2730,15.13,1513,-0.44578754578754576]
[]
[]
["Stock Quotes Provided by MSN Money"]
["Click here to visit MSN Money"]
[null,null,null,"Last","Previous Close","High","Low","Volume","Change","% Change","52 Wk High","52 Wk Low","Market Cap","EPS","P/E Ratio","# Shares Out"]
["Google Inc ","Chart","News",610.04,608.82000000000005,614.72,609.5,1932353,1.22,2E-3,642.96,433.63,196141334819,26.3,23.1,321522100]
["Microsoft Corp ","Chart","News",26.55,26.77,26.95,26.5,52977103,-0.22,-8.2000000000000007E-3,31.58,22.73,223083235689,2.36,11.3,8402382000]
["Yahoo! Inc ","Chart","News",16.5,16.37,16.77,16.38,16402362,0.13,7.9000000000000008E-3,19.12,12.94,21507750000,0.9,18.2,1303500000]
["Whole Foods Market Inc ","Chart","News",57.88,57.41,58.27,57.45,1414662,0.47,8.2000000000000007E-3,60.94,33.96,10038174889,1.62,35.6,173430800]
["Citigroup Inc ","Chart","News",4.7,4.6900000000000004,4.7300000000000004,4.66,407451587,0.01,2.0999999999999999E-3,5.15,3.34,136574286458,0.35,13.2,29058360000]
["Bank of America Corp ","Chart","News",14.2,13.97,14.32,14.12,126652761,0.23,1.6500000000000001E-2,19.86,10.91,143209128076,-0.33,0,10085150000]
["Dell Inc ","Chart","News",15.13,15.05,15.28,14.83,20253117,0.08,5.3E-3,17.52,11.34,29205303051,1.35,11.1,1930291000]
[]
["Symbol Lookup",null,"MSN Money Home",null,null,null,"Microsoft Office Tools on the Web"]
["Find stocks, mutual funds, options, indices, and currencies.",null,"Discover MSN Money's tools, columns, and more!",null,null,null,"Get the latest from Microsoft Office"]
[]
["Terms of Use. © 2011 Microsoft Corporation and/or its suppliers. All rights reserved."]

{"sheet":"Ct(1)","index":146,"n_rows":144,"n_cols":14,"rows_kept":144,"cut":false,"hidden":false,"merged":[]}
[]
["Into The Wind Sales"]
[null,"Jan","Feb","Mar","Total",null,null,null,null,"Jan","Feb","Mar",null,{"$f":"CHAR(17)&\" These are called 'Categories' and will appear in the horizontal axis.\"","v":"\u0011 These are called 'Categories' and will appear in the horizontal axis."}]
["Toys",500,2150,8893,{"$f":"SUM(B4:D4)","v":11543},null,null,null,"Toys",500,2150,8893,null,{"$f":"CHAR(17)&\" The numbers \"&FIXED(J4,0)&\", \"&FIXED(K4,0)&\", \"&FIXED(L4,0)&\" are called the '\"&I4&\" Series'.\"","v":"\u0011 The numbers 500, 2,150, 8,893 are called the 'Toys Series'."}]
["Boomerangs",4000,6933,9545,{"$f":"SUM(B5:D5)","v":20478},null,null,null,"Boomerangs",4000,6933,9545,null,{"$f":"CHAR(17)&\" The numbers \"&FIXED(J5,0)&\", \"&FIXED(K5,0)&\", \"&FIXED(L5,0)&\" are called the '\"&I5&\" Series'.\"","v":"\u0011 The numbers 4,000, 6,933, 9,545 are called the 'Boomerangs Series'."}]
["Kites",9721,5367,15064,{"$f":"SUM(B6:D6)","v":30152},null,null,null,"Kites",9721,5367,15064,null,"\u0011 The numbers 9,721, 5,367, 15,064 are called the 'Kites Series'."]
["Total",{"$f":"SUM(B4:B6)","v":14221},{"$f":"SUM(C4:C6)","v":14450},{"$f":"SUM(D4:D6)","v":33502},{"$f":"SUM(B7:D7)","v":62173}]
[null,null,null,null,null,null,null,null,"These labels will appear in the color coded 'Legend'"]
[]
[]
[]
[]
[]
[]
[]
[]
[]
[]
[]
[]
[]
[]
[]
[]
[]
[]
[]
[]
[]
[]
[]
[]
[]
[]
[]
[]
[]
[]
[]
[]
[]
[]
[]
[]
[]
[]
[]
[]
[]
[]
[]
[]
[]
[]
[]
[]
[]
[]
[]
[]
[]
[]
[]
[]
[]
[]
[]
[]
[]
[]
[]
[]
[]
[]
[]
[]
[]
[]
[]
[]
[]
[]
[]
[]
[]
[]
[]
[]
[]
[]
[]
[]
[]
[]
[]
[]
[]
[]
[]
[]
[]
[]
[]
[]
[]
[]
["Scores"]
[69]
[75,null,"Row Labels","Count of Scores"]
[56,null,"0-9",1]
[26,null,"20-29",1]
[85,null,"30-39",4]
[67,null,"40-49",1]
[67,null,"50-59",4]
[70,null,"60-69",10]
[30,null,"70-79",7]
[81,null,"80-89",7]
[74,null,"90-100",2]
[98,null,"Grand Total",37]
[45,null,null,null,null,null,"Categories - Each Integer Category Has A Range Of 10 And Each Has No Gap Because There Are No Possibilities Between Columns"]
[79]
[72]
[65]
[68]
[52]
[82]
[53]
[64]
[81]
[88]
[92]
[64]
[82]
[34]
[52]
[74]
[73]
[66]
[37]
[8]
[84]
[68]
[62]
[38]

{"sheet":"Ct(3)","index":147,"n_rows":18,"n_cols":5,"rows_kept":18,"cut":false,"hidden":false,"merged":[]}
["Units","Sales","Total Costs","Fixed Cost","Net Income"]
[{"$f":"B17","v":0},{"$f":"A2*B$13","v":0},{"$f":"B2*B$15+D2","v":171562.49999999997},{"$f":"B$16","v":171562.49999999997},{"$f":"B2-SUM(C2:D2)","v":-343124.99999999994}]
[{"$f":"A2+B$18","v":3500},87500,{"$f":"B3*B$15+D3","v":219687.49999999997},171562.49999999997,-303749.99999999994]
[{"$f":"A3+B$18","v":7000},175000,267812.5,171562.49999999997,-264375]
[10500,262500,315937.5,171562.49999999997,-225000]
[14000,350000,364062.5,171562.49999999997,-185625]
[17500,437500,412187.5,171562.49999999997,-146250]
[21000,525000,460312.5,171562.49999999997,-106875]
[24500,612500,508437.5,171562.49999999997,-67500]
[28000,700000,556562.5,171562.49999999997,-28125]
[]
["Assumptions Tables"]
["Sell Price of Boomerang",25]
["Units Sold",15250]
["Manufacturing Cost of Boomerang as a % of Sell Price",0.55000000000000004]
["Total Fixed Cost for Rest Of Operations",{"$f":"(B13*B14)*(1-B15)","v":171562.49999999997}]
["Table Start Unit Number",0]
["Table Unit Increment",3500]

{"sheet":"C(1)","index":148,"n_rows":6,"n_cols":2,"rows_kept":6,"cut":false,"hidden":false,"merged":[]}
["Funding for City","Amount"]
["Sales Tax",133947]
["Income Tax",179193]
["Property Tax",102512.5]
["Other",98847.5]
["Total",{"$f":"SUM(B2:B5)","v":514500}]

{"sheet":"C(2)","index":149,"n_rows":6,"n_cols":5,"rows_kept":6,"cut":false,"hidden":false,"merged":[]}
["Into The Wind Sales"]
[null,"Jan","Feb","Mar","Total"]
["Toys",500,2150,8893,{"$f":"SUM(B3:D3)","v":11543}]
["Boomerangs",4000,6933,9545,{"$f":"SUM(B4:D4)","v":20478}]
["Kites",9721,5367,15064,{"$f":"SUM(B5:D5)","v":30152}]
["Total",{"$f":"SUM(B3:B5)","v":14221},{"$f":"SUM(C3:C5)","v":14450},{"$f":"SUM(D3:D5)","v":33502},{"$f":"SUM(B6:D6)","v":62173}]

{"sheet":"C(3)","index":150,"n_rows":97,"n_cols":19,"rows_kept":97,"cut":false,"hidden":false,"merged":[]}
[null,null,null,null,null,"Histogram For Class Scores",null,null,null,null,null,null,null,null,null,null,null,"Assumptions"]
["Test Scores",null,"Lower","Upper",null,"Grouped Number Categories","How Many Students Got A Score In Each Category",null,null,null,null,null,null,null,null,null,null,"Start","Range"]
[81.75,null,{"$f":"R3","v":0},{"$f":"C3+$S$3","v":10},null,{"$f":"IF(C3=0,\"00\",C3)&\" up to \"&D3","v":"00 up to 10"},{"$f":"COUNTIFS($A$3:$A$97,\">=\"&C3,$A$3:$A$97,\"<\"&D3)","v":5},null,null,null,null,null,null,null,null,null,null,0,10]
[33,null,{"$f":"D3","v":10},20,null,{"$f":"IF(C4=0,\"00\",C4)&\" up to \"&D4","v":"10 up to 20"},{"$f":"COUNTIFS($A$3:$A$97,\">=\"&C4,$A$3:$A$97,\"<\"&D4)","v":1}]
[76,null,{"$f":"D4","v":20},30,null,"20 up to 30",0]
[38.5,null,30,40,null,"30 up to 40",7]
[98,null,40,50,null,"40 up to 50",8]
[84.5,null,50,60,null,"50 up to 60",12]
[72,null,60,70,null,"60 up to 70",20]
[89.75,null,70,80,null,"70 up to 80",15]
[99,null,80,90,null,"80 up to 90",17]
[78,null,90,100,null,"90 up to 100",10]
[47.75]
[58,null,null,null,null,"Min",{"$f":"MIN($A$3:$A$97)","v":1.25}]
[53.75,null,null,null,null,"Max",{"$f":"MAX($A$3:$A$97)","v":99.5}]
[55]
[4.5]
[75]
[73.75]
[80.75]
[67]
[36.25]
[38]
[42]
[68.25]
[73.5]
[68]
[84.25]
[56]
[61.75]
[36.5]
[63.5]
[78]
[81]
[67.25]
[93.25]
[62.5]
[41.75]
[80.25]
[47]
[91.5]
[52.75,null,"check","check"]
[2,null,"Frequency","Frequency"]
[88.25,null,{"$f":"COUNTIF($A$3:$A$97,\"<\"&D3)-COUNTIF($A$3:$A$97,\"<\"&C3)","v":5},{"$f":"SUMPRODUCT(--($A$3:$A$97>=C3),--($A$3:$A$97<D3))","v":5}]
[56,null,1,1]
[65,null,0,0]
[60.75,null,7,7]
[95.5,null,8,8]
[1.25,null,12,12]
[67.75,null,20,20]
[59,null,15,15]
[33.25,null,17,17]
[75,null,10,10]
[96.5]
[93.25]
[64.25]
[40.25]
[61]
[99.5]
[80.75]
[62.75]
[83.5]
[98.25]
[32]
[73]
[9.75]
[76]
[76]
[69]
[68.5]
[68]
[89.5]
[60.5]
[71]
[72]
[57.75]
[86.25]
[59]
[41.5]
[84.75]
[58]
[66.5]
[47.25]
[65.75]
[82.25]
[19.5]
[60.25]
[73]
[96.5]
[85]
[86.25]
[43]
[52.5]
[86.75]
[54]
[2]
[73.25]

{"sheet":"C(4)","index":151,"n_rows":6,"n_cols":5,"rows_kept":6,"cut":false,"hidden":false,"merged":[]}
["Into The Wind Sales"]
[null,"Jan","Feb","Mar","Total"]
["Toys",500,2150,8893,{"$f":"SUM(B3:D3)","v":11543}]
["Boomerangs",4000,6933,9545,{"$f":"SUM(B4:D4)","v":20478}]
["Kites",9721,5367,15064,{"$f":"SUM(B5:D5)","v":30152}]
["Total",{"$f":"SUM(B3:B5)","v":14221},{"$f":"SUM(C3:C5)","v":14450},{"$f":"SUM(D3:D5)","v":33502},{"$f":"SUM(B6:D6)","v":62173}]

{"sheet":"C(5)","index":152,"n_rows":5,"n_cols":9,"rows_kept":5,"cut":false,"hidden":false,"merged":[]}
[{"$f":"\"Into The Wind Unit Sales \"&B2&\" to \"&I2","v":"Into The Wind Unit Sales 2005 to 2012"}]
[null,2005,2006,2007,2008,2009,2010,2011,2012]
["Toys",5645,4382,6200,2155,1902,3544,6874,6710]
["Boomerangs",6000,6626,5487,5011,4480,6511,8004,7851]
["Kites",23438,20393,24863,9753,10547,9510,12548,21547]

{"sheet":"C(6)","index":153,"n_rows":40,"n_cols":11,"rows_kept":40,"cut":false,"hidden":false,"merged":[]}
["Do Hours Studied Predict Final Score On Test? Is there a relationship?",null,null,null,null,null,null,"y intercept","slope","correlation Coefficient","Coefficient of Determination"]
["Hours Studied - X","Student Scores On Final - Y",null,null,null,null,null,"Where line crosses y-axis","For 1 unit out x-axis, how far up the y-axis do you go?","Strength and direction of line (not causation)","The amount of influence x has on y (not causation)"]
[5,88,null,null,null,null,null,"b","m","r","r^2"]
[4,82,null,null,null,null,null,{"$f":"INTERCEPT($B$3:$B$40,$A$3:$A$40)","v":48.451817860924805},{"$f":"SLOPE($B$3:$B$40,$A$3:$A$40)","v":4.8348040945993658},{"$f":"PEARSON($A$3:$A$40,$B$3:$B$40)","v":0.7815613775517013},{"$f":"RSQ($B$3:$B$40,$A$3:$A$40)","v":0.61083818688051295}]
[2,61]
[4,78]
[8,81]
[1,17]
[11,89]
[11,99]
[2,46]
[7,89]
[2,54]
[5,83]
[7,84]
[3,59]
[6,91]
[5,78]
[10,100]
[6,79]
[4,75]
[6,86]
[7,85]
[10,96]
[9,94]
[4,55]
[14,97]
[3,44]
[4,79]
[6,91]
[7,93]
[3,67]
[5,93]
[10,95]
[2,41]
[3,68]
[12,93]
[4,47]
[5,75]
[8,97]

{"sheet":"C(7)","index":154,"n_rows":18,"n_cols":5,"rows_kept":18,"cut":false,"hidden":false,"merged":[]}
["Units","Sales","Total Costs","Fixed Cost","Net Income"]
[{"$f":"B17","v":0},{"$f":"A2*B$13","v":0},{"$f":"B2*B$15+D2","v":171562.49999999997},{"$f":"B$16","v":171562.49999999997},{"$f":"B2-C2","v":-171562.49999999997}]
[{"$f":"A2+B$18","v":3500},87500,219687.49999999997,171562.49999999997,-132187.49999999997]
[{"$f":"A3+B$18","v":7000},175000,267812.5,171562.49999999997,-92812.5]
[10500,262500,315937.5,171562.49999999997,-53437.5]
[14000,350000,364062.5,171562.49999999997,-14062.5]
[17500,437500,412187.5,171562.49999999997,25312.5]
[21000,525000,460312.5,171562.49999999997,64687.5]
[24500,612500,508437.5,171562.49999999997,104062.5]
[28000,700000,556562.5,171562.49999999997,143437.5]
[]
["Assumptions Tables"]
["Sell Price of Boomerang",25]
["Units Sold",15250]
["Manufacturing Cost of Boomerang as a % of Sell Price",0.55000000000000004]
["Total Fixed Cost for Rest Of Operations",{"$f":"(B13*B14)*(1-B15)","v":171562.49999999997}]
["Table Start Unit Number",0]
["Table Unit Increment",3500]

{"sheet":"C(8)","index":155,"n_rows":7,"n_cols":3,"rows_kept":7,"cut":false,"hidden":false,"merged":[]}
["Month","Sales","Expenses"]
["Jan",100,75]
["Feb",150,105]
["Mar",210,150]
["Apr",190,140]
["May",150,110]
["Jun",230,180]

{"sheet":"C(9)","index":156,"n_rows":15,"n_cols":7,"rows_kept":15,"cut":false,"hidden":false,"merged":[]}
[]
[null,"Bellen","Carlota","Sunshine","Aspen","Sunset","Quad"]
["Day 1",141,179,188,196,200,174]
["Day 2",174,155,129,123,129,189]
["Day 3",177,163,160,136,178,190]
["Day 4",168,182,121,175,171,168]
["Day 5",121,178,197,175,194,144]
[]
[]
[null,"Bellen","Carlota","Sunshine","Aspen","Sunset","Quad"]
["Day 1",141,179,188,196,200,174]
["Day 2",174,155,129,123,129,189]
["Day 3",177,163,160,136,178,190]
["Day 4",168,182,121,175,171,168]
["Day 5",121,178,197,175,194,144]

{"sheet":"CF(1)","index":157,"n_rows":13,"n_cols":15,"rows_kept":13,"cut":false,"hidden":false,"merged":[]}
["Hilights Duplicates",null,"Above Average",null,"Top 10%",null,null,"Hilights Duplicates",null,null,"Above Average",null,null,"Top 20%"]
["Customer",null,"Sales",null,"Sales",null,null,"Customer",null,null,"Sales",null,null,"Sales"]
["Rod Kloer Firm",null,3.04,null,3.04,null,null,"Rod Kloer Firm",{"$f":"COUNTIF($A$3:$A$13,H3)>1","v":false},null,3.04,{"$f":"K3>AVERAGE($C$3:$C$13)","v":false},null,3.04,{"$f":"N3>_xlfn.PERCENTILE.EXC($E$3:$E$13,0.8)","v":false}]
["Hal Hinchliff Firm",null,19.41,null,19.41,null,null,"Hal Hinchliff Firm",true,null,19.41,true,null,19.41,true]
["Hal Hinchliff Firm",null,18.87,null,18.87,null,null,"Hal Hinchliff Firm",true,null,18.87,true,null,18.87,false]
["Shakia Warning Inc.",null,6.9,null,6.9,null,null,"Shakia Warning Inc.",false,null,6.9,false,null,6.9,false]
["Cliff Stalworth Firm",null,11.37,null,11.37,null,null,"Cliff Stalworth Firm",false,null,11.37,false,null,11.37,false]
["Jackson Kings LLP",null,18.89,null,18.89,null,null,"Jackson Kings LLP",true,null,18.89,true,null,18.89,true]
["Jackson Kings LLP",null,18.59,null,18.59,null,null,"Jackson Kings LLP",true,null,18.59,true,null,18.59,false]
["Rob Swearegene Company",null,7.36,null,7.36,null,null,"Rob Swearegene Company",false,null,7.36,false,null,7.36,false]
["Marcel Mittelsteadt Firm",null,13.05,null,13.05,null,null,"Marcel Mittelsteadt Firm",false,null,13.05,true,null,13.05,false]
["Rob Schiesher LLP",null,4.29,null,4.29,null,null,"Rob Schiesher LLP",false,null,4.29,false,null,4.29,false]
["Jackson Kings LLP",null,11.24,null,11.24,null,null,"Jackson Kings LLP",true,null,11.24,false,null,11.24,false]

{"sheet":"CF(2)","index":158,"n_rows":13,"n_cols":9,"rows_kept":13,"cut":false,"hidden":false,"merged":[]}
["Hilights Duplicates",null,"Above Average",null,"Top 10%",null,"Icons",null,"Data Bars"]
["Customer",null,"Sales",null,"Sales",null,"Sales",null,"Sales"]
["Rod Kloer Firm",null,3.04,null,3.04,null,3.04,null,3.04]
["Hal Hinchliff Firm",null,19.41,null,19.41,null,19.41,null,19.41]
["Hal Hinchliff Firm",null,18.87,null,18.87,null,18.87,null,1]
["Shakia Warning Inc.",null,6.9,null,6.9,null,6.9,null,6.9]
["Cliff Stalworth Firm",null,11.37,null,11.37,null,11.37,null,11.37]
["Jackson Kings LLP",null,18.89,null,18.89,null,18.89,null,18.89]
["Jackson Kings LLP",null,18.59,null,18.59,null,18.59,null,18.59]
["Rob Swearegene Company",null,7.36,null,7.36,null,7.36,null,7.36]
["Marcel Mittelsteadt Firm",null,13.05,null,13.05,null,13.05,null,13.05]
["Rob Schiesher LLP",null,4.29,null,4.29,null,4.29,null,4.29]
["Jackson Kings LLP",null,11.24,null,11.24,null,11.24,null,11.24]

{"sheet":"Logical","index":159,"n_rows":7,"n_cols":6,"rows_kept":7,"cut":false,"hidden":false,"merged":[]}
["Comparative Operators",null,"1st number","2nd number","Logical Formula Result","Logical Formula"]
[" > Greater Than",null,34,43,{"$f":"C2>D2","v":false},{"$f":"\" \"&TextFormula","v":" =C2>D2"}]
[" >= Greater Than Or Equal To",null,34,34,{"$f":"C3>=D3","v":true},{"$f":"\" \"&TextFormula","v":" =C3>=D3"}]
[" < Less Than",null,500,100,{"$f":"C4<D4","v":false},{"$f":"\" \"&TextFormula","v":" =C4<D4"}]
[" <= Less Than Or Equal To",null,"Jo","Joe",{"$f":"C5=D5","v":false},{"$f":"\" \"&TextFormula","v":" =C5=D5"}]
[" = Equal To",null,"Jo","Jo",true,{"$f":"\" \"&TextFormula","v":" =C6=D6"}]
[" <> Not Equal To",null,"Jo","Jo",{"$f":"C7<>D7","v":false},{"$f":"\" \"&TextFormula","v":" =C7<>D7"}]

{"sheet":"CF(3)","index":160,"n_rows":13,"n_cols":4,"rows_kept":13,"cut":false,"hidden":false,"merged":[]}
["Highlight Cell Based on another Cells Value"]
["Date to Highlight","2011-03-07"]
[]
["Date","Sales"]
["2011-03-07",8336,null,{"$f":"A5=B$2","v":true}]
["2010-03-11",9894,null,false]
["2011-03-07",11686,null,true]
["2010-03-11",7599,null,false]
["2011-03-07",9609,null,true]
["2010-03-09",11210,null,false]
["2010-03-09",12561,null,false]
["2011-03-07",7125,null,true]
["2010-03-09",11140,null,false]

{"sheet":"CF(4)","index":161,"n_rows":13,"n_cols":5,"rows_kept":13,"cut":false,"hidden":false,"merged":[]}
["Highlight Whole Row for an exact value"]
["Date to Highlight","2010-03-09"]
[]
["Date","Sales"]
["2011-03-07",8336,null,{"$f":"$A5=$B$2","v":false},false]
["2010-03-11",9894,null,false,false]
["2011-03-07",11686,null,false,false]
["2010-03-11",7599,null,false,false]
["2011-03-07",9609,null,false,false]
["2010-03-09",11210,null,true,true]
["2010-03-09",12561,null,true,true]
["2011-03-07",7125,null,false,false]
["2010-03-09",11140,null,true,true]

{"sheet":"CF(5)","index":162,"n_rows":25,"n_cols":8,"rows_kept":25,"cut":false,"hidden":false,"merged":[]}
["Highlight Whole Row for an aproximate value"]
["Income",5555,null,{"$f":"VLOOKUP(B2,A5:B13,1)","v":5000}]
[]
["Upper Value For Tax","Tax Rate"]
[0,0,null,{"$f":"VLOOKUP($B$2,$A$5:$A$13,1)=$A5","v":false},false]
[500,5.0000000000000001E-3,null,false,false]
[1000,0.01,null,false,false]
[2000,1.2500000000000001E-2,null,false,false]
[3000,1.7500000000000002E-2,null,false,false]
[5000,0.02,null,true,true]
[10000,0.03,null,false,false]
[20000,0.04,null,false,false]
[30000,0.05,null,false,false]
[]
[]
[null,null,"Pro","Pro 3"]
[null,null,"Year",2011]
[]
[null,null,null,2008,2009,2010,2011,2012]
[null,null,"Pro 1",15,15,29,19,45]
[null,null,"Pro 2",47,29,42,44,31]
[null,null,"Pro 3",17,50,38,21,34]
[null,null,"Pro 4",11,24,23,13,47]
[null,null,"Pro 5",23,11,15,25,48]
[null,null,"Pro 6",45,48,17,27,25]

{"sheet":"CF(6)","index":163,"n_rows":39,"n_cols":7,"rows_kept":39,"cut":false,"hidden":false,"merged":[]}
["Highlight Weekends or Holidays"]
[null,null,null,{"$f":"NETWORKDAYS(A5,A16,G5:G11)","v":8}]
[]
["Date","Employee",null,null,null,null,"Holidays"]
["2010-03-07",{"$f":"CHOOSE(INT(RAND()*3+1),\"Jo\",\"Sioux\",\"Mary\")","v":"Jo"},null,{"$f":"NETWORKDAYS($A5,$A5,$G$5:$G$11)=0","v":true},{"$f":"NETWORKDAYS($A5,$A5,$G$5:$G$11)=0","v":true},null,"2010-03-12"]
["2010-03-08",{"$f":"CHOOSE(INT(RAND()*3+1),\"Jo\",\"Sioux\",\"Mary\")","v":"Mary"},null,false,false]
["2010-03-09","Mary",null,false,false]
["2010-03-10","Jo",null,false,false]
["2010-03-11","Sioux",null,false,false]
["2010-03-12","Sioux",null,true,true]
["2010-03-13","Sioux",null,true,true]
["2010-03-14","Mary",null,true,true]
["2010-03-15","Mary",null,false,false]
["2010-03-16","Sioux",null,false,false]
["2010-03-17","Mary",null,false,false]
["2010-03-18","Sioux",null,false,false]
["2010-03-19","Jo"]
["2010-03-20","Sioux"]
["2010-03-21","Sioux"]
["2010-03-22","Jo"]
["2010-03-23","Sioux"]
["2010-03-24","Jo"]
["2010-03-25","Sioux"]
["2010-03-26","Mary"]
["2010-03-27","Sioux"]
["2010-03-28","Sioux"]
["2010-03-29","Mary"]
["2010-03-30","Sioux"]
["2010-03-31","Mary"]
["2010-04-01","Jo"]
["2010-04-02","Jo"]
["2010-04-03","Mary"]
["2010-04-04","Sioux"]
["2010-04-05","Jo"]
["2010-04-06","Sioux"]
["2010-04-07","Sioux"]
["2010-04-08","Jo"]
["2010-04-09","Mary"]
["2010-04-10","Mary"]

{"sheet":"F&R&GotTo","index":164,"n_rows":14,"n_cols":16,"rows_kept":14,"cut":false,"hidden":false,"merged":[]}
["Names","Sales","Sales","Sales","Sales",null,null,null,"Units","Sales",null,null,"Units",null,"Sales"]
["Sioux",80,53,96,91,null,null,null,1,100,null,"SUM",{"$f":"SUM($I$2:$I$12)","v":34},null,{"$f":"SUM($J$2:$J$12)","v":3394}]
["Sioux",0,79,128,98,null,null,null,2,250,null,"COUNT",{"$f":"COUNT($I$2:$I$12)","v":11},null,{"$f":"COUNT($J$2:$J$12)","v":11}]
["Joe",72,54,129,15,null,null,null,3,321,null,"COUNTIF",{"$f":"COUNTIF($I$2:$I$12,N4)","v":7},">2",{"$f":"COUNTIF($J$2:$J$12,P4)","v":7},">250"]
["Joe",61,125,0,94,null,null,null,2,158,null,"SUMIF",{"$f":"SUMIF($I$2:$I$12,N4)","v":27},">2",{"$f":"SUMIF($J$2:$J$12,P5)","v":2686},">250"]
["Phil",12,112,127,9,null,null,null,4,652]
["Frank",121,0,95,6,null,null,null,3,298]
["Chin",96,17,125,63,null,null,null,6,455]
["Frank",5,111,75,127,null,null,null,4,300]
["Chin",94,57,0,67,null,null,null,3,275]
["Sioux",76,75,71,14,null,null,null,2,200]
["Phil",17,0,87,94,null,null,null,4,385]
["Phil",5,64,95,0]
["Chin",0,51,62,68]

{"sheet":"Notes(52)","index":165,"n_rows":22,"n_cols":2,"rows_kept":22,"cut":false,"hidden":false,"merged":[]}
[{"$f":"ROWS(A$1:A1)","v":1},"How to Record a Macro"]
[{"$f":"ROWS(A$1:A2)","v":2},"Macro = VBA code"]
[{"$f":"ROWS(A$1:A3)","v":3},"Macros are great for repetitive tasks"]
[{"$f":"ROWS(A$1:A4)","v":4},"What file extension to use for Excel 2007: .xlsm"]
[{"$f":"ROWS(A$1:A5)","v":5},"How to show Developer Ribbon in Excel 2007"]
[{"$f":"ROWS(A$1:A6)","v":6},"Record Macro Button"]
[{"$f":"ROWS(A$1:A7)","v":7},"Alt + F11 opens VBA editor"]
[{"$f":"ROWS(A$1:A8)","v":8},"F4 shows Properties Window"]
[{"$f":"ROWS(A$1:A9)","v":9},"Alt, I, M Insert Module"]
[{"$f":"ROWS(A$1:A10)","v":10},"If Copy Code from Internet, paste into Module"]
[{"$f":"ROWS(A$1:A11)","v":11},"Alt + F8 opens List of Macros"]
[{"$f":"ROWS(A$1:A12)","v":12},"Relative & Absolute button in the Developer Ribbon"]
[{"$f":"ROWS(A$1:A13)","v":13},"The fact that the Relative & Absolute button governs selection movement when recording a Macro"]
[{"$f":"ROWS(A$1:A14)","v":14},"The fact that the cell references in Formulas created during a Recorded Macro are governed by the dollar signs"]
[{"$f":"ROWS(A$1:A15)","v":15},"When to record an Absolute Marco"]
[{"$f":"ROWS(A$1:A16)","v":16},"When to record an Relative Marco"]
[{"$f":"ROWS(A$1:A17)","v":17},"When to Record a Relative & Absolute Macro"]
[{"$f":"ROWS(A$1:A18)","v":18},"How to create a formula during a recorded Macro that will pick up a variable number of cells"]
[{"$f":"ROWS(A$1:A19)","v":19},"How to trick the Absolute Macro into recording a Relative Movement using keyboard shortcuts"]
[{"$f":"ROWS(A$1:A20)","v":20},"A Macro for formatting a report and adding a column of formulas for a static range of data"]
[{"$f":"ROWS(A$1:A21)","v":21},"A Macro for taking data in columns and moving it to a row"]
[{"$f":"ROWS(A$1:A22)","v":22},"A Macro for formatting a report and adding a column of formulas for a variable range of data"]

{"sheet":"Notes","index":166,"n_rows":19,"n_cols":2,"rows_kept":19,"cut":false,"hidden":false,"merged":[]}
[{"$f":"ROWS(A1:A$1)&\")\"","v":"1)"},"What is a Macro?"]
[{"$f":"ROWS(A$1:A2)&\")\"","v":"2)"},"Macro Means Code (Set of instructions) for common repetitive tasks."]
[{"$f":"ROWS(A$1:A3)&\")\"","v":"3)"},"Code in Excel is called VBA (Visual Basic Application)"]
[{"$f":"ROWS(A$1:A4)&\")\"","v":"4)"},"You can write code by hand in Excel in the VBA editor (Alt + F11), but not in this class."]
[{"$f":"ROWS(A$1:A5)&\")\"","v":"5)"},"Luckily there is a way to have Excel write code for you: Macro Recorder. A Macro Recorder is like a tape recorder recording a voice, except the Macro Recorder watches what you do in Excel and then writes code for you."]
[{"$f":"ROWS(A$1:A6)&\")\"","v":"6)"},"In Excel 2007/2010, you must use the \".xlsm\" extension in order to use Macros. You must also set the security level in the Code Group in the Developer Ribbon to \"Disable all Macros with notification\"; then each time you open the workbook, click the \"Options\" button that appears when you open the workbook, then click \"Enable\"."]
[{"$f":"ROWS(A$1:A8)&\")\"","v":"8)"},"In Excel 2003, the file extension .xls works with VBA or without VBA."]
[{"$f":"ROWS(A$1:A8)&\")\"","v":"8)"},"Show Developer Ribbon, Orb (Office Button), Excel Options, Popular Tab of Left, check \"Show Developer tab in Ribbon\""]
[{"$f":"ROWS(A$1:A9)&\")\"","v":"9)"},"Relative Macros record Relative Cell references and movement"]
[{"$f":"ROWS(A$1:A10)&\")\"","v":"10)"},"Absolute Macros record Absolute Cell references and movement"]
[{"$f":"ROWS(A$1:A16)&\")\"","v":"16)"},"The \"Use Relative Reference\" button in the Code Group in the Developer Ribbon (In Excel 2003, it is the on the \"Stop Recording Macro\" toolbar - to show it, right-click any toolbar, point to \"Customize\", click on the Toolbars tab, check the box for \"Stop Recording\"), The \"Use Relative Reference\" button is a toggle that toggles between Absolution and Relative References.  When the button is yellow/orange in color, the Marco is recording Relative Cell References in the Macro. When it is not yellow/orange, it is recording Absolute References."]
[{"$f":"ROWS(A$1:A12)&\")\"","v":"12)"},"To turn on the Macro Recorder use the \"Record Macro button in the Code group in the Developer Ribbon (or the Record Macro button on the left side of the Status Bar)."]
[{"$f":"ROWS(A$1:A13)&\")\"","v":"13)"},"Be sure to Turn off the Macro Recorder when you are done"]
[{"$f":"ROWS(A$1:A14)&\")\"","v":"14)"},"If you store Macros in \"This workbook\", they are only available in this workbook"]
[{"$f":"ROWS(A$1:A15)&\")\"","v":"15)"},"If you store Macros in \"Personal workbook\", they are stored in the hidden workbook named \"Personal\" and the Macros will be available in all workbooks on your computer. To edit a Macro in a Personal workbook, you must unhide the workbook using the \"Unhide\" button in the Window Group on the View Ribbon (Excel 2003 \"Unhide\" is in the Windows menu)."]
[{"$f":"ROWS(A$1:A16)&\")\"","v":"16)"},"The VBA editor (Microsoft Visual Basic editor) is where you write code (Alt + F11)"]
[{"$f":"ROWS(A$1:A17)&\")\"","v":"17)"},"Use Alt + F8 to see list of Macros. You can select a Macro and then click the Edit button to see the code that the Macro recorder recorded."]
[{"$f":"ROWS(A$1:A18)&\")\"","v":"18)"},"In the VBA editor:\nLeft side shows: 1) \"Project Explorer\" (Ctrl + R), which sows objects such as Workbook, Worksheets and Modules (Macros). 2) Properties (F4 key)"]
[{"$f":"ROWS(A$1:A19)&\")\"","v":"19)"},"If you copy code from internet, when you are in VBA editor, Alt I + M, name Macro, Paste Code on right side, go  back to Excel, Alt + F8 to open Macro List, Select Macro, click Options, assign keyboard shortcut"]

{"sheet":"M(1)","index":167,"n_rows":23,"n_cols":11,"rows_kept":23,"cut":false,"hidden":false,"merged":[]}
["Date","Time","Temp (F)","Celsius",null,null,null,null,null,{"$f":"ROWS(J$1:J1)&\")\"","v":"1)"},"Absolute Macro because the table is the same size and is in the same cells every time"]
["2009-04-01","17:07:18.708",42.92,{"$f":"CONVERT(C2,\"F\",\"C\")","v":6.0666666666666673},null,null,null,null,null,{"$f":"ROWS(J$1:J2)&\")\"","v":"2)"},"In 2007, add Developer Ribbon: Alt + F + I, then check Developer Ribbon check box, In Excel 2010, Customize Ribbon to add (right-click Ribbon, Customize)"]
["2009-04-02","23:49:58.762",42.61,{"$f":"CONVERT(C3,\"F\",\"C\")","v":5.8944444444444439},null,null,null,null,null,{"$f":"ROWS(J$1:J3)&\")\"","v":"3)"},"The MACRO recorder is like a tape recorder: it will follow your actions in Excel and instead of recording the sound or visual of your actions, it writes the code that represents your actions."]
["2009-04-03","11:59:10.701",49.69,9.8277777777777757,null,null,null,null,null,{"$f":"ROWS(J$1:J4)&\")\"","v":"4)"},"Recording an Absolute MACRO: 1) The Relative/Absolute recording button must be off; 2) The MACRO records your actions absolutely, that is to say when you click in the cell A1, it records cell A1, not a relative position."]
["2009-04-04","22:41:23.238",44.58,6.988888888888888,null,null,null,null,null,{"$f":"ROWS(J$1:J5)&\")\"","v":"5)"},"After you are done, click the Stop Recording button."]
["2009-04-05","00:20:05.128",43.03,6.1277777777777782,null,null,null,null,null,{"$f":"ROWS(J$1:J6)&\")\"","v":"6)"},"Alt + F8 opens the list of MACROS. You can click the Options button to see or change your keyboard shortcut. Click the Edit button to see the code that the MACRO recorder wrote. After you have read the code, click the close button on the VBA editor window."]
["2009-04-06","11:49:22.327",43.94,6.633333333333332]
["2009-04-07","20:02:30.344",43.74,6.522222222222223]
["2009-04-08","22:23:35.341",48.37,9.0944444444444432]
["2009-04-09","00:44:26.639",42.56,5.866666666666668]
["2009-04-10","08:53:54.036",41.18,5.0999999999999996]
["2009-04-11","05:51:37.917",47.980000000000004,8.87777777777778]
["2009-04-12","05:19:06.640",47.62,8.6777777777777754]
["2009-04-13","17:34:57.066",44.99,7.2166666666666677]
["2009-04-14","11:46:21.218",43.41,6.3388888888888868]
["2009-04-15","06:29:31.734",41.82,5.4555555555555557]
["2009-04-16","11:52:54.386",49.31,9.6166666666666671]
["2009-04-17","17:27:17.793",42.77,5.9833333333333352]
["2009-04-18","01:52:24.064",45.769999999999996,7.6499999999999977]
["2009-04-19","00:37:02.355",42.04,5.5777777777777775]
["2009-04-20","23:57:22.639",41.81,5.4500000000000011]
[]
[null,null,"Ave",{"$f":"AVERAGE(D2:D21)","v":6.9483333333333333}]

{"sheet":"M(1.1)","index":168,"n_rows":23,"n_cols":11,"rows_kept":23,"cut":false,"hidden":false,"merged":[]}
["Date","Time","Temp (F)","Celsius",null,null,null,null,null,{"$f":"ROWS(J$1:J1)&\")\"","v":"1)"},"Absolute Macro because the table is the same size and is in the same cells every time"]
["2009-04-01","17:07:18.708",42.92,{"$f":"CONVERT(C2,\"F\",\"C\")","v":6.0666666666666673},null,null,null,null,null,{"$f":"ROWS(J$1:J2)&\")\"","v":"2)"},"In 2007, add Developer Ribbon: Alt + F + I, then check Developer Ribbon check box, In Excel 2010, Customize Ribbon to add (right-click Ribbon, Customize)"]
["2009-04-02","23:49:58.762",42.61,{"$f":"CONVERT(C3,\"F\",\"C\")","v":5.8944444444444439},null,null,null,null,null,{"$f":"ROWS(J$1:J3)&\")\"","v":"3)"},"The MACRO recorder is like a tape recorder: it will follow your actions in Excel and instead of recording the sound or visual of your actions, it writes the code that represents your actions."]
["2009-04-03","11:59:10.701",49.69,9.8277777777777757,null,null,null,null,null,{"$f":"ROWS(J$1:J4)&\")\"","v":"4)"},"Recording an Absolute MACRO: 1) The Relative/Absolute recording button must be off; 2) The MACRO records your actions absolutely, that is to say when you click in the cell A1, it records cell A1, not a relative position."]
["2009-04-04","22:41:23.238",44.58,6.988888888888888,null,null,null,null,null,{"$f":"ROWS(J$1:J5)&\")\"","v":"5)"},"After you are done, click the Stop Recording button."]
["2009-04-05","00:20:05.128",43.03,6.1277777777777782,null,null,null,null,null,{"$f":"ROWS(J$1:J6)&\")\"","v":"6)"},"Alt + F8 opens the list of MACROS. You can click the Options button to see or change your keyboard shortcut. Click the Edit button to see the code that the MACRO recorder wrote. After you have read the code, click the close button on the VBA editor window."]
["2009-04-06","11:49:22.327",43.94,6.633333333333332]
["2009-04-07","20:02:30.344",43.74,6.522222222222223]
["2009-04-08","22:23:35.341",48.37,9.0944444444444432]
["2009-04-09","00:44:26.639",42.56,5.866666666666668]
["2009-04-10","08:53:54.036",41.18,5.0999999999999996]
["2009-04-11","05:51:37.917",47.980000000000004,8.87777777777778]
["2009-04-12","05:19:06.640",47.62,8.6777777777777754]
["2009-04-13","17:34:57.066",44.99,7.2166666666666677]
["2009-04-14","11:46:21.218",43.41,6.3388888888888868]
["2009-04-15","06:29:31.734",41.82,5.4555555555555557]
["2009-04-16","11:52:54.386",49.31,9.6166666666666671]
["2009-04-17","17:27:17.793",42.77,5.9833333333333352]
["2009-04-18","01:52:24.064",45.769999999999996,7.6499999999999977]
["2009-04-19","00:37:02.355",42.04,5.5777777777777775]
["2009-04-20","23:57:22.639",41.81,5.4500000000000011]
[]
[null,null,"Ave",{"$f":"AVERAGE(D2:D21)","v":6.9483333333333333}]

{"sheet":"M(1.2)","index":169,"n_rows":21,"n_cols":11,"rows_kept":21,"cut":false,"hidden":false,"merged":[]}
["Date","Time","Temp (F)",null,null,null,null,null,null,{"$f":"ROWS(J$1:J1)&\")\"","v":"1)"},"Absolute Macro because the table is the same size and is in the same cells every time"]
["2009-04-01","17:07:18.708",42.92,null,null,null,null,null,null,{"$f":"ROWS(J$1:J2)&\")\"","v":"2)"},"In 2007, add Developer Ribbon: Alt + F + I, then check Developer Ribbon check box, In Excel 2010, Customize Ribbon to add (right-click Ribbon, Customize)"]
["2009-04-02","23:49:58.762",42.61,null,null,null,null,null,null,{"$f":"ROWS(J$1:J3)&\")\"","v":"3)"},"The MACRO recorder is like a tape recorder: it will follow your actions in Excel and instead of recording the sound or visual of your actions, it writes the code that represents your actions."]
["2009-04-03","11:59:10.701",49.69,null,null,null,null,null,null,{"$f":"ROWS(J$1:J4)&\")\"","v":"4)"},"Recording an Absolute MACRO: 1) The Relative/Absolute recording button must be off; 2) The MACRO records your actions absolutely, that is to say when you click in the cell A1, it records cell A1, not a relative position."]
["2009-04-04","22:41:23.238",44.58,null,null,null,null,null,null,{"$f":"ROWS(J$1:J5)&\")\"","v":"5)"},"After you are done, click the Stop Recording button."]
["2009-04-05","00:20:05.128",43.03,null,null,null,null,null,null,{"$f":"ROWS(J$1:J6)&\")\"","v":"6)"},"Alt + F8 opens the list of MACROS. You can click the Options button to see or change your keyboard shortcut. Click the Edit button to see the code that the MACRO recorder wrote. After you have read the code, click the close button on the VBA editor window."]
["2009-04-06","11:49:22.327",43.94]
["2009-04-07","20:02:30.344",43.74]
["2009-04-08","22:23:35.341",48.37]
["2009-04-09","00:44:26.639",42.56]
["2009-04-10","08:53:54.036",41.18]
["2009-04-11","05:51:37.917",47.980000000000004]
["2009-04-12","05:19:06.640",47.62]
["2009-04-13","17:34:57.066",44.99]
["2009-04-14","11:46:21.218",43.41]
["2009-04-15","06:29:31.734",41.82]
["2009-04-16","11:52:54.386",49.31]
["2009-04-17","17:27:17.793",42.77]
["2009-04-18","01:52:24.064",45.769999999999996]
["2009-04-19","00:37:02.355",42.04]
["2009-04-20","23:57:22.639",41.81]

{"sheet":"M(1.3)","index":170,"n_rows":21,"n_cols":11,"rows_kept":21,"cut":false,"hidden":false,"merged":[]}
["Date","Time","Temp (F)",null,null,null,null,null,null,{"$f":"ROWS(J$1:J1)&\")\"","v":"1)"},"Absolute Macro because the table is the same size and is in the same cells every time"]
["2009-04-01","17:07:18.708",42.92,null,null,null,null,null,null,{"$f":"ROWS(J$1:J2)&\")\"","v":"2)"},"In 2007, add Developer Ribbon: Alt + F + I, then check Developer Ribbon check box, In Excel 2010, Customize Ribbon to add (right-click Ribbon, Customize)"]
["2009-04-02","23:49:58.762",42.61,null,null,null,null,null,null,{"$f":"ROWS(J$1:J3)&\")\"","v":"3)"},"The MACRO recorder is like a tape recorder: it will follow your actions in Excel and instead of recording the sound or visual of your actions, it writes the code that represents your actions."]
["2009-04-03","11:59:10.701",49.69,null,null,null,null,null,null,{"$f":"ROWS(J$1:J4)&\")\"","v":"4)"},"Recording an Absolute MACRO: 1) The Relative/Absolute recording button must be off; 2) The MACRO records your actions absolutely, that is to say when you click in the cell A1, it records cell A1, not a relative position."]
["2009-04-04","22:41:23.238",44.58,null,null,null,null,null,null,{"$f":"ROWS(J$1:J5)&\")\"","v":"5)"},"After you are done, click the Stop Recording button."]
["2009-04-05","00:20:05.128",43.03,null,null,null,null,null,null,{"$f":"ROWS(J$1:J6)&\")\"","v":"6)"},"Alt + F8 opens the list of MACROS. You can click the Options button to see or change your keyboard shortcut. Click the Edit button to see the code that the MACRO recorder wrote. After you have read the code, click the close button on the VBA editor window."]
["2009-04-06","11:49:22.327",43.94]
["2009-04-07","20:02:30.344",43.74]
["2009-04-08","22:23:35.341",48.37]
["2009-04-09","00:44:26.639",42.56]
["2009-04-10","08:53:54.036",41.18]
["2009-04-11","05:51:37.917",47.980000000000004]
["2009-04-12","05:19:06.640",47.62]
["2009-04-13","17:34:57.066",44.99]
["2009-04-14","11:46:21.218",43.41]
["2009-04-15","06:29:31.734",41.82]
["2009-04-16","11:52:54.386",49.31]
["2009-04-17","17:27:17.793",42.77]
["2009-04-18","01:52:24.064",45.769999999999996]
["2009-04-19","00:37:02.355",42.04]
["2009-04-20","23:57:22.639",41.81]

{"sheet":"M(1.4)","index":171,"n_rows":21,"n_cols":11,"rows_kept":21,"cut":false,"hidden":false,"merged":[]}
["Date","Time","Temp (F)",null,null,null,null,null,null,{"$f":"ROWS(J$1:J1)&\")\"","v":"1)"},"Absolute Macro because the table is the same size and is in the same cells every time"]
["2009-04-01","17:07:18.708",42.92,null,null,null,null,null,null,{"$f":"ROWS(J$1:J2)&\")\"","v":"2)"},"In 2007, add Developer Ribbon: Alt + F + I, then check Developer Ribbon check box, In Excel 2010, Customize Ribbon to add (right-click Ribbon, Customize)"]
["2009-04-02","23:49:58.762",42.61,null,null,null,null,null,null,{"$f":"ROWS(J$1:J3)&\")\"","v":"3)"},"The MACRO recorder is like a tape recorder: it will follow your actions in Excel and instead of recording the sound or visual of your actions, it writes the code that represents your actions."]
["2009-04-03","11:59:10.701",49.69,null,null,null,null,null,null,{"$f":"ROWS(J$1:J4)&\")\"","v":"4)"},"Recording an Absolute MACRO: 1) The Relative/Absolute recording button must be off; 2) The MACRO records your actions absolutely, that is to say when you click in the cell A1, it records cell A1, not a relative position."]
["2009-04-04","22:41:23.238",44.58,null,null,null,null,null,null,{"$f":"ROWS(J$1:J5)&\")\"","v":"5)"},"After you are done, click the Stop Recording button."]
["2009-04-05","00:20:05.128",43.03,null,null,null,null,null,null,{"$f":"ROWS(J$1:J6)&\")\"","v":"6)"},"Alt + F8 opens the list of MACROS. You can click the Options button to see or change your keyboard shortcut. Click the Edit button to see the code that the MACRO recorder wrote. After you have read the code, click the close button on the VBA editor window."]
["2009-04-06","11:49:22.327",43.94]
["2009-04-07","20:02:30.344",43.74]
["2009-04-08","22:23:35.341",48.37]
["2009-04-09","00:44:26.639",42.56]
["2009-04-10","08:53:54.036",41.18]
["2009-04-11","05:51:37.917",47.980000000000004]
["2009-04-12","05:19:06.640",47.62]
["2009-04-13","17:34:57.066",44.99]
["2009-04-14","11:46:21.218",43.41]
["2009-04-15","06:29:31.734",41.82]
["2009-04-16","11:52:54.386",49.31]
["2009-04-17","17:27:17.793",42.77]
["2009-04-18","01:52:24.064",45.769999999999996]
["2009-04-19","00:37:02.355",42.04]
["2009-04-20","23:57:22.639",41.81]

{"sheet":"M(2)","index":172,"n_rows":22,"n_cols":10,"rows_kept":22,"cut":false,"hidden":false,"merged":[]}
[{"$f":"ROWS(A$1:A1)&\")\"","v":"1)"},"Relative Macro Because each time we do something it needs to be a relative move."]
[{"$f":"ROWS(A$1:A2)&\")\"","v":"2)"},"In 2007, add Developer Ribbon: Alt + F + I, then check Developer Ribbon check box, In Excel 2010, Customize Ribbon to add (right-click Ribbon, Customize)"]
[{"$f":"ROWS(A$1:A3)&\")\"","v":"3)"},"The MACRO recorder is like a tape recorder: it will follow your actions in Excel and instead of recording the sound or visual of your actions, it writes the code that represents your actions."]
[{"$f":"ROWS(A$1:A4)&\")\"","v":"4)"},"Recording an Relative MACRO: 1) The Relative/Absolute recording button must be on; 2) The MACRO records your actions relatively that is to say when you click in the cell 4 rows above, it will always click in the cell 4 above from the realative starting point."]
[{"$f":"ROWS(A$1:A5)&\")\"","v":"5)"},"After you are done, click the Stop Recording button."]
[{"$f":"ROWS(A$1:A6)&\")\"","v":"6)"},"Alt + F8 opens the list of MACROS. You can click the Options button to see or change your keyboard shortcut. Click the Edit button to see the code that the MACRO recorder wrote. After you have read the code, click the close button on the VBA editor window."]
[]
[null,"First","Last","Address","City","State","Zip","Phone","E1","E2"]
[null,"Steve","Chin","14 17th St.","Seattle","WA",98104,"206-572-3409",{"$f":"B9&\"_\"&C9&\"@notaol.com\"","v":"Steve_Chin@notaol.com"},{"$f":"C9&\"_\"&D9&\"@notaol.com\"","v":"Chin_14 17th St.@notaol.com"}]
[null,"Troun","Tenn","6 19th St.","Seattle","WA",98106,"206-667-3154","Troun_Tenn@notaol.com","Tenn_6 19th St.@notaol.com"]
[null,"Rhond","Tradfren","10 13th St.","Seattle","WA",98117,"206-574-1265","Rhond_Tradfren@notaol.com","Tradfren_10 13th St.@notaol.com"]
[null,"Sheli","Das","2 15th St.","Seattle","WA",98111,"206-637-4014","Sheli_Das@notaol.com","Das_2 15th St.@notaol.com"]
[null,"Jon","Teddy","3 17th St.","Seattle","WA",98114,"206-515-5102","Jon_Teddy@notaol.com","Teddy_3 17th St.@notaol.com"]
[null,"Jeri","Yessler","12 16th St.","Seattle","WA",98114,"206-583-2943","Jeri_Yessler@notaol.com","Yessler_12 16th St.@notaol.com"]
[null,"Luke","Suix","8 19th St.","Seattle","WA",98113,"206-774-4449","Luke_Suix@notaol.com","Suix_8 19th St.@notaol.com"]
[null,"Luke","Red","15 16th St.","Seattle","WA",98108,"206-685-2311","Luke_Red@notaol.com","Red_15 16th St.@notaol.com"]
[null,"Jeri","Smythe","14 19th St.","Seattle","WA",98112,"206-574-6156","Jeri_Smythe@notaol.com","Smythe_14 19th St.@notaol.com"]
[null,"Luke","Rad","3 16th St.","Seattle","WA",98106,"206-599-3338","Luke_Rad@notaol.com","Rad_3 16th St.@notaol.com"]
[null,"Jon","Dap","5 19th St.","Seattle","WA",98116,"206-679-1485","Jon_Dap@notaol.com","Dap_5 19th St.@notaol.com"]
[null,"Steve","Gupis","6 17th St.","Seattle","WA",98111,"206-609-1507","Steve_Gupis@notaol.com","Gupis_6 17th St.@notaol.com"]
[null,"Jon","Summi","4 14th St.","Seattle","WA",98104,"206-733-4318","Jon_Summi@notaol.com","Summi_4 14th St.@notaol.com"]
[null,"Sheli","Fun","7 15th St.","Seattle","WA",98110,"206-691-7629","Sheli_Fun@notaol.com","Fun_7 15th St.@notaol.com"]

{"sheet":"M(2.1)","index":173,"n_rows":148,"n_cols":10,"rows_kept":148,"cut":false,"hidden":false,"merged":[]}
[{"$f":"ROWS(A$1:A1)&\")\"","v":"1)"},"Relative Macro Because each time we do something it needs to be a relative move."]
[{"$f":"ROWS(A$1:A2)&\")\"","v":"2)"},"In 2007, add Developer Ribbon: Alt + F + I, then check Developer Ribbon check box, In Excel 2010, Customize Ribbon to add (right-click Ribbon, Customize)"]
[{"$f":"ROWS(A$1:A3)&\")\"","v":"3)"},"The MACRO recorder is like a tape recorder: it will follow your actions in Excel and instead of recording the sound or visual of your actions, it writes the code that represents your actions."]
[{"$f":"ROWS(A$1:A4)&\")\"","v":"4)"},"Recording an Relative MACRO: 1) The Relative/Absolute recording button must be on; 2) The MACRO records your actions relatively that is to say when you click in the cell 4 rows above, it will always click in the cell 4 above from the realative starting point."]
[{"$f":"ROWS(A$1:A5)&\")\"","v":"5)"},"After you are done, click the Stop Recording button."]
[{"$f":"ROWS(A$1:A6)&\")\"","v":"6)"},"Alt + F8 opens the list of MACROS. You can click the Options button to see or change your keyboard shortcut. Click the Edit button to see the code that the MACRO recorder wrote. After you have read the code, click the close button on the VBA editor window."]
[]
[null,"First","Last","Address","City","State","Zip","Phone","E1","E2"]
[]
[null,"Steve"]
[null,"Chin"]
[null,"14 17th St."]
[null,"Seattle"]
[null,"WA"]
[null,98104]
[null,"206-572-3409"]
[null,{"$f":"B10&\"_\"&B11&\"@notaol.com\"","v":"Steve_Chin@notaol.com"}]
[null,{"$f":"B11&\"_\"&B12&\"@notaol.com\"","v":"Chin_14 17th St.@notaol.com"}]
[]
[null,"Troun"]
[null,"Tenn"]
[null,"6 19th St."]
[null,"Seattle"]
[null,"WA"]
[null,98106]
[null,"206-667-3154"]
[null,{"$f":"B20&\"_\"&B21&\"@notaol.com\"","v":"Troun_Tenn@notaol.com"}]
[null,{"$f":"B21&\"_\"&B22&\"@notaol.com\"","v":"Tenn_6 19th St.@notaol.com"}]
[]
[null,"Rhond"]
[null,"Tradfren"]
[null,"10 13th St."]
[null,"Seattle"]
[null,"WA"]
[null,98117]
[null,"206-574-1265"]
[null,{"$f":"B30&\"_\"&B31&\"@notaol.com\"","v":"Rhond_Tradfren@notaol.com"}]
[null,{"$f":"B31&\"_\"&B32&\"@notaol.com\"","v":"Tradfren_10 13th St.@notaol.com"}]
[]
[null,"Sheli"]
[null,"Das"]
[null,"2 15th St."]
[null,"Seattle"]
[null,"WA"]
[null,98111]
[null,"206-637-4014"]
[null,{"$f":"B40&\"_\"&B41&\"@notaol.com\"","v":"Sheli_Das@notaol.com"}]
[null,{"$f":"B41&\"_\"&B42&\"@notaol.com\"","v":"Das_2 15th St.@notaol.com"}]
[]
[null,"Jon"]
[null,"Teddy"]
[null,"3 17th St."]
[null,"Seattle"]
[null,"WA"]
[null,98114]
[null,"206-515-5102"]
[null,{"$f":"B50&\"_\"&B51&\"@notaol.com\"","v":"Jon_Teddy@notaol.com"}]
[null,{"$f":"B51&\"_\"&B52&\"@notaol.com\"","v":"Teddy_3 17th St.@notaol.com"}]
[]
[null,"Jeri"]
[null,"Yessler"]
[null,"12 16th St."]
[null,"Seattle"]
[null,"WA"]
[null,98114]
[null,"206-583-2943"]
[null,{"$f":"B60&\"_\"&B61&\"@notaol.com\"","v":"Jeri_Yessler@notaol.com"}]
[null,{"$f":"B61&\"_\"&B62&\"@notaol.com\"","v":"Yessler_12 16th St.@notaol.com"}]
[]
[null,"Luke"]
[null,"Suix"]
[null,"8 19th St."]
[null,"Seattle"]
[null,"WA"]
[null,98113]
[null,"206-774-4449"]
[null,{"$f":"B70&\"_\"&B71&\"@notaol.com\"","v":"Luke_Suix@notaol.com"}]
[null,{"$f":"B71&\"_\"&B72&\"@notaol.com\"","v":"Suix_8 19th St.@notaol.com"}]
[]
[null,"Luke"]
[null,"Red"]
[null,"15 16th St."]
[null,"Seattle"]
[null,"WA"]
[null,98108]
[null,"206-685-2311"]
[null,{"$f":"B80&\"_\"&B81&\"@notaol.com\"","v":"Luke_Red@notaol.com"}]
[null,{"$f":"B81&\"_\"&B82&\"@notaol.com\"","v":"Red_15 16th St.@notaol.com"}]
[]
[null,"Jeri"]
[null,"Smythe"]
[null,"14 19th St."]
[null,"Seattle"]
[null,"WA"]
[null,98112]
[null,"206-574-6156"]
[null,{"$f":"B90&\"_\"&B91&\"@notaol.com\"","v":"Jeri_Smythe@notaol.com"}]
[null,{"$f":"B91&\"_\"&B92&\"@notaol.com\"","v":"Smythe_14 19th St.@notaol.com"}]
[]
[null,"Luke"]
[null,"Rad"]
[null,"3 16th St."]
[null,"Seattle"]
[null,"WA"]
[null,98106]
[null,"206-599-3338"]
[null,{"$f":"B100&\"_\"&B101&\"@notaol.com\"","v":"Luke_Rad@notaol.com"}]
[null,{"$f":"B101&\"_\"&B102&\"@notaol.com\"","v":"Rad_3 16th St.@notaol.com"}]
[]
[null,"Jon"]
[null,"Dap"]
[null,"5 19th St."]
[null,"Seattle"]
[null,"WA"]
[null,98116]
[null,"206-679-1485"]
[null,{"$f":"B110&\"_\"&B111&\"@notaol.com\"","v":"Jon_Dap@notaol.com"}]
[null,{"$f":"B111&\"_\"&B112&\"@notaol.com\"","v":"Dap_5 19th St.@notaol.com"}]
[]
[null,"Steve"]
[null,"Gupis"]
[null,"6 17th St."]
[null,"Seattle"]
[null,"WA"]
[null,98111]
[null,"206-609-1507"]
[null,{"$f":"B120&\"_\"&B121&\"@notaol.com\"","v":"Steve_Gupis@notaol.com"}]
[null,{"$f":"B121&\"_\"&B122&\"@notaol.com\"","v":"Gupis_6 17th St.@notaol.com"}]
[]
[null,"Jon"]
[null,"Summi"]
[null,"4 14th St."]
[null,"Seattle"]
[null,"WA"]
[null,98104]
[null,"206-733-4318"]
[null,{"$f":"B130&\"_\"&B131&\"@notaol.com\"","v":"Jon_Summi@notaol.com"}]
[null,{"$f":"B131&\"_\"&B132&\"@notaol.com\"","v":"Summi_4 14th St.@notaol.com"}]
[]
[null,"Sheli"]
[null,"Fun"]
[null,"7 15th St."]
[null,"Seattle"]
[null,"WA"]
[null,98110]
[null,"206-691-7629"]
[null,{"$f":"B140&\"_\"&B141&\"@notaol.com\"","v":"Sheli_Fun@notaol.com"}]
[null,{"$f":"B141&\"_\"&B142&\"@notaol.com\"","v":"Fun_7 15th St.@notaol.com"}]

{"sheet":"M(2.2)","index":174,"n_rows":148,"n_cols":10,"rows_kept":148,"cut":false,"hidden":false,"merged":[]}
[{"$f":"ROWS(A$1:A1)&\")\"","v":"1)"},"Relative Macro Because each time we do something it needs to be a relative move."]
[{"$f":"ROWS(A$1:A2)&\")\"","v":"2)"},"In 2007, add Developer Ribbon: Alt + F + I, then check Developer Ribbon check box"]
[{"$f":"ROWS(A$1:A3)&\")\"","v":"3)"},"The MACRO recorder is like a tape recorder: it will follow your actions in Excel and instead of recording the sound or visual of your actions, it writes the code that represents your actions."]
[{"$f":"ROWS(A$1:A4)&\")\"","v":"4)"},"Recording an Relative MACRO: 1) The Relative/Absolute recording button must be on; 2) The MACRO records your actions relatively that is to say when you click in the cell 4 rows above, it will always click in the cell 4 above from the realative starting point."]
[{"$f":"ROWS(A$1:A5)&\")\"","v":"5)"},"After you are done, click the Stop Recording button."]
[{"$f":"ROWS(A$1:A6)&\")\"","v":"6)"},"Alt + F8 opens the list of MACROS. You can click the Options button to see or change your keyboard shortcut. Click the Edit button to see the code that the MACRO recorder wrote. After you have read the code, click the close button on the VBA editor window."]
[]
[null,"First","Last","Address","City","State","Zip","Phone","E1","E2"]
[]
[null,"Steve"]
[null,"Chin"]
[null,"14 17th St."]
[null,"Seattle"]
[null,"WA"]
[null,98104]
[null,"206-572-3409"]
[null,{"$f":"B10&\"_\"&B11&\"@notaol.com\"","v":"Steve_Chin@notaol.com"}]
[null,{"$f":"B11&\"_\"&B12&\"@notaol.com\"","v":"Chin_14 17th St.@notaol.com"}]
[]
[null,"Troun"]
[null,"Tenn"]
[null,"6 19th St."]
[null,"Seattle"]
[null,"WA"]
[null,98106]
[null,"206-667-3154"]
[null,{"$f":"B20&\"_\"&B21&\"@notaol.com\"","v":"Troun_Tenn@notaol.com"}]
[null,{"$f":"B21&\"_\"&B22&\"@notaol.com\"","v":"Tenn_6 19th St.@notaol.com"}]
[]
[null,"Rhond"]
[null,"Tradfren"]
[null,"10 13th St."]
[null,"Seattle"]
[null,"WA"]
[null,98117]
[null,"206-574-1265"]
[null,{"$f":"B30&\"_\"&B31&\"@notaol.com\"","v":"Rhond_Tradfren@notaol.com"}]
[null,{"$f":"B31&\"_\"&B32&\"@notaol.com\"","v":"Tradfren_10 13th St.@notaol.com"}]
[]
[null,"Sheli"]
[null,"Das"]
[null,"2 15th St."]
[null,"Seattle"]
[null,"WA"]
[null,98111]
[null,"206-637-4014"]
[null,{"$f":"B40&\"_\"&B41&\"@notaol.com\"","v":"Sheli_Das@notaol.com"}]
[null,{"$f":"B41&\"_\"&B42&\"@notaol.com\"","v":"Das_2 15th St.@notaol.com"}]
[]
[null,"Jon"]
[null,"Teddy"]
[null,"3 17th St."]
[null,"Seattle"]
[null,"WA"]
[null,98114]
[null,"206-515-5102"]
[null,{"$f":"B50&\"_\"&B51&\"@notaol.com\"","v":"Jon_Teddy@notaol.com"}]
[null,{"$f":"B51&\"_\"&B52&\"@notaol.com\"","v":"Teddy_3 17th St.@notaol.com"}]
[]
[null,"Jeri"]
[null,"Yessler"]
[null,"12 16th St."]
[null,"Seattle"]
[null,"WA"]
[null,98114]
[null,"206-583-2943"]
[null,{"$f":"B60&\"_\"&B61&\"@notaol.com\"","v":"Jeri_Yessler@notaol.com"}]
[null,{"$f":"B61&\"_\"&B62&\"@notaol.com\"","v":"Yessler_12 16th St.@notaol.com"}]
[]
[null,"Luke"]
[null,"Suix"]
[null,"8 19th St."]
[null,"Seattle"]
[null,"WA"]
[null,98113]
[null,"206-774-4449"]
[null,{"$f":"B70&\"_\"&B71&\"@notaol.com\"","v":"Luke_Suix@notaol.com"}]
[null,{"$f":"B71&\"_\"&B72&\"@notaol.com\"","v":"Suix_8 19th St.@notaol.com"}]
[]
[null,"Luke"]
[null,"Red"]
[null,"15 16th St."]
[null,"Seattle"]
[null,"WA"]
[null,98108]
[null,"206-685-2311"]
[null,{"$f":"B80&\"_\"&B81&\"@notaol.com\"","v":"Luke_Red@notaol.com"}]
[null,{"$f":"B81&\"_\"&B82&\"@notaol.com\"","v":"Red_15 16th St.@notaol.com"}]
[]
[null,"Jeri"]
[null,"Smythe"]
[null,"14 19th St."]
[null,"Seattle"]
[null,"WA"]
[null,98112]
[null,"206-574-6156"]
[null,{"$f":"B90&\"_\"&B91&\"@notaol.com\"","v":"Jeri_Smythe@notaol.com"}]
[null,{"$f":"B91&\"_\"&B92&\"@notaol.com\"","v":"Smythe_14 19th St.@notaol.com"}]
[]
[null,"Luke"]
[null,"Rad"]
[null,"3 16th St."]
[null,"Seattle"]
[null,"WA"]
[null,98106]
[null,"206-599-3338"]
[null,{"$f":"B100&\"_\"&B101&\"@notaol.com\"","v":"Luke_Rad@notaol.com"}]
[null,{"$f":"B101&\"_\"&B102&\"@notaol.com\"","v":"Rad_3 16th St.@notaol.com"}]
[]
[null,"Jon"]
[null,"Dap"]
[null,"5 19th St."]
[null,"Seattle"]
[null,"WA"]
[null,98116]
[null,"206-679-1485"]
[null,{"$f":"B110&\"_\"&B111&\"@notaol.com\"","v":"Jon_Dap@notaol.com"}]
[null,{"$f":"B111&\"_\"&B112&\"@notaol.com\"","v":"Dap_5 19th St.@notaol.com"}]
[]
[null,"Steve"]
[null,"Gupis"]
[null,"6 17th St."]
[null,"Seattle"]
[null,"WA"]
[null,98111]
[null,"206-609-1507"]
[null,{"$f":"B120&\"_\"&B121&\"@notaol.com\"","v":"Steve_Gupis@notaol.com"}]
[null,{"$f":"B121&\"_\"&B122&\"@notaol.com\"","v":"Gupis_6 17th St.@notaol.com"}]
[]
[null,"Jon"]
[null,"Summi"]
[null,"4 14th St."]
[null,"Seattle"]
[null,"WA"]
[null,98104]
[null,"206-733-4318"]
[null,{"$f":"B130&\"_\"&B131&\"@notaol.com\"","v":"Jon_Summi@notaol.com"}]
[null,{"$f":"B131&\"_\"&B132&\"@notaol.com\"","v":"Summi_4 14th St.@notaol.com"}]
[]
[null,"Sheli"]
[null,"Fun"]
[null,"7 15th St."]
[null,"Seattle"]
[null,"WA"]
[null,98110]
[null,"206-691-7629"]
[null,{"$f":"B140&\"_\"&B141&\"@notaol.com\"","v":"Sheli_Fun@notaol.com"}]
[null,{"$f":"B141&\"_\"&B142&\"@notaol.com\"","v":"Fun_7 15th St.@notaol.com"}]

{"sheet":"M(2.3)","index":175,"n_rows":148,"n_cols":10,"rows_kept":148,"cut":false,"hidden":false,"merged":[]}
[{"$f":"ROWS(A$1:A1)&\")\"","v":"1)"},"Relative Macro Because each time we do something it needs to be a relative move."]
[{"$f":"ROWS(A$1:A2)&\")\"","v":"2)"},"In 2007, add Developer Ribbon: Alt + F + I, then check Developer Ribbon check box"]
[{"$f":"ROWS(A$1:A3)&\")\"","v":"3)"},"The MACRO recorder is like a tape recorder: it will follow your actions in Excel and instead of recording the sound or visual of your actions, it writes the code that represents your actions."]
[{"$f":"ROWS(A$1:A4)&\")\"","v":"4)"},"Recording an Relative MACRO: 1) The Relative/Absolute recording button must be on; 2) The MACRO records your actions relatively that is to say when you click in the cell 4 rows above, it will always click in the cell 4 above from the realative starting point."]
[{"$f":"ROWS(A$1:A5)&\")\"","v":"5)"},"After you are done, click the Stop Recording button."]
[{"$f":"ROWS(A$1:A6)&\")\"","v":"6)"},"Alt + F8 opens the list of MACROS. You can click the Options button to see or change your keyboard shortcut. Click the Edit button to see the code that the MACRO recorder wrote. After you have read the code, click the close button on the VBA editor window."]
[]
[null,"First","Last","Address","City","State","Zip","Phone","E1","E2"]
[]
[null,"Steve"]
[null,"Chin"]
[null,"14 17th St."]
[null,"Seattle"]
[null,"WA"]
[null,98104]
[null,"206-572-3409"]
[null,{"$f":"B10&\"_\"&B11&\"@notaol.com\"","v":"Steve_Chin@notaol.com"}]
[null,{"$f":"B11&\"_\"&B12&\"@notaol.com\"","v":"Chin_14 17th St.@notaol.com"}]
[]
[null,"Troun"]
[null,"Tenn"]
[null,"6 19th St."]
[null,"Seattle"]
[null,"WA"]
[null,98106]
[null,"206-667-3154"]
[null,{"$f":"B20&\"_\"&B21&\"@notaol.com\"","v":"Troun_Tenn@notaol.com"}]
[null,{"$f":"B21&\"_\"&B22&\"@notaol.com\"","v":"Tenn_6 19th St.@notaol.com"}]
[]
[null,"Rhond"]
[null,"Tradfren"]
[null,"10 13th St."]
[null,"Seattle"]
[null,"WA"]
[null,98117]
[null,"206-574-1265"]
[null,{"$f":"B30&\"_\"&B31&\"@notaol.com\"","v":"Rhond_Tradfren@notaol.com"}]
[null,{"$f":"B31&\"_\"&B32&\"@notaol.com\"","v":"Tradfren_10 13th St.@notaol.com"}]
[]
[null,"Sheli"]
[null,"Das"]
[null,"2 15th St."]
[null,"Seattle"]
[null,"WA"]
[null,98111]
[null,"206-637-4014"]
[null,{"$f":"B40&\"_\"&B41&\"@notaol.com\"","v":"Sheli_Das@notaol.com"}]
[null,{"$f":"B41&\"_\"&B42&\"@notaol.com\"","v":"Das_2 15th St.@notaol.com"}]
[]
[null,"Jon"]
[null,"Teddy"]
[null,"3 17th St."]
[null,"Seattle"]
[null,"WA"]
[null,98114]
[null,"206-515-5102"]
[null,{"$f":"B50&\"_\"&B51&\"@notaol.com\"","v":"Jon_Teddy@notaol.com"}]
[null,{"$f":"B51&\"_\"&B52&\"@notaol.com\"","v":"Teddy_3 17th St.@notaol.com"}]
[]
[null,"Jeri"]
[null,"Yessler"]
[null,"12 16th St."]
[null,"Seattle"]
[null,"WA"]
[null,98114]
[null,"206-583-2943"]
[null,{"$f":"B60&\"_\"&B61&\"@notaol.com\"","v":"Jeri_Yessler@notaol.com"}]
[null,{"$f":"B61&\"_\"&B62&\"@notaol.com\"","v":"Yessler_12 16th St.@notaol.com"}]
[]
[null,"Luke"]
[null,"Suix"]
[null,"8 19th St."]
[null,"Seattle"]
[null,"WA"]
[null,98113]
[null,"206-774-4449"]
[null,{"$f":"B70&\"_\"&B71&\"@notaol.com\"","v":"Luke_Suix@notaol.com"}]
[null,{"$f":"B71&\"_\"&B72&\"@notaol.com\"","v":"Suix_8 19th St.@notaol.com"}]
[]
[null,"Luke"]
[null,"Red"]
[null,"15 16th St."]
[null,"Seattle"]
[null,"WA"]
[null,98108]
[null,"206-685-2311"]
[null,{"$f":"B80&\"_\"&B81&\"@notaol.com\"","v":"Luke_Red@notaol.com"}]
[null,{"$f":"B81&\"_\"&B82&\"@notaol.com\"","v":"Red_15 16th St.@notaol.com"}]
[]
[null,"Jeri"]
[null,"Smythe"]
[null,"14 19th St."]
[null,"Seattle"]
[null,"WA"]
[null,98112]
[null,"206-574-6156"]
[null,{"$f":"B90&\"_\"&B91&\"@notaol.com\"","v":"Jeri_Smythe@notaol.com"}]
[null,{"$f":"B91&\"_\"&B92&\"@notaol.com\"","v":"Smythe_14 19th St.@notaol.com"}]
[]
[null,"Luke"]
[null,"Rad"]
[null,"3 16th St."]
[null,"Seattle"]
[null,"WA"]
[null,98106]
[null,"206-599-3338"]
[null,{"$f":"B100&\"_\"&B101&\"@notaol.com\"","v":"Luke_Rad@notaol.com"}]
[null,{"$f":"B101&\"_\"&B102&\"@notaol.com\"","v":"Rad_3 16th St.@notaol.com"}]
[]
[null,"Jon"]
[null,"Dap"]
[null,"5 19th St."]
[null,"Seattle"]
[null,"WA"]
[null,98116]
[null,"206-679-1485"]
[null,{"$f":"B110&\"_\"&B111&\"@notaol.com\"","v":"Jon_Dap@notaol.com"}]
[null,{"$f":"B111&\"_\"&B112&\"@notaol.com\"","v":"Dap_5 19th St.@notaol.com"}]
[]
[null,"Steve"]
[null,"Gupis"]
[null,"6 17th St."]
[null,"Seattle"]
[null,"WA"]
[null,98111]
[null,"206-609-1507"]
[null,{"$f":"B120&\"_\"&B121&\"@notaol.com\"","v":"Steve_Gupis@notaol.com"}]
[null,{"$f":"B121&\"_\"&B122&\"@notaol.com\"","v":"Gupis_6 17th St.@notaol.com"}]
[]
[null,"Jon"]
[null,"Summi"]
[null,"4 14th St."]
[null,"Seattle"]
[null,"WA"]
[null,98104]
[null,"206-733-4318"]
[null,{"$f":"B130&\"_\"&B131&\"@notaol.com\"","v":"Jon_Summi@notaol.com"}]
[null,{"$f":"B131&\"_\"&B132&\"@notaol.com\"","v":"Summi_4 14th St.@notaol.com"}]
[]
[null,"Sheli"]
[null,"Fun"]
[null,"7 15th St."]
[null,"Seattle"]
[null,"WA"]
[null,98110]
[null,"206-691-7629"]
[null,{"$f":"B140&\"_\"&B141&\"@notaol.com\"","v":"Sheli_Fun@notaol.com"}]
[null,{"$f":"B141&\"_\"&B142&\"@notaol.com\"","v":"Fun_7 15th St.@notaol.com"}]

{"sheet":"M(2.4)","index":176,"n_rows":148,"n_cols":10,"rows_kept":148,"cut":false,"hidden":false,"merged":[]}
[{"$f":"ROWS(A$1:A1)&\")\"","v":"1)"},"Relative Macro Because each time we do something it needs to be a relative move."]
[{"$f":"ROWS(A$1:A2)&\")\"","v":"2)"},"In 2007, add Developer Ribbon: Alt + F + I, then check Developer Ribbon check box"]
[{"$f":"ROWS(A$1:A3)&\")\"","v":"3)"},"The MACRO recorder is like a tape recorder: it will follow your actions in Excel and instead of recording the sound or visual of your actions, it writes the code that represents your actions."]
[{"$f":"ROWS(A$1:A4)&\")\"","v":"4)"},"Recording an Relative MACRO: 1) The Relative/Absolute recording button must be on; 2) The MACRO records your actions relatively that is to say when you click in the cell 4 rows above, it will always click in the cell 4 above from the realative starting point."]
[{"$f":"ROWS(A$1:A5)&\")\"","v":"5)"},"After you are done, click the Stop Recording button."]
[{"$f":"ROWS(A$1:A6)&\")\"","v":"6)"},"Alt + F8 opens the list of MACROS. You can click the Options button to see or change your keyboard shortcut. Click the Edit button to see the code that the MACRO recorder wrote. After you have read the code, click the close button on the VBA editor window."]
[]
[null,"First","Last","Address","City","State","Zip","Phone","E1","E2"]
[]
[null,"Steve"]
[null,"Chin"]
[null,"14 17th St."]
[null,"Seattle"]
[null,"WA"]
[null,98104]
[null,"206-572-3409"]
[null,{"$f":"B10&\"_\"&B11&\"@notaol.com\"","v":"Steve_Chin@notaol.com"}]
[null,{"$f":"B11&\"_\"&B12&\"@notaol.com\"","v":"Chin_14 17th St.@notaol.com"}]
[]
[null,"Troun"]
[null,"Tenn"]
[null,"6 19th St."]
[null,"Seattle"]
[null,"WA"]
[null,98106]
[null,"206-667-3154"]
[null,{"$f":"B20&\"_\"&B21&\"@notaol.com\"","v":"Troun_Tenn@notaol.com"}]
[null,{"$f":"B21&\"_\"&B22&\"@notaol.com\"","v":"Tenn_6 19th St.@notaol.com"}]
[]
[null,"Rhond"]
[null,"Tradfren"]
[null,"10 13th St."]
[null,"Seattle"]
[null,"WA"]
[null,98117]
[null,"206-574-1265"]
[null,{"$f":"B30&\"_\"&B31&\"@notaol.com\"","v":"Rhond_Tradfren@notaol.com"}]
[null,{"$f":"B31&\"_\"&B32&\"@notaol.com\"","v":"Tradfren_10 13th St.@notaol.com"}]
[]
[null,"Sheli"]
[null,"Das"]
[null,"2 15th St."]
[null,"Seattle"]
[null,"WA"]
[null,98111]
[null,"206-637-4014"]
[null,{"$f":"B40&\"_\"&B41&\"@notaol.com\"","v":"Sheli_Das@notaol.com"}]
[null,{"$f":"B41&\"_\"&B42&\"@notaol.com\"","v":"Das_2 15th St.@notaol.com"}]
[]
[null,"Jon"]
[null,"Teddy"]
[null,"3 17th St."]
[null,"Seattle"]
[null,"WA"]
[null,98114]
[null,"206-515-5102"]
[null,{"$f":"B50&\"_\"&B51&\"@notaol.com\"","v":"Jon_Teddy@notaol.com"}]
[null,{"$f":"B51&\"_\"&B52&\"@notaol.com\"","v":"Teddy_3 17th St.@notaol.com"}]
[]
[null,"Jeri"]
[null,"Yessler"]
[null,"12 16th St."]
[null,"Seattle"]
[null,"WA"]
[null,98114]
[null,"206-583-2943"]
[null,{"$f":"B60&\"_\"&B61&\"@notaol.com\"","v":"Jeri_Yessler@notaol.com"}]
[null,{"$f":"B61&\"_\"&B62&\"@notaol.com\"","v":"Yessler_12 16th St.@notaol.com"}]
[]
[null,"Luke"]
[null,"Suix"]
[null,"8 19th St."]
[null,"Seattle"]
[null,"WA"]
[null,98113]
[null,"206-774-4449"]
[null,{"$f":"B70&\"_\"&B71&\"@notaol.com\"","v":"Luke_Suix@notaol.com"}]
[null,{"$f":"B71&\"_\"&B72&\"@notaol.com\"","v":"Suix_8 19th St.@notaol.com"}]
[]
[null,"Luke"]
[null,"Red"]
[null,"15 16th St."]
[null,"Seattle"]
[null,"WA"]
[null,98108]
[null,"206-685-2311"]
[null,{"$f":"B80&\"_\"&B81&\"@notaol.com\"","v":"Luke_Red@notaol.com"}]
[null,{"$f":"B81&\"_\"&B82&\"@notaol.com\"","v":"Red_15 16th St.@notaol.com"}]
[]
[null,"Jeri"]
[null,"Smythe"]
[null,"14 19th St."]
[null,"Seattle"]
[null,"WA"]
[null,98112]
[null,"206-574-6156"]
[null,{"$f":"B90&\"_\"&B91&\"@notaol.com\"","v":"Jeri_Smythe@notaol.com"}]
[null,{"$f":"B91&\"_\"&B92&\"@notaol.com\"","v":"Smythe_14 19th St.@notaol.com"}]
[]
[null,"Luke"]
[null,"Rad"]
[null,"3 16th St."]
[null,"Seattle"]
[null,"WA"]
[null,98106]
[null,"206-599-3338"]
[null,{"$f":"B100&\"_\"&B101&\"@notaol.com\"","v":"Luke_Rad@notaol.com"}]
[null,{"$f":"B101&\"_\"&B102&\"@notaol.com\"","v":"Rad_3 16th St.@notaol.com"}]
[]
[null,"Jon"]
[null,"Dap"]
[null,"5 19th St."]
[null,"Seattle"]
[null,"WA"]
[null,98116]
[null,"206-679-1485"]
[null,{"$f":"B110&\"_\"&B111&\"@notaol.com\"","v":"Jon_Dap@notaol.com"}]
[null,{"$f":"B111&\"_\"&B112&\"@notaol.com\"","v":"Dap_5 19th St.@notaol.com"}]
[]
[null,"Steve"]
[null,"Gupis"]
[null,"6 17th St."]
[null,"Seattle"]
[null,"WA"]
[null,98111]
[null,"206-609-1507"]
[null,{"$f":"B120&\"_\"&B121&\"@notaol.com\"","v":"Steve_Gupis@notaol.com"}]
[null,{"$f":"B121&\"_\"&B122&\"@notaol.com\"","v":"Gupis_6 17th St.@notaol.com"}]
[]
[null,"Jon"]
[null,"Summi"]
[null,"4 14th St."]
[null,"Seattle"]
[null,"WA"]
[null,98104]
[null,"206-733-4318"]
[null,{"$f":"B130&\"_\"&B131&\"@notaol.com\"","v":"Jon_Summi@notaol.com"}]
[null,{"$f":"B131&\"_\"&B132&\"@notaol.com\"","v":"Summi_4 14th St.@notaol.com"}]
[]
[null,"Sheli"]
[null,"Fun"]
[null,"7 15th St."]
[null,"Seattle"]
[null,"WA"]
[null,98110]
[null,"206-691-7629"]
[null,{"$f":"B140&\"_\"&B141&\"@notaol.com\"","v":"Sheli_Fun@notaol.com"}]
[null,{"$f":"B141&\"_\"&B142&\"@notaol.com\"","v":"Fun_7 15th St.@notaol.com"}]

{"sheet":"M(2.5)","index":177,"n_rows":148,"n_cols":10,"rows_kept":148,"cut":false,"hidden":false,"merged":[]}
[{"$f":"ROWS(A$1:A1)&\")\"","v":"1)"},"Relative Macro Because each time we do something it needs to be a relative move."]
[{"$f":"ROWS(A$1:A2)&\")\"","v":"2)"},"In 2007, add Developer Ribbon: Alt + F + I, then check Developer Ribbon check box"]
[{"$f":"ROWS(A$1:A3)&\")\"","v":"3)"},"The MACRO recorder is like a tape recorder: it will follow your actions in Excel and instead of recording the sound or visual of your actions, it writes the code that represents your actions."]
[{"$f":"ROWS(A$1:A4)&\")\"","v":"4)"},"Recording an Relative MACRO: 1) The Relative/Absolute recording button must be on; 2) The MACRO records your actions relatively that is to say when you click in the cell 4 rows above, it will always click in the cell 4 above from the realative starting point."]
[{"$f":"ROWS(A$1:A5)&\")\"","v":"5)"},"After you are done, click the Stop Recording button."]
[{"$f":"ROWS(A$1:A6)&\")\"","v":"6)"},"Alt + F8 opens the list of MACROS. You can click the Options button to see or change your keyboard shortcut. Click the Edit button to see the code that the MACRO recorder wrote. After you have read the code, click the close button on the VBA editor window."]
[]
[null,"First","Last","Address","City","State","Zip","Phone","E1","E2"]
[]
[null,"Steve"]
[null,"Chin"]
[null,"14 17th St."]
[null,"Seattle"]
[null,"WA"]
[null,98104]
[null,"206-572-3409"]
[null,{"$f":"B10&\"_\"&B11&\"@notaol.com\"","v":"Steve_Chin@notaol.com"}]
[null,{"$f":"B11&\"_\"&B12&\"@notaol.com\"","v":"Chin_14 17th St.@notaol.com"}]
[]
[null,"Troun"]
[null,"Tenn"]
[null,"6 19th St."]
[null,"Seattle"]
[null,"WA"]
[null,98106]
[null,"206-667-3154"]
[null,{"$f":"B20&\"_\"&B21&\"@notaol.com\"","v":"Troun_Tenn@notaol.com"}]
[null,{"$f":"B21&\"_\"&B22&\"@notaol.com\"","v":"Tenn_6 19th St.@notaol.com"}]
[]
[null,"Rhond"]
[null,"Tradfren"]
[null,"10 13th St."]
[null,"Seattle"]
[null,"WA"]
[null,98117]
[null,"206-574-1265"]
[null,{"$f":"B30&\"_\"&B31&\"@notaol.com\"","v":"Rhond_Tradfren@notaol.com"}]
[null,{"$f":"B31&\"_\"&B32&\"@notaol.com\"","v":"Tradfren_10 13th St.@notaol.com"}]
[]
[null,"Sheli"]
[null,"Das"]
[null,"2 15th St."]
[null,"Seattle"]
[null,"WA"]
[null,98111]
[null,"206-637-4014"]
[null,{"$f":"B40&\"_\"&B41&\"@notaol.com\"","v":"Sheli_Das@notaol.com"}]
[null,{"$f":"B41&\"_\"&B42&\"@notaol.com\"","v":"Das_2 15th St.@notaol.com"}]
[]
[null,"Jon"]
[null,"Teddy"]
[null,"3 17th St."]
[null,"Seattle"]
[null,"WA"]
[null,98114]
[null,"206-515-5102"]
[null,{"$f":"B50&\"_\"&B51&\"@notaol.com\"","v":"Jon_Teddy@notaol.com"}]
[null,{"$f":"B51&\"_\"&B52&\"@notaol.com\"","v":"Teddy_3 17th St.@notaol.com"}]
[]
[null,"Jeri"]
[null,"Yessler"]
[null,"12 16th St."]
[null,"Seattle"]
[null,"WA"]
[null,98114]
[null,"206-583-2943"]
[null,{"$f":"B60&\"_\"&B61&\"@notaol.com\"","v":"Jeri_Yessler@notaol.com"}]
[null,{"$f":"B61&\"_\"&B62&\"@notaol.com\"","v":"Yessler_12 16th St.@notaol.com"}]
[]
[null,"Luke"]
[null,"Suix"]
[null,"8 19th St."]
[null,"Seattle"]
[null,"WA"]
[null,98113]
[null,"206-774-4449"]
[null,{"$f":"B70&\"_\"&B71&\"@notaol.com\"","v":"Luke_Suix@notaol.com"}]
[null,{"$f":"B71&\"_\"&B72&\"@notaol.com\"","v":"Suix_8 19th St.@notaol.com"}]
[]
[null,"Luke"]
[null,"Red"]
[null,"15 16th St."]
[null,"Seattle"]
[null,"WA"]
[null,98108]
[null,"206-685-2311"]
[null,{"$f":"B80&\"_\"&B81&\"@notaol.com\"","v":"Luke_Red@notaol.com"}]
[null,{"$f":"B81&\"_\"&B82&\"@notaol.com\"","v":"Red_15 16th St.@notaol.com"}]
[]
[null,"Jeri"]
[null,"Smythe"]
[null,"14 19th St."]
[null,"Seattle"]
[null,"WA"]
[null,98112]
[null,"206-574-6156"]
[null,{"$f":"B90&\"_\"&B91&\"@notaol.com\"","v":"Jeri_Smythe@notaol.com"}]
[null,{"$f":"B91&\"_\"&B92&\"@notaol.com\"","v":"Smythe_14 19th St.@notaol.com"}]
[]
[null,"Luke"]
[null,"Rad"]
[null,"3 16th St."]
[null,"Seattle"]
[null,"WA"]
[null,98106]
[null,"206-599-3338"]
[null,{"$f":"B100&\"_\"&B101&\"@notaol.com\"","v":"Luke_Rad@notaol.com"}]
[null,{"$f":"B101&\"_\"&B102&\"@notaol.com\"","v":"Rad_3 16th St.@notaol.com"}]
[]
[null,"Jon"]
[null,"Dap"]
[null,"5 19th St."]
[null,"Seattle"]
[null,"WA"]
[null,98116]
[null,"206-679-1485"]
[null,{"$f":"B110&\"_\"&B111&\"@notaol.com\"","v":"Jon_Dap@notaol.com"}]
[null,{"$f":"B111&\"_\"&B112&\"@notaol.com\"","v":"Dap_5 19th St.@notaol.com"}]
[]
[null,"Steve"]
[null,"Gupis"]
[null,"6 17th St."]
[null,"Seattle"]
[null,"WA"]
[null,98111]
[null,"206-609-1507"]
[null,{"$f":"B120&\"_\"&B121&\"@notaol.com\"","v":"Steve_Gupis@notaol.com"}]
[null,{"$f":"B121&\"_\"&B122&\"@notaol.com\"","v":"Gupis_6 17th St.@notaol.com"}]
[]
[null,"Jon"]
[null,"Summi"]
[null,"4 14th St."]
[null,"Seattle"]
[null,"WA"]
[null,98104]
[null,"206-733-4318"]
[null,{"$f":"B130&\"_\"&B131&\"@notaol.com\"","v":"Jon_Summi@notaol.com"}]
[null,{"$f":"B131&\"_\"&B132&\"@notaol.com\"","v":"Summi_4 14th St.@notaol.com"}]
[]
[null,"Sheli"]
[null,"Fun"]
[null,"7 15th St."]
[null,"Seattle"]
[null,"WA"]
[null,98110]
[null,"206-691-7629"]
[null,{"$f":"B140&\"_\"&B141&\"@notaol.com\"","v":"Sheli_Fun@notaol.com"}]
[null,{"$f":"B141&\"_\"&B142&\"@notaol.com\"","v":"Fun_7 15th St.@notaol.com"}]

{"sheet":"M(3.1)","index":178,"n_rows":33,"n_cols":6,"rows_kept":33,"cut":false,"hidden":false,"merged":[]}
["Date","Time","Temp (F)","Celsius",null,"Relative & Absolute Macro because the table is different sizes each  time, and sometimes we are moving relatively and sometimes absolutely."]
["2009-04-01","17:07:18.708",42.92,{"$f":"CONVERT(C2,\"F\",\"C\")","v":6.0666666666666673}]
["2009-04-02","23:49:58.762",42.61,{"$f":"CONVERT(C3,\"F\",\"C\")","v":5.8944444444444439}]
["2009-04-03","11:59:10.701",49.69,9.8277777777777757]
["2009-04-04","22:41:23.238",44.58,6.988888888888888]
["2009-04-05","00:20:05.128",43.03,6.1277777777777782]
["2009-04-06","11:49:22.327",43.94,6.633333333333332]
["2009-04-07","20:02:30.344",43.74,6.522222222222223]
["2009-04-08","22:23:35.341",48.37,9.0944444444444432]
["2009-04-09","00:44:26.639",42.56,5.866666666666668]
["2009-04-10","08:53:54.036",41.18,5.0999999999999996]
["2009-04-11","05:51:37.917",47.980000000000004,8.87777777777778]
["2009-04-12","05:19:06.640",47.62,8.6777777777777754]
["2009-04-13","17:34:57.066",44.99,7.2166666666666677]
["2009-04-14","11:46:21.218",43.41,6.3388888888888868]
["2009-04-15","06:29:31.734",41.82,5.4555555555555557]
["2009-04-16","11:52:54.386",49.31,9.6166666666666671]
["2009-04-17","17:27:17.793",42.77,5.9833333333333352]
["2009-04-18","01:52:24.064",45.769999999999996,7.6499999999999977]
["2009-04-19","00:37:02.355",42.04,5.5777777777777775]
["2009-04-20","23:57:22.639",41.81,5.4500000000000011]
["2009-04-21","11:52:54.386",39.621000000000002,4.2338888888888899]
["2009-04-22","17:27:17.793",38.048000000000002,3.3600000000000008]
["2009-04-23","01:52:24.064",36.475000000000001,2.486111111111112]
["2009-04-24","00:37:02.355",34.902000000000001,1.6122222222222227]
["2009-04-25","23:57:22.639",33.329000000000001,0.73833333333333362]
["2009-04-26","11:52:54.386",31.756,-0.13555555555555543]
["2009-04-27","17:27:17.793",30.183,-1.0094444444444446]
["2009-04-28","01:52:24.064",28.61,-1.8833333333333335]
["2009-04-29","00:37:02.355",41.81,5.4500000000000011]
["2009-04-30","23:57:22.639",44.99,7.2166666666666677]
[]
[null,null,"Ave",{"$f":"AVERAGE($D$2:D31)","v":5.3678518518518521}]

{"sheet":"M(3.2)","index":179,"n_rows":34,"n_cols":6,"rows_kept":34,"cut":false,"hidden":false,"merged":[]}
["Date","Time","Temp (F)","Celsius",null,"Relative & Absolute Macro because the table is different sizes each  time, and sometimes we are moving relatively and sometimes absolutely."]
["2009-05-01","17:07:18.708",42.92,{"$f":"CONVERT(C2,\"F\",\"C\")","v":6.0666666666666673}]
["2009-05-02","23:49:58.762",42.61,{"$f":"CONVERT(C3,\"F\",\"C\")","v":5.8944444444444439}]
["2009-05-03","11:59:10.701",49.69,9.8277777777777757]
["2009-05-04","22:41:23.238",44.58,6.988888888888888]
["2009-05-05","00:20:05.128",43.03,6.1277777777777782]
["2009-05-06","11:49:22.327",43.94,6.633333333333332]
["2009-05-07","20:02:30.344",43.74,6.522222222222223]
["2009-05-08","22:23:35.341",48.37,9.0944444444444432]
["2009-05-09","00:44:26.639",42.56,5.866666666666668]
["2009-05-10","08:53:54.036",41.18,5.0999999999999996]
["2009-05-11","05:51:37.917",47.980000000000004,8.87777777777778]
["2009-05-12","05:19:06.640",47.62,8.6777777777777754]
["2009-05-13","17:34:57.066",44.99,7.2166666666666677]
["2009-05-14","11:46:21.218",43.41,6.3388888888888868]
["2009-05-15","06:29:31.734",41.82,5.4555555555555557]
["2009-05-16","11:52:54.386",49.31,9.6166666666666671]
["2009-05-17","17:27:17.793",42.77,5.9833333333333352]
["2009-05-18","01:52:24.064",45.769999999999996,7.6499999999999977]
["2009-05-19","00:37:02.355",42.04,5.5777777777777775]
["2009-05-20","23:57:22.639",41.81,5.4500000000000011]
["2009-05-21","11:52:54.386",39.621000000000002,4.2338888888888899]
["2009-05-22","17:27:17.793",38.048000000000002,3.3600000000000008]
["2009-05-23","01:52:24.064",36.475000000000001,2.486111111111112]
["2009-05-24","00:37:02.355",34.902000000000001,1.6122222222222227]
["2009-05-25","23:57:22.639",33.329000000000001,0.73833333333333362]
["2009-05-26","11:52:54.386",31.756,-0.13555555555555543]
["2009-05-27","17:27:17.793",30.183,-1.0094444444444446]
["2009-05-28","01:52:24.064",28.61,-1.8833333333333335]
["2009-05-29","00:37:02.355",41.81,5.4500000000000011]
["2009-05-30","23:57:22.639",44.99,7.2166666666666677]
["2009-05-31",1.0398453573348601,45.99,7.772222222222223]
[]
[null,null,"Ave",{"$f":"AVERAGE($D$2:D32)","v":5.4454121863799285}]

{"sheet":"M(3.3)","index":180,"n_rows":96,"n_cols":6,"rows_kept":96,"cut":false,"hidden":false,"merged":[]}
["Date","Time","Temp (F)","Celsius",null,"Relative & Absolute Macro because the table is different sizes each  time, and sometimes we are moving relatively and sometimes absolutely."]
["2009-06-01","17:07:18.708",42.92,{"$f":"CONVERT(C2,\"F\",\"C\")","v":6.0666666666666673}]
["2009-06-02","23:49:58.762",42.61,{"$f":"CONVERT(C3,\"F\",\"C\")","v":5.8944444444444439}]
["2009-06-03","11:59:10.701",49.69,9.8277777777777757]
["2009-06-04","22:41:23.238",44.58,6.988888888888888]
["2009-06-05","00:20:05.128",43.03,6.1277777777777782]
["2009-06-06","11:49:22.327",43.94,6.633333333333332]
["2009-06-07","20:02:30.344",43.74,6.522222222222223]
["2009-06-08","22:23:35.341",48.37,9.0944444444444432]
["2009-06-09","00:44:26.639",42.56,5.866666666666668]
["2009-06-10","08:53:54.036",41.18,5.0999999999999996]
["2009-06-11","05:51:37.917",47.980000000000004,8.87777777777778]
["2009-06-12","05:19:06.640",47.62,8.6777777777777754]
["2009-06-13","17:34:57.066",44.99,7.2166666666666677]
["2009-06-14","11:46:21.218",43.41,6.3388888888888868]
["2009-06-15","06:29:31.734",41.82,5.4555555555555557]
["2009-06-16","11:52:54.386",49.31,9.6166666666666671]
["2009-06-17","17:27:17.793",42.77,5.9833333333333352]
["2009-06-18","01:52:24.064",45.769999999999996,7.6499999999999977]
["2009-06-19","00:37:02.355",42.04,5.5777777777777775]
["2009-06-20","23:57:22.639",41.81,5.4500000000000011]
["2009-06-21","11:52:54.386",39.621000000000002,4.2338888888888899]
["2009-06-22","17:27:17.793",38.048000000000002,3.3600000000000008]
["2009-06-23","01:52:24.064",36.475000000000001,2.486111111111112]
["2009-06-24","00:37:02.355",34.902000000000001,1.6122222222222227]
["2009-06-25","23:57:22.639",33.329000000000001,0.73833333333333362]
["2009-06-26","11:52:54.386",31.756,-0.13555555555555543]
["2009-06-27","17:27:17.793",30.183,-1.0094444444444446]
["2009-06-28","01:52:24.064",28.61,-1.8833333333333335]
["2009-06-29","02:52:24.064",29.61,-1.3277777777777782]
["2009-06-30","03:52:24.064",30.61,-0.77222222222222248]
["2009-07-01","04:52:24.064",31.61,-0.21666666666666698]
["2009-07-02","05:52:24.064",32.61,0.33888888888888857]
["2009-07-03","06:52:24.064",33.61,0.89444444444444415]
["2009-07-04","07:52:24.064",34.61,1.4499999999999997]
["2009-07-05","08:52:24.064",35.61,2.0055555555555551]
["2009-07-06","09:52:24.064",36.61,2.5611111111111109]
["2009-07-07","10:52:24.064",37.61,3.1166666666666663]
["2009-07-08","11:52:24.064",38.61,3.6722222222222216]
["2009-07-09","12:52:24.064",39.61,4.227777777777777]
["2009-07-10","13:52:24.064",40.61,4.7833333333333332]
["2009-07-11","14:52:24.064",41.61,5.3388888888888886]
["2009-07-12","15:52:24.064",42.61,5.8944444444444439]
["2009-07-13","16:52:24.064",43.61,6.4499999999999993]
["2009-07-14","17:52:24.064",44.61,7.0055555555555546]
["2009-07-15","18:52:24.064",45.61,7.5611111111111109]
["2009-07-16","19:52:24.064",46.61,8.1166666666666654]
["2009-07-17","20:52:24.064",47.61,8.6722222222222225]
["2009-07-18","21:52:24.064",48.61,9.2277777777777779]
["2009-07-19","22:52:24.064",49.61,9.7833333333333332]
["2009-07-20","23:52:24.064",50.61,10.338888888888889]
["2009-07-21",1.03638962992073,51.61,10.894444444444444]
["2009-07-22",1.0780562965873901,52.61,11.45]
["2009-07-23",1.11972296325406,53.61,12.005555555555555]
["2009-07-24",1.16138962992073,54.61,12.56111111111111]
["2009-07-25",1.2030562965873901,55.61,13.116666666666665]
["2009-07-26",1.24472296325406,56.61,13.672222222222221]
["2009-07-27",1.28638962992073,57.61,14.227777777777778]
["2009-07-28",1.3280562965873901,58.61,14.783333333333333]
["2009-07-29",1.36972296325406,59.61,15.338888888888889]
["2009-07-30",1.41138962992073,60.61,15.894444444444444]
["2009-07-31",1.4530562965873901,61.61,16.45]
["2009-08-01",1.49472296325406,62.61,17.005555555555556]
["2009-08-02",1.53638962992073,63.61,17.56111111111111]
["2009-08-03",1.5780562965873901,64.61,18.116666666666667]
["2009-08-04",1.61972296325406,65.61,18.672222222222221]
["2009-08-05",1.66138962992073,66.61,{"$f":"CONVERT(C67,\"F\",\"C\")","v":19.227777777777778}]
["2009-08-06",1.7030562965873901,67.61,19.783333333333331]
["2009-08-07",1.74472296325406,68.61,20.338888888888889]
["2009-08-08",1.78638962992073,69.61,20.894444444444442]
["2009-08-09",1.8280562965873901,70.61,21.45]
["2009-08-10",1.86972296325406,71.61,22.005555555555556]
["2009-08-11",1.91138962992073,72.61,22.56111111111111]
["2009-08-12",1.9530562965873901,73.61,23.116666666666667]
["2009-08-13",1.99472296325406,74.61,23.672222222222221]
["2009-08-14",2.03638962992073,75.61,24.227777777777778]
["2009-08-15",2.0780562965873899,76.61,24.783333333333331]
["2009-08-16",2.11972296325406,77.61,25.338888888888889]
["2009-08-17",2.16138962992073,78.61,25.894444444444442]
["2009-08-18",2.2030562965873899,79.61,26.45]
["2009-08-19",2.24472296325406,80.61,27.005555555555553]
["2009-08-20",2.28638962992073,81.61,27.56111111111111]
["2009-08-21",2.3280562965873899,82.61,28.116666666666667]
["2009-08-22",2.36972296325406,83.61,28.672222222222221]
["2009-08-23",2.41138962992073,84.61,29.227777777777778]
["2009-08-24",2.4530562965873899,85.61,29.783333333333331]
["2009-08-25",2.49472296325406,86.61,30.338888888888889]
["2009-08-26",2.53638962992073,87.61,30.894444444444442]
["2009-08-27",2.5780562965873899,88.61,31.45]
["2009-08-28",2.61972296325406,89.61,32.005555555555553]
["2009-08-29",2.66138962992073,90.61,32.56111111111111]
["2009-08-30",2.7030562965873899,91.61,33.116666666666667]
["2009-08-31",2.74472296325406,92.61,33.672222222222224]
["2009-09-01",2.78638962992073,93.61,34.227777777777774]
[]
[null,null,"Ave",{"$f":"AVERAGE($D$2:D94)","v":13.092676224611706}]

{"sheet":"M(4.1)","index":181,"n_rows":31,"n_cols":6,"rows_kept":31,"cut":false,"hidden":false,"merged":[]}
["Date","Time","Temp (F)",null,null,"Relative & Absolute Macro because the table is different sizes each  time, and sometimes we are moving relatively and sometimes absolutely."]
["2009-04-01","17:07:18.708",42.92]
["2009-04-02","23:49:58.762",42.61]
["2009-04-03","11:59:10.701",49.69]
["2009-04-04","22:41:23.238",44.58]
["2009-04-05","00:20:05.128",43.03]
["2009-04-06","11:49:22.327",43.94]
["2009-04-07","20:02:30.344",43.74]
["2009-04-08","22:23:35.341",48.37]
["2009-04-09","00:44:26.639",42.56]
["2009-04-10","08:53:54.036",41.18]
["2009-04-11","05:51:37.917",47.980000000000004]
["2009-04-12","05:19:06.640",47.62]
["2009-04-13","17:34:57.066",44.99]
["2009-04-14","11:46:21.218",43.41]
["2009-04-15","06:29:31.734",41.82]
["2009-04-16","11:52:54.386",49.31]
["2009-04-17","17:27:17.793",42.77]
["2009-04-18","01:52:24.064",45.769999999999996]
["2009-04-19","00:37:02.355",42.04]
["2009-04-20","23:57:22.639",41.81]
["2009-04-21","11:52:54.386",39.621000000000002]
["2009-04-22","17:27:17.793",38.048000000000002]
["2009-04-23","01:52:24.064",36.475000000000001]
["2009-04-24","00:37:02.355",34.902000000000001]
["2009-04-25","23:57:22.639",33.329000000000001]
["2009-04-26","11:52:54.386",31.756]
["2009-04-27","17:27:17.793",30.183]
["2009-04-28","01:52:24.064",28.61]
["2009-04-29","00:37:02.355",41.81]
["2009-04-30","23:57:22.639",44.99]

{"sheet":"M(4.2)","index":182,"n_rows":32,"n_cols":6,"rows_kept":32,"cut":false,"hidden":false,"merged":[]}
["Date","Time","Temp (F)",null,null,"Relative & Absolute Macro because the table is different sizes each  time, and sometimes we are moving relatively and sometimes absolutely."]
["2009-05-01","17:07:18.708",42.92]
["2009-05-02","23:49:58.762",42.61]
["2009-05-03","11:59:10.701",49.69]
["2009-05-04","22:41:23.238",44.58]
["2009-05-05","00:20:05.128",43.03]
["2009-05-06","11:49:22.327",43.94]
["2009-05-07","20:02:30.344",43.74]
["2009-05-08","22:23:35.341",48.37]
["2009-05-09","00:44:26.639",42.56]
["2009-05-10","08:53:54.036",41.18]
["2009-05-11","05:51:37.917",47.980000000000004]
["2009-05-12","05:19:06.640",47.62]
["2009-05-13","17:34:57.066",44.99]
["2009-05-14","11:46:21.218",43.41]
["2009-05-15","06:29:31.734",41.82]
["2009-05-16","11:52:54.386",49.31]
["2009-05-17","17:27:17.793",42.77]
["2009-05-18","01:52:24.064",45.769999999999996]
["2009-05-19","00:37:02.355",42.04]
["2009-05-20","23:57:22.639",41.81]
["2009-05-21","11:52:54.386",39.621000000000002]
["2009-05-22","17:27:17.793",38.048000000000002]
["2009-05-23","01:52:24.064",36.475000000000001]
["2009-05-24","00:37:02.355",34.902000000000001]
["2009-05-25","23:57:22.639",33.329000000000001]
["2009-05-26","11:52:54.386",31.756]
["2009-05-27","17:27:17.793",30.183]
["2009-05-28","01:52:24.064",28.61]
["2009-05-29","00:37:02.355",41.81]
["2009-05-30","23:57:22.639",44.99]
["2009-05-31",1.0398453573348601,45.99]

{"sheet":"M(4.3)","index":183,"n_rows":94,"n_cols":6,"rows_kept":94,"cut":false,"hidden":false,"merged":[]}
["Date","Time","Temp (F)",null,null,"Relative & Absolute Macro because the table is different sizes each  time, and sometimes we are moving relatively and sometimes absolutely."]
["2009-06-01","17:07:18.708",42.92]
["2009-06-02","23:49:58.762",42.61]
["2009-06-03","11:59:10.701",49.69]
["2009-06-04","22:41:23.238",44.58]
["2009-06-05","00:20:05.128",43.03]
["2009-06-06","11:49:22.327",43.94]
["2009-06-07","20:02:30.344",43.74]
["2009-06-08","22:23:35.341",48.37]
["2009-06-09","00:44:26.639",42.56]
["2009-06-10","08:53:54.036",41.18]
["2009-06-11","05:51:37.917",47.980000000000004]
["2009-06-12","05:19:06.640",47.62]
["2009-06-13","17:34:57.066",44.99]
["2009-06-14","11:46:21.218",43.41]
["2009-06-15","06:29:31.734",41.82]
["2009-06-16","11:52:54.386",49.31]
["2009-06-17","17:27:17.793",42.77]
["2009-06-18","01:52:24.064",45.769999999999996]
["2009-06-19","00:37:02.355",42.04]
["2009-06-20","23:57:22.639",41.81]
["2009-06-21","11:52:54.386",39.621000000000002]
["2009-06-22","17:27:17.793",38.048000000000002]
["2009-06-23","01:52:24.064",36.475000000000001]
["2009-06-24","00:37:02.355",34.902000000000001]
["2009-06-25","23:57:22.639",33.329000000000001]
["2009-06-26","11:52:54.386",31.756]
["2009-06-27","17:27:17.793",30.183]
["2009-06-28","01:52:24.064",28.61]
["2009-06-29","02:52:24.064",29.61]
["2009-06-30","03:52:24.064",30.61]
["2009-07-01","04:52:24.064",31.61]
["2009-07-02","05:52:24.064",32.61]
["2009-07-03","06:52:24.064",33.61]
["2009-07-04","07:52:24.064",34.61]
["2009-07-05","08:52:24.064",35.61]
["2009-07-06","09:52:24.064",36.61]
["2009-07-07","10:52:24.064",37.61]
["2009-07-08","11:52:24.064",38.61]
["2009-07-09","12:52:24.064",39.61]
["2009-07-10","13:52:24.064",40.61]
["2009-07-11","14:52:24.064",41.61]
["2009-07-12","15:52:24.064",42.61]
["2009-07-13","16:52:24.064",43.61]
["2009-07-14","17:52:24.064",44.61]
["2009-07-15","18:52:24.064",45.61]
["2009-07-16","19:52:24.064",46.61]
["2009-07-17","20:52:24.064",47.61]
["2009-07-18","21:52:24.064",48.61]
["2009-07-19","22:52:24.064",49.61]
["2009-07-20","23:52:24.064",50.61]
["2009-07-21",1.03638962992073,51.61]
["2009-07-22",1.0780562965873901,52.61]
["2009-07-23",1.11972296325406,53.61]
["2009-07-24",1.16138962992073,54.61]
["2009-07-25",1.2030562965873901,55.61]
["2009-07-26",1.24472296325406,56.61]
["2009-07-27",1.28638962992073,57.61]
["2009-07-28",1.3280562965873901,58.61]
["2009-07-29",1.36972296325406,59.61]
["2009-07-30",1.41138962992073,60.61]
["2009-07-31",1.4530562965873901,61.61]
["2009-08-01",1.49472296325406,62.61]
["2009-08-02",1.53638962992073,63.61]
["2009-08-03",1.5780562965873901,64.61]
["2009-08-04",1.61972296325406,65.61]
["2009-08-05",1.66138962992073,66.61]
["2009-08-06",1.7030562965873901,67.61]
["2009-08-07",1.74472296325406,68.61]
["2009-08-08",1.78638962992073,69.61]
["2009-08-09",1.8280562965873901,70.61]
["2009-08-10",1.86972296325406,71.61]
["2009-08-11",1.91138962992073,72.61]
["2009-08-12",1.9530562965873901,73.61]
["2009-08-13",1.99472296325406,74.61]
["2009-08-14",2.03638962992073,75.61]
["2009-08-15",2.0780562965873899,76.61]
["2009-08-16",2.11972296325406,77.61]
["2009-08-17",2.16138962992073,78.61]
["2009-08-18",2.2030562965873899,79.61]
["2009-08-19",2.24472296325406,80.61]
["2009-08-20",2.28638962992073,81.61]
["2009-08-21",2.3280562965873899,82.61]
["2009-08-22",2.36972296325406,83.61]
["2009-08-23",2.41138962992073,84.61]
["2009-08-24",2.4530562965873899,85.61]
["2009-08-25",2.49472296325406,86.61]
["2009-08-26",2.53638962992073,87.61]
["2009-08-27",2.5780562965873899,88.61]
["2009-08-28",2.61972296325406,89.61]
["2009-08-29",2.66138962992073,90.61]
["2009-08-30",2.7030562965873899,91.61]
["2009-08-31",2.74472296325406,92.61]
["2009-09-01",2.78638962992073,93.61]

{"sheet":"LastVideo","index":184,"n_rows":24,"n_cols":9,"rows_kept":24,"cut":false,"hidden":false,"merged":[]}
["Date","Product","SalesRep","Sales",null,"OR",null,"AND"]
["2011-02-09","Sunset","Chin",504,null,"Product","Product","Year","Count"]
["2011-08-30","Sunset","Gault",1239,null,"Carlota","Quad",2011,{"$f":"IFERROR(SUMPRODUCT(((ProductDR=$F$3)+(ProductDR=$G$3))*(YEAR(DateDR)=H3)),0)","v":3}]
["2011-09-21","Quad","Sioux",621]
["2012-03-31","Carlota","Smith",966,null,"Extract Records"]
["2012-05-17","Quad","Sioux",1323,null,{"$f":"A1","v":"Date"},"Product","SalesRep","Sales"]
["2012-07-16","Sunshine","Sioux",988,null,{"$f":"IF(ROWS(F$7:F7)>$I$3,\"\",INDEX(MyDynamicTable,SMALL(IF(((ProductDR=$F$3)+(ProductDR=$G$3))*(YEAR(DateDR)=$H$3),ROW(DateDR)-ROW($A$2)+1),ROWS(F$7:F7)),COLUMNS($F7:F7)))","v":"2011-09-21"},{"$f":"IF(ROWS(G$7:G7)>$I$3,\"\",INDEX(MyDynamicTable,SMALL(IF(((ProductDR=$F$3)+(ProductDR=$G$3))*(YEAR(DateDR)=$H$3),ROW(DateDR)-ROW($A$2)+1),ROWS(G$7:G7)),COLUMNS($F7:G7)))","v":"Quad"},{"$f":"IF(ROWS(H$7:H7)>$I$3,\"\",INDEX(MyDynamicTable,SMALL(IF(((ProductDR=$F$3)+(ProductDR=$G$3))*(YEAR(DateDR)=$H$3),ROW(DateDR)-ROW($A$2)+1),ROWS(H$7:H7)),COLUMNS($F7:H7)))","v":"Sioux"},{"$f":"IF(ROWS(I$7:I7)>$I$3,\"\",INDEX(MyDynamicTable,SMALL(IF(((ProductDR=$F$3)+(ProductDR=$G$3))*(YEAR(DateDR)=$H$3),ROW(DateDR)-ROW($A$2)+1),ROWS(I$7:I7)),COLUMNS($F7:I7)))","v":621}]
["2012-08-19","Bellen","Pham",682,null,{"$f":"IF(ROWS(F$7:F8)>$I$3,\"\",INDEX(MyDynamicTable,SMALL(IF(((ProductDR=$F$3)+(ProductDR=$G$3))*(YEAR(DateDR)=$H$3),ROW(DateDR)-ROW($A$2)+1),ROWS(F$7:F8)),COLUMNS($F8:F8)))","v":"2011-02-28"},{"$f":"IF(ROWS(G$7:G8)>$I$3,\"\",INDEX(MyDynamicTable,SMALL(IF(((ProductDR=$F$3)+(ProductDR=$G$3))*(YEAR(DateDR)=$H$3),ROW(DateDR)-ROW($A$2)+1),ROWS(G$7:G8)),COLUMNS($F8:G8)))","v":"Quad"},{"$f":"IF(ROWS(H$7:H8)>$I$3,\"\",INDEX(MyDynamicTable,SMALL(IF(((ProductDR=$F$3)+(ProductDR=$G$3))*(YEAR(DateDR)=$H$3),ROW(DateDR)-ROW($A$2)+1),ROWS(H$7:H8)),COLUMNS($F8:H8)))","v":"Chin"},{"$f":"IF(ROWS(I$7:I8)>$I$3,\"\",INDEX(MyDynamicTable,SMALL(IF(((ProductDR=$F$3)+(ProductDR=$G$3))*(YEAR(DateDR)=$H$3),ROW(DateDR)-ROW($A$2)+1),ROWS(I$7:I8)),COLUMNS($F8:I8)))","v":2000}]
["2011-09-24","Sunset","Gault",315,null,{"$f":"IF(ROWS(F$7:F9)>$I$3,\"\",INDEX(MyDynamicTable,SMALL(IF(((ProductDR=$F$3)+(ProductDR=$G$3))*(YEAR(DateDR)=$H$3),ROW(DateDR)-ROW($A$2)+1),ROWS(F$7:F9)),COLUMNS($F9:F9)))","v":"2011-02-28"},{"$f":"IF(ROWS(G$7:G9)>$I$3,\"\",INDEX(MyDynamicTable,SMALL(IF(((ProductDR=$F$3)+(ProductDR=$G$3))*(YEAR(DateDR)=$H$3),ROW(DateDR)-ROW($A$2)+1),ROWS(G$7:G9)),COLUMNS($F9:G9)))","v":"Quad"},{"$f":"IF(ROWS(H$7:H9)>$I$3,\"\",INDEX(MyDynamicTable,SMALL(IF(((ProductDR=$F$3)+(ProductDR=$G$3))*(YEAR(DateDR)=$H$3),ROW(DateDR)-ROW($A$2)+1),ROWS(H$7:H9)),COLUMNS($F9:H9)))","v":"Chin"},{"$f":"IF(ROWS(I$7:I9)>$I$3,\"\",INDEX(MyDynamicTable,SMALL(IF(((ProductDR=$F$3)+(ProductDR=$G$3))*(YEAR(DateDR)=$H$3),ROW(DateDR)-ROW($A$2)+1),ROWS(I$7:I9)),COLUMNS($F9:I9)))","v":2000}]
["2012-11-29","Bellen","Chin",1188,null,{"$f":"IF(ROWS(F$7:F10)>$I$3,\"\",INDEX(MyDynamicTable,SMALL(IF(((ProductDR=$F$3)+(ProductDR=$G$3))*(YEAR(DateDR)=$H$3),ROW(DateDR)-ROW($A$2)+1),ROWS(F$7:F10)),COLUMNS($F10:F10)))","v":""},{"$f":"IF(ROWS(G$7:G10)>$I$3,\"\",INDEX(MyDynamicTable,SMALL(IF(((ProductDR=$F$3)+(ProductDR=$G$3))*(YEAR(DateDR)=$H$3),ROW(DateDR)-ROW($A$2)+1),ROWS(G$7:G10)),COLUMNS($F10:G10)))","v":""},{"$f":"IF(ROWS(H$7:H10)>$I$3,\"\",INDEX(MyDynamicTable,SMALL(IF(((ProductDR=$F$3)+(ProductDR=$G$3))*(YEAR(DateDR)=$H$3),ROW(DateDR)-ROW($A$2)+1),ROWS(H$7:H10)),COLUMNS($F10:H10)))","v":""},{"$f":"IF(ROWS(I$7:I10)>$I$3,\"\",INDEX(MyDynamicTable,SMALL(IF(((ProductDR=$F$3)+(ProductDR=$G$3))*(YEAR(DateDR)=$H$3),ROW(DateDR)-ROW($A$2)+1),ROWS(I$7:I10)),COLUMNS($F10:I10)))","v":""}]
["2011-02-28","Quad","Chin",2000,null,{"$f":"IF(ROWS(F$7:F11)>$I$3,\"\",INDEX(MyDynamicTable,SMALL(IF(((ProductDR=$F$3)+(ProductDR=$G$3))*(YEAR(DateDR)=$H$3),ROW(DateDR)-ROW($A$2)+1),ROWS(F$7:F11)),COLUMNS($F11:F11)))","v":""},{"$f":"IF(ROWS(G$7:G11)>$I$3,\"\",INDEX(MyDynamicTable,SMALL(IF(((ProductDR=$F$3)+(ProductDR=$G$3))*(YEAR(DateDR)=$H$3),ROW(DateDR)-ROW($A$2)+1),ROWS(G$7:G11)),COLUMNS($F11:G11)))","v":""},{"$f":"IF(ROWS(H$7:H11)>$I$3,\"\",INDEX(MyDynamicTable,SMALL(IF(((ProductDR=$F$3)+(ProductDR=$G$3))*(YEAR(DateDR)=$H$3),ROW(DateDR)-ROW($A$2)+1),ROWS(H$7:H11)),COLUMNS($F11:H11)))","v":""},{"$f":"IF(ROWS(I$7:I11)>$I$3,\"\",INDEX(MyDynamicTable,SMALL(IF(((ProductDR=$F$3)+(ProductDR=$G$3))*(YEAR(DateDR)=$H$3),ROW(DateDR)-ROW($A$2)+1),ROWS(I$7:I11)),COLUMNS($F11:I11)))","v":""}]
["2011-02-28","Quad","Chin",2000,null,{"$f":"IF(ROWS(F$7:F12)>$I$3,\"\",INDEX(MyDynamicTable,SMALL(IF(((ProductDR=$F$3)+(ProductDR=$G$3))*(YEAR(DateDR)=$H$3),ROW(DateDR)-ROW($A$2)+1),ROWS(F$7:F12)),COLUMNS($F12:F12)))","v":""},{"$f":"IF(ROWS(G$7:G12)>$I$3,\"\",INDEX(MyDynamicTable,SMALL(IF(((ProductDR=$F$3)+(ProductDR=$G$3))*(YEAR(DateDR)=$H$3),ROW(DateDR)-ROW($A$2)+1),ROWS(G$7:G12)),COLUMNS($F12:G12)))","v":""},{"$f":"IF(ROWS(H$7:H12)>$I$3,\"\",INDEX(MyDynamicTable,SMALL(IF(((ProductDR=$F$3)+(ProductDR=$G$3))*(YEAR(DateDR)=$H$3),ROW(DateDR)-ROW($A$2)+1),ROWS(H$7:H12)),COLUMNS($F12:H12)))","v":""},{"$f":"IF(ROWS(I$7:I12)>$I$3,\"\",INDEX(MyDynamicTable,SMALL(IF(((ProductDR=$F$3)+(ProductDR=$G$3))*(YEAR(DateDR)=$H$3),ROW(DateDR)-ROW($A$2)+1),ROWS(I$7:I12)),COLUMNS($F12:I12)))","v":""}]
[null,null,null,null,null,{"$f":"IF(ROWS(F$7:F13)>$I$3,\"\",INDEX(MyDynamicTable,SMALL(IF(((ProductDR=$F$3)+(ProductDR=$G$3))*(YEAR(DateDR)=$H$3),ROW(DateDR)-ROW($A$2)+1),ROWS(F$7:F13)),COLUMNS($F13:F13)))","v":""},{"$f":"IF(ROWS(G$7:G13)>$I$3,\"\",INDEX(MyDynamicTable,SMALL(IF(((ProductDR=$F$3)+(ProductDR=$G$3))*(YEAR(DateDR)=$H$3),ROW(DateDR)-ROW($A$2)+1),ROWS(G$7:G13)),COLUMNS($F13:G13)))","v":""},{"$f":"IF(ROWS(H$7:H13)>$I$3,\"\",INDEX(MyDynamicTable,SMALL(IF(((ProductDR=$F$3)+(ProductDR=$G$3))*(YEAR(DateDR)=$H$3),ROW(DateDR)-ROW($A$2)+1),ROWS(H$7:H13)),COLUMNS($F13:H13)))","v":""},{"$f":"IF(ROWS(I$7:I13)>$I$3,\"\",INDEX(MyDynamicTable,SMALL(IF(((ProductDR=$F$3)+(ProductDR=$G$3))*(YEAR(DateDR)=$H$3),ROW(DateDR)-ROW($A$2)+1),ROWS(I$7:I13)),COLUMNS($F13:I13)))","v":""}]
[{"$f":"$A$2:INDEX($A$2:$A$12,COUNTA($A$2:$A$12))","v":40583},{"$f":"$B$2:INDEX($B$2:$B$12,COUNTA($B$2:$B$12))","v":"Sunset"},{"$f":"$C$2:INDEX($C$2:$C$12,COUNTA($C$2:$C$12))","v":"Chin"},{"$f":"$D$2:INDEX($D$2:$D$12,COUNTA($D$2:$D$12))","v":504},null,{"$f":"IF(ROWS(F$7:F14)>$I$3,\"\",INDEX(MyDynamicTable,SMALL(IF(((ProductDR=$F$3)+(ProductDR=$G$3))*(YEAR(DateDR)=$H$3),ROW(DateDR)-ROW($A$2)+1),ROWS(F$7:F14)),COLUMNS($F14:F14)))","v":""},{"$f":"IF(ROWS(G$7:G14)>$I$3,\"\",INDEX(MyDynamicTable,SMALL(IF(((ProductDR=$F$3)+(ProductDR=$G$3))*(YEAR(DateDR)=$H$3),ROW(DateDR)-ROW($A$2)+1),ROWS(G$7:G14)),COLUMNS($F14:G14)))","v":""},{"$f":"IF(ROWS(H$7:H14)>$I$3,\"\",INDEX(MyDynamicTable,SMALL(IF(((ProductDR=$F$3)+(ProductDR=$G$3))*(YEAR(DateDR)=$H$3),ROW(DateDR)-ROW($A$2)+1),ROWS(H$7:H14)),COLUMNS($F14:H14)))","v":""},{"$f":"IF(ROWS(I$7:I14)>$I$3,\"\",INDEX(MyDynamicTable,SMALL(IF(((ProductDR=$F$3)+(ProductDR=$G$3))*(YEAR(DateDR)=$H$3),ROW(DateDR)-ROW($A$2)+1),ROWS(I$7:I14)),COLUMNS($F14:I14)))","v":""}]
[{"$f":"$A$2:INDEX($A$2:$D$12,COUNTA($A$2:$A$12),4)","v":40583}]
[null,null,null,null,null,{"$f":"ROWS(F$7:F7)","v":1},{"$f":"ROWS(G$7:G7)","v":1},{"$f":"ROWS(H$7:H7)","v":1},{"$f":"ROWS(I$7:I7)","v":1}]
[null,null,null,null,null,{"$f":"ROWS(F$7:F8)","v":2},{"$f":"ROWS(G$7:G8)","v":2},{"$f":"ROWS(H$7:H8)","v":2},{"$f":"ROWS(I$7:I8)","v":2}]
[null,null,null,null,null,{"$f":"ROWS(F$7:F9)","v":3},{"$f":"ROWS(G$7:G9)","v":3},{"$f":"ROWS(H$7:H9)","v":3},{"$f":"ROWS(I$7:I9)","v":3}]
[null,null,null,null,null,{"$f":"ROWS(F$7:F10)","v":4},{"$f":"ROWS(G$7:G10)","v":4},{"$f":"ROWS(H$7:H10)","v":4},{"$f":"ROWS(I$7:I10)","v":4}]
[null,null,null,null,null,{"$f":"COLUMNS($F7:F7)","v":1},{"$f":"COLUMNS($F7:G7)","v":2},{"$f":"COLUMNS($F7:H7)","v":3},{"$f":"COLUMNS($F7:I7)","v":4}]
[null,null,null,null,null,{"$f":"COLUMNS($F8:F8)","v":1},{"$f":"COLUMNS($F8:G8)","v":2},{"$f":"COLUMNS($F8:H8)","v":3},{"$f":"COLUMNS($F8:I8)","v":4}]
[null,null,null,null,null,{"$f":"COLUMNS($F9:F9)","v":1},{"$f":"COLUMNS($F9:G9)","v":2},{"$f":"COLUMNS($F9:H9)","v":3},{"$f":"COLUMNS($F9:I9)","v":4}]
[null,null,null,null,null,{"$f":"COLUMNS($F10:F10)","v":1},{"$f":"COLUMNS($F10:G10)","v":2},{"$f":"COLUMNS($F10:H10)","v":3},{"$f":"COLUMNS($F10:I10)","v":4}]
[null,null,null,null,null,{"$f":"COLUMNS($F11:F11)","v":1},{"$f":"COLUMNS($F11:G11)","v":2},{"$f":"COLUMNS($F11:H11)","v":3},{"$f":"COLUMNS($F11:I11)","v":4}]