{"text_format":"1","workbook":"xlsx","n_sheets":30,"sheets":["Links","New2010","Sparklines (1)","Sparklines (1an)","Sparklines (2)","Ctrl Keyboard","Ctrl Keyboard (an)","PT Slicers","PT Slicers (an)","New Print","New Print (an)","Negative Data Bars","Negative Data Bars (an)","New PT Calculations","New PT Calculations (an)","NETWORKDAYS","NETWORKDAYS (an)","WORKDAY","WORKDAY (an)","(565)","(565an)","STDEV.S","STDEV.S (an)","NORM.S.DIST","NORM.S.DIST (an)","RANK","RANK (an)","AGGREGATE","SUMIFS More","SUMIFS More (an)"],"not_rendered":{"charts":2,"images":2,"macros":0,"external_links":0,"defined_names":24,"comments":0,"pivot_tables":4},"unopened":[],"bounds":{"document_bytes":16777216,"sheet_cells":100000,"rows_first":2000,"rows_last":500,"rows_between":2000,"halvings":0,"cell_chars":16384,"cell_head_chars":4096},"cells_cut":0,"cells_raw":0,"read":"whole","date_system":"1900"}

{"sheet":"Links","index":0,"n_rows":12,"n_cols":2,"rows_kept":12,"cut":false,"hidden":false,"merged":[]}
["Event:","What's New In Excel 2011"]
[]
["Video Title:","Excel 2010 20 New Features -- Northwest Accounting Educators Conference 2011"]
["Video link:","http://www.youtube.com/watch?v=YZ4mGGTv8M4"]
[]
["Download Excel file name:","NAE-Excel2010.xlsm"]
["Download Link:","http://people.highline.edu/mgirvin/ExcelIsFun.htm"]
[]
["Speaker:","Michael excelisfun Girvin, Highline Community College"]
[]
["Related book & DVD:","Slaying Excel Dragon"]
["Link:","http://www.mrexcel.com/slayingdragonsbundle.html"]

{"sheet":"New2010","index":1,"n_rows":26,"n_cols":2,"rows_kept":26,"cut":false,"hidden":false,"merged":[]}
["Main New item in Excel 2007: User Interface"]
["Main New item in Excel 2010: Statistical and Math function overhaul"]
["Main New item in Excel 2012: Making Excel Easier for Users who know nothing about Excel at all"]
[]
[null,"Some New features in Excel 2010:"]
[1,"Sparklines"]
[2,"Ctrl Keyboard Shortcuts"]
[3,"PivotTable Slicers"]
[4,"New Print Preview and Print Options combined"]
[5,"Conditional Formatting Negative Data Bars"]
[6,"New PivotTable Calculations"]
[7,"NETWORKDAYS Old 'Compatibility' Function"]
[8,"NETWORKDAYS.INTL New 2010 Function"]
[9,"WORKDAY Old 'Compatibility' Function"]
[10,"WORKDAY.INTL New 2010 Function"]
[null,"About 50 new Statistic Functions:"]
[11,"STDEV Old 'Compatibility' Function"]
[12,"STDEV.S New 2010 Function"]
[13,"NORMSDIST Old 'Compatibility' Function"]
[14,"NORM.S.DIST New 2010 Function"]
[15,"RANK Old 'Compatibility' Function"]
[16,"RANK.AVE New 2010 Function"]
[17,"RANK.EQ New 2010 Function"]
[18,"AGGREGATE New 2010 Function"]
[19,"Customize Ribbon and QAT"]
[20,"SUMIFS, COUNTIFS, AVERAGEIFS (New in 2007)"]

{"sheet":"Sparklines (1)","index":2,"n_rows":19,"n_cols":17,"rows_kept":19,"cut":false,"hidden":false,"merged":[]}
[]
["Score Category","Test 1","Test 2","Test 3"]
[{"$f":"P3&\" up to \"&Q3","v":"0 up to 20"},1,5,0,null,null,null,null,null,null,null,null,null,null,null,0,20]
[{"$f":"P4&\" up to \"&Q4","v":"20 up to 40"},5,10,18,null,null,null,null,null,null,null,null,null,null,null,{"$f":"Q3","v":20},{"$f":"Q3+20","v":40}]
[{"$f":"P5&\" up to \"&Q5","v":"40 up to 60"},19,25,17,null,null,null,null,null,null,null,null,null,null,null,{"$f":"Q4","v":40},{"$f":"Q4+20","v":60}]
[{"$f":"P6&\" up to \"&Q6","v":"60 up to 80"},30,18,10,null,null,null,null,null,null,null,null,null,null,null,60,80]
[{"$f":"P7&\" up to \"&Q7","v":"80 up to 100"},10,5,10,null,null,null,null,null,null,null,null,null,null,null,80,100]
["Total",{"$f":"SUM(B3:B7)","v":65},63,55]
[]
[]
[]
["Day","Sales",null,"Sparklines: Insert Ribbon Tab"]
["Day 1",50000,null,"Sparkline Tools Design Ribbon Tab: High Point, Low Point, Marker Color, Axis Options - Vertical Max - Same for All"]
["Day 2",45000,null,"Other videos on this topic:"]
["Day 3",25000,null,"Mr Excel & excelisfun Trick 21: Excel 2010 Sparklines (Amazing Cell Charts!!) "]
["Day 4",75000,null,"Excel 2010 Statistics #18: Frequency Distribution Shape & Histogram Skew & Sparklines "]
["Day 5",13000]
["Day 6",45000]
["Day 7",125000]

{"sheet":"Sparklines (1an)","index":3,"n_rows":19,"n_cols":17,"rows_kept":19,"cut":false,"hidden":false,"merged":[]}
[]
["Score Category","Test 1","Test 2","Test 3"]
[{"$f":"P3&\" up to \"&Q3","v":"0 up to 20"},1,5,0,null,null,null,null,null,null,null,null,null,null,null,0,20]
[{"$f":"P4&\" up to \"&Q4","v":"20 up to 40"},5,10,18,null,null,null,null,null,null,null,null,null,null,null,{"$f":"Q3","v":20},{"$f":"Q3+20","v":40}]
[{"$f":"P5&\" up to \"&Q5","v":"40 up to 60"},19,25,17,null,null,null,null,null,null,null,null,null,null,null,{"$f":"Q4","v":40},{"$f":"Q4+20","v":60}]
[{"$f":"P6&\" up to \"&Q6","v":"60 up to 80"},30,18,10,null,null,null,null,null,null,null,null,null,null,null,60,80]
[{"$f":"P7&\" up to \"&Q7","v":"80 up to 100"},10,5,10,null,null,null,null,null,null,null,null,null,null,null,80,100]
["Total",{"$f":"SUM(B3:B7)","v":65},63,55]
[]
[]
[]
["Day","Sales",null,"Sparklines: Insert Ribbon Tab"]
["Day 1",50000,null,"Sparkline Tools Design Ribbon Tab: High Point, Low Point, Marker Color, Axis Options - Vertical Max - Same for All"]
["Day 2",45000,null,"Other videos on this topic:"]
["Day 3",25000,null,"Mr Excel & excelisfun Trick 21: Excel 2010 Sparklines (Amazing Cell Charts!!) "]
["Day 4",75000,null,"Excel 2010 Statistics #18: Frequency Distribution Shape & Histogram Skew & Sparklines "]
["Day 5",13000]
["Day 6",45000]
["Day 7",125000]

{"sheet":"Sparklines (2)","index":4,"n_rows":103,"n_cols":18,"rows_kept":103,"cut":false,"hidden":false,"merged":[]}
["When you look at a lot of samples for the same population, you may notice that distributions tend to be shaped in a certain way."]
["The distribution may be skewed in a certain way."]
["If the shaped of the distribution is consistent across samples, you can use that fact to help with doing statistics."]
["For example, if the shape of the data is bell shaped, you can use \"Normal Distribution\" statistical methods, which makes the calculations less difficult."]
["In later chapters we will see how to use the normal distribution and Excel functions like NORM.DIST and NORM.INV to make our life easy."]
[]
[]
[]
[null,null,null,null,null,null,null,null,null,{"$f":"MAX(K11:R20)&CHAR(10)&CHAR(10)&0","v":"29\n\n0"}]
["Stats Test Sample 1","Stats Test Sample 2","Stats Test Sample 3","Stats Test Sample 4","Stats Test Sample 5","Stats Test Sample 6","Stats Test Sample 7","Stats Test Sample 8",null,"Bins","Frequency Sample 1","Frequency Sample 2","Frequency Sample 3","Frequency Sample 4","Frequency Sample 5","Frequency Sample 6","Frequency Sample 7","Frequency Sample 8"]
[{"$f":"CHOOSE(RANDBETWEEN(1,10),RANDBETWEEN(0,100),RANDBETWEEN(10,100),RANDBETWEEN(20,100),RANDBETWEEN(30,95),RANDBETWEEN(30,90),RANDBETWEEN(35,85),RANDBETWEEN(40,80),RANDBETWEEN(50,75),RANDBETWEEN(50,75),RANDBETWEEN(60,85))","v":16},84,38,27,64,35,83,50,null,10,{"$f":"FREQUENCY(A11:A103,$J$11:$J$20)","v":1},{"$f":"FREQUENCY(B11:B103,$J$11:$J$20)","v":3},{"$f":"FREQUENCY(C11:C103,$J$11:$J$20)","v":2},{"$f":"FREQUENCY(D11:D103,$J$11:$J$20)","v":0},{"$f":"FREQUENCY(E11:E103,$J$11:$J$20)","v":0},{"$f":"FREQUENCY(F11:F103,$J$11:$J$20)","v":0},{"$f":"FREQUENCY(G11:G103,$J$11:$J$20)","v":1},{"$f":"FREQUENCY(H11:H103,$J$11:$J$20)","v":1}]
[67,51,72,69,73,91,65,52,null,20,3,1,5,1,3,0,0,4]
[53,56,73,15,68,65,69,98,null,30,4,3,2,4,3,5,5,5]
[65,86,50,65,92,84,79,58,null,40,8,5,9,5,3,11,6,9]
[91,50,37,22,82,64,75,71,null,50,10,11,10,12,8,9,13,10]
[51,74,46,73,54,46,37,69,null,60,19,14,5,19,19,13,15,19]
[57,73,70,55,89,37,65,30,null,70,21,18,25,23,23,29,23,24]
[19,60,18,81,25,81,70,63,null,80,15,16,19,16,16,12,16,13]
[50,99,62,77,39,65,54,52,null,90,8,17,10,10,13,9,10,6]
[74,78,97,72,66,62,49,51,null,100,4,5,6,3,5,5,4,2]
[26,74,71,74,59,34,70,68]
[61,66,86,81,60,76,72,52]
[81,78,73,36,54,53,73,65,null,null,"Label Formula: =MAX(K11:R20)&CHAR(10)&CHAR(10)&0"]
[25,97,49,62,70,67,49,56,null,null,1,"& is join symbol"]
[59,68,61,69,51,92,94,45,null,null,2,"CHAR(10) formula element adds a Hard Return to formula"]
[85,98,31,84,54,66,73,55]
[{"$f":"CHOOSE(RANDBETWEEN(1,10),RANDBETWEEN(0,100),RANDBETWEEN(10,100),RANDBETWEEN(20,100),RANDBETWEEN(30,95),RANDBETWEEN(30,90),RANDBETWEEN(35,85),RANDBETWEEN(40,80),RANDBETWEEN(50,75),RANDBETWEEN(50,75),RANDBETWEEN(60,85))","v":69},39,97,58,54,59,45,61]
[46,45,72,41,74,29,64,60]
[32,69,61,71,96,59,64,61]
[81,68,69,69,59,77,51,41]
[56,73,30,66,63,98,78,65]
[33,30,69,50,43,70,49,69]
[67,54,85,66,78,64,87,65]
[73,85,75,72,21,63,95,62]
[32,64,47,40,53,55,72,56]
[69,49,18,48,80,28,68,25]
[50,63,37,68,12,50,35,75]
[60,1,56,82,99,65,82,63]
[60,57,67,67,83,59,64,30]
[77,92,44,68,78,49,70,55]
[67,48,77,81,60,38,56,54]
[59,3,79,49,62,72,67,64]
[{"$f":"CHOOSE(RANDBETWEEN(1,10),RANDBETWEEN(0,100),RANDBETWEEN(10,100),RANDBETWEEN(20,100),RANDBETWEEN(30,95),RANDBETWEEN(30,90),RANDBETWEEN(35,85),RANDBETWEEN(40,80),RANDBETWEEN(50,75),RANDBETWEEN(50,75),RANDBETWEEN(60,85))","v":65},33,69,95,50,34,51,40]
[68,62,64,29,58,75,88,90]
[70,99,84,52,53,55,52,77]
[67,67,60,70,91,69,41,71]
[79,71,75,84,66,58,74,39]
[6,63,37,42,53,63,65,75]
[63,52,99,80,83,44,50,57]
[51,61,38,52,60,70,22,24]
[58,82,38,51,69,62,67,42]
[73,73,96,71,44,42,84,60]
[80,74,81,59,61,61,56,78]
[34,26,63,49,53,63,83,68]
[28,57,38,40,80,65,82,51]
[82,74,18,45,42,54,67,20]
[38,55,64,86,73,80,73,11]
[72,53,67,50,71,78,69,73]
[{"$f":"CHOOSE(RANDBETWEEN(1,10),RANDBETWEEN(0,100),RANDBETWEEN(10,100),RANDBETWEEN(20,100),RANDBETWEEN(30,95),RANDBETWEEN(30,90),RANDBETWEEN(35,85),RANDBETWEEN(40,80),RANDBETWEEN(50,75),RANDBETWEEN(50,75),RANDBETWEEN(60,85))","v":60},85,55,55,47,70,66,82]
[16,55,67,73,62,36,52,44]
[49,51,80,51,20,86,25,69]
[52,86,74,62,84,80,47,47]
[75,75,82,61,57,50,48,71]
[74,64,65,60,34,81,50,15]
[68,66,79,63,74,24,10,72]
[95,81,64,70,74,77,50,54]
[41,50,13,57,77,60,79,67]
[52,83,82,58,69,53,77,31]
[68,82,54,71,66,81,53,64]
[70,54,92,81,83,35,54,90]
[41,10,69,55,100,79,80,60]
[64,86,10,67,56,88,75,12]
[75,80,62,56,67,84,67,45]
[91,68,62,50,84,45,55,54]
[{"$f":"CHOOSE(RANDBETWEEN(1,10),RANDBETWEEN(0,100),RANDBETWEEN(10,100),RANDBETWEEN(20,100),RANDBETWEEN(30,95),RANDBETWEEN(30,90),RANDBETWEEN(35,85),RANDBETWEEN(40,80),RANDBETWEEN(50,75),RANDBETWEEN(50,75),RANDBETWEEN(60,85))","v":45},84,75,78,86,74,71,64]
[83,67,68,80,70,34,66,34]
[51,35,83,56,68,65,37,67]
[68,83,94,64,83,84,30,63]
[79,61,65,74,43,54,64,76]
[42,46,72,66,53,66,43,51]
[56,84,69,39,67,63,84,69]
[47,36,36,78,79,75,68,75]
[58,55,73,85,62,61,55,61]
[66,72,81,56,89,70,66,92]
[35,19,53,53,65,90,82,62]
[78,49,11,55,68,28,24,40]
[89,46,81,65,32,68,55,71]
[57,83,43,95,73,64,84,80]
[51,79,72,51,68,75,67,82]
[62,28,63,50,11,96,78,35]
[{"$f":"CHOOSE(RANDBETWEEN(1,10),RANDBETWEEN(0,100),RANDBETWEEN(10,100),RANDBETWEEN(20,100),RANDBETWEEN(30,95),RANDBETWEEN(30,90),RANDBETWEEN(35,85),RANDBETWEEN(40,80),RANDBETWEEN(50,75),RANDBETWEEN(50,75),RANDBETWEEN(60,85))","v":40},46,49,69,72,62,73,44]
[96,62,45,31,45,69,95,85]
[75,43,63,64,52,48,67,43]
[61,65,81,23,67,61,24,44]
[50,48,49,50,69,95,39,62]
[62,84,73,69,50,58,57,39]
[82,65,68,76,84,36,39,6]
[51,82,45,56,73,68,58,26]
[71,40,25,50,89,53,35,54]
[39,84,62,82,67,46,58,81]
[74,60,7,95,22,31,41,67]
[21,80,75,63,90,21,45,34]
[86,80,72,76,75,37,99,40]

{"sheet":"Ctrl Keyboard","index":5,"n_rows":15,"n_cols":9,"rows_kept":15,"cut":false,"hidden":false,"merged":[]}
[null,"Day1","Day2","Day3","Day4","Total",null,"Transpose Table"]
["Prod1",52,28,13,36,{"$f":"SUM(B2:E2)","v":129},null,null,"Ctrl + C"]
["Prod2",48,45,81,7,181,null,1,"Paste Button in Home Ribbon, Transpose icon"]
["Prod3",62,69,50,50,231,null,2,"Ctrl + V, then use Smart Tag"]
["Prod4",57,77,22,13,169,null,3,"Ctrl + V, Ctrl, T"]
["Prod5",90,4,78,48,220,null,4,"Right-Click Key, T, Enter"]
["Total",{"$f":"SUM(B2:B6)","v":309},{"$f":"SUM(C2:C6)","v":223},{"$f":"SUM(D2:D6)","v":244},{"$f":"SUM(E2:E6)","v":154},930,null,"Paste Special Values"]
[null,null,null,null,null,null,null,null,"Ctrl + C"]
[null,null,null,null,null,null,null,1,"Right-Click Key, V"]
[null,null,null,null,null,null,null,2,"Without Copying: Right-click edge of"]
[null,null,null,null,null,null,null,null,"cell/s, drag to new location, release"]
[null,null,null,null,null,null,null,null,"right-click, point to drop-down menu"]
[null,null,null,null,null,null,null,null,"\"Copy Her As Values\""]
[null,null,null,null,null,null,null,"Other videos on this topic:"]
[null,null,null,null,null,null,null,"Excel 2010 Preview #2: Copy & Paste Special Magic"]

{"sheet":"Ctrl Keyboard (an)","index":6,"n_rows":21,"n_cols":9,"rows_kept":21,"cut":false,"hidden":false,"merged":[]}
[null,"Day1","Day2","Day3","Day4","Total",null,"Transpose Table"]
["Prod1",52,28,13,36,{"$f":"SUM(B2:E2)","v":129},null,null,"Ctrl + C"]
["Prod2",48,45,81,7,181,null,1,"Paste Button in Home Ribbon, Transpose icon"]
["Prod3",62,69,50,50,231,null,2,"Ctrl + V, then use Smart Tag"]
["Prod4",57,77,22,13,169,null,3,"Ctrl + V, Ctrl, T"]
["Prod5",90,4,78,48,220,null,4,"Right-Click Key, T, Enter"]
["Total",{"$f":"SUM(B2:B6)","v":309},{"$f":"SUM(C2:C6)","v":223},{"$f":"SUM(D2:D6)","v":244},{"$f":"SUM(E2:E6)","v":154},930,null,"Paste Special Values"]
[null,null,null,null,null,null,null,null,"Ctrl + C"]
[null,"Prod1","Prod2","Prod3","Prod4","Prod5","Total",1,"Right-Click Key, V"]
["Day1",52,48,62,57,90,{"$f":"SUM(B10:F10)","v":309},2,"Without Copying: Right-click edge of"]
["Day2",28,45,69,77,4,{"$f":"SUM(B11:F11)","v":223},null,"cell/s, drag to new location, release"]
["Day3",13,81,50,22,78,{"$f":"SUM(B12:F12)","v":244},null,"right-click, point to drop-down menu"]
["Day4",36,7,50,13,48,{"$f":"SUM(B13:F13)","v":154},null,"\"Copy Her As Values\""]
["Total",{"$f":"SUM(B10:B13)","v":129},181,231,169,220,930,"Other videos on this topic:"]
[null,null,null,null,null,null,null,"Excel 2010 Preview #2: Copy & Paste Special Magic"]
[null,930,930,null,129]
[null,null,null,null,181]
[null,null,null,null,231]
[null,null,null,null,169]
[null,null,null,null,220]
[null,null,null,null,930]

{"sheet":"PT Slicers","index":7,"n_rows":495,"n_cols":6,"rows_kept":495,"cut":false,"hidden":false,"merged":[]}
["Create PT on New Sheet: Alt, N, V, T, Enter"]
["Drag Date to Row Labels"]
["Group Date by Year and Month: Right-click, Group"]
["Drag Sales to Values area"]
["Old Method: Drag Product, Customer, SalesRep fields to Report Filter"]
["New Method: PivotTable Tools Options Ribbon Tab: Insert Slicer"]
["Move and Size Slicers with Mouse"]
["Slicers Tools Options Ribbon Tab: Change Colors"]
["Use Ctrl Key to Select items not next to each other"]
["Grayed out items mean there were none"]
[]
["Other videos on this topic:"]
["Excel 2010 Preview #4: Pivot Table Slicer (Report/Page Filter Slicer) "]
["Office 2010 Class #36: Excel PivotTables Pivot Tables 15 examples (Data Analysis) "]
[]
["Date","Product","Customer","SalesRep","Units","Sales"]
["2008-01-02","Sunshine","Albertsons","Fred",5,68.75]
["2008-07-30","Quad","PCC","Sioux",18,247.5]
["2008-11-30","Carlota","Albertsons","Sue",22,302.5]
["2009-04-21","SunBell","QFC","Jo",8,110]
["2009-12-31","Sunset","QFC","Sioux",20,275]
["2008-01-26","Tri","WholeFoods","Sioux",11,151.25]
["2009-03-27","Sunset","WholeFoods","Jo",25,343.75]
["2008-01-28","Bellen","WholeFoods","Pham",7,96.25]
["2009-04-07","Bellen","Albertsons","Pham",15,206.25]
["2009-01-19","Sunshine","Albertsons","Pham",17,233.75]
["2008-02-22","Carlota","PCC","Chin",15,206.25]
["2008-10-05","Carlota","QFC","Pham",3,41.25]
["2009-01-12","SunBell","TraderJoe's","Joe",17,233.75]
["2009-04-17","Tri","QFC","Pham",14,192.5]
["2008-09-26","Sunshine","Albertsons","Sioux",14,192.5]
["2008-01-13","Sunshine","Coop","Joe",14,192.5]
["2008-10-02","Tri","QFC","Jo",17,233.75]
["2008-10-09","SunBell","Safeway","Joe",21,288.75]
["2009-10-28","SunBell","Safeway","Jo",14,192.5]
["2009-11-06","Sunshine","WholeFoods","Pham",4,55]
["2008-01-24","SunBell","Safeway","Pham",19,261.25]
["2008-10-30","Tri","WholeFoods","Sioux",25,343.75]
["2008-10-27","Sunshine","PCC","Pham",14,192.5]
["2008-08-12","Tri","WholeFoods","Joe",17,233.75]
["2008-11-30","Carlota","Coop","Fred",7,96.25]
["2008-01-01","Carlota","Safeway","Sioux",13,178.75]
["2009-12-03","Quad","QFC","Sue",7,96.25]
["2008-05-28","Tri","Coop","Joe",21,288.75]
["2009-08-06","Tri","PCC","Joe",19,261.25]
["2008-07-13","Quad","PCC","Joe",16,220]
["2009-04-21","Tri","QFC","Pham",23,316.25]
["2009-04-26","Tri","Albertsons","Joe",2,27.5]
["2008-08-26","Tri","QFC","Chin",2,27.5]
["2008-12-12","SunBell","PCC","Joe",14,192.5]
["2009-02-05","Carlota","PCC","Fred",15,206.25]
["2008-10-02","Sunset","WholeFoods","Fred",1,13.75]
["2009-04-29","Sunset","WholeFoods","Fred",17,233.75]
["2009-08-13","Carlota","Coop","Pham",7,96.25]
["2008-08-15","SunBell","Coop","Chin",4,55]
["2009-04-30","Bellen","QFC","Sioux",24,330]
["2009-05-24","Bellen","QFC","Fred",15,206.25]
["2009-06-08","SunBell","QFC","Joe",19,261.25]
["2009-12-15","SunBell","Coop","Fred",11,151.25]
["2009-12-21","Quad","WholeFoods","Fred",8,110]
["2009-10-10","Carlota","Albertsons","Fred",21,288.75]
["2008-07-06","Bellen","Safeway","Pham",22,302.5]
["2008-06-21","Sunshine","PCC","Joe",8,110]
["2009-03-02","Carlota","QFC","Joe",10,137.5]
["2009-03-16","Carlota","Coop","Sue",16,220]
["2008-12-09","Tri","Safeway","Chin",15,206.25]
["2009-12-04","Sunset","PCC","Jo",23,316.25]
["2008-07-18","Bellen","WholeFoods","Jo",15,206.25]
["2009-11-24","Tri","TraderJoe's","Sioux",14,192.5]
["2008-04-25","Sunset","QFC","Joe",2,27.5]
["2009-08-17","Tri","WholeFoods","Sue",2,27.5]
["2008-11-03","Quad","WholeFoods","Chin",3,41.25]
["2009-09-06","SunBell","WholeFoods","Chin",4,55]
["2008-12-30","Carlota","Safeway","Sue",20,275]
["2008-02-14","Sunshine","TraderJoe's","Jo",1,13.75]
["2008-11-01","Tri","QFC","Fred",13,178.75]
["2009-01-01","Quad","WholeFoods","Sioux",23,316.25]
["2008-03-07","SunBell","QFC","Joe",16,220]
["2008-06-29","Carlota","Coop","Chin",17,233.75]
["2008-10-12","Sunshine","Coop","Fred",18,247.5]
["2008-06-10","Carlota","Albertsons","Pham",25,343.75]
["2009-07-25","Sunset","PCC","Chin",2,27.5]
["2008-11-29","SunBell","WholeFoods","Sue",1,13.75]
["2008-04-07","SunBell","Coop","Fred",18,247.5]
["2008-01-14","Carlota","WholeFoods","Sioux",23,316.25]
["2009-08-30","Sunshine","WholeFoods","Pham",4,55]
["2008-08-17","Sunshine","Coop","Jo",12,165]
["2008-12-19","Sunshine","QFC","Sue",24,330]
["2008-02-19","Carlota","Safeway","Pham",10,137.5]
["2008-03-03","Carlota","TraderJoe's","Sioux",15,206.25]
["2009-04-07","Sunshine","Safeway","Sue",17,233.75]
["2009-10-04","Carlota","Albertsons","Sue",13,178.75]
["2008-09-01","Bellen","Safeway","Sue",10,137.5]
["2009-07-12","Sunset","TraderJoe's","Jo",20,275]
["2008-10-04","SunBell","Albertsons","Fred",20,275]
["2009-11-20","Quad","Coop","Joe",1,13.75]
["2008-10-27","SunBell","TraderJoe's","Chin",4,55]
["2008-02-11","SunBell","WholeFoods","Fred",18,247.5]
["2009-08-26","Carlota","PCC","Fred",10,137.5]
["2008-03-08","Sunshine","TraderJoe's","Sue",6,82.5]
["2008-12-05","Quad","TraderJoe's","Fred",12,165]
["2008-01-02","SunBell","Coop","Pham",19,261.25]
["2009-10-09","Sunshine","WholeFoods","Sue",1,13.75]
["2009-03-02","Sunshine","PCC","Jo",10,137.5]
["2008-11-11","SunBell","PCC","Fred",5,68.75]
["2008-03-18","Sunshine","Coop","Jo",10,137.5]
["2008-01-05","Bellen","PCC","Sue",16,220]
["2009-01-03","Bellen","TraderJoe's","Chin",3,41.25]
["2009-04-26","SunBell","TraderJoe's","Pham",20,275]
["2008-11-10","Sunset","TraderJoe's","Pham",18,247.5]
["2008-09-27","SunBell","Safeway","Joe",9,123.75]
["2009-01-19","Quad","TraderJoe's","Fred",7,96.25]
["2008-09-06","Quad","Safeway","Joe",4,55]
["2008-02-22","Sunshine","Albertsons","Pham",12,165]
["2008-03-31","Bellen","QFC","Chin",25,343.75]
["2009-08-02","Quad","PCC","Sioux",10,137.5]
["2008-12-03","Bellen","Albertsons","Pham",2,27.5]
["2008-05-20","Sunshine","Safeway","Jo",22,302.5]
["2009-03-26","Bellen","QFC","Sioux",21,288.75]
["2008-12-31","Sunset","QFC","Sioux",3,41.25]
["2009-11-05","Sunshine","Safeway","Jo",20,275]
["2008-12-06","Sunset","Coop","Jo",16,220]
["2008-04-03","Quad","QFC","Joe",8,110]
["2009-09-19","Sunshine","TraderJoe's","Pham",24,330]
["2008-01-07","Bellen","PCC","Chin",12,165]
["2008-11-10","Quad","TraderJoe's","Chin",17,233.75]
["2008-04-30","Carlota","WholeFoods","Fred",1,13.75]
["2009-04-28","Tri","WholeFoods","Sue",2,27.5]
["2009-12-16","Tri","WholeFoods","Jo",21,288.75]
["2009-03-20","Sunshine","PCC","Joe",15,206.25]
["2009-03-01","Tri","Safeway","Fred",24,330]
["2009-01-13","Tri","Safeway","Chin",24,330]
["2008-09-12","Quad","Albertsons","Sioux",6,82.5]
["2008-07-12","Sunset","WholeFoods","Sioux",12,165]
["2008-01-03","Quad","Safeway","Pham",1,13.75]
["2008-11-11","Quad","Coop","Chin",21,288.75]
["2009-07-24","Carlota","Albertsons","Fred",23,316.25]
["2008-10-01","Quad","Albertsons","Jo",17,233.75]
["2008-12-21","SunBell","QFC","Pham",12,165]
["2008-01-14","Tri","TraderJoe's","Jo",1,13.75]
["2008-01-15","Tri","Coop","Pham",6,82.5]
["2009-08-29","Carlota","PCC","Jo",18,247.5]
["2008-08-27","SunBell","WholeFoods","Jo",8,110]
["2008-07-22","Sunshine","Safeway","Pham",11,151.25]
["2009-01-29","Carlota","PCC","Fred",6,82.5]
["2009-03-08","Sunset","TraderJoe's","Sue",18,247.5]
["2009-12-12","Tri","Safeway","Fred",8,110]
["2009-09-22","Sunset","PCC","Chin",11,151.25]
["2009-12-11","Tri","WholeFoods","Chin",2,27.5]
["2008-03-22","Carlota","Albertsons","Sioux",22,302.5]
["2009-08-24","Quad","TraderJoe's","Sioux",21,288.75]
["2009-08-28","Bellen","TraderJoe's","Chin",11,151.25]
["2008-08-15","Sunshine","Coop","Jo",6,82.5]
["2009-06-26","Sunshine","Coop","Jo",25,343.75]
["2008-03-17","Bellen","Coop","Pham",2,27.5]
["2008-03-14","Bellen","Safeway","Joe",15,206.25]
["2009-08-11","Quad","WholeFoods","Sue",21,288.75]
["2008-05-08","Tri","QFC","Sioux",5,68.75]
["2008-07-30","Carlota","WholeFoods","Sue",13,178.75]
["2008-10-24","Carlota","Safeway","Pham",13,178.75]
["2008-12-14","Tri","Safeway","Joe",9,123.75]
["2008-05-15","Sunshine","Safeway","Sue",18,247.5]
["2009-05-15","Carlota","Albertsons","Chin",8,110]
["2009-04-23","Tri","QFC","Sue",7,96.25]
["2009-03-21","Sunset","PCC","Chin",6,82.5]
["2009-07-22","SunBell","Coop","Sioux",7,96.25]
["2009-05-13","Tri","PCC","Sioux",14,192.5]
["2008-12-17","Quad","PCC","Joe",24,330]
["2008-03-12","Quad","QFC","Joe",17,233.75]
["2008-06-10","Carlota","QFC","Chin",5,68.75]
["2008-04-09","Bellen","TraderJoe's","Sue",1,13.75]
["2008-04-08","Carlota","WholeFoods","Sue",14,192.5]
["2008-02-11","Sunshine","PCC","Jo",12,165]
["2009-06-08","Sunset","PCC","Sioux",25,343.75]
["2008-12-03","Carlota","Albertsons","Jo",3,41.25]
["2009-04-26","Bellen","PCC","Jo",14,192.5]
["2008-04-13","Tri","PCC","Jo",6,82.5]
["2009-12-23","Carlota","Albertsons","Fred",17,233.75]
["2008-02-06","SunBell","Albertsons","Sioux",23,316.25]
["2008-03-15","Bellen","PCC","Fred",4,55]
["2009-06-03","Sunset","WholeFoods","Sue",20,275]
["2009-04-04","Carlota","QFC","Sioux",16,220]
["2009-06-14","Sunset","WholeFoods","Jo",19,261.25]
["2009-04-21","Sunshine","Safeway","Sue",16,220]
["2009-06-16","Sunshine","WholeFoods","Joe",1,13.75]
["2009-02-16","SunBell","PCC","Jo",11,151.25]
["2008-05-04","Tri","Coop","Sioux",18,247.5]
["2009-09-26","Tri","Safeway","Fred",10,137.5]
["2008-12-04","Carlota","Albertsons","Fred",14,192.5]
["2009-07-15","Carlota","WholeFoods","Pham",11,151.25]
["2009-11-28","Carlota","Albertsons","Pham",20,275]
["2008-07-25","Sunset","Coop","Fred",21,288.75]
["2008-03-31","Carlota","TraderJoe's","Sue",17,233.75]
["2009-10-25","Sunshine","WholeFoods","Sue",16,220]
["2009-08-11","Bellen","PCC","Jo",6,82.5]
["2009-09-29","Tri","Albertsons","Pham",3,41.25]
["2009-02-18","Tri","QFC","Pham",7,96.25]
["2009-06-21","Carlota","Coop","Joe",8,110]
["2008-02-05","Sunset","Safeway","Chin",16,220]
["2009-03-03","Bellen","QFC","Joe",19,261.25]
["2009-07-14","Tri","WholeFoods","Joe",17,233.75]
["2008-04-21","Sunset","Safeway","Sioux",11,151.25]
["2009-02-23","Sunshine","Albertsons","Fred",24,330]
["2008-01-10","Carlota","Safeway","Joe",20,275]
["2009-05-07","Quad","Albertsons","Joe",19,261.25]
["2008-04-24","Bellen","WholeFoods","Jo",3,41.25]
["2009-01-06","Sunshine","WholeFoods","Jo",16,220]
["2009-07-14","Sunshine","Safeway","Sioux",23,316.25]
["2009-03-14","Sunshine","Albertsons","Pham",16,220]
["2008-02-24","Carlota","PCC","Sue",23,316.25]
["2009-05-16","Bellen","TraderJoe's","Sue",19,261.25]
["2009-07-08","Carlota","WholeFoods","Pham",2,27.5]
["2009-12-29","SunBell","PCC","Sioux",18,247.5]
["2009-09-14","Carlota","Coop","Joe",2,27.5]
["2009-06-22","Sunshine","QFC","Jo",23,316.25]
["2009-11-21","Quad","WholeFoods","Fred",25,343.75]
["2009-03-15","SunBell","QFC","Chin",14,192.5]
["2008-02-13","Quad","Albertsons","Fred",15,206.25]
["2008-03-07","Tri","PCC","Chin",17,233.75]
["2009-06-08","Tri","WholeFoods","Fred",22,302.5]
["2009-03-05","Carlota","QFC","Sioux",12,165]
["2008-05-30","Carlota","TraderJoe's","Jo",8,110]
["2008-05-26","Carlota","Coop","Joe",5,68.75]
["2008-01-04","Carlota","WholeFoods","Pham",19,261.25]
["2008-12-21","Quad","Albertsons","Chin",19,261.25]
["2008-05-28","Sunset","Safeway","Joe",19,261.25]
["2009-01-05","Quad","QFC","Sue",18,247.5]
["2008-07-22","Bellen","Coop","Fred",3,41.25]
["2008-07-01","Bellen","Albertsons","Chin",8,110]
["2008-02-19","Sunset","Coop","Sioux",24,330]
["2009-01-29","Sunset","WholeFoods","Jo",3,41.25]
["2009-09-03","SunBell","TraderJoe's","Sioux",5,68.75]
["2008-02-08","Sunset","PCC","Jo",10,137.5]
["2008-08-28","Carlota","PCC","Fred",7,96.25]
["2008-12-02","Bellen","QFC","Fred",12,165]
["2009-06-07","Carlota","WholeFoods","Joe",1,13.75]
["2009-05-06","Quad","TraderJoe's","Joe",25,343.75]
["2009-10-04","Sunset","WholeFoods","Jo",1,13.75]
["2009-05-16","Sunshine","QFC","Chin",17,233.75]
["2009-11-20","Carlota","Coop","Fred",5,68.75]
["2009-02-11","Sunset","PCC","Sue",11,151.25]
["2009-01-09","Tri","QFC","Sue",7,96.25]
["2008-03-28","Sunshine","QFC","Fred",19,261.25]
["2008-10-19","Tri","WholeFoods","Fred",6,82.5]
["2008-12-19","Quad","Safeway","Sioux",22,302.5]
["2008-06-03","Sunset","PCC","Sue",9,123.75]
["2008-08-30","Tri","Safeway","Chin",16,220]
["2009-02-17","Sunshine","WholeFoods","Sioux",7,96.25]
["2009-11-07","Bellen","Albertsons","Sue",20,275]
["2008-05-01","SunBell","QFC","Joe",3,41.25]
["2009-03-17","SunBell","TraderJoe's","Jo",25,343.75]
["2008-12-23","Sunshine","WholeFoods","Pham",11,151.25]
["2009-02-25","SunBell","Coop","Chin",22,302.5]
["2009-04-29","SunBell","Albertsons","Jo",2,27.5]
["2008-04-03","Bellen","PCC","Pham",24,330]
["2008-08-04","Carlota","PCC","Chin",3,41.25]
["2009-03-05","Quad","Safeway","Pham",17,233.75]
["2008-08-08","Sunshine","Albertsons","Joe",3,41.25]
["2008-06-06","Quad","WholeFoods","Sue",13,178.75]
["2009-11-26","Sunset","QFC","Fred",22,302.5]
["2009-01-09","Quad","WholeFoods","Sue",19,261.25]
["2009-01-30","Carlota","Albertsons","Chin",3,41.25]
["2008-08-28","Sunshine","Coop","Sue",25,343.75]
["2009-11-05","Tri","Safeway","Fred",4,55]
["2009-11-13","Quad","WholeFoods","Sioux",13,178.75]
["2008-06-28","Bellen","Coop","Pham",4,55]
["2009-03-29","Tri","Coop","Jo",9,123.75]
["2008-10-31","Quad","Safeway","Chin",3,41.25]
["2008-02-02","Tri","Albertsons","Fred",10,137.5]
["2009-10-30","Sunset","TraderJoe's","Sioux",11,151.25]
["2008-09-12","Quad","TraderJoe's","Pham",24,330]
["2008-04-16","SunBell","Coop","Jo",4,55]
["2009-06-15","Quad","TraderJoe's","Fred",13,178.75]
["2009-07-20","Bellen","QFC","Fred",9,123.75]
["2009-06-05","Tri","PCC","Sue",24,330]
["2008-06-21","Sunshine","PCC","Sue",25,343.75]
["2009-03-17","Quad","Safeway","Sioux",3,41.25]
["2009-05-12","Tri","PCC","Fred",14,192.5]
["2008-09-10","Bellen","Coop","Sue",20,275]
["2008-04-07","Bellen","PCC","Joe",22,302.5]
["2009-05-28","Quad","QFC","Sue",24,330]
["2009-06-29","Carlota","Albertsons","Joe",19,261.25]
["2008-11-24","Sunset","Coop","Joe",14,192.5]
["2008-11-04","Quad","WholeFoods","Sue",2,27.5]
["2008-08-30","Carlota","Safeway","Chin",9,123.75]
["2008-06-16","Sunshine","PCC","Sue",19,261.25]
["2009-04-11","Bellen","PCC","Fred",7,96.25]
["2008-06-19","Sunshine","Albertsons","Joe",7,96.25]
["2009-01-22","Carlota","WholeFoods","Fred",13,178.75]
["2008-06-25","Quad","TraderJoe's","Jo",7,96.25]
["2009-08-14","Bellen","WholeFoods","Chin",14,192.5]
["2008-08-02","Sunset","PCC","Fred",21,288.75]
["2008-03-02","Sunset","PCC","Jo",14,192.5]
["2008-06-12","Bellen","WholeFoods","Sue",5,68.75]
["2008-08-25","Quad","QFC","Joe",23,316.25]
["2009-07-14","Sunset","Safeway","Jo",22,302.5]
["2009-12-23","SunBell","Albertsons","Pham",1,13.75]
["2009-10-25","Sunshine","Albertsons","Pham",5,68.75]
["2009-05-10","SunBell","TraderJoe's","Chin",8,110]
["2008-03-08","Bellen","Albertsons","Pham",14,192.5]
["2009-10-28","SunBell","Safeway","Sioux",6,82.5]
["2009-04-30","Sunshine","Coop","Chin",20,275]
["2009-07-18","SunBell","Safeway","Fred",25,343.75]
["2009-05-13","Carlota","PCC","Sue",12,165]
["2008-04-07","Sunshine","Coop","Jo",7,96.25]
["2009-01-26","Tri","Safeway","Pham",24,330]
["2008-12-03","Quad","Albertsons","Jo",17,233.75]
["2009-03-29","Carlota","PCC","Fred",20,275]
["2008-06-01","Sunset","TraderJoe's","Sue",19,261.25]
["2008-02-28","Quad","Albertsons","Joe",21,288.75]
["2008-02-02","Carlota","TraderJoe's","Sue",15,206.25]
["2009-02-27","Sunset","Albertsons","Pham",23,316.25]
["2008-04-08","Sunset","PCC","Jo",17,233.75]
["2008-01-10","Tri","TraderJoe's","Sue",15,206.25]
["2009-11-16","Carlota","WholeFoods","Sioux",8,110]
["2009-04-03","Bellen","Albertsons","Jo",9,123.75]
["2009-08-11","Sunset","Albertsons","Chin",20,275]
["2009-04-03","Quad","QFC","Sue",15,206.25]
["2009-12-10","SunBell","PCC","Fred",16,220]
["2008-10-12","Tri","WholeFoods","Jo",19,261.25]
["2008-09-19","Tri","TraderJoe's","Fred",6,82.5]
["2009-06-23","Tri","QFC","Jo",8,110]
["2008-07-19","Carlota","PCC","Chin",20,275]
["2009-03-06","Carlota","Coop","Fred",24,330]
["2009-09-28","Tri","PCC","Pham",9,123.75]
["2009-11-29","Sunset","Safeway","Chin",24,330]
["2009-10-19","Quad","Coop","Sue",21,288.75]
["2009-12-24","Sunshine","TraderJoe's","Sioux",15,206.25]
["2009-10-09","Bellen","Albertsons","Sue",25,343.75]
["2008-07-15","Bellen","QFC","Chin",8,110]
["2009-02-05","Sunset","Safeway","Sioux",12,165]
["2009-02-23","SunBell","Albertsons","Fred",1,13.75]
["2009-08-30","Quad","PCC","Chin",14,192.5]
["2009-06-23","Tri","Albertsons","Fred",5,68.75]
["2009-10-28","Quad","WholeFoods","Pham",24,330]
["2009-08-02","Sunset","Albertsons","Fred",3,41.25]
["2009-01-02","SunBell","QFC","Fred",23,316.25]
["2008-03-01","Sunset","Safeway","Pham",7,96.25]
["2009-11-14","SunBell","Safeway","Joe",4,55]
["2008-10-26","Sunshine","Albertsons","Joe",8,110]
["2008-04-01","Tri","PCC","Chin",21,288.75]
["2008-08-27","Carlota","TraderJoe's","Pham",20,275]
["2008-05-13","Bellen","WholeFoods","Fred",4,55]
["2008-09-04","Bellen","PCC","Joe",9,123.75]
["2008-06-16","Carlota","Coop","Jo",21,288.75]
["2009-06-13","Sunshine","Coop","Sue",7,96.25]
["2008-05-06","Sunset","Albertsons","Jo",5,68.75]
["2008-01-05","Tri","Albertsons","Joe",21,288.75]
["2008-05-10","Sunset","WholeFoods","Fred",14,192.5]
["2008-12-01","Tri","Coop","Sue",13,178.75]
["2008-04-15","Bellen","Safeway","Pham",20,275]
["2008-05-31","Sunset","Coop","Chin",25,343.75]
["2009-01-09","Sunset","Safeway","Joe",12,165]
["2008-04-22","Tri","TraderJoe's","Joe",2,27.5]
["2008-02-13","Tri","Albertsons","Sue",11,151.25]
["2009-08-06","Quad","PCC","Jo",12,165]
["2009-10-12","Bellen","Coop","Chin",4,55]
["2009-05-27","Tri","PCC","Sioux",13,178.75]
["2009-02-14","Carlota","QFC","Fred",21,288.75]
["2009-06-08","SunBell","Coop","Pham",21,288.75]
["2008-03-19","Tri","Albertsons","Chin",7,96.25]
["2008-11-27","Carlota","TraderJoe's","Joe",24,330]
["2008-06-06","SunBell","Albertsons","Joe",8,110]
["2008-07-25","Sunshine","WholeFoods","Jo",21,288.75]
["2008-09-10","SunBell","Albertsons","Jo",24,330]
["2008-05-12","Bellen","TraderJoe's","Joe",15,206.25]
["2009-07-17","Quad","TraderJoe's","Pham",4,55]
["2009-02-06","Quad","WholeFoods","Jo",10,137.5]
["2009-12-02","SunBell","QFC","Fred",8,110]
["2009-03-09","Sunset","TraderJoe's","Sue",24,330]
["2009-11-21","Quad","PCC","Joe",7,96.25]
["2008-07-31","Quad","TraderJoe's","Chin",2,27.5]
["2009-04-15","Carlota","TraderJoe's","Fred",22,302.5]
["2009-04-24","SunBell","Albertsons","Joe",3,41.25]
["2009-12-04","Quad","WholeFoods","Fred",8,110]
["2009-01-28","Sunset","TraderJoe's","Sioux",3,41.25]
["2009-12-26","SunBell","WholeFoods","Pham",19,261.25]
["2008-10-29","Bellen","Coop","Pham",16,220]
["2008-02-09","Sunset","Coop","Chin",1,13.75]
["2008-12-27","Sunset","TraderJoe's","Joe",13,178.75]
["2008-08-03","SunBell","Safeway","Fred",16,220]
["2008-10-30","Quad","Coop","Sioux",18,247.5]
["2008-09-09","Tri","Coop","Fred",11,151.25]
["2008-04-14","Tri","WholeFoods","Fred",21,288.75]
["2009-06-24","SunBell","Safeway","Joe",1,13.75]
["2008-09-13","Quad","WholeFoods","Chin",13,178.75]
["2008-04-30","Carlota","Albertsons","Fred",14,192.5]
["2009-05-14","Sunshine","Safeway","Sioux",7,96.25]
["2008-01-10","Sunset","WholeFoods","Fred",17,233.75]
["2008-01-04","Sunset","PCC","Jo",2,27.5]
["2008-06-19","Bellen","WholeFoods","Sue",9,123.75]
["2009-07-08","Tri","Coop","Joe",20,275]
["2009-03-17","Carlota","QFC","Sioux",16,220]
["2008-07-27","Bellen","WholeFoods","Chin",22,302.5]
["2008-01-09","Carlota","Coop","Chin",19,261.25]
["2008-04-12","Sunshine","QFC","Pham",7,96.25]
["2008-05-10","Sunshine","TraderJoe's","Joe",10,137.5]
["2008-11-14","Bellen","PCC","Sue",18,247.5]
["2008-12-28","Quad","TraderJoe's","Fred",18,247.5]
["2009-03-12","Sunset","QFC","Sioux",24,330]
["2009-03-22","Sunset","Albertsons","Fred",21,288.75]
["2008-03-28","Sunshine","TraderJoe's","Sue",9,123.75]
["2009-05-18","Tri","TraderJoe's","Chin",13,178.75]
["2009-07-06","Sunset","TraderJoe's","Sioux",9,123.75]
["2008-01-11","Bellen","WholeFoods","Pham",4,55]
["2009-04-03","Sunshine","TraderJoe's","Pham",21,288.75]
["2008-04-30","Bellen","WholeFoods","Chin",20,275]
["2008-02-26","Sunset","Albertsons","Pham",22,302.5]
["2009-03-06","Quad","PCC","Pham",8,110]
["2008-07-30","Bellen","QFC","Joe",15,206.25]
["2009-05-06","Tri","Coop","Joe",25,343.75]
["2008-09-08","Tri","QFC","Sue",25,343.75]
["2008-08-11","Quad","Albertsons","Sioux",24,330]
["2008-02-08","Quad","Coop","Pham",3,41.25]
["2008-01-23","Tri","WholeFoods","Fred",9,123.75]
["2008-12-20","Carlota","WholeFoods","Joe",11,151.25]
["2008-09-22","Carlota","Coop","Sue",15,206.25]
["2009-07-14","Sunshine","Coop","Jo",5,68.75]
["2008-02-26","Quad","Albertsons","Fred",9,123.75]
["2009-02-09","SunBell","WholeFoods","Chin",10,137.5]
["2008-10-13","Sunset","Safeway","Joe",4,55]
["2008-03-27","Quad","TraderJoe's","Jo",10,137.5]
["2009-08-14","Quad","Coop","Fred",7,96.25]
["2008-06-03","Carlota","TraderJoe's","Fred",22,302.5]
["2008-11-09","Carlota","PCC","Fred",17,233.75]
["2008-04-23","Sunset","Safeway","Chin",2,27.5]
["2009-08-12","Tri","QFC","Sue",11,151.25]
["2009-03-11","Quad","Albertsons","Sue",17,233.75]
["2009-11-26","Tri","Safeway","Joe",6,82.5]
["2008-01-09","Tri","Albertsons","Jo",2,27.5]
["2008-01-14","Carlota","Safeway","Sioux",19,261.25]
["2009-01-04","Sunshine","TraderJoe's","Jo",22,302.5]
["2008-06-19","Quad","PCC","Jo",8,110]
["2008-10-31","Tri","Coop","Sioux",7,96.25]
["2009-05-30","Sunshine","PCC","Sioux",5,68.75]
["2008-10-28","Sunshine","Coop","Jo",5,68.75]
["2009-12-03","Sunshine","Coop","Chin",3,41.25]
["2008-11-12","Tri","WholeFoods","Fred",4,55]
["2009-06-17","Tri","Albertsons","Fred",24,330]
["2008-05-24","Carlota","TraderJoe's","Sioux",5,68.75]
["2009-10-06","Carlota","Safeway","Sue",5,68.75]
["2009-02-06","Sunshine","WholeFoods","Sioux",1,13.75]
["2008-01-12","Sunshine","Safeway","Chin",6,82.5]
["2009-12-14","Sunset","WholeFoods","Fred",19,261.25]
["2008-11-06","Quad","PCC","Sue",7,96.25]
["2009-07-08","Tri","Coop","Pham",14,192.5]
["2009-05-12","Quad","WholeFoods","Chin",25,343.75]
["2009-03-06","Sunshine","Albertsons","Fred",15,206.25]
["2009-01-10","Quad","Safeway","Sioux",1,13.75]
["2009-04-08","Tri","WholeFoods","Sue",9,123.75]
["2008-07-29","SunBell","WholeFoods","Sioux",24,330]
["2008-10-27","Quad","TraderJoe's","Joe",4,55]
["2008-12-30","SunBell","PCC","Pham",11,151.25]
["2008-09-15","Bellen","Albertsons","Jo",8,110]
["2009-07-18","Sunshine","QFC","Sue",3,41.25]
["2008-05-28","Sunshine","PCC","Sioux",19,261.25]
["2009-05-10","Bellen","Coop","Chin",24,330]
["2008-09-08","SunBell","Safeway","Sue",14,192.5]
["2008-11-15","Sunset","WholeFoods","Pham",19,261.25]
["2008-10-05","Sunset","Coop","Pham",15,206.25]
["2009-08-31","Sunset","WholeFoods","Sue",21,288.75]
["2008-09-12","SunBell","Coop","Jo",7,96.25]
["2009-04-07","Quad","WholeFoods","Jo",6,82.5]
["2008-07-15","Bellen","Albertsons","Jo",3,41.25]
["2009-08-12","Bellen","PCC","Sue",17,233.75]
["2009-08-20","Sunset","Coop","Chin",20,275]
["2008-12-18","Carlota","PCC","Sue",6,82.5]
["2009-03-20","SunBell","WholeFoods","Sue",19,261.25]
["2008-04-16","SunBell","Safeway","Sioux",4,55]
["2008-07-30","Quad","Coop","Jo",5,68.75]
["2008-09-29","Quad","Safeway","Pham",13,178.75]
["2008-12-08","SunBell","Coop","Sue",1,13.75]
["2009-07-21","SunBell","WholeFoods","Jo",4,55]
["2009-02-04","Bellen","QFC","Pham",9,123.75]
["2009-10-07","Sunshine","PCC","Jo",1,13.75]
["2008-07-01","Tri","PCC","Chin",24,330]
["2008-12-16","SunBell","Safeway","Jo",9,123.75]
["2009-02-26","Carlota","Safeway","Sioux",17,233.75]
["2009-04-30","Carlota","TraderJoe's","Jo",22,302.5]
["2009-08-22","Sunshine","QFC","Fred",21,288.75]
["2008-05-19","Carlota","WholeFoods","Pham",21,288.75]
["2008-08-25","Carlota","Safeway","Joe",4,55]
["2009-03-04","Tri","QFC","Fred",25,343.75]
["2008-02-06","Tri","TraderJoe's","Joe",19,261.25]
["2008-10-09","Sunset","QFC","Pham",7,96.25]
["2008-03-14","Bellen","PCC","Sue",13,178.75]
["2008-12-26","Quad","Safeway","Chin",2,27.5]
["2009-08-25","Sunshine","Coop","Jo",24,330]
["2009-07-13","Tri","Safeway","Joe",18,247.5]
["2009-09-06","Tri","WholeFoods","Pham",9,123.75]
["2008-11-25","Quad","WholeFoods","Fred",4,55]
["2009-05-12","Tri","TraderJoe's","Fred",4,55]
["2008-07-10","Tri","Albertsons","Joe",20,275]
["2009-07-04","Bellen","QFC","Pham",10,137.5]
["2009-10-17","Tri","WholeFoods","Jo",12,165]

{"sheet":"PT Slicers (an)","index":8,"n_rows":12,"n_cols":3,"rows_kept":12,"cut":false,"hidden":false,"merged":[]}
[]
[]
["Years","Date","Sum of Sales"]
["2008","Mar",343.75]
[null,"Jul",316.25]
[null,"Dec",165]
["2009","Feb",123.75]
[null,"Mar",550]
[null,"Apr",330]
[null,"May",206.25]
[null,"Jul",261.25]
["Grand Total",null,2296.25]

{"sheet":"New Print","index":9,"n_rows":369,"n_cols":7,"rows_kept":369,"cut":false,"hidden":false,"merged":[]}
["Print Options and Print Preview are combined"]
["WARNING: Red x in upper right corner closed Excel"]
["Ctrl + P and Ctrl F2 (old Print Preview keyboard) open New Print"]
[]
["Years","Rate","Periods per year","Loan","Total Periods","Period Rate","PMT"]
[30,4.7500000000000001E-2,12,250000,{"$f":"C6*A6","v":360},{"$f":"B6/C6","v":3.9583333333333337E-3},{"$f":"-PMT(F6,E6,D6)","v":1304.1183412577773}]
[]
["Period","PMT","Interest","Principal Paid","Balance"]
[0,null,null,null,{"$f":"D6","v":250000}]
[1,{"$f":"G$6","v":1304.1183412577773},{"$f":"E9*F$6","v":989.58333333333337},{"$f":"B10-C10","v":314.5350079244439},{"$f":"E9-D10","v":249685.46499207555}]
[2,{"$f":"G$6","v":1304.1183412577773},{"$f":"E10*F$6","v":988.33829892696576},{"$f":"B11-C11","v":315.78004233081151},249369.68494974473]
[3,1304.1183412577773,987.08833625940633,317.03000499837094,249052.65494474635]
[4,1304.1183412577773,985.83342582295438,318.28491543482289,248734.37002931151]
[5,1304.1183412577773,984.57354803269152,319.54479322508575,248414.82523608641]
[6,1304.1183412577773,983.3086832261755,320.80965803160177,248094.01557805482]
[7,1304.1183412577773,982.03881166313374,322.07952959464353,247771.93604846019]
[8,1304.1183412577773,980.76391352515498,323.3544277326223,247448.58162072758]
[9,1304.1183412577773,979.48396891538005,324.63437234239723,247123.94724838517]
[10,1304.1183412577773,978.19895785819142,325.91938339958585,246798.02786498558]
[11,1304.1183412577773,976.90886029890135,327.20948095887593,246470.8183840267]
[12,1304.1183412577773,975.6136561034391,328.50468515433818,246142.31369887237]
[13,1304.1183412577773,974.31332505803653,329.80501619974075,245812.50868267263]
[14,1304.1183412577773,973.00784686891257,331.11049438886471,245481.39818828375]
[15,1304.1183412577773,971.69720116195663,332.42114009582065,245148.97704818792]
[16,1304.1183412577773,970.38136748241061,333.73697377536666,244815.24007441255]
[17,1304.1183412577773,969.06032529454978,335.05801596322749,244480.18205844931]
[18,1304.1183412577773,967.73405398136197,336.38428727641531,244143.79777117289]
[19,1304.1183412577773,966.40253284422613,337.71580841355114,243806.08196275934]
[20,1304.1183412577773,965.06574110258919,339.05260015518809,243467.02936260417]
[21,1304.1183412577773,963.72365789364153,340.39468336413574,243126.63467924003]
[22,1304.1183412577773,962.37626227199189,341.74207898578538,242784.89260025424]
[23,1304.1183412577773,961.0235332093398,343.09480804843747,242441.79779220582]
[24,1304.1183412577773,959.66544959414807,344.4528916636292,242097.3449005422]
[25,1304.1183412577773,958.30199023131297,345.8163510264643,241751.52854951573]
[26,1304.1183412577773,956.93313384183318,347.18520741594409,241404.34334209978]
[27,1304.1183412577773,955.5588590624784,348.55948219529887,241055.78385990448]
[28,1304.1183412577773,954.17914444545534,349.93919681232194,240705.84466309217]
[29,1304.1183412577773,952.79396845807321,351.32437279970407,240354.52029029245]
[30,1304.1183412577773,951.40330948240774,352.71503177536954,240001.80525851707]
[31,1304.1183412577773,950.00714581496345,354.11119544281382,239647.69406307425]
[32,1304.1183412577773,948.60545566633562,355.51288559144166,239292.18117748279]
[33,1304.1183412577773,947.19821716086949,356.92012409690778,238935.26105338588]
[34,1304.1183412577773,945.78540833631916,358.33293292145811,238576.92812046444]
[35,1304.1183412577773,944.36700714350513,359.75133411427214,238217.17678635017]
[36,1304.1183412577773,942.94299144596948,361.17534981180779,237856.00143653835]
[37,1304.1183412577773,941.51333901963108,362.6050022381462,237493.3964343002]
[38,1304.1183412577773,940.07802755243836,364.04031370533892,237129.35612059486]
[39,1304.1183412577773,938.63703464402147,365.48130661375581,236763.87481398112]
[40,1304.1183412577773,937.19033780534198,366.92800345243529,236396.94681052869]
[41,1304.1183412577773,935.73791445834286,368.38042679943442,236028.56638372925]
[42,1304.1183412577773,934.27974193559498,369.83859932218229,235658.72778440706]
[43,1304.1183412577773,932.81579747994465,371.30254377783262,235287.42524062924]
[44,1304.1183412577773,931.34605824415746,372.77228301361981,234914.65295761562]
[45,1304.1183412577773,929.87050129056195,374.24783996721533,234540.40511764839]
[46,1304.1183412577773,928.38910359069166,375.72923766708561,234164.67587998131]
[47,1304.1183412577773,926.90184202492605,377.21649923285122,233787.45938074845]
[48,1304.1183412577773,925.4086933821294,378.70964787564787,233408.74973287279]
[49,1304.1183412577773,923.90963435928825,380.20870689848903,233028.54102597429]
[50,1304.1183412577773,922.40464156114831,381.71369969662896,232646.82732627768]
[51,1304.1183412577773,920.89369149984918,383.22464975792809,232263.60267651975]
[52,1304.1183412577773,919.37676059455737,384.74158066321991,231878.86109585653]
[53,1304.1183412577773,917.85382517109883,386.26451608667844,231492.59657976986]
[54,1304.1183412577773,916.32486146158908,387.79347979618819,231104.80309997368]
[55,1304.1183412577773,914.78984560406252,389.32849565371475,230715.47460431996]
[56,1304.1183412577773,913.24875364209993,390.86958761567735,230324.60501670427]
[57,1304.1183412577773,911.70156152445452,392.41677973332276,229932.18823697095]
[58,1304.1183412577773,910.14824510467679,393.97009615310049,229538.21814081786]
[59,1304.1183412577773,908.58878014073741,395.52956111703986,229142.68857970083]
[60,1304.1183412577773,907.02314229464923,397.09519896312804,228745.5933807377]
[61,1304.1183412577773,905.45130713208675,398.66703412569052,228346.92634661202]
[62,1304.1183412577773,903.87325012200597,400.2450911357713,227946.68125547626]
[63,1304.1183412577773,902.28894663626022,401.82939462151705,227544.85186085475]
[64,1304.1183412577773,900.69837194921672,403.41996930856055,227141.43189154618]
[65,1304.1183412577773,899.10150123737037,405.0168400204069,{"$f":"E73-D74","v":226736.41505152578}]
[66,{"$f":"G$6","v":1304.1183412577773},{"$f":"E74*F$6","v":897.49830957895631},{"$f":"B75-C75","v":406.62003167882096},226329.79501984696]
[67,1304.1183412577773,895.88877195356099,408.22956930421628,225921.56545054275]
[68,1304.1183412577773,894.27286324173178,409.84547801604549,225511.71997252671]
[69,1304.1183412577773,892.65055822458498,411.46778303319229,225100.25218949353]
[70,1304.1183412577773,891.02183158341199,413.09650967436528,224687.15567981917]
[71,1304.1183412577773,889.38665789928427,414.731683358493,{"$f":"E79-D80","v":224272.42399646068}]
[72,1304.1183412577773,887.7450116526569,416.37332960512038,{"$f":"E80-D81","v":223856.05066685556}]
[73,1304.1183412577773,886.09686722296999,418.02147403480728,223438.02919282074]
[74,1304.1183412577773,884.44219888824887,419.67614236952841,223018.3530504512]
[75,1304.1183412577773,882.78098082470274,421.33736043307454,222597.01569001813]
[76,1304.1183412577773,881.1131871063219,423.00515415145537,222174.01053586666]
[77,1304.1183412577773,879.43879170447224,424.67954955330504,221749.33098631335]
[78,1304.1183412577773,877.75776848749035,426.36057277028692,221322.97041354305]
[79,1304.1183412577773,876.07009122027466,428.04825003750261,220894.92216350554]
[80,1304.1183412577773,874.37573356387622,429.74260769390105,220465.17955581163]
[81,1304.1183412577773,872.67466907508776,431.44367218268951,220033.73588362895]
[82,1304.1183412577773,870.96687120603133,433.15147005174595,219600.58441357719]
[83,1304.1183412577773,869.25231330374311,434.86602795403417,219165.71838562316]
[84,1304.1183412577773,867.53096860975836,436.58737264801891,218729.13101297515]
[85,1304.1183412577773,865.80281025969339,438.31553099808389,218290.81548197707]
[86,1304.1183412577773,864.06781128282603,440.05052997495125,217850.76495200212]
[87,1304.1183412577773,862.32594460167513,441.79239665610214,217408.97255534603]
[88,1304.1183412577773,860.5771830315781,443.54115822619917,216965.43139711983]
[89,1304.1183412577773,858.82149928026604,445.29684197751124,216520.13455514231]
[90,1304.1183412577773,857.05886594743845,447.05947531033883,216073.07507983196]
[91,1304.1183412577773,855.28925552433498,448.8290857334423,215624.24599409851]
[92,1304.1183412577773,853.5126403933067,450.60570086447058,215173.64029323406]
[93,1304.1183412577773,851.7289928273849,452.38934843039237,214721.25094480367]
[94,1304.1183412577773,849.93828498984794,454.18005626792933,214267.07088853573]
[95,1304.1183412577773,848.14048893378731,455.97785232398996,213811.09303621174]
[96,1304.1183412577773,846.33557660167151,457.78276465610577,213353.31027155562]
[97,1304.1183412577773,844.52351982490768,459.59482143286959,212893.71545012275]
[98,1304.1183412577773,842.70429032340257,461.4140509343747,212432.30139918838]
[99,1304.1183412577773,840.87785970512073,463.24048155265655,211969.06091763571]
[100,1304.1183412577773,839.04419946564144,465.07414179213583,211503.98677584357]
[101,1304.1183412577773,837.20328098771427,466.91506027006301,211037.07171557352]
[102,1304.1183412577773,835.35507554081187,468.76326571696541,210568.30844985656]
[103,1304.1183412577773,833.49955428068233,470.61878697709494,210097.68966287945]
[104,1304.1183412577773,831.63668824889794,472.48165300887933,209625.20800987058]
[105,1304.1183412577773,829.7664483724044,474.35189288537288,209150.8561169852]
[106,1304.1183412577773,827.88880546306655,476.22953579471073,208674.6265811905]
[107,1304.1183412577773,826.00373021721248,478.1146110405648,208196.51197014994]
[108,1304.1183412577773,824.11119321517685,480.00714804260042,207716.50482210732]
[109,1304.1183412577773,822.21116492084161,481.90717633693566,207234.59764577038]
[110,1304.1183412577773,820.30361568117451,483.81472557660277,206750.78292019377]
[111,1304.1183412577773,818.38851572576709,485.72982553201018,206265.05309466177]
[112,1304.1183412577773,816.46583516636952,487.65250609140776,205777.40058857037]
[113,1304.1183412577773,814.53554399642439,489.58279726135288,205287.817791309]
[114,1304.1183412577773,812.5976120905982,491.52072916717907,204796.29706214182]
[115,1304.1183412577773,810.65200920431141,493.46633205346586,204302.83073008835]
[116,1304.1183412577773,808.69870497326644,495.41963628451083,203807.41109380382]
[117,1304.1183412577773,806.7376689129735,497.38067234480377,203310.03042145903]
[118,1304.1183412577773,804.76887041827536,499.34947083950192,202810.68095061951]
[119,1304.1183412577773,802.79227876286893,501.32606249490834,202309.3548881246]
[120,1304.1183412577773,800.8078630988266,503.31047815895067,201806.04440996563]
[121,1304.1183412577773,798.81559245611402,505.30274880166326,201300.74166116398]
[122,1304.1183412577773,796.81543574210752,507.30290551566975,200793.4387556483]
[123,1304.1183412577773,794.80736174110791,509.31097951666936,200284.12777613162]
[124,1304.1183412577773,792.79133911385441,511.32700214392287,199772.80077398769]
[125,1304.1183412577773,790.76733639703468,513.35100486074259,199259.44976912695]
[126,1304.1183412577773,788.73532200279419,515.38301925498308,198744.06674987197]
[127,1304.1183412577773,786.69526421824332,517.42307703953395,198226.64367283243]
[128,1304.1183412577773,784.64713120496174,519.47121005281554,197707.17246277962]
[129,1304.1183412577773,782.59089099850269,521.52745025927459,197185.64501252034]
[130,{"$f":"G$6","v":1304.1183412577773},{"$f":"E138*F$6","v":780.52651150789313},{"$f":"B139-C139","v":523.59182974988414},196662.05318277047]
[131,1304.1183412577773,778.45396051513319,525.66438074264408,196136.38880202782]
[132,1304.1183412577773,776.37320567469351,527.74513558308377,195608.64366644475]
[133,1304.1183412577773,774.28421451301051,529.83412674476676,195078.80953969999]
[134,1304.1183412577773,772.18695442797912,531.93138682979816,194546.87815287019]
[135,1304.1183412577773,770.08139268844457,534.03694856933271,194012.84120430087]
[136,1304.1183412577773,767.96749643369105,536.15084482408622,{"$f":"E144-D145","v":193476.69035947678}]
[137,1304.1183412577773,765.845232672929,538.27310858484827,192938.41725089194]
[138,1304.1183412577773,763.71456828478063,540.40377297299665,192398.01347791895]
[139,1304.1183412577773,761.57547001676255,542.54287124101472,191855.47060667793]
[140,1304.1183412577773,759.42790448476683,544.69043677301045,191310.78016990493]
[141,1304.1183412577773,757.27183817254047,546.8465030852368,190763.93366681971]
[142,1304.1183412577773,755.10723743116137,549.01110382661591,190214.9225629931]
[143,1304.1183412577773,752.9340684785144,551.18427277926287,189663.73829021383]
[144,1304.1183412577773,750.75229739876318,553.3660438590141,189110.37224635482]
[145,1304.1183412577773,748.56189014182121,555.55645111595607,188554.81579523886]
[146,1304.1183412577773,746.36281252282049,557.75552873495678,187997.06026650389]
[147,1304.1183412577773,744.15503022157793,559.96331103619934,187437.09695546768]
[148,1304.1183412577773,741.93850878205967,562.1798324757176,186874.91712299196]
[149,1304.1183412577773,739.71321361184323,564.40512764593404,186310.51199534602]
[150,1304.1183412577773,737.47910998157806,566.63923127619921,185743.87276406982]
[151,1304.1183412577773,735.23616302444304,568.88217823333423,185174.99058583649]
[152,1304.1183412577773,732.98433773560282,571.13400352217445,184603.85658231433]
[153,1304.1183412577773,730.72359897166098,573.3947422861163,184030.46184002821]
[154,1304.1183412577773,728.45391145011172,575.66442980766556,183454.79741022055]
[155,1304.1183412577773,726.17523974878975,577.94310150898752,182876.85430871157]
[156,1304.1183412577773,723.88754830531673,580.23079295246055,182296.6235157591]
[157,1304.1183412577773,721.59080141654647,582.5275398412308,181714.09597591788]
[158,1304.1183412577773,719.28496323800834,584.83337801976893,181129.26259789811]
[159,1304.1183412577773,716.96999778334668,587.14834347443059,180542.11425442368]
[160,1304.1183412577773,714.64586892376042,589.47247233401686,179952.64178208966]
[161,1304.1183412577773,712.31254038743828,591.805800870339,179360.83598121931]
[162,1304.1183412577773,709.9699757589932,594.14836549878407,178766.68761572053]
[163,1304.1183412577773,707.6181384788938,596.50020277888348,178170.18741294165]
[164,1304.1183412577773,705.25699184289408,598.86134941488319,177571.32606352677]
[165,1304.1183412577773,702.88649900146015,601.23184225631712,176970.09422127044]
[166,1304.1183412577773,700.50662295919551,603.61171829858176,176366.48250297186]
[167,1304.1183412577773,698.11732657426364,606.00101468351363,175760.48148828835]
[168,1304.1183412577773,695.7185725578081,608.39976869996917,175152.08171958837]
[169,1304.1183412577773,693.31032347337066,610.80801778440662,174541.27370180396]
[170,1304.1183412577773,690.89254173630741,613.22579952146987,173928.0479022825]
[171,1304.1183412577773,688.46518961320157,615.6531516445757,173312.39475063793]
[172,1304.1183412577773,686.02822922127518,618.09011203650209,172694.30463860143]
[173,1304.1183412577773,683.58162252779744,620.53671872997984,172073.76791987146]
[174,1304.1183412577773,681.12533134949126,622.99300990828601,171450.77490996316]
[175,1304.1183412577773,678.6593173519376,625.45902390583967,170825.31588605733]
[176,1304.1183412577773,676.18354204897696,627.93479920880031,170197.38108684853]
[177,1304.1183412577773,673.69796680210879,630.42037445566848,169566.96071239287]
[178,1304.1183412577773,671.20255281988852,632.91578843788875,168934.04492395499]
[179,1304.1183412577773,668.69726115732192,635.42108010045536,168298.62384385453]
[180,1304.1183412577773,666.18205271525756,637.93628854251972,167660.687555312]
[181,1304.1183412577773,663.65688823977678,640.4614530180005,167020.22610229399]
[182,1304.1183412577773,661.12172832158046,642.99661293619681,166377.22948935779]
[183,1304.1183412577773,658.57653339537467,645.54180786240261,165731.68768149539]
[184,1304.1183412577773,656.02126373925262,648.09707751852466,165083.59060397686]
[185,1304.1183412577773,653.45587947407512,650.66246178370216,164432.92814219315]
[186,1304.1183412577773,650.88034056284789,653.23800069492938,163779.69014149823]
[187,1304.1183412577773,648.29460681009721,655.82373444768007,163123.86640705055]
[188,1304.1183412577773,645.69863786124176,658.41970339653551,162465.44670365402]
[189,1304.1183412577773,643.09239320196389,661.02594805581339,161804.4207555982]
[190,1304.1183412577773,640.47583215757629,663.64250910020098,161140.778246498]
[191,1304.1183412577773,637.84891389238794,666.26942736538933,160474.50881913261]
[192,1304.1183412577773,635.2115974090666,668.90674384871068,159805.60207528391]
[193,1304.1183412577773,632.56384154799889,671.55449970977838,159134.04757557414]
[194,{"$f":"G$6","v":1304.1183412577773},{"$f":"E202*F$6","v":629.90560498664763},{"$f":"B203-C203","v":674.21273627112964},158459.83483930302]
[195,1304.1183412577773,627.23684623890779,676.88149501886949,157782.95334428415]
[196,1304.1183412577773,624.55752365445812,679.56081760331915,157103.39252668084]
[197,1304.1183412577773,621.8675954181117,682.25074583966557,156421.14178084116]
[198,1304.1183412577773,619.167019549163,684.95132170861427,155736.19045913254]
[199,1304.1183412577773,616.45575390073304,687.66258735704423,155048.5278717755]
[200,1304.1183412577773,613.73375615911141,690.38458509866587,{"$f":"E208-D209","v":154358.14328667684}]
[201,1304.1183412577773,611.00098384309592,693.11735741468135,153665.02592926216]
[202,1304.1183412577773,608.25739430332942,695.86094695444785,152969.1649823077]
[203,1304.1183412577773,605.50294472163466,698.61539653614261,152270.54958577157]
[204,1304.1183412577773,602.73759211034587,701.3807491474314,151569.16883662413]
[205,1304.1183412577773,599.96129331163718,704.1570479461401,150865.01178867798]
[206,1304.1183412577773,597.17400499685039,706.94433626092689,150158.06745241705]
[207,1304.1183412577773,594.37568366581752,709.74265759195976,149448.32479482508]
[208,1304.1183412577773,591.56628564618268,712.5520556115946,148735.77273921348]
[209,1304.1183412577773,588.74576709272014,715.37257416505713,148020.40016504843]
[210,1304.1183412577773,585.9140839866501,718.20425727112718,147302.19590777729]
[211,1304.1183412577773,583.07119213495184,721.04714912282543,146581.14875865445]
[212,1304.1183412577773,580.21704716967395,723.90129408810333,145857.24746456635]
[213,1304.1183412577773,577.35160454724189,726.76673671053538,145130.48072785581]
[214,1304.1183412577773,574.47481954776265,729.64352171001462,144400.83720614581]
[215,1304.1183412577773,571.58664727432722,732.53169398345005,143668.30551216236]
[216,1304.1183412577773,568.6870426523094,735.43129860546787,142932.8742135569]
[217,1304.1183412577773,565.77596042866276,738.34238082911452,142194.53183272778]
[218,1304.1183412577773,562.85335517121416,741.26498608656311,141453.26684664123]
[219,1304.1183412577773,559.91918126795485,744.19915998982242,140709.0676866514]
[220,1304.1183412577773,556.97339292632853,747.14494833144875,139961.92273831996]
[221,1304.1183412577773,554.01594417251658,750.10239708526069,139211.82034123471]
[222,1304.1183412577773,551.04678885072076,753.07155240705652,138458.74878882765]
[223,1304.1183412577773,548.06588062244282,756.05246063533446,137702.69632819231]
[224,1304.1183412577773,545.07317296576127,759.045168292016,136943.6511599003]
[225,1304.1183412577773,542.06861917460537,762.0497220831719,136181.60143781712]
[226,1304.1183412577773,539.05217235802616,765.06616889975112,135416.53526891736]
[227,1304.1183412577773,536.02378543946463,768.09455581831264,134648.44071309906]
[228,1304.1183412577773,532.98341115601716,771.13493010176012,133877.30578299731]
[229,1304.1183412577773,529.9310020576977,774.18733920007958,133103.11844379723]
[230,1304.1183412577773,526.86651050669741,777.25183075107986,132325.86661304615]
[231,1304.1183412577773,523.789888676641,780.32845258113628,131545.53816046502]
[232,1304.1183412577773,520.70108855184071,783.41725270593656,130762.12090775908]
[233,1304.1183412577773,517.60006192654635,786.51827933123093,129975.60262842785]
[234,1304.1183412577773,514.48676040419366,789.63158085358361,129185.97104757426]
[235,1304.1183412577773,511.36113539664814,792.75720586112914,128393.21384171314]
[236,1304.1183412577773,508.22313812344788,795.89520313432945,127597.3186385788]
[237,1304.1183412577773,505.07271961104112,799.04562164673621,126798.27301693206]
[238,1304.1183412577773,501.90983069202275,802.20851056575452,125996.0645063663]
[239,1304.1183412577773,498.73442200436665,805.38391925341057,125190.68058711289]
[240,1304.1183412577773,495.54644399065523,808.57189726712204,124382.10868984577]
[241,1304.1183412577773,492.34584689730622,811.772494360471,123570.3361954853]
[242,1304.1183412577773,489.13258077379601,814.98576048398127,122755.35043500132]
[243,1304.1183412577773,485.90659547188028,818.21174578589694,121937.13868921543]
[244,1304.1183412577773,482.66784064481112,821.45050061296615,121115.68818860246]
[245,1304.1183412577773,479.41626574655146,824.70207551122576,120290.98611309123]
[246,1304.1183412577773,476.15182003098619,827.96652122679109,119463.01959186445]
[247,1304.1183412577773,472.87445255113016,831.24388870664711,118631.77570315779]
[248,1304.1183412577773,469.58411215833297,834.53422909944425,117797.24147405835]
[249,1304.1183412577773,466.28074750148102,837.8375937562962,116959.40388030205]
[250,1304.1183412577773,462.96430702619568,841.15403423158159,116118.24984607047]
[251,1304.1183412577773,459.63473897402895,844.48360228374827,115273.76624378671]
[252,1304.1183412577773,456.29199138165575,847.82634987612153,114425.93989391059]
[253,1304.1183412577773,452.93601208006277,851.18232917771456,113574.75756473288]
[254,1304.1183412577773,449.56674869373433,854.55159256404295,112720.20597216883]
[255,1304.1183412577773,446.18414863983497,857.93419261794224,111862.27177955088]
[256,1304.1183412577773,442.78815912738895,861.33018213038827,111000.94159742049]
[257,1304.1183412577773,439.37872715645614,864.73961410132119,110136.20198331917]
[258,{"$f":"G$6","v":1304.1183412577773},{"$f":"E266*F$6","v":435.95579951730508},{"$f":"B267-C267","v":868.16254174047219},109268.0394415787]
[259,1304.1183412577773,432.51932278958242,871.5990184681948,108396.4404231105]
[260,1304.1183412577773,429.06924334147908,875.04909791629825,107521.3913251942]
[261,1304.1183412577773,425.60550732889374,878.51283392888354,106642.87849126532]
[262,1304.1183412577773,422.12806069459191,881.99028056318537,105760.88821070213]
[263,1304.1183412577773,418.63684916736264,885.48149209041458,104875.40671861172]
[264,1304.1183412577773,415.13181826117142,888.9865229966058,{"$f":"E272-D273","v":103986.42019561511}]
[265,1304.1183412577773,411.61291327430985,892.50542798346737,103093.91476763164]
[266,1304.1183412577773,408.08007928854192,896.03826196923535,102197.8765056624]
[267,1304.1183412577773,404.53326116824701,899.58508008953027,101298.29142557287]
[268,1304.1183412577773,400.97240355955933,903.14593769821795,100395.14548787464]
[269,1304.1183412577773,397.39745088950383,906.72089036827344,99488.424597506368]
[270,1304.1183412577773,393.80834736512941,910.30999389264787,98578.114603613722]
[271,1304.1183412577773,390.20503697263769,913.91330428513959,97664.201299328575]
[272,1304.1183412577773,386.58746347650896,917.53087778126837,96746.6704215473]
[273,1304.1183412577773,382.95557041862475,921.16277083915247,95825.507650708154]
[274,1304.1183412577773,379.3093011173865,924.80904014039083,94900.698610567764]
[275,1304.1183412577773,375.64859866683076,928.46974259094645,93972.228867976824]
[276,1304.1183412577773,371.97340593574165,932.14493532203562,93040.083932654787]
[277,1304.1183412577773,368.28366556675854,935.83467569101867,92104.249256963769]
[278,1304.1183412577773,364.57931997548161,939.53902128229561,91164.710235681472]
[279,1304.1183412577773,360.8603113495725,943.25802990820478,90221.452205773268]
[280,1304.1183412577773,357.12658164785256,946.99175960992466,89274.460446163343]
[281,1304.1183412577773,353.3780725993966,950.74026865838073,88323.720177504962]
[282,1304.1183412577773,349.61472570262384,954.50361555515337,87369.216561949812]
[283,1304.1183412577773,345.83648222438472,958.28185903339249,86410.93470291642]
[284,1304.1183412577773,342.0432831990442,962.07505805873302,85448.859644857686]
[285,1304.1183412577773,338.23506942756171,965.88327183021556,84482.976373027472]
[286,1304.1183412577773,334.41178147656711,969.70655978121022,83513.269813246268]
[287,1304.1183412577773,330.57335967743319,973.54498158034403,82539.724831665924]
[288,1304.1183412577773,326.71974412534433,977.398597132433,81562.326234533495]
[289,1304.1183412577773,322.85087467836178,981.26746657941544,80581.058767954077]
[290,1304.1183412577773,318.96669095648491,985.15165030129242,79595.90711765278]
[291,1304.1183412577773,315.06713234070895,989.05120891706838,78606.855908735713]
[292,1304.1183412577773,311.15213797207889,992.96620328569838,77613.889705450012]
[293,1304.1183412577773,307.22164675073964,996.89669450703764,76616.99301094297]
[294,1304.1183412577773,303.27559733498259,1000.8427439227946,75616.150267020173]
[295,1304.1183412577773,299.31392814028823,1004.804413117489,74611.345853902691]
[296,1304.1183412577773,295.33657733836486,1008.7817639194125,73602.56408998328]
[297,1304.1183412577773,291.34348285618387,1012.7748584015934,72589.789231581686]
[298,1304.1183412577773,287.33458237501088,1016.7837588827664,71573.005472698918]
[299,1304.1183412577773,283.30981332943327,1020.808527928344,70552.196944770578]
[300,1304.1183412577773,279.26911290638355,1024.8492283513938,69527.347716419186]
[301,1304.1183412577773,275.21241804415928,1028.9059232136181,68498.441793205566]
[302,1304.1183412577773,271.13966543143874,1032.9786758263385,67465.46311737923]
[303,1304.1183412577773,267.0507915062928,1037.0675497514844,66428.39556762774]
[304,1304.1183412577773,262.94573245519314,1041.1726088025841,65387.222958825158]
[305,1304.1183412577773,258.82442421201625,1045.293917045761,64341.929041779396]
[306,1304.1183412577773,254.68680245704346,1049.4315388007337,63292.497502978666]
[307,1304.1183412577773,250.53280261595725,1053.58553864182,62238.911964336847]
[308,1304.1183412577773,246.36235985883337,1057.755981398944,61181.155982937904]
[309,1304.1183412577773,242.17540909912921,1061.9429321586481,60119.213050779254]
[310,1304.1183412577773,237.9718849926679,1066.1464562651095,59053.066594514145]
[311,1304.1183412577773,233.75172193661851,1070.3666193211589,57982.699975192983]
[312,1304.1183412577773,229.51485406847223,1074.603487189305,56908.096488003677]
[313,1304.1183412577773,225.26121526501458,1078.8571259927626,55829.239362010914]
[314,1304.1183412577773,220.99073914129323,1083.127602116484,54746.111759894433]
[315,1304.1183412577773,216.70335904958216,1087.4149822081952,53658.696777686237]
[316,1304.1183412577773,212.39900807834138,1091.7193331794358,52566.977444506803]
[317,1304.1183412577773,208.07761905117277,1096.0407222066044,51470.936722300197]
[318,1304.1183412577773,203.73912452577164,1100.3792167320057,50370.557505568191]
[319,1304.1183412577773,199.38345679287411,1104.7348844649032,49265.822621103289]
[320,1304.1183412577773,195.01054787520053,1109.1077933825768,48156.714827720709]
[321,1304.1183412577773,190.6203295263945,1113.4980117313828,47043.216815989326]
[322,{"$f":"G$6","v":1304.1183412577773},{"$f":"E330*F$6","v":186.21273322995776},{"$f":"B331-C331","v":1117.9056080278194},45925.311207961509]
[323,1304.1183412577773,181.787690198181,1122.3306510595962,44802.980556901915]
[324,1304.1183412577773,177.3451313710701,1126.7732098867073,43676.20734701521]
[325,1304.1183412577773,172.88498741526854,1131.2333538425087,42544.973993172702]
[326,1304.1183412577773,168.40718872297529,1135.7111525348021,41409.262840637901]
[327,1304.1183412577773,163.91166541085838,1140.2066758469189,40269.056164790985]
[328,1304.1183412577773,159.39834731896434,1144.7199939388129,{"$f":"E336-D337","v":39124.33617085217}]
[329,1304.1183412577773,154.8671640096232,1149.2511772481541,37975.084993604018]
[330,1304.1183412577773,150.31804476634926,1153.8002964914281,36821.284697112591]
[331,1304.1183412577773,145.75091859273735,1158.3674226650398,35662.917274447551]
[332,1304.1183412577773,141.1657142113549,1162.9526270464223,34499.964647401132]
[333,1304.1183412577773,136.56236006262949,1167.5559811951478,33332.408666205985]
[334,1304.1183412577773,131.94078430373204,1172.1775569540453,32160.231109251941]
[335,1304.1183412577773,127.30091480745561,1176.8174264503216,30983.41368280162]
[336,1304.1183412577773,122.64267916108976,1181.4756620966875,29801.938020704933]
[337,1304.1183412577773,117.96600466529037,1186.1523365924868,28615.785684112445]
[338,1304.1183412577773,113.2708183329451,1190.8475229248322,27424.938161187612]
[339,1304.1183412577773,108.55704688803431,1195.5612943697429,26229.376866817871]
[340,1304.1183412577773,103.82461676448742,1200.2937244932898,25029.08314232458]
[341,1304.1183412577773,99.073454105034799,1205.0448871527424,23824.038255171836]
[342,1304.1183412577773,94.303484760055184,1209.8148564977221,22614.223398674112]
[343,1304.1183412577773,89.514634286418371,1214.6037069713589,21399.619691702752]
[344,1304.1183412577773,84.706827946323401,1219.411513311454,20180.208178391298]
[345,1304.1183412577773,79.879990706132233,1224.238350551645,18955.969827839654]
[346,1304.1183412577773,75.034047235198642,1229.0842940225787,17726.885533817076]
[347,1304.1183412577773,70.168921904692596,1233.9494193530847,16492.936114463992]
[348,1304.1183412577773,65.284538786419972,1238.8338024713573,15254.102311992634]
[349,1304.1183412577773,60.380821651637511,1243.7375196061398,14010.364792386494]
[350,1304.1183412577773,55.457693969863207,1248.6606472879141,12761.70414509858]
[351,1304.1183412577773,50.515078907681882,1253.6032623500953,11508.100882748484]
[352,1304.1183412577773,45.552899327546086,1258.5654419302311,10249.535440818252]
[353,1304.1183412577773,40.571077786572253,1263.547263471205,8985.9881773470479]
[354,1304.1183412577773,35.56953653533207,1268.5488047224453,7717.4393726246026]
[355,1304.1183412577773,30.548197516639053,1273.5701437411383,6443.8692288834645]
[356,1304.1183412577773,25.506982364330383,1278.6113588934468,5165.2578699900178]
[357,1304.1183412577773,20.445812402043821,1283.6725288557334,3881.5853411342841]
[358,1304.1183412577773,15.364608641989877,1288.7537326157874,2592.831608518497]
[359,1304.1183412577773,10.263291783719051,1293.8550494740582,1298.9765590444388]
[360,1304.1183412577773,5.1417822128842374,1298.9765590448931,-4.5429260353557765E-10]

{"sheet":"New Print (an)","index":10,"n_rows":369,"n_cols":7,"rows_kept":369,"cut":false,"hidden":false,"merged":[]}
["Print Options and Print Preview are combined"]
["WARNING: Red x in upper right corner closed Excel"]
["Ctrl + P and Ctrl F2 (old Print Preview keyboard) open New Print"]
[]
["Years","Rate","Periods per year","Loan","Total Periods","Period Rate","PMT"]
[30,4.7500000000000001E-2,12,250000,{"$f":"C6*A6","v":360},{"$f":"B6/C6","v":3.9583333333333337E-3},{"$f":"-PMT(F6,E6,D6)","v":1304.1183412577773}]
[]
["Period","PMT","Interest","Principal Paid","Balance"]
[0,null,null,null,{"$f":"D6","v":250000}]
[1,{"$f":"G$6","v":1304.1183412577773},{"$f":"E9*F$6","v":989.58333333333337},{"$f":"B10-C10","v":314.5350079244439},{"$f":"E9-D10","v":249685.46499207555}]
[2,{"$f":"G$6","v":1304.1183412577773},{"$f":"E10*F$6","v":988.33829892696576},{"$f":"B11-C11","v":315.78004233081151},249369.68494974473]
[3,1304.1183412577773,987.08833625940633,317.03000499837094,249052.65494474635]
[4,1304.1183412577773,985.83342582295438,318.28491543482289,248734.37002931151]
[5,1304.1183412577773,984.57354803269152,319.54479322508575,248414.82523608641]
[6,1304.1183412577773,983.3086832261755,320.80965803160177,248094.01557805482]
[7,1304.1183412577773,982.03881166313374,322.07952959464353,247771.93604846019]
[8,1304.1183412577773,980.76391352515498,323.3544277326223,247448.58162072758]
[9,1304.1183412577773,979.48396891538005,324.63437234239723,247123.94724838517]
[10,1304.1183412577773,978.19895785819142,325.91938339958585,246798.02786498558]
[11,1304.1183412577773,976.90886029890135,327.20948095887593,246470.8183840267]
[12,1304.1183412577773,975.6136561034391,328.50468515433818,246142.31369887237]
[13,1304.1183412577773,974.31332505803653,329.80501619974075,245812.50868267263]
[14,1304.1183412577773,973.00784686891257,331.11049438886471,245481.39818828375]
[15,1304.1183412577773,971.69720116195663,332.42114009582065,245148.97704818792]
[16,1304.1183412577773,970.38136748241061,333.73697377536666,244815.24007441255]
[17,1304.1183412577773,969.06032529454978,335.05801596322749,244480.18205844931]
[18,1304.1183412577773,967.73405398136197,336.38428727641531,244143.79777117289]
[19,1304.1183412577773,966.40253284422613,337.71580841355114,243806.08196275934]
[20,1304.1183412577773,965.06574110258919,339.05260015518809,243467.02936260417]
[21,1304.1183412577773,963.72365789364153,340.39468336413574,243126.63467924003]
[22,1304.1183412577773,962.37626227199189,341.74207898578538,242784.89260025424]
[23,1304.1183412577773,961.0235332093398,343.09480804843747,242441.79779220582]
[24,1304.1183412577773,959.66544959414807,344.4528916636292,242097.3449005422]
[25,1304.1183412577773,958.30199023131297,345.8163510264643,241751.52854951573]
[26,1304.1183412577773,956.93313384183318,347.18520741594409,241404.34334209978]
[27,1304.1183412577773,955.5588590624784,348.55948219529887,241055.78385990448]
[28,1304.1183412577773,954.17914444545534,349.93919681232194,240705.84466309217]
[29,1304.1183412577773,952.79396845807321,351.32437279970407,240354.52029029245]
[30,1304.1183412577773,951.40330948240774,352.71503177536954,240001.80525851707]
[31,1304.1183412577773,950.00714581496345,354.11119544281382,239647.69406307425]
[32,1304.1183412577773,948.60545566633562,355.51288559144166,239292.18117748279]
[33,1304.1183412577773,947.19821716086949,356.92012409690778,238935.26105338588]
[34,1304.1183412577773,945.78540833631916,358.33293292145811,238576.92812046444]
[35,1304.1183412577773,944.36700714350513,359.75133411427214,238217.17678635017]
[36,1304.1183412577773,942.94299144596948,361.17534981180779,237856.00143653835]
[37,1304.1183412577773,941.51333901963108,362.6050022381462,237493.3964343002]
[38,1304.1183412577773,940.07802755243836,364.04031370533892,237129.35612059486]
[39,1304.1183412577773,938.63703464402147,365.48130661375581,236763.87481398112]
[40,1304.1183412577773,937.19033780534198,366.92800345243529,236396.94681052869]
[41,1304.1183412577773,935.73791445834286,368.38042679943442,236028.56638372925]
[42,1304.1183412577773,934.27974193559498,369.83859932218229,235658.72778440706]
[43,1304.1183412577773,932.81579747994465,371.30254377783262,235287.42524062924]
[44,1304.1183412577773,931.34605824415746,372.77228301361981,234914.65295761562]
[45,1304.1183412577773,929.87050129056195,374.24783996721533,234540.40511764839]
[46,1304.1183412577773,928.38910359069166,375.72923766708561,234164.67587998131]
[47,1304.1183412577773,926.90184202492605,377.21649923285122,233787.45938074845]
[48,1304.1183412577773,925.4086933821294,378.70964787564787,233408.74973287279]
[49,1304.1183412577773,923.90963435928825,380.20870689848903,233028.54102597429]
[50,1304.1183412577773,922.40464156114831,381.71369969662896,232646.82732627768]
[51,1304.1183412577773,920.89369149984918,383.22464975792809,232263.60267651975]
[52,1304.1183412577773,919.37676059455737,384.74158066321991,231878.86109585653]
[53,1304.1183412577773,917.85382517109883,386.26451608667844,231492.59657976986]
[54,1304.1183412577773,916.32486146158908,387.79347979618819,231104.80309997368]
[55,1304.1183412577773,914.78984560406252,389.32849565371475,230715.47460431996]
[56,1304.1183412577773,913.24875364209993,390.86958761567735,230324.60501670427]
[57,1304.1183412577773,911.70156152445452,392.41677973332276,229932.18823697095]
[58,1304.1183412577773,910.14824510467679,393.97009615310049,229538.21814081786]
[59,1304.1183412577773,908.58878014073741,395.52956111703986,229142.68857970083]
[60,1304.1183412577773,907.02314229464923,397.09519896312804,228745.5933807377]
[61,1304.1183412577773,905.45130713208675,398.66703412569052,228346.92634661202]
[62,1304.1183412577773,903.87325012200597,400.2450911357713,227946.68125547626]
[63,1304.1183412577773,902.28894663626022,401.82939462151705,227544.85186085475]
[64,1304.1183412577773,900.69837194921672,403.41996930856055,227141.43189154618]
[65,1304.1183412577773,899.10150123737037,405.0168400204069,{"$f":"E73-D74","v":226736.41505152578}]
[66,{"$f":"G$6","v":1304.1183412577773},{"$f":"E74*F$6","v":897.49830957895631},{"$f":"B75-C75","v":406.62003167882096},226329.79501984696]
[67,1304.1183412577773,895.88877195356099,408.22956930421628,225921.56545054275]
[68,1304.1183412577773,894.27286324173178,409.84547801604549,225511.71997252671]
[69,1304.1183412577773,892.65055822458498,411.46778303319229,225100.25218949353]
[70,1304.1183412577773,891.02183158341199,413.09650967436528,224687.15567981917]
[71,1304.1183412577773,889.38665789928427,414.731683358493,{"$f":"E79-D80","v":224272.42399646068}]
[72,1304.1183412577773,887.7450116526569,416.37332960512038,{"$f":"E80-D81","v":223856.05066685556}]
[73,1304.1183412577773,886.09686722296999,418.02147403480728,223438.02919282074]
[74,1304.1183412577773,884.44219888824887,419.67614236952841,223018.3530504512]
[75,1304.1183412577773,882.78098082470274,421.33736043307454,222597.01569001813]
[76,1304.1183412577773,881.1131871063219,423.00515415145537,222174.01053586666]
[77,1304.1183412577773,879.43879170447224,424.67954955330504,221749.33098631335]
[78,1304.1183412577773,877.75776848749035,426.36057277028692,221322.97041354305]
[79,1304.1183412577773,876.07009122027466,428.04825003750261,220894.92216350554]
[80,1304.1183412577773,874.37573356387622,429.74260769390105,220465.17955581163]
[81,1304.1183412577773,872.67466907508776,431.44367218268951,220033.73588362895]
[82,1304.1183412577773,870.96687120603133,433.15147005174595,219600.58441357719]
[83,1304.1183412577773,869.25231330374311,434.86602795403417,219165.71838562316]
[84,1304.1183412577773,867.53096860975836,436.58737264801891,218729.13101297515]
[85,1304.1183412577773,865.80281025969339,438.31553099808389,218290.81548197707]
[86,1304.1183412577773,864.06781128282603,440.05052997495125,217850.76495200212]
[87,1304.1183412577773,862.32594460167513,441.79239665610214,217408.97255534603]
[88,1304.1183412577773,860.5771830315781,443.54115822619917,216965.43139711983]
[89,1304.1183412577773,858.82149928026604,445.29684197751124,216520.13455514231]
[90,1304.1183412577773,857.05886594743845,447.05947531033883,216073.07507983196]
[91,1304.1183412577773,855.28925552433498,448.8290857334423,215624.24599409851]
[92,1304.1183412577773,853.5126403933067,450.60570086447058,215173.64029323406]
[93,1304.1183412577773,851.7289928273849,452.38934843039237,214721.25094480367]
[94,1304.1183412577773,849.93828498984794,454.18005626792933,214267.07088853573]
[95,1304.1183412577773,848.14048893378731,455.97785232398996,213811.09303621174]
[96,1304.1183412577773,846.33557660167151,457.78276465610577,213353.31027155562]
[97,1304.1183412577773,844.52351982490768,459.59482143286959,212893.71545012275]
[98,1304.1183412577773,842.70429032340257,461.4140509343747,212432.30139918838]
[99,1304.1183412577773,840.87785970512073,463.24048155265655,211969.06091763571]
[100,1304.1183412577773,839.04419946564144,465.07414179213583,211503.98677584357]
[101,1304.1183412577773,837.20328098771427,466.91506027006301,211037.07171557352]
[102,1304.1183412577773,835.35507554081187,468.76326571696541,210568.30844985656]
[103,1304.1183412577773,833.49955428068233,470.61878697709494,210097.68966287945]
[104,1304.1183412577773,831.63668824889794,472.48165300887933,209625.20800987058]
[105,1304.1183412577773,829.7664483724044,474.35189288537288,209150.8561169852]
[106,1304.1183412577773,827.88880546306655,476.22953579471073,208674.6265811905]
[107,1304.1183412577773,826.00373021721248,478.1146110405648,208196.51197014994]
[108,1304.1183412577773,824.11119321517685,480.00714804260042,207716.50482210732]
[109,1304.1183412577773,822.21116492084161,481.90717633693566,207234.59764577038]
[110,1304.1183412577773,820.30361568117451,483.81472557660277,206750.78292019377]
[111,1304.1183412577773,818.38851572576709,485.72982553201018,206265.05309466177]
[112,1304.1183412577773,816.46583516636952,487.65250609140776,205777.40058857037]
[113,1304.1183412577773,814.53554399642439,489.58279726135288,205287.817791309]
[114,1304.1183412577773,812.5976120905982,491.52072916717907,204796.29706214182]
[115,1304.1183412577773,810.65200920431141,493.46633205346586,204302.83073008835]
[116,1304.1183412577773,808.69870497326644,495.41963628451083,203807.41109380382]
[117,1304.1183412577773,806.7376689129735,497.38067234480377,203310.03042145903]
[118,1304.1183412577773,804.76887041827536,499.34947083950192,202810.68095061951]
[119,1304.1183412577773,802.79227876286893,501.32606249490834,202309.3548881246]
[120,1304.1183412577773,800.8078630988266,503.31047815895067,201806.04440996563]
[121,1304.1183412577773,798.81559245611402,505.30274880166326,201300.74166116398]
[122,1304.1183412577773,796.81543574210752,507.30290551566975,200793.4387556483]
[123,1304.1183412577773,794.80736174110791,509.31097951666936,200284.12777613162]
[124,1304.1183412577773,792.79133911385441,511.32700214392287,199772.80077398769]
[125,1304.1183412577773,790.76733639703468,513.35100486074259,199259.44976912695]
[126,1304.1183412577773,788.73532200279419,515.38301925498308,198744.06674987197]
[127,1304.1183412577773,786.69526421824332,517.42307703953395,198226.64367283243]
[128,1304.1183412577773,784.64713120496174,519.47121005281554,197707.17246277962]
[129,1304.1183412577773,782.59089099850269,521.52745025927459,197185.64501252034]
[130,{"$f":"G$6","v":1304.1183412577773},{"$f":"E138*F$6","v":780.52651150789313},{"$f":"B139-C139","v":523.59182974988414},196662.05318277047]
[131,1304.1183412577773,778.45396051513319,525.66438074264408,196136.38880202782]
[132,1304.1183412577773,776.37320567469351,527.74513558308377,195608.64366644475]
[133,1304.1183412577773,774.28421451301051,529.83412674476676,195078.80953969999]
[134,1304.1183412577773,772.18695442797912,531.93138682979816,194546.87815287019]
[135,1304.1183412577773,770.08139268844457,534.03694856933271,194012.84120430087]
[136,1304.1183412577773,767.96749643369105,536.15084482408622,{"$f":"E144-D145","v":193476.69035947678}]
[137,1304.1183412577773,765.845232672929,538.27310858484827,192938.41725089194]
[138,1304.1183412577773,763.71456828478063,540.40377297299665,192398.01347791895]
[139,1304.1183412577773,761.57547001676255,542.54287124101472,191855.47060667793]
[140,1304.1183412577773,759.42790448476683,544.69043677301045,191310.78016990493]
[141,1304.1183412577773,757.27183817254047,546.8465030852368,190763.93366681971]
[142,1304.1183412577773,755.10723743116137,549.01110382661591,190214.9225629931]
[143,1304.1183412577773,752.9340684785144,551.18427277926287,189663.73829021383]
[144,1304.1183412577773,750.75229739876318,553.3660438590141,189110.37224635482]
[145,1304.1183412577773,748.56189014182121,555.55645111595607,188554.81579523886]
[146,1304.1183412577773,746.36281252282049,557.75552873495678,187997.06026650389]
[147,1304.1183412577773,744.15503022157793,559.96331103619934,187437.09695546768]
[148,1304.1183412577773,741.93850878205967,562.1798324757176,186874.91712299196]
[149,1304.1183412577773,739.71321361184323,564.40512764593404,186310.51199534602]
[150,1304.1183412577773,737.47910998157806,566.63923127619921,185743.87276406982]
[151,1304.1183412577773,735.23616302444304,568.88217823333423,185174.99058583649]
[152,1304.1183412577773,732.98433773560282,571.13400352217445,184603.85658231433]
[153,1304.1183412577773,730.72359897166098,573.3947422861163,184030.46184002821]
[154,1304.1183412577773,728.45391145011172,575.66442980766556,183454.79741022055]
[155,1304.1183412577773,726.17523974878975,577.94310150898752,182876.85430871157]
[156,1304.1183412577773,723.88754830531673,580.23079295246055,182296.6235157591]
[157,1304.1183412577773,721.59080141654647,582.5275398412308,181714.09597591788]
[158,1304.1183412577773,719.28496323800834,584.83337801976893,181129.26259789811]
[159,1304.1183412577773,716.96999778334668,587.14834347443059,180542.11425442368]
[160,1304.1183412577773,714.64586892376042,589.47247233401686,179952.64178208966]
[161,1304.1183412577773,712.31254038743828,591.805800870339,179360.83598121931]
[162,1304.1183412577773,709.9699757589932,594.14836549878407,178766.68761572053]
[163,1304.1183412577773,707.6181384788938,596.50020277888348,178170.18741294165]
[164,1304.1183412577773,705.25699184289408,598.86134941488319,177571.32606352677]
[165,1304.1183412577773,702.88649900146015,601.23184225631712,176970.09422127044]
[166,1304.1183412577773,700.50662295919551,603.61171829858176,176366.48250297186]
[167,1304.1183412577773,698.11732657426364,606.00101468351363,175760.48148828835]
[168,1304.1183412577773,695.7185725578081,608.39976869996917,175152.08171958837]
[169,1304.1183412577773,693.31032347337066,610.80801778440662,174541.27370180396]
[170,1304.1183412577773,690.89254173630741,613.22579952146987,173928.0479022825]
[171,1304.1183412577773,688.46518961320157,615.6531516445757,173312.39475063793]
[172,1304.1183412577773,686.02822922127518,618.09011203650209,172694.30463860143]
[173,1304.1183412577773,683.58162252779744,620.53671872997984,172073.76791987146]
[174,1304.1183412577773,681.12533134949126,622.99300990828601,171450.77490996316]
[175,1304.1183412577773,678.6593173519376,625.45902390583967,170825.31588605733]
[176,1304.1183412577773,676.18354204897696,627.93479920880031,170197.38108684853]
[177,1304.1183412577773,673.69796680210879,630.42037445566848,169566.96071239287]
[178,1304.1183412577773,671.20255281988852,632.91578843788875,168934.04492395499]
[179,1304.1183412577773,668.69726115732192,635.42108010045536,168298.62384385453]
[180,1304.1183412577773,666.18205271525756,637.93628854251972,167660.687555312]
[181,1304.1183412577773,663.65688823977678,640.4614530180005,167020.22610229399]
[182,1304.1183412577773,661.12172832158046,642.99661293619681,166377.22948935779]
[183,1304.1183412577773,658.57653339537467,645.54180786240261,165731.68768149539]
[184,1304.1183412577773,656.02126373925262,648.09707751852466,165083.59060397686]
[185,1304.1183412577773,653.45587947407512,650.66246178370216,164432.92814219315]
[186,1304.1183412577773,650.88034056284789,653.23800069492938,163779.69014149823]
[187,1304.1183412577773,648.29460681009721,655.82373444768007,163123.86640705055]
[188,1304.1183412577773,645.69863786124176,658.41970339653551,162465.44670365402]
[189,1304.1183412577773,643.09239320196389,661.02594805581339,161804.4207555982]
[190,1304.1183412577773,640.47583215757629,663.64250910020098,161140.778246498]
[191,1304.1183412577773,637.84891389238794,666.26942736538933,160474.50881913261]
[192,1304.1183412577773,635.2115974090666,668.90674384871068,159805.60207528391]
[193,1304.1183412577773,632.56384154799889,671.55449970977838,159134.04757557414]
[194,{"$f":"G$6","v":1304.1183412577773},{"$f":"E202*F$6","v":629.90560498664763},{"$f":"B203-C203","v":674.21273627112964},158459.83483930302]
[195,1304.1183412577773,627.23684623890779,676.88149501886949,157782.95334428415]
[196,1304.1183412577773,624.55752365445812,679.56081760331915,157103.39252668084]
[197,1304.1183412577773,621.8675954181117,682.25074583966557,156421.14178084116]
[198,1304.1183412577773,619.167019549163,684.95132170861427,155736.19045913254]
[199,1304.1183412577773,616.45575390073304,687.66258735704423,155048.5278717755]
[200,1304.1183412577773,613.73375615911141,690.38458509866587,{"$f":"E208-D209","v":154358.14328667684}]
[201,1304.1183412577773,611.00098384309592,693.11735741468135,153665.02592926216]
[202,1304.1183412577773,608.25739430332942,695.86094695444785,152969.1649823077]
[203,1304.1183412577773,605.50294472163466,698.61539653614261,152270.54958577157]
[204,1304.1183412577773,602.73759211034587,701.3807491474314,151569.16883662413]
[205,1304.1183412577773,599.96129331163718,704.1570479461401,150865.01178867798]
[206,1304.1183412577773,597.17400499685039,706.94433626092689,150158.06745241705]
[207,1304.1183412577773,594.37568366581752,709.74265759195976,149448.32479482508]
[208,1304.1183412577773,591.56628564618268,712.5520556115946,148735.77273921348]
[209,1304.1183412577773,588.74576709272014,715.37257416505713,148020.40016504843]
[210,1304.1183412577773,585.9140839866501,718.20425727112718,147302.19590777729]
[211,1304.1183412577773,583.07119213495184,721.04714912282543,146581.14875865445]
[212,1304.1183412577773,580.21704716967395,723.90129408810333,145857.24746456635]
[213,1304.1183412577773,577.35160454724189,726.76673671053538,145130.48072785581]
[214,1304.1183412577773,574.47481954776265,729.64352171001462,144400.83720614581]
[215,1304.1183412577773,571.58664727432722,732.53169398345005,143668.30551216236]
[216,1304.1183412577773,568.6870426523094,735.43129860546787,142932.8742135569]
[217,1304.1183412577773,565.77596042866276,738.34238082911452,142194.53183272778]
[218,1304.1183412577773,562.85335517121416,741.26498608656311,141453.26684664123]
[219,1304.1183412577773,559.91918126795485,744.19915998982242,140709.0676866514]
[220,1304.1183412577773,556.97339292632853,747.14494833144875,139961.92273831996]
[221,1304.1183412577773,554.01594417251658,750.10239708526069,139211.82034123471]
[222,1304.1183412577773,551.04678885072076,753.07155240705652,138458.74878882765]
[223,1304.1183412577773,548.06588062244282,756.05246063533446,137702.69632819231]
[224,1304.1183412577773,545.07317296576127,759.045168292016,136943.6511599003]
[225,1304.1183412577773,542.06861917460537,762.0497220831719,136181.60143781712]
[226,1304.1183412577773,539.05217235802616,765.06616889975112,135416.53526891736]
[227,1304.1183412577773,536.02378543946463,768.09455581831264,134648.44071309906]
[228,1304.1183412577773,532.98341115601716,771.13493010176012,133877.30578299731]
[229,1304.1183412577773,529.9310020576977,774.18733920007958,133103.11844379723]
[230,1304.1183412577773,526.86651050669741,777.25183075107986,132325.86661304615]
[231,1304.1183412577773,523.789888676641,780.32845258113628,131545.53816046502]
[232,1304.1183412577773,520.70108855184071,783.41725270593656,130762.12090775908]
[233,1304.1183412577773,517.60006192654635,786.51827933123093,129975.60262842785]
[234,1304.1183412577773,514.48676040419366,789.63158085358361,129185.97104757426]
[235,1304.1183412577773,511.36113539664814,792.75720586112914,128393.21384171314]
[236,1304.1183412577773,508.22313812344788,795.89520313432945,127597.3186385788]
[237,1304.1183412577773,505.07271961104112,799.04562164673621,126798.27301693206]
[238,1304.1183412577773,501.90983069202275,802.20851056575452,125996.0645063663]
[239,1304.1183412577773,498.73442200436665,805.38391925341057,125190.68058711289]
[240,1304.1183412577773,495.54644399065523,808.57189726712204,124382.10868984577]
[241,1304.1183412577773,492.34584689730622,811.772494360471,123570.3361954853]
[242,1304.1183412577773,489.13258077379601,814.98576048398127,122755.35043500132]
[243,1304.1183412577773,485.90659547188028,818.21174578589694,121937.13868921543]
[244,1304.1183412577773,482.66784064481112,821.45050061296615,121115.68818860246]
[245,1304.1183412577773,479.41626574655146,824.70207551122576,120290.98611309123]
[246,1304.1183412577773,476.15182003098619,827.96652122679109,119463.01959186445]
[247,1304.1183412577773,472.87445255113016,831.24388870664711,118631.77570315779]
[248,1304.1183412577773,469.58411215833297,834.53422909944425,117797.24147405835]
[249,1304.1183412577773,466.28074750148102,837.8375937562962,116959.40388030205]
[250,1304.1183412577773,462.96430702619568,841.15403423158159,116118.24984607047]
[251,1304.1183412577773,459.63473897402895,844.48360228374827,115273.76624378671]
[252,1304.1183412577773,456.29199138165575,847.82634987612153,114425.93989391059]
[253,1304.1183412577773,452.93601208006277,851.18232917771456,113574.75756473288]
[254,1304.1183412577773,449.56674869373433,854.55159256404295,112720.20597216883]
[255,1304.1183412577773,446.18414863983497,857.93419261794224,111862.27177955088]
[256,1304.1183412577773,442.78815912738895,861.33018213038827,111000.94159742049]
[257,1304.1183412577773,439.37872715645614,864.73961410132119,110136.20198331917]
[258,{"$f":"G$6","v":1304.1183412577773},{"$f":"E266*F$6","v":435.95579951730508},{"$f":"B267-C267","v":868.16254174047219},109268.0394415787]
[259,1304.1183412577773,432.51932278958242,871.5990184681948,108396.4404231105]
[260,1304.1183412577773,429.06924334147908,875.04909791629825,107521.3913251942]
[261,1304.1183412577773,425.60550732889374,878.51283392888354,106642.87849126532]
[262,1304.1183412577773,422.12806069459191,881.99028056318537,105760.88821070213]
[263,1304.1183412577773,418.63684916736264,885.48149209041458,104875.40671861172]
[264,1304.1183412577773,415.13181826117142,888.9865229966058,{"$f":"E272-D273","v":103986.42019561511}]
[265,1304.1183412577773,411.61291327430985,892.50542798346737,103093.91476763164]
[266,1304.1183412577773,408.08007928854192,896.03826196923535,102197.8765056624]
[267,1304.1183412577773,404.53326116824701,899.58508008953027,101298.29142557287]
[268,1304.1183412577773,400.97240355955933,903.14593769821795,100395.14548787464]
[269,1304.1183412577773,397.39745088950383,906.72089036827344,99488.424597506368]
[270,1304.1183412577773,393.80834736512941,910.30999389264787,98578.114603613722]
[271,1304.1183412577773,390.20503697263769,913.91330428513959,97664.201299328575]
[272,1304.1183412577773,386.58746347650896,917.53087778126837,96746.6704215473]
[273,1304.1183412577773,382.95557041862475,921.16277083915247,95825.507650708154]
[274,1304.1183412577773,379.3093011173865,924.80904014039083,94900.698610567764]
[275,1304.1183412577773,375.64859866683076,928.46974259094645,93972.228867976824]
[276,1304.1183412577773,371.97340593574165,932.14493532203562,93040.083932654787]
[277,1304.1183412577773,368.28366556675854,935.83467569101867,92104.249256963769]
[278,1304.1183412577773,364.57931997548161,939.53902128229561,91164.710235681472]
[279,1304.1183412577773,360.8603113495725,943.25802990820478,90221.452205773268]
[280,1304.1183412577773,357.12658164785256,946.99175960992466,89274.460446163343]
[281,1304.1183412577773,353.3780725993966,950.74026865838073,88323.720177504962]
[282,1304.1183412577773,349.61472570262384,954.50361555515337,87369.216561949812]
[283,1304.1183412577773,345.83648222438472,958.28185903339249,86410.93470291642]
[284,1304.1183412577773,342.0432831990442,962.07505805873302,85448.859644857686]
[285,1304.1183412577773,338.23506942756171,965.88327183021556,84482.976373027472]
[286,1304.1183412577773,334.41178147656711,969.70655978121022,83513.269813246268]
[287,1304.1183412577773,330.57335967743319,973.54498158034403,82539.724831665924]
[288,1304.1183412577773,326.71974412534433,977.398597132433,81562.326234533495]
[289,1304.1183412577773,322.85087467836178,981.26746657941544,80581.058767954077]
[290,1304.1183412577773,318.96669095648491,985.15165030129242,79595.90711765278]
[291,1304.1183412577773,315.06713234070895,989.05120891706838,78606.855908735713]
[292,1304.1183412577773,311.15213797207889,992.96620328569838,77613.889705450012]
[293,1304.1183412577773,307.22164675073964,996.89669450703764,76616.99301094297]
[294,1304.1183412577773,303.27559733498259,1000.8427439227946,75616.150267020173]
[295,1304.1183412577773,299.31392814028823,1004.804413117489,74611.345853902691]
[296,1304.1183412577773,295.33657733836486,1008.7817639194125,73602.56408998328]
[297,1304.1183412577773,291.34348285618387,1012.7748584015934,72589.789231581686]
[298,1304.1183412577773,287.33458237501088,1016.7837588827664,71573.005472698918]
[299,1304.1183412577773,283.30981332943327,1020.808527928344,70552.196944770578]
[300,1304.1183412577773,279.26911290638355,1024.8492283513938,69527.347716419186]
[301,1304.1183412577773,275.21241804415928,1028.9059232136181,68498.441793205566]
[302,1304.1183412577773,271.13966543143874,1032.9786758263385,67465.46311737923]
[303,1304.1183412577773,267.0507915062928,1037.0675497514844,66428.39556762774]
[304,1304.1183412577773,262.94573245519314,1041.1726088025841,65387.222958825158]
[305,1304.1183412577773,258.82442421201625,1045.293917045761,64341.929041779396]
[306,1304.1183412577773,254.68680245704346,1049.4315388007337,63292.497502978666]
[307,1304.1183412577773,250.53280261595725,1053.58553864182,62238.911964336847]
[308,1304.1183412577773,246.36235985883337,1057.755981398944,61181.155982937904]
[309,1304.1183412577773,242.17540909912921,1061.9429321586481,60119.213050779254]
[310,1304.1183412577773,237.9718849926679,1066.1464562651095,59053.066594514145]
[311,1304.1183412577773,233.75172193661851,1070.3666193211589,57982.699975192983]
[312,1304.1183412577773,229.51485406847223,1074.603487189305,56908.096488003677]
[313,1304.1183412577773,225.26121526501458,1078.8571259927626,55829.239362010914]
[314,1304.1183412577773,220.99073914129323,1083.127602116484,54746.111759894433]
[315,1304.1183412577773,216.70335904958216,1087.4149822081952,53658.696777686237]
[316,1304.1183412577773,212.39900807834138,1091.7193331794358,52566.977444506803]
[317,1304.1183412577773,208.07761905117277,1096.0407222066044,51470.936722300197]
[318,1304.1183412577773,203.73912452577164,1100.3792167320057,50370.557505568191]
[319,1304.1183412577773,199.38345679287411,1104.7348844649032,49265.822621103289]
[320,1304.1183412577773,195.01054787520053,1109.1077933825768,48156.714827720709]
[321,1304.1183412577773,190.6203295263945,1113.4980117313828,47043.216815989326]
[322,{"$f":"G$6","v":1304.1183412577773},{"$f":"E330*F$6","v":186.21273322995776},{"$f":"B331-C331","v":1117.9056080278194},45925.311207961509]
[323,1304.1183412577773,181.787690198181,1122.3306510595962,44802.980556901915]
[324,1304.1183412577773,177.3451313710701,1126.7732098867073,43676.20734701521]
[325,1304.1183412577773,172.88498741526854,1131.2333538425087,42544.973993172702]
[326,1304.1183412577773,168.40718872297529,1135.7111525348021,41409.262840637901]
[327,1304.1183412577773,163.91166541085838,1140.2066758469189,40269.056164790985]
[328,1304.1183412577773,159.39834731896434,1144.7199939388129,{"$f":"E336-D337","v":39124.33617085217}]
[329,1304.1183412577773,154.8671640096232,1149.2511772481541,37975.084993604018]
[330,1304.1183412577773,150.31804476634926,1153.8002964914281,36821.284697112591]
[331,1304.1183412577773,145.75091859273735,1158.3674226650398,35662.917274447551]
[332,1304.1183412577773,141.1657142113549,1162.9526270464223,34499.964647401132]
[333,1304.1183412577773,136.56236006262949,1167.5559811951478,33332.408666205985]
[334,1304.1183412577773,131.94078430373204,1172.1775569540453,32160.231109251941]
[335,1304.1183412577773,127.30091480745561,1176.8174264503216,30983.41368280162]
[336,1304.1183412577773,122.64267916108976,1181.4756620966875,29801.938020704933]
[337,1304.1183412577773,117.96600466529037,1186.1523365924868,28615.785684112445]
[338,1304.1183412577773,113.2708183329451,1190.8475229248322,27424.938161187612]
[339,1304.1183412577773,108.55704688803431,1195.5612943697429,26229.376866817871]
[340,1304.1183412577773,103.82461676448742,1200.2937244932898,25029.08314232458]
[341,1304.1183412577773,99.073454105034799,1205.0448871527424,23824.038255171836]
[342,1304.1183412577773,94.303484760055184,1209.8148564977221,22614.223398674112]
[343,1304.1183412577773,89.514634286418371,1214.6037069713589,21399.619691702752]
[344,1304.1183412577773,84.706827946323401,1219.411513311454,20180.208178391298]
[345,1304.1183412577773,79.879990706132233,1224.238350551645,18955.969827839654]
[346,1304.1183412577773,75.034047235198642,1229.0842940225787,17726.885533817076]
[347,1304.1183412577773,70.168921904692596,1233.9494193530847,16492.936114463992]
[348,1304.1183412577773,65.284538786419972,1238.8338024713573,15254.102311992634]
[349,1304.1183412577773,60.380821651637511,1243.7375196061398,14010.364792386494]
[350,1304.1183412577773,55.457693969863207,1248.6606472879141,12761.70414509858]
[351,1304.1183412577773,50.515078907681882,1253.6032623500953,11508.100882748484]
[352,1304.1183412577773,45.552899327546086,1258.5654419302311,10249.535440818252]
[353,1304.1183412577773,40.571077786572253,1263.547263471205,8985.9881773470479]
[354,1304.1183412577773,35.56953653533207,1268.5488047224453,7717.4393726246026]
[355,1304.1183412577773,30.548197516639053,1273.5701437411383,6443.8692288834645]
[356,1304.1183412577773,25.506982364330383,1278.6113588934468,5165.2578699900178]
[357,1304.1183412577773,20.445812402043821,1283.6725288557334,3881.5853411342841]
[358,1304.1183412577773,15.364608641989877,1288.7537326157874,2592.831608518497]
[359,1304.1183412577773,10.263291783719051,1293.8550494740582,1298.9765590444388]
[360,1304.1183412577773,5.1417822128842374,1298.9765590448931,-4.5429260353557765E-10]

{"sheet":"Negative Data Bars","index":11,"n_rows":31,"n_cols":9,"rows_kept":31,"cut":false,"hidden":false,"merged":[]}
["Excel 2007: Conditional Formatting Vastly Improved."]
["Excel 2010: Data Bars can handle negative and positive in a new way"]
["Conditional Formatting on Home Ribbon Tab"]
[]
["Other videos on this topic:"]
["Excel 2010 Preview #5: Conditional Formatting Negative Data Bars"]
["Mr Excel & excelisfun Trick 72: Data Bar Cell Charts in Excel 2007/2010 & Excel 2003"]
["Highline Excel Class 21: Conditional Formatting 12 Examples "]
[]
[null,"Sales","Cell Chart",null,"Gain Or Loss","Cell Chart",null,null,"Above Ave"]
[null,5328,null,null,-671,null,null,null,"Sales"]
[null,6267,null,null,2378,null,null,null,4835]
[null,1362,null,null,5694,null,null,null,383]
[null,2711,null,null,-687,null,null,null,4193]
[null,2318,null,null,-3002,null,null,null,1061]
[null,7290,null,null,-146,null,null,null,5967]
[null,7099,null,null,3262,null,null,null,6556]
[null,6373,null,null,1323,null,null,null,7046]
[null,4603,null,null,1215,null,null,null,84]
[null,1605,null,null,4169,null,null,null,1516]
[null,6020,null,null,1950,null,null,null,4220]
[null,2521,null,null,-3231,null,null,null,7436]
[null,5982,null,null,5902,null,null,null,3878]
[null,811,null,null,-3033,null,null,null,7028]
[null,4096,null,null,3109,null,null,null,1931]
[null,1281,null,null,-197,null,null,null,5092]
[null,3155,null,null,-995,null,null,null,7361]
[null,4756,null,null,-4637,null,null,null,2947]
[null,6897,null,null,-1480,null,null,null,2017]
[null,1491,null,null,6488,null,null,null,1786]
[null,null,null,null,null,null,null,null,1904]

{"sheet":"Negative Data Bars (an)","index":12,"n_rows":31,"n_cols":9,"rows_kept":31,"cut":false,"hidden":false,"merged":[]}
["Excel 2007: Conditional Formatting Vastly Improved."]
["Excel 2010: Data Bars can handle negative and positive in a new way"]
["Conditional Formatting on Home Ribbon Tab"]
[]
["Other videos on this topic:"]
["Excel 2010 Preview #5: Conditional Formatting Negative Data Bars"]
["Mr Excel & excelisfun Trick 72: Data Bar Cell Charts in Excel 2007/2010 & Excel 2003"]
["Highline Excel Class 21: Conditional Formatting 12 Examples "]
[]
[null,"Sales","Cell Chart",null,"Gain Or Loss","Cell Chart",null,null,"Above Ave"]
[null,5328,5328,null,-671,-671,null,null,"Sales"]
[null,6267,6267,null,2378,2378,null,null,4835]
[null,1362,1362,null,5694,5694,null,null,383]
[null,2711,2711,null,-687,-687,null,null,4193]
[null,2318,2318,null,-3002,-3002,null,null,1061]
[null,7290,7290,null,-146,-146,null,null,5967]
[null,7099,7099,null,3262,3262,null,null,6556]
[null,6373,6373,null,1323,1323,null,null,7046]
[null,4603,4603,null,1215,1215,null,null,84]
[null,1605,1605,null,4169,4169,null,null,1516]
[null,6020,6020,null,1950,1950,null,null,4220]
[null,2521,2521,null,-3231,-3231,null,null,7436]
[null,5982,5982,null,5902,5902,null,null,3878]
[null,811,811,null,-3033,-3033,null,null,7028]
[null,4096,4096,null,3109,3109,null,null,1931]
[null,1281,1281,null,-197,-197,null,null,5092]
[null,3155,3155,null,-995,-995,null,null,7361]
[null,4756,4756,null,-4637,-4637,null,null,2947]
[null,6897,6897,null,-1480,-1480,null,null,2017]
[null,1491,1491,null,6488,6488,null,null,1786]
[null,null,null,null,null,null,null,null,1904]

{"sheet":"New PT Calculations","index":13,"n_rows":491,"n_cols":6,"rows_kept":491,"cut":false,"hidden":false,"merged":[]}
["PivotTable Options Ribbon Tab, Show Values As: \"% Running Total\""]
["PivotTable Options Ribbon Tab, Show Values As: \"% of Parent Total\""]
["PivotTable Design Ribbon Tab, Report Layout, Tabular Form"]
["PivotTable Design Ribbon Tab, Report Layout, Repeat All Items Labels"]
[]
["Other videos on this topic:"]
["Office 2010 Class #36: Excel PivotTables Pivot Tables 15 examples (Data Analysis ..."]
["Excel Magic Trick 498: 6 PivotTable Calculation Tricks (Pivot Table)"]
["Dueling Excel - Percent of Parent: Podcast #1404"]
["Excel 2010 Statistics #41: Joint Probability Table with PivotTable"]
[]
["Date","Product","Customer","SalesRep","Units","Sales"]
[{"$f":"RANDBETWEEN(40179,40543)","v":"2010-07-09"},"Sunshine","Albertsons","Fred",5,68.75]
["2010-03-21","Quad","PCC","Sioux",18,247.5]
[{"$f":"RANDBETWEEN(40179,40543)","v":"2010-06-18"},"Carlota","Albertsons","Sue",22,302.5]
[{"$f":"RANDBETWEEN(40179,40543)","v":"2010-04-17"},"SunBell","QFC","Jo",8,110]
["2010-12-25","Sunset","QFC","Sioux",20,275]
["2010-04-16","Tri","WholeFoods","Sioux",11,151.25]
["2010-07-26","Sunset","WholeFoods","Jo",25,343.75]
["2010-10-03","Bellen","WholeFoods","Pham",7,96.25]
["2010-10-23","Bellen","Albertsons","Pham",15,206.25]
["2010-04-25","Sunshine","Albertsons","Pham",17,233.75]
["2010-08-18","Carlota","PCC","Chin",15,206.25]
["2010-01-05","Carlota","QFC","Pham",3,41.25]
["2010-09-22","SunBell","TraderJoe's","Joe",17,233.75]
["2010-11-25","Tri","QFC","Pham",14,192.5]
["2010-04-18","Sunshine","Albertsons","Sioux",14,192.5]
["2010-10-31","Sunshine","Coop","Joe",14,192.5]
["2010-03-11","Tri","QFC","Jo",17,233.75]
["2010-05-13","SunBell","Safeway","Joe",21,288.75]
["2010-01-07","SunBell","Safeway","Jo",14,192.5]
["2010-08-25","Sunshine","WholeFoods","Pham",4,55]
["2010-01-10","SunBell","Safeway","Pham",19,261.25]
["2010-09-02","Tri","WholeFoods","Sioux",25,343.75]
["2010-01-25","Sunshine","PCC","Pham",14,192.5]
["2010-08-25","Tri","WholeFoods","Joe",17,233.75]
["2010-11-26","Carlota","Coop","Fred",7,96.25]
["2010-04-06","Carlota","Safeway","Sioux",13,178.75]
["2010-09-21","Quad","QFC","Sue",7,96.25]
["2010-07-19","Tri","Coop","Joe",21,288.75]
["2010-11-07","Tri","PCC","Joe",19,261.25]
["2010-11-17","Quad","PCC","Joe",16,220]
["2010-10-09","Tri","QFC","Pham",23,316.25]
["2010-03-25","Tri","Albertsons","Joe",2,27.5]
["2010-09-16","Tri","QFC","Chin",2,27.5]
["2010-07-15","SunBell","PCC","Joe",14,192.5]
["2010-02-26","Carlota","PCC","Fred",15,206.25]
["2010-02-10","Sunset","WholeFoods","Fred",1,13.75]
["2010-12-25","Sunset","WholeFoods","Fred",17,233.75]
["2010-03-03","Carlota","Coop","Pham",7,96.25]
["2010-03-20","SunBell","Coop","Chin",4,55]
["2010-02-22","Bellen","QFC","Sioux",24,330]
["2010-08-24","Bellen","QFC","Fred",15,206.25]
["2010-02-06","SunBell","QFC","Joe",19,261.25]
["2010-06-02","SunBell","Coop","Fred",11,151.25]
["2010-05-20","Quad","WholeFoods","Fred",8,110]
["2010-01-04","Carlota","Albertsons","Fred",21,288.75]
["2010-08-31","Bellen","Safeway","Pham",22,302.5]
["2010-12-05","Sunshine","PCC","Joe",8,110]
["2010-09-09","Carlota","QFC","Joe",10,137.5]
["2010-06-04","Carlota","Coop","Sue",16,220]
["2010-11-21","Tri","Safeway","Chin",15,206.25]
["2010-12-17","Sunset","PCC","Jo",23,316.25]
["2010-04-12","Bellen","WholeFoods","Jo",15,206.25]
["2010-09-12","Tri","TraderJoe's","Sioux",14,192.5]
["2010-01-11","Sunset","QFC","Joe",2,27.5]
["2010-03-06","Tri","WholeFoods","Sue",2,27.5]
["2010-08-22","Quad","WholeFoods","Chin",3,41.25]
["2010-07-16","SunBell","WholeFoods","Chin",4,55]
["2010-06-20","Carlota","Safeway","Sue",20,275]
["2010-03-26","Sunshine","TraderJoe's","Jo",1,13.75]
["2010-02-16","Tri","QFC","Fred",13,178.75]
["2010-03-11","Quad","WholeFoods","Sioux",23,316.25]
["2010-03-06","SunBell","QFC","Joe",16,220]
["2010-12-10","Carlota","Coop","Chin",17,233.75]
["2010-07-26","Sunshine","Coop","Fred",18,247.5]
["2010-12-28","Carlota","Albertsons","Pham",25,343.75]
["2010-02-12","Sunset","PCC","Chin",2,27.5]
["2010-10-21","SunBell","WholeFoods","Sue",1,13.75]
[{"$f":"RANDBETWEEN(40179,40543)","v":"2010-03-05"},"SunBell","Coop","Fred",18,247.5]
["2010-11-29","Carlota","WholeFoods","Sioux",23,316.25]
["2010-06-09","Sunshine","WholeFoods","Pham",4,55]
["2010-07-02","Sunshine","Coop","Jo",12,165]
["2010-03-29","Sunshine","QFC","Sue",24,330]
["2010-11-29","Carlota","Safeway","Pham",10,137.5]
["2010-05-04","Carlota","TraderJoe's","Sioux",15,206.25]
["2010-05-05","Sunshine","Safeway","Sue",17,233.75]
["2010-03-03","Carlota","Albertsons","Sue",13,178.75]
["2010-08-30","Bellen","Safeway","Sue",10,137.5]
["2010-08-20","Sunset","TraderJoe's","Jo",20,275]
["2010-02-10","SunBell","Albertsons","Fred",20,275]
["2010-07-07","Quad","Coop","Joe",1,13.75]
["2010-12-18","SunBell","TraderJoe's","Chin",4,55]
["2010-12-26","SunBell","WholeFoods","Fred",18,247.5]
["2010-03-22","Carlota","PCC","Fred",10,137.5]
["2010-01-27","Sunshine","TraderJoe's","Sue",6,82.5]
["2010-07-21","Quad","TraderJoe's","Fred",12,165]
["2010-08-22","SunBell","Coop","Pham",19,261.25]
["2010-06-25","Sunshine","WholeFoods","Sue",1,13.75]
["2010-08-01","Sunshine","PCC","Jo",10,137.5]
["2010-09-25","SunBell","PCC","Fred",5,68.75]
["2010-06-06","Sunshine","Coop","Jo",10,137.5]
["2010-10-28","Bellen","PCC","Sue",16,220]
["2010-09-21","Bellen","TraderJoe's","Chin",3,41.25]
["2010-12-21","SunBell","TraderJoe's","Pham",20,275]
["2010-06-14","Sunset","TraderJoe's","Pham",18,247.5]
["2010-07-31","SunBell","Safeway","Joe",9,123.75]
["2010-11-14","Quad","TraderJoe's","Fred",7,96.25]
["2010-09-08","Quad","Safeway","Joe",4,55]
["2010-06-16","Sunshine","Albertsons","Pham",12,165]
["2010-12-19","Bellen","QFC","Chin",25,343.75]
["2010-03-03","Quad","PCC","Sioux",10,137.5]
["2010-10-20","Bellen","Albertsons","Pham",2,27.5]
["2010-03-30","Sunshine","Safeway","Jo",22,302.5]
["2010-08-09","Bellen","QFC","Sioux",21,288.75]
["2010-12-04","Sunset","QFC","Sioux",3,41.25]
["2010-11-26","Sunshine","Safeway","Jo",20,275]
["2010-01-13","Sunset","Coop","Jo",16,220]
["2010-08-01","Quad","QFC","Joe",8,110]
["2010-11-04","Sunshine","TraderJoe's","Pham",24,330]
["2010-03-25","Bellen","PCC","Chin",12,165]
["2010-10-02","Quad","TraderJoe's","Chin",17,233.75]
["2010-05-01","Carlota","WholeFoods","Fred",1,13.75]
["2010-03-05","Tri","WholeFoods","Sue",2,27.5]
["2010-12-27","Tri","WholeFoods","Jo",21,288.75]
["2010-11-15","Sunshine","PCC","Joe",15,206.25]
["2010-06-30","Tri","Safeway","Fred",24,330]
["2010-04-16","Tri","Safeway","Chin",24,330]
["2010-02-19","Quad","Albertsons","Sioux",6,82.5]
["2010-02-15","Sunset","WholeFoods","Sioux",12,165]
["2010-06-03","Quad","Safeway","Pham",1,13.75]
["2010-12-16","Quad","Coop","Chin",21,288.75]
["2010-01-07","Carlota","Albertsons","Fred",23,316.25]
["2010-01-24","Quad","Albertsons","Jo",17,233.75]
["2010-10-22","SunBell","QFC","Pham",12,165]
["2010-11-03","Tri","TraderJoe's","Jo",1,13.75]
["2010-03-29","Tri","Coop","Pham",6,82.5]
["2010-12-09","Carlota","PCC","Jo",18,247.5]
["2010-09-27","SunBell","WholeFoods","Jo",8,110]
["2010-11-20","Sunshine","Safeway","Pham",11,151.25]
["2010-11-30","Carlota","PCC","Fred",6,82.5]
["2010-05-17","Sunset","TraderJoe's","Sue",18,247.5]
["2010-08-19","Tri","Safeway","Fred",8,110]
[{"$f":"RANDBETWEEN(40179,40543)","v":"2010-05-18"},"Sunset","PCC","Chin",11,151.25]
["2010-12-12","Tri","WholeFoods","Chin",2,27.5]
["2010-09-22","Carlota","Albertsons","Sioux",22,302.5]
["2010-02-27","Quad","TraderJoe's","Sioux",21,288.75]
["2010-03-28","Bellen","TraderJoe's","Chin",11,151.25]
["2010-09-30","Sunshine","Coop","Jo",6,82.5]
["2010-09-20","Sunshine","Coop","Jo",25,343.75]
["2010-10-29","Bellen","Coop","Pham",2,27.5]
["2010-02-09","Bellen","Safeway","Joe",15,206.25]
["2010-10-30","Quad","WholeFoods","Sue",21,288.75]
["2010-05-29","Tri","QFC","Sioux",5,68.75]
["2010-05-13","Carlota","WholeFoods","Sue",13,178.75]
["2010-03-10","Carlota","Safeway","Pham",13,178.75]
["2010-05-08","Tri","Safeway","Joe",9,123.75]
["2010-12-25","Sunshine","Safeway","Sue",18,247.5]
["2010-08-08","Carlota","Albertsons","Chin",8,110]
["2010-04-29","Tri","QFC","Sue",7,96.25]
["2010-01-22","Sunset","PCC","Chin",6,82.5]
["2010-08-27","SunBell","Coop","Sioux",7,96.25]
["2010-09-28","Tri","PCC","Sioux",14,192.5]
["2010-10-17","Quad","PCC","Joe",24,330]
["2010-12-02","Quad","QFC","Joe",17,233.75]
["2010-05-24","Carlota","QFC","Chin",5,68.75]
["2010-06-16","Bellen","TraderJoe's","Sue",1,13.75]
["2010-08-30","Carlota","WholeFoods","Sue",14,192.5]
["2010-01-18","Sunshine","PCC","Jo",12,165]
["2010-12-02","Sunset","PCC","Sioux",25,343.75]
["2010-09-02","Carlota","Albertsons","Jo",3,41.25]
["2010-05-26","Bellen","PCC","Jo",14,192.5]
["2010-01-20","Tri","PCC","Jo",6,82.5]
["2010-06-28","Carlota","Albertsons","Fred",17,233.75]
["2010-08-28","SunBell","Albertsons","Sioux",23,316.25]
["2010-08-08","Bellen","PCC","Fred",4,55]
["2010-04-15","Sunset","WholeFoods","Sue",20,275]
["2010-10-19","Carlota","QFC","Sioux",16,220]
["2010-08-11","Sunset","WholeFoods","Jo",19,261.25]
["2010-05-20","Sunshine","Safeway","Sue",16,220]
["2010-12-27","Sunshine","WholeFoods","Joe",1,13.75]
["2010-12-22","SunBell","PCC","Jo",11,151.25]
["2010-06-29","Tri","Coop","Sioux",18,247.5]
["2010-09-18","Tri","Safeway","Fred",10,137.5]
["2010-01-17","Carlota","Albertsons","Fred",14,192.5]
["2010-03-03","Carlota","WholeFoods","Pham",11,151.25]
["2010-07-01","Carlota","Albertsons","Pham",20,275]
["2010-05-17","Sunset","Coop","Fred",21,288.75]
["2010-08-25","Carlota","TraderJoe's","Sue",17,233.75]
["2010-08-23","Sunshine","WholeFoods","Sue",16,220]
["2010-08-03","Bellen","PCC","Jo",6,82.5]
["2010-08-29","Tri","Albertsons","Pham",3,41.25]
["2010-07-25","Tri","QFC","Pham",7,96.25]
["2010-03-13","Carlota","Coop","Joe",8,110]
["2010-12-08","Sunset","Safeway","Chin",16,220]
["2010-01-02","Bellen","QFC","Joe",19,261.25]
["2010-06-04","Tri","WholeFoods","Joe",17,233.75]
["2010-10-03","Sunset","Safeway","Sioux",11,151.25]
["2010-12-26","Sunshine","Albertsons","Fred",24,330]
["2010-04-17","Carlota","Safeway","Joe",20,275]
["2010-05-16","Quad","Albertsons","Joe",19,261.25]
["2010-10-09","Bellen","WholeFoods","Jo",3,41.25]
["2010-06-17","Sunshine","WholeFoods","Jo",16,220]
["2010-03-10","Sunshine","Safeway","Sioux",23,316.25]
["2010-03-17","Sunshine","Albertsons","Pham",16,220]
["2010-01-09","Carlota","PCC","Sue",23,316.25]
["2010-05-15","Bellen","TraderJoe's","Sue",19,261.25]
[{"$f":"RANDBETWEEN(40179,40543)","v":"2010-07-08"},"Carlota","WholeFoods","Pham",2,27.5]
["2010-01-27","SunBell","PCC","Sioux",18,247.5]
["2010-10-20","Carlota","Coop","Joe",2,27.5]
["2010-12-06","Sunshine","QFC","Jo",23,316.25]
["2010-08-19","Quad","WholeFoods","Fred",25,343.75]
["2010-05-20","SunBell","QFC","Chin",14,192.5]
["2010-11-05","Quad","Albertsons","Fred",15,206.25]
["2010-12-27","Tri","PCC","Chin",17,233.75]
["2010-05-26","Tri","WholeFoods","Fred",22,302.5]
["2010-07-20","Carlota","QFC","Sioux",12,165]
["2010-03-06","Carlota","TraderJoe's","Jo",8,110]
["2010-03-12","Carlota","Coop","Joe",5,68.75]
["2010-09-17","Carlota","WholeFoods","Pham",19,261.25]
["2010-09-21","Quad","Albertsons","Chin",19,261.25]
["2010-08-03","Sunset","Safeway","Joe",19,261.25]
["2010-02-27","Quad","QFC","Sue",18,247.5]
["2010-11-03","Bellen","Coop","Fred",3,41.25]
["2010-06-19","Bellen","Albertsons","Chin",8,110]
["2010-05-13","Sunset","Coop","Sioux",24,330]
["2010-07-15","Sunset","WholeFoods","Jo",3,41.25]
["2010-04-02","SunBell","TraderJoe's","Sioux",5,68.75]
["2010-10-13","Sunset","PCC","Jo",10,137.5]
["2010-03-10","Carlota","PCC","Fred",7,96.25]
["2010-07-14","Bellen","QFC","Fred",12,165]
["2010-06-12","Carlota","WholeFoods","Joe",1,13.75]
["2010-04-22","Quad","TraderJoe's","Joe",25,343.75]
["2010-07-14","Sunset","WholeFoods","Jo",1,13.75]
["2010-10-31","Sunshine","QFC","Chin",17,233.75]
["2010-10-18","Carlota","Coop","Fred",5,68.75]
["2010-05-08","Sunset","PCC","Sue",11,151.25]
["2010-07-28","Tri","QFC","Sue",7,96.25]
["2010-11-05","Sunshine","QFC","Fred",19,261.25]
["2010-03-02","Tri","WholeFoods","Fred",6,82.5]
["2010-05-11","Quad","Safeway","Sioux",22,302.5]
["2010-06-15","Sunset","PCC","Sue",9,123.75]
["2010-01-29","Tri","Safeway","Chin",16,220]
["2010-06-01","Sunshine","WholeFoods","Sioux",7,96.25]
["2010-04-28","Bellen","Albertsons","Sue",20,275]
["2010-02-02","SunBell","QFC","Joe",3,41.25]
["2010-02-25","SunBell","TraderJoe's","Jo",25,343.75]
["2010-10-05","Sunshine","WholeFoods","Pham",11,151.25]
["2010-05-21","SunBell","Coop","Chin",22,302.5]
["2010-07-27","SunBell","Albertsons","Jo",2,27.5]
["2010-04-04","Bellen","PCC","Pham",24,330]
["2010-02-12","Carlota","PCC","Chin",3,41.25]
["2010-11-29","Quad","Safeway","Pham",17,233.75]
["2010-02-25","Sunshine","Albertsons","Joe",3,41.25]
["2010-09-10","Quad","WholeFoods","Sue",13,178.75]
["2010-08-27","Sunset","QFC","Fred",22,302.5]
["2010-02-22","Quad","WholeFoods","Sue",19,261.25]
["2010-06-25","Carlota","Albertsons","Chin",3,41.25]
["2010-06-26","Sunshine","Coop","Sue",25,343.75]
["2010-07-25","Tri","Safeway","Fred",4,55]
["2010-09-22","Quad","WholeFoods","Sioux",13,178.75]
["2010-05-10","Bellen","Coop","Pham",4,55]
["2010-06-09","Tri","Coop","Jo",9,123.75]
["2010-09-08","Quad","Safeway","Chin",3,41.25]
["2010-12-26","Tri","Albertsons","Fred",10,137.5]
["2010-01-11","Sunset","TraderJoe's","Sioux",11,151.25]
["2010-05-27","Quad","TraderJoe's","Pham",24,330]
["2010-04-16","SunBell","Coop","Jo",4,55]
["2010-11-02","Quad","TraderJoe's","Fred",13,178.75]
["2010-09-08","Bellen","QFC","Fred",9,123.75]
["2010-11-02","Tri","PCC","Sue",24,330]
[{"$f":"RANDBETWEEN(40179,40543)","v":"2010-05-20"},"Sunshine","PCC","Sue",25,343.75]
["2010-03-24","Quad","Safeway","Sioux",3,41.25]
["2010-07-05","Tri","PCC","Fred",14,192.5]
["2010-05-27","Bellen","Coop","Sue",20,275]
["2010-05-31","Bellen","PCC","Joe",22,302.5]
["2010-10-09","Quad","QFC","Sue",24,330]
["2010-04-11","Carlota","Albertsons","Joe",19,261.25]
["2010-07-19","Sunset","Coop","Joe",14,192.5]
["2010-12-05","Quad","WholeFoods","Sue",2,27.5]
["2010-12-26","Carlota","Safeway","Chin",9,123.75]
["2010-03-18","Sunshine","PCC","Sue",19,261.25]
["2010-12-11","Bellen","PCC","Fred",7,96.25]
["2010-08-06","Sunshine","Albertsons","Joe",7,96.25]
["2010-09-18","Carlota","WholeFoods","Fred",13,178.75]
["2010-11-22","Quad","TraderJoe's","Jo",7,96.25]
["2010-08-22","Bellen","WholeFoods","Chin",14,192.5]
["2010-03-26","Sunset","PCC","Fred",21,288.75]
["2010-08-19","Sunset","PCC","Jo",14,192.5]
["2010-12-06","Bellen","WholeFoods","Sue",5,68.75]
["2010-05-29","Quad","QFC","Joe",23,316.25]
["2010-11-10","Sunset","Safeway","Jo",22,302.5]
["2010-02-01","SunBell","Albertsons","Pham",1,13.75]
["2010-05-24","Sunshine","Albertsons","Pham",5,68.75]
["2010-04-30","SunBell","TraderJoe's","Chin",8,110]
["2010-10-10","Bellen","Albertsons","Pham",14,192.5]
["2010-05-22","SunBell","Safeway","Sioux",6,82.5]
["2010-11-11","Sunshine","Coop","Chin",20,275]
["2010-10-16","SunBell","Safeway","Fred",25,343.75]
["2010-02-01","Carlota","PCC","Sue",12,165]
["2010-11-26","Sunshine","Coop","Jo",7,96.25]
["2010-05-13","Tri","Safeway","Pham",24,330]
["2010-03-16","Quad","Albertsons","Jo",17,233.75]
["2010-12-22","Carlota","PCC","Fred",20,275]
["2010-03-12","Sunset","TraderJoe's","Sue",19,261.25]
["2010-08-25","Quad","Albertsons","Joe",21,288.75]
["2010-09-20","Carlota","TraderJoe's","Sue",15,206.25]
["2010-08-05","Sunset","Albertsons","Pham",23,316.25]
["2010-12-23","Sunset","PCC","Jo",17,233.75]
["2010-02-28","Tri","TraderJoe's","Sue",15,206.25]
["2010-01-08","Carlota","WholeFoods","Sioux",8,110]
["2010-06-18","Bellen","Albertsons","Jo",9,123.75]
["2010-09-21","Sunset","Albertsons","Chin",20,275]
["2010-11-01","Quad","QFC","Sue",15,206.25]
["2010-04-09","SunBell","PCC","Fred",16,220]
["2010-07-12","Tri","WholeFoods","Jo",19,261.25]
["2010-12-31","Tri","TraderJoe's","Fred",6,82.5]
["2010-11-26","Tri","QFC","Jo",8,110]
["2010-01-08","Carlota","PCC","Chin",20,275]
["2010-11-28","Carlota","Coop","Fred",24,330]
["2010-07-28","Tri","PCC","Pham",9,123.75]
["2010-01-11","Sunset","Safeway","Chin",24,330]
["2010-01-06","Quad","Coop","Sue",21,288.75]
["2010-02-07","Sunshine","TraderJoe's","Sioux",15,206.25]
["2010-01-27","Bellen","Albertsons","Sue",25,343.75]
["2010-02-05","Bellen","QFC","Chin",8,110]
["2010-06-30","Sunset","Safeway","Sioux",12,165]
["2010-04-17","SunBell","Albertsons","Fred",1,13.75]
["2010-03-17","Quad","PCC","Chin",14,192.5]
["2010-08-04","Tri","Albertsons","Fred",5,68.75]
["2010-01-18","Quad","WholeFoods","Pham",24,330]
["2010-10-31","Sunset","Albertsons","Fred",3,41.25]
["2010-04-12","SunBell","QFC","Fred",23,316.25]
["2010-08-04","Sunset","Safeway","Pham",7,96.25]
["2010-03-11","SunBell","Safeway","Joe",4,55]
[{"$f":"RANDBETWEEN(40179,40543)","v":"2010-10-15"},"Sunshine","Albertsons","Joe",8,110]
["2010-06-08","Tri","PCC","Chin",21,288.75]
["2010-04-30","Carlota","TraderJoe's","Pham",20,275]
["2010-04-10","Bellen","WholeFoods","Fred",4,55]
["2010-03-19","Bellen","PCC","Joe",9,123.75]
["2010-10-18","Carlota","Coop","Jo",21,288.75]
["2010-06-26","Sunshine","Coop","Sue",7,96.25]
["2010-03-22","Sunset","Albertsons","Jo",5,68.75]
["2010-02-14","Tri","Albertsons","Joe",21,288.75]
["2010-09-04","Sunset","WholeFoods","Fred",14,192.5]
["2010-09-15","Tri","Coop","Sue",13,178.75]
["2010-11-19","Bellen","Safeway","Pham",20,275]
["2010-10-26","Sunset","Coop","Chin",25,343.75]
["2010-10-07","Sunset","Safeway","Joe",12,165]
["2010-07-01","Tri","TraderJoe's","Joe",2,27.5]
["2010-07-19","Tri","Albertsons","Sue",11,151.25]
["2010-02-17","Quad","PCC","Jo",12,165]
["2010-10-18","Bellen","Coop","Chin",4,55]
["2010-02-04","Tri","PCC","Sioux",13,178.75]
["2010-03-22","Carlota","QFC","Fred",21,288.75]
["2010-07-12","SunBell","Coop","Pham",21,288.75]
["2010-07-25","Tri","Albertsons","Chin",7,96.25]
["2010-10-05","Carlota","TraderJoe's","Joe",24,330]
["2010-07-31","SunBell","Albertsons","Joe",8,110]
["2010-09-13","Sunshine","WholeFoods","Jo",21,288.75]
["2010-01-02","SunBell","Albertsons","Jo",24,330]
["2010-07-18","Bellen","TraderJoe's","Joe",15,206.25]
["2010-02-09","Quad","TraderJoe's","Pham",4,55]
["2010-10-07","Quad","WholeFoods","Jo",10,137.5]
["2010-07-27","SunBell","QFC","Fred",8,110]
["2010-01-07","Sunset","TraderJoe's","Sue",24,330]
["2010-06-28","Quad","PCC","Joe",7,96.25]
["2010-10-15","Quad","TraderJoe's","Chin",2,27.5]
["2010-01-09","Carlota","TraderJoe's","Fred",22,302.5]
["2010-01-02","SunBell","Albertsons","Joe",3,41.25]
["2010-01-16","Quad","WholeFoods","Fred",8,110]
["2010-03-22","Sunset","TraderJoe's","Sioux",3,41.25]
["2010-12-01","SunBell","WholeFoods","Pham",19,261.25]
["2010-07-19","Bellen","Coop","Pham",16,220]
["2010-07-06","Sunset","Coop","Chin",1,13.75]
["2010-01-26","Sunset","TraderJoe's","Joe",13,178.75]
["2010-10-24","SunBell","Safeway","Fred",16,220]
["2010-10-01","Quad","Coop","Sioux",18,247.5]
["2010-11-10","Tri","Coop","Fred",11,151.25]
["2010-07-02","Tri","WholeFoods","Fred",21,288.75]
["2010-11-18","SunBell","Safeway","Joe",1,13.75]
["2010-12-17","Quad","WholeFoods","Chin",13,178.75]
["2010-01-30","Carlota","Albertsons","Fred",14,192.5]
["2010-07-17","Sunshine","Safeway","Sioux",7,96.25]
["2010-06-11","Sunset","WholeFoods","Fred",17,233.75]
["2010-06-15","Sunset","PCC","Jo",2,27.5]
["2010-10-30","Bellen","WholeFoods","Sue",9,123.75]
["2010-12-11","Tri","Coop","Joe",20,275]
["2010-09-23","Carlota","QFC","Sioux",16,220]
["2010-08-09","Bellen","WholeFoods","Chin",22,302.5]
["2010-08-27","Carlota","Coop","Chin",19,261.25]
["2010-01-02","Sunshine","QFC","Pham",7,96.25]
["2010-04-01","Sunshine","TraderJoe's","Joe",10,137.5]
["2010-05-18","Bellen","PCC","Sue",18,247.5]
["2010-05-30","Quad","TraderJoe's","Fred",18,247.5]
["2010-03-29","Sunset","QFC","Sioux",24,330]
["2010-10-17","Sunset","Albertsons","Fred",21,288.75]
["2010-01-17","Sunshine","TraderJoe's","Sue",9,123.75]
["2010-05-26","Tri","TraderJoe's","Chin",13,178.75]
[{"$f":"RANDBETWEEN(40179,40543)","v":"2010-04-16"},"Sunset","TraderJoe's","Sioux",9,123.75]
["2010-11-03","Bellen","WholeFoods","Pham",4,55]
["2010-06-25","Sunshine","TraderJoe's","Pham",21,288.75]
["2010-03-02","Bellen","WholeFoods","Chin",20,275]
["2010-05-26","Sunset","Albertsons","Pham",22,302.5]
["2010-08-14","Quad","PCC","Pham",8,110]
["2010-01-24","Bellen","QFC","Joe",15,206.25]
["2010-03-22","Tri","Coop","Joe",25,343.75]
["2010-10-15","Tri","QFC","Sue",25,343.75]
["2010-02-27","Quad","Albertsons","Sioux",24,330]
["2010-10-22","Quad","Coop","Pham",3,41.25]
["2010-10-13","Tri","WholeFoods","Fred",9,123.75]
["2010-12-09","Carlota","WholeFoods","Joe",11,151.25]
["2010-07-02","Carlota","Coop","Sue",15,206.25]
["2010-09-21","Sunshine","Coop","Jo",5,68.75]
["2010-03-09","Quad","Albertsons","Fred",9,123.75]
["2010-08-20","SunBell","WholeFoods","Chin",10,137.5]
["2010-11-07","Sunset","Safeway","Joe",4,55]
["2010-01-24","Quad","TraderJoe's","Jo",10,137.5]
["2010-06-15","Quad","Coop","Fred",7,96.25]
["2010-03-20","Carlota","TraderJoe's","Fred",22,302.5]
["2010-10-21","Carlota","PCC","Fred",17,233.75]
["2010-07-11","Sunset","Safeway","Chin",2,27.5]
["2010-05-07","Tri","QFC","Sue",11,151.25]
["2010-03-29","Quad","Albertsons","Sue",17,233.75]
["2010-10-03","Tri","Safeway","Joe",6,82.5]
["2010-12-20","Tri","Albertsons","Jo",2,27.5]
["2010-03-26","Carlota","Safeway","Sioux",19,261.25]
["2010-03-22","Sunshine","TraderJoe's","Jo",22,302.5]
["2010-08-21","Quad","PCC","Jo",8,110]
["2010-08-21","Tri","Coop","Sioux",7,96.25]
["2010-12-17","Sunshine","PCC","Sioux",5,68.75]
["2010-02-27","Sunshine","Coop","Jo",5,68.75]
["2010-02-07","Sunshine","Coop","Chin",3,41.25]
["2010-10-29","Tri","WholeFoods","Fred",4,55]
["2010-05-18","Tri","Albertsons","Fred",24,330]
["2010-04-22","Carlota","TraderJoe's","Sioux",5,68.75]
["2010-10-05","Carlota","Safeway","Sue",5,68.75]
["2010-07-22","Sunshine","WholeFoods","Sioux",1,13.75]
["2010-09-12","Sunshine","Safeway","Chin",6,82.5]
["2010-02-14","Sunset","WholeFoods","Fred",19,261.25]
["2010-06-15","Quad","PCC","Sue",7,96.25]
["2010-06-04","Tri","Coop","Pham",14,192.5]
["2010-02-24","Quad","WholeFoods","Chin",25,343.75]
["2010-08-16","Sunshine","Albertsons","Fred",15,206.25]
["2010-07-12","Quad","Safeway","Sioux",1,13.75]
["2010-08-23","Tri","WholeFoods","Sue",9,123.75]
["2010-12-31","SunBell","WholeFoods","Sioux",24,330]
["2010-10-23","Quad","TraderJoe's","Joe",4,55]
["2010-05-28","SunBell","PCC","Pham",11,151.25]
["2010-01-03","Bellen","Albertsons","Jo",8,110]
["2010-11-28","Sunshine","QFC","Sue",3,41.25]
["2010-12-05","Sunshine","PCC","Sioux",19,261.25]
["2010-10-20","Bellen","Coop","Chin",24,330]
["2010-08-21","SunBell","Safeway","Sue",14,192.5]
["2010-05-03","Sunset","WholeFoods","Pham",19,261.25]
["2010-05-28","Sunset","Coop","Pham",15,206.25]
["2010-02-05","Sunset","WholeFoods","Sue",21,288.75]
["2010-10-27","SunBell","Coop","Jo",7,96.25]
["2010-01-26","Quad","WholeFoods","Jo",6,82.5]
["2010-03-30","Bellen","Albertsons","Jo",3,41.25]
["2010-03-08","Bellen","PCC","Sue",17,233.75]
["2010-10-20","Sunset","Coop","Chin",20,275]
["2010-03-06","Carlota","PCC","Sue",6,82.5]
[{"$f":"RANDBETWEEN(40179,40543)","v":"2010-10-08"},"SunBell","WholeFoods","Sue",19,261.25]
["2010-10-23","SunBell","Safeway","Sioux",4,55]
["2010-04-05","Quad","Coop","Jo",5,68.75]
["2010-07-31","Quad","Safeway","Pham",13,178.75]
["2010-08-02","SunBell","Coop","Sue",1,13.75]
["2010-06-14","SunBell","WholeFoods","Jo",4,55]
["2010-07-04","Bellen","QFC","Pham",9,123.75]
["2010-06-13","Sunshine","PCC","Jo",1,13.75]
["2010-01-02","Tri","PCC","Chin",24,330]
["2010-07-11","SunBell","Safeway","Jo",9,123.75]
["2010-07-23","Carlota","Safeway","Sioux",17,233.75]
["2010-02-26","Carlota","TraderJoe's","Jo",22,302.5]
["2010-07-23","Sunshine","QFC","Fred",21,288.75]
["2010-03-23","Carlota","WholeFoods","Pham",21,288.75]
["2010-03-14","Carlota","Safeway","Joe",4,55]
["2010-10-26","Tri","QFC","Fred",25,343.75]
["2010-04-09","Tri","TraderJoe's","Joe",19,261.25]
["2010-11-26","Sunset","QFC","Pham",7,96.25]
["2010-11-29","Bellen","PCC","Sue",13,178.75]
["2010-05-22","Quad","Safeway","Chin",2,27.5]
["2010-05-22","Sunshine","Coop","Jo",24,330]
["2010-10-22","Tri","Safeway","Joe",18,247.5]
["2010-12-20","Tri","WholeFoods","Pham",9,123.75]
["2010-05-27","Quad","WholeFoods","Fred",4,55]
["2010-12-08","Tri","TraderJoe's","Fred",4,55]
["2010-04-23","Tri","Albertsons","Joe",20,275]
["2010-08-23","Bellen","QFC","Pham",10,137.5]
["2010-06-09","Tri","WholeFoods","Jo",12,165]

{"sheet":"New PT Calculations (an)","index":14,"n_rows":480,"n_cols":20,"rows_kept":480,"cut":false,"hidden":false,"merged":[]}
["Date","Product","Customer","SalesRep","Units","Sales",null,"Years","Date","Sum of Sales","Running Total","% Running Total",null,"old method",null,"Years","Date","Sum of Sales","Running Total","% Running Total"]
[{"$f":"RANDBETWEEN(40179,40543)","v":"2010-05-29"},"Sunshine","Albertsons","Fred",5,68.75,null,"2010","Jan",5747.5,5747.5,6.7245817245817241E-2,null,{"$f":"SUM($J$2:J2)/$J$14","v":6.7245817245817241E-2},null,"2010","Jan",5747.5,5747.5,6.7245817245817241E-2]
["2010-08-07","Quad","PCC","Sioux",18,247.5,null,null,"Feb",4372.5,10120,0.11840411840411841,null,{"$f":"SUM($J$2:J3)/$J$14","v":0.11840411840411841},null,"2010","Feb",4372.5,10120,0.11840411840411841]
[{"$f":"RANDBETWEEN(40179,40543)","v":"2010-06-22"},"Carlota","Albertsons","Sue",22,302.5,null,null,"Mar",8772.5,18892.5,0.22104247104247104,null,{"$f":"SUM($J$2:J4)/$J$14","v":0.22104247104247104},null,"2010","Mar",8772.5,18892.5,0.22104247104247104]
[{"$f":"RANDBETWEEN(40179,40543)","v":"2010-08-21"},"SunBell","QFC","Jo",8,110,null,null,"Apr",6270,25162.5,0.29440154440154442,null,{"$f":"SUM($J$2:J5)/$J$14","v":0.29440154440154442},null,"2010","Apr",6270,25162.5,0.29440154440154442]
["2010-04-12","Sunset","QFC","Sioux",20,275,null,null,"May",8855,34017.5,0.39800514800514802,null,{"$f":"SUM($J$2:J6)/$J$14","v":0.39800514800514802},null,"2010","May",8855,34017.5,0.39800514800514802]
["2010-05-03","Tri","WholeFoods","Sioux",11,151.25,null,null,"Jun",6270,40287.5,0.47136422136422135,null,{"$f":"SUM($J$2:J7)/$J$14","v":0.47136422136422135},null,"2010","Jun",6270,40287.5,0.47136422136422135]
["2010-05-05","Sunset","WholeFoods","Jo",25,343.75,null,null,"Jul",7906.25,48193.75,0.56386743886743884,null,{"$f":"SUM($J$2:J8)/$J$14","v":0.56386743886743884},null,"2010","Jul",7906.25,48193.75,0.56386743886743884]
["2010-03-18","Bellen","WholeFoods","Pham",7,96.25,null,null,"Aug",6380,54573.75,0.63851351351351349,null,{"$f":"SUM($J$2:J9)/$J$14","v":0.63851351351351349},null,"2010","Aug",6380,54573.75,0.63851351351351349]
["2010-12-01","Bellen","Albertsons","Pham",15,206.25,null,null,"Sep",7727.5,62301.25,0.72892535392535396,null,{"$f":"SUM($J$2:J10)/$J$14","v":0.72892535392535396},null,"2010","Sep",7727.5,62301.25,0.72892535392535396]
["2010-08-12","Sunshine","Albertsons","Pham",17,233.75,null,null,"Oct",7218.75,69520,0.81338481338481339,null,{"$f":"SUM($J$2:J11)/$J$14","v":0.81338481338481339},null,"2010","Oct",7218.75,69520,0.81338481338481339]
["2010-12-09","Carlota","PCC","Chin",15,206.25,null,null,"Nov",7700,77220,0.90347490347490345,null,{"$f":"SUM($J$2:J12)/$J$14","v":0.90347490347490345},null,"2010","Nov",7700,77220,0.90347490347490345]
["2010-02-08","Carlota","QFC","Pham",3,41.25,null,null,"Dec",8250,85470,1,null,{"$f":"SUM($J$2:J13)/$J$14","v":1},null,"2010","Dec",8250,85470,1]
["2010-04-18","SunBell","TraderJoe's","Joe",17,233.75,null,"Grand Total",null,85470,null,null,null,null,null,"Grand Total",null,85470]
["2010-02-15","Tri","QFC","Pham",14,192.5]
["2010-01-25","Sunshine","Albertsons","Sioux",14,192.5]
["2010-11-09","Sunshine","Coop","Joe",14,192.5,null,"SalesRep","Product","Sum of Sales","% of Parent",null,null,null,null,"check"]
["2010-02-23","Tri","QFC","Jo",17,233.75,null,"Chin","Bellen",2076.25,0.20160213618157544,null,"<<== Bellen % of Chin Total",null,null,{"$f":"GETPIVOTDATA(\"Sum of Sales\",$H$17,\"Product\",\"Bellen\",\"SalesRep\",\"Chin\")/GETPIVOTDATA(\"Sum of Sales\",$H$17,\"SalesRep\",\"Chin\")","v":0.20160213618157544}]
["2010-11-16","SunBell","Safeway","Joe",21,288.75,null,null,"Carlota",1361.25,0.1321762349799733]
["2010-02-10","SunBell","Safeway","Jo",14,192.5,null,null,"Quad",1636.25,0.15887850467289719]
["2010-11-10","Sunshine","WholeFoods","Pham",4,55,null,null,"SunBell",907.5,8.8117489986648867E-2]
["2010-01-17","SunBell","Safeway","Pham",19,261.25,null,null,"Sunset",1746.25,0.16955941255006676]
["2010-09-14","Tri","WholeFoods","Sioux",25,343.75,null,null,"Sunshine",632.5,6.1415220293724967E-2]
["2010-11-12","Sunshine","PCC","Pham",14,192.5,null,null,"Tri",1938.75,0.18825100133511349]
["2010-11-08","Tri","WholeFoods","Joe",17,233.75,null,"Chin Total",null,10298.75,0.1204954954954955,null,"<< Chin % of Overall Total",null,null,{"$f":"GETPIVOTDATA(\"Sum of Sales\",$H$17,\"SalesRep\",\"Chin\")/GETPIVOTDATA(\"Sum of Sales\",$H$17)","v":0.1204954954954955}]
["2010-07-29","Carlota","Coop","Fred",7,96.25,null,"Fred","Bellen",742.5,4.9180327868852458E-2]
["2010-08-19","Carlota","Safeway","Sioux",13,178.75,null,null,"Carlota",3836.25,0.25409836065573771]
["2010-11-19","Quad","QFC","Sue",7,96.25,null,null,"Quad",1732.5,0.11475409836065574]
["2010-11-09","Tri","Coop","Joe",21,288.75,null,null,"SunBell",2213.75,0.14663023679417123]
["2010-08-08","Tri","PCC","Joe",19,261.25,null,null,"Sunset",2145,0.14207650273224043]
["2010-06-08","Quad","PCC","Joe",16,220,null,null,"Sunshine",1402.5,9.2896174863387984E-2]
["2010-07-23","Tri","QFC","Pham",23,316.25,null,null,"Tri",3025,0.20036429872495445]
["2010-06-26","Tri","Albertsons","Joe",2,27.5,null,"Fred Total",null,15097.5,0.17664092664092665]
["2010-07-30","Tri","QFC","Chin",2,27.5,null,"Jo","Bellen",797.5,6.8075117370892016E-2]
["2010-08-21","SunBell","PCC","Joe",14,192.5,null,null,"Carlota",990,8.4507042253521125E-2]
["2010-11-07","Carlota","PCC","Fred",15,206.25,null,null,"Quad",1265,0.107981220657277]
["2010-05-02","Sunset","WholeFoods","Fred",1,13.75,null,null,"SunBell",1595,0.13615023474178403]
["2010-06-19","Sunset","WholeFoods","Fred",17,233.75,null,null,"Sunset",2433.75,0.20774647887323944]
["2010-12-13","Carlota","Coop","Pham",7,96.25,null,null,"Sunshine",3327.5,0.284037558685446]
["2010-03-12","SunBell","Coop","Chin",4,55,null,null,"Tri",1306.25,0.11150234741784038]
["2010-08-06","Bellen","QFC","Sioux",24,330,null,"Jo Total",null,11715,0.13706563706563707]
["2010-10-29","Bellen","QFC","Fred",15,206.25,null,"Joe","Bellen",1306.25,0.11459589867310012]
["2010-09-21","SunBell","QFC","Joe",19,261.25,null,null,"Carlota",1430,0.12545235223160434]
["2010-12-09","SunBell","Coop","Fred",11,151.25,null,null,"Quad",2323.75,0.20386007237635706]
["2010-03-20","Quad","WholeFoods","Fred",8,110,null,null,"SunBell",1581.25,0.13872135102533173]
["2010-12-17","Carlota","Albertsons","Fred",21,288.75,null,null,"Sunset",880,7.7201447527141129E-2]
["2010-09-12","Bellen","Safeway","Pham",22,302.5,null,null,"Sunshine",907.5,7.9613992762364291E-2]
["2010-02-25","Sunshine","PCC","Joe",8,110,null,null,"Tri",2970,0.26055488540410132]
["2010-10-23","Carlota","QFC","Joe",10,137.5,null,"Joe Total",null,11398.75,0.13336550836550837]
["2010-05-06","Carlota","Coop","Sue",16,220,null,"Pham","Bellen",2048.75,0.16893424036281179]
["2010-10-20","Tri","Safeway","Chin",15,206.25,null,null,"Carlota",2076.25,0.1712018140589569]
["2010-09-02","Sunset","PCC","Jo",23,316.25,null,null,"Quad",1292.5,0.10657596371882086]
["2010-01-25","Bellen","WholeFoods","Jo",15,206.25,null,null,"SunBell",1677.5,0.1383219954648526]
["2010-05-22","Tri","TraderJoe's","Sioux",14,192.5,null,null,"Sunset",1526.25,0.12585034013605442]
["2010-09-28","Sunset","QFC","Joe",2,27.5,null,null,"Sunshine",2007.5,0.1655328798185941]
["2010-01-24","Tri","WholeFoods","Sue",2,27.5,null,null,"Tri",1498.75,0.1235827664399093]
["2010-07-02","Quad","WholeFoods","Chin",3,41.25,null,"Pham Total",null,12127.5,0.14189189189189189]
["2010-12-16","SunBell","WholeFoods","Chin",4,55,null,"Sioux","Bellen",618.75,5.5624227441285541E-2]
["2010-01-21","Carlota","Safeway","Sue",20,275,null,null,"Carlota",2282.5,0.20519159456118666]
["2010-07-09","Sunshine","TraderJoe's","Jo",1,13.75,null,null,"Quad",2186.25,0.1965389369592089]
["2010-01-03","Tri","QFC","Fred",13,178.75,null,null,"SunBell",1196.25,0.10754017305315204]
["2010-06-25","Quad","WholeFoods","Sioux",23,316.25,null,null,"Sunset",2117.5,0.19035846724351049]
["2010-05-26","SunBell","QFC","Joe",16,220,null,null,"Sunshine",1251.25,0.11248454882571075]
["2010-10-25","Carlota","Coop","Chin",17,233.75,null,null,"Tri",1471.25,0.13226205191594562]
["2010-06-03","Sunshine","Coop","Fred",18,247.5,null,"Sioux Total",null,11123.75,0.13014800514800515]
["2010-12-12","Carlota","Albertsons","Pham",25,343.75,null,"Sue","Bellen",2378.75,0.17352056168505517]
["2010-06-21","Sunset","PCC","Chin",2,27.5,null,null,"Carlota",2626.25,0.19157472417251756]
["2010-09-04","SunBell","WholeFoods","Sue",1,13.75,null,null,"Quad",2255,0.16449348044132397]
[{"$f":"RANDBETWEEN(40179,40543)","v":"2010-06-20"},"SunBell","Coop","Fred",18,247.5,null,null,"SunBell",481.25,3.5105315947843531E-2]
["2010-11-05","Carlota","WholeFoods","Sioux",23,316.25,null,null,"Sunset",1677.5,0.12236710130391174]
["2010-10-14","Sunshine","WholeFoods","Pham",4,55,null,null,"Sunshine",2557.5,0.18655967903711135]
["2010-01-13","Sunshine","Coop","Jo",12,165,null,null,"Tri",1732.5,0.12637913741223672]
["2010-05-05","Sunshine","QFC","Sue",24,330,null,"Sue Total",null,13708.75,0.1603925353925354]
["2010-11-22","Carlota","Safeway","Pham",10,137.5,null,"Grand Total",null,85470,1]
["2010-02-23","Carlota","TraderJoe's","Sioux",15,206.25]
["2010-09-27","Sunshine","Safeway","Sue",17,233.75]
["2010-08-19","Carlota","Albertsons","Sue",13,178.75]
["2010-07-20","Bellen","Safeway","Sue",10,137.5]
["2010-04-11","Sunset","TraderJoe's","Jo",20,275]
["2010-09-22","SunBell","Albertsons","Fred",20,275]
["2010-02-05","Quad","Coop","Joe",1,13.75]
["2010-01-10","SunBell","TraderJoe's","Chin",4,55]
["2010-12-13","SunBell","WholeFoods","Fred",18,247.5]
["2010-11-25","Carlota","PCC","Fred",10,137.5]
["2010-11-16","Sunshine","TraderJoe's","Sue",6,82.5]
["2010-01-12","Quad","TraderJoe's","Fred",12,165]
["2010-06-17","SunBell","Coop","Pham",19,261.25]
["2010-07-19","Sunshine","WholeFoods","Sue",1,13.75]
["2010-04-18","Sunshine","PCC","Jo",10,137.5]
["2010-07-14","SunBell","PCC","Fred",5,68.75]
["2010-01-23","Sunshine","Coop","Jo",10,137.5]
["2010-10-10","Bellen","PCC","Sue",16,220]
["2010-02-11","Bellen","TraderJoe's","Chin",3,41.25]
["2010-03-26","SunBell","TraderJoe's","Pham",20,275]
["2010-05-25","Sunset","TraderJoe's","Pham",18,247.5]
["2010-09-06","SunBell","Safeway","Joe",9,123.75]
["2010-10-25","Quad","TraderJoe's","Fred",7,96.25]
["2010-02-05","Quad","Safeway","Joe",4,55]
["2010-03-29","Sunshine","Albertsons","Pham",12,165]
["2010-11-19","Bellen","QFC","Chin",25,343.75]
["2010-08-31","Quad","PCC","Sioux",10,137.5]
["2010-03-17","Bellen","Albertsons","Pham",2,27.5]
["2010-07-20","Sunshine","Safeway","Jo",22,302.5]
["2010-06-22","Bellen","QFC","Sioux",21,288.75]
["2010-03-02","Sunset","QFC","Sioux",3,41.25]
["2010-05-22","Sunshine","Safeway","Jo",20,275]
["2010-08-25","Sunset","Coop","Jo",16,220]
["2010-11-26","Quad","QFC","Joe",8,110]
["2010-02-09","Sunshine","TraderJoe's","Pham",24,330]
["2010-05-22","Bellen","PCC","Chin",12,165]
["2010-03-25","Quad","TraderJoe's","Chin",17,233.75]
["2010-01-07","Carlota","WholeFoods","Fred",1,13.75]
["2010-08-26","Tri","WholeFoods","Sue",2,27.5]
["2010-01-19","Tri","WholeFoods","Jo",21,288.75]
["2010-02-28","Sunshine","PCC","Joe",15,206.25]
["2010-09-03","Tri","Safeway","Fred",24,330]
["2010-07-11","Tri","Safeway","Chin",24,330]
["2010-06-16","Quad","Albertsons","Sioux",6,82.5]
["2010-06-28","Sunset","WholeFoods","Sioux",12,165]
["2010-11-11","Quad","Safeway","Pham",1,13.75]
["2010-05-07","Quad","Coop","Chin",21,288.75]
["2010-02-11","Carlota","Albertsons","Fred",23,316.25]
["2010-01-29","Quad","Albertsons","Jo",17,233.75]
["2010-12-04","SunBell","QFC","Pham",12,165]
["2010-06-09","Tri","TraderJoe's","Jo",1,13.75]
["2010-06-03","Tri","Coop","Pham",6,82.5]
["2010-11-14","Carlota","PCC","Jo",18,247.5]
["2010-12-05","SunBell","WholeFoods","Jo",8,110]
["2010-05-27","Sunshine","Safeway","Pham",11,151.25]
["2010-10-10","Carlota","PCC","Fred",6,82.5]
["2010-12-02","Sunset","TraderJoe's","Sue",18,247.5]
["2010-04-26","Tri","Safeway","Fred",8,110]
[{"$f":"RANDBETWEEN(40179,40543)","v":"2010-03-06"},"Sunset","PCC","Chin",11,151.25]
["2010-03-17","Tri","WholeFoods","Chin",2,27.5]
["2010-10-08","Carlota","Albertsons","Sioux",22,302.5]
["2010-07-28","Quad","TraderJoe's","Sioux",21,288.75]
["2010-10-06","Bellen","TraderJoe's","Chin",11,151.25]
["2010-12-01","Sunshine","Coop","Jo",6,82.5]
["2010-05-07","Sunshine","Coop","Jo",25,343.75]
["2010-03-27","Bellen","Coop","Pham",2,27.5]
["2010-05-20","Bellen","Safeway","Joe",15,206.25]
["2010-08-25","Quad","WholeFoods","Sue",21,288.75]
["2010-01-11","Tri","QFC","Sioux",5,68.75]
["2010-09-22","Carlota","WholeFoods","Sue",13,178.75]
["2010-10-23","Carlota","Safeway","Pham",13,178.75]
["2010-07-29","Tri","Safeway","Joe",9,123.75]
["2010-03-02","Sunshine","Safeway","Sue",18,247.5]
["2010-06-05","Carlota","Albertsons","Chin",8,110]
["2010-10-03","Tri","QFC","Sue",7,96.25]
["2010-01-14","Sunset","PCC","Chin",6,82.5]
["2010-01-04","SunBell","Coop","Sioux",7,96.25]
["2010-12-26","Tri","PCC","Sioux",14,192.5]
["2010-02-05","Quad","PCC","Joe",24,330]
["2010-03-21","Quad","QFC","Joe",17,233.75]
["2010-04-09","Carlota","QFC","Chin",5,68.75]
["2010-12-10","Bellen","TraderJoe's","Sue",1,13.75]
["2010-07-10","Carlota","WholeFoods","Sue",14,192.5]
["2010-03-21","Sunshine","PCC","Jo",12,165]
["2010-06-05","Sunset","PCC","Sioux",25,343.75]
["2010-07-05","Carlota","Albertsons","Jo",3,41.25]
["2010-01-22","Bellen","PCC","Jo",14,192.5]
["2010-06-24","Tri","PCC","Jo",6,82.5]
["2010-09-13","Carlota","Albertsons","Fred",17,233.75]
["2010-06-03","SunBell","Albertsons","Sioux",23,316.25]
["2010-06-14","Bellen","PCC","Fred",4,55]
["2010-10-05","Sunset","WholeFoods","Sue",20,275]
["2010-10-12","Carlota","QFC","Sioux",16,220]
["2010-08-13","Sunset","WholeFoods","Jo",19,261.25]
["2010-03-19","Sunshine","Safeway","Sue",16,220]
["2010-02-24","Sunshine","WholeFoods","Joe",1,13.75]
["2010-11-30","SunBell","PCC","Jo",11,151.25]
["2010-08-28","Tri","Coop","Sioux",18,247.5]
["2010-02-08","Tri","Safeway","Fred",10,137.5]
["2010-12-27","Carlota","Albertsons","Fred",14,192.5]
["2010-04-28","Carlota","WholeFoods","Pham",11,151.25]
["2010-09-30","Carlota","Albertsons","Pham",20,275]
["2010-05-07","Sunset","Coop","Fred",21,288.75]
["2010-09-17","Carlota","TraderJoe's","Sue",17,233.75]
["2010-09-10","Sunshine","WholeFoods","Sue",16,220]
["2010-08-25","Bellen","PCC","Jo",6,82.5]
["2010-05-29","Tri","Albertsons","Pham",3,41.25]
["2010-02-21","Tri","QFC","Pham",7,96.25]
["2010-04-20","Carlota","Coop","Joe",8,110]
["2010-11-11","Sunset","Safeway","Chin",16,220]
["2010-08-30","Bellen","QFC","Joe",19,261.25]
["2010-11-19","Tri","WholeFoods","Joe",17,233.75]
["2010-08-13","Sunset","Safeway","Sioux",11,151.25]
["2010-11-01","Sunshine","Albertsons","Fred",24,330]
["2010-01-18","Carlota","Safeway","Joe",20,275]
["2010-05-24","Quad","Albertsons","Joe",19,261.25]
["2010-12-29","Bellen","WholeFoods","Jo",3,41.25]
["2010-06-30","Sunshine","WholeFoods","Jo",16,220]
["2010-03-28","Sunshine","Safeway","Sioux",23,316.25]
["2010-07-20","Sunshine","Albertsons","Pham",16,220]
["2010-05-25","Carlota","PCC","Sue",23,316.25]
["2010-08-06","Bellen","TraderJoe's","Sue",19,261.25]
[{"$f":"RANDBETWEEN(40179,40543)","v":"2010-09-30"},"Carlota","WholeFoods","Pham",2,27.5]
["2010-10-28","SunBell","PCC","Sioux",18,247.5]
["2010-08-06","Carlota","Coop","Joe",2,27.5]
["2010-12-11","Sunshine","QFC","Jo",23,316.25]
["2010-08-12","Quad","WholeFoods","Fred",25,343.75]
["2010-05-10","SunBell","QFC","Chin",14,192.5]
["2010-11-04","Quad","Albertsons","Fred",15,206.25]
["2010-12-19","Tri","PCC","Chin",17,233.75]
["2010-12-07","Tri","WholeFoods","Fred",22,302.5]
["2010-04-23","Carlota","QFC","Sioux",12,165]
["2010-09-11","Carlota","TraderJoe's","Jo",8,110]
["2010-06-19","Carlota","Coop","Joe",5,68.75]
["2010-07-01","Carlota","WholeFoods","Pham",19,261.25]
["2010-01-04","Quad","Albertsons","Chin",19,261.25]
["2010-04-30","Sunset","Safeway","Joe",19,261.25]
["2010-05-19","Quad","QFC","Sue",18,247.5]
["2010-11-27","Bellen","Coop","Fred",3,41.25]
["2010-04-21","Bellen","Albertsons","Chin",8,110]
["2010-01-10","Sunset","Coop","Sioux",24,330]
["2010-01-15","Sunset","WholeFoods","Jo",3,41.25]
["2010-05-27","SunBell","TraderJoe's","Sioux",5,68.75]
["2010-12-20","Sunset","PCC","Jo",10,137.5]
["2010-02-17","Carlota","PCC","Fred",7,96.25]
["2010-06-22","Bellen","QFC","Fred",12,165]
["2010-09-10","Carlota","WholeFoods","Joe",1,13.75]
["2010-08-09","Quad","TraderJoe's","Joe",25,343.75]
["2010-02-10","Sunset","WholeFoods","Jo",1,13.75]
["2010-09-20","Sunshine","QFC","Chin",17,233.75]
["2010-04-28","Carlota","Coop","Fred",5,68.75]
["2010-03-19","Sunset","PCC","Sue",11,151.25]
["2010-06-30","Tri","QFC","Sue",7,96.25]
["2010-10-17","Sunshine","QFC","Fred",19,261.25]
["2010-01-13","Tri","WholeFoods","Fred",6,82.5]
["2010-12-09","Quad","Safeway","Sioux",22,302.5]
["2010-06-22","Sunset","PCC","Sue",9,123.75]
["2010-09-04","Tri","Safeway","Chin",16,220]
["2010-02-22","Sunshine","WholeFoods","Sioux",7,96.25]
["2010-08-19","Bellen","Albertsons","Sue",20,275]
["2010-01-31","SunBell","QFC","Joe",3,41.25]
["2010-09-17","SunBell","TraderJoe's","Jo",25,343.75]
["2010-12-02","Sunshine","WholeFoods","Pham",11,151.25]
["2010-09-19","SunBell","Coop","Chin",22,302.5]
["2010-03-18","SunBell","Albertsons","Jo",2,27.5]
["2010-09-11","Bellen","PCC","Pham",24,330]
["2010-03-29","Carlota","PCC","Chin",3,41.25]
["2010-01-11","Quad","Safeway","Pham",17,233.75]
["2010-07-07","Sunshine","Albertsons","Joe",3,41.25]
["2010-01-03","Quad","WholeFoods","Sue",13,178.75]
["2010-04-30","Sunset","QFC","Fred",22,302.5]
["2010-10-24","Quad","WholeFoods","Sue",19,261.25]
["2010-03-30","Carlota","Albertsons","Chin",3,41.25]
["2010-07-20","Sunshine","Coop","Sue",25,343.75]
["2010-04-29","Tri","Safeway","Fred",4,55]
["2010-09-29","Quad","WholeFoods","Sioux",13,178.75]
["2010-12-25","Bellen","Coop","Pham",4,55]
["2010-05-14","Tri","Coop","Jo",9,123.75]
["2010-07-08","Quad","Safeway","Chin",3,41.25]
["2010-09-01","Tri","Albertsons","Fred",10,137.5]
["2010-08-29","Sunset","TraderJoe's","Sioux",11,151.25]
["2010-01-03","Quad","TraderJoe's","Pham",24,330]
["2010-01-12","SunBell","Coop","Jo",4,55]
["2010-03-14","Quad","TraderJoe's","Fred",13,178.75]
["2010-12-01","Bellen","QFC","Fred",9,123.75]
["2010-02-21","Tri","PCC","Sue",24,330]
[{"$f":"RANDBETWEEN(40179,40543)","v":"2010-09-28"},"Sunshine","PCC","Sue",25,343.75]
["2010-05-08","Quad","Safeway","Sioux",3,41.25]
["2010-04-25","Tri","PCC","Fred",14,192.5]
["2010-05-27","Bellen","Coop","Sue",20,275]
["2010-02-03","Bellen","PCC","Joe",22,302.5]
["2010-04-25","Quad","QFC","Sue",24,330]
["2010-07-27","Carlota","Albertsons","Joe",19,261.25]
["2010-03-26","Sunset","Coop","Joe",14,192.5]
["2010-07-18","Quad","WholeFoods","Sue",2,27.5]
["2010-09-04","Carlota","Safeway","Chin",9,123.75]
["2010-03-26","Sunshine","PCC","Sue",19,261.25]
["2010-01-18","Bellen","PCC","Fred",7,96.25]
["2010-01-23","Sunshine","Albertsons","Joe",7,96.25]
["2010-05-09","Carlota","WholeFoods","Fred",13,178.75]
["2010-11-23","Quad","TraderJoe's","Jo",7,96.25]
["2010-12-24","Bellen","WholeFoods","Chin",14,192.5]
["2010-08-18","Sunset","PCC","Fred",21,288.75]
["2010-01-01","Sunset","PCC","Jo",14,192.5]
["2010-11-23","Bellen","WholeFoods","Sue",5,68.75]
["2010-03-24","Quad","QFC","Joe",23,316.25]
["2010-06-10","Sunset","Safeway","Jo",22,302.5]
["2010-12-24","SunBell","Albertsons","Pham",1,13.75]
["2010-01-28","Sunshine","Albertsons","Pham",5,68.75]
["2010-07-27","SunBell","TraderJoe's","Chin",8,110]
["2010-10-01","Bellen","Albertsons","Pham",14,192.5]
["2010-08-29","SunBell","Safeway","Sioux",6,82.5]
["2010-10-30","Sunshine","Coop","Chin",20,275]
["2010-09-14","SunBell","Safeway","Fred",25,343.75]
["2010-10-04","Carlota","PCC","Sue",12,165]
["2010-03-26","Sunshine","Coop","Jo",7,96.25]
["2010-01-06","Tri","Safeway","Pham",24,330]
["2010-12-13","Quad","Albertsons","Jo",17,233.75]
["2010-01-26","Carlota","PCC","Fred",20,275]
["2010-06-08","Sunset","TraderJoe's","Sue",19,261.25]
["2010-03-06","Quad","Albertsons","Joe",21,288.75]
["2010-01-29","Carlota","TraderJoe's","Sue",15,206.25]
["2010-10-30","Sunset","Albertsons","Pham",23,316.25]
["2010-08-23","Sunset","PCC","Jo",17,233.75]
["2010-02-23","Tri","TraderJoe's","Sue",15,206.25]
["2010-04-19","Carlota","WholeFoods","Sioux",8,110]
["2010-02-14","Bellen","Albertsons","Jo",9,123.75]
["2010-07-18","Sunset","Albertsons","Chin",20,275]
["2010-12-30","Quad","QFC","Sue",15,206.25]
["2010-03-07","SunBell","PCC","Fred",16,220]
["2010-03-25","Tri","WholeFoods","Jo",19,261.25]
["2010-08-09","Tri","TraderJoe's","Fred",6,82.5]
["2010-11-12","Tri","QFC","Jo",8,110]
["2010-11-21","Carlota","PCC","Chin",20,275]
["2010-08-23","Carlota","Coop","Fred",24,330]
["2010-09-20","Tri","PCC","Pham",9,123.75]
["2010-12-13","Sunset","Safeway","Chin",24,330]
["2010-11-24","Quad","Coop","Sue",21,288.75]
["2010-10-13","Sunshine","TraderJoe's","Sioux",15,206.25]
["2010-10-04","Bellen","Albertsons","Sue",25,343.75]
["2010-05-27","Bellen","QFC","Chin",8,110]
["2010-05-29","Sunset","Safeway","Sioux",12,165]
["2010-06-28","SunBell","Albertsons","Fred",1,13.75]
["2010-01-23","Quad","PCC","Chin",14,192.5]
["2010-08-09","Tri","Albertsons","Fred",5,68.75]
["2010-08-08","Quad","WholeFoods","Pham",24,330]
["2010-04-25","Sunset","Albertsons","Fred",3,41.25]
["2010-12-05","SunBell","QFC","Fred",23,316.25]
["2010-07-20","Sunset","Safeway","Pham",7,96.25]
["2010-05-31","SunBell","Safeway","Joe",4,55]
[{"$f":"RANDBETWEEN(40179,40543)","v":"2010-12-11"},"Sunshine","Albertsons","Joe",8,110]
["2010-11-23","Tri","PCC","Chin",21,288.75]
["2010-07-31","Carlota","TraderJoe's","Pham",20,275]
["2010-10-04","Bellen","WholeFoods","Fred",4,55]
["2010-04-21","Bellen","PCC","Joe",9,123.75]
["2010-02-26","Carlota","Coop","Jo",21,288.75]
["2010-06-30","Sunshine","Coop","Sue",7,96.25]
["2010-12-22","Sunset","Albertsons","Jo",5,68.75]
["2010-07-26","Tri","Albertsons","Joe",21,288.75]
["2010-01-20","Sunset","WholeFoods","Fred",14,192.5]
["2010-09-21","Tri","Coop","Sue",13,178.75]
["2010-11-24","Bellen","Safeway","Pham",20,275]
["2010-01-07","Sunset","Coop","Chin",25,343.75]
["2010-02-06","Sunset","Safeway","Joe",12,165]
["2010-11-12","Tri","TraderJoe's","Joe",2,27.5]
["2010-11-19","Tri","Albertsons","Sue",11,151.25]
["2010-07-18","Quad","PCC","Jo",12,165]
["2010-02-06","Bellen","Coop","Chin",4,55]
["2010-06-19","Tri","PCC","Sioux",13,178.75]
["2010-09-17","Carlota","QFC","Fred",21,288.75]
["2010-12-25","SunBell","Coop","Pham",21,288.75]
["2010-09-29","Tri","Albertsons","Chin",7,96.25]
["2010-02-12","Carlota","TraderJoe's","Joe",24,330]
["2010-06-25","SunBell","Albertsons","Joe",8,110]
["2010-02-02","Sunshine","WholeFoods","Jo",21,288.75]
["2010-05-15","SunBell","Albertsons","Jo",24,330]
["2010-01-05","Bellen","TraderJoe's","Joe",15,206.25]
["2010-06-08","Quad","TraderJoe's","Pham",4,55]
["2010-10-06","Quad","WholeFoods","Jo",10,137.5]
["2010-10-23","SunBell","QFC","Fred",8,110]
["2010-07-20","Sunset","TraderJoe's","Sue",24,330]
["2010-04-14","Quad","PCC","Joe",7,96.25]
["2010-12-02","Quad","TraderJoe's","Chin",2,27.5]
["2010-11-09","Carlota","TraderJoe's","Fred",22,302.5]
["2010-08-24","SunBell","Albertsons","Joe",3,41.25]
["2010-04-27","Quad","WholeFoods","Fred",8,110]
["2010-11-25","Sunset","TraderJoe's","Sioux",3,41.25]
["2010-03-29","SunBell","WholeFoods","Pham",19,261.25]
["2010-05-08","Bellen","Coop","Pham",16,220]
["2010-09-17","Sunset","Coop","Chin",1,13.75]
["2010-05-11","Sunset","TraderJoe's","Joe",13,178.75]
["2010-06-09","SunBell","Safeway","Fred",16,220]
["2010-04-16","Quad","Coop","Sioux",18,247.5]
["2010-08-11","Tri","Coop","Fred",11,151.25]
["2010-09-26","Tri","WholeFoods","Fred",21,288.75]
["2010-01-23","SunBell","Safeway","Joe",1,13.75]
["2010-01-15","Quad","WholeFoods","Chin",13,178.75]
["2010-04-07","Carlota","Albertsons","Fred",14,192.5]
["2010-10-31","Sunshine","Safeway","Sioux",7,96.25]
["2010-10-21","Sunset","WholeFoods","Fred",17,233.75]
["2010-06-11","Sunset","PCC","Jo",2,27.5]
["2010-12-21","Bellen","WholeFoods","Sue",9,123.75]
["2010-05-07","Tri","Coop","Joe",20,275]
["2010-10-10","Carlota","QFC","Sioux",16,220]
["2010-03-15","Bellen","WholeFoods","Chin",22,302.5]
["2010-12-26","Carlota","Coop","Chin",19,261.25]
["2010-01-17","Sunshine","QFC","Pham",7,96.25]
["2010-07-15","Sunshine","TraderJoe's","Joe",10,137.5]
["2010-08-02","Bellen","PCC","Sue",18,247.5]
["2010-08-26","Quad","TraderJoe's","Fred",18,247.5]
["2010-10-21","Sunset","QFC","Sioux",24,330]
["2010-05-26","Sunset","Albertsons","Fred",21,288.75]
["2010-08-09","Sunshine","TraderJoe's","Sue",9,123.75]
["2010-09-15","Tri","TraderJoe's","Chin",13,178.75]
[{"$f":"RANDBETWEEN(40179,40543)","v":"2010-08-07"},"Sunset","TraderJoe's","Sioux",9,123.75]
["2010-01-04","Bellen","WholeFoods","Pham",4,55]
["2010-06-11","Sunshine","TraderJoe's","Pham",21,288.75]
["2010-01-27","Bellen","WholeFoods","Chin",20,275]
["2010-07-23","Sunset","Albertsons","Pham",22,302.5]
["2010-01-25","Quad","PCC","Pham",8,110]
["2010-08-14","Bellen","QFC","Joe",15,206.25]
["2010-09-24","Tri","Coop","Joe",25,343.75]
["2010-05-21","Tri","QFC","Sue",25,343.75]
["2010-12-03","Quad","Albertsons","Sioux",24,330]
["2010-01-28","Quad","Coop","Pham",3,41.25]
["2010-06-09","Tri","WholeFoods","Fred",9,123.75]
["2010-02-10","Carlota","WholeFoods","Joe",11,151.25]
["2010-12-20","Carlota","Coop","Sue",15,206.25]
["2010-07-12","Sunshine","Coop","Jo",5,68.75]
["2010-05-18","Quad","Albertsons","Fred",9,123.75]
["2010-05-21","SunBell","WholeFoods","Chin",10,137.5]
["2010-07-20","Sunset","Safeway","Joe",4,55]
["2010-04-17","Quad","TraderJoe's","Jo",10,137.5]
["2010-05-29","Quad","Coop","Fred",7,96.25]
["2010-12-18","Carlota","TraderJoe's","Fred",22,302.5]
["2010-03-22","Carlota","PCC","Fred",17,233.75]
["2010-08-16","Sunset","Safeway","Chin",2,27.5]
["2010-11-09","Tri","QFC","Sue",11,151.25]
["2010-04-07","Quad","Albertsons","Sue",17,233.75]
["2010-01-02","Tri","Safeway","Joe",6,82.5]
["2010-06-14","Tri","Albertsons","Jo",2,27.5]
["2010-03-11","Carlota","Safeway","Sioux",19,261.25]
["2010-06-10","Sunshine","TraderJoe's","Jo",22,302.5]
["2010-08-11","Quad","PCC","Jo",8,110]
["2010-03-02","Tri","Coop","Sioux",7,96.25]
["2010-12-11","Sunshine","PCC","Sioux",5,68.75]
["2010-11-07","Sunshine","Coop","Jo",5,68.75]
["2010-08-17","Sunshine","Coop","Chin",3,41.25]
["2010-06-24","Tri","WholeFoods","Fred",4,55]
["2010-11-03","Tri","Albertsons","Fred",24,330]
["2010-11-25","Carlota","TraderJoe's","Sioux",5,68.75]
["2010-08-08","Carlota","Safeway","Sue",5,68.75]
["2010-10-04","Sunshine","WholeFoods","Sioux",1,13.75]
["2010-03-09","Sunshine","Safeway","Chin",6,82.5]
["2010-09-09","Sunset","WholeFoods","Fred",19,261.25]
["2010-03-13","Quad","PCC","Sue",7,96.25]
["2010-12-10","Tri","Coop","Pham",14,192.5]
["2010-06-13","Quad","WholeFoods","Chin",25,343.75]
["2010-07-03","Sunshine","Albertsons","Fred",15,206.25]
["2010-05-14","Quad","Safeway","Sioux",1,13.75]
["2010-11-29","Tri","WholeFoods","Sue",9,123.75]
["2010-04-20","SunBell","WholeFoods","Sioux",24,330]
["2010-07-19","Quad","TraderJoe's","Joe",4,55]
["2010-11-24","SunBell","PCC","Pham",11,151.25]
["2010-06-19","Bellen","Albertsons","Jo",8,110]
["2010-05-23","Sunshine","QFC","Sue",3,41.25]
["2010-11-20","Sunshine","PCC","Sioux",19,261.25]
["2010-05-18","Bellen","Coop","Chin",24,330]
["2010-12-30","SunBell","Safeway","Sue",14,192.5]
["2010-09-03","Sunset","WholeFoods","Pham",19,261.25]
["2010-07-17","Sunset","Coop","Pham",15,206.25]
["2010-05-16","Sunset","WholeFoods","Sue",21,288.75]
["2010-10-11","SunBell","Coop","Jo",7,96.25]
["2010-05-21","Quad","WholeFoods","Jo",6,82.5]
["2010-10-22","Bellen","Albertsons","Jo",3,41.25]
["2010-09-04","Bellen","PCC","Sue",17,233.75]
["2010-01-01","Sunset","Coop","Chin",20,275]
["2010-02-10","Carlota","PCC","Sue",6,82.5]
[{"$f":"RANDBETWEEN(40179,40543)","v":"2010-07-21"},"SunBell","WholeFoods","Sue",19,261.25]
["2010-02-12","SunBell","Safeway","Sioux",4,55]
["2010-07-11","Quad","Coop","Jo",5,68.75]
["2010-08-07","Quad","Safeway","Pham",13,178.75]
["2010-09-15","SunBell","Coop","Sue",1,13.75]
["2010-03-09","SunBell","WholeFoods","Jo",4,55]
["2010-12-02","Bellen","QFC","Pham",9,123.75]
["2010-03-28","Sunshine","PCC","Jo",1,13.75]
["2010-04-13","Tri","PCC","Chin",24,330]
["2010-11-16","SunBell","Safeway","Jo",9,123.75]
["2010-07-04","Carlota","Safeway","Sioux",17,233.75]
["2010-05-27","Carlota","TraderJoe's","Jo",22,302.5]
["2010-02-19","Sunshine","QFC","Fred",21,288.75]
["2010-10-11","Carlota","WholeFoods","Pham",21,288.75]
["2010-08-20","Carlota","Safeway","Joe",4,55]
["2010-05-25","Tri","QFC","Fred",25,343.75]
["2010-11-07","Tri","TraderJoe's","Joe",19,261.25]
["2010-12-05","Sunset","QFC","Pham",7,96.25]
["2010-12-24","Bellen","PCC","Sue",13,178.75]
["2010-02-12","Quad","Safeway","Chin",2,27.5]
["2010-07-01","Sunshine","Coop","Jo",24,330]
["2010-10-10","Tri","Safeway","Joe",18,247.5]
["2010-09-28","Tri","WholeFoods","Pham",9,123.75]
["2010-03-13","Quad","WholeFoods","Fred",4,55]
["2010-12-28","Tri","TraderJoe's","Fred",4,55]
["2010-01-06","Tri","Albertsons","Joe",20,275]
["2010-10-07","Bellen","QFC","Pham",10,137.5]
["2010-02-25","Tri","WholeFoods","Jo",12,165]

{"sheet":"NETWORKDAYS","index":15,"n_rows":30,"n_cols":14,"rows_kept":30,"cut":false,"hidden":false,"merged":[]}
["NETWORKDAYS Old 'Compatibility' Function"]
["NETWORKDAYS.INTL New 2010 Function"]
[]
["Other videos on this topic:"]
["Excel Magic Trick 437: NETWORKDAYS Function for Counting Workdays"]
["Excel Magic Trick 438: Counting Workdays Without NETWORKDAYS Function (Weekend is not Sat. & Sun.)"]
["Excel Magic Trick 439: NETWORKDAYS.INTL function Excel 2010"]
["Excel Magic Trick 535: Count Weekdays Including Half Days NETWORKDAYS & NETWORKDAYS.INTL"]
[]
["Holidays",null,"NETWORKDAY assumes Sat and Sun.",null,null,null,"weekend argument  Weekend days",null,null,null,null,null,{"$f":"CHOOSE(M11,\"Sun\",\"Mon\",\"Tue\",\"Wed\",\"Thu\",\"Fri\",\"Sat\")","v":"Mon"},{"$f":"CHOOSE(N11,\"Sun\",\"Mon\",\"Tue\",\"Wed\",\"Thu\",\"Fri\",\"Sat\")","v":"Tue"}]
["2009-11-06",null,"Start","End","Net working Days",null,"1 or omitted    Saturday, Sunday",null,null,null,null,null,2,{"$f":"M11+1","v":3}]
["2009-11-12",null,"2009-10-29","2009-11-16",{"$f":"NETWORKDAYS(C12,D12,$A$11:$A$29)","v":10},null,"2       Sunday, Monday"]
["2009-11-13",null,"2009-10-29","2010-01-30",63,null,"3       Monday, Tuesday",null,null,null,null,null,"old method"]
["2010-01-01",null,"2009-10-31","2010-01-02",41,null,"4       Tuesday, Wednesday",null,null,null,null,null,{"$f":"SUMPRODUCT((WEEKDAY(ROW(INDIRECT(C24&\":\"&D24)))<$M$11)+(WEEKDAY(ROW(INDIRECT(C24&\":\"&D24)))>$N$11),--(COUNTIF($A$11:$A$29,ROW(INDIRECT(C24&\":\"&D24)))=0))","v":11}]
["2010-01-10",null,"2009-11-01","2010-01-13",49,null,"5       Wednesday, Thursday",null,null,null,null,null,63]
[null,null,"2009-11-02","2009-12-04",22,null,"6       Thursday, Friday",null,null,null,null,null,42]
[null,null,"2009-11-02","2010-02-07",66,null,"7       Friday, Saturday",null,null,null,null,null,47]
[null,null,"2009-11-04","2010-02-15",70,null,"11      Sunday only",null,null,null,null,null,20]
[null,null,null,null,null,null,"12      Monday only",null,null,null,null,null,65]
[null,null,null,null,"Third argument",null,"13      Tuesday only",null,null,null,null,null,70]
[null,null,null,null,3,null,"14      Wednesday only"]
[null,null,"NETWORKDAYS.INTL",null,null,null,"15      Thursday only"]
[null,null,"Start","End","Net working Days",null,"16      Friday only"]
[null,null,"2009-10-29","2009-11-16",null,null,"17      Saturday only"]
[null,null,"2009-10-29","2010-01-30"]
[null,null,"2009-10-31","2010-01-02"]
[null,null,"2009-11-01","2010-01-13"]
[null,null,"2009-11-02","2009-12-04"]
[null,null,"2009-11-02","2010-02-07"]
[null,null,"2009-11-04","2010-02-15"]

{"sheet":"NETWORKDAYS (an)","index":16,"n_rows":30,"n_cols":14,"rows_kept":30,"cut":false,"hidden":false,"merged":[]}
["NETWORKDAYS Old 'Compatibility' Function"]
["NETWORKDAYS.INTL New 2010 Function"]
[]
["Other videos on this topic:"]
["Excel Magic Trick 437: NETWORKDAYS Function for Counting Workdays"]
["Excel Magic Trick 438: Counting Workdays Without NETWORKDAYS Function (Weekend is not Sat. & Sun.)"]
["Excel Magic Trick 439: NETWORKDAYS.INTL function Excel 2010"]
["Excel Magic Trick 535: Count Weekdays Including Half Days NETWORKDAYS & NETWORKDAYS.INTL"]
[]
["Holidays",null,"NETWORKDAY assumes Sat and Sun.",null,null,null,"weekend argument  Weekend days",null,null,null,null,null,{"$f":"CHOOSE(M11,\"Sun\",\"Mon\",\"Tue\",\"Wed\",\"Thu\",\"Fri\",\"Sat\")","v":"Mon"},{"$f":"CHOOSE(N11,\"Sun\",\"Mon\",\"Tue\",\"Wed\",\"Thu\",\"Fri\",\"Sat\")","v":"Tue"}]
["2009-11-06",null,"Start","End","Net working Days",null,"1 or omitted    Saturday, Sunday",null,null,null,null,null,2,{"$f":"M11+1","v":3}]
["2009-11-12",null,"2009-10-29","2009-11-16",{"$f":"NETWORKDAYS(C12,D12,$A$11:$A$29)","v":10},null,"2       Sunday, Monday"]
["2009-11-13",null,"2009-10-29","2010-01-30",{"$f":"NETWORKDAYS(C13,D13,$A$11:$A$29)","v":63},null,"3       Monday, Tuesday",null,null,null,null,null,"old method"]
["2010-01-01",null,"2009-10-31","2010-01-02",41,null,"4       Tuesday, Wednesday",null,null,null,null,null,{"$f":"SUMPRODUCT((WEEKDAY(ROW(INDIRECT(C24&\":\"&D24)))<$M$11)+(WEEKDAY(ROW(INDIRECT(C24&\":\"&D24)))>$N$11),--(COUNTIF($A$11:$A$29,ROW(INDIRECT(C24&\":\"&D24)))=0))","v":11}]
["2010-01-10",null,"2009-11-01","2010-01-13",49,null,"5       Wednesday, Thursday",null,null,null,null,null,63]
[null,null,"2009-11-02","2009-12-04",22,null,"6       Thursday, Friday",null,null,null,null,null,42]
[null,null,"2009-11-02","2010-02-07",66,null,"7       Friday, Saturday",null,null,null,null,null,47]
[null,null,"2009-11-04","2010-02-15",70,null,"11      Sunday only",null,null,null,null,null,20]
[null,null,null,null,null,null,"12      Monday only",null,null,null,null,null,65]
[null,null,null,null,"Third argument",null,"13      Tuesday only",null,null,null,null,null,70]
[null,null,null,null,3,null,"14      Wednesday only"]
[null,null,"NETWORKDAYS.INTL",null,null,null,"15      Thursday only"]
[null,null,"Start","End","Net working Days",null,"16      Friday only"]
[null,null,"2009-10-29","2009-11-16",{"$f":"NETWORKDAYS.INTL(C24,D24,$E$21,$A$11:$A$29)","v":11},null,"17      Saturday only"]
[null,null,"2009-10-29","2010-01-30",{"$f":"NETWORKDAYS.INTL(C25,D25,$E$21,$A$11:$A$29)","v":63}]
[null,null,"2009-10-31","2010-01-02",42]
[null,null,"2009-11-01","2010-01-13",47]
[null,null,"2009-11-02","2009-12-04",20]
[null,null,"2009-11-02","2010-02-07",65]
[null,null,"2009-11-04","2010-02-15",70]

{"sheet":"WORKDAY","index":17,"n_rows":62,"n_cols":4,"rows_kept":62,"cut":false,"hidden":false,"merged":[]}
["WORKDAY Old 'Compatibility' Function"]
["WORKDAY.INTL New 2010 Function"]
[]
["Other videos on this topic:"]
["Excel Magic Trick 563: WORKDAY.INTL & WORKDAY Excel 2010 Functions"]
["Excel Magic Trick 565: Excel 2010 Daily Gantt Chart"]
["Excel Magic Trick 783: Date Functions & Formulas (17 Examples) "]
[]
["WORKDAY assumes Sat. & Sun. are weekend"]
["Start Date","2010-04-02",null,"Holidays"]
["# of Workdays in future",16,null,"2010-04-05"]
["Work Date in Future",{"$f":"WORKDAY(B10,B11,D11:D16)","v":"2010-04-27"}]
[]
[]
[]
[]
[]
["WORKDAY.INTL has third argument that allows weekends that are different from Sat. & Sun."]
["Fri & Sat are weekend",null,null,"Holidays"]
["Start Date","2010-04-02",null,"2010-04-05"]
["# of Workdays in future",16]
["Work Date in Future"]
["Friday is included"]
[]
[]
[]
[]
[]
[]
[]
[]
[]
["2010-04-02",{"$f":"WEEKDAY(A33,17)>5","v":true}]
["2010-04-03",true]
["2010-04-04",false]
["2010-04-05",false]
["2010-04-06",false]
["2010-04-07",false]
["2010-04-08",false]
["2010-04-09",true]
["2010-04-10",true]
["2010-04-11",false]
["2010-04-12",false]
["2010-04-13",false]
["2010-04-14",false]
["2010-04-15",false]
["2010-04-16",true]
["2010-04-17",true]
["2010-04-18",false]
["2010-04-19",false]
["2010-04-20",false]
["2010-04-21",false]
["2010-04-22",false]
["2010-04-23",true]
["2010-04-24",true]
["2010-04-25",false]
["2010-04-26",false]
["2010-04-27",false]
["2010-04-28",false]
["2010-04-29",false]
["2010-04-30",true]
["2010-05-01",true]

{"sheet":"WORKDAY (an)","index":18,"n_rows":23,"n_cols":4,"rows_kept":23,"cut":false,"hidden":false,"merged":[]}
["WORKDAY Old 'Compatibility' Function"]
["WORKDAY.INTL New 2010 Function"]
[]
["Other videos on this topic:"]
["Excel Magic Trick 563: WORKDAY.INTL & WORKDAY Excel 2010 Functions"]
["Excel Magic Trick 565: Excel 2010 Daily Gantt Chart"]
["Excel Magic Trick 783: Date Functions & Formulas (17 Examples) "]
[]
["WORKDAY assumes Sat. & Sun. are weekend"]
["Start Date","2010-04-02",null,"Holidays"]
["# of Workdays in future",16,null,"2010-04-05"]
["Work Date in Future",{"$f":"WORKDAY(B10,B11,D11:D16)","v":"2010-04-27"}]
[]
[]
[]
[]
[]
["WORKDAY.INTL has third argument that allows weekends that are different from Sat. & Sun."]
["Fri & Sat are weekend",null,null,"Holidays"]
["Start Date","2010-04-02",null,"2010-04-05"]
["# of Workdays in future",16]
["Work Date in Future",{"$f":"WORKDAY.INTL(B20,B21,7,D20:D25)","v":"2010-04-26"}]
["Friday is included",{"$f":"WORKDAY.INTL(B20,B21-1,7,D20:D25)","v":"2010-04-25"}]

{"sheet":"(565)","index":19,"n_rows":12,"n_cols":15,"rows_kept":12,"cut":false,"hidden":true,"merged":[]}
[]
["Product Start Date","Days in Project","End Date","2010-04-01","2010-04-02","2010-04-03","2010-04-04","2010-04-05","2010-04-06","2010-04-07","2010-04-08","2010-04-09","2010-04-10","2010-04-11","2010-04-12"]
["2010-04-01",2]
["2010-04-01",4]
["2010-04-04",4]
["2010-04-04",2]
["2010-04-01",3]
["2010-04-06",3]
[]
["Holidays","Weekends"]
["2010-04-05","Friday"]
[null,"Saturday",null," =AND(D$2>=$A3,D$2<=$C3)"]

{"sheet":"(565an)","index":20,"n_rows":15,"n_cols":15,"rows_kept":15,"cut":false,"hidden":true,"merged":[]}
[]
["Product Start Date","Days in Project","End Date","2010-04-01","2010-04-02","2010-04-03","2010-04-04","2010-04-05","2010-04-06","2010-04-07","2010-04-08","2010-04-09","2010-04-10","2010-04-11","2010-04-12"]
["2010-04-01",2,{"$f":"WORKDAY.INTL(A3,B3-1,7,$A$11:$A$16)","v":"2010-04-04"}]
["2010-04-01",4,{"$f":"WORKDAY.INTL(A4,B4-1,7,$A$11:$A$16)","v":"2010-04-07"}]
["2010-04-04",4,"2010-04-08"]
["2010-04-04",2,"2010-04-06"]
["2010-04-01",3,"2010-04-06"]
["2010-04-06",3,"2010-04-08"]
[]
["Holidays","Weekends"]
["2010-04-05","Friday"]
[null,"Saturday",null," =AND(D$2>=$A3,D$2<=$C3)"]
[]
[null,null,null,"Video:"]
[null,null,null,"Excel Magic Trick 565: Excel 2010 Daily Gantt Chart "]

{"sheet":"STDEV.S","index":21,"n_rows":26,"n_cols":25,"rows_kept":26,"cut":false,"hidden":false,"merged":[]}
["About 50 new Statistic Functions:"]
["STDEV Old 'Compatibility' Function"]
["STDEV.S New 2010 Function"]
[]
["Other videos on this topic:"]
["Excel 2010 Statistics #30: Standard Deviation: How fairly does the mean represent its data points? "]
[]
["Mean"]
["Standard Deviation",null,null,null,null,null,null,"How fairly the mean represents its data points? How clustered are the data points about the mean? Dispersion. Variability. Risk."]
["Standard Deviation"]
["Year","Stock Return A","Stock Return B",null,null,null,null,null,null,null,null,null,null,null,null,null,null,null,null,null,null,"Stock Return A","Y A","Stock Return B","Y B"]
[1995,0.05,0.02,null,null,null,null,null,null,null,null,null,null,null,null,null,null,null,null,null,null,0.05,1,0.02,2]
[1996,0.1,0.04,null,null,null,null,null,null,null,null,null,null,null,null,null,null,null,null,null,null,0.1,1,0.04,2]
[1997,0.12,3.5000000000000003E-2,null,null,null,null,null,null,null,null,null,null,null,null,null,null,null,null,null,null,0.12,1,3.5000000000000003E-2,2]
[1998,0.17,5.5E-2,null,null,null,null,null,null,null,null,null,null,null,null,null,null,null,null,null,null,0.17,1,5.5E-2,2]
[1999,0.19,0.04,null,null,null,null,null,null,null,null,null,null,null,null,null,null,null,null,null,null,0.19,1,0.04,2]
[2000,0.01,4.2000000000000003E-2,null,null,null,null,null,null,null,null,null,null,null,null,null,null,null,null,null,null,0.01,1,4.2000000000000003E-2,2]
[2001,-0.15,4.2999999999999997E-2,null,null,null,null,null,null,null,null,null,null,null,null,null,null,null,null,null,null,-0.15,1,4.2999999999999997E-2,2]
[2002,-0.03,4.7E-2,null,null,null,null,null,null,null,null,null,null,null,null,null,null,null,null,null,null,-0.03,1,4.7E-2,2]
[2003,0.03,0.05,null,null,null,null,null,null,null,null,null,null,null,null,null,null,null,null,null,null,0.03,1,0.05,2]
[2004,5.5E-2,5.0999999999999997E-2,null,null,null,null,null,null,null,null,null,null,null,null,null,null,null,null,null,null,5.5E-2,1,5.0999999999999997E-2,2]
[2005,0.1,0.03,null,null,null,null,null,null,null,null,null,null,null,null,null,null,null,null,null,null,0.1,1,0.03,2]
[2006,6.5000000000000002E-2,2.9000000000000001E-2,null,null,null,null,null,null,null,null,null,null,null,null,null,null,null,null,null,null,6.5000000000000002E-2,1,2.9000000000000001E-2,2]
[2007,-0.02,4.5999999999999999E-2,null,null,null,null,null,null,null,null,null,null,null,null,null,null,null,null,null,null,-0.02,1,4.5999999999999999E-2,2]
[2008,-0.22,4.9000000000000002E-2,null,null,null,null,null,null,null,null,null,null,null,null,null,null,null,null,null,null,-0.22,1,4.9000000000000002E-2,2]
[2009,0.15,4.1000000000000002E-2,null,null,null,null,null,null,null,null,null,null,null,null,null,null,null,null,null,null,0.15,1,4.1000000000000002E-2,2]

{"sheet":"STDEV.S (an)","index":22,"n_rows":26,"n_cols":25,"rows_kept":26,"cut":false,"hidden":false,"merged":[]}
["About 50 new Statistic Functions:"]
["STDEV Old 'Compatibility' Function"]
["STDEV.S New 2010 Function"]
[]
["Other videos on this topic:"]
["Excel 2010 Statistics #30: Standard Deviation: How fairly does the mean represent its data points? "]
[]
["Mean",{"$f":"AVERAGE(B12:B26)","v":4.1333333333333347E-2},4.1200000000000007E-2]
["Standard Deviation",{"$f":"STDEV(B12:B26)","v":0.11314445044573183},9.4506235621933891E-3,null,null,null,null,"How fairly the mean represents its data points? How clustered are the data points about the mean? Dispersion. Variability. Risk."]
["Standard Deviation",{"$f":"_xlfn.STDEV.S(B12:B26)","v":0.11314445044573183},9.4506235621933891E-3]
["Year","Stock Return A","Stock Return B",null,null,null,null,null,null,null,null,null,null,null,null,null,null,null,null,null,null,"Stock Return A","Y A","Stock Return B","Y B"]
[1995,0.05,0.02,null,null,null,null,null,null,null,null,null,null,null,null,null,null,null,null,null,null,0.05,1,0.02,2]
[1996,0.1,0.04,null,null,null,null,null,null,null,null,null,null,null,null,null,null,null,null,null,null,0.1,1,0.04,2]
[1997,0.12,3.5000000000000003E-2,null,null,null,null,null,null,null,null,null,null,null,null,null,null,null,null,null,null,0.12,1,3.5000000000000003E-2,2]
[1998,0.17,5.5E-2,null,null,null,null,null,null,null,null,null,null,null,null,null,null,null,null,null,null,0.17,1,5.5E-2,2]
[1999,0.19,0.04,null,null,null,null,null,null,null,null,null,null,null,null,null,null,null,null,null,null,0.19,1,0.04,2]
[2000,0.01,4.2000000000000003E-2,null,null,null,null,null,null,null,null,null,null,null,null,null,null,null,null,null,null,0.01,1,4.2000000000000003E-2,2]
[2001,-0.15,4.2999999999999997E-2,null,null,null,null,null,null,null,null,null,null,null,null,null,null,null,null,null,null,-0.15,1,4.2999999999999997E-2,2]
[2002,-0.03,4.7E-2,null,null,null,null,null,null,null,null,null,null,null,null,null,null,null,null,null,null,-0.03,1,4.7E-2,2]
[2003,0.03,0.05,null,null,null,null,null,null,null,null,null,null,null,null,null,null,null,null,null,null,0.03,1,0.05,2]
[2004,5.5E-2,5.0999999999999997E-2,null,null,null,null,null,null,null,null,null,null,null,null,null,null,null,null,null,null,5.5E-2,1,5.0999999999999997E-2,2]
[2005,0.1,0.03,null,null,null,null,null,null,null,null,null,null,null,null,null,null,null,null,null,null,0.1,1,0.03,2]
[2006,6.5000000000000002E-2,2.9000000000000001E-2,null,null,null,null,null,null,null,null,null,null,null,null,null,null,null,null,null,null,6.5000000000000002E-2,1,2.9000000000000001E-2,2]
[2007,-0.02,4.5999999999999999E-2,null,null,null,null,null,null,null,null,null,null,null,null,null,null,null,null,null,null,-0.02,1,4.5999999999999999E-2,2]
[2008,-0.22,4.9000000000000002E-2,null,null,null,null,null,null,null,null,null,null,null,null,null,null,null,null,null,null,-0.22,1,4.9000000000000002E-2,2]
[2009,0.15,4.1000000000000002E-2,null,null,null,null,null,null,null,null,null,null,null,null,null,null,null,null,null,null,0.15,1,4.1000000000000002E-2,2]

{"sheet":"NORM.S.DIST","index":23,"n_rows":15,"n_cols":7,"rows_kept":15,"cut":false,"hidden":false,"merged":[]}
["About 50 new Statistic Functions:"]
["NORMSDIST Old 'Compatibility' Function"]
["NORM.S.DIST New 2010 Function"]
[]
["Other videos on this topic:"]
["Excel 2010 Statistics #30: Standard Deviation: How fairly does the mean represent its data points? "]
["Excel 2010 Statistics 57: NORM.DIST, NORM.S.DIST, NORM.INV, NORM.S.INV Functions Bell Curve "]
["Playlists with over 100 Stats Videos:"]
["http://www.youtube.com/user/ExcelIsFun#grid/user/FAD0C5745D4A1F60",null,null,null,null,"or","http://www.youtube.com/user/ExcelIsFun#grid/user/A1F22CE787E693BF"]
[]
["X","Test Score Mean","Standard Deviation","z",{"$f":"\"P(X<=\"&A12&\")\"","v":"P(X<=20)"}]
[20,25,4.75,{"$f":"(A12-B12)/C12","v":-1.0526315789473684},null," =NORMSDIST(D2)"]
[null,null,null,null,null," =NORM.S.DIST(D2,1)"]
[]
[{"$f":"IF(E13=\"\",\"\",\"The Probability that we could get a score of \"&FIXED(A12,0)&\" or less is \"&TEXT(E13,\"0.00%\"))","v":""}]

{"sheet":"NORM.S.DIST (an)","index":24,"n_rows":15,"n_cols":7,"rows_kept":15,"cut":false,"hidden":false,"merged":[]}
["About 50 new Statistic Functions:"]
["NORMSDIST Old 'Compatibility' Function"]
["NORM.S.DIST New 2010 Function"]
[]
["Other videos on this topic:"]
["Excel 2010 Statistics #30: Standard Deviation: How fairly does the mean represent its data points? "]
["Excel 2010 Statistics 57: NORM.DIST, NORM.S.DIST, NORM.INV, NORM.S.INV Functions Bell Curve "]
["Playlists with over 100 Stats Videos:"]
["http://www.youtube.com/user/ExcelIsFun#grid/user/FAD0C5745D4A1F60",null,null,null,null,"or","http://www.youtube.com/user/ExcelIsFun#grid/user/A1F22CE787E693BF"]
[]
["X","Test Score Mean","Standard Deviation","z",{"$f":"\"P(X<=\"&A12&\")\"","v":"P(X<=20)"}]
[20,25,4.75,{"$f":"(A12-B12)/C12","v":-1.0526315789473684},{"$f":"NORMSDIST(D12)","v":0.14625493909194276}," =NORMSDIST(D2)"]
[null,null,null,null,{"$f":"_xlfn.NORM.S.DIST(D12,1)","v":0.14625493909194276}," =NORM.S.DIST(D2,1)"]
[]
[{"$f":"IF(E13=\"\",\"\",\"The Probability that we could get a score of \"&FIXED(A12,0)&\" or less is \"&TEXT(E13,\"0.00%\"))","v":"The Probability that we could get a score of 20 or less is 14.63%"}]

{"sheet":"RANK","index":25,"n_rows":24,"n_cols":6,"rows_kept":24,"cut":false,"hidden":false,"merged":[]}
["RANK Old 'Compatibility' Function"]
["RANK.AVE New 2010 Function"]
["RANK.EQ New 2010 Function"]
[]
["Other videos on this topic:"]
["Excel 2010 Preview #1: New Rank Function RANK.AVE"]
["Excel Magic Trick 337: RANK function 10 Examples"]
[]
[null,"RANK","RANK.AVG","RANK.EQ"]
["CPA Scores","Rank old","Rank new 1","Rank new 2",null,"old"]
[7,null,null,null,null,{"$f":"RANK(A11,$A$11:$A$24,0)+(COUNT($A$11:$A$24)+1-RANK(A11,$A$11:$A$24,0)-RANK(A11,$A$11:$A$24,1))/2","v":14}]
[17,null,null,null,null,{"$f":"RANK(A12,$A$11:$A$24,0)+(COUNT($A$11:$A$24)+1-RANK(A12,$A$11:$A$24,0)-RANK(A12,$A$11:$A$24,1))/2","v":13}]
[26,null,null,null,null,12]
[27,null,null,null,null,11]
[30,null,null,null,null,10]
[41,null,null,null,null,9]
[42,null,null,null,null,7.5]
[42,null,null,null,null,7.5]
[43,null,null,null,null,6]
[45,null,null,null,null,5]
[54,null,null,null,null,3.5]
[54,null,null,null,null,3.5]
[59,null,null,null,null,2]
[97,null,null,null,null,1]

{"sheet":"RANK (an)","index":26,"n_rows":24,"n_cols":6,"rows_kept":24,"cut":false,"hidden":false,"merged":[]}
["RANK Old 'Compatibility' Function"]
["RANK.AVE New 2010 Function"]
["RANK.EQ New 2010 Function"]
[]
["Other videos on this topic:"]
["Excel 2010 Preview #1: New Rank Function RANK.AVE"]
["Excel Magic Trick 337: RANK function 10 Examples"]
[]
[null,"RANK","RANK.AVG","RANK.EQ"]
["CPA Scores","Rank old","Rank new 1","Rank new 2",null,"old"]
[7,{"$f":"RANK(A11,$A$11:$A$24,0)","v":14},{"$f":"_xlfn.RANK.AVG(A11,$A$11:$A$24,0)","v":14},{"$f":"_xlfn.RANK.EQ(A11,$A$11:$A$24,0)","v":14},null,{"$f":"RANK(A11,$A$11:$A$24,0)+(COUNT($A$11:$A$24)+1-RANK(A11,$A$11:$A$24,0)-RANK(A11,$A$11:$A$24,1))/2","v":14}]
[17,{"$f":"RANK(A12,$A$11:$A$24,0)","v":13},{"$f":"_xlfn.RANK.AVG(A12,$A$11:$A$24,0)","v":13},{"$f":"_xlfn.RANK.EQ(A12,$A$11:$A$24,0)","v":13},null,{"$f":"RANK(A12,$A$11:$A$24,0)+(COUNT($A$11:$A$24)+1-RANK(A12,$A$11:$A$24,0)-RANK(A12,$A$11:$A$24,1))/2","v":13}]
[26,12,12,12,null,12]
[27,11,11,11,null,11]
[30,10,10,10,null,10]
[41,9,9,9,null,9]
[42,7,7.5,7,null,7.5]
[42,7,7.5,7,null,7.5]
[43,6,6,6,null,6]
[45,5,5,5,null,5]
[54,3,3.5,3,null,3.5]
[54,3,3.5,3,null,3.5]
[59,2,2,2,null,2]
[97,1,1,1,null,1]

{"sheet":"AGGREGATE","index":27,"n_rows":18,"n_cols":1,"rows_kept":18,"cut":false,"hidden":false,"merged":[]}
["AGGREGATE New 2010 Function"]
[]
["Excel 2010 AGGREGATE Function\n"]
["This amazing new function can do hundreds of things:"]
["1. AGGREGATE function Contains 19 different functions "]
["2. AGGREGATE function Ignores Hidden Rows for Calculations "]
["3. AGGREGATE function Ignores Error Values for Calculations"]
["4. AGGREGATE function Ignores Nested SUBTOTALs for Calculations"]
["5. AGGREGATE function Ignores Filtered Values When Making Calculations "]
["6. AGGREGATE Function Array Formula #1 Single Cell Array Formula "]
["7. AGGREGATE Function Array Formula #2 Return 5 Largest Values "]
["8. AGGREGATE Function Array Formula #3 Calculate 90 Percentile CPA Scores "]
["9. AGGREGATE function Can Not Handle 3-D Cell References"]
["10. AGGREGATE Function Array Formula #4 Extract Records 1 criterion"]
["11. AGGREGATE function Array Formula #5 Extract Records 2 criteria"]
[]
["12 Other videos on this topic:"]
["http://www.youtube.com/user/ExcelIsFun#grid/user/95781BFAAB4162C0"]

{"sheet":"SUMIFS More","index":28,"n_rows":480,"n_cols":19,"rows_kept":480,"cut":false,"hidden":false,"merged":[]}
["Date","Product","Customer","SalesRep","Units","Sales",null,"Criteria:",null,null,null,null,null,null,null,null,null,"SalesRep","Product"]
["2008-01-02","Sunshine","Albertsons","Fred",5,68.75,null,"SalesRep","Product",null,"Right-click QAT or Ribbon to Customize",null,null,null,null,null,null,"Fred","Sunshine"]
["2008-07-30","Quad","PCC","Sioux",18,247.5,null,"Sue","Quad",null,null,null,null,null,null,null,null,"Sioux","Quad"]
["2008-11-30","Carlota","Albertsons","Sue",22,302.5,null,null,null,null,"New Functions in 2007 for more than 1 criteria",null,null,null,null,null,null,"Sue","Carlota"]
["2009-04-21","SunBell","QFC","Jo",8,110,null,"Count",null,null,"COUNTIFS",null,null,null,null,null,null,"Jo","SunBell"]
["2009-12-31","Sunset","QFC","Sioux",20,275,null,"Add",null,null,"SUMIFS",null,null,null,null,null,null,"Pham","Sunset"]
["2008-01-26","Tri","WholeFoods","Sioux",11,151.25,null,"Ave",{"$f":"AVERAGEIFS($F$2:$F$480,$D$2:$D$480,H3,$B$2:$B$480,I3)","v":205},null,"AVERAGEIFS",null,null,null,null,null,null,"Chin","Tri"]
["2009-03-27","Sunset","WholeFoods","Jo",25,343.75,null,null,null,null,null,null,null,null,null,null,null,"Joe","Bellen"]
["2008-01-28","Bellen","WholeFoods","Pham",7,96.25]
["2009-04-07","Bellen","Albertsons","Pham",15,206.25]
["2009-01-19","Sunshine","Albertsons","Pham",17,233.75]
["2008-02-22","Carlota","PCC","Chin",15,206.25]
["2008-10-05","Carlota","QFC","Pham",3,41.25]
["2009-01-12","SunBell","TraderJoe's","Joe",17,233.75]
["2009-04-17","Tri","QFC","Pham",14,192.5]
["2008-09-26","Sunshine","Albertsons","Sioux",14,192.5]
["2008-01-13","Sunshine","Coop","Joe",14,192.5]
["2008-10-02","Tri","QFC","Jo",17,233.75]
["2008-10-09","SunBell","Safeway","Joe",21,288.75]
["2009-10-28","SunBell","Safeway","Jo",14,192.5]
["2009-11-06","Sunshine","WholeFoods","Pham",4,55]
["2008-01-24","SunBell","Safeway","Pham",19,261.25]
["2008-10-30","Tri","WholeFoods","Sioux",25,343.75]
["2008-10-27","Sunshine","PCC","Pham",14,192.5]
["2008-08-12","Tri","WholeFoods","Joe",17,233.75]
["2008-11-30","Carlota","Coop","Fred",7,96.25]
["2008-01-01","Carlota","Safeway","Sioux",13,178.75]
["2009-12-03","Quad","QFC","Sue",7,96.25]
["2008-05-28","Tri","Coop","Joe",21,288.75]
["2009-08-06","Tri","PCC","Joe",19,261.25]
["2008-07-13","Quad","PCC","Joe",16,220]
["2009-04-21","Tri","QFC","Pham",23,316.25]
["2009-04-26","Tri","Albertsons","Joe",2,27.5]
["2008-08-26","Tri","QFC","Chin",2,27.5]
["2008-12-12","SunBell","PCC","Joe",14,192.5]
["2009-02-05","Carlota","PCC","Fred",15,206.25]
["2008-10-02","Sunset","WholeFoods","Fred",1,13.75]
["2009-04-29","Sunset","WholeFoods","Fred",17,233.75]
["2009-08-13","Carlota","Coop","Pham",7,96.25]
["2008-08-15","SunBell","Coop","Chin",4,55]
["2009-04-30","Bellen","QFC","Sioux",24,330]
["2009-05-24","Bellen","QFC","Fred",15,206.25]
["2009-06-08","SunBell","QFC","Joe",19,261.25]
["2009-12-15","SunBell","Coop","Fred",11,151.25]
["2009-12-21","Quad","WholeFoods","Fred",8,110]
["2009-10-10","Carlota","Albertsons","Fred",21,288.75]
["2008-07-06","Bellen","Safeway","Pham",22,302.5]
["2008-06-21","Sunshine","PCC","Joe",8,110]
["2009-03-02","Carlota","QFC","Joe",10,137.5]
["2009-03-16","Carlota","Coop","Sue",16,220]
["2008-12-09","Tri","Safeway","Chin",15,206.25]
["2009-12-04","Sunset","PCC","Jo",23,316.25]
["2008-07-18","Bellen","WholeFoods","Jo",15,206.25]
["2009-11-24","Tri","TraderJoe's","Sioux",14,192.5]
["2008-04-25","Sunset","QFC","Joe",2,27.5]
["2009-08-17","Tri","WholeFoods","Sue",2,27.5]
["2008-11-03","Quad","WholeFoods","Chin",3,41.25]
["2009-09-06","SunBell","WholeFoods","Chin",4,55]
["2008-12-30","Carlota","Safeway","Sue",20,275]
["2008-02-14","Sunshine","TraderJoe's","Jo",1,13.75]
["2008-11-01","Tri","QFC","Fred",13,178.75]
["2009-01-01","Quad","WholeFoods","Sioux",23,316.25]
["2008-03-07","SunBell","QFC","Joe",16,220]
["2008-06-29","Carlota","Coop","Chin",17,233.75]
["2008-10-12","Sunshine","Coop","Fred",18,247.5]
["2008-06-10","Carlota","Albertsons","Pham",25,343.75]
["2009-07-25","Sunset","PCC","Chin",2,27.5]
["2008-11-29","SunBell","WholeFoods","Sue",1,13.75]
["2008-04-07","SunBell","Coop","Fred",18,247.5]
["2008-01-14","Carlota","WholeFoods","Sioux",23,316.25]
["2009-08-30","Sunshine","WholeFoods","Pham",4,55]
["2008-08-17","Sunshine","Coop","Jo",12,165]
["2008-12-19","Sunshine","QFC","Sue",24,330]
["2008-02-19","Carlota","Safeway","Pham",10,137.5]
["2008-03-03","Carlota","TraderJoe's","Sioux",15,206.25]
["2009-04-07","Sunshine","Safeway","Sue",17,233.75]
["2009-10-04","Carlota","Albertsons","Sue",13,178.75]
["2008-09-01","Bellen","Safeway","Sue",10,137.5]
["2009-07-12","Sunset","TraderJoe's","Jo",20,275]
["2008-10-04","SunBell","Albertsons","Fred",20,275]
["2009-11-20","Quad","Coop","Joe",1,13.75]
["2008-10-27","SunBell","TraderJoe's","Chin",4,55]
["2008-02-11","SunBell","WholeFoods","Fred",18,247.5]
["2009-08-26","Carlota","PCC","Fred",10,137.5]
["2008-03-08","Sunshine","TraderJoe's","Sue",6,82.5]
["2008-12-05","Quad","TraderJoe's","Fred",12,165]
["2008-01-02","SunBell","Coop","Pham",19,261.25]
["2009-10-09","Sunshine","WholeFoods","Sue",1,13.75]
["2009-03-02","Sunshine","PCC","Jo",10,137.5]
["2008-11-11","SunBell","PCC","Fred",5,68.75]
["2008-03-18","Sunshine","Coop","Jo",10,137.5]
["2008-01-05","Bellen","PCC","Sue",16,220]
["2009-01-03","Bellen","TraderJoe's","Chin",3,41.25]
["2009-04-26","SunBell","TraderJoe's","Pham",20,275]
["2008-11-10","Sunset","TraderJoe's","Pham",18,247.5]
["2008-09-27","SunBell","Safeway","Joe",9,123.75]
["2009-01-19","Quad","TraderJoe's","Fred",7,96.25]
["2008-09-06","Quad","Safeway","Joe",4,55]
["2008-02-22","Sunshine","Albertsons","Pham",12,165]
["2008-03-31","Bellen","QFC","Chin",25,343.75]
["2009-08-02","Quad","PCC","Sioux",10,137.5]
["2008-12-03","Bellen","Albertsons","Pham",2,27.5]
["2008-05-20","Sunshine","Safeway","Jo",22,302.5]
["2009-03-26","Bellen","QFC","Sioux",21,288.75]
["2008-12-31","Sunset","QFC","Sioux",3,41.25]
["2009-11-05","Sunshine","Safeway","Jo",20,275]
["2008-12-06","Sunset","Coop","Jo",16,220]
["2008-04-03","Quad","QFC","Joe",8,110]
["2009-09-19","Sunshine","TraderJoe's","Pham",24,330]
["2008-01-07","Bellen","PCC","Chin",12,165]
["2008-11-10","Quad","TraderJoe's","Chin",17,233.75]
["2008-04-30","Carlota","WholeFoods","Fred",1,13.75]
["2009-04-28","Tri","WholeFoods","Sue",2,27.5]
["2009-12-16","Tri","WholeFoods","Jo",21,288.75]
["2009-03-20","Sunshine","PCC","Joe",15,206.25]
["2009-03-01","Tri","Safeway","Fred",24,330]
["2009-01-13","Tri","Safeway","Chin",24,330]
["2008-09-12","Quad","Albertsons","Sioux",6,82.5]
["2008-07-12","Sunset","WholeFoods","Sioux",12,165]
["2008-01-03","Quad","Safeway","Pham",1,13.75]
["2008-11-11","Quad","Coop","Chin",21,288.75]
["2009-07-24","Carlota","Albertsons","Fred",23,316.25]
["2008-10-01","Quad","Albertsons","Jo",17,233.75]
["2008-12-21","SunBell","QFC","Pham",12,165]
["2008-01-14","Tri","TraderJoe's","Jo",1,13.75]
["2008-01-15","Tri","Coop","Pham",6,82.5]
["2009-08-29","Carlota","PCC","Jo",18,247.5]
["2008-08-27","SunBell","WholeFoods","Jo",8,110]
["2008-07-22","Sunshine","Safeway","Pham",11,151.25]
["2009-01-29","Carlota","PCC","Fred",6,82.5]
["2009-03-08","Sunset","TraderJoe's","Sue",18,247.5]
["2009-12-12","Tri","Safeway","Fred",8,110]
["2009-09-22","Sunset","PCC","Chin",11,151.25]
["2009-12-11","Tri","WholeFoods","Chin",2,27.5]
["2008-03-22","Carlota","Albertsons","Sioux",22,302.5]
["2009-08-24","Quad","TraderJoe's","Sioux",21,288.75]
["2009-08-28","Bellen","TraderJoe's","Chin",11,151.25]
["2008-08-15","Sunshine","Coop","Jo",6,82.5]
["2009-06-26","Sunshine","Coop","Jo",25,343.75]
["2008-03-17","Bellen","Coop","Pham",2,27.5]
["2008-03-14","Bellen","Safeway","Joe",15,206.25]
["2009-08-11","Quad","WholeFoods","Sue",21,288.75]
["2008-05-08","Tri","QFC","Sioux",5,68.75]
["2008-07-30","Carlota","WholeFoods","Sue",13,178.75]
["2008-10-24","Carlota","Safeway","Pham",13,178.75]
["2008-12-14","Tri","Safeway","Joe",9,123.75]
["2008-05-15","Sunshine","Safeway","Sue",18,247.5]
["2009-05-15","Carlota","Albertsons","Chin",8,110]
["2009-04-23","Tri","QFC","Sue",7,96.25]
["2009-03-21","Sunset","PCC","Chin",6,82.5]
["2009-07-22","SunBell","Coop","Sioux",7,96.25]
["2009-05-13","Tri","PCC","Sioux",14,192.5]
["2008-12-17","Quad","PCC","Joe",24,330]
["2008-03-12","Quad","QFC","Joe",17,233.75]
["2008-06-10","Carlota","QFC","Chin",5,68.75]
["2008-04-09","Bellen","TraderJoe's","Sue",1,13.75]
["2008-04-08","Carlota","WholeFoods","Sue",14,192.5]
["2008-02-11","Sunshine","PCC","Jo",12,165]
["2009-06-08","Sunset","PCC","Sioux",25,343.75]
["2008-12-03","Carlota","Albertsons","Jo",3,41.25]
["2009-04-26","Bellen","PCC","Jo",14,192.5]
["2008-04-13","Tri","PCC","Jo",6,82.5]
["2009-12-23","Carlota","Albertsons","Fred",17,233.75]
["2008-02-06","SunBell","Albertsons","Sioux",23,316.25]
["2008-03-15","Bellen","PCC","Fred",4,55]
["2009-06-03","Sunset","WholeFoods","Sue",20,275]
["2009-04-04","Carlota","QFC","Sioux",16,220]
["2009-06-14","Sunset","WholeFoods","Jo",19,261.25]
["2009-04-21","Sunshine","Safeway","Sue",16,220]
["2009-06-16","Sunshine","WholeFoods","Joe",1,13.75]
["2009-02-16","SunBell","PCC","Jo",11,151.25]
["2008-05-04","Tri","Coop","Sioux",18,247.5]
["2009-09-26","Tri","Safeway","Fred",10,137.5]
["2008-12-04","Carlota","Albertsons","Fred",14,192.5]
["2009-07-15","Carlota","WholeFoods","Pham",11,151.25]
["2009-11-28","Carlota","Albertsons","Pham",20,275]
["2008-07-25","Sunset","Coop","Fred",21,288.75]
["2008-03-31","Carlota","TraderJoe's","Sue",17,233.75]
["2009-10-25","Sunshine","WholeFoods","Sue",16,220]
["2009-08-11","Bellen","PCC","Jo",6,82.5]
["2009-09-29","Tri","Albertsons","Pham",3,41.25]
["2009-02-18","Tri","QFC","Pham",7,96.25]
["2009-06-21","Carlota","Coop","Joe",8,110]
["2008-02-05","Sunset","Safeway","Chin",16,220]
["2009-03-03","Bellen","QFC","Joe",19,261.25]
["2009-07-14","Tri","WholeFoods","Joe",17,233.75]
["2008-04-21","Sunset","Safeway","Sioux",11,151.25]
["2009-02-23","Sunshine","Albertsons","Fred",24,330]
["2008-01-10","Carlota","Safeway","Joe",20,275]
["2009-05-07","Quad","Albertsons","Joe",19,261.25]
["2008-04-24","Bellen","WholeFoods","Jo",3,41.25]
["2009-01-06","Sunshine","WholeFoods","Jo",16,220]
["2009-07-14","Sunshine","Safeway","Sioux",23,316.25]
["2009-03-14","Sunshine","Albertsons","Pham",16,220]
["2008-02-24","Carlota","PCC","Sue",23,316.25]
["2009-05-16","Bellen","TraderJoe's","Sue",19,261.25]
["2009-07-08","Carlota","WholeFoods","Pham",2,27.5]
["2009-12-29","SunBell","PCC","Sioux",18,247.5]
["2009-09-14","Carlota","Coop","Joe",2,27.5]
["2009-06-22","Sunshine","QFC","Jo",23,316.25]
["2009-11-21","Quad","WholeFoods","Fred",25,343.75]
["2009-03-15","SunBell","QFC","Chin",14,192.5]
["2008-02-13","Quad","Albertsons","Fred",15,206.25]
["2008-03-07","Tri","PCC","Chin",17,233.75]
["2009-06-08","Tri","WholeFoods","Fred",22,302.5]
["2009-03-05","Carlota","QFC","Sioux",12,165]
["2008-05-30","Carlota","TraderJoe's","Jo",8,110]
["2008-05-26","Carlota","Coop","Joe",5,68.75]
["2008-01-04","Carlota","WholeFoods","Pham",19,261.25]
["2008-12-21","Quad","Albertsons","Chin",19,261.25]
["2008-05-28","Sunset","Safeway","Joe",19,261.25]
["2009-01-05","Quad","QFC","Sue",18,247.5]
["2008-07-22","Bellen","Coop","Fred",3,41.25]
["2008-07-01","Bellen","Albertsons","Chin",8,110]
["2008-02-19","Sunset","Coop","Sioux",24,330]
["2009-01-29","Sunset","WholeFoods","Jo",3,41.25]
["2009-09-03","SunBell","TraderJoe's","Sioux",5,68.75]
["2008-02-08","Sunset","PCC","Jo",10,137.5]
["2008-08-28","Carlota","PCC","Fred",7,96.25]
["2008-12-02","Bellen","QFC","Fred",12,165]
["2009-06-07","Carlota","WholeFoods","Joe",1,13.75]
["2009-05-06","Quad","TraderJoe's","Joe",25,343.75]
["2009-10-04","Sunset","WholeFoods","Jo",1,13.75]
["2009-05-16","Sunshine","QFC","Chin",17,233.75]
["2009-11-20","Carlota","Coop","Fred",5,68.75]
["2009-02-11","Sunset","PCC","Sue",11,151.25]
["2009-01-09","Tri","QFC","Sue",7,96.25]
["2008-03-28","Sunshine","QFC","Fred",19,261.25]
["2008-10-19","Tri","WholeFoods","Fred",6,82.5]
["2008-12-19","Quad","Safeway","Sioux",22,302.5]
["2008-06-03","Sunset","PCC","Sue",9,123.75]
["2008-08-30","Tri","Safeway","Chin",16,220]
["2009-02-17","Sunshine","WholeFoods","Sioux",7,96.25]
["2009-11-07","Bellen","Albertsons","Sue",20,275]
["2008-05-01","SunBell","QFC","Joe",3,41.25]
["2009-03-17","SunBell","TraderJoe's","Jo",25,343.75]
["2008-12-23","Sunshine","WholeFoods","Pham",11,151.25]
["2009-02-25","SunBell","Coop","Chin",22,302.5]
["2009-04-29","SunBell","Albertsons","Jo",2,27.5]
["2008-04-03","Bellen","PCC","Pham",24,330]
["2008-08-04","Carlota","PCC","Chin",3,41.25]
["2009-03-05","Quad","Safeway","Pham",17,233.75]
["2008-08-08","Sunshine","Albertsons","Joe",3,41.25]
["2008-06-06","Quad","WholeFoods","Sue",13,178.75]
["2009-11-26","Sunset","QFC","Fred",22,302.5]
["2009-01-09","Quad","WholeFoods","Sue",19,261.25]
["2009-01-30","Carlota","Albertsons","Chin",3,41.25]
["2008-08-28","Sunshine","Coop","Sue",25,343.75]
["2009-11-05","Tri","Safeway","Fred",4,55]
["2009-11-13","Quad","WholeFoods","Sioux",13,178.75]
["2008-06-28","Bellen","Coop","Pham",4,55]
["2009-03-29","Tri","Coop","Jo",9,123.75]
["2008-10-31","Quad","Safeway","Chin",3,41.25]
["2008-02-02","Tri","Albertsons","Fred",10,137.5]
["2009-10-30","Sunset","TraderJoe's","Sioux",11,151.25]
["2008-09-12","Quad","TraderJoe's","Pham",24,330]
["2008-04-16","SunBell","Coop","Jo",4,55]
["2009-06-15","Quad","TraderJoe's","Fred",13,178.75]
["2009-07-20","Bellen","QFC","Fred",9,123.75]
["2009-06-05","Tri","PCC","Sue",24,330]
["2008-06-21","Sunshine","PCC","Sue",25,343.75]
["2009-03-17","Quad","Safeway","Sioux",3,41.25]
["2009-05-12","Tri","PCC","Fred",14,192.5]
["2008-09-10","Bellen","Coop","Sue",20,275]
["2008-04-07","Bellen","PCC","Joe",22,302.5]
["2009-05-28","Quad","QFC","Sue",24,330]
["2009-06-29","Carlota","Albertsons","Joe",19,261.25]
["2008-11-24","Sunset","Coop","Joe",14,192.5]
["2008-11-04","Quad","WholeFoods","Sue",2,27.5]
["2008-08-30","Carlota","Safeway","Chin",9,123.75]
["2008-06-16","Sunshine","PCC","Sue",19,261.25]
["2009-04-11","Bellen","PCC","Fred",7,96.25]
["2008-06-19","Sunshine","Albertsons","Joe",7,96.25]
["2009-01-22","Carlota","WholeFoods","Fred",13,178.75]
["2008-06-25","Quad","TraderJoe's","Jo",7,96.25]
["2009-08-14","Bellen","WholeFoods","Chin",14,192.5]
["2008-08-02","Sunset","PCC","Fred",21,288.75]
["2008-03-02","Sunset","PCC","Jo",14,192.5]
["2008-06-12","Bellen","WholeFoods","Sue",5,68.75]
["2008-08-25","Quad","QFC","Joe",23,316.25]
["2009-07-14","Sunset","Safeway","Jo",22,302.5]
["2009-12-23","SunBell","Albertsons","Pham",1,13.75]
["2009-10-25","Sunshine","Albertsons","Pham",5,68.75]
["2009-05-10","SunBell","TraderJoe's","Chin",8,110]
["2008-03-08","Bellen","Albertsons","Pham",14,192.5]
["2009-10-28","SunBell","Safeway","Sioux",6,82.5]
["2009-04-30","Sunshine","Coop","Chin",20,275]
["2009-07-18","SunBell","Safeway","Fred",25,343.75]
["2009-05-13","Carlota","PCC","Sue",12,165]
["2008-04-07","Sunshine","Coop","Jo",7,96.25]
["2009-01-26","Tri","Safeway","Pham",24,330]
["2008-12-03","Quad","Albertsons","Jo",17,233.75]
["2009-03-29","Carlota","PCC","Fred",20,275]
["2008-06-01","Sunset","TraderJoe's","Sue",19,261.25]
["2008-02-28","Quad","Albertsons","Joe",21,288.75]
["2008-02-02","Carlota","TraderJoe's","Sue",15,206.25]
["2009-02-27","Sunset","Albertsons","Pham",23,316.25]
["2008-04-08","Sunset","PCC","Jo",17,233.75]
["2008-01-10","Tri","TraderJoe's","Sue",15,206.25]
["2009-11-16","Carlota","WholeFoods","Sioux",8,110]
["2009-04-03","Bellen","Albertsons","Jo",9,123.75]
["2009-08-11","Sunset","Albertsons","Chin",20,275]
["2009-04-03","Quad","QFC","Sue",15,206.25]
["2009-12-10","SunBell","PCC","Fred",16,220]
["2008-10-12","Tri","WholeFoods","Jo",19,261.25]
["2008-09-19","Tri","TraderJoe's","Fred",6,82.5]
["2009-06-23","Tri","QFC","Jo",8,110]
["2008-07-19","Carlota","PCC","Chin",20,275]
["2009-03-06","Carlota","Coop","Fred",24,330]
["2009-09-28","Tri","PCC","Pham",9,123.75]
["2009-11-29","Sunset","Safeway","Chin",24,330]
["2009-10-19","Quad","Coop","Sue",21,288.75]
["2009-12-24","Sunshine","TraderJoe's","Sioux",15,206.25]
["2009-10-09","Bellen","Albertsons","Sue",25,343.75]
["2008-07-15","Bellen","QFC","Chin",8,110]
["2009-02-05","Sunset","Safeway","Sioux",12,165]
["2009-02-23","SunBell","Albertsons","Fred",1,13.75]
["2009-08-30","Quad","PCC","Chin",14,192.5]
["2009-06-23","Tri","Albertsons","Fred",5,68.75]
["2009-10-28","Quad","WholeFoods","Pham",24,330]
["2009-08-02","Sunset","Albertsons","Fred",3,41.25]
["2009-01-02","SunBell","QFC","Fred",23,316.25]
["2008-03-01","Sunset","Safeway","Pham",7,96.25]
["2009-11-14","SunBell","Safeway","Joe",4,55]
["2008-10-26","Sunshine","Albertsons","Joe",8,110]
["2008-04-01","Tri","PCC","Chin",21,288.75]
["2008-08-27","Carlota","TraderJoe's","Pham",20,275]
["2008-05-13","Bellen","WholeFoods","Fred",4,55]
["2008-09-04","Bellen","PCC","Joe",9,123.75]
["2008-06-16","Carlota","Coop","Jo",21,288.75]
["2009-06-13","Sunshine","Coop","Sue",7,96.25]
["2008-05-06","Sunset","Albertsons","Jo",5,68.75]
["2008-01-05","Tri","Albertsons","Joe",21,288.75]
["2008-05-10","Sunset","WholeFoods","Fred",14,192.5]
["2008-12-01","Tri","Coop","Sue",13,178.75]
["2008-04-15","Bellen","Safeway","Pham",20,275]
["2008-05-31","Sunset","Coop","Chin",25,343.75]
["2009-01-09","Sunset","Safeway","Joe",12,165]
["2008-04-22","Tri","TraderJoe's","Joe",2,27.5]
["2008-02-13","Tri","Albertsons","Sue",11,151.25]
["2009-08-06","Quad","PCC","Jo",12,165]
["2009-10-12","Bellen","Coop","Chin",4,55]
["2009-05-27","Tri","PCC","Sioux",13,178.75]
["2009-02-14","Carlota","QFC","Fred",21,288.75]
["2009-06-08","SunBell","Coop","Pham",21,288.75]
["2008-03-19","Tri","Albertsons","Chin",7,96.25]
["2008-11-27","Carlota","TraderJoe's","Joe",24,330]
["2008-06-06","SunBell","Albertsons","Joe",8,110]
["2008-07-25","Sunshine","WholeFoods","Jo",21,288.75]
["2008-09-10","SunBell","Albertsons","Jo",24,330]
["2008-05-12","Bellen","TraderJoe's","Joe",15,206.25]
["2009-07-17","Quad","TraderJoe's","Pham",4,55]
["2009-02-06","Quad","WholeFoods","Jo",10,137.5]
["2009-12-02","SunBell","QFC","Fred",8,110]
["2009-03-09","Sunset","TraderJoe's","Sue",24,330]
["2009-11-21","Quad","PCC","Joe",7,96.25]
["2008-07-31","Quad","TraderJoe's","Chin",2,27.5]
["2009-04-15","Carlota","TraderJoe's","Fred",22,302.5]
["2009-04-24","SunBell","Albertsons","Joe",3,41.25]
["2009-12-04","Quad","WholeFoods","Fred",8,110]
["2009-01-28","Sunset","TraderJoe's","Sioux",3,41.25]
["2009-12-26","SunBell","WholeFoods","Pham",19,261.25]
["2008-10-29","Bellen","Coop","Pham",16,220]
["2008-02-09","Sunset","Coop","Chin",1,13.75]
["2008-12-27","Sunset","TraderJoe's","Joe",13,178.75]
["2008-08-03","SunBell","Safeway","Fred",16,220]
["2008-10-30","Quad","Coop","Sioux",18,247.5]
["2008-09-09","Tri","Coop","Fred",11,151.25]
["2008-04-14","Tri","WholeFoods","Fred",21,288.75]
["2009-06-24","SunBell","Safeway","Joe",1,13.75]
["2008-09-13","Quad","WholeFoods","Chin",13,178.75]
["2008-04-30","Carlota","Albertsons","Fred",14,192.5]
["2009-05-14","Sunshine","Safeway","Sioux",7,96.25]
["2008-01-10","Sunset","WholeFoods","Fred",17,233.75]
["2008-01-04","Sunset","PCC","Jo",2,27.5]
["2008-06-19","Bellen","WholeFoods","Sue",9,123.75]
["2009-07-08","Tri","Coop","Joe",20,275]
["2009-03-17","Carlota","QFC","Sioux",16,220]
["2008-07-27","Bellen","WholeFoods","Chin",22,302.5]
["2008-01-09","Carlota","Coop","Chin",19,261.25]
["2008-04-12","Sunshine","QFC","Pham",7,96.25]
["2008-05-10","Sunshine","TraderJoe's","Joe",10,137.5]
["2008-11-14","Bellen","PCC","Sue",18,247.5]
["2008-12-28","Quad","TraderJoe's","Fred",18,247.5]
["2009-03-12","Sunset","QFC","Sioux",24,330]
["2009-03-22","Sunset","Albertsons","Fred",21,288.75]
["2008-03-28","Sunshine","TraderJoe's","Sue",9,123.75]
["2009-05-18","Tri","TraderJoe's","Chin",13,178.75]
["2009-07-06","Sunset","TraderJoe's","Sioux",9,123.75]
["2008-01-11","Bellen","WholeFoods","Pham",4,55]
["2009-04-03","Sunshine","TraderJoe's","Pham",21,288.75]
["2008-04-30","Bellen","WholeFoods","Chin",20,275]
["2008-02-26","Sunset","Albertsons","Pham",22,302.5]
["2009-03-06","Quad","PCC","Pham",8,110]
["2008-07-30","Bellen","QFC","Joe",15,206.25]
["2009-05-06","Tri","Coop","Joe",25,343.75]
["2008-09-08","Tri","QFC","Sue",25,343.75]
["2008-08-11","Quad","Albertsons","Sioux",24,330]
["2008-02-08","Quad","Coop","Pham",3,41.25]
["2008-01-23","Tri","WholeFoods","Fred",9,123.75]
["2008-12-20","Carlota","WholeFoods","Joe",11,151.25]
["2008-09-22","Carlota","Coop","Sue",15,206.25]
["2009-07-14","Sunshine","Coop","Jo",5,68.75]
["2008-02-26","Quad","Albertsons","Fred",9,123.75]
["2009-02-09","SunBell","WholeFoods","Chin",10,137.5]
["2008-10-13","Sunset","Safeway","Joe",4,55]
["2008-03-27","Quad","TraderJoe's","Jo",10,137.5]
["2009-08-14","Quad","Coop","Fred",7,96.25]
["2008-06-03","Carlota","TraderJoe's","Fred",22,302.5]
["2008-11-09","Carlota","PCC","Fred",17,233.75]
["2008-04-23","Sunset","Safeway","Chin",2,27.5]
["2009-08-12","Tri","QFC","Sue",11,151.25]
["2009-03-11","Quad","Albertsons","Sue",17,233.75]
["2009-11-26","Tri","Safeway","Joe",6,82.5]
["2008-01-09","Tri","Albertsons","Jo",2,27.5]
["2008-01-14","Carlota","Safeway","Sioux",19,261.25]
["2009-01-04","Sunshine","TraderJoe's","Jo",22,302.5]
["2008-06-19","Quad","PCC","Jo",8,110]
["2008-10-31","Tri","Coop","Sioux",7,96.25]
["2009-05-30","Sunshine","PCC","Sioux",5,68.75]
["2008-10-28","Sunshine","Coop","Jo",5,68.75]
["2009-12-03","Sunshine","Coop","Chin",3,41.25]
["2008-11-12","Tri","WholeFoods","Fred",4,55]
["2009-06-17","Tri","Albertsons","Fred",24,330]
["2008-05-24","Carlota","TraderJoe's","Sioux",5,68.75]
["2009-10-06","Carlota","Safeway","Sue",5,68.75]
["2009-02-06","Sunshine","WholeFoods","Sioux",1,13.75]
["2008-01-12","Sunshine","Safeway","Chin",6,82.5]
["2009-12-14","Sunset","WholeFoods","Fred",19,261.25]
["2008-11-06","Quad","PCC","Sue",7,96.25]
["2009-07-08","Tri","Coop","Pham",14,192.5]
["2009-05-12","Quad","WholeFoods","Chin",25,343.75]
["2009-03-06","Sunshine","Albertsons","Fred",15,206.25]
["2009-01-10","Quad","Safeway","Sioux",1,13.75]
["2009-04-08","Tri","WholeFoods","Sue",9,123.75]
["2008-07-29","SunBell","WholeFoods","Sioux",24,330]
["2008-10-27","Quad","TraderJoe's","Joe",4,55]
["2008-12-30","SunBell","PCC","Pham",11,151.25]
["2008-09-15","Bellen","Albertsons","Jo",8,110]
["2009-07-18","Sunshine","QFC","Sue",3,41.25]
["2008-05-28","Sunshine","PCC","Sioux",19,261.25]
["2009-05-10","Bellen","Coop","Chin",24,330]
["2008-09-08","SunBell","Safeway","Sue",14,192.5]
["2008-11-15","Sunset","WholeFoods","Pham",19,261.25]
["2008-10-05","Sunset","Coop","Pham",15,206.25]
["2009-08-31","Sunset","WholeFoods","Sue",21,288.75]
["2008-09-12","SunBell","Coop","Jo",7,96.25]
["2009-04-07","Quad","WholeFoods","Jo",6,82.5]
["2008-07-15","Bellen","Albertsons","Jo",3,41.25]
["2009-08-12","Bellen","PCC","Sue",17,233.75]
["2009-08-20","Sunset","Coop","Chin",20,275]
["2008-12-18","Carlota","PCC","Sue",6,82.5]
["2009-03-20","SunBell","WholeFoods","Sue",19,261.25]
["2008-04-16","SunBell","Safeway","Sioux",4,55]
["2008-07-30","Quad","Coop","Jo",5,68.75]
["2008-09-29","Quad","Safeway","Pham",13,178.75]
["2008-12-08","SunBell","Coop","Sue",1,13.75]
["2009-07-21","SunBell","WholeFoods","Jo",4,55]
["2009-02-04","Bellen","QFC","Pham",9,123.75]
["2009-10-07","Sunshine","PCC","Jo",1,13.75]
["2008-07-01","Tri","PCC","Chin",24,330]
["2008-12-16","SunBell","Safeway","Jo",9,123.75]
["2009-02-26","Carlota","Safeway","Sioux",17,233.75]
["2009-04-30","Carlota","TraderJoe's","Jo",22,302.5]
["2009-08-22","Sunshine","QFC","Fred",21,288.75]
["2008-05-19","Carlota","WholeFoods","Pham",21,288.75]
["2008-08-25","Carlota","Safeway","Joe",4,55]
["2009-03-04","Tri","QFC","Fred",25,343.75]
["2008-02-06","Tri","TraderJoe's","Joe",19,261.25]
["2008-10-09","Sunset","QFC","Pham",7,96.25]
["2008-03-14","Bellen","PCC","Sue",13,178.75]
["2008-12-26","Quad","Safeway","Chin",2,27.5]
["2009-08-25","Sunshine","Coop","Jo",24,330]
["2009-07-13","Tri","Safeway","Joe",18,247.5]
["2009-09-06","Tri","WholeFoods","Pham",9,123.75]
["2008-11-25","Quad","WholeFoods","Fred",4,55]
["2009-05-12","Tri","TraderJoe's","Fred",4,55]
["2008-07-10","Tri","Albertsons","Joe",20,275]
["2009-07-04","Bellen","QFC","Pham",10,137.5]
["2009-10-17","Tri","WholeFoods","Jo",12,165]

{"sheet":"SUMIFS More (an)","index":29,"n_rows":480,"n_cols":19,"rows_kept":480,"cut":false,"hidden":false,"merged":[]}
["Date","Product","Customer","SalesRep","Units","Sales",null,"Criteria:",null,null,null,null,null,null,null,null,null,"SalesRep","Product"]
["2008-01-02","Sunshine","Albertsons","Fred",5,68.75,null,"SalesRep","Product",null,"Right-click QAT or Ribbon to Customize",null,null,null,null,null,null,"Fred","Sunshine"]
["2008-07-30","Quad","PCC","Sioux",18,247.5,null,"Sue","Quad",null,null,null,null,null,null,null,null,"Sioux","Quad"]
["2008-11-30","Carlota","Albertsons","Sue",22,302.5,null,null,null,null,"New Functions in 2007 for more than 1 criteria",null,null,null,null,null,null,"Sue","Carlota"]
["2009-04-21","SunBell","QFC","Jo",8,110,null,"Count",{"$f":"COUNTIFS($D$2:$D$480,H3,$B$2:$B$480,I3)","v":11},null,"COUNTIFS",null,null,null,null,null,null,"Jo","SunBell"]
["2009-12-31","Sunset","QFC","Sioux",20,275,null,"Add",{"$f":"SUMIFS($F$2:$F$480,$D$2:$D$480,H3,$B$2:$B$480,I3)","v":2255},null,"SUMIFS",null,null,null,null,null,null,"Pham","Sunset"]
["2008-01-26","Tri","WholeFoods","Sioux",11,151.25,null,"Ave",{"$f":"AVERAGEIFS($F$2:$F$480,$D$2:$D$480,H3,$B$2:$B$480,I3)","v":205},null,"AVERAGEIFS",null,null,null,null,null,null,"Chin","Tri"]
["2009-03-27","Sunset","WholeFoods","Jo",25,343.75,null,null,null,null,null,null,null,null,null,null,null,"Joe","Bellen"]
["2008-01-28","Bellen","WholeFoods","Pham",7,96.25]
["2009-04-07","Bellen","Albertsons","Pham",15,206.25]
["2009-01-19","Sunshine","Albertsons","Pham",17,233.75]
["2008-02-22","Carlota","PCC","Chin",15,206.25]
["2008-10-05","Carlota","QFC","Pham",3,41.25]
["2009-01-12","SunBell","TraderJoe's","Joe",17,233.75]
["2009-04-17","Tri","QFC","Pham",14,192.5]
["2008-09-26","Sunshine","Albertsons","Sioux",14,192.5]
["2008-01-13","Sunshine","Coop","Joe",14,192.5]
["2008-10-02","Tri","QFC","Jo",17,233.75]
["2008-10-09","SunBell","Safeway","Joe",21,288.75]
["2009-10-28","SunBell","Safeway","Jo",14,192.5]
["2009-11-06","Sunshine","WholeFoods","Pham",4,55]
["2008-01-24","SunBell","Safeway","Pham",19,261.25]
["2008-10-30","Tri","WholeFoods","Sioux",25,343.75]
["2008-10-27","Sunshine","PCC","Pham",14,192.5]
["2008-08-12","Tri","WholeFoods","Joe",17,233.75]
["2008-11-30","Carlota","Coop","Fred",7,96.25]
["2008-01-01","Carlota","Safeway","Sioux",13,178.75]
["2009-12-03","Quad","QFC","Sue",7,96.25]
["2008-05-28","Tri","Coop","Joe",21,288.75]
["2009-08-06","Tri","PCC","Joe",19,261.25]
["2008-07-13","Quad","PCC","Joe",16,220]
["2009-04-21","Tri","QFC","Pham",23,316.25]
["2009-04-26","Tri","Albertsons","Joe",2,27.5]
["2008-08-26","Tri","QFC","Chin",2,27.5]
["2008-12-12","SunBell","PCC","Joe",14,192.5]
["2009-02-05","Carlota","PCC","Fred",15,206.25]
["2008-10-02","Sunset","WholeFoods","Fred",1,13.75]
["2009-04-29","Sunset","WholeFoods","Fred",17,233.75]
["2009-08-13","Carlota","Coop","Pham",7,96.25]
["2008-08-15","SunBell","Coop","Chin",4,55]
["2009-04-30","Bellen","QFC","Sioux",24,330]
["2009-05-24","Bellen","QFC","Fred",15,206.25]
["2009-06-08","SunBell","QFC","Joe",19,261.25]
["2009-12-15","SunBell","Coop","Fred",11,151.25]
["2009-12-21","Quad","WholeFoods","Fred",8,110]
["2009-10-10","Carlota","Albertsons","Fred",21,288.75]
["2008-07-06","Bellen","Safeway","Pham",22,302.5]
["2008-06-21","Sunshine","PCC","Joe",8,110]
["2009-03-02","Carlota","QFC","Joe",10,137.5]
["2009-03-16","Carlota","Coop","Sue",16,220]
["2008-12-09","Tri","Safeway","Chin",15,206.25]
["2009-12-04","Sunset","PCC","Jo",23,316.25]
["2008-07-18","Bellen","WholeFoods","Jo",15,206.25]
["2009-11-24","Tri","TraderJoe's","Sioux",14,192.5]
["2008-04-25","Sunset","QFC","Joe",2,27.5]
["2009-08-17","Tri","WholeFoods","Sue",2,27.5]
["2008-11-03","Quad","WholeFoods","Chin",3,41.25]
["2009-09-06","SunBell","WholeFoods","Chin",4,55]
["2008-12-30","Carlota","Safeway","Sue",20,275]
["2008-02-14","Sunshine","TraderJoe's","Jo",1,13.75]
["2008-11-01","Tri","QFC","Fred",13,178.75]
["2009-01-01","Quad","WholeFoods","Sioux",23,316.25]
["2008-03-07","SunBell","QFC","Joe",16,220]
["2008-06-29","Carlota","Coop","Chin",17,233.75]
["2008-10-12","Sunshine","Coop","Fred",18,247.5]
["2008-06-10","Carlota","Albertsons","Pham",25,343.75]
["2009-07-25","Sunset","PCC","Chin",2,27.5]
["2008-11-29","SunBell","WholeFoods","Sue",1,13.75]
["2008-04-07","SunBell","Coop","Fred",18,247.5]
["2008-01-14","Carlota","WholeFoods","Sioux",23,316.25]
["2009-08-30","Sunshine","WholeFoods","Pham",4,55]
["2008-08-17","Sunshine","Coop","Jo",12,165]
["2008-12-19","Sunshine","QFC","Sue",24,330]
["2008-02-19","Carlota","Safeway","Pham",10,137.5]
["2008-03-03","Carlota","TraderJoe's","Sioux",15,206.25]
["2009-04-07","Sunshine","Safeway","Sue",17,233.75]
["2009-10-04","Carlota","Albertsons","Sue",13,178.75]
["2008-09-01","Bellen","Safeway","Sue",10,137.5]
["2009-07-12","Sunset","TraderJoe's","Jo",20,275]
["2008-10-04","SunBell","Albertsons","Fred",20,275]
["2009-11-20","Quad","Coop","Joe",1,13.75]
["2008-10-27","SunBell","TraderJoe's","Chin",4,55]
["2008-02-11","SunBell","WholeFoods","Fred",18,247.5]
["2009-08-26","Carlota","PCC","Fred",10,137.5]
["2008-03-08","Sunshine","TraderJoe's","Sue",6,82.5]
["2008-12-05","Quad","TraderJoe's","Fred",12,165]
["2008-01-02","SunBell","Coop","Pham",19,261.25]
["2009-10-09","Sunshine","WholeFoods","Sue",1,13.75]
["2009-03-02","Sunshine","PCC","Jo",10,137.5]
["2008-11-11","SunBell","PCC","Fred",5,68.75]
["2008-03-18","Sunshine","Coop","Jo",10,137.5]
["2008-01-05","Bellen","PCC","Sue",16,220]
["2009-01-03","Bellen","TraderJoe's","Chin",3,41.25]
["2009-04-26","SunBell","TraderJoe's","Pham",20,275]
["2008-11-10","Sunset","TraderJoe's","Pham",18,247.5]
["2008-09-27","SunBell","Safeway","Joe",9,123.75]
["2009-01-19","Quad","TraderJoe's","Fred",7,96.25]
["2008-09-06","Quad","Safeway","Joe",4,55]
["2008-02-22","Sunshine","Albertsons","Pham",12,165]
["2008-03-31","Bellen","QFC","Chin",25,343.75]
["2009-08-02","Quad","PCC","Sioux",10,137.5]
["2008-12-03","Bellen","Albertsons","Pham",2,27.5]
["2008-05-20","Sunshine","Safeway","Jo",22,302.5]
["2009-03-26","Bellen","QFC","Sioux",21,288.75]
["2008-12-31","Sunset","QFC","Sioux",3,41.25]
["2009-11-05","Sunshine","Safeway","Jo",20,275]
["2008-12-06","Sunset","Coop","Jo",16,220]
["2008-04-03","Quad","QFC","Joe",8,110]
["2009-09-19","Sunshine","TraderJoe's","Pham",24,330]
["2008-01-07","Bellen","PCC","Chin",12,165]
["2008-11-10","Quad","TraderJoe's","Chin",17,233.75]
["2008-04-30","Carlota","WholeFoods","Fred",1,13.75]
["2009-04-28","Tri","WholeFoods","Sue",2,27.5]
["2009-12-16","Tri","WholeFoods","Jo",21,288.75]
["2009-03-20","Sunshine","PCC","Joe",15,206.25]
["2009-03-01","Tri","Safeway","Fred",24,330]
["2009-01-13","Tri","Safeway","Chin",24,330]
["2008-09-12","Quad","Albertsons","Sioux",6,82.5]
["2008-07-12","Sunset","WholeFoods","Sioux",12,165]
["2008-01-03","Quad","Safeway","Pham",1,13.75]
["2008-11-11","Quad","Coop","Chin",21,288.75]
["2009-07-24","Carlota","Albertsons","Fred",23,316.25]
["2008-10-01","Quad","Albertsons","Jo",17,233.75]
["2008-12-21","SunBell","QFC","Pham",12,165]
["2008-01-14","Tri","TraderJoe's","Jo",1,13.75]
["2008-01-15","Tri","Coop","Pham",6,82.5]
["2009-08-29","Carlota","PCC","Jo",18,247.5]
["2008-08-27","SunBell","WholeFoods","Jo",8,110]
["2008-07-22","Sunshine","Safeway","Pham",11,151.25]
["2009-01-29","Carlota","PCC","Fred",6,82.5]
["2009-03-08","Sunset","TraderJoe's","Sue",18,247.5]
["2009-12-12","Tri","Safeway","Fred",8,110]
["2009-09-22","Sunset","PCC","Chin",11,151.25]
["2009-12-11","Tri","WholeFoods","Chin",2,27.5]
["2008-03-22","Carlota","Albertsons","Sioux",22,302.5]
["2009-08-24","Quad","TraderJoe's","Sioux",21,288.75]
["2009-08-28","Bellen","TraderJoe's","Chin",11,151.25]
["2008-08-15","Sunshine","Coop","Jo",6,82.5]
["2009-06-26","Sunshine","Coop","Jo",25,343.75]
["2008-03-17","Bellen","Coop","Pham",2,27.5]
["2008-03-14","Bellen","Safeway","Joe",15,206.25]
["2009-08-11","Quad","WholeFoods","Sue",21,288.75]
["2008-05-08","Tri","QFC","Sioux",5,68.75]
["2008-07-30","Carlota","WholeFoods","Sue",13,178.75]
["2008-10-24","Carlota","Safeway","Pham",13,178.75]
["2008-12-14","Tri","Safeway","Joe",9,123.75]
["2008-05-15","Sunshine","Safeway","Sue",18,247.5]
["2009-05-15","Carlota","Albertsons","Chin",8,110]
["2009-04-23","Tri","QFC","Sue",7,96.25]
["2009-03-21","Sunset","PCC","Chin",6,82.5]
["2009-07-22","SunBell","Coop","Sioux",7,96.25]
["2009-05-13","Tri","PCC","Sioux",14,192.5]
["2008-12-17","Quad","PCC","Joe",24,330]
["2008-03-12","Quad","QFC","Joe",17,233.75]
["2008-06-10","Carlota","QFC","Chin",5,68.75]
["2008-04-09","Bellen","TraderJoe's","Sue",1,13.75]
["2008-04-08","Carlota","WholeFoods","Sue",14,192.5]
["2008-02-11","Sunshine","PCC","Jo",12,165]
["2009-06-08","Sunset","PCC","Sioux",25,343.75]
["2008-12-03","Carlota","Albertsons","Jo",3,41.25]
["2009-04-26","Bellen","PCC","Jo",14,192.5]
["2008-04-13","Tri","PCC","Jo",6,82.5]
["2009-12-23","Carlota","Albertsons","Fred",17,233.75]
["2008-02-06","SunBell","Albertsons","Sioux",23,316.25]
["2008-03-15","Bellen","PCC","Fred",4,55]
["2009-06-03","Sunset","WholeFoods","Sue",20,275]
["2009-04-04","Carlota","QFC","Sioux",16,220]
["2009-06-14","Sunset","WholeFoods","Jo",19,261.25]
["2009-04-21","Sunshine","Safeway","Sue",16,220]
["2009-06-16","Sunshine","WholeFoods","Joe",1,13.75]
["2009-02-16","SunBell","PCC","Jo",11,151.25]
["2008-05-04","Tri","Coop","Sioux",18,247.5]
["2009-09-26","Tri","Safeway","Fred",10,137.5]
["2008-12-04","Carlota","Albertsons","Fred",14,192.5]
["2009-07-15","Carlota","WholeFoods","Pham",11,151.25]
["2009-11-28","Carlota","Albertsons","Pham",20,275]
["2008-07-25","Sunset","Coop","Fred",21,288.75]
["2008-03-31","Carlota","TraderJoe's","Sue",17,233.75]
["2009-10-25","Sunshine","WholeFoods","Sue",16,220]
["2009-08-11","Bellen","PCC","Jo",6,82.5]
["2009-09-29","Tri","Albertsons","Pham",3,41.25]
["2009-02-18","Tri","QFC","Pham",7,96.25]
["2009-06-21","Carlota","Coop","Joe",8,110]
["2008-02-05","Sunset","Safeway","Chin",16,220]
["2009-03-03","Bellen","QFC","Joe",19,261.25]
["2009-07-14","Tri","WholeFoods","Joe",17,233.75]
["2008-04-21","Sunset","Safeway","Sioux",11,151.25]
["2009-02-23","Sunshine","Albertsons","Fred",24,330]
["2008-01-10","Carlota","Safeway","Joe",20,275]
["2009-05-07","Quad","Albertsons","Joe",19,261.25]
["2008-04-24","Bellen","WholeFoods","Jo",3,41.25]
["2009-01-06","Sunshine","WholeFoods","Jo",16,220]
["2009-07-14","Sunshine","Safeway","Sioux",23,316.25]
["2009-03-14","Sunshine","Albertsons","Pham",16,220]
["2008-02-24","Carlota","PCC","Sue",23,316.25]
["2009-05-16","Bellen","TraderJoe's","Sue",19,261.25]
["2009-07-08","Carlota","WholeFoods","Pham",2,27.5]
["2009-12-29","SunBell","PCC","Sioux",18,247.5]
["2009-09-14","Carlota","Coop","Joe",2,27.5]
["2009-06-22","Sunshine","QFC","Jo",23,316.25]
["2009-11-21","Quad","WholeFoods","Fred",25,343.75]
["2009-03-15","SunBell","QFC","Chin",14,192.5]
["2008-02-13","Quad","Albertsons","Fred",15,206.25]
["2008-03-07","Tri","PCC","Chin",17,233.75]
["2009-06-08","Tri","WholeFoods","Fred",22,302.5]
["2009-03-05","Carlota","QFC","Sioux",12,165]
["2008-05-30","Carlota","TraderJoe's","Jo",8,110]
["2008-05-26","Carlota","Coop","Joe",5,68.75]
["2008-01-04","Carlota","WholeFoods","Pham",19,261.25]
["2008-12-21","Quad","Albertsons","Chin",19,261.25]
["2008-05-28","Sunset","Safeway","Joe",19,261.25]
["2009-01-05","Quad","QFC","Sue",18,247.5]
["2008-07-22","Bellen","Coop","Fred",3,41.25]
["2008-07-01","Bellen","Albertsons","Chin",8,110]
["2008-02-19","Sunset","Coop","Sioux",24,330]
["2009-01-29","Sunset","WholeFoods","Jo",3,41.25]
["2009-09-03","SunBell","TraderJoe's","Sioux",5,68.75]
["2008-02-08","Sunset","PCC","Jo",10,137.5]
["2008-08-28","Carlota","PCC","Fred",7,96.25]
["2008-12-02","Bellen","QFC","Fred",12,165]
["2009-06-07","Carlota","WholeFoods","Joe",1,13.75]
["2009-05-06","Quad","TraderJoe's","Joe",25,343.75]
["2009-10-04","Sunset","WholeFoods","Jo",1,13.75]
["2009-05-16","Sunshine","QFC","Chin",17,233.75]
["2009-11-20","Carlota","Coop","Fred",5,68.75]
["2009-02-11","Sunset","PCC","Sue",11,151.25]
["2009-01-09","Tri","QFC","Sue",7,96.25]
["2008-03-28","Sunshine","QFC","Fred",19,261.25]
["2008-10-19","Tri","WholeFoods","Fred",6,82.5]
["2008-12-19","Quad","Safeway","Sioux",22,302.5]
["2008-06-03","Sunset","PCC","Sue",9,123.75]
["2008-08-30","Tri","Safeway","Chin",16,220]
["2009-02-17","Sunshine","WholeFoods","Sioux",7,96.25]
["2009-11-07","Bellen","Albertsons","Sue",20,275]
["2008-05-01","SunBell","QFC","Joe",3,41.25]
["2009-03-17","SunBell","TraderJoe's","Jo",25,343.75]
["2008-12-23","Sunshine","WholeFoods","Pham",11,151.25]
["2009-02-25","SunBell","Coop","Chin",22,302.5]
["2009-04-29","SunBell","Albertsons","Jo",2,27.5]
["2008-04-03","Bellen","PCC","Pham",24,330]
["2008-08-04","Carlota","PCC","Chin",3,41.25]
["2009-03-05","Quad","Safeway","Pham",17,233.75]
["2008-08-08","Sunshine","Albertsons","Joe",3,41.25]
["2008-06-06","Quad","WholeFoods","Sue",13,178.75]
["2009-11-26","Sunset","QFC","Fred",22,302.5]
["2009-01-09","Quad","WholeFoods","Sue",19,261.25]
["2009-01-30","Carlota","Albertsons","Chin",3,41.25]
["2008-08-28","Sunshine","Coop","Sue",25,343.75]
["2009-11-05","Tri","Safeway","Fred",4,55]
["2009-11-13","Quad","WholeFoods","Sioux",13,178.75]
["2008-06-28","Bellen","Coop","Pham",4,55]
["2009-03-29","Tri","Coop","Jo",9,123.75]
["2008-10-31","Quad","Safeway","Chin",3,41.25]
["2008-02-02","Tri","Albertsons","Fred",10,137.5]
["2009-10-30","Sunset","TraderJoe's","Sioux",11,151.25]
["2008-09-12","Quad","TraderJoe's","Pham",24,330]
["2008-04-16","SunBell","Coop","Jo",4,55]
["2009-06-15","Quad","TraderJoe's","Fred",13,178.75]
["2009-07-20","Bellen","QFC","Fred",9,123.75]
["2009-06-05","Tri","PCC","Sue",24,330]
["2008-06-21","Sunshine","PCC","Sue",25,343.75]
["2009-03-17","Quad","Safeway","Sioux",3,41.25]
["2009-05-12","Tri","PCC","Fred",14,192.5]
["2008-09-10","Bellen","Coop","Sue",20,275]
["2008-04-07","Bellen","PCC","Joe",22,302.5]
["2009-05-28","Quad","QFC","Sue",24,330]
["2009-06-29","Carlota","Albertsons","Joe",19,261.25]
["2008-11-24","Sunset","Coop","Joe",14,192.5]
["2008-11-04","Quad","WholeFoods","Sue",2,27.5]
["2008-08-30","Carlota","Safeway","Chin",9,123.75]
["2008-06-16","Sunshine","PCC","Sue",19,261.25]
["2009-04-11","Bellen","PCC","Fred",7,96.25]
["2008-06-19","Sunshine","Albertsons","Joe",7,96.25]
["2009-01-22","Carlota","WholeFoods","Fred",13,178.75]
["2008-06-25","Quad","TraderJoe's","Jo",7,96.25]
["2009-08-14","Bellen","WholeFoods","Chin",14,192.5]
["2008-08-02","Sunset","PCC","Fred",21,288.75]
["2008-03-02","Sunset","PCC","Jo",14,192.5]
["2008-06-12","Bellen","WholeFoods","Sue",5,68.75]
["2008-08-25","Quad","QFC","Joe",23,316.25]
["2009-07-14","Sunset","Safeway","Jo",22,302.5]
["2009-12-23","SunBell","Albertsons","Pham",1,13.75]
["2009-10-25","Sunshine","Albertsons","Pham",5,68.75]
["2009-05-10","SunBell","TraderJoe's","Chin",8,110]
["2008-03-08","Bellen","Albertsons","Pham",14,192.5]
["2009-10-28","SunBell","Safeway","Sioux",6,82.5]
["2009-04-30","Sunshine","Coop","Chin",20,275]
["2009-07-18","SunBell","Safeway","Fred",25,343.75]
["2009-05-13","Carlota","PCC","Sue",12,165]
["2008-04-07","Sunshine","Coop","Jo",7,96.25]
["2009-01-26","Tri","Safeway","Pham",24,330]
["2008-12-03","Quad","Albertsons","Jo",17,233.75]
["2009-03-29","Carlota","PCC","Fred",20,275]
["2008-06-01","Sunset","TraderJoe's","Sue",19,261.25]
["2008-02-28","Quad","Albertsons","Joe",21,288.75]
["2008-02-02","Carlota","TraderJoe's","Sue",15,206.25]
["2009-02-27","Sunset","Albertsons","Pham",23,316.25]
["2008-04-08","Sunset","PCC","Jo",17,233.75]
["2008-01-10","Tri","TraderJoe's","Sue",15,206.25]
["2009-11-16","Carlota","WholeFoods","Sioux",8,110]
["2009-04-03","Bellen","Albertsons","Jo",9,123.75]
["2009-08-11","Sunset","Albertsons","Chin",20,275]
["2009-04-03","Quad","QFC","Sue",15,206.25]
["2009-12-10","SunBell","PCC","Fred",16,220]
["2008-10-12","Tri","WholeFoods","Jo",19,261.25]
["2008-09-19","Tri","TraderJoe's","Fred",6,82.5]
["2009-06-23","Tri","QFC","Jo",8,110]
["2008-07-19","Carlota","PCC","Chin",20,275]
["2009-03-06","Carlota","Coop","Fred",24,330]
["2009-09-28","Tri","PCC","Pham",9,123.75]
["2009-11-29","Sunset","Safeway","Chin",24,330]
["2009-10-19","Quad","Coop","Sue",21,288.75]
["2009-12-24","Sunshine","TraderJoe's","Sioux",15,206.25]
["2009-10-09","Bellen","Albertsons","Sue",25,343.75]
["2008-07-15","Bellen","QFC","Chin",8,110]
["2009-02-05","Sunset","Safeway","Sioux",12,165]
["2009-02-23","SunBell","Albertsons","Fred",1,13.75]
["2009-08-30","Quad","PCC","Chin",14,192.5]
["2009-06-23","Tri","Albertsons","Fred",5,68.75]
["2009-10-28","Quad","WholeFoods","Pham",24,330]
["2009-08-02","Sunset","Albertsons","Fred",3,41.25]
["2009-01-02","SunBell","QFC","Fred",23,316.25]
["2008-03-01","Sunset","Safeway","Pham",7,96.25]
["2009-11-14","SunBell","Safeway","Joe",4,55]
["2008-10-26","Sunshine","Albertsons","Joe",8,110]
["2008-04-01","Tri","PCC","Chin",21,288.75]
["2008-08-27","Carlota","TraderJoe's","Pham",20,275]
["2008-05-13","Bellen","WholeFoods","Fred",4,55]
["2008-09-04","Bellen","PCC","Joe",9,123.75]
["2008-06-16","Carlota","Coop","Jo",21,288.75]
["2009-06-13","Sunshine","Coop","Sue",7,96.25]
["2008-05-06","Sunset","Albertsons","Jo",5,68.75]
["2008-01-05","Tri","Albertsons","Joe",21,288.75]
["2008-05-10","Sunset","WholeFoods","Fred",14,192.5]
["2008-12-01","Tri","Coop","Sue",13,178.75]
["2008-04-15","Bellen","Safeway","Pham",20,275]
["2008-05-31","Sunset","Coop","Chin",25,343.75]
["2009-01-09","Sunset","Safeway","Joe",12,165]
["2008-04-22","Tri","TraderJoe's","Joe",2,27.5]
["2008-02-13","Tri","Albertsons","Sue",11,151.25]
["2009-08-06","Quad","PCC","Jo",12,165]
["2009-10-12","Bellen","Coop","Chin",4,55]
["2009-05-27","Tri","PCC","Sioux",13,178.75]
["2009-02-14","Carlota","QFC","Fred",21,288.75]
["2009-06-08","SunBell","Coop","Pham",21,288.75]
["2008-03-19","Tri","Albertsons","Chin",7,96.25]
["2008-11-27","Carlota","TraderJoe's","Joe",24,330]
["2008-06-06","SunBell","Albertsons","Joe",8,110]
["2008-07-25","Sunshine","WholeFoods","Jo",21,288.75]
["2008-09-10","SunBell","Albertsons","Jo",24,330]
["2008-05-12","Bellen","TraderJoe's","Joe",15,206.25]
["2009-07-17","Quad","TraderJoe's","Pham",4,55]
["2009-02-06","Quad","WholeFoods","Jo",10,137.5]
["2009-12-02","SunBell","QFC","Fred",8,110]
["2009-03-09","Sunset","TraderJoe's","Sue",24,330]
["2009-11-21","Quad","PCC","Joe",7,96.25]
["2008-07-31","Quad","TraderJoe's","Chin",2,27.5]
["2009-04-15","Carlota","TraderJoe's","Fred",22,302.5]
["2009-04-24","SunBell","Albertsons","Joe",3,41.25]
["2009-12-04","Quad","WholeFoods","Fred",8,110]
["2009-01-28","Sunset","TraderJoe's","Sioux",3,41.25]
["2009-12-26","SunBell","WholeFoods","Pham",19,261.25]
["2008-10-29","Bellen","Coop","Pham",16,220]
["2008-02-09","Sunset","Coop","Chin",1,13.75]
["2008-12-27","Sunset","TraderJoe's","Joe",13,178.75]
["2008-08-03","SunBell","Safeway","Fred",16,220]
["2008-10-30","Quad","Coop","Sioux",18,247.5]
["2008-09-09","Tri","Coop","Fred",11,151.25]
["2008-04-14","Tri","WholeFoods","Fred",21,288.75]
["2009-06-24","SunBell","Safeway","Joe",1,13.75]
["2008-09-13","Quad","WholeFoods","Chin",13,178.75]
["2008-04-30","Carlota","Albertsons","Fred",14,192.5]
["2009-05-14","Sunshine","Safeway","Sioux",7,96.25]
["2008-01-10","Sunset","WholeFoods","Fred",17,233.75]
["2008-01-04","Sunset","PCC","Jo",2,27.5]
["2008-06-19","Bellen","WholeFoods","Sue",9,123.75]
["2009-07-08","Tri","Coop","Joe",20,275]
["2009-03-17","Carlota","QFC","Sioux",16,220]
["2008-07-27","Bellen","WholeFoods","Chin",22,302.5]
["2008-01-09","Carlota","Coop","Chin",19,261.25]
["2008-04-12","Sunshine","QFC","Pham",7,96.25]
["2008-05-10","Sunshine","TraderJoe's","Joe",10,137.5]
["2008-11-14","Bellen","PCC","Sue",18,247.5]
["2008-12-28","Quad","TraderJoe's","Fred",18,247.5]
["2009-03-12","Sunset","QFC","Sioux",24,330]
["2009-03-22","Sunset","Albertsons","Fred",21,288.75]
["2008-03-28","Sunshine","TraderJoe's","Sue",9,123.75]
["2009-05-18","Tri","TraderJoe's","Chin",13,178.75]
["2009-07-06","Sunset","TraderJoe's","Sioux",9,123.75]
["2008-01-11","Bellen","WholeFoods","Pham",4,55]
["2009-04-03","Sunshine","TraderJoe's","Pham",21,288.75]
["2008-04-30","Bellen","WholeFoods","Chin",20,275]
["2008-02-26","Sunset","Albertsons","Pham",22,302.5]
["2009-03-06","Quad","PCC","Pham",8,110]
["2008-07-30","Bellen","QFC","Joe",15,206.25]
["2009-05-06","Tri","Coop","Joe",25,343.75]
["2008-09-08","Tri","QFC","Sue",25,343.75]
["2008-08-11","Quad","Albertsons","Sioux",24,330]
["2008-02-08","Quad","Coop","Pham",3,41.25]
["2008-01-23","Tri","WholeFoods","Fred",9,123.75]
["2008-12-20","Carlota","WholeFoods","Joe",11,151.25]
["2008-09-22","Carlota","Coop","Sue",15,206.25]
["2009-07-14","Sunshine","Coop","Jo",5,68.75]
["2008-02-26","Quad","Albertsons","Fred",9,123.75]
["2009-02-09","SunBell","WholeFoods","Chin",10,137.5]
["2008-10-13","Sunset","Safeway","Joe",4,55]
["2008-03-27","Quad","TraderJoe's","Jo",10,137.5]
["2009-08-14","Quad","Coop","Fred",7,96.25]
["2008-06-03","Carlota","TraderJoe's","Fred",22,302.5]
["2008-11-09","Carlota","PCC","Fred",17,233.75]
["2008-04-23","Sunset","Safeway","Chin",2,27.5]
["2009-08-12","Tri","QFC","Sue",11,151.25]
["2009-03-11","Quad","Albertsons","Sue",17,233.75]
["2009-11-26","Tri","Safeway","Joe",6,82.5]
["2008-01-09","Tri","Albertsons","Jo",2,27.5]
["2008-01-14","Carlota","Safeway","Sioux",19,261.25]
["2009-01-04","Sunshine","TraderJoe's","Jo",22,302.5]
["2008-06-19","Quad","PCC","Jo",8,110]
["2008-10-31","Tri","Coop","Sioux",7,96.25]
["2009-05-30","Sunshine","PCC","Sioux",5,68.75]
["2008-10-28","Sunshine","Coop","Jo",5,68.75]
["2009-12-03","Sunshine","Coop","Chin",3,41.25]
["2008-11-12","Tri","WholeFoods","Fred",4,55]
["2009-06-17","Tri","Albertsons","Fred",24,330]
["2008-05-24","Carlota","TraderJoe's","Sioux",5,68.75]
["2009-10-06","Carlota","Safeway","Sue",5,68.75]
["2009-02-06","Sunshine","WholeFoods","Sioux",1,13.75]
["2008-01-12","Sunshine","Safeway","Chin",6,82.5]
["2009-12-14","Sunset","WholeFoods","Fred",19,261.25]
["2008-11-06","Quad","PCC","Sue",7,96.25]
["2009-07-08","Tri","Coop","Pham",14,192.5]
["2009-05-12","Quad","WholeFoods","Chin",25,343.75]
["2009-03-06","Sunshine","Albertsons","Fred",15,206.25]
["2009-01-10","Quad","Safeway","Sioux",1,13.75]
["2009-04-08","Tri","WholeFoods","Sue",9,123.75]
["2008-07-29","SunBell","WholeFoods","Sioux",24,330]
["2008-10-27","Quad","TraderJoe's","Joe",4,55]
["2008-12-30","SunBell","PCC","Pham",11,151.25]
["2008-09-15","Bellen","Albertsons","Jo",8,110]
["2009-07-18","Sunshine","QFC","Sue",3,41.25]
["2008-05-28","Sunshine","PCC","Sioux",19,261.25]
["2009-05-10","Bellen","Coop","Chin",24,330]
["2008-09-08","SunBell","Safeway","Sue",14,192.5]
["2008-11-15","Sunset","WholeFoods","Pham",19,261.25]
["2008-10-05","Sunset","Coop","Pham",15,206.25]
["2009-08-31","Sunset","WholeFoods","Sue",21,288.75]
["2008-09-12","SunBell","Coop","Jo",7,96.25]
["2009-04-07","Quad","WholeFoods","Jo",6,82.5]
["2008-07-15","Bellen","Albertsons","Jo",3,41.25]
["2009-08-12","Bellen","PCC","Sue",17,233.75]
["2009-08-20","Sunset","Coop","Chin",20,275]
["2008-12-18","Carlota","PCC","Sue",6,82.5]
["2009-03-20","SunBell","WholeFoods","Sue",19,261.25]
["2008-04-16","SunBell","Safeway","Sioux",4,55]
["2008-07-30","Quad","Coop","Jo",5,68.75]
["2008-09-29","Quad","Safeway","Pham",13,178.75]
["2008-12-08","SunBell","Coop","Sue",1,13.75]
["2009-07-21","SunBell","WholeFoods","Jo",4,55]
["2009-02-04","Bellen","QFC","Pham",9,123.75]
["2009-10-07","Sunshine","PCC","Jo",1,13.75]
["2008-07-01","Tri","PCC","Chin",24,330]
["2008-12-16","SunBell","Safeway","Jo",9,123.75]
["2009-02-26","Carlota","Safeway","Sioux",17,233.75]
["2009-04-30","Carlota","TraderJoe's","Jo",22,302.5]
["2009-08-22","Sunshine","QFC","Fred",21,288.75]
["2008-05-19","Carlota","WholeFoods","Pham",21,288.75]
["2008-08-25","Carlota","Safeway","Joe",4,55]
["2009-03-04","Tri","QFC","Fred",25,343.75]
["2008-02-06","Tri","TraderJoe's","Joe",19,261.25]
["2008-10-09","Sunset","QFC","Pham",7,96.25]
["2008-03-14","Bellen","PCC","Sue",13,178.75]
["2008-12-26","Quad","Safeway","Chin",2,27.5]
["2009-08-25","Sunshine","Coop","Jo",24,330]
["2009-07-13","Tri","Safeway","Joe",18,247.5]
["2009-09-06","Tri","WholeFoods","Pham",9,123.75]
["2008-11-25","Quad","WholeFoods","Fred",4,55]
["2009-05-12","Tri","TraderJoe's","Fred",4,55]
["2008-07-10","Tri","Albertsons","Joe",20,275]
["2009-07-04","Bellen","QFC","Pham",10,137.5]
["2009-10-17","Tri","WholeFoods","Jo",12,165]