{"text_format":"1","workbook":"xlsx","n_sheets":5,"sheets":["Question","Start","Mike","Mike (2)","Bill"],"not_rendered":{"charts":0,"images":0,"macros":0,"external_links":0,"defined_names":0,"comments":0,"pivot_tables":0},"unopened":[],"bounds":{"document_bytes":16777216,"sheet_cells":100000,"rows_first":2000,"rows_last":500,"rows_between":2000,"halvings":0,"cell_chars":16384,"cell_head_chars":4096},"cells_cut":0,"cells_raw":0,"read":"whole","date_system":"1900"}

{"sheet":"Question","index":0,"n_rows":194,"n_cols":5,"rows_kept":194,"cut":false,"hidden":false,"merged":[]}
["Industry","Customer","Amount",null,"Alex asks:  is there a way to show the top 2 customers per industry?"]
["A","Acct 8375",59948.701198641109]
["A","Acct 1119",57571.432058516744]
["A","Acct 5201",51158.299885325156]
["A","Acct 4408",23608.901998540343]
["B","Acct 2516",99568.567525250037]
["B","Acct 3743",81646.665885651004]
["B","Acct 4045",79274.823478148726]
["B","Acct 7206",64366.495318589732]
["B","Acct 4007",52577.103164786662]
["B","Acct 3806",13796.142644822095]
["B","Acct 1910",12138.442495236857]
["B","Acct 7089",8774.8026805944846]
["C","Acct 4308",45239.218902719978]
["C","Acct 5600",25193.714664525236]
["C","Acct 6115",17495.623050845155]
["D","Acct 2337",98475.307688900779]
["D","Acct 8136",97846.31589242247]
["D","Acct 4816",26444.325750543539]
["E","Acct 3149",72092.199651957693]
["E","Acct 7662",65470.184284119059]
["E","Acct 4289",64944.26296356738]
["E","Acct 7792",62998.694120045839]
["E","Acct 5617",62734.08329937575]
["E","Acct 7210",50013.311746072031]
["E","Acct 4341",39233.444282046439]
["E","Acct 6062",29832.458673877827]
["E","Acct 1364",17251.793375353474]
["E","Acct 5119",10396.892563135962]
["F","Acct 3626",83709.062277228455]
["F","Acct 7853",67756.829240491483]
["F","Acct 6976",59664.026927225699]
["F","Acct 5891",48310.794809471889]
["F","Acct 7434",43426.488050126041]
["F","Acct 1805",20969.511691952881]
["F","Acct 3479",2233.0877044513641]
["G","Acct 4572",98032.383611700527]
["G","Acct 3463",78194.091269626821]
["G","Acct 4202",76665.750257587832]
["G","Acct 6885",56257.227525234288]
["G","Acct 6445",40864.926055360163]
["G","Acct 5336",6883.7709958614932]
["H","Acct 7000",95458.07830050755]
["H","Acct 3609",89821.418741519999]
["H","Acct 4633",89361.942591034429]
["H","Acct 3846",86798.501207525958]
["H","Acct 1067",43392.063969875504]
["H","Acct 5766",24277.339010315001]
["H","Acct 2003",20094.052456190082]
["H","Acct 6171",19433.15046207772]
["H","Acct 3929",7789.3703568382207]
["H","Acct 8365",3466.3045130392866]
["H","Acct 8318",1854.4621656475856]
["H","Acct 5742",68.401019163055736]
["I","Acct 2335",96986.478946464005]
["I","Acct 7761",94931.171086085713]
["I","Acct 7297",90699.261858278114]
["I","Acct 5300",87789.328269525518]
["I","Acct 3853",86204.595435424795]
["I","Acct 1079",74531.421535208792]
["I","Acct 4623",74069.427022633623]
["I","Acct 2401",66564.803428470259]
["I","Acct 5360",53569.205169452172]
["I","Acct 8371",23389.143038519091]
["I","Acct 2234",12050.678952141358]
["J","Acct 6172",93547.891564467995]
["J","Acct 4394",88084.334500708588]
["J","Acct 7933",87655.308899984651]
["J","Acct 7673",82293.104880033716]
["J","Acct 8868",81510.467506900051]
["J","Acct 1385",69549.267947399916]
["J","Acct 1353",64993.578410125861]
["J","Acct 3839",62790.980512658687]
["J","Acct 7937",37230.676759181959]
["J","Acct 3572",27859.12782444404]
["J","Acct 8285",16955.51182875994]
["J","Acct 4583",9687.6331415009954]
["K","Acct 7565",84888.3557188181]
["K","Acct 6510",70681.601631156314]
["K","Acct 6891",59407.130969918151]
["K","Acct 2455",56457.318323541193]
["K","Acct 5001",37382.501380440444]
["L","Acct 8898",98419.82694628532]
["L","Acct 8210",72573.353135136334]
["L","Acct 8361",57832.389120664964]
["L","Acct 8038",41764.529772309797]
["L","Acct 3155",33360.942138445571]
["L","Acct 5975",10963.989377962658]
["L","Acct 3693",5145.0679813428878]
["M","Acct 1839",93012.868685983034]
["M","Acct 8666",89585.223662240242]
["M","Acct 5486",83186.624258868935]
["M","Acct 7791",71962.025844609889]
["M","Acct 7844",70209.460628448345]
["M","Acct 3951",65416.931332410903]
["M","Acct 5535",59374.365818534447]
["M","Acct 5922",53247.285606027915]
["M","Acct 1928",53083.049022911968]
["M","Acct 1489",30363.21523896942]
["M","Acct 2671",19973.06971246413]
["M","Acct 8409",18684.296007320787]
["M","Acct 1029",12275.341687067708]
["M","Acct 5378",5989.472665921614]
["N","Acct 7568",75958.520399238434]
["N","Acct 1881",68036.179783628075]
["N","Acct 2572",35387.666055635462]
["N","Acct 6471",26247.804740380965]
["N","Acct 3287",16958.805359766848]
["N","Acct 5385",16270.326629001696]
["N","Acct 6968",3441.5438593462522]
["O","Acct 2274",98826.453609775665]
["O","Acct 4857",80257.656503568927]
["O","Acct 3449",42019.850448222431]
["O","Acct 8704",28612.064572513373]
["O","Acct 3511",28534.865024923994]
["P","Acct 7506",98371.957216768133]
["P","Acct 8246",85292.137879763279]
["P","Acct 7863",85194.239646258648]
["P","Acct 1457",81855.218059321414]
["P","Acct 2682",47153.535610922416]
["P","Acct 8012",42087.342515283024]
["P","Acct 2752",41447.981980571625]
["P","Acct 6769",37767.112763393619]
["P","Acct 3180",13917.201059140294]
["Q","Acct 3599",83535.147175419741]
["Q","Acct 1289",44824.408958438311]
["Q","Acct 3068",31145.337098534397]
["Q","Acct 1496",14932.955485635446]
["R","Acct 4164",88970.843076139776]
["R","Acct 7397",85708.50929882683]
["R","Acct 6023",74273.508848181009]
["R","Acct 4100",43672.911787917968]
["R","Acct 8152",36607.047572390074]
["R","Acct 7092",29185.529257034559]
["R","Acct 2588",25304.69252127334]
["R","Acct 4783",7744.3144514072856]
["S","Acct 2814",76834.025919695297]
["S","Acct 4150",56289.341835275176]
["S","Acct 8643",47809.554028744547]
["S","Acct 6269",41921.984416262072]
["S","Acct 1034",34929.233956985816]
["S","Acct 8653",30915.561620566979]
["S","Acct 1315",6428.7769890917998]
["T","Acct 2211",77993.273405303655]
["T","Acct 7416",52875.38074087417]
["T","Acct 4526",34201.873974298614]
["T","Acct 6104",34131.139663162045]
["T","Acct 8943",18023.937649358435]
["T","Acct 1804",11937.654793067864]
["T","Acct 7464",11534.378379106869]
["T","Acct 2776",10598.165394744552]
["U","Acct 6175",94460.225887369714]
["U","Acct 3099",69380.535860821517]
["U","Acct 3368",50397.749597289985]
["U","Acct 4996",27407.916767624385]
["U","Acct 5124",20942.261918338823]
["U","Acct 1799",19966.876355848693]
["V","Acct 2893",90009.426074220391]
["V","Acct 6058",89086.219281350044]
["V","Acct 8919",80698.698876596623]
["V","Acct 3637",77526.661323302294]
["V","Acct 7968",76227.680486931786]
["V","Acct 6752",72064.545259473292]
["V","Acct 5203",69539.252716050803]
["V","Acct 4579",51261.581782236441]
["V","Acct 2607",44606.242804784924]
["V","Acct 6361",35569.629642003863]
["W","Acct 5113",84485.285822197315]
["W","Acct 3607",84196.837223824099]
["W","Acct 5655",83233.555443191712]
["W","Acct 5177",60065.297803779948]
["W","Acct 7776",56415.591684292442]
["W","Acct 8156",28647.069512270285]
["W","Acct 4708",22122.262555228601]
["W","Acct 1970",17766.844024179351]
["W","Acct 8513",13218.842175105949]
["X","Acct 1468",96875.666033515285]
["X","Acct 8421",91985.651518750223]
["X","Acct 5176",67364.968983625469]
["X","Acct 5243",39771.947012448916]
["Y","Acct 6120",67790.265221296489]
["Y","Acct 8634",54469.545793770703]
["Y","Acct 2377",36832.298898686]
["Y","Acct 2318",23587.42117057553]
["Y","Acct 5888",6870.4628633050379]
["Z","Acct 7408",99579.82654280118]
["Z","Acct 2468",82730.192313480526]
["Z","Acct 6122",80274.179806068685]
["Z","Acct 1782",35550.520792141171]
["Z","Acct 8453",24668.664993029066]
["Z","Acct 8259",17226.994831884102]
["Z","Acct 2300",15073.748208474048]
["Z","Acct 4734",14909.96885258835]
["Z","Acct 2666",12675.218539484102]

{"sheet":"Start","index":1,"n_rows":194,"n_cols":5,"rows_kept":194,"cut":false,"hidden":false,"merged":[]}
["Industry","Customer","Amount",null,"Alex asks:  is there a way to show the top 2 customers per industry?"]
["A","Acct 8375",59948.701198641109]
["A","Acct 1119",57571.432058516744]
["A","Acct 5201",51158.299885325156]
["A","Acct 4408",23608.901998540343]
["B","Acct 2516",99568.567525250037]
["B","Acct 3743",81646.665885651004]
["B","Acct 4045",79274.823478148726]
["B","Acct 7206",64366.495318589732]
["B","Acct 4007",52577.103164786662]
["B","Acct 3806",13796.142644822095]
["B","Acct 1910",12138.442495236857]
["B","Acct 7089",8774.8026805944846]
["C","Acct 4308",45239.218902719978]
["C","Acct 5600",25193.714664525236]
["C","Acct 6115",17495.623050845155]
["D","Acct 2337",98475.307688900779]
["D","Acct 8136",97846.31589242247]
["D","Acct 4816",26444.325750543539]
["E","Acct 3149",72092.199651957693]
["E","Acct 7662",65470.184284119059]
["E","Acct 4289",64944.26296356738]
["E","Acct 7792",62998.694120045839]
["E","Acct 5617",62734.08329937575]
["E","Acct 7210",50013.311746072031]
["E","Acct 4341",39233.444282046439]
["E","Acct 6062",29832.458673877827]
["E","Acct 1364",17251.793375353474]
["E","Acct 5119",10396.892563135962]
["F","Acct 3626",83709.062277228455]
["F","Acct 7853",67756.829240491483]
["F","Acct 6976",59664.026927225699]
["F","Acct 5891",48310.794809471889]
["F","Acct 7434",43426.488050126041]
["F","Acct 1805",20969.511691952881]
["F","Acct 3479",2233.0877044513641]
["G","Acct 4572",98032.383611700527]
["G","Acct 3463",78194.091269626821]
["G","Acct 4202",76665.750257587832]
["G","Acct 6885",56257.227525234288]
["G","Acct 6445",40864.926055360163]
["G","Acct 5336",6883.7709958614932]
["H","Acct 7000",95458.07830050755]
["H","Acct 3609",89821.418741519999]
["H","Acct 4633",89361.942591034429]
["H","Acct 3846",86798.501207525958]
["H","Acct 1067",43392.063969875504]
["H","Acct 5766",24277.339010315001]
["H","Acct 2003",20094.052456190082]
["H","Acct 6171",19433.15046207772]
["H","Acct 3929",7789.3703568382207]
["H","Acct 8365",3466.3045130392866]
["H","Acct 8318",1854.4621656475856]
["H","Acct 5742",68.401019163055736]
["I","Acct 2335",96986.478946464005]
["I","Acct 7761",94931.171086085713]
["I","Acct 7297",90699.261858278114]
["I","Acct 5300",87789.328269525518]
["I","Acct 3853",86204.595435424795]
["I","Acct 1079",74531.421535208792]
["I","Acct 4623",74069.427022633623]
["I","Acct 2401",66564.803428470259]
["I","Acct 5360",53569.205169452172]
["I","Acct 8371",23389.143038519091]
["I","Acct 2234",12050.678952141358]
["J","Acct 6172",93547.891564467995]
["J","Acct 4394",88084.334500708588]
["J","Acct 7933",87655.308899984651]
["J","Acct 7673",82293.104880033716]
["J","Acct 8868",81510.467506900051]
["J","Acct 1385",69549.267947399916]
["J","Acct 1353",64993.578410125861]
["J","Acct 3839",62790.980512658687]
["J","Acct 7937",37230.676759181959]
["J","Acct 3572",27859.12782444404]
["J","Acct 8285",16955.51182875994]
["J","Acct 4583",9687.6331415009954]
["K","Acct 7565",84888.3557188181]
["K","Acct 6510",70681.601631156314]
["K","Acct 6891",59407.130969918151]
["K","Acct 2455",56457.318323541193]
["K","Acct 5001",37382.501380440444]
["L","Acct 8898",98419.82694628532]
["L","Acct 8210",72573.353135136334]
["L","Acct 8361",57832.389120664964]
["L","Acct 8038",41764.529772309797]
["L","Acct 3155",33360.942138445571]
["L","Acct 5975",10963.989377962658]
["L","Acct 3693",5145.0679813428878]
["M","Acct 1839",93012.868685983034]
["M","Acct 8666",89585.223662240242]
["M","Acct 5486",83186.624258868935]
["M","Acct 7791",71962.025844609889]
["M","Acct 7844",70209.460628448345]
["M","Acct 3951",65416.931332410903]
["M","Acct 5535",59374.365818534447]
["M","Acct 5922",53247.285606027915]
["M","Acct 1928",53083.049022911968]
["M","Acct 1489",30363.21523896942]
["M","Acct 2671",19973.06971246413]
["M","Acct 8409",18684.296007320787]
["M","Acct 1029",12275.341687067708]
["M","Acct 5378",5989.472665921614]
["N","Acct 7568",75958.520399238434]
["N","Acct 1881",68036.179783628075]
["N","Acct 2572",35387.666055635462]
["N","Acct 6471",26247.804740380965]
["N","Acct 3287",16958.805359766848]
["N","Acct 5385",16270.326629001696]
["N","Acct 6968",3441.5438593462522]
["O","Acct 2274",98826.453609775665]
["O","Acct 4857",80257.656503568927]
["O","Acct 3449",42019.850448222431]
["O","Acct 8704",28612.064572513373]
["O","Acct 3511",28534.865024923994]
["P","Acct 7506",98371.957216768133]
["P","Acct 8246",85292.137879763279]
["P","Acct 7863",85194.239646258648]
["P","Acct 1457",81855.218059321414]
["P","Acct 2682",47153.535610922416]
["P","Acct 8012",42087.342515283024]
["P","Acct 2752",41447.981980571625]
["P","Acct 6769",37767.112763393619]
["P","Acct 3180",13917.201059140294]
["Q","Acct 3599",83535.147175419741]
["Q","Acct 1289",44824.408958438311]
["Q","Acct 3068",31145.337098534397]
["Q","Acct 1496",14932.955485635446]
["R","Acct 4164",88970.843076139776]
["R","Acct 7397",85708.50929882683]
["R","Acct 6023",74273.508848181009]
["R","Acct 4100",43672.911787917968]
["R","Acct 8152",36607.047572390074]
["R","Acct 7092",29185.529257034559]
["R","Acct 2588",25304.69252127334]
["R","Acct 4783",7744.3144514072856]
["S","Acct 2814",76834.025919695297]
["S","Acct 4150",56289.341835275176]
["S","Acct 8643",47809.554028744547]
["S","Acct 6269",41921.984416262072]
["S","Acct 1034",34929.233956985816]
["S","Acct 8653",30915.561620566979]
["S","Acct 1315",6428.7769890917998]
["T","Acct 2211",77993.273405303655]
["T","Acct 7416",52875.38074087417]
["T","Acct 4526",34201.873974298614]
["T","Acct 6104",34131.139663162045]
["T","Acct 8943",18023.937649358435]
["T","Acct 1804",11937.654793067864]
["T","Acct 7464",11534.378379106869]
["T","Acct 2776",10598.165394744552]
["U","Acct 6175",94460.225887369714]
["U","Acct 3099",69380.535860821517]
["U","Acct 3368",50397.749597289985]
["U","Acct 4996",27407.916767624385]
["U","Acct 5124",20942.261918338823]
["U","Acct 1799",19966.876355848693]
["V","Acct 2893",90009.426074220391]
["V","Acct 6058",89086.219281350044]
["V","Acct 8919",80698.698876596623]
["V","Acct 3637",77526.661323302294]
["V","Acct 7968",76227.680486931786]
["V","Acct 6752",72064.545259473292]
["V","Acct 5203",69539.252716050803]
["V","Acct 4579",51261.581782236441]
["V","Acct 2607",44606.242804784924]
["V","Acct 6361",35569.629642003863]
["W","Acct 5113",84485.285822197315]
["W","Acct 3607",84196.837223824099]
["W","Acct 5655",83233.555443191712]
["W","Acct 5177",60065.297803779948]
["W","Acct 7776",56415.591684292442]
["W","Acct 8156",28647.069512270285]
["W","Acct 4708",22122.262555228601]
["W","Acct 1970",17766.844024179351]
["W","Acct 8513",13218.842175105949]
["X","Acct 1468",96875.666033515285]
["X","Acct 8421",91985.651518750223]
["X","Acct 5176",67364.968983625469]
["X","Acct 5243",39771.947012448916]
["Y","Acct 6120",67790.265221296489]
["Y","Acct 8634",54469.545793770703]
["Y","Acct 2377",36832.298898686]
["Y","Acct 2318",23587.42117057553]
["Y","Acct 5888",6870.4628633050379]
["Z","Acct 7408",99579.82654280118]
["Z","Acct 2468",82730.192313480526]
["Z","Acct 6122",80274.179806068685]
["Z","Acct 1782",35550.520792141171]
["Z","Acct 8453",24668.664993029066]
["Z","Acct 8259",17226.994831884102]
["Z","Acct 2300",15073.748208474048]
["Z","Acct 4734",14909.96885258835]
["Z","Acct 2666",12675.218539484102]

{"sheet":"Mike","index":2,"n_rows":194,"n_cols":14,"rows_kept":194,"cut":false,"hidden":false,"merged":[]}
["Industry","Customer","Amount",null,"Alex asks:  is there a way to show the top 2 customers per industry?"]
["A","Acct 8375",59948.701198641109]
["A","Acct 1119",59948.701198641109,null,"Top",2]
["A","Acct 5201",51158.299885325156,null,"**For the formula to work, you must do two sorts: 1st sort Amount column Z to A; and 2nd sort Industry A to Z.\n****For formula that workd no matter what the sort see sheet (Mike(2)."]
["A","Acct 4408",23608.901998540343,null,"Industry/Customer","Customer 1","Customer 2","Customer 3"]
["B","Acct 2516",59948.701198641109,null,"A",{"$f":"IF(COLUMNS($F6:F6)>$F$3,\"\",INDEX($B$2:$B$194,SMALL(IF($A$2:$A$194=$E6,IF($C$2:$C$194>=LARGE(IF($A$2:$A$194=$E6,$C$2:$C$194),$F$3),ROW($B$2:$B$194)-ROW($B$2)+1)),COLUMNS($F6:F6))))","v":"Acct 8375"},{"$f":"IF(COLUMNS($F6:G6)>$F$3,\"\",INDEX($B$2:$B$194,SMALL(IF($A$2:$A$194=$E6,IF($C$2:$C$194>=LARGE(IF($A$2:$A$194=$E6,$C$2:$C$194),$F$3),ROW($B$2:$B$194)-ROW($B$2)+1)),COLUMNS($F6:G6))))","v":"Acct 1119"},{"$f":"IF(COLUMNS($F6:H6)>$F$3,\"\",INDEX($B$2:$B$194,SMALL(IF($A$2:$A$194=$E6,IF($C$2:$C$194>=LARGE(IF($A$2:$A$194=$E6,$C$2:$C$194),$F$3),ROW($B$2:$B$194)-ROW($B$2)+1)),COLUMNS($F6:H6))))","v":""},null,null,null,{"$f":"IF(COLUMNS($L6:L6)>$F$3,\"\",INDEX($B$2:$B$194,SMALL(IF($A$2:$A$194=$E6,IF($C$2:$C$194>=LARGE(IF($A$2:$A$194=$E6,$C$2:$C$194),$F$3),ROW($B$2:$B$194)-ROW($B$2)+1)),COLUMNS($L6:L6))))","v":"Acct 8375"},{"$f":"IF(COLUMNS($L6:M6)>$F$3,\"\",INDEX($B$2:$B$194,SMALL(IF($A$2:$A$194=$E6,IF($C$2:$C$194>=LARGE(IF($A$2:$A$194=$E6,$C$2:$C$194),$F$3),ROW($B$2:$B$194)-ROW($B$2)+1)),COLUMNS($L6:M6))))","v":"Acct 1119"},{"$f":"IF(COLUMNS($L6:N6)>$F$3,\"\",INDEX($B$2:$B$194,SMALL(IF($A$2:$A$194=$E6,IF($C$2:$C$194>=LARGE(IF($A$2:$A$194=$E6,$C$2:$C$194),$F$3),ROW($B$2:$B$194)-ROW($B$2)+1)),COLUMNS($L6:N6))))","v":""}]
["B","Acct 3743",59948.701198641109,null,"B",{"$f":"IF(COLUMNS($F7:F7)>$F$3,\"\",INDEX($B$2:$B$194,SMALL(IF($A$2:$A$194=$E7,IF($C$2:$C$194>=LARGE(IF($A$2:$A$194=$E7,$C$2:$C$194),$F$3),ROW($B$2:$B$194)-ROW($B$2)+1)),COLUMNS($F7:F7))))","v":"Acct 4045"},{"$f":"IF(COLUMNS($F7:G7)>$F$3,\"\",INDEX($B$2:$B$194,SMALL(IF($A$2:$A$194=$E7,IF($C$2:$C$194>=LARGE(IF($A$2:$A$194=$E7,$C$2:$C$194),$F$3),ROW($B$2:$B$194)-ROW($B$2)+1)),COLUMNS($F7:G7))))","v":"Acct 7206"},{"$f":"IF(COLUMNS($F7:H7)>$F$3,\"\",INDEX($B$2:$B$194,SMALL(IF($A$2:$A$194=$E7,IF($C$2:$C$194>=LARGE(IF($A$2:$A$194=$E7,$C$2:$C$194),$F$3),ROW($B$2:$B$194)-ROW($B$2)+1)),COLUMNS($F7:H7))))","v":""},null,null,null,{"$f":"IF(COLUMNS($L7:L7)>$F$3,\"\",INDEX($B$2:$B$194,SMALL(IF($A$2:$A$194=$E7,IF($C$2:$C$194>=LARGE(IF($A$2:$A$194=$E7,$C$2:$C$194),$F$3),ROW($B$2:$B$194)-ROW($B$2)+1)),COLUMNS($L7:L7))))","v":"Acct 4045"},{"$f":"IF(COLUMNS($L7:M7)>$F$3,\"\",INDEX($B$2:$B$194,SMALL(IF($A$2:$A$194=$E7,IF($C$2:$C$194>=LARGE(IF($A$2:$A$194=$E7,$C$2:$C$194),$F$3),ROW($B$2:$B$194)-ROW($B$2)+1)),COLUMNS($L7:M7))))","v":"Acct 7206"},{"$f":"IF(COLUMNS($L7:N7)>$F$3,\"\",INDEX($B$2:$B$194,SMALL(IF($A$2:$A$194=$E7,IF($C$2:$C$194>=LARGE(IF($A$2:$A$194=$E7,$C$2:$C$194),$F$3),ROW($B$2:$B$194)-ROW($B$2)+1)),COLUMNS($L7:N7))))","v":""}]
["B","Acct 4045",79274.823478148726,null,"C",{"$f":"IF(COLUMNS($F8:F8)>$F$3,\"\",INDEX($B$2:$B$194,SMALL(IF($A$2:$A$194=$E8,IF($C$2:$C$194>=LARGE(IF($A$2:$A$194=$E8,$C$2:$C$194),$F$3),ROW($B$2:$B$194)-ROW($B$2)+1)),COLUMNS($F8:F8))))","v":"Acct 4308"},{"$f":"IF(COLUMNS($F8:G8)>$F$3,\"\",INDEX($B$2:$B$194,SMALL(IF($A$2:$A$194=$E8,IF($C$2:$C$194>=LARGE(IF($A$2:$A$194=$E8,$C$2:$C$194),$F$3),ROW($B$2:$B$194)-ROW($B$2)+1)),COLUMNS($F8:G8))))","v":"Acct 5600"},{"$f":"IF(COLUMNS($F8:H8)>$F$3,\"\",INDEX($B$2:$B$194,SMALL(IF($A$2:$A$194=$E8,IF($C$2:$C$194>=LARGE(IF($A$2:$A$194=$E8,$C$2:$C$194),$F$3),ROW($B$2:$B$194)-ROW($B$2)+1)),COLUMNS($F8:H8))))","v":""},null,null,null,{"$f":"IF(COLUMNS($L8:L8)>$F$3,\"\",INDEX($B$2:$B$194,SMALL(IF($A$2:$A$194=$E8,IF($C$2:$C$194>=LARGE(IF($A$2:$A$194=$E8,$C$2:$C$194),$F$3),ROW($B$2:$B$194)-ROW($B$2)+1)),COLUMNS($L8:L8))))","v":"Acct 4308"},{"$f":"IF(COLUMNS($L8:M8)>$F$3,\"\",INDEX($B$2:$B$194,SMALL(IF($A$2:$A$194=$E8,IF($C$2:$C$194>=LARGE(IF($A$2:$A$194=$E8,$C$2:$C$194),$F$3),ROW($B$2:$B$194)-ROW($B$2)+1)),COLUMNS($L8:M8))))","v":"Acct 5600"},{"$f":"IF(COLUMNS($L8:N8)>$F$3,\"\",INDEX($B$2:$B$194,SMALL(IF($A$2:$A$194=$E8,IF($C$2:$C$194>=LARGE(IF($A$2:$A$194=$E8,$C$2:$C$194),$F$3),ROW($B$2:$B$194)-ROW($B$2)+1)),COLUMNS($L8:N8))))","v":""}]
["B","Acct 7206",64366.495318589732,null,"D",{"$f":"IF(COLUMNS($F9:F9)>$F$3,\"\",INDEX($B$2:$B$194,SMALL(IF($A$2:$A$194=$E9,IF($C$2:$C$194>=LARGE(IF($A$2:$A$194=$E9,$C$2:$C$194),$F$3),ROW($B$2:$B$194)-ROW($B$2)+1)),COLUMNS($F9:F9))))","v":"Acct 2337"},{"$f":"IF(COLUMNS($F9:G9)>$F$3,\"\",INDEX($B$2:$B$194,SMALL(IF($A$2:$A$194=$E9,IF($C$2:$C$194>=LARGE(IF($A$2:$A$194=$E9,$C$2:$C$194),$F$3),ROW($B$2:$B$194)-ROW($B$2)+1)),COLUMNS($F9:G9))))","v":"Acct 8136"},{"$f":"IF(COLUMNS($F9:H9)>$F$3,\"\",INDEX($B$2:$B$194,SMALL(IF($A$2:$A$194=$E9,IF($C$2:$C$194>=LARGE(IF($A$2:$A$194=$E9,$C$2:$C$194),$F$3),ROW($B$2:$B$194)-ROW($B$2)+1)),COLUMNS($F9:H9))))","v":""},null,null,null,{"$f":"IF(COLUMNS($L9:L9)>$F$3,\"\",INDEX($B$2:$B$194,SMALL(IF($A$2:$A$194=$E9,IF($C$2:$C$194>=LARGE(IF($A$2:$A$194=$E9,$C$2:$C$194),$F$3),ROW($B$2:$B$194)-ROW($B$2)+1)),COLUMNS($L9:L9))))","v":"Acct 2337"},{"$f":"IF(COLUMNS($L9:M9)>$F$3,\"\",INDEX($B$2:$B$194,SMALL(IF($A$2:$A$194=$E9,IF($C$2:$C$194>=LARGE(IF($A$2:$A$194=$E9,$C$2:$C$194),$F$3),ROW($B$2:$B$194)-ROW($B$2)+1)),COLUMNS($L9:M9))))","v":"Acct 8136"},{"$f":"IF(COLUMNS($L9:N9)>$F$3,\"\",INDEX($B$2:$B$194,SMALL(IF($A$2:$A$194=$E9,IF($C$2:$C$194>=LARGE(IF($A$2:$A$194=$E9,$C$2:$C$194),$F$3),ROW($B$2:$B$194)-ROW($B$2)+1)),COLUMNS($L9:N9))))","v":""}]
["B","Acct 4007",52577.103164786662,null,"E",{"$f":"IF(COLUMNS($F10:F10)>$F$3,\"\",INDEX($B$2:$B$194,SMALL(IF($A$2:$A$194=$E10,IF($C$2:$C$194>=LARGE(IF($A$2:$A$194=$E10,$C$2:$C$194),$F$3),ROW($B$2:$B$194)-ROW($B$2)+1)),COLUMNS($F10:F10))))","v":"Acct 3149"},{"$f":"IF(COLUMNS($F10:G10)>$F$3,\"\",INDEX($B$2:$B$194,SMALL(IF($A$2:$A$194=$E10,IF($C$2:$C$194>=LARGE(IF($A$2:$A$194=$E10,$C$2:$C$194),$F$3),ROW($B$2:$B$194)-ROW($B$2)+1)),COLUMNS($F10:G10))))","v":"Acct 7662"},{"$f":"IF(COLUMNS($F10:H10)>$F$3,\"\",INDEX($B$2:$B$194,SMALL(IF($A$2:$A$194=$E10,IF($C$2:$C$194>=LARGE(IF($A$2:$A$194=$E10,$C$2:$C$194),$F$3),ROW($B$2:$B$194)-ROW($B$2)+1)),COLUMNS($F10:H10))))","v":""},null,null,null,{"$f":"IF(COLUMNS($L10:L10)>$F$3,\"\",INDEX($B$2:$B$194,SMALL(IF($A$2:$A$194=$E10,IF($C$2:$C$194>=LARGE(IF($A$2:$A$194=$E10,$C$2:$C$194),$F$3),ROW($B$2:$B$194)-ROW($B$2)+1)),COLUMNS($L10:L10))))","v":"Acct 3149"},{"$f":"IF(COLUMNS($L10:M10)>$F$3,\"\",INDEX($B$2:$B$194,SMALL(IF($A$2:$A$194=$E10,IF($C$2:$C$194>=LARGE(IF($A$2:$A$194=$E10,$C$2:$C$194),$F$3),ROW($B$2:$B$194)-ROW($B$2)+1)),COLUMNS($L10:M10))))","v":"Acct 7662"},{"$f":"IF(COLUMNS($L10:N10)>$F$3,\"\",INDEX($B$2:$B$194,SMALL(IF($A$2:$A$194=$E10,IF($C$2:$C$194>=LARGE(IF($A$2:$A$194=$E10,$C$2:$C$194),$F$3),ROW($B$2:$B$194)-ROW($B$2)+1)),COLUMNS($L10:N10))))","v":""}]
["B","Acct 3806",13796.142644822095,null,"F",{"$f":"IF(COLUMNS($F11:F11)>$F$3,\"\",INDEX($B$2:$B$194,SMALL(IF($A$2:$A$194=$E11,IF($C$2:$C$194>=LARGE(IF($A$2:$A$194=$E11,$C$2:$C$194),$F$3),ROW($B$2:$B$194)-ROW($B$2)+1)),COLUMNS($F11:F11))))","v":"Acct 3626"},{"$f":"IF(COLUMNS($F11:G11)>$F$3,\"\",INDEX($B$2:$B$194,SMALL(IF($A$2:$A$194=$E11,IF($C$2:$C$194>=LARGE(IF($A$2:$A$194=$E11,$C$2:$C$194),$F$3),ROW($B$2:$B$194)-ROW($B$2)+1)),COLUMNS($F11:G11))))","v":"Acct 7853"},{"$f":"IF(COLUMNS($F11:H11)>$F$3,\"\",INDEX($B$2:$B$194,SMALL(IF($A$2:$A$194=$E11,IF($C$2:$C$194>=LARGE(IF($A$2:$A$194=$E11,$C$2:$C$194),$F$3),ROW($B$2:$B$194)-ROW($B$2)+1)),COLUMNS($F11:H11))))","v":""},null,null,null,{"$f":"IF(COLUMNS($L11:L11)>$F$3,\"\",INDEX($B$2:$B$194,SMALL(IF($A$2:$A$194=$E11,IF($C$2:$C$194>=LARGE(IF($A$2:$A$194=$E11,$C$2:$C$194),$F$3),ROW($B$2:$B$194)-ROW($B$2)+1)),COLUMNS($L11:L11))))","v":"Acct 3626"},{"$f":"IF(COLUMNS($L11:M11)>$F$3,\"\",INDEX($B$2:$B$194,SMALL(IF($A$2:$A$194=$E11,IF($C$2:$C$194>=LARGE(IF($A$2:$A$194=$E11,$C$2:$C$194),$F$3),ROW($B$2:$B$194)-ROW($B$2)+1)),COLUMNS($L11:M11))))","v":"Acct 7853"},{"$f":"IF(COLUMNS($L11:N11)>$F$3,\"\",INDEX($B$2:$B$194,SMALL(IF($A$2:$A$194=$E11,IF($C$2:$C$194>=LARGE(IF($A$2:$A$194=$E11,$C$2:$C$194),$F$3),ROW($B$2:$B$194)-ROW($B$2)+1)),COLUMNS($L11:N11))))","v":""}]
["B","Acct 1910",12138.442495236857,null,"G",{"$f":"IF(COLUMNS($F12:F12)>$F$3,\"\",INDEX($B$2:$B$194,SMALL(IF($A$2:$A$194=$E12,IF($C$2:$C$194>=LARGE(IF($A$2:$A$194=$E12,$C$2:$C$194),$F$3),ROW($B$2:$B$194)-ROW($B$2)+1)),COLUMNS($F12:F12))))","v":"Acct 4572"},{"$f":"IF(COLUMNS($F12:G12)>$F$3,\"\",INDEX($B$2:$B$194,SMALL(IF($A$2:$A$194=$E12,IF($C$2:$C$194>=LARGE(IF($A$2:$A$194=$E12,$C$2:$C$194),$F$3),ROW($B$2:$B$194)-ROW($B$2)+1)),COLUMNS($F12:G12))))","v":"Acct 3463"},{"$f":"IF(COLUMNS($F12:H12)>$F$3,\"\",INDEX($B$2:$B$194,SMALL(IF($A$2:$A$194=$E12,IF($C$2:$C$194>=LARGE(IF($A$2:$A$194=$E12,$C$2:$C$194),$F$3),ROW($B$2:$B$194)-ROW($B$2)+1)),COLUMNS($F12:H12))))","v":""},null,null,null,{"$f":"IF(COLUMNS($L12:L12)>$F$3,\"\",INDEX($B$2:$B$194,SMALL(IF($A$2:$A$194=$E12,IF($C$2:$C$194>=LARGE(IF($A$2:$A$194=$E12,$C$2:$C$194),$F$3),ROW($B$2:$B$194)-ROW($B$2)+1)),COLUMNS($L12:L12))))","v":"Acct 4572"},{"$f":"IF(COLUMNS($L12:M12)>$F$3,\"\",INDEX($B$2:$B$194,SMALL(IF($A$2:$A$194=$E12,IF($C$2:$C$194>=LARGE(IF($A$2:$A$194=$E12,$C$2:$C$194),$F$3),ROW($B$2:$B$194)-ROW($B$2)+1)),COLUMNS($L12:M12))))","v":"Acct 3463"},{"$f":"IF(COLUMNS($L12:N12)>$F$3,\"\",INDEX($B$2:$B$194,SMALL(IF($A$2:$A$194=$E12,IF($C$2:$C$194>=LARGE(IF($A$2:$A$194=$E12,$C$2:$C$194),$F$3),ROW($B$2:$B$194)-ROW($B$2)+1)),COLUMNS($L12:N12))))","v":""}]
["B","Acct 7089",8774.8026805944846,null,"H",{"$f":"IF(COLUMNS($F13:F13)>$F$3,\"\",INDEX($B$2:$B$194,SMALL(IF($A$2:$A$194=$E13,IF($C$2:$C$194>=LARGE(IF($A$2:$A$194=$E13,$C$2:$C$194),$F$3),ROW($B$2:$B$194)-ROW($B$2)+1)),COLUMNS($F13:F13))))","v":"Acct 7000"},{"$f":"IF(COLUMNS($F13:G13)>$F$3,\"\",INDEX($B$2:$B$194,SMALL(IF($A$2:$A$194=$E13,IF($C$2:$C$194>=LARGE(IF($A$2:$A$194=$E13,$C$2:$C$194),$F$3),ROW($B$2:$B$194)-ROW($B$2)+1)),COLUMNS($F13:G13))))","v":"Acct 3609"},{"$f":"IF(COLUMNS($F13:H13)>$F$3,\"\",INDEX($B$2:$B$194,SMALL(IF($A$2:$A$194=$E13,IF($C$2:$C$194>=LARGE(IF($A$2:$A$194=$E13,$C$2:$C$194),$F$3),ROW($B$2:$B$194)-ROW($B$2)+1)),COLUMNS($F13:H13))))","v":""},null,null,null,{"$f":"IF(COLUMNS($L13:L13)>$F$3,\"\",INDEX($B$2:$B$194,SMALL(IF($A$2:$A$194=$E13,IF($C$2:$C$194>=LARGE(IF($A$2:$A$194=$E13,$C$2:$C$194),$F$3),ROW($B$2:$B$194)-ROW($B$2)+1)),COLUMNS($L13:L13))))","v":"Acct 7000"},{"$f":"IF(COLUMNS($L13:M13)>$F$3,\"\",INDEX($B$2:$B$194,SMALL(IF($A$2:$A$194=$E13,IF($C$2:$C$194>=LARGE(IF($A$2:$A$194=$E13,$C$2:$C$194),$F$3),ROW($B$2:$B$194)-ROW($B$2)+1)),COLUMNS($L13:M13))))","v":"Acct 3609"},{"$f":"IF(COLUMNS($L13:N13)>$F$3,\"\",INDEX($B$2:$B$194,SMALL(IF($A$2:$A$194=$E13,IF($C$2:$C$194>=LARGE(IF($A$2:$A$194=$E13,$C$2:$C$194),$F$3),ROW($B$2:$B$194)-ROW($B$2)+1)),COLUMNS($L13:N13))))","v":""}]
["C","Acct 4308",45239.218902719978,null,"I",{"$f":"IF(COLUMNS($F14:F14)>$F$3,\"\",INDEX($B$2:$B$194,SMALL(IF($A$2:$A$194=$E14,IF($C$2:$C$194>=LARGE(IF($A$2:$A$194=$E14,$C$2:$C$194),$F$3),ROW($B$2:$B$194)-ROW($B$2)+1)),COLUMNS($F14:F14))))","v":"Acct 2335"},{"$f":"IF(COLUMNS($F14:G14)>$F$3,\"\",INDEX($B$2:$B$194,SMALL(IF($A$2:$A$194=$E14,IF($C$2:$C$194>=LARGE(IF($A$2:$A$194=$E14,$C$2:$C$194),$F$3),ROW($B$2:$B$194)-ROW($B$2)+1)),COLUMNS($F14:G14))))","v":"Acct 7761"},{"$f":"IF(COLUMNS($F14:H14)>$F$3,\"\",INDEX($B$2:$B$194,SMALL(IF($A$2:$A$194=$E14,IF($C$2:$C$194>=LARGE(IF($A$2:$A$194=$E14,$C$2:$C$194),$F$3),ROW($B$2:$B$194)-ROW($B$2)+1)),COLUMNS($F14:H14))))","v":""},null,null,null,{"$f":"IF(COLUMNS($L14:L14)>$F$3,\"\",INDEX($B$2:$B$194,SMALL(IF($A$2:$A$194=$E14,IF($C$2:$C$194>=LARGE(IF($A$2:$A$194=$E14,$C$2:$C$194),$F$3),ROW($B$2:$B$194)-ROW($B$2)+1)),COLUMNS($L14:L14))))","v":"Acct 2335"},{"$f":"IF(COLUMNS($L14:M14)>$F$3,\"\",INDEX($B$2:$B$194,SMALL(IF($A$2:$A$194=$E14,IF($C$2:$C$194>=LARGE(IF($A$2:$A$194=$E14,$C$2:$C$194),$F$3),ROW($B$2:$B$194)-ROW($B$2)+1)),COLUMNS($L14:M14))))","v":"Acct 7761"},{"$f":"IF(COLUMNS($L14:N14)>$F$3,\"\",INDEX($B$2:$B$194,SMALL(IF($A$2:$A$194=$E14,IF($C$2:$C$194>=LARGE(IF($A$2:$A$194=$E14,$C$2:$C$194),$F$3),ROW($B$2:$B$194)-ROW($B$2)+1)),COLUMNS($L14:N14))))","v":""}]
["C","Acct 5600",25193.714664525236,null,"J",{"$f":"IF(COLUMNS($F15:F15)>$F$3,\"\",INDEX($B$2:$B$194,SMALL(IF($A$2:$A$194=$E15,IF($C$2:$C$194>=LARGE(IF($A$2:$A$194=$E15,$C$2:$C$194),$F$3),ROW($B$2:$B$194)-ROW($B$2)+1)),COLUMNS($F15:F15))))","v":"Acct 6172"},{"$f":"IF(COLUMNS($F15:G15)>$F$3,\"\",INDEX($B$2:$B$194,SMALL(IF($A$2:$A$194=$E15,IF($C$2:$C$194>=LARGE(IF($A$2:$A$194=$E15,$C$2:$C$194),$F$3),ROW($B$2:$B$194)-ROW($B$2)+1)),COLUMNS($F15:G15))))","v":"Acct 4394"},{"$f":"IF(COLUMNS($F15:H15)>$F$3,\"\",INDEX($B$2:$B$194,SMALL(IF($A$2:$A$194=$E15,IF($C$2:$C$194>=LARGE(IF($A$2:$A$194=$E15,$C$2:$C$194),$F$3),ROW($B$2:$B$194)-ROW($B$2)+1)),COLUMNS($F15:H15))))","v":""},null,null,null,{"$f":"IF(COLUMNS($L15:L15)>$F$3,\"\",INDEX($B$2:$B$194,SMALL(IF($A$2:$A$194=$E15,IF($C$2:$C$194>=LARGE(IF($A$2:$A$194=$E15,$C$2:$C$194),$F$3),ROW($B$2:$B$194)-ROW($B$2)+1)),COLUMNS($L15:L15))))","v":"Acct 6172"},{"$f":"IF(COLUMNS($L15:M15)>$F$3,\"\",INDEX($B$2:$B$194,SMALL(IF($A$2:$A$194=$E15,IF($C$2:$C$194>=LARGE(IF($A$2:$A$194=$E15,$C$2:$C$194),$F$3),ROW($B$2:$B$194)-ROW($B$2)+1)),COLUMNS($L15:M15))))","v":"Acct 4394"},{"$f":"IF(COLUMNS($L15:N15)>$F$3,\"\",INDEX($B$2:$B$194,SMALL(IF($A$2:$A$194=$E15,IF($C$2:$C$194>=LARGE(IF($A$2:$A$194=$E15,$C$2:$C$194),$F$3),ROW($B$2:$B$194)-ROW($B$2)+1)),COLUMNS($L15:N15))))","v":""}]
["C","Acct 6115",17495.623050845155,null,"K",{"$f":"IF(COLUMNS($F16:F16)>$F$3,\"\",INDEX($B$2:$B$194,SMALL(IF($A$2:$A$194=$E16,IF($C$2:$C$194>=LARGE(IF($A$2:$A$194=$E16,$C$2:$C$194),$F$3),ROW($B$2:$B$194)-ROW($B$2)+1)),COLUMNS($F16:F16))))","v":"Acct 7565"},{"$f":"IF(COLUMNS($F16:G16)>$F$3,\"\",INDEX($B$2:$B$194,SMALL(IF($A$2:$A$194=$E16,IF($C$2:$C$194>=LARGE(IF($A$2:$A$194=$E16,$C$2:$C$194),$F$3),ROW($B$2:$B$194)-ROW($B$2)+1)),COLUMNS($F16:G16))))","v":"Acct 6510"},{"$f":"IF(COLUMNS($F16:H16)>$F$3,\"\",INDEX($B$2:$B$194,SMALL(IF($A$2:$A$194=$E16,IF($C$2:$C$194>=LARGE(IF($A$2:$A$194=$E16,$C$2:$C$194),$F$3),ROW($B$2:$B$194)-ROW($B$2)+1)),COLUMNS($F16:H16))))","v":""},null,null,null,{"$f":"IF(COLUMNS($L16:L16)>$F$3,\"\",INDEX($B$2:$B$194,SMALL(IF($A$2:$A$194=$E16,IF($C$2:$C$194>=LARGE(IF($A$2:$A$194=$E16,$C$2:$C$194),$F$3),ROW($B$2:$B$194)-ROW($B$2)+1)),COLUMNS($L16:L16))))","v":"Acct 7565"},{"$f":"IF(COLUMNS($L16:M16)>$F$3,\"\",INDEX($B$2:$B$194,SMALL(IF($A$2:$A$194=$E16,IF($C$2:$C$194>=LARGE(IF($A$2:$A$194=$E16,$C$2:$C$194),$F$3),ROW($B$2:$B$194)-ROW($B$2)+1)),COLUMNS($L16:M16))))","v":"Acct 6510"},{"$f":"IF(COLUMNS($L16:N16)>$F$3,\"\",INDEX($B$2:$B$194,SMALL(IF($A$2:$A$194=$E16,IF($C$2:$C$194>=LARGE(IF($A$2:$A$194=$E16,$C$2:$C$194),$F$3),ROW($B$2:$B$194)-ROW($B$2)+1)),COLUMNS($L16:N16))))","v":""}]
["D","Acct 2337",98475.307688900779,null,"L",{"$f":"IF(COLUMNS($F17:F17)>$F$3,\"\",INDEX($B$2:$B$194,SMALL(IF($A$2:$A$194=$E17,IF($C$2:$C$194>=LARGE(IF($A$2:$A$194=$E17,$C$2:$C$194),$F$3),ROW($B$2:$B$194)-ROW($B$2)+1)),COLUMNS($F17:F17))))","v":"Acct 8898"},{"$f":"IF(COLUMNS($F17:G17)>$F$3,\"\",INDEX($B$2:$B$194,SMALL(IF($A$2:$A$194=$E17,IF($C$2:$C$194>=LARGE(IF($A$2:$A$194=$E17,$C$2:$C$194),$F$3),ROW($B$2:$B$194)-ROW($B$2)+1)),COLUMNS($F17:G17))))","v":"Acct 8210"},{"$f":"IF(COLUMNS($F17:H17)>$F$3,\"\",INDEX($B$2:$B$194,SMALL(IF($A$2:$A$194=$E17,IF($C$2:$C$194>=LARGE(IF($A$2:$A$194=$E17,$C$2:$C$194),$F$3),ROW($B$2:$B$194)-ROW($B$2)+1)),COLUMNS($F17:H17))))","v":""},null,null,null,{"$f":"IF(COLUMNS($L17:L17)>$F$3,\"\",INDEX($B$2:$B$194,SMALL(IF($A$2:$A$194=$E17,IF($C$2:$C$194>=LARGE(IF($A$2:$A$194=$E17,$C$2:$C$194),$F$3),ROW($B$2:$B$194)-ROW($B$2)+1)),COLUMNS($L17:L17))))","v":"Acct 8898"},{"$f":"IF(COLUMNS($L17:M17)>$F$3,\"\",INDEX($B$2:$B$194,SMALL(IF($A$2:$A$194=$E17,IF($C$2:$C$194>=LARGE(IF($A$2:$A$194=$E17,$C$2:$C$194),$F$3),ROW($B$2:$B$194)-ROW($B$2)+1)),COLUMNS($L17:M17))))","v":"Acct 8210"},{"$f":"IF(COLUMNS($L17:N17)>$F$3,\"\",INDEX($B$2:$B$194,SMALL(IF($A$2:$A$194=$E17,IF($C$2:$C$194>=LARGE(IF($A$2:$A$194=$E17,$C$2:$C$194),$F$3),ROW($B$2:$B$194)-ROW($B$2)+1)),COLUMNS($L17:N17))))","v":""}]
["D","Acct 8136",97846.31589242247,null,"M",{"$f":"IF(COLUMNS($F18:F18)>$F$3,\"\",INDEX($B$2:$B$194,SMALL(IF($A$2:$A$194=$E18,IF($C$2:$C$194>=LARGE(IF($A$2:$A$194=$E18,$C$2:$C$194),$F$3),ROW($B$2:$B$194)-ROW($B$2)+1)),COLUMNS($F18:F18))))","v":"Acct 1839"},{"$f":"IF(COLUMNS($F18:G18)>$F$3,\"\",INDEX($B$2:$B$194,SMALL(IF($A$2:$A$194=$E18,IF($C$2:$C$194>=LARGE(IF($A$2:$A$194=$E18,$C$2:$C$194),$F$3),ROW($B$2:$B$194)-ROW($B$2)+1)),COLUMNS($F18:G18))))","v":"Acct 8666"},{"$f":"IF(COLUMNS($F18:H18)>$F$3,\"\",INDEX($B$2:$B$194,SMALL(IF($A$2:$A$194=$E18,IF($C$2:$C$194>=LARGE(IF($A$2:$A$194=$E18,$C$2:$C$194),$F$3),ROW($B$2:$B$194)-ROW($B$2)+1)),COLUMNS($F18:H18))))","v":""},null,null,null,{"$f":"IF(COLUMNS($L18:L18)>$F$3,\"\",INDEX($B$2:$B$194,SMALL(IF($A$2:$A$194=$E18,IF($C$2:$C$194>=LARGE(IF($A$2:$A$194=$E18,$C$2:$C$194),$F$3),ROW($B$2:$B$194)-ROW($B$2)+1)),COLUMNS($L18:L18))))","v":"Acct 1839"},{"$f":"IF(COLUMNS($L18:M18)>$F$3,\"\",INDEX($B$2:$B$194,SMALL(IF($A$2:$A$194=$E18,IF($C$2:$C$194>=LARGE(IF($A$2:$A$194=$E18,$C$2:$C$194),$F$3),ROW($B$2:$B$194)-ROW($B$2)+1)),COLUMNS($L18:M18))))","v":"Acct 8666"},{"$f":"IF(COLUMNS($L18:N18)>$F$3,\"\",INDEX($B$2:$B$194,SMALL(IF($A$2:$A$194=$E18,IF($C$2:$C$194>=LARGE(IF($A$2:$A$194=$E18,$C$2:$C$194),$F$3),ROW($B$2:$B$194)-ROW($B$2)+1)),COLUMNS($L18:N18))))","v":""}]
["D","Acct 4816",26444.325750543539,null,"N",{"$f":"IF(COLUMNS($F19:F19)>$F$3,\"\",INDEX($B$2:$B$194,SMALL(IF($A$2:$A$194=$E19,IF($C$2:$C$194>=LARGE(IF($A$2:$A$194=$E19,$C$2:$C$194),$F$3),ROW($B$2:$B$194)-ROW($B$2)+1)),COLUMNS($F19:F19))))","v":"Acct 7568"},{"$f":"IF(COLUMNS($F19:G19)>$F$3,\"\",INDEX($B$2:$B$194,SMALL(IF($A$2:$A$194=$E19,IF($C$2:$C$194>=LARGE(IF($A$2:$A$194=$E19,$C$2:$C$194),$F$3),ROW($B$2:$B$194)-ROW($B$2)+1)),COLUMNS($F19:G19))))","v":"Acct 1881"},{"$f":"IF(COLUMNS($F19:H19)>$F$3,\"\",INDEX($B$2:$B$194,SMALL(IF($A$2:$A$194=$E19,IF($C$2:$C$194>=LARGE(IF($A$2:$A$194=$E19,$C$2:$C$194),$F$3),ROW($B$2:$B$194)-ROW($B$2)+1)),COLUMNS($F19:H19))))","v":""},null,null,null,{"$f":"IF(COLUMNS($L19:L19)>$F$3,\"\",INDEX($B$2:$B$194,SMALL(IF($A$2:$A$194=$E19,IF($C$2:$C$194>=LARGE(IF($A$2:$A$194=$E19,$C$2:$C$194),$F$3),ROW($B$2:$B$194)-ROW($B$2)+1)),COLUMNS($L19:L19))))","v":"Acct 7568"},{"$f":"IF(COLUMNS($L19:M19)>$F$3,\"\",INDEX($B$2:$B$194,SMALL(IF($A$2:$A$194=$E19,IF($C$2:$C$194>=LARGE(IF($A$2:$A$194=$E19,$C$2:$C$194),$F$3),ROW($B$2:$B$194)-ROW($B$2)+1)),COLUMNS($L19:M19))))","v":"Acct 1881"},{"$f":"IF(COLUMNS($L19:N19)>$F$3,\"\",INDEX($B$2:$B$194,SMALL(IF($A$2:$A$194=$E19,IF($C$2:$C$194>=LARGE(IF($A$2:$A$194=$E19,$C$2:$C$194),$F$3),ROW($B$2:$B$194)-ROW($B$2)+1)),COLUMNS($L19:N19))))","v":""}]
["E","Acct 3149",72092.199651957693,null,"O",{"$f":"IF(COLUMNS($F20:F20)>$F$3,\"\",INDEX($B$2:$B$194,SMALL(IF($A$2:$A$194=$E20,IF($C$2:$C$194>=LARGE(IF($A$2:$A$194=$E20,$C$2:$C$194),$F$3),ROW($B$2:$B$194)-ROW($B$2)+1)),COLUMNS($F20:F20))))","v":"Acct 2274"},{"$f":"IF(COLUMNS($F20:G20)>$F$3,\"\",INDEX($B$2:$B$194,SMALL(IF($A$2:$A$194=$E20,IF($C$2:$C$194>=LARGE(IF($A$2:$A$194=$E20,$C$2:$C$194),$F$3),ROW($B$2:$B$194)-ROW($B$2)+1)),COLUMNS($F20:G20))))","v":"Acct 4857"},{"$f":"IF(COLUMNS($F20:H20)>$F$3,\"\",INDEX($B$2:$B$194,SMALL(IF($A$2:$A$194=$E20,IF($C$2:$C$194>=LARGE(IF($A$2:$A$194=$E20,$C$2:$C$194),$F$3),ROW($B$2:$B$194)-ROW($B$2)+1)),COLUMNS($F20:H20))))","v":""},null,null,null,{"$f":"IF(COLUMNS($L20:L20)>$F$3,\"\",INDEX($B$2:$B$194,SMALL(IF($A$2:$A$194=$E20,IF($C$2:$C$194>=LARGE(IF($A$2:$A$194=$E20,$C$2:$C$194),$F$3),ROW($B$2:$B$194)-ROW($B$2)+1)),COLUMNS($L20:L20))))","v":"Acct 2274"},{"$f":"IF(COLUMNS($L20:M20)>$F$3,\"\",INDEX($B$2:$B$194,SMALL(IF($A$2:$A$194=$E20,IF($C$2:$C$194>=LARGE(IF($A$2:$A$194=$E20,$C$2:$C$194),$F$3),ROW($B$2:$B$194)-ROW($B$2)+1)),COLUMNS($L20:M20))))","v":"Acct 4857"},{"$f":"IF(COLUMNS($L20:N20)>$F$3,\"\",INDEX($B$2:$B$194,SMALL(IF($A$2:$A$194=$E20,IF($C$2:$C$194>=LARGE(IF($A$2:$A$194=$E20,$C$2:$C$194),$F$3),ROW($B$2:$B$194)-ROW($B$2)+1)),COLUMNS($L20:N20))))","v":""}]
["E","Acct 7662",65470.184284119059,null,"P",{"$f":"IF(COLUMNS($F21:F21)>$F$3,\"\",INDEX($B$2:$B$194,SMALL(IF($A$2:$A$194=$E21,IF($C$2:$C$194>=LARGE(IF($A$2:$A$194=$E21,$C$2:$C$194),$F$3),ROW($B$2:$B$194)-ROW($B$2)+1)),COLUMNS($F21:F21))))","v":"Acct 7506"},{"$f":"IF(COLUMNS($F21:G21)>$F$3,\"\",INDEX($B$2:$B$194,SMALL(IF($A$2:$A$194=$E21,IF($C$2:$C$194>=LARGE(IF($A$2:$A$194=$E21,$C$2:$C$194),$F$3),ROW($B$2:$B$194)-ROW($B$2)+1)),COLUMNS($F21:G21))))","v":"Acct 8246"},{"$f":"IF(COLUMNS($F21:H21)>$F$3,\"\",INDEX($B$2:$B$194,SMALL(IF($A$2:$A$194=$E21,IF($C$2:$C$194>=LARGE(IF($A$2:$A$194=$E21,$C$2:$C$194),$F$3),ROW($B$2:$B$194)-ROW($B$2)+1)),COLUMNS($F21:H21))))","v":""},null,null,null,{"$f":"IF(COLUMNS($L21:L21)>$F$3,\"\",INDEX($B$2:$B$194,SMALL(IF($A$2:$A$194=$E21,IF($C$2:$C$194>=LARGE(IF($A$2:$A$194=$E21,$C$2:$C$194),$F$3),ROW($B$2:$B$194)-ROW($B$2)+1)),COLUMNS($L21:L21))))","v":"Acct 7506"},{"$f":"IF(COLUMNS($L21:M21)>$F$3,\"\",INDEX($B$2:$B$194,SMALL(IF($A$2:$A$194=$E21,IF($C$2:$C$194>=LARGE(IF($A$2:$A$194=$E21,$C$2:$C$194),$F$3),ROW($B$2:$B$194)-ROW($B$2)+1)),COLUMNS($L21:M21))))","v":"Acct 8246"},{"$f":"IF(COLUMNS($L21:N21)>$F$3,\"\",INDEX($B$2:$B$194,SMALL(IF($A$2:$A$194=$E21,IF($C$2:$C$194>=LARGE(IF($A$2:$A$194=$E21,$C$2:$C$194),$F$3),ROW($B$2:$B$194)-ROW($B$2)+1)),COLUMNS($L21:N21))))","v":""}]
["E","Acct 4289",64944.26296356738,null,"Q",{"$f":"IF(COLUMNS($F22:F22)>$F$3,\"\",INDEX($B$2:$B$194,SMALL(IF($A$2:$A$194=$E22,IF($C$2:$C$194>=LARGE(IF($A$2:$A$194=$E22,$C$2:$C$194),$F$3),ROW($B$2:$B$194)-ROW($B$2)+1)),COLUMNS($F22:F22))))","v":"Acct 3599"},{"$f":"IF(COLUMNS($F22:G22)>$F$3,\"\",INDEX($B$2:$B$194,SMALL(IF($A$2:$A$194=$E22,IF($C$2:$C$194>=LARGE(IF($A$2:$A$194=$E22,$C$2:$C$194),$F$3),ROW($B$2:$B$194)-ROW($B$2)+1)),COLUMNS($F22:G22))))","v":"Acct 1289"},{"$f":"IF(COLUMNS($F22:H22)>$F$3,\"\",INDEX($B$2:$B$194,SMALL(IF($A$2:$A$194=$E22,IF($C$2:$C$194>=LARGE(IF($A$2:$A$194=$E22,$C$2:$C$194),$F$3),ROW($B$2:$B$194)-ROW($B$2)+1)),COLUMNS($F22:H22))))","v":""},null,null,null,{"$f":"IF(COLUMNS($L22:L22)>$F$3,\"\",INDEX($B$2:$B$194,SMALL(IF($A$2:$A$194=$E22,IF($C$2:$C$194>=LARGE(IF($A$2:$A$194=$E22,$C$2:$C$194),$F$3),ROW($B$2:$B$194)-ROW($B$2)+1)),COLUMNS($L22:L22))))","v":"Acct 3599"},{"$f":"IF(COLUMNS($L22:M22)>$F$3,\"\",INDEX($B$2:$B$194,SMALL(IF($A$2:$A$194=$E22,IF($C$2:$C$194>=LARGE(IF($A$2:$A$194=$E22,$C$2:$C$194),$F$3),ROW($B$2:$B$194)-ROW($B$2)+1)),COLUMNS($L22:M22))))","v":"Acct 1289"},{"$f":"IF(COLUMNS($L22:N22)>$F$3,\"\",INDEX($B$2:$B$194,SMALL(IF($A$2:$A$194=$E22,IF($C$2:$C$194>=LARGE(IF($A$2:$A$194=$E22,$C$2:$C$194),$F$3),ROW($B$2:$B$194)-ROW($B$2)+1)),COLUMNS($L22:N22))))","v":""}]
["E","Acct 7792",62998.694120045839,null,"R",{"$f":"IF(COLUMNS($F23:F23)>$F$3,\"\",INDEX($B$2:$B$194,SMALL(IF($A$2:$A$194=$E23,IF($C$2:$C$194>=LARGE(IF($A$2:$A$194=$E23,$C$2:$C$194),$F$3),ROW($B$2:$B$194)-ROW($B$2)+1)),COLUMNS($F23:F23))))","v":"Acct 4164"},{"$f":"IF(COLUMNS($F23:G23)>$F$3,\"\",INDEX($B$2:$B$194,SMALL(IF($A$2:$A$194=$E23,IF($C$2:$C$194>=LARGE(IF($A$2:$A$194=$E23,$C$2:$C$194),$F$3),ROW($B$2:$B$194)-ROW($B$2)+1)),COLUMNS($F23:G23))))","v":"Acct 7397"},{"$f":"IF(COLUMNS($F23:H23)>$F$3,\"\",INDEX($B$2:$B$194,SMALL(IF($A$2:$A$194=$E23,IF($C$2:$C$194>=LARGE(IF($A$2:$A$194=$E23,$C$2:$C$194),$F$3),ROW($B$2:$B$194)-ROW($B$2)+1)),COLUMNS($F23:H23))))","v":""},null,null,null,{"$f":"IF(COLUMNS($L23:L23)>$F$3,\"\",INDEX($B$2:$B$194,SMALL(IF($A$2:$A$194=$E23,IF($C$2:$C$194>=LARGE(IF($A$2:$A$194=$E23,$C$2:$C$194),$F$3),ROW($B$2:$B$194)-ROW($B$2)+1)),COLUMNS($L23:L23))))","v":"Acct 4164"},{"$f":"IF(COLUMNS($L23:M23)>$F$3,\"\",INDEX($B$2:$B$194,SMALL(IF($A$2:$A$194=$E23,IF($C$2:$C$194>=LARGE(IF($A$2:$A$194=$E23,$C$2:$C$194),$F$3),ROW($B$2:$B$194)-ROW($B$2)+1)),COLUMNS($L23:M23))))","v":"Acct 7397"},{"$f":"IF(COLUMNS($L23:N23)>$F$3,\"\",INDEX($B$2:$B$194,SMALL(IF($A$2:$A$194=$E23,IF($C$2:$C$194>=LARGE(IF($A$2:$A$194=$E23,$C$2:$C$194),$F$3),ROW($B$2:$B$194)-ROW($B$2)+1)),COLUMNS($L23:N23))))","v":""}]
["E","Acct 5617",62734.08329937575,null,"S",{"$f":"IF(COLUMNS($F24:F24)>$F$3,\"\",INDEX($B$2:$B$194,SMALL(IF($A$2:$A$194=$E24,IF($C$2:$C$194>=LARGE(IF($A$2:$A$194=$E24,$C$2:$C$194),$F$3),ROW($B$2:$B$194)-ROW($B$2)+1)),COLUMNS($F24:F24))))","v":"Acct 2814"},{"$f":"IF(COLUMNS($F24:G24)>$F$3,\"\",INDEX($B$2:$B$194,SMALL(IF($A$2:$A$194=$E24,IF($C$2:$C$194>=LARGE(IF($A$2:$A$194=$E24,$C$2:$C$194),$F$3),ROW($B$2:$B$194)-ROW($B$2)+1)),COLUMNS($F24:G24))))","v":"Acct 4150"},{"$f":"IF(COLUMNS($F24:H24)>$F$3,\"\",INDEX($B$2:$B$194,SMALL(IF($A$2:$A$194=$E24,IF($C$2:$C$194>=LARGE(IF($A$2:$A$194=$E24,$C$2:$C$194),$F$3),ROW($B$2:$B$194)-ROW($B$2)+1)),COLUMNS($F24:H24))))","v":""},null,null,null,{"$f":"IF(COLUMNS($L24:L24)>$F$3,\"\",INDEX($B$2:$B$194,SMALL(IF($A$2:$A$194=$E24,IF($C$2:$C$194>=LARGE(IF($A$2:$A$194=$E24,$C$2:$C$194),$F$3),ROW($B$2:$B$194)-ROW($B$2)+1)),COLUMNS($L24:L24))))","v":"Acct 2814"},{"$f":"IF(COLUMNS($L24:M24)>$F$3,\"\",INDEX($B$2:$B$194,SMALL(IF($A$2:$A$194=$E24,IF($C$2:$C$194>=LARGE(IF($A$2:$A$194=$E24,$C$2:$C$194),$F$3),ROW($B$2:$B$194)-ROW($B$2)+1)),COLUMNS($L24:M24))))","v":"Acct 4150"},{"$f":"IF(COLUMNS($L24:N24)>$F$3,\"\",INDEX($B$2:$B$194,SMALL(IF($A$2:$A$194=$E24,IF($C$2:$C$194>=LARGE(IF($A$2:$A$194=$E24,$C$2:$C$194),$F$3),ROW($B$2:$B$194)-ROW($B$2)+1)),COLUMNS($L24:N24))))","v":""}]
["E","Acct 7210",50013.311746072031,null,"T",{"$f":"IF(COLUMNS($F25:F25)>$F$3,\"\",INDEX($B$2:$B$194,SMALL(IF($A$2:$A$194=$E25,IF($C$2:$C$194>=LARGE(IF($A$2:$A$194=$E25,$C$2:$C$194),$F$3),ROW($B$2:$B$194)-ROW($B$2)+1)),COLUMNS($F25:F25))))","v":"Acct 2211"},{"$f":"IF(COLUMNS($F25:G25)>$F$3,\"\",INDEX($B$2:$B$194,SMALL(IF($A$2:$A$194=$E25,IF($C$2:$C$194>=LARGE(IF($A$2:$A$194=$E25,$C$2:$C$194),$F$3),ROW($B$2:$B$194)-ROW($B$2)+1)),COLUMNS($F25:G25))))","v":"Acct 7416"},{"$f":"IF(COLUMNS($F25:H25)>$F$3,\"\",INDEX($B$2:$B$194,SMALL(IF($A$2:$A$194=$E25,IF($C$2:$C$194>=LARGE(IF($A$2:$A$194=$E25,$C$2:$C$194),$F$3),ROW($B$2:$B$194)-ROW($B$2)+1)),COLUMNS($F25:H25))))","v":""},null,null,null,{"$f":"IF(COLUMNS($L25:L25)>$F$3,\"\",INDEX($B$2:$B$194,SMALL(IF($A$2:$A$194=$E25,IF($C$2:$C$194>=LARGE(IF($A$2:$A$194=$E25,$C$2:$C$194),$F$3),ROW($B$2:$B$194)-ROW($B$2)+1)),COLUMNS($L25:L25))))","v":"Acct 2211"},{"$f":"IF(COLUMNS($L25:M25)>$F$3,\"\",INDEX($B$2:$B$194,SMALL(IF($A$2:$A$194=$E25,IF($C$2:$C$194>=LARGE(IF($A$2:$A$194=$E25,$C$2:$C$194),$F$3),ROW($B$2:$B$194)-ROW($B$2)+1)),COLUMNS($L25:M25))))","v":"Acct 7416"},{"$f":"IF(COLUMNS($L25:N25)>$F$3,\"\",INDEX($B$2:$B$194,SMALL(IF($A$2:$A$194=$E25,IF($C$2:$C$194>=LARGE(IF($A$2:$A$194=$E25,$C$2:$C$194),$F$3),ROW($B$2:$B$194)-ROW($B$2)+1)),COLUMNS($L25:N25))))","v":""}]
["E","Acct 4341",39233.444282046439,null,"U",{"$f":"IF(COLUMNS($F26:F26)>$F$3,\"\",INDEX($B$2:$B$194,SMALL(IF($A$2:$A$194=$E26,IF($C$2:$C$194>=LARGE(IF($A$2:$A$194=$E26,$C$2:$C$194),$F$3),ROW($B$2:$B$194)-ROW($B$2)+1)),COLUMNS($F26:F26))))","v":"Acct 6175"},{"$f":"IF(COLUMNS($F26:G26)>$F$3,\"\",INDEX($B$2:$B$194,SMALL(IF($A$2:$A$194=$E26,IF($C$2:$C$194>=LARGE(IF($A$2:$A$194=$E26,$C$2:$C$194),$F$3),ROW($B$2:$B$194)-ROW($B$2)+1)),COLUMNS($F26:G26))))","v":"Acct 3099"},{"$f":"IF(COLUMNS($F26:H26)>$F$3,\"\",INDEX($B$2:$B$194,SMALL(IF($A$2:$A$194=$E26,IF($C$2:$C$194>=LARGE(IF($A$2:$A$194=$E26,$C$2:$C$194),$F$3),ROW($B$2:$B$194)-ROW($B$2)+1)),COLUMNS($F26:H26))))","v":""},null,null,null,{"$f":"IF(COLUMNS($L26:L26)>$F$3,\"\",INDEX($B$2:$B$194,SMALL(IF($A$2:$A$194=$E26,IF($C$2:$C$194>=LARGE(IF($A$2:$A$194=$E26,$C$2:$C$194),$F$3),ROW($B$2:$B$194)-ROW($B$2)+1)),COLUMNS($L26:L26))))","v":"Acct 6175"},{"$f":"IF(COLUMNS($L26:M26)>$F$3,\"\",INDEX($B$2:$B$194,SMALL(IF($A$2:$A$194=$E26,IF($C$2:$C$194>=LARGE(IF($A$2:$A$194=$E26,$C$2:$C$194),$F$3),ROW($B$2:$B$194)-ROW($B$2)+1)),COLUMNS($L26:M26))))","v":"Acct 3099"},{"$f":"IF(COLUMNS($L26:N26)>$F$3,\"\",INDEX($B$2:$B$194,SMALL(IF($A$2:$A$194=$E26,IF($C$2:$C$194>=LARGE(IF($A$2:$A$194=$E26,$C$2:$C$194),$F$3),ROW($B$2:$B$194)-ROW($B$2)+1)),COLUMNS($L26:N26))))","v":""}]
["E","Acct 6062",29832.458673877827,null,"V",{"$f":"IF(COLUMNS($F27:F27)>$F$3,\"\",INDEX($B$2:$B$194,SMALL(IF($A$2:$A$194=$E27,IF($C$2:$C$194>=LARGE(IF($A$2:$A$194=$E27,$C$2:$C$194),$F$3),ROW($B$2:$B$194)-ROW($B$2)+1)),COLUMNS($F27:F27))))","v":"Acct 2893"},{"$f":"IF(COLUMNS($F27:G27)>$F$3,\"\",INDEX($B$2:$B$194,SMALL(IF($A$2:$A$194=$E27,IF($C$2:$C$194>=LARGE(IF($A$2:$A$194=$E27,$C$2:$C$194),$F$3),ROW($B$2:$B$194)-ROW($B$2)+1)),COLUMNS($F27:G27))))","v":"Acct 6058"},{"$f":"IF(COLUMNS($F27:H27)>$F$3,\"\",INDEX($B$2:$B$194,SMALL(IF($A$2:$A$194=$E27,IF($C$2:$C$194>=LARGE(IF($A$2:$A$194=$E27,$C$2:$C$194),$F$3),ROW($B$2:$B$194)-ROW($B$2)+1)),COLUMNS($F27:H27))))","v":""},null,null,null,{"$f":"IF(COLUMNS($L27:L27)>$F$3,\"\",INDEX($B$2:$B$194,SMALL(IF($A$2:$A$194=$E27,IF($C$2:$C$194>=LARGE(IF($A$2:$A$194=$E27,$C$2:$C$194),$F$3),ROW($B$2:$B$194)-ROW($B$2)+1)),COLUMNS($L27:L27))))","v":"Acct 2893"},{"$f":"IF(COLUMNS($L27:M27)>$F$3,\"\",INDEX($B$2:$B$194,SMALL(IF($A$2:$A$194=$E27,IF($C$2:$C$194>=LARGE(IF($A$2:$A$194=$E27,$C$2:$C$194),$F$3),ROW($B$2:$B$194)-ROW($B$2)+1)),COLUMNS($L27:M27))))","v":"Acct 6058"},{"$f":"IF(COLUMNS($L27:N27)>$F$3,\"\",INDEX($B$2:$B$194,SMALL(IF($A$2:$A$194=$E27,IF($C$2:$C$194>=LARGE(IF($A$2:$A$194=$E27,$C$2:$C$194),$F$3),ROW($B$2:$B$194)-ROW($B$2)+1)),COLUMNS($L27:N27))))","v":""}]
["E","Acct 1364",17251.793375353474,null,"W",{"$f":"IF(COLUMNS($F28:F28)>$F$3,\"\",INDEX($B$2:$B$194,SMALL(IF($A$2:$A$194=$E28,IF($C$2:$C$194>=LARGE(IF($A$2:$A$194=$E28,$C$2:$C$194),$F$3),ROW($B$2:$B$194)-ROW($B$2)+1)),COLUMNS($F28:F28))))","v":"Acct 5113"},{"$f":"IF(COLUMNS($F28:G28)>$F$3,\"\",INDEX($B$2:$B$194,SMALL(IF($A$2:$A$194=$E28,IF($C$2:$C$194>=LARGE(IF($A$2:$A$194=$E28,$C$2:$C$194),$F$3),ROW($B$2:$B$194)-ROW($B$2)+1)),COLUMNS($F28:G28))))","v":"Acct 3607"},{"$f":"IF(COLUMNS($F28:H28)>$F$3,\"\",INDEX($B$2:$B$194,SMALL(IF($A$2:$A$194=$E28,IF($C$2:$C$194>=LARGE(IF($A$2:$A$194=$E28,$C$2:$C$194),$F$3),ROW($B$2:$B$194)-ROW($B$2)+1)),COLUMNS($F28:H28))))","v":""},null,null,null,{"$f":"IF(COLUMNS($L28:L28)>$F$3,\"\",INDEX($B$2:$B$194,SMALL(IF($A$2:$A$194=$E28,IF($C$2:$C$194>=LARGE(IF($A$2:$A$194=$E28,$C$2:$C$194),$F$3),ROW($B$2:$B$194)-ROW($B$2)+1)),COLUMNS($L28:L28))))","v":"Acct 5113"},{"$f":"IF(COLUMNS($L28:M28)>$F$3,\"\",INDEX($B$2:$B$194,SMALL(IF($A$2:$A$194=$E28,IF($C$2:$C$194>=LARGE(IF($A$2:$A$194=$E28,$C$2:$C$194),$F$3),ROW($B$2:$B$194)-ROW($B$2)+1)),COLUMNS($L28:M28))))","v":"Acct 3607"},{"$f":"IF(COLUMNS($L28:N28)>$F$3,\"\",INDEX($B$2:$B$194,SMALL(IF($A$2:$A$194=$E28,IF($C$2:$C$194>=LARGE(IF($A$2:$A$194=$E28,$C$2:$C$194),$F$3),ROW($B$2:$B$194)-ROW($B$2)+1)),COLUMNS($L28:N28))))","v":""}]
["E","Acct 5119",10396.892563135962,null,"X",{"$f":"IF(COLUMNS($F29:F29)>$F$3,\"\",INDEX($B$2:$B$194,SMALL(IF($A$2:$A$194=$E29,IF($C$2:$C$194>=LARGE(IF($A$2:$A$194=$E29,$C$2:$C$194),$F$3),ROW($B$2:$B$194)-ROW($B$2)+1)),COLUMNS($F29:F29))))","v":"Acct 1468"},{"$f":"IF(COLUMNS($F29:G29)>$F$3,\"\",INDEX($B$2:$B$194,SMALL(IF($A$2:$A$194=$E29,IF($C$2:$C$194>=LARGE(IF($A$2:$A$194=$E29,$C$2:$C$194),$F$3),ROW($B$2:$B$194)-ROW($B$2)+1)),COLUMNS($F29:G29))))","v":"Acct 8421"},{"$f":"IF(COLUMNS($F29:H29)>$F$3,\"\",INDEX($B$2:$B$194,SMALL(IF($A$2:$A$194=$E29,IF($C$2:$C$194>=LARGE(IF($A$2:$A$194=$E29,$C$2:$C$194),$F$3),ROW($B$2:$B$194)-ROW($B$2)+1)),COLUMNS($F29:H29))))","v":""},null,null,null,{"$f":"IF(COLUMNS($L29:L29)>$F$3,\"\",INDEX($B$2:$B$194,SMALL(IF($A$2:$A$194=$E29,IF($C$2:$C$194>=LARGE(IF($A$2:$A$194=$E29,$C$2:$C$194),$F$3),ROW($B$2:$B$194)-ROW($B$2)+1)),COLUMNS($L29:L29))))","v":"Acct 1468"},{"$f":"IF(COLUMNS($L29:M29)>$F$3,\"\",INDEX($B$2:$B$194,SMALL(IF($A$2:$A$194=$E29,IF($C$2:$C$194>=LARGE(IF($A$2:$A$194=$E29,$C$2:$C$194),$F$3),ROW($B$2:$B$194)-ROW($B$2)+1)),COLUMNS($L29:M29))))","v":"Acct 8421"},{"$f":"IF(COLUMNS($L29:N29)>$F$3,\"\",INDEX($B$2:$B$194,SMALL(IF($A$2:$A$194=$E29,IF($C$2:$C$194>=LARGE(IF($A$2:$A$194=$E29,$C$2:$C$194),$F$3),ROW($B$2:$B$194)-ROW($B$2)+1)),COLUMNS($L29:N29))))","v":""}]
["F","Acct 3626",83709.062277228455,null,"Y",{"$f":"IF(COLUMNS($F30:F30)>$F$3,\"\",INDEX($B$2:$B$194,SMALL(IF($A$2:$A$194=$E30,IF($C$2:$C$194>=LARGE(IF($A$2:$A$194=$E30,$C$2:$C$194),$F$3),ROW($B$2:$B$194)-ROW($B$2)+1)),COLUMNS($F30:F30))))","v":"Acct 6120"},{"$f":"IF(COLUMNS($F30:G30)>$F$3,\"\",INDEX($B$2:$B$194,SMALL(IF($A$2:$A$194=$E30,IF($C$2:$C$194>=LARGE(IF($A$2:$A$194=$E30,$C$2:$C$194),$F$3),ROW($B$2:$B$194)-ROW($B$2)+1)),COLUMNS($F30:G30))))","v":"Acct 8634"},{"$f":"IF(COLUMNS($F30:H30)>$F$3,\"\",INDEX($B$2:$B$194,SMALL(IF($A$2:$A$194=$E30,IF($C$2:$C$194>=LARGE(IF($A$2:$A$194=$E30,$C$2:$C$194),$F$3),ROW($B$2:$B$194)-ROW($B$2)+1)),COLUMNS($F30:H30))))","v":""},null,null,null,{"$f":"IF(COLUMNS($L30:L30)>$F$3,\"\",INDEX($B$2:$B$194,SMALL(IF($A$2:$A$194=$E30,IF($C$2:$C$194>=LARGE(IF($A$2:$A$194=$E30,$C$2:$C$194),$F$3),ROW($B$2:$B$194)-ROW($B$2)+1)),COLUMNS($L30:L30))))","v":"Acct 6120"},{"$f":"IF(COLUMNS($L30:M30)>$F$3,\"\",INDEX($B$2:$B$194,SMALL(IF($A$2:$A$194=$E30,IF($C$2:$C$194>=LARGE(IF($A$2:$A$194=$E30,$C$2:$C$194),$F$3),ROW($B$2:$B$194)-ROW($B$2)+1)),COLUMNS($L30:M30))))","v":"Acct 8634"},{"$f":"IF(COLUMNS($L30:N30)>$F$3,\"\",INDEX($B$2:$B$194,SMALL(IF($A$2:$A$194=$E30,IF($C$2:$C$194>=LARGE(IF($A$2:$A$194=$E30,$C$2:$C$194),$F$3),ROW($B$2:$B$194)-ROW($B$2)+1)),COLUMNS($L30:N30))))","v":""}]
["F","Acct 7853",67756.829240491483,null,"Z",{"$f":"IF(COLUMNS($F31:F31)>$F$3,\"\",INDEX($B$2:$B$194,SMALL(IF($A$2:$A$194=$E31,IF($C$2:$C$194>=LARGE(IF($A$2:$A$194=$E31,$C$2:$C$194),$F$3),ROW($B$2:$B$194)-ROW($B$2)+1)),COLUMNS($F31:F31))))","v":"Acct 7408"},{"$f":"IF(COLUMNS($F31:G31)>$F$3,\"\",INDEX($B$2:$B$194,SMALL(IF($A$2:$A$194=$E31,IF($C$2:$C$194>=LARGE(IF($A$2:$A$194=$E31,$C$2:$C$194),$F$3),ROW($B$2:$B$194)-ROW($B$2)+1)),COLUMNS($F31:G31))))","v":"Acct 2468"},{"$f":"IF(COLUMNS($F31:H31)>$F$3,\"\",INDEX($B$2:$B$194,SMALL(IF($A$2:$A$194=$E31,IF($C$2:$C$194>=LARGE(IF($A$2:$A$194=$E31,$C$2:$C$194),$F$3),ROW($B$2:$B$194)-ROW($B$2)+1)),COLUMNS($F31:H31))))","v":""},null,null,null,{"$f":"IF(COLUMNS($L31:L31)>$F$3,\"\",INDEX($B$2:$B$194,SMALL(IF($A$2:$A$194=$E31,IF($C$2:$C$194>=LARGE(IF($A$2:$A$194=$E31,$C$2:$C$194),$F$3),ROW($B$2:$B$194)-ROW($B$2)+1)),COLUMNS($L31:L31))))","v":"Acct 7408"},{"$f":"IF(COLUMNS($L31:M31)>$F$3,\"\",INDEX($B$2:$B$194,SMALL(IF($A$2:$A$194=$E31,IF($C$2:$C$194>=LARGE(IF($A$2:$A$194=$E31,$C$2:$C$194),$F$3),ROW($B$2:$B$194)-ROW($B$2)+1)),COLUMNS($L31:M31))))","v":"Acct 2468"},{"$f":"IF(COLUMNS($L31:N31)>$F$3,\"\",INDEX($B$2:$B$194,SMALL(IF($A$2:$A$194=$E31,IF($C$2:$C$194>=LARGE(IF($A$2:$A$194=$E31,$C$2:$C$194),$F$3),ROW($B$2:$B$194)-ROW($B$2)+1)),COLUMNS($L31:N31))))","v":""}]
["F","Acct 6976",59664.026927225699]
["F","Acct 5891",48310.794809471889]
["F","Acct 7434",43426.488050126041]
["F","Acct 1805",20969.511691952881]
["F","Acct 3479",2233.0877044513641]
["G","Acct 4572",98032.383611700527]
["G","Acct 3463",78194.091269626821]
["G","Acct 4202",76665.750257587832]
["G","Acct 6885",56257.227525234288]
["G","Acct 6445",40864.926055360163]
["G","Acct 5336",6883.7709958614932]
["H","Acct 7000",95458.07830050755]
["H","Acct 3609",89821.418741519999]
["H","Acct 4633",89361.942591034429]
["H","Acct 3846",86798.501207525958]
["H","Acct 1067",43392.063969875504]
["H","Acct 5766",24277.339010315001]
["H","Acct 2003",20094.052456190082]
["H","Acct 6171",19433.15046207772]
["H","Acct 3929",7789.3703568382207]
["H","Acct 8365",3466.3045130392866]
["H","Acct 8318",1854.4621656475856]
["H","Acct 5742",68.401019163055736]
["I","Acct 2335",96986.478946464005]
["I","Acct 7761",94931.171086085713]
["I","Acct 7297",90699.261858278114]
["I","Acct 5300",87789.328269525518]
["I","Acct 3853",86204.595435424795]
["I","Acct 1079",74531.421535208792]
["I","Acct 4623",74069.427022633623]
["I","Acct 2401",66564.803428470259]
["I","Acct 5360",53569.205169452172]
["I","Acct 8371",23389.143038519091]
["I","Acct 2234",12050.678952141358]
["J","Acct 6172",93547.891564467995]
["J","Acct 4394",88084.334500708588]
["J","Acct 7933",87655.308899984651]
["J","Acct 7673",82293.104880033716]
["J","Acct 8868",81510.467506900051]
["J","Acct 1385",69549.267947399916]
["J","Acct 1353",64993.578410125861]
["J","Acct 3839",62790.980512658687]
["J","Acct 7937",37230.676759181959]
["J","Acct 3572",27859.12782444404]
["J","Acct 8285",16955.51182875994]
["J","Acct 4583",9687.6331415009954]
["K","Acct 7565",84888.3557188181]
["K","Acct 6510",70681.601631156314]
["K","Acct 6891",59407.130969918151]
["K","Acct 2455",56457.318323541193]
["K","Acct 5001",37382.501380440444]
["L","Acct 8898",98419.82694628532]
["L","Acct 8210",72573.353135136334]
["L","Acct 8361",57832.389120664964]
["L","Acct 8038",41764.529772309797]
["L","Acct 3155",33360.942138445571]
["L","Acct 5975",10963.989377962658]
["L","Acct 3693",5145.0679813428878]
["M","Acct 1839",93012.868685983034]
["M","Acct 8666",89585.223662240242]
["M","Acct 5486",83186.624258868935]
["M","Acct 7791",71962.025844609889]
["M","Acct 7844",70209.460628448345]
["M","Acct 3951",65416.931332410903]
["M","Acct 5535",59374.365818534447]
["M","Acct 5922",53247.285606027915]
["M","Acct 1928",53083.049022911968]
["M","Acct 1489",30363.21523896942]
["M","Acct 2671",19973.06971246413]
["M","Acct 8409",18684.296007320787]
["M","Acct 1029",12275.341687067708]
["M","Acct 5378",5989.472665921614]
["N","Acct 7568",75958.520399238434]
["N","Acct 1881",68036.179783628075]
["N","Acct 2572",35387.666055635462]
["N","Acct 6471",26247.804740380965]
["N","Acct 3287",16958.805359766848]
["N","Acct 5385",16270.326629001696]
["N","Acct 6968",3441.5438593462522]
["O","Acct 2274",98826.453609775665]
["O","Acct 4857",80257.656503568927]
["O","Acct 3449",42019.850448222431]
["O","Acct 8704",28612.064572513373]
["O","Acct 3511",28534.865024923994]
["P","Acct 7506",98371.957216768133]
["P","Acct 8246",85292.137879763279]
["P","Acct 7863",85194.239646258648]
["P","Acct 1457",81855.218059321414]
["P","Acct 2682",47153.535610922416]
["P","Acct 8012",42087.342515283024]
["P","Acct 2752",41447.981980571625]
["P","Acct 6769",37767.112763393619]
["P","Acct 3180",13917.201059140294]
["Q","Acct 3599",83535.147175419741]
["Q","Acct 1289",44824.408958438311]
["Q","Acct 3068",31145.337098534397]
["Q","Acct 1496",14932.955485635446]
["R","Acct 4164",88970.843076139776]
["R","Acct 7397",85708.50929882683]
["R","Acct 6023",74273.508848181009]
["R","Acct 4100",43672.911787917968]
["R","Acct 8152",36607.047572390074]
["R","Acct 7092",29185.529257034559]
["R","Acct 2588",25304.69252127334]
["R","Acct 4783",7744.3144514072856]
["S","Acct 2814",76834.025919695297]
["S","Acct 4150",56289.341835275176]
["S","Acct 8643",47809.554028744547]
["S","Acct 6269",41921.984416262072]
["S","Acct 1034",34929.233956985816]
["S","Acct 8653",30915.561620566979]
["S","Acct 1315",6428.7769890917998]
["T","Acct 2211",77993.273405303655]
["T","Acct 7416",52875.38074087417]
["T","Acct 4526",34201.873974298614]
["T","Acct 6104",34131.139663162045]
["T","Acct 8943",18023.937649358435]
["T","Acct 1804",11937.654793067864]
["T","Acct 7464",11534.378379106869]
["T","Acct 2776",10598.165394744552]
["U","Acct 6175",94460.225887369714]
["U","Acct 3099",69380.535860821517]
["U","Acct 3368",50397.749597289985]
["U","Acct 4996",27407.916767624385]
["U","Acct 5124",20942.261918338823]
["U","Acct 1799",19966.876355848693]
["V","Acct 2893",90009.426074220391]
["V","Acct 6058",89086.219281350044]
["V","Acct 8919",80698.698876596623]
["V","Acct 3637",77526.661323302294]
["V","Acct 7968",76227.680486931786]
["V","Acct 6752",72064.545259473292]
["V","Acct 5203",69539.252716050803]
["V","Acct 4579",51261.581782236441]
["V","Acct 2607",44606.242804784924]
["V","Acct 6361",35569.629642003863]
["W","Acct 5113",84485.285822197315]
["W","Acct 3607",84196.837223824099]
["W","Acct 5655",83233.555443191712]
["W","Acct 5177",60065.297803779948]
["W","Acct 7776",56415.591684292442]
["W","Acct 8156",28647.069512270285]
["W","Acct 4708",22122.262555228601]
["W","Acct 1970",17766.844024179351]
["W","Acct 8513",13218.842175105949]
["X","Acct 1468",96875.666033515285]
["X","Acct 8421",91985.651518750223]
["X","Acct 5176",67364.968983625469]
["X","Acct 5243",39771.947012448916]
["Y","Acct 6120",67790.265221296489]
["Y","Acct 8634",54469.545793770703]
["Y","Acct 2377",36832.298898686]
["Y","Acct 2318",23587.42117057553]
["Y","Acct 5888",6870.4628633050379]
["Z","Acct 7408",99579.82654280118]
["Z","Acct 2468",82730.192313480526]
["Z","Acct 6122",80274.179806068685]
["Z","Acct 1782",35550.520792141171]
["Z","Acct 8453",24668.664993029066]
["Z","Acct 8259",17226.994831884102]
["Z","Acct 2300",15073.748208474048]
["Z","Acct 4734",14909.96885258835]
["Z","Acct 2666",12675.218539484102]

{"sheet":"Mike (2)","index":3,"n_rows":194,"n_cols":14,"rows_kept":194,"cut":false,"hidden":false,"merged":[]}
["Industry","Customer","Amount",null,"Alex asks:  is there a way to show the top 2 customers per industry?"]
["A","Acct 8375",59948.701198641109]
["A","Acct 1119",59948.701198641109,null,"Top",3]
["A","Acct 5201",51158.299885325156,null,"**For the formula to work, you must do two sorts: 1st sort Amount column Z to A; and 2nd sort Industry A to Z.\n****For formula that workd no matter what the sort see sheet (Mike(2)."]
["A","Acct 4408",23608.901998540343,null,"Industry/Customer","Customer 1","Customer 2","Customer 3","Customer 4"]
["B","Acct 2516",59948.701198641109,null,"A",{"$f":"IFERROR(INDEX($B$2:$B$194,MATCH(LARGE(IF($A$2:$A$194=$E6,IF($C$2:$C$194>=LARGE(IF($A$2:$A$194=$E6,$C$2:$C$194),$F$3),$C$2:$C$194/(ROW($C$2:$C$194)/10000))),COLUMNS($F6:F6)),$C$2:$C$194/(ROW($C$2:$C$194)/10000),0)),\"\")","v":"Acct 8375"},{"$f":"IFERROR(INDEX($B$2:$B$194,MATCH(LARGE(IF($A$2:$A$194=$E6,IF($C$2:$C$194>=LARGE(IF($A$2:$A$194=$E6,$C$2:$C$194),$F$3),$C$2:$C$194/(ROW($C$2:$C$194)/10000))),COLUMNS($F6:G6)),$C$2:$C$194/(ROW($C$2:$C$194)/10000),0)),\"\")","v":"Acct 1119"},{"$f":"IFERROR(INDEX($B$2:$B$194,MATCH(LARGE(IF($A$2:$A$194=$E6,IF($C$2:$C$194>=LARGE(IF($A$2:$A$194=$E6,$C$2:$C$194),$F$3),$C$2:$C$194/(ROW($C$2:$C$194)/10000))),COLUMNS($F6:H6)),$C$2:$C$194/(ROW($C$2:$C$194)/10000),0)),\"\")","v":"Acct 5201"},{"$f":"IFERROR(INDEX($B$2:$B$194,MATCH(LARGE(IF($A$2:$A$194=$E6,IF($C$2:$C$194>=LARGE(IF($A$2:$A$194=$E6,$C$2:$C$194),$F$3),$C$2:$C$194/(ROW($C$2:$C$194)/10000))),COLUMNS($F6:I6)),$C$2:$C$194/(ROW($C$2:$C$194)/10000),0)),\"\")","v":""},null,null,{"$f":"IF(COLUMNS($L6:L6)>$F$3,\"\",INDEX($B$2:$B$194,SMALL(IF($A$2:$A$194=$E6,IF($C$2:$C$194>=LARGE(IF($A$2:$A$194=$E6,$C$2:$C$194),$F$3),ROW($B$2:$B$194)-ROW($B$2)+1)),COLUMNS($L6:L6))))","v":"Acct 8375"},{"$f":"IF(COLUMNS($L6:M6)>$F$3,\"\",INDEX($B$2:$B$194,SMALL(IF($A$2:$A$194=$E6,IF($C$2:$C$194>=LARGE(IF($A$2:$A$194=$E6,$C$2:$C$194),$F$3),ROW($B$2:$B$194)-ROW($B$2)+1)),COLUMNS($L6:M6))))","v":"Acct 1119"},{"$f":"IF(COLUMNS($L6:N6)>$F$3,\"\",INDEX($B$2:$B$194,SMALL(IF($A$2:$A$194=$E6,IF($C$2:$C$194>=LARGE(IF($A$2:$A$194=$E6,$C$2:$C$194),$F$3),ROW($B$2:$B$194)-ROW($B$2)+1)),COLUMNS($L6:N6))))","v":"Acct 5201"}]
["B","Acct 3743",59948.701198641109,null,"B",{"$f":"IFERROR(INDEX($B$2:$B$194,MATCH(LARGE(IF($A$2:$A$194=$E7,IF($C$2:$C$194>=LARGE(IF($A$2:$A$194=$E7,$C$2:$C$194),$F$3),$C$2:$C$194/(ROW($C$2:$C$194)/10000))),COLUMNS($F7:F7)),$C$2:$C$194/(ROW($C$2:$C$194)/10000),0)),\"\")","v":"Acct 2516"},{"$f":"IFERROR(INDEX($B$2:$B$194,MATCH(LARGE(IF($A$2:$A$194=$E7,IF($C$2:$C$194>=LARGE(IF($A$2:$A$194=$E7,$C$2:$C$194),$F$3),$C$2:$C$194/(ROW($C$2:$C$194)/10000))),COLUMNS($F7:G7)),$C$2:$C$194/(ROW($C$2:$C$194)/10000),0)),\"\")","v":"Acct 4045"},{"$f":"IFERROR(INDEX($B$2:$B$194,MATCH(LARGE(IF($A$2:$A$194=$E7,IF($C$2:$C$194>=LARGE(IF($A$2:$A$194=$E7,$C$2:$C$194),$F$3),$C$2:$C$194/(ROW($C$2:$C$194)/10000))),COLUMNS($F7:H7)),$C$2:$C$194/(ROW($C$2:$C$194)/10000),0)),\"\")","v":"Acct 3743"},{"$f":"IFERROR(INDEX($B$2:$B$194,MATCH(LARGE(IF($A$2:$A$194=$E7,IF($C$2:$C$194>=LARGE(IF($A$2:$A$194=$E7,$C$2:$C$194),$F$3),$C$2:$C$194/(ROW($C$2:$C$194)/10000))),COLUMNS($F7:I7)),$C$2:$C$194/(ROW($C$2:$C$194)/10000),0)),\"\")","v":"Acct 7206"},null,null,{"$f":"IF(COLUMNS($L7:L7)>$F$3,\"\",INDEX($B$2:$B$194,SMALL(IF($A$2:$A$194=$E7,IF($C$2:$C$194>=LARGE(IF($A$2:$A$194=$E7,$C$2:$C$194),$F$3),ROW($B$2:$B$194)-ROW($B$2)+1)),COLUMNS($L7:L7))))","v":"Acct 2516"},{"$f":"IF(COLUMNS($L7:M7)>$F$3,\"\",INDEX($B$2:$B$194,SMALL(IF($A$2:$A$194=$E7,IF($C$2:$C$194>=LARGE(IF($A$2:$A$194=$E7,$C$2:$C$194),$F$3),ROW($B$2:$B$194)-ROW($B$2)+1)),COLUMNS($L7:M7))))","v":"Acct 3743"},{"$f":"IF(COLUMNS($L7:N7)>$F$3,\"\",INDEX($B$2:$B$194,SMALL(IF($A$2:$A$194=$E7,IF($C$2:$C$194>=LARGE(IF($A$2:$A$194=$E7,$C$2:$C$194),$F$3),ROW($B$2:$B$194)-ROW($B$2)+1)),COLUMNS($L7:N7))))","v":"Acct 4045"}]
["B","Acct 4045",79274.823478148726,null,"C",{"$f":"IFERROR(INDEX($B$2:$B$194,MATCH(LARGE(IF($A$2:$A$194=$E8,IF($C$2:$C$194>=LARGE(IF($A$2:$A$194=$E8,$C$2:$C$194),$F$3),$C$2:$C$194/(ROW($C$2:$C$194)/10000))),COLUMNS($F8:F8)),$C$2:$C$194/(ROW($C$2:$C$194)/10000),0)),\"\")","v":"Acct 4308"},{"$f":"IFERROR(INDEX($B$2:$B$194,MATCH(LARGE(IF($A$2:$A$194=$E8,IF($C$2:$C$194>=LARGE(IF($A$2:$A$194=$E8,$C$2:$C$194),$F$3),$C$2:$C$194/(ROW($C$2:$C$194)/10000))),COLUMNS($F8:G8)),$C$2:$C$194/(ROW($C$2:$C$194)/10000),0)),\"\")","v":"Acct 5600"},{"$f":"IFERROR(INDEX($B$2:$B$194,MATCH(LARGE(IF($A$2:$A$194=$E8,IF($C$2:$C$194>=LARGE(IF($A$2:$A$194=$E8,$C$2:$C$194),$F$3),$C$2:$C$194/(ROW($C$2:$C$194)/10000))),COLUMNS($F8:H8)),$C$2:$C$194/(ROW($C$2:$C$194)/10000),0)),\"\")","v":"Acct 6115"},{"$f":"IFERROR(INDEX($B$2:$B$194,MATCH(LARGE(IF($A$2:$A$194=$E8,IF($C$2:$C$194>=LARGE(IF($A$2:$A$194=$E8,$C$2:$C$194),$F$3),$C$2:$C$194/(ROW($C$2:$C$194)/10000))),COLUMNS($F8:I8)),$C$2:$C$194/(ROW($C$2:$C$194)/10000),0)),\"\")","v":""},null,null,{"$f":"IF(COLUMNS($L8:L8)>$F$3,\"\",INDEX($B$2:$B$194,SMALL(IF($A$2:$A$194=$E8,IF($C$2:$C$194>=LARGE(IF($A$2:$A$194=$E8,$C$2:$C$194),$F$3),ROW($B$2:$B$194)-ROW($B$2)+1)),COLUMNS($L8:L8))))","v":"Acct 4308"},{"$f":"IF(COLUMNS($L8:M8)>$F$3,\"\",INDEX($B$2:$B$194,SMALL(IF($A$2:$A$194=$E8,IF($C$2:$C$194>=LARGE(IF($A$2:$A$194=$E8,$C$2:$C$194),$F$3),ROW($B$2:$B$194)-ROW($B$2)+1)),COLUMNS($L8:M8))))","v":"Acct 5600"},{"$f":"IF(COLUMNS($L8:N8)>$F$3,\"\",INDEX($B$2:$B$194,SMALL(IF($A$2:$A$194=$E8,IF($C$2:$C$194>=LARGE(IF($A$2:$A$194=$E8,$C$2:$C$194),$F$3),ROW($B$2:$B$194)-ROW($B$2)+1)),COLUMNS($L8:N8))))","v":"Acct 6115"}]
["B","Acct 7206",64366.495318589732,null,"D",{"$f":"IFERROR(INDEX($B$2:$B$194,MATCH(LARGE(IF($A$2:$A$194=$E9,IF($C$2:$C$194>=LARGE(IF($A$2:$A$194=$E9,$C$2:$C$194),$F$3),$C$2:$C$194/(ROW($C$2:$C$194)/10000))),COLUMNS($F9:F9)),$C$2:$C$194/(ROW($C$2:$C$194)/10000),0)),\"\")","v":"Acct 2337"},{"$f":"IFERROR(INDEX($B$2:$B$194,MATCH(LARGE(IF($A$2:$A$194=$E9,IF($C$2:$C$194>=LARGE(IF($A$2:$A$194=$E9,$C$2:$C$194),$F$3),$C$2:$C$194/(ROW($C$2:$C$194)/10000))),COLUMNS($F9:G9)),$C$2:$C$194/(ROW($C$2:$C$194)/10000),0)),\"\")","v":"Acct 8136"},{"$f":"IFERROR(INDEX($B$2:$B$194,MATCH(LARGE(IF($A$2:$A$194=$E9,IF($C$2:$C$194>=LARGE(IF($A$2:$A$194=$E9,$C$2:$C$194),$F$3),$C$2:$C$194/(ROW($C$2:$C$194)/10000))),COLUMNS($F9:H9)),$C$2:$C$194/(ROW($C$2:$C$194)/10000),0)),\"\")","v":"Acct 4816"},{"$f":"IFERROR(INDEX($B$2:$B$194,MATCH(LARGE(IF($A$2:$A$194=$E9,IF($C$2:$C$194>=LARGE(IF($A$2:$A$194=$E9,$C$2:$C$194),$F$3),$C$2:$C$194/(ROW($C$2:$C$194)/10000))),COLUMNS($F9:I9)),$C$2:$C$194/(ROW($C$2:$C$194)/10000),0)),\"\")","v":""},null,null,{"$f":"IF(COLUMNS($L9:L9)>$F$3,\"\",INDEX($B$2:$B$194,SMALL(IF($A$2:$A$194=$E9,IF($C$2:$C$194>=LARGE(IF($A$2:$A$194=$E9,$C$2:$C$194),$F$3),ROW($B$2:$B$194)-ROW($B$2)+1)),COLUMNS($L9:L9))))","v":"Acct 2337"},{"$f":"IF(COLUMNS($L9:M9)>$F$3,\"\",INDEX($B$2:$B$194,SMALL(IF($A$2:$A$194=$E9,IF($C$2:$C$194>=LARGE(IF($A$2:$A$194=$E9,$C$2:$C$194),$F$3),ROW($B$2:$B$194)-ROW($B$2)+1)),COLUMNS($L9:M9))))","v":"Acct 8136"},{"$f":"IF(COLUMNS($L9:N9)>$F$3,\"\",INDEX($B$2:$B$194,SMALL(IF($A$2:$A$194=$E9,IF($C$2:$C$194>=LARGE(IF($A$2:$A$194=$E9,$C$2:$C$194),$F$3),ROW($B$2:$B$194)-ROW($B$2)+1)),COLUMNS($L9:N9))))","v":"Acct 4816"}]
["B","Acct 4007",52577.103164786662,null,"E",{"$f":"IFERROR(INDEX($B$2:$B$194,MATCH(LARGE(IF($A$2:$A$194=$E10,IF($C$2:$C$194>=LARGE(IF($A$2:$A$194=$E10,$C$2:$C$194),$F$3),$C$2:$C$194/(ROW($C$2:$C$194)/10000))),COLUMNS($F10:F10)),$C$2:$C$194/(ROW($C$2:$C$194)/10000),0)),\"\")","v":"Acct 3149"},{"$f":"IFERROR(INDEX($B$2:$B$194,MATCH(LARGE(IF($A$2:$A$194=$E10,IF($C$2:$C$194>=LARGE(IF($A$2:$A$194=$E10,$C$2:$C$194),$F$3),$C$2:$C$194/(ROW($C$2:$C$194)/10000))),COLUMNS($F10:G10)),$C$2:$C$194/(ROW($C$2:$C$194)/10000),0)),\"\")","v":"Acct 7662"},{"$f":"IFERROR(INDEX($B$2:$B$194,MATCH(LARGE(IF($A$2:$A$194=$E10,IF($C$2:$C$194>=LARGE(IF($A$2:$A$194=$E10,$C$2:$C$194),$F$3),$C$2:$C$194/(ROW($C$2:$C$194)/10000))),COLUMNS($F10:H10)),$C$2:$C$194/(ROW($C$2:$C$194)/10000),0)),\"\")","v":"Acct 4289"},{"$f":"IFERROR(INDEX($B$2:$B$194,MATCH(LARGE(IF($A$2:$A$194=$E10,IF($C$2:$C$194>=LARGE(IF($A$2:$A$194=$E10,$C$2:$C$194),$F$3),$C$2:$C$194/(ROW($C$2:$C$194)/10000))),COLUMNS($F10:I10)),$C$2:$C$194/(ROW($C$2:$C$194)/10000),0)),\"\")","v":""},null,null,{"$f":"IF(COLUMNS($L10:L10)>$F$3,\"\",INDEX($B$2:$B$194,SMALL(IF($A$2:$A$194=$E10,IF($C$2:$C$194>=LARGE(IF($A$2:$A$194=$E10,$C$2:$C$194),$F$3),ROW($B$2:$B$194)-ROW($B$2)+1)),COLUMNS($L10:L10))))","v":"Acct 3149"},{"$f":"IF(COLUMNS($L10:M10)>$F$3,\"\",INDEX($B$2:$B$194,SMALL(IF($A$2:$A$194=$E10,IF($C$2:$C$194>=LARGE(IF($A$2:$A$194=$E10,$C$2:$C$194),$F$3),ROW($B$2:$B$194)-ROW($B$2)+1)),COLUMNS($L10:M10))))","v":"Acct 7662"},{"$f":"IF(COLUMNS($L10:N10)>$F$3,\"\",INDEX($B$2:$B$194,SMALL(IF($A$2:$A$194=$E10,IF($C$2:$C$194>=LARGE(IF($A$2:$A$194=$E10,$C$2:$C$194),$F$3),ROW($B$2:$B$194)-ROW($B$2)+1)),COLUMNS($L10:N10))))","v":"Acct 4289"}]
["B","Acct 3806",13796.142644822095,null,"F",{"$f":"IFERROR(INDEX($B$2:$B$194,MATCH(LARGE(IF($A$2:$A$194=$E11,IF($C$2:$C$194>=LARGE(IF($A$2:$A$194=$E11,$C$2:$C$194),$F$3),$C$2:$C$194/(ROW($C$2:$C$194)/10000))),COLUMNS($F11:F11)),$C$2:$C$194/(ROW($C$2:$C$194)/10000),0)),\"\")","v":"Acct 3626"},{"$f":"IFERROR(INDEX($B$2:$B$194,MATCH(LARGE(IF($A$2:$A$194=$E11,IF($C$2:$C$194>=LARGE(IF($A$2:$A$194=$E11,$C$2:$C$194),$F$3),$C$2:$C$194/(ROW($C$2:$C$194)/10000))),COLUMNS($F11:G11)),$C$2:$C$194/(ROW($C$2:$C$194)/10000),0)),\"\")","v":"Acct 7853"},{"$f":"IFERROR(INDEX($B$2:$B$194,MATCH(LARGE(IF($A$2:$A$194=$E11,IF($C$2:$C$194>=LARGE(IF($A$2:$A$194=$E11,$C$2:$C$194),$F$3),$C$2:$C$194/(ROW($C$2:$C$194)/10000))),COLUMNS($F11:H11)),$C$2:$C$194/(ROW($C$2:$C$194)/10000),0)),\"\")","v":"Acct 6976"},{"$f":"IFERROR(INDEX($B$2:$B$194,MATCH(LARGE(IF($A$2:$A$194=$E11,IF($C$2:$C$194>=LARGE(IF($A$2:$A$194=$E11,$C$2:$C$194),$F$3),$C$2:$C$194/(ROW($C$2:$C$194)/10000))),COLUMNS($F11:I11)),$C$2:$C$194/(ROW($C$2:$C$194)/10000),0)),\"\")","v":""},null,null,{"$f":"IF(COLUMNS($L11:L11)>$F$3,\"\",INDEX($B$2:$B$194,SMALL(IF($A$2:$A$194=$E11,IF($C$2:$C$194>=LARGE(IF($A$2:$A$194=$E11,$C$2:$C$194),$F$3),ROW($B$2:$B$194)-ROW($B$2)+1)),COLUMNS($L11:L11))))","v":"Acct 3626"},{"$f":"IF(COLUMNS($L11:M11)>$F$3,\"\",INDEX($B$2:$B$194,SMALL(IF($A$2:$A$194=$E11,IF($C$2:$C$194>=LARGE(IF($A$2:$A$194=$E11,$C$2:$C$194),$F$3),ROW($B$2:$B$194)-ROW($B$2)+1)),COLUMNS($L11:M11))))","v":"Acct 7853"},{"$f":"IF(COLUMNS($L11:N11)>$F$3,\"\",INDEX($B$2:$B$194,SMALL(IF($A$2:$A$194=$E11,IF($C$2:$C$194>=LARGE(IF($A$2:$A$194=$E11,$C$2:$C$194),$F$3),ROW($B$2:$B$194)-ROW($B$2)+1)),COLUMNS($L11:N11))))","v":"Acct 6976"}]
["B","Acct 1910",12138.442495236857,null,"G",{"$f":"IFERROR(INDEX($B$2:$B$194,MATCH(LARGE(IF($A$2:$A$194=$E12,IF($C$2:$C$194>=LARGE(IF($A$2:$A$194=$E12,$C$2:$C$194),$F$3),$C$2:$C$194/(ROW($C$2:$C$194)/10000))),COLUMNS($F12:F12)),$C$2:$C$194/(ROW($C$2:$C$194)/10000),0)),\"\")","v":"Acct 4572"},{"$f":"IFERROR(INDEX($B$2:$B$194,MATCH(LARGE(IF($A$2:$A$194=$E12,IF($C$2:$C$194>=LARGE(IF($A$2:$A$194=$E12,$C$2:$C$194),$F$3),$C$2:$C$194/(ROW($C$2:$C$194)/10000))),COLUMNS($F12:G12)),$C$2:$C$194/(ROW($C$2:$C$194)/10000),0)),\"\")","v":"Acct 3463"},{"$f":"IFERROR(INDEX($B$2:$B$194,MATCH(LARGE(IF($A$2:$A$194=$E12,IF($C$2:$C$194>=LARGE(IF($A$2:$A$194=$E12,$C$2:$C$194),$F$3),$C$2:$C$194/(ROW($C$2:$C$194)/10000))),COLUMNS($F12:H12)),$C$2:$C$194/(ROW($C$2:$C$194)/10000),0)),\"\")","v":"Acct 4202"},{"$f":"IFERROR(INDEX($B$2:$B$194,MATCH(LARGE(IF($A$2:$A$194=$E12,IF($C$2:$C$194>=LARGE(IF($A$2:$A$194=$E12,$C$2:$C$194),$F$3),$C$2:$C$194/(ROW($C$2:$C$194)/10000))),COLUMNS($F12:I12)),$C$2:$C$194/(ROW($C$2:$C$194)/10000),0)),\"\")","v":""},null,null,{"$f":"IF(COLUMNS($L12:L12)>$F$3,\"\",INDEX($B$2:$B$194,SMALL(IF($A$2:$A$194=$E12,IF($C$2:$C$194>=LARGE(IF($A$2:$A$194=$E12,$C$2:$C$194),$F$3),ROW($B$2:$B$194)-ROW($B$2)+1)),COLUMNS($L12:L12))))","v":"Acct 4572"},{"$f":"IF(COLUMNS($L12:M12)>$F$3,\"\",INDEX($B$2:$B$194,SMALL(IF($A$2:$A$194=$E12,IF($C$2:$C$194>=LARGE(IF($A$2:$A$194=$E12,$C$2:$C$194),$F$3),ROW($B$2:$B$194)-ROW($B$2)+1)),COLUMNS($L12:M12))))","v":"Acct 3463"},{"$f":"IF(COLUMNS($L12:N12)>$F$3,\"\",INDEX($B$2:$B$194,SMALL(IF($A$2:$A$194=$E12,IF($C$2:$C$194>=LARGE(IF($A$2:$A$194=$E12,$C$2:$C$194),$F$3),ROW($B$2:$B$194)-ROW($B$2)+1)),COLUMNS($L12:N12))))","v":"Acct 4202"}]
["B","Acct 7089",8774.8026805944846,null,"H",{"$f":"IFERROR(INDEX($B$2:$B$194,MATCH(LARGE(IF($A$2:$A$194=$E13,IF($C$2:$C$194>=LARGE(IF($A$2:$A$194=$E13,$C$2:$C$194),$F$3),$C$2:$C$194/(ROW($C$2:$C$194)/10000))),COLUMNS($F13:F13)),$C$2:$C$194/(ROW($C$2:$C$194)/10000),0)),\"\")","v":"Acct 7000"},{"$f":"IFERROR(INDEX($B$2:$B$194,MATCH(LARGE(IF($A$2:$A$194=$E13,IF($C$2:$C$194>=LARGE(IF($A$2:$A$194=$E13,$C$2:$C$194),$F$3),$C$2:$C$194/(ROW($C$2:$C$194)/10000))),COLUMNS($F13:G13)),$C$2:$C$194/(ROW($C$2:$C$194)/10000),0)),\"\")","v":"Acct 3609"},{"$f":"IFERROR(INDEX($B$2:$B$194,MATCH(LARGE(IF($A$2:$A$194=$E13,IF($C$2:$C$194>=LARGE(IF($A$2:$A$194=$E13,$C$2:$C$194),$F$3),$C$2:$C$194/(ROW($C$2:$C$194)/10000))),COLUMNS($F13:H13)),$C$2:$C$194/(ROW($C$2:$C$194)/10000),0)),\"\")","v":"Acct 4633"},{"$f":"IFERROR(INDEX($B$2:$B$194,MATCH(LARGE(IF($A$2:$A$194=$E13,IF($C$2:$C$194>=LARGE(IF($A$2:$A$194=$E13,$C$2:$C$194),$F$3),$C$2:$C$194/(ROW($C$2:$C$194)/10000))),COLUMNS($F13:I13)),$C$2:$C$194/(ROW($C$2:$C$194)/10000),0)),\"\")","v":""},null,null,{"$f":"IF(COLUMNS($L13:L13)>$F$3,\"\",INDEX($B$2:$B$194,SMALL(IF($A$2:$A$194=$E13,IF($C$2:$C$194>=LARGE(IF($A$2:$A$194=$E13,$C$2:$C$194),$F$3),ROW($B$2:$B$194)-ROW($B$2)+1)),COLUMNS($L13:L13))))","v":"Acct 7000"},{"$f":"IF(COLUMNS($L13:M13)>$F$3,\"\",INDEX($B$2:$B$194,SMALL(IF($A$2:$A$194=$E13,IF($C$2:$C$194>=LARGE(IF($A$2:$A$194=$E13,$C$2:$C$194),$F$3),ROW($B$2:$B$194)-ROW($B$2)+1)),COLUMNS($L13:M13))))","v":"Acct 3609"},{"$f":"IF(COLUMNS($L13:N13)>$F$3,\"\",INDEX($B$2:$B$194,SMALL(IF($A$2:$A$194=$E13,IF($C$2:$C$194>=LARGE(IF($A$2:$A$194=$E13,$C$2:$C$194),$F$3),ROW($B$2:$B$194)-ROW($B$2)+1)),COLUMNS($L13:N13))))","v":"Acct 4633"}]
["C","Acct 4308",45239.218902719978,null,"I",{"$f":"IFERROR(INDEX($B$2:$B$194,MATCH(LARGE(IF($A$2:$A$194=$E14,IF($C$2:$C$194>=LARGE(IF($A$2:$A$194=$E14,$C$2:$C$194),$F$3),$C$2:$C$194/(ROW($C$2:$C$194)/10000))),COLUMNS($F14:F14)),$C$2:$C$194/(ROW($C$2:$C$194)/10000),0)),\"\")","v":"Acct 2335"},{"$f":"IFERROR(INDEX($B$2:$B$194,MATCH(LARGE(IF($A$2:$A$194=$E14,IF($C$2:$C$194>=LARGE(IF($A$2:$A$194=$E14,$C$2:$C$194),$F$3),$C$2:$C$194/(ROW($C$2:$C$194)/10000))),COLUMNS($F14:G14)),$C$2:$C$194/(ROW($C$2:$C$194)/10000),0)),\"\")","v":"Acct 7761"},{"$f":"IFERROR(INDEX($B$2:$B$194,MATCH(LARGE(IF($A$2:$A$194=$E14,IF($C$2:$C$194>=LARGE(IF($A$2:$A$194=$E14,$C$2:$C$194),$F$3),$C$2:$C$194/(ROW($C$2:$C$194)/10000))),COLUMNS($F14:H14)),$C$2:$C$194/(ROW($C$2:$C$194)/10000),0)),\"\")","v":"Acct 7297"},{"$f":"IFERROR(INDEX($B$2:$B$194,MATCH(LARGE(IF($A$2:$A$194=$E14,IF($C$2:$C$194>=LARGE(IF($A$2:$A$194=$E14,$C$2:$C$194),$F$3),$C$2:$C$194/(ROW($C$2:$C$194)/10000))),COLUMNS($F14:I14)),$C$2:$C$194/(ROW($C$2:$C$194)/10000),0)),\"\")","v":""},null,null,{"$f":"IF(COLUMNS($L14:L14)>$F$3,\"\",INDEX($B$2:$B$194,SMALL(IF($A$2:$A$194=$E14,IF($C$2:$C$194>=LARGE(IF($A$2:$A$194=$E14,$C$2:$C$194),$F$3),ROW($B$2:$B$194)-ROW($B$2)+1)),COLUMNS($L14:L14))))","v":"Acct 2335"},{"$f":"IF(COLUMNS($L14:M14)>$F$3,\"\",INDEX($B$2:$B$194,SMALL(IF($A$2:$A$194=$E14,IF($C$2:$C$194>=LARGE(IF($A$2:$A$194=$E14,$C$2:$C$194),$F$3),ROW($B$2:$B$194)-ROW($B$2)+1)),COLUMNS($L14:M14))))","v":"Acct 7761"},{"$f":"IF(COLUMNS($L14:N14)>$F$3,\"\",INDEX($B$2:$B$194,SMALL(IF($A$2:$A$194=$E14,IF($C$2:$C$194>=LARGE(IF($A$2:$A$194=$E14,$C$2:$C$194),$F$3),ROW($B$2:$B$194)-ROW($B$2)+1)),COLUMNS($L14:N14))))","v":"Acct 7297"}]
["C","Acct 5600",25193.714664525236,null,"J",{"$f":"IFERROR(INDEX($B$2:$B$194,MATCH(LARGE(IF($A$2:$A$194=$E15,IF($C$2:$C$194>=LARGE(IF($A$2:$A$194=$E15,$C$2:$C$194),$F$3),$C$2:$C$194/(ROW($C$2:$C$194)/10000))),COLUMNS($F15:F15)),$C$2:$C$194/(ROW($C$2:$C$194)/10000),0)),\"\")","v":"Acct 6172"},{"$f":"IFERROR(INDEX($B$2:$B$194,MATCH(LARGE(IF($A$2:$A$194=$E15,IF($C$2:$C$194>=LARGE(IF($A$2:$A$194=$E15,$C$2:$C$194),$F$3),$C$2:$C$194/(ROW($C$2:$C$194)/10000))),COLUMNS($F15:G15)),$C$2:$C$194/(ROW($C$2:$C$194)/10000),0)),\"\")","v":"Acct 4394"},{"$f":"IFERROR(INDEX($B$2:$B$194,MATCH(LARGE(IF($A$2:$A$194=$E15,IF($C$2:$C$194>=LARGE(IF($A$2:$A$194=$E15,$C$2:$C$194),$F$3),$C$2:$C$194/(ROW($C$2:$C$194)/10000))),COLUMNS($F15:H15)),$C$2:$C$194/(ROW($C$2:$C$194)/10000),0)),\"\")","v":"Acct 7933"},{"$f":"IFERROR(INDEX($B$2:$B$194,MATCH(LARGE(IF($A$2:$A$194=$E15,IF($C$2:$C$194>=LARGE(IF($A$2:$A$194=$E15,$C$2:$C$194),$F$3),$C$2:$C$194/(ROW($C$2:$C$194)/10000))),COLUMNS($F15:I15)),$C$2:$C$194/(ROW($C$2:$C$194)/10000),0)),\"\")","v":""},null,null,{"$f":"IF(COLUMNS($L15:L15)>$F$3,\"\",INDEX($B$2:$B$194,SMALL(IF($A$2:$A$194=$E15,IF($C$2:$C$194>=LARGE(IF($A$2:$A$194=$E15,$C$2:$C$194),$F$3),ROW($B$2:$B$194)-ROW($B$2)+1)),COLUMNS($L15:L15))))","v":"Acct 6172"},{"$f":"IF(COLUMNS($L15:M15)>$F$3,\"\",INDEX($B$2:$B$194,SMALL(IF($A$2:$A$194=$E15,IF($C$2:$C$194>=LARGE(IF($A$2:$A$194=$E15,$C$2:$C$194),$F$3),ROW($B$2:$B$194)-ROW($B$2)+1)),COLUMNS($L15:M15))))","v":"Acct 4394"},{"$f":"IF(COLUMNS($L15:N15)>$F$3,\"\",INDEX($B$2:$B$194,SMALL(IF($A$2:$A$194=$E15,IF($C$2:$C$194>=LARGE(IF($A$2:$A$194=$E15,$C$2:$C$194),$F$3),ROW($B$2:$B$194)-ROW($B$2)+1)),COLUMNS($L15:N15))))","v":"Acct 7933"}]
["C","Acct 6115",17495.623050845155,null,"K",{"$f":"IFERROR(INDEX($B$2:$B$194,MATCH(LARGE(IF($A$2:$A$194=$E16,IF($C$2:$C$194>=LARGE(IF($A$2:$A$194=$E16,$C$2:$C$194),$F$3),$C$2:$C$194/(ROW($C$2:$C$194)/10000))),COLUMNS($F16:F16)),$C$2:$C$194/(ROW($C$2:$C$194)/10000),0)),\"\")","v":"Acct 7565"},{"$f":"IFERROR(INDEX($B$2:$B$194,MATCH(LARGE(IF($A$2:$A$194=$E16,IF($C$2:$C$194>=LARGE(IF($A$2:$A$194=$E16,$C$2:$C$194),$F$3),$C$2:$C$194/(ROW($C$2:$C$194)/10000))),COLUMNS($F16:G16)),$C$2:$C$194/(ROW($C$2:$C$194)/10000),0)),\"\")","v":"Acct 6510"},{"$f":"IFERROR(INDEX($B$2:$B$194,MATCH(LARGE(IF($A$2:$A$194=$E16,IF($C$2:$C$194>=LARGE(IF($A$2:$A$194=$E16,$C$2:$C$194),$F$3),$C$2:$C$194/(ROW($C$2:$C$194)/10000))),COLUMNS($F16:H16)),$C$2:$C$194/(ROW($C$2:$C$194)/10000),0)),\"\")","v":"Acct 6891"},{"$f":"IFERROR(INDEX($B$2:$B$194,MATCH(LARGE(IF($A$2:$A$194=$E16,IF($C$2:$C$194>=LARGE(IF($A$2:$A$194=$E16,$C$2:$C$194),$F$3),$C$2:$C$194/(ROW($C$2:$C$194)/10000))),COLUMNS($F16:I16)),$C$2:$C$194/(ROW($C$2:$C$194)/10000),0)),\"\")","v":""},null,null,{"$f":"IF(COLUMNS($L16:L16)>$F$3,\"\",INDEX($B$2:$B$194,SMALL(IF($A$2:$A$194=$E16,IF($C$2:$C$194>=LARGE(IF($A$2:$A$194=$E16,$C$2:$C$194),$F$3),ROW($B$2:$B$194)-ROW($B$2)+1)),COLUMNS($L16:L16))))","v":"Acct 7565"},{"$f":"IF(COLUMNS($L16:M16)>$F$3,\"\",INDEX($B$2:$B$194,SMALL(IF($A$2:$A$194=$E16,IF($C$2:$C$194>=LARGE(IF($A$2:$A$194=$E16,$C$2:$C$194),$F$3),ROW($B$2:$B$194)-ROW($B$2)+1)),COLUMNS($L16:M16))))","v":"Acct 6510"},{"$f":"IF(COLUMNS($L16:N16)>$F$3,\"\",INDEX($B$2:$B$194,SMALL(IF($A$2:$A$194=$E16,IF($C$2:$C$194>=LARGE(IF($A$2:$A$194=$E16,$C$2:$C$194),$F$3),ROW($B$2:$B$194)-ROW($B$2)+1)),COLUMNS($L16:N16))))","v":"Acct 6891"}]
["D","Acct 2337",98475.307688900779,null,"L",{"$f":"IFERROR(INDEX($B$2:$B$194,MATCH(LARGE(IF($A$2:$A$194=$E17,IF($C$2:$C$194>=LARGE(IF($A$2:$A$194=$E17,$C$2:$C$194),$F$3),$C$2:$C$194/(ROW($C$2:$C$194)/10000))),COLUMNS($F17:F17)),$C$2:$C$194/(ROW($C$2:$C$194)/10000),0)),\"\")","v":"Acct 8898"},{"$f":"IFERROR(INDEX($B$2:$B$194,MATCH(LARGE(IF($A$2:$A$194=$E17,IF($C$2:$C$194>=LARGE(IF($A$2:$A$194=$E17,$C$2:$C$194),$F$3),$C$2:$C$194/(ROW($C$2:$C$194)/10000))),COLUMNS($F17:G17)),$C$2:$C$194/(ROW($C$2:$C$194)/10000),0)),\"\")","v":"Acct 8210"},{"$f":"IFERROR(INDEX($B$2:$B$194,MATCH(LARGE(IF($A$2:$A$194=$E17,IF($C$2:$C$194>=LARGE(IF($A$2:$A$194=$E17,$C$2:$C$194),$F$3),$C$2:$C$194/(ROW($C$2:$C$194)/10000))),COLUMNS($F17:H17)),$C$2:$C$194/(ROW($C$2:$C$194)/10000),0)),\"\")","v":"Acct 8361"},{"$f":"IFERROR(INDEX($B$2:$B$194,MATCH(LARGE(IF($A$2:$A$194=$E17,IF($C$2:$C$194>=LARGE(IF($A$2:$A$194=$E17,$C$2:$C$194),$F$3),$C$2:$C$194/(ROW($C$2:$C$194)/10000))),COLUMNS($F17:I17)),$C$2:$C$194/(ROW($C$2:$C$194)/10000),0)),\"\")","v":""},null,null,{"$f":"IF(COLUMNS($L17:L17)>$F$3,\"\",INDEX($B$2:$B$194,SMALL(IF($A$2:$A$194=$E17,IF($C$2:$C$194>=LARGE(IF($A$2:$A$194=$E17,$C$2:$C$194),$F$3),ROW($B$2:$B$194)-ROW($B$2)+1)),COLUMNS($L17:L17))))","v":"Acct 8898"},{"$f":"IF(COLUMNS($L17:M17)>$F$3,\"\",INDEX($B$2:$B$194,SMALL(IF($A$2:$A$194=$E17,IF($C$2:$C$194>=LARGE(IF($A$2:$A$194=$E17,$C$2:$C$194),$F$3),ROW($B$2:$B$194)-ROW($B$2)+1)),COLUMNS($L17:M17))))","v":"Acct 8210"},{"$f":"IF(COLUMNS($L17:N17)>$F$3,\"\",INDEX($B$2:$B$194,SMALL(IF($A$2:$A$194=$E17,IF($C$2:$C$194>=LARGE(IF($A$2:$A$194=$E17,$C$2:$C$194),$F$3),ROW($B$2:$B$194)-ROW($B$2)+1)),COLUMNS($L17:N17))))","v":"Acct 8361"}]
["D","Acct 8136",97846.31589242247,null,"M",{"$f":"IFERROR(INDEX($B$2:$B$194,MATCH(LARGE(IF($A$2:$A$194=$E18,IF($C$2:$C$194>=LARGE(IF($A$2:$A$194=$E18,$C$2:$C$194),$F$3),$C$2:$C$194/(ROW($C$2:$C$194)/10000))),COLUMNS($F18:F18)),$C$2:$C$194/(ROW($C$2:$C$194)/10000),0)),\"\")","v":"Acct 1839"},{"$f":"IFERROR(INDEX($B$2:$B$194,MATCH(LARGE(IF($A$2:$A$194=$E18,IF($C$2:$C$194>=LARGE(IF($A$2:$A$194=$E18,$C$2:$C$194),$F$3),$C$2:$C$194/(ROW($C$2:$C$194)/10000))),COLUMNS($F18:G18)),$C$2:$C$194/(ROW($C$2:$C$194)/10000),0)),\"\")","v":"Acct 8666"},{"$f":"IFERROR(INDEX($B$2:$B$194,MATCH(LARGE(IF($A$2:$A$194=$E18,IF($C$2:$C$194>=LARGE(IF($A$2:$A$194=$E18,$C$2:$C$194),$F$3),$C$2:$C$194/(ROW($C$2:$C$194)/10000))),COLUMNS($F18:H18)),$C$2:$C$194/(ROW($C$2:$C$194)/10000),0)),\"\")","v":"Acct 5486"},{"$f":"IFERROR(INDEX($B$2:$B$194,MATCH(LARGE(IF($A$2:$A$194=$E18,IF($C$2:$C$194>=LARGE(IF($A$2:$A$194=$E18,$C$2:$C$194),$F$3),$C$2:$C$194/(ROW($C$2:$C$194)/10000))),COLUMNS($F18:I18)),$C$2:$C$194/(ROW($C$2:$C$194)/10000),0)),\"\")","v":""},null,null,{"$f":"IF(COLUMNS($L18:L18)>$F$3,\"\",INDEX($B$2:$B$194,SMALL(IF($A$2:$A$194=$E18,IF($C$2:$C$194>=LARGE(IF($A$2:$A$194=$E18,$C$2:$C$194),$F$3),ROW($B$2:$B$194)-ROW($B$2)+1)),COLUMNS($L18:L18))))","v":"Acct 1839"},{"$f":"IF(COLUMNS($L18:M18)>$F$3,\"\",INDEX($B$2:$B$194,SMALL(IF($A$2:$A$194=$E18,IF($C$2:$C$194>=LARGE(IF($A$2:$A$194=$E18,$C$2:$C$194),$F$3),ROW($B$2:$B$194)-ROW($B$2)+1)),COLUMNS($L18:M18))))","v":"Acct 8666"},{"$f":"IF(COLUMNS($L18:N18)>$F$3,\"\",INDEX($B$2:$B$194,SMALL(IF($A$2:$A$194=$E18,IF($C$2:$C$194>=LARGE(IF($A$2:$A$194=$E18,$C$2:$C$194),$F$3),ROW($B$2:$B$194)-ROW($B$2)+1)),COLUMNS($L18:N18))))","v":"Acct 5486"}]
["D","Acct 4816",26444.325750543539,null,"N",{"$f":"IFERROR(INDEX($B$2:$B$194,MATCH(LARGE(IF($A$2:$A$194=$E19,IF($C$2:$C$194>=LARGE(IF($A$2:$A$194=$E19,$C$2:$C$194),$F$3),$C$2:$C$194/(ROW($C$2:$C$194)/10000))),COLUMNS($F19:F19)),$C$2:$C$194/(ROW($C$2:$C$194)/10000),0)),\"\")","v":"Acct 7568"},{"$f":"IFERROR(INDEX($B$2:$B$194,MATCH(LARGE(IF($A$2:$A$194=$E19,IF($C$2:$C$194>=LARGE(IF($A$2:$A$194=$E19,$C$2:$C$194),$F$3),$C$2:$C$194/(ROW($C$2:$C$194)/10000))),COLUMNS($F19:G19)),$C$2:$C$194/(ROW($C$2:$C$194)/10000),0)),\"\")","v":"Acct 1881"},{"$f":"IFERROR(INDEX($B$2:$B$194,MATCH(LARGE(IF($A$2:$A$194=$E19,IF($C$2:$C$194>=LARGE(IF($A$2:$A$194=$E19,$C$2:$C$194),$F$3),$C$2:$C$194/(ROW($C$2:$C$194)/10000))),COLUMNS($F19:H19)),$C$2:$C$194/(ROW($C$2:$C$194)/10000),0)),\"\")","v":"Acct 2572"},{"$f":"IFERROR(INDEX($B$2:$B$194,MATCH(LARGE(IF($A$2:$A$194=$E19,IF($C$2:$C$194>=LARGE(IF($A$2:$A$194=$E19,$C$2:$C$194),$F$3),$C$2:$C$194/(ROW($C$2:$C$194)/10000))),COLUMNS($F19:I19)),$C$2:$C$194/(ROW($C$2:$C$194)/10000),0)),\"\")","v":""},null,null,{"$f":"IF(COLUMNS($L19:L19)>$F$3,\"\",INDEX($B$2:$B$194,SMALL(IF($A$2:$A$194=$E19,IF($C$2:$C$194>=LARGE(IF($A$2:$A$194=$E19,$C$2:$C$194),$F$3),ROW($B$2:$B$194)-ROW($B$2)+1)),COLUMNS($L19:L19))))","v":"Acct 7568"},{"$f":"IF(COLUMNS($L19:M19)>$F$3,\"\",INDEX($B$2:$B$194,SMALL(IF($A$2:$A$194=$E19,IF($C$2:$C$194>=LARGE(IF($A$2:$A$194=$E19,$C$2:$C$194),$F$3),ROW($B$2:$B$194)-ROW($B$2)+1)),COLUMNS($L19:M19))))","v":"Acct 1881"},{"$f":"IF(COLUMNS($L19:N19)>$F$3,\"\",INDEX($B$2:$B$194,SMALL(IF($A$2:$A$194=$E19,IF($C$2:$C$194>=LARGE(IF($A$2:$A$194=$E19,$C$2:$C$194),$F$3),ROW($B$2:$B$194)-ROW($B$2)+1)),COLUMNS($L19:N19))))","v":"Acct 2572"}]
["E","Acct 3149",72092.199651957693,null,"O",{"$f":"IFERROR(INDEX($B$2:$B$194,MATCH(LARGE(IF($A$2:$A$194=$E20,IF($C$2:$C$194>=LARGE(IF($A$2:$A$194=$E20,$C$2:$C$194),$F$3),$C$2:$C$194/(ROW($C$2:$C$194)/10000))),COLUMNS($F20:F20)),$C$2:$C$194/(ROW($C$2:$C$194)/10000),0)),\"\")","v":"Acct 2274"},{"$f":"IFERROR(INDEX($B$2:$B$194,MATCH(LARGE(IF($A$2:$A$194=$E20,IF($C$2:$C$194>=LARGE(IF($A$2:$A$194=$E20,$C$2:$C$194),$F$3),$C$2:$C$194/(ROW($C$2:$C$194)/10000))),COLUMNS($F20:G20)),$C$2:$C$194/(ROW($C$2:$C$194)/10000),0)),\"\")","v":"Acct 4857"},{"$f":"IFERROR(INDEX($B$2:$B$194,MATCH(LARGE(IF($A$2:$A$194=$E20,IF($C$2:$C$194>=LARGE(IF($A$2:$A$194=$E20,$C$2:$C$194),$F$3),$C$2:$C$194/(ROW($C$2:$C$194)/10000))),COLUMNS($F20:H20)),$C$2:$C$194/(ROW($C$2:$C$194)/10000),0)),\"\")","v":"Acct 3449"},{"$f":"IFERROR(INDEX($B$2:$B$194,MATCH(LARGE(IF($A$2:$A$194=$E20,IF($C$2:$C$194>=LARGE(IF($A$2:$A$194=$E20,$C$2:$C$194),$F$3),$C$2:$C$194/(ROW($C$2:$C$194)/10000))),COLUMNS($F20:I20)),$C$2:$C$194/(ROW($C$2:$C$194)/10000),0)),\"\")","v":""},null,null,{"$f":"IF(COLUMNS($L20:L20)>$F$3,\"\",INDEX($B$2:$B$194,SMALL(IF($A$2:$A$194=$E20,IF($C$2:$C$194>=LARGE(IF($A$2:$A$194=$E20,$C$2:$C$194),$F$3),ROW($B$2:$B$194)-ROW($B$2)+1)),COLUMNS($L20:L20))))","v":"Acct 2274"},{"$f":"IF(COLUMNS($L20:M20)>$F$3,\"\",INDEX($B$2:$B$194,SMALL(IF($A$2:$A$194=$E20,IF($C$2:$C$194>=LARGE(IF($A$2:$A$194=$E20,$C$2:$C$194),$F$3),ROW($B$2:$B$194)-ROW($B$2)+1)),COLUMNS($L20:M20))))","v":"Acct 4857"},{"$f":"IF(COLUMNS($L20:N20)>$F$3,\"\",INDEX($B$2:$B$194,SMALL(IF($A$2:$A$194=$E20,IF($C$2:$C$194>=LARGE(IF($A$2:$A$194=$E20,$C$2:$C$194),$F$3),ROW($B$2:$B$194)-ROW($B$2)+1)),COLUMNS($L20:N20))))","v":"Acct 3449"}]
["E","Acct 7662",65470.184284119059,null,"P",{"$f":"IFERROR(INDEX($B$2:$B$194,MATCH(LARGE(IF($A$2:$A$194=$E21,IF($C$2:$C$194>=LARGE(IF($A$2:$A$194=$E21,$C$2:$C$194),$F$3),$C$2:$C$194/(ROW($C$2:$C$194)/10000))),COLUMNS($F21:F21)),$C$2:$C$194/(ROW($C$2:$C$194)/10000),0)),\"\")","v":"Acct 7506"},{"$f":"IFERROR(INDEX($B$2:$B$194,MATCH(LARGE(IF($A$2:$A$194=$E21,IF($C$2:$C$194>=LARGE(IF($A$2:$A$194=$E21,$C$2:$C$194),$F$3),$C$2:$C$194/(ROW($C$2:$C$194)/10000))),COLUMNS($F21:G21)),$C$2:$C$194/(ROW($C$2:$C$194)/10000),0)),\"\")","v":"Acct 8246"},{"$f":"IFERROR(INDEX($B$2:$B$194,MATCH(LARGE(IF($A$2:$A$194=$E21,IF($C$2:$C$194>=LARGE(IF($A$2:$A$194=$E21,$C$2:$C$194),$F$3),$C$2:$C$194/(ROW($C$2:$C$194)/10000))),COLUMNS($F21:H21)),$C$2:$C$194/(ROW($C$2:$C$194)/10000),0)),\"\")","v":"Acct 7863"},{"$f":"IFERROR(INDEX($B$2:$B$194,MATCH(LARGE(IF($A$2:$A$194=$E21,IF($C$2:$C$194>=LARGE(IF($A$2:$A$194=$E21,$C$2:$C$194),$F$3),$C$2:$C$194/(ROW($C$2:$C$194)/10000))),COLUMNS($F21:I21)),$C$2:$C$194/(ROW($C$2:$C$194)/10000),0)),\"\")","v":""},null,null,{"$f":"IF(COLUMNS($L21:L21)>$F$3,\"\",INDEX($B$2:$B$194,SMALL(IF($A$2:$A$194=$E21,IF($C$2:$C$194>=LARGE(IF($A$2:$A$194=$E21,$C$2:$C$194),$F$3),ROW($B$2:$B$194)-ROW($B$2)+1)),COLUMNS($L21:L21))))","v":"Acct 7506"},{"$f":"IF(COLUMNS($L21:M21)>$F$3,\"\",INDEX($B$2:$B$194,SMALL(IF($A$2:$A$194=$E21,IF($C$2:$C$194>=LARGE(IF($A$2:$A$194=$E21,$C$2:$C$194),$F$3),ROW($B$2:$B$194)-ROW($B$2)+1)),COLUMNS($L21:M21))))","v":"Acct 8246"},{"$f":"IF(COLUMNS($L21:N21)>$F$3,\"\",INDEX($B$2:$B$194,SMALL(IF($A$2:$A$194=$E21,IF($C$2:$C$194>=LARGE(IF($A$2:$A$194=$E21,$C$2:$C$194),$F$3),ROW($B$2:$B$194)-ROW($B$2)+1)),COLUMNS($L21:N21))))","v":"Acct 7863"}]
["E","Acct 4289",64944.26296356738,null,"Q",{"$f":"IFERROR(INDEX($B$2:$B$194,MATCH(LARGE(IF($A$2:$A$194=$E22,IF($C$2:$C$194>=LARGE(IF($A$2:$A$194=$E22,$C$2:$C$194),$F$3),$C$2:$C$194/(ROW($C$2:$C$194)/10000))),COLUMNS($F22:F22)),$C$2:$C$194/(ROW($C$2:$C$194)/10000),0)),\"\")","v":"Acct 3599"},{"$f":"IFERROR(INDEX($B$2:$B$194,MATCH(LARGE(IF($A$2:$A$194=$E22,IF($C$2:$C$194>=LARGE(IF($A$2:$A$194=$E22,$C$2:$C$194),$F$3),$C$2:$C$194/(ROW($C$2:$C$194)/10000))),COLUMNS($F22:G22)),$C$2:$C$194/(ROW($C$2:$C$194)/10000),0)),\"\")","v":"Acct 1289"},{"$f":"IFERROR(INDEX($B$2:$B$194,MATCH(LARGE(IF($A$2:$A$194=$E22,IF($C$2:$C$194>=LARGE(IF($A$2:$A$194=$E22,$C$2:$C$194),$F$3),$C$2:$C$194/(ROW($C$2:$C$194)/10000))),COLUMNS($F22:H22)),$C$2:$C$194/(ROW($C$2:$C$194)/10000),0)),\"\")","v":"Acct 3068"},{"$f":"IFERROR(INDEX($B$2:$B$194,MATCH(LARGE(IF($A$2:$A$194=$E22,IF($C$2:$C$194>=LARGE(IF($A$2:$A$194=$E22,$C$2:$C$194),$F$3),$C$2:$C$194/(ROW($C$2:$C$194)/10000))),COLUMNS($F22:I22)),$C$2:$C$194/(ROW($C$2:$C$194)/10000),0)),\"\")","v":""},null,null,{"$f":"IF(COLUMNS($L22:L22)>$F$3,\"\",INDEX($B$2:$B$194,SMALL(IF($A$2:$A$194=$E22,IF($C$2:$C$194>=LARGE(IF($A$2:$A$194=$E22,$C$2:$C$194),$F$3),ROW($B$2:$B$194)-ROW($B$2)+1)),COLUMNS($L22:L22))))","v":"Acct 3599"},{"$f":"IF(COLUMNS($L22:M22)>$F$3,\"\",INDEX($B$2:$B$194,SMALL(IF($A$2:$A$194=$E22,IF($C$2:$C$194>=LARGE(IF($A$2:$A$194=$E22,$C$2:$C$194),$F$3),ROW($B$2:$B$194)-ROW($B$2)+1)),COLUMNS($L22:M22))))","v":"Acct 1289"},{"$f":"IF(COLUMNS($L22:N22)>$F$3,\"\",INDEX($B$2:$B$194,SMALL(IF($A$2:$A$194=$E22,IF($C$2:$C$194>=LARGE(IF($A$2:$A$194=$E22,$C$2:$C$194),$F$3),ROW($B$2:$B$194)-ROW($B$2)+1)),COLUMNS($L22:N22))))","v":"Acct 3068"}]
["E","Acct 7792",62998.694120045839,null,"R",{"$f":"IFERROR(INDEX($B$2:$B$194,MATCH(LARGE(IF($A$2:$A$194=$E23,IF($C$2:$C$194>=LARGE(IF($A$2:$A$194=$E23,$C$2:$C$194),$F$3),$C$2:$C$194/(ROW($C$2:$C$194)/10000))),COLUMNS($F23:F23)),$C$2:$C$194/(ROW($C$2:$C$194)/10000),0)),\"\")","v":"Acct 4164"},{"$f":"IFERROR(INDEX($B$2:$B$194,MATCH(LARGE(IF($A$2:$A$194=$E23,IF($C$2:$C$194>=LARGE(IF($A$2:$A$194=$E23,$C$2:$C$194),$F$3),$C$2:$C$194/(ROW($C$2:$C$194)/10000))),COLUMNS($F23:G23)),$C$2:$C$194/(ROW($C$2:$C$194)/10000),0)),\"\")","v":"Acct 7397"},{"$f":"IFERROR(INDEX($B$2:$B$194,MATCH(LARGE(IF($A$2:$A$194=$E23,IF($C$2:$C$194>=LARGE(IF($A$2:$A$194=$E23,$C$2:$C$194),$F$3),$C$2:$C$194/(ROW($C$2:$C$194)/10000))),COLUMNS($F23:H23)),$C$2:$C$194/(ROW($C$2:$C$194)/10000),0)),\"\")","v":"Acct 6023"},{"$f":"IFERROR(INDEX($B$2:$B$194,MATCH(LARGE(IF($A$2:$A$194=$E23,IF($C$2:$C$194>=LARGE(IF($A$2:$A$194=$E23,$C$2:$C$194),$F$3),$C$2:$C$194/(ROW($C$2:$C$194)/10000))),COLUMNS($F23:I23)),$C$2:$C$194/(ROW($C$2:$C$194)/10000),0)),\"\")","v":""},null,null,{"$f":"IF(COLUMNS($L23:L23)>$F$3,\"\",INDEX($B$2:$B$194,SMALL(IF($A$2:$A$194=$E23,IF($C$2:$C$194>=LARGE(IF($A$2:$A$194=$E23,$C$2:$C$194),$F$3),ROW($B$2:$B$194)-ROW($B$2)+1)),COLUMNS($L23:L23))))","v":"Acct 4164"},{"$f":"IF(COLUMNS($L23:M23)>$F$3,\"\",INDEX($B$2:$B$194,SMALL(IF($A$2:$A$194=$E23,IF($C$2:$C$194>=LARGE(IF($A$2:$A$194=$E23,$C$2:$C$194),$F$3),ROW($B$2:$B$194)-ROW($B$2)+1)),COLUMNS($L23:M23))))","v":"Acct 7397"},{"$f":"IF(COLUMNS($L23:N23)>$F$3,\"\",INDEX($B$2:$B$194,SMALL(IF($A$2:$A$194=$E23,IF($C$2:$C$194>=LARGE(IF($A$2:$A$194=$E23,$C$2:$C$194),$F$3),ROW($B$2:$B$194)-ROW($B$2)+1)),COLUMNS($L23:N23))))","v":"Acct 6023"}]
["E","Acct 5617",62734.08329937575,null,"S",{"$f":"IFERROR(INDEX($B$2:$B$194,MATCH(LARGE(IF($A$2:$A$194=$E24,IF($C$2:$C$194>=LARGE(IF($A$2:$A$194=$E24,$C$2:$C$194),$F$3),$C$2:$C$194/(ROW($C$2:$C$194)/10000))),COLUMNS($F24:F24)),$C$2:$C$194/(ROW($C$2:$C$194)/10000),0)),\"\")","v":"Acct 2814"},{"$f":"IFERROR(INDEX($B$2:$B$194,MATCH(LARGE(IF($A$2:$A$194=$E24,IF($C$2:$C$194>=LARGE(IF($A$2:$A$194=$E24,$C$2:$C$194),$F$3),$C$2:$C$194/(ROW($C$2:$C$194)/10000))),COLUMNS($F24:G24)),$C$2:$C$194/(ROW($C$2:$C$194)/10000),0)),\"\")","v":"Acct 4150"},{"$f":"IFERROR(INDEX($B$2:$B$194,MATCH(LARGE(IF($A$2:$A$194=$E24,IF($C$2:$C$194>=LARGE(IF($A$2:$A$194=$E24,$C$2:$C$194),$F$3),$C$2:$C$194/(ROW($C$2:$C$194)/10000))),COLUMNS($F24:H24)),$C$2:$C$194/(ROW($C$2:$C$194)/10000),0)),\"\")","v":"Acct 8643"},{"$f":"IFERROR(INDEX($B$2:$B$194,MATCH(LARGE(IF($A$2:$A$194=$E24,IF($C$2:$C$194>=LARGE(IF($A$2:$A$194=$E24,$C$2:$C$194),$F$3),$C$2:$C$194/(ROW($C$2:$C$194)/10000))),COLUMNS($F24:I24)),$C$2:$C$194/(ROW($C$2:$C$194)/10000),0)),\"\")","v":""},null,null,{"$f":"IF(COLUMNS($L24:L24)>$F$3,\"\",INDEX($B$2:$B$194,SMALL(IF($A$2:$A$194=$E24,IF($C$2:$C$194>=LARGE(IF($A$2:$A$194=$E24,$C$2:$C$194),$F$3),ROW($B$2:$B$194)-ROW($B$2)+1)),COLUMNS($L24:L24))))","v":"Acct 2814"},{"$f":"IF(COLUMNS($L24:M24)>$F$3,\"\",INDEX($B$2:$B$194,SMALL(IF($A$2:$A$194=$E24,IF($C$2:$C$194>=LARGE(IF($A$2:$A$194=$E24,$C$2:$C$194),$F$3),ROW($B$2:$B$194)-ROW($B$2)+1)),COLUMNS($L24:M24))))","v":"Acct 4150"},{"$f":"IF(COLUMNS($L24:N24)>$F$3,\"\",INDEX($B$2:$B$194,SMALL(IF($A$2:$A$194=$E24,IF($C$2:$C$194>=LARGE(IF($A$2:$A$194=$E24,$C$2:$C$194),$F$3),ROW($B$2:$B$194)-ROW($B$2)+1)),COLUMNS($L24:N24))))","v":"Acct 8643"}]
["E","Acct 7210",50013.311746072031,null,"T",{"$f":"IFERROR(INDEX($B$2:$B$194,MATCH(LARGE(IF($A$2:$A$194=$E25,IF($C$2:$C$194>=LARGE(IF($A$2:$A$194=$E25,$C$2:$C$194),$F$3),$C$2:$C$194/(ROW($C$2:$C$194)/10000))),COLUMNS($F25:F25)),$C$2:$C$194/(ROW($C$2:$C$194)/10000),0)),\"\")","v":"Acct 2211"},{"$f":"IFERROR(INDEX($B$2:$B$194,MATCH(LARGE(IF($A$2:$A$194=$E25,IF($C$2:$C$194>=LARGE(IF($A$2:$A$194=$E25,$C$2:$C$194),$F$3),$C$2:$C$194/(ROW($C$2:$C$194)/10000))),COLUMNS($F25:G25)),$C$2:$C$194/(ROW($C$2:$C$194)/10000),0)),\"\")","v":"Acct 7416"},{"$f":"IFERROR(INDEX($B$2:$B$194,MATCH(LARGE(IF($A$2:$A$194=$E25,IF($C$2:$C$194>=LARGE(IF($A$2:$A$194=$E25,$C$2:$C$194),$F$3),$C$2:$C$194/(ROW($C$2:$C$194)/10000))),COLUMNS($F25:H25)),$C$2:$C$194/(ROW($C$2:$C$194)/10000),0)),\"\")","v":"Acct 4526"},{"$f":"IFERROR(INDEX($B$2:$B$194,MATCH(LARGE(IF($A$2:$A$194=$E25,IF($C$2:$C$194>=LARGE(IF($A$2:$A$194=$E25,$C$2:$C$194),$F$3),$C$2:$C$194/(ROW($C$2:$C$194)/10000))),COLUMNS($F25:I25)),$C$2:$C$194/(ROW($C$2:$C$194)/10000),0)),\"\")","v":""},null,null,{"$f":"IF(COLUMNS($L25:L25)>$F$3,\"\",INDEX($B$2:$B$194,SMALL(IF($A$2:$A$194=$E25,IF($C$2:$C$194>=LARGE(IF($A$2:$A$194=$E25,$C$2:$C$194),$F$3),ROW($B$2:$B$194)-ROW($B$2)+1)),COLUMNS($L25:L25))))","v":"Acct 2211"},{"$f":"IF(COLUMNS($L25:M25)>$F$3,\"\",INDEX($B$2:$B$194,SMALL(IF($A$2:$A$194=$E25,IF($C$2:$C$194>=LARGE(IF($A$2:$A$194=$E25,$C$2:$C$194),$F$3),ROW($B$2:$B$194)-ROW($B$2)+1)),COLUMNS($L25:M25))))","v":"Acct 7416"},{"$f":"IF(COLUMNS($L25:N25)>$F$3,\"\",INDEX($B$2:$B$194,SMALL(IF($A$2:$A$194=$E25,IF($C$2:$C$194>=LARGE(IF($A$2:$A$194=$E25,$C$2:$C$194),$F$3),ROW($B$2:$B$194)-ROW($B$2)+1)),COLUMNS($L25:N25))))","v":"Acct 4526"}]
["E","Acct 4341",39233.444282046439,null,"U",{"$f":"IFERROR(INDEX($B$2:$B$194,MATCH(LARGE(IF($A$2:$A$194=$E26,IF($C$2:$C$194>=LARGE(IF($A$2:$A$194=$E26,$C$2:$C$194),$F$3),$C$2:$C$194/(ROW($C$2:$C$194)/10000))),COLUMNS($F26:F26)),$C$2:$C$194/(ROW($C$2:$C$194)/10000),0)),\"\")","v":"Acct 6175"},{"$f":"IFERROR(INDEX($B$2:$B$194,MATCH(LARGE(IF($A$2:$A$194=$E26,IF($C$2:$C$194>=LARGE(IF($A$2:$A$194=$E26,$C$2:$C$194),$F$3),$C$2:$C$194/(ROW($C$2:$C$194)/10000))),COLUMNS($F26:G26)),$C$2:$C$194/(ROW($C$2:$C$194)/10000),0)),\"\")","v":"Acct 3099"},{"$f":"IFERROR(INDEX($B$2:$B$194,MATCH(LARGE(IF($A$2:$A$194=$E26,IF($C$2:$C$194>=LARGE(IF($A$2:$A$194=$E26,$C$2:$C$194),$F$3),$C$2:$C$194/(ROW($C$2:$C$194)/10000))),COLUMNS($F26:H26)),$C$2:$C$194/(ROW($C$2:$C$194)/10000),0)),\"\")","v":"Acct 3368"},{"$f":"IFERROR(INDEX($B$2:$B$194,MATCH(LARGE(IF($A$2:$A$194=$E26,IF($C$2:$C$194>=LARGE(IF($A$2:$A$194=$E26,$C$2:$C$194),$F$3),$C$2:$C$194/(ROW($C$2:$C$194)/10000))),COLUMNS($F26:I26)),$C$2:$C$194/(ROW($C$2:$C$194)/10000),0)),\"\")","v":""},null,null,{"$f":"IF(COLUMNS($L26:L26)>$F$3,\"\",INDEX($B$2:$B$194,SMALL(IF($A$2:$A$194=$E26,IF($C$2:$C$194>=LARGE(IF($A$2:$A$194=$E26,$C$2:$C$194),$F$3),ROW($B$2:$B$194)-ROW($B$2)+1)),COLUMNS($L26:L26))))","v":"Acct 6175"},{"$f":"IF(COLUMNS($L26:M26)>$F$3,\"\",INDEX($B$2:$B$194,SMALL(IF($A$2:$A$194=$E26,IF($C$2:$C$194>=LARGE(IF($A$2:$A$194=$E26,$C$2:$C$194),$F$3),ROW($B$2:$B$194)-ROW($B$2)+1)),COLUMNS($L26:M26))))","v":"Acct 3099"},{"$f":"IF(COLUMNS($L26:N26)>$F$3,\"\",INDEX($B$2:$B$194,SMALL(IF($A$2:$A$194=$E26,IF($C$2:$C$194>=LARGE(IF($A$2:$A$194=$E26,$C$2:$C$194),$F$3),ROW($B$2:$B$194)-ROW($B$2)+1)),COLUMNS($L26:N26))))","v":"Acct 3368"}]
["E","Acct 6062",29832.458673877827,null,"V",{"$f":"IFERROR(INDEX($B$2:$B$194,MATCH(LARGE(IF($A$2:$A$194=$E27,IF($C$2:$C$194>=LARGE(IF($A$2:$A$194=$E27,$C$2:$C$194),$F$3),$C$2:$C$194/(ROW($C$2:$C$194)/10000))),COLUMNS($F27:F27)),$C$2:$C$194/(ROW($C$2:$C$194)/10000),0)),\"\")","v":"Acct 2893"},{"$f":"IFERROR(INDEX($B$2:$B$194,MATCH(LARGE(IF($A$2:$A$194=$E27,IF($C$2:$C$194>=LARGE(IF($A$2:$A$194=$E27,$C$2:$C$194),$F$3),$C$2:$C$194/(ROW($C$2:$C$194)/10000))),COLUMNS($F27:G27)),$C$2:$C$194/(ROW($C$2:$C$194)/10000),0)),\"\")","v":"Acct 6058"},{"$f":"IFERROR(INDEX($B$2:$B$194,MATCH(LARGE(IF($A$2:$A$194=$E27,IF($C$2:$C$194>=LARGE(IF($A$2:$A$194=$E27,$C$2:$C$194),$F$3),$C$2:$C$194/(ROW($C$2:$C$194)/10000))),COLUMNS($F27:H27)),$C$2:$C$194/(ROW($C$2:$C$194)/10000),0)),\"\")","v":"Acct 8919"},{"$f":"IFERROR(INDEX($B$2:$B$194,MATCH(LARGE(IF($A$2:$A$194=$E27,IF($C$2:$C$194>=LARGE(IF($A$2:$A$194=$E27,$C$2:$C$194),$F$3),$C$2:$C$194/(ROW($C$2:$C$194)/10000))),COLUMNS($F27:I27)),$C$2:$C$194/(ROW($C$2:$C$194)/10000),0)),\"\")","v":""},null,null,{"$f":"IF(COLUMNS($L27:L27)>$F$3,\"\",INDEX($B$2:$B$194,SMALL(IF($A$2:$A$194=$E27,IF($C$2:$C$194>=LARGE(IF($A$2:$A$194=$E27,$C$2:$C$194),$F$3),ROW($B$2:$B$194)-ROW($B$2)+1)),COLUMNS($L27:L27))))","v":"Acct 2893"},{"$f":"IF(COLUMNS($L27:M27)>$F$3,\"\",INDEX($B$2:$B$194,SMALL(IF($A$2:$A$194=$E27,IF($C$2:$C$194>=LARGE(IF($A$2:$A$194=$E27,$C$2:$C$194),$F$3),ROW($B$2:$B$194)-ROW($B$2)+1)),COLUMNS($L27:M27))))","v":"Acct 6058"},{"$f":"IF(COLUMNS($L27:N27)>$F$3,\"\",INDEX($B$2:$B$194,SMALL(IF($A$2:$A$194=$E27,IF($C$2:$C$194>=LARGE(IF($A$2:$A$194=$E27,$C$2:$C$194),$F$3),ROW($B$2:$B$194)-ROW($B$2)+1)),COLUMNS($L27:N27))))","v":"Acct 8919"}]
["E","Acct 1364",17251.793375353474,null,"W",{"$f":"IFERROR(INDEX($B$2:$B$194,MATCH(LARGE(IF($A$2:$A$194=$E28,IF($C$2:$C$194>=LARGE(IF($A$2:$A$194=$E28,$C$2:$C$194),$F$3),$C$2:$C$194/(ROW($C$2:$C$194)/10000))),COLUMNS($F28:F28)),$C$2:$C$194/(ROW($C$2:$C$194)/10000),0)),\"\")","v":"Acct 5113"},{"$f":"IFERROR(INDEX($B$2:$B$194,MATCH(LARGE(IF($A$2:$A$194=$E28,IF($C$2:$C$194>=LARGE(IF($A$2:$A$194=$E28,$C$2:$C$194),$F$3),$C$2:$C$194/(ROW($C$2:$C$194)/10000))),COLUMNS($F28:G28)),$C$2:$C$194/(ROW($C$2:$C$194)/10000),0)),\"\")","v":"Acct 3607"},{"$f":"IFERROR(INDEX($B$2:$B$194,MATCH(LARGE(IF($A$2:$A$194=$E28,IF($C$2:$C$194>=LARGE(IF($A$2:$A$194=$E28,$C$2:$C$194),$F$3),$C$2:$C$194/(ROW($C$2:$C$194)/10000))),COLUMNS($F28:H28)),$C$2:$C$194/(ROW($C$2:$C$194)/10000),0)),\"\")","v":"Acct 5655"},{"$f":"IFERROR(INDEX($B$2:$B$194,MATCH(LARGE(IF($A$2:$A$194=$E28,IF($C$2:$C$194>=LARGE(IF($A$2:$A$194=$E28,$C$2:$C$194),$F$3),$C$2:$C$194/(ROW($C$2:$C$194)/10000))),COLUMNS($F28:I28)),$C$2:$C$194/(ROW($C$2:$C$194)/10000),0)),\"\")","v":""},null,null,{"$f":"IF(COLUMNS($L28:L28)>$F$3,\"\",INDEX($B$2:$B$194,SMALL(IF($A$2:$A$194=$E28,IF($C$2:$C$194>=LARGE(IF($A$2:$A$194=$E28,$C$2:$C$194),$F$3),ROW($B$2:$B$194)-ROW($B$2)+1)),COLUMNS($L28:L28))))","v":"Acct 5113"},{"$f":"IF(COLUMNS($L28:M28)>$F$3,\"\",INDEX($B$2:$B$194,SMALL(IF($A$2:$A$194=$E28,IF($C$2:$C$194>=LARGE(IF($A$2:$A$194=$E28,$C$2:$C$194),$F$3),ROW($B$2:$B$194)-ROW($B$2)+1)),COLUMNS($L28:M28))))","v":"Acct 3607"},{"$f":"IF(COLUMNS($L28:N28)>$F$3,\"\",INDEX($B$2:$B$194,SMALL(IF($A$2:$A$194=$E28,IF($C$2:$C$194>=LARGE(IF($A$2:$A$194=$E28,$C$2:$C$194),$F$3),ROW($B$2:$B$194)-ROW($B$2)+1)),COLUMNS($L28:N28))))","v":"Acct 5655"}]
["E","Acct 5119",10396.892563135962,null,"X",{"$f":"IFERROR(INDEX($B$2:$B$194,MATCH(LARGE(IF($A$2:$A$194=$E29,IF($C$2:$C$194>=LARGE(IF($A$2:$A$194=$E29,$C$2:$C$194),$F$3),$C$2:$C$194/(ROW($C$2:$C$194)/10000))),COLUMNS($F29:F29)),$C$2:$C$194/(ROW($C$2:$C$194)/10000),0)),\"\")","v":"Acct 1468"},{"$f":"IFERROR(INDEX($B$2:$B$194,MATCH(LARGE(IF($A$2:$A$194=$E29,IF($C$2:$C$194>=LARGE(IF($A$2:$A$194=$E29,$C$2:$C$194),$F$3),$C$2:$C$194/(ROW($C$2:$C$194)/10000))),COLUMNS($F29:G29)),$C$2:$C$194/(ROW($C$2:$C$194)/10000),0)),\"\")","v":"Acct 8421"},{"$f":"IFERROR(INDEX($B$2:$B$194,MATCH(LARGE(IF($A$2:$A$194=$E29,IF($C$2:$C$194>=LARGE(IF($A$2:$A$194=$E29,$C$2:$C$194),$F$3),$C$2:$C$194/(ROW($C$2:$C$194)/10000))),COLUMNS($F29:H29)),$C$2:$C$194/(ROW($C$2:$C$194)/10000),0)),\"\")","v":"Acct 5176"},{"$f":"IFERROR(INDEX($B$2:$B$194,MATCH(LARGE(IF($A$2:$A$194=$E29,IF($C$2:$C$194>=LARGE(IF($A$2:$A$194=$E29,$C$2:$C$194),$F$3),$C$2:$C$194/(ROW($C$2:$C$194)/10000))),COLUMNS($F29:I29)),$C$2:$C$194/(ROW($C$2:$C$194)/10000),0)),\"\")","v":""},null,null,{"$f":"IF(COLUMNS($L29:L29)>$F$3,\"\",INDEX($B$2:$B$194,SMALL(IF($A$2:$A$194=$E29,IF($C$2:$C$194>=LARGE(IF($A$2:$A$194=$E29,$C$2:$C$194),$F$3),ROW($B$2:$B$194)-ROW($B$2)+1)),COLUMNS($L29:L29))))","v":"Acct 1468"},{"$f":"IF(COLUMNS($L29:M29)>$F$3,\"\",INDEX($B$2:$B$194,SMALL(IF($A$2:$A$194=$E29,IF($C$2:$C$194>=LARGE(IF($A$2:$A$194=$E29,$C$2:$C$194),$F$3),ROW($B$2:$B$194)-ROW($B$2)+1)),COLUMNS($L29:M29))))","v":"Acct 8421"},{"$f":"IF(COLUMNS($L29:N29)>$F$3,\"\",INDEX($B$2:$B$194,SMALL(IF($A$2:$A$194=$E29,IF($C$2:$C$194>=LARGE(IF($A$2:$A$194=$E29,$C$2:$C$194),$F$3),ROW($B$2:$B$194)-ROW($B$2)+1)),COLUMNS($L29:N29))))","v":"Acct 5176"}]
["F","Acct 3626",83709.062277228455,null,"Y",{"$f":"IFERROR(INDEX($B$2:$B$194,MATCH(LARGE(IF($A$2:$A$194=$E30,IF($C$2:$C$194>=LARGE(IF($A$2:$A$194=$E30,$C$2:$C$194),$F$3),$C$2:$C$194/(ROW($C$2:$C$194)/10000))),COLUMNS($F30:F30)),$C$2:$C$194/(ROW($C$2:$C$194)/10000),0)),\"\")","v":"Acct 6120"},{"$f":"IFERROR(INDEX($B$2:$B$194,MATCH(LARGE(IF($A$2:$A$194=$E30,IF($C$2:$C$194>=LARGE(IF($A$2:$A$194=$E30,$C$2:$C$194),$F$3),$C$2:$C$194/(ROW($C$2:$C$194)/10000))),COLUMNS($F30:G30)),$C$2:$C$194/(ROW($C$2:$C$194)/10000),0)),\"\")","v":"Acct 8634"},{"$f":"IFERROR(INDEX($B$2:$B$194,MATCH(LARGE(IF($A$2:$A$194=$E30,IF($C$2:$C$194>=LARGE(IF($A$2:$A$194=$E30,$C$2:$C$194),$F$3),$C$2:$C$194/(ROW($C$2:$C$194)/10000))),COLUMNS($F30:H30)),$C$2:$C$194/(ROW($C$2:$C$194)/10000),0)),\"\")","v":"Acct 2377"},{"$f":"IFERROR(INDEX($B$2:$B$194,MATCH(LARGE(IF($A$2:$A$194=$E30,IF($C$2:$C$194>=LARGE(IF($A$2:$A$194=$E30,$C$2:$C$194),$F$3),$C$2:$C$194/(ROW($C$2:$C$194)/10000))),COLUMNS($F30:I30)),$C$2:$C$194/(ROW($C$2:$C$194)/10000),0)),\"\")","v":""},null,null,{"$f":"IF(COLUMNS($L30:L30)>$F$3,\"\",INDEX($B$2:$B$194,SMALL(IF($A$2:$A$194=$E30,IF($C$2:$C$194>=LARGE(IF($A$2:$A$194=$E30,$C$2:$C$194),$F$3),ROW($B$2:$B$194)-ROW($B$2)+1)),COLUMNS($L30:L30))))","v":"Acct 6120"},{"$f":"IF(COLUMNS($L30:M30)>$F$3,\"\",INDEX($B$2:$B$194,SMALL(IF($A$2:$A$194=$E30,IF($C$2:$C$194>=LARGE(IF($A$2:$A$194=$E30,$C$2:$C$194),$F$3),ROW($B$2:$B$194)-ROW($B$2)+1)),COLUMNS($L30:M30))))","v":"Acct 8634"},{"$f":"IF(COLUMNS($L30:N30)>$F$3,\"\",INDEX($B$2:$B$194,SMALL(IF($A$2:$A$194=$E30,IF($C$2:$C$194>=LARGE(IF($A$2:$A$194=$E30,$C$2:$C$194),$F$3),ROW($B$2:$B$194)-ROW($B$2)+1)),COLUMNS($L30:N30))))","v":"Acct 2377"}]
["F","Acct 7853",67756.829240491483,null,"Z",{"$f":"IF(COLUMNS($F31:F31)>SUM(($A$2:$A$194=$E31)*($C$2:$C$194>=LARGE(IF($A$2:$A$194=$E31,$C$2:$C$194),$F$3))),\"\",INDEX($B$2:$B$194,SMALL(IF($A$2:$A$194=$E31,IF($C$2:$C$194=LARGE(IF($A$2:$A$194=$E31,$C$2:$C$194),COLUMNS($F31:F31)),ROW($B$2:$B$194)-ROW($B$2)+1)),SUM(1*(LARGE(IF($A$2:$A$194=$E31,$C$2:$C$194),ROW(INDIRECT(\"1:\"&COLUMNS($F31:F31))))=LARGE(IF($A$2:$A$194=$E31,$C$2:$C$194),COLUMNS($F31:F31)))))))","v":"Acct 7408"},{"$f":"IF(COLUMNS($F31:G31)>SUM(($A$2:$A$194=$E31)*($C$2:$C$194>=LARGE(IF($A$2:$A$194=$E31,$C$2:$C$194),$F$3))),\"\",INDEX($B$2:$B$194,SMALL(IF($A$2:$A$194=$E31,IF($C$2:$C$194=LARGE(IF($A$2:$A$194=$E31,$C$2:$C$194),COLUMNS($F31:G31)),ROW($B$2:$B$194)-ROW($B$2)+1)),SUM(1*(LARGE(IF($A$2:$A$194=$E31,$C$2:$C$194),ROW(INDIRECT(\"1:\"&COLUMNS($F31:G31))))=LARGE(IF($A$2:$A$194=$E31,$C$2:$C$194),COLUMNS($F31:G31)))))))","v":"Acct 2468"},{"$f":"IF(COLUMNS($F31:H31)>SUM(($A$2:$A$194=$E31)*($C$2:$C$194>=LARGE(IF($A$2:$A$194=$E31,$C$2:$C$194),$F$3))),\"\",INDEX($B$2:$B$194,SMALL(IF($A$2:$A$194=$E31,IF($C$2:$C$194=LARGE(IF($A$2:$A$194=$E31,$C$2:$C$194),COLUMNS($F31:H31)),ROW($B$2:$B$194)-ROW($B$2)+1)),SUM(1*(LARGE(IF($A$2:$A$194=$E31,$C$2:$C$194),ROW(INDIRECT(\"1:\"&COLUMNS($F31:H31))))=LARGE(IF($A$2:$A$194=$E31,$C$2:$C$194),COLUMNS($F31:H31)))))))","v":"Acct 6122"},{"$f":"IF(COLUMNS($F31:I31)>SUM(($A$2:$A$194=$E31)*($C$2:$C$194>=LARGE(IF($A$2:$A$194=$E31,$C$2:$C$194),$F$3))),\"\",INDEX($B$2:$B$194,SMALL(IF($A$2:$A$194=$E31,IF($C$2:$C$194=LARGE(IF($A$2:$A$194=$E31,$C$2:$C$194),COLUMNS($F31:I31)),ROW($B$2:$B$194)-ROW($B$2)+1)),SUM(1*(LARGE(IF($A$2:$A$194=$E31,$C$2:$C$194),ROW(INDIRECT(\"1:\"&COLUMNS($F31:I31))))=LARGE(IF($A$2:$A$194=$E31,$C$2:$C$194),COLUMNS($F31:I31)))))))","v":""},null,null,{"$f":"IF(COLUMNS($L31:L31)>$F$3,\"\",INDEX($B$2:$B$194,SMALL(IF($A$2:$A$194=$E31,IF($C$2:$C$194>=LARGE(IF($A$2:$A$194=$E31,$C$2:$C$194),$F$3),ROW($B$2:$B$194)-ROW($B$2)+1)),COLUMNS($L31:L31))))","v":"Acct 7408"},{"$f":"IF(COLUMNS($L31:M31)>$F$3,\"\",INDEX($B$2:$B$194,SMALL(IF($A$2:$A$194=$E31,IF($C$2:$C$194>=LARGE(IF($A$2:$A$194=$E31,$C$2:$C$194),$F$3),ROW($B$2:$B$194)-ROW($B$2)+1)),COLUMNS($L31:M31))))","v":"Acct 2468"},{"$f":"IF(COLUMNS($L31:N31)>$F$3,\"\",INDEX($B$2:$B$194,SMALL(IF($A$2:$A$194=$E31,IF($C$2:$C$194>=LARGE(IF($A$2:$A$194=$E31,$C$2:$C$194),$F$3),ROW($B$2:$B$194)-ROW($B$2)+1)),COLUMNS($L31:N31))))","v":"Acct 6122"}]
["F","Acct 6976",59664.026927225699]
["F","Acct 5891",48310.794809471889]
["F","Acct 7434",43426.488050126041]
["F","Acct 1805",20969.511691952881]
["F","Acct 3479",2233.0877044513641]
["G","Acct 4572",98032.383611700527]
["G","Acct 3463",78194.091269626821]
["G","Acct 4202",76665.750257587832]
["G","Acct 6885",56257.227525234288]
["G","Acct 6445",40864.926055360163]
["G","Acct 5336",6883.7709958614932]
["H","Acct 7000",95458.07830050755]
["H","Acct 3609",89821.418741519999]
["H","Acct 4633",89361.942591034429]
["H","Acct 3846",86798.501207525958]
["H","Acct 1067",43392.063969875504]
["H","Acct 5766",24277.339010315001]
["H","Acct 2003",20094.052456190082]
["H","Acct 6171",19433.15046207772]
["H","Acct 3929",7789.3703568382207]
["H","Acct 8365",3466.3045130392866]
["H","Acct 8318",1854.4621656475856]
["H","Acct 5742",68.401019163055736]
["I","Acct 2335",96986.478946464005]
["I","Acct 7761",94931.171086085713]
["I","Acct 7297",90699.261858278114]
["I","Acct 5300",87789.328269525518]
["I","Acct 3853",86204.595435424795]
["I","Acct 1079",74531.421535208792]
["I","Acct 4623",74069.427022633623]
["I","Acct 2401",66564.803428470259]
["I","Acct 5360",53569.205169452172]
["I","Acct 8371",23389.143038519091]
["I","Acct 2234",12050.678952141358]
["J","Acct 6172",93547.891564467995]
["J","Acct 4394",88084.334500708588]
["J","Acct 7933",87655.308899984651]
["J","Acct 7673",82293.104880033716]
["J","Acct 8868",81510.467506900051]
["J","Acct 1385",69549.267947399916]
["J","Acct 1353",64993.578410125861]
["J","Acct 3839",62790.980512658687]
["J","Acct 7937",37230.676759181959]
["J","Acct 3572",27859.12782444404]
["J","Acct 8285",16955.51182875994]
["J","Acct 4583",9687.6331415009954]
["K","Acct 7565",84888.3557188181]
["K","Acct 6510",70681.601631156314]
["K","Acct 6891",59407.130969918151]
["K","Acct 2455",56457.318323541193]
["K","Acct 5001",37382.501380440444]
["L","Acct 8898",98419.82694628532]
["L","Acct 8210",72573.353135136334]
["L","Acct 8361",57832.389120664964]
["L","Acct 8038",41764.529772309797]
["L","Acct 3155",33360.942138445571]
["L","Acct 5975",10963.989377962658]
["L","Acct 3693",5145.0679813428878]
["M","Acct 1839",93012.868685983034]
["M","Acct 8666",89585.223662240242]
["M","Acct 5486",83186.624258868935]
["M","Acct 7791",71962.025844609889]
["M","Acct 7844",70209.460628448345]
["M","Acct 3951",65416.931332410903]
["M","Acct 5535",59374.365818534447]
["M","Acct 5922",53247.285606027915]
["M","Acct 1928",53083.049022911968]
["M","Acct 1489",30363.21523896942]
["M","Acct 2671",19973.06971246413]
["M","Acct 8409",18684.296007320787]
["M","Acct 1029",12275.341687067708]
["M","Acct 5378",5989.472665921614]
["N","Acct 7568",75958.520399238434]
["N","Acct 1881",68036.179783628075]
["N","Acct 2572",35387.666055635462]
["N","Acct 6471",26247.804740380965]
["N","Acct 3287",16958.805359766848]
["N","Acct 5385",16270.326629001696]
["N","Acct 6968",3441.5438593462522]
["O","Acct 2274",98826.453609775665]
["O","Acct 4857",80257.656503568927]
["O","Acct 3449",42019.850448222431]
["O","Acct 8704",28612.064572513373]
["O","Acct 3511",28534.865024923994]
["P","Acct 7506",98371.957216768133]
["P","Acct 8246",85292.137879763279]
["P","Acct 7863",85194.239646258648]
["P","Acct 1457",81855.218059321414]
["P","Acct 2682",47153.535610922416]
["P","Acct 8012",42087.342515283024]
["P","Acct 2752",41447.981980571625]
["P","Acct 6769",37767.112763393619]
["P","Acct 3180",13917.201059140294]
["Q","Acct 3599",83535.147175419741]
["Q","Acct 1289",44824.408958438311]
["Q","Acct 3068",31145.337098534397]
["Q","Acct 1496",14932.955485635446]
["R","Acct 4164",88970.843076139776]
["R","Acct 7397",85708.50929882683]
["R","Acct 6023",74273.508848181009]
["R","Acct 4100",43672.911787917968]
["R","Acct 8152",36607.047572390074]
["R","Acct 7092",29185.529257034559]
["R","Acct 2588",25304.69252127334]
["R","Acct 4783",7744.3144514072856]
["S","Acct 2814",76834.025919695297]
["S","Acct 4150",56289.341835275176]
["S","Acct 8643",47809.554028744547]
["S","Acct 6269",41921.984416262072]
["S","Acct 1034",34929.233956985816]
["S","Acct 8653",30915.561620566979]
["S","Acct 1315",6428.7769890917998]
["T","Acct 2211",77993.273405303655]
["T","Acct 7416",52875.38074087417]
["T","Acct 4526",34201.873974298614]
["T","Acct 6104",34131.139663162045]
["T","Acct 8943",18023.937649358435]
["T","Acct 1804",11937.654793067864]
["T","Acct 7464",11534.378379106869]
["T","Acct 2776",10598.165394744552]
["U","Acct 6175",94460.225887369714]
["U","Acct 3099",69380.535860821517]
["U","Acct 3368",50397.749597289985]
["U","Acct 4996",27407.916767624385]
["U","Acct 5124",20942.261918338823]
["U","Acct 1799",19966.876355848693]
["V","Acct 2893",90009.426074220391]
["V","Acct 6058",89086.219281350044]
["V","Acct 8919",80698.698876596623]
["V","Acct 3637",77526.661323302294]
["V","Acct 7968",76227.680486931786]
["V","Acct 6752",72064.545259473292]
["V","Acct 5203",69539.252716050803]
["V","Acct 4579",51261.581782236441]
["V","Acct 2607",44606.242804784924]
["V","Acct 6361",35569.629642003863]
["W","Acct 5113",84485.285822197315]
["W","Acct 3607",84196.837223824099]
["W","Acct 5655",83233.555443191712]
["W","Acct 5177",60065.297803779948]
["W","Acct 7776",56415.591684292442]
["W","Acct 8156",28647.069512270285]
["W","Acct 4708",22122.262555228601]
["W","Acct 1970",17766.844024179351]
["W","Acct 8513",13218.842175105949]
["X","Acct 1468",96875.666033515285]
["X","Acct 8421",91985.651518750223]
["X","Acct 5176",67364.968983625469]
["X","Acct 5243",39771.947012448916]
["Y","Acct 6120",67790.265221296489]
["Y","Acct 8634",54469.545793770703]
["Y","Acct 2377",36832.298898686]
["Y","Acct 2318",23587.42117057553]
["Y","Acct 5888",6870.4628633050379]
["Z","Acct 7408",99579.82654280118]
["Z","Acct 2468",82730.192313480526]
["Z","Acct 6122",80274.179806068685]
["Z","Acct 1782",35550.520792141171]
["Z","Acct 8453",24668.664993029066]
["Z","Acct 8259",17226.994831884102]
["Z","Acct 2300",15073.748208474048]
["Z","Acct 4734",14909.96885258835]
["Z","Acct 2666",12675.218539484102]

{"sheet":"Bill","index":4,"n_rows":194,"n_cols":7,"rows_kept":194,"cut":false,"hidden":false,"merged":[]}
["Industry","Customer","Amount",null,"Alex asks:  is there a way to show the top 2 customers per industry?"]
["A","Acct 8375",59948.701198641109]
["A","Acct 1119",57571.432058516744,null,{"$f":"_xlfn.AGGREGATE(14,6,($C$2:$C$194)/($A$2:$A$194=\"A\"),2)","v":57571.432058516744}]
["A","Acct 5201",51158.299885325156,null,null,1,2]
["A","Acct 4408",23608.901998540343,null,"A",{"$f":"_xlfn.AGGREGATE(14,6,($C$2:$C$194)/($A$2:$A$194=$E5),F$4)","v":59948.701198641109},{"$f":"_xlfn.AGGREGATE(14,6,($C$2:$C$194)/($A$2:$A$194=$E5),G$4)","v":57571.432058516744}]
["B","Acct 2516",99568.567525250037,null,"B",{"$f":"_xlfn.AGGREGATE(14,6,($C$2:$C$194)/($A$2:$A$194=$E6),F$4)","v":99568.567525250037},81646.665885651004]
["B","Acct 3743",81646.665885651004,null,"C",45239.218902719978,25193.714664525236]
["B","Acct 4045",79274.823478148726,null,"D",98475.307688900779,97846.31589242247]
["B","Acct 7206",64366.495318589732,null,"E",72092.199651957693,65470.184284119059]
["B","Acct 4007",52577.103164786662,null,"F",83709.062277228455,67756.829240491483]
["B","Acct 3806",13796.142644822095,null,"G",98032.383611700527,78194.091269626821]
["B","Acct 1910",12138.442495236857,null,"H",95458.07830050755,89821.418741519999]
["B","Acct 7089",8774.8026805944846,null,"I",96986.478946464005,94931.171086085713]
["C","Acct 4308",45239.218902719978,null,"J",93547.891564467995,88084.334500708588]
["C","Acct 5600",25193.714664525236,null,"K",84888.3557188181,70681.601631156314]
["C","Acct 6115",17495.623050845155]
["D","Acct 2337",98475.307688900779,null,null,1,2]
["D","Acct 8136",97846.31589242247,null,"A",{"$f":"LARGE(IF($A$2:$A$194=$E18,$C$2:$C$194),F$17)","v":59948.701198641109},{"$f":"LARGE(IF($A$2:$A$194=$E18,$C$2:$C$194),G$17)","v":57571.432058516744}]
["D","Acct 4816",26444.325750543539,null,"B",{"$f":"LARGE(IF($A$2:$A$194=$E19,$C$2:$C$194),F$17)","v":99568.567525250037},{"$f":"LARGE(IF($A$2:$A$194=$E19,$C$2:$C$194),G$17)","v":81646.665885651004}]
["E","Acct 3149",72092.199651957693,null,"C",{"$f":"LARGE(IF($A$2:$A$194=$E20,$C$2:$C$194),F$17)","v":45239.218902719978},{"$f":"LARGE(IF($A$2:$A$194=$E20,$C$2:$C$194),G$17)","v":25193.714664525236}]
["E","Acct 7662",65470.184284119059,null,"D",{"$f":"LARGE(IF($A$2:$A$194=$E21,$C$2:$C$194),F$17)","v":98475.307688900779},{"$f":"LARGE(IF($A$2:$A$194=$E21,$C$2:$C$194),G$17)","v":97846.31589242247}]
["E","Acct 4289",64944.26296356738,null,"E",{"$f":"LARGE(IF($A$2:$A$194=$E22,$C$2:$C$194),F$17)","v":72092.199651957693},{"$f":"LARGE(IF($A$2:$A$194=$E22,$C$2:$C$194),G$17)","v":65470.184284119059}]
["E","Acct 7792",62998.694120045839,null,"F",{"$f":"LARGE(IF($A$2:$A$194=$E23,$C$2:$C$194),F$17)","v":83709.062277228455},{"$f":"LARGE(IF($A$2:$A$194=$E23,$C$2:$C$194),G$17)","v":67756.829240491483}]
["E","Acct 5617",62734.08329937575,null,"G",{"$f":"LARGE(IF($A$2:$A$194=$E24,$C$2:$C$194),F$17)","v":98032.383611700527},{"$f":"LARGE(IF($A$2:$A$194=$E24,$C$2:$C$194),G$17)","v":78194.091269626821}]
["E","Acct 7210",50013.311746072031,null,"H",{"$f":"LARGE(IF($A$2:$A$194=$E25,$C$2:$C$194),F$17)","v":95458.07830050755},{"$f":"LARGE(IF($A$2:$A$194=$E25,$C$2:$C$194),G$17)","v":89821.418741519999}]
["E","Acct 4341",39233.444282046439,null,"I",{"$f":"LARGE(IF($A$2:$A$194=$E26,$C$2:$C$194),F$17)","v":96986.478946464005},{"$f":"LARGE(IF($A$2:$A$194=$E26,$C$2:$C$194),G$17)","v":94931.171086085713}]
["E","Acct 6062",29832.458673877827,null,"J",{"$f":"LARGE(IF($A$2:$A$194=$E27,$C$2:$C$194),F$17)","v":93547.891564467995},{"$f":"LARGE(IF($A$2:$A$194=$E27,$C$2:$C$194),G$17)","v":88084.334500708588}]
["E","Acct 1364",17251.793375353474,null,"K",{"$f":"LARGE(IF($A$2:$A$194=$E28,$C$2:$C$194),F$17)","v":84888.3557188181},{"$f":"LARGE(IF($A$2:$A$194=$E28,$C$2:$C$194),G$17)","v":70681.601631156314}]
["E","Acct 5119",10396.892563135962]
["F","Acct 3626",83709.062277228455]
["F","Acct 7853",67756.829240491483]
["F","Acct 6976",59664.026927225699]
["F","Acct 5891",48310.794809471889]
["F","Acct 7434",43426.488050126041]
["F","Acct 1805",20969.511691952881]
["F","Acct 3479",2233.0877044513641]
["G","Acct 4572",98032.383611700527]
["G","Acct 3463",78194.091269626821]
["G","Acct 4202",76665.750257587832]
["G","Acct 6885",56257.227525234288]
["G","Acct 6445",40864.926055360163]
["G","Acct 5336",6883.7709958614932]
["H","Acct 7000",95458.07830050755]
["H","Acct 3609",89821.418741519999]
["H","Acct 4633",89361.942591034429]
["H","Acct 3846",86798.501207525958]
["H","Acct 1067",43392.063969875504]
["H","Acct 5766",24277.339010315001]
["H","Acct 2003",20094.052456190082]
["H","Acct 6171",19433.15046207772]
["H","Acct 3929",7789.3703568382207]
["H","Acct 8365",3466.3045130392866]
["H","Acct 8318",1854.4621656475856]
["H","Acct 5742",68.401019163055736]
["I","Acct 2335",96986.478946464005]
["I","Acct 7761",94931.171086085713]
["I","Acct 7297",90699.261858278114]
["I","Acct 5300",87789.328269525518]
["I","Acct 3853",86204.595435424795]
["I","Acct 1079",74531.421535208792]
["I","Acct 4623",74069.427022633623]
["I","Acct 2401",66564.803428470259]
["I","Acct 5360",53569.205169452172]
["I","Acct 8371",23389.143038519091]
["I","Acct 2234",12050.678952141358]
["J","Acct 6172",93547.891564467995]
["J","Acct 4394",88084.334500708588]
["J","Acct 7933",87655.308899984651]
["J","Acct 7673",82293.104880033716]
["J","Acct 8868",81510.467506900051]
["J","Acct 1385",69549.267947399916]
["J","Acct 1353",64993.578410125861]
["J","Acct 3839",62790.980512658687]
["J","Acct 7937",37230.676759181959]
["J","Acct 3572",27859.12782444404]
["J","Acct 8285",16955.51182875994]
["J","Acct 4583",9687.6331415009954]
["K","Acct 7565",84888.3557188181]
["K","Acct 6510",70681.601631156314]
["K","Acct 6891",59407.130969918151]
["K","Acct 2455",56457.318323541193]
["K","Acct 5001",37382.501380440444]
["L","Acct 8898",98419.82694628532]
["L","Acct 8210",72573.353135136334]
["L","Acct 8361",57832.389120664964]
["L","Acct 8038",41764.529772309797]
["L","Acct 3155",33360.942138445571]
["L","Acct 5975",10963.989377962658]
["L","Acct 3693",5145.0679813428878]
["M","Acct 1839",93012.868685983034]
["M","Acct 8666",89585.223662240242]
["M","Acct 5486",83186.624258868935]
["M","Acct 7791",71962.025844609889]
["M","Acct 7844",70209.460628448345]
["M","Acct 3951",65416.931332410903]
["M","Acct 5535",59374.365818534447]
["M","Acct 5922",53247.285606027915]
["M","Acct 1928",53083.049022911968]
["M","Acct 1489",30363.21523896942]
["M","Acct 2671",19973.06971246413]
["M","Acct 8409",18684.296007320787]
["M","Acct 1029",12275.341687067708]
["M","Acct 5378",5989.472665921614]
["N","Acct 7568",75958.520399238434]
["N","Acct 1881",68036.179783628075]
["N","Acct 2572",35387.666055635462]
["N","Acct 6471",26247.804740380965]
["N","Acct 3287",16958.805359766848]
["N","Acct 5385",16270.326629001696]
["N","Acct 6968",3441.5438593462522]
["O","Acct 2274",98826.453609775665]
["O","Acct 4857",80257.656503568927]
["O","Acct 3449",42019.850448222431]
["O","Acct 8704",28612.064572513373]
["O","Acct 3511",28534.865024923994]
["P","Acct 7506",98371.957216768133]
["P","Acct 8246",85292.137879763279]
["P","Acct 7863",85194.239646258648]
["P","Acct 1457",81855.218059321414]
["P","Acct 2682",47153.535610922416]
["P","Acct 8012",42087.342515283024]
["P","Acct 2752",41447.981980571625]
["P","Acct 6769",37767.112763393619]
["P","Acct 3180",13917.201059140294]
["Q","Acct 3599",83535.147175419741]
["Q","Acct 1289",44824.408958438311]
["Q","Acct 3068",31145.337098534397]
["Q","Acct 1496",14932.955485635446]
["R","Acct 4164",88970.843076139776]
["R","Acct 7397",85708.50929882683]
["R","Acct 6023",74273.508848181009]
["R","Acct 4100",43672.911787917968]
["R","Acct 8152",36607.047572390074]
["R","Acct 7092",29185.529257034559]
["R","Acct 2588",25304.69252127334]
["R","Acct 4783",7744.3144514072856]
["S","Acct 2814",76834.025919695297]
["S","Acct 4150",56289.341835275176]
["S","Acct 8643",47809.554028744547]
["S","Acct 6269",41921.984416262072]
["S","Acct 1034",34929.233956985816]
["S","Acct 8653",30915.561620566979]
["S","Acct 1315",6428.7769890917998]
["T","Acct 2211",77993.273405303655]
["T","Acct 7416",52875.38074087417]
["T","Acct 4526",34201.873974298614]
["T","Acct 6104",34131.139663162045]
["T","Acct 8943",18023.937649358435]
["T","Acct 1804",11937.654793067864]
["T","Acct 7464",11534.378379106869]
["T","Acct 2776",10598.165394744552]
["U","Acct 6175",94460.225887369714]
["U","Acct 3099",69380.535860821517]
["U","Acct 3368",50397.749597289985]
["U","Acct 4996",27407.916767624385]
["U","Acct 5124",20942.261918338823]
["U","Acct 1799",19966.876355848693]
["V","Acct 2893",90009.426074220391]
["V","Acct 6058",89086.219281350044]
["V","Acct 8919",80698.698876596623]
["V","Acct 3637",77526.661323302294]
["V","Acct 7968",76227.680486931786]
["V","Acct 6752",72064.545259473292]
["V","Acct 5203",69539.252716050803]
["V","Acct 4579",51261.581782236441]
["V","Acct 2607",44606.242804784924]
["V","Acct 6361",35569.629642003863]
["W","Acct 5113",84485.285822197315]
["W","Acct 3607",84196.837223824099]
["W","Acct 5655",83233.555443191712]
["W","Acct 5177",60065.297803779948]
["W","Acct 7776",56415.591684292442]
["W","Acct 8156",28647.069512270285]
["W","Acct 4708",22122.262555228601]
["W","Acct 1970",17766.844024179351]
["W","Acct 8513",13218.842175105949]
["X","Acct 1468",96875.666033515285]
["X","Acct 8421",91985.651518750223]
["X","Acct 5176",67364.968983625469]
["X","Acct 5243",39771.947012448916]
["Y","Acct 6120",67790.265221296489]
["Y","Acct 8634",54469.545793770703]
["Y","Acct 2377",36832.298898686]
["Y","Acct 2318",23587.42117057553]
["Y","Acct 5888",6870.4628633050379]
["Z","Acct 7408",99579.82654280118]
["Z","Acct 2468",82730.192313480526]
["Z","Acct 6122",80274.179806068685]
["Z","Acct 1782",35550.520792141171]
["Z","Acct 8453",24668.664993029066]
["Z","Acct 8259",17226.994831884102]
["Z","Acct 2300",15073.748208474048]
["Z","Acct 4734",14909.96885258835]
["Z","Acct 2666",12675.218539484102]