{"text_format":"1","workbook":"xlsx","n_sheets":4,"sheets":["PivotTable","Failing_Kids","Final","ClassCategories"],"not_rendered":{"charts":0,"images":0,"macros":0,"external_links":0,"defined_names":0,"comments":0,"pivot_tables":1},"unopened":[],"bounds":{"document_bytes":16777216,"sheet_cells":100000,"rows_first":2000,"rows_last":500,"rows_between":2000,"halvings":0,"cell_chars":16384,"cell_head_chars":4096},"cells_cut":0,"cells_raw":0,"read":"whole","date_system":"1900"}

{"sheet":"PivotTable","index":0,"n_rows":320,"n_cols":7,"rows_kept":320,"cut":false,"hidden":false,"merged":[]}
[]
[]
["Count of Letter Grade","Category"]
["Name","Elective","English","Math","Phys Ed","Science","Social Studies"]
["Abbott Howard",0,1,0,0,0,0]
["Aguilar Carlos",0,0,1,0,0,1]
["Albert Harry",0,0,0,0,0,1]
["Allen Alfred",0,0,1,0,0,0]
["Allison Samuel",0,1,1,0,0,0]
["Alvarado Kristin",0,0,1,0,0,0]
["Armstrong Joanna",1,1,1,0,0,0]
["Armstrong Ronald",0,1,0,0,0,0]
["Arnold Fred",1,0,0,0,0,0]
["Atkins Glenn",0,0,0,0,1,0]
["Atkinson Phillip",0,0,1,0,0,1]
["Austin Yvette",0,0,1,0,1,0]
["Avila Natalie",1,0,0,0,0,0]
["Baird Whitney",0,0,1,0,0,0]
["Ball Bernice",1,0,0,0,1,0]
["Ballard Terry",0,1,0,0,0,0]
{"$rows_left_out":301}
{"sheet":"Failing_Kids","index":1,"n_rows":464,"n_cols":15,"rows_kept":464,"cut":false,"hidden":false,"merged":[[1,2,1,14]]}
[null,null,"Total Records:380"]
[null,null,"All Records"]
["Name","Category","Last","First","Grade","Course","Course #","Teacher","Letter Grade","grading.task","grading.termName","Percent","Period","student.activeToday","ID #"]
[{"$f":"C4&\" \"&D4","v":"Abbott Howard"},{"$f":"VLOOKUP(F4,ClassCategories!$A$2:$B$42,2,0)","v":"English"},"Abbott","Howard",10,"ENGLISH 3",909,"Weiss, Gwendolyn","F","Eligibility","Quarter 1",54.84,1,1,999999999]
[{"$f":"C5&\" \"&D5","v":"Aguilar Carlos"},{"$f":"VLOOKUP(F5,ClassCategories!$A$2:$B$42,2,0)","v":"Math"},"Aguilar","Carlos",11,"Algebra 2 Sem 1",1177,"Riley, Frank","F","Eligibility","Quarter 1",45.14,1,1,999999999]
["Aguilar Carlos",{"$f":"VLOOKUP(F6,ClassCategories!$A$2:$B$42,2,0)","v":"Social Studies"},"Aguilar","Carlos",11,"US/AZ HIS 1",1529,"Espinoza, Adam","F","Eligibility","Quarter 1",35.76,5,1,999999999]
["Albert Harry",{"$f":"VLOOKUP(F7,ClassCategories!$A$2:$B$42,2,0)","v":"Social Studies"},"Albert","Harry",11,"AP US/AZ HIS",1531,"Shepard, Diana","F","Eligibility","Quarter 1",59.15,7,1,999999999]
["Allen Alfred",{"$f":"VLOOKUP(F8,ClassCategories!$A$2:$B$42,2,0)","v":"Math"},"Allen","Alfred",10,"Algebra 1 Sem 1",1119,"James, Lola","F","Eligibility","Quarter 1",27.8,4,1,999999999]
["Allison Samuel",{"$f":"VLOOKUP(F9,ClassCategories!$A$2:$B$42,2,0)","v":"English"},"Allison","Samuel",10,"ENGLISH 3",909,"Sheppard, Chad","F","Eligibility","Quarter 1",55.38,6,1,999999999]
["Allison Samuel",{"$f":"VLOOKUP(F10,ClassCategories!$A$2:$B$42,2,0)","v":"Math"},"Allison","Samuel",10,"Geometry Sem 1",1131,"Ortega, Alma","F","Eligibility","Quarter 1",59.1,2,1,999999999]
["Alvarado Kristin",{"$f":"VLOOKUP(F11,ClassCategories!$A$2:$B$42,2,0)","v":"Math"},"Alvarado","Kristin",11,"Algebra 2 Sem 1",1177,"Riley, Frank","F","Eligibility","Quarter 1",34.619999999999997,1,1,999999999]
["Armstrong Joanna",{"$f":"VLOOKUP(F12,ClassCategories!$A$2:$B$42,2,0)","v":"Math"},"Armstrong","Joanna",11,"Algebra 2 Sem 1",1177,"Riley, Frank","F","Eligibility","Quarter 1",52.54,1,1,999999999]
["Armstrong Joanna",{"$f":"VLOOKUP(F13,ClassCategories!$A$2:$B$42,2,0)","v":"English"},"Armstrong","Joanna",11,"ENGLISH 5",915,"Sawyer, Jeff","F","Eligibility","Quarter 1",35.29,3,1,999999999]
["Armstrong Joanna",{"$f":"VLOOKUP(F14,ClassCategories!$A$2:$B$42,2,0)","v":"Elective"},"Armstrong","Joanna",11,"GERMAN 3",611,"Simon, Guadalupe","F","Eligibility","Quarter 1",57.35,7,1,999999999]
["Armstrong Ronald",{"$f":"VLOOKUP(F15,ClassCategories!$A$2:$B$42,2,0)","v":"English"},"Armstrong","Ronald",11,"ENGLISH 3",909,"Ray, Stacy","F","Eligibility","Quarter 1",41.58,3,1,999999999]
["Arnold Fred",{"$f":"VLOOKUP(F16,ClassCategories!$A$2:$B$42,2,0)","v":"Elective"},"Arnold","Fred",10,"ACCOUNT 1",501,"Richmond, Elsie","F","Eligibility","Quarter 1",46.67,2,1,999999999]
["Atkins Glenn",{"$f":"VLOOKUP(F17,ClassCategories!$A$2:$B$42,2,0)","v":"Science"},"Atkins","Glenn",10,"BIOLOGY 1",1407,"Kaufman, Philip","F","Eligibility","Quarter 1",31.67,6,1,999999999]
["Atkinson Phillip",{"$f":"VLOOKUP(F18,ClassCategories!$A$2:$B$42,2,0)","v":"Math"},"Atkinson","Phillip",11,"Algebra 1 Sem 2",3119,"Gallegos, Brandy","F","Eligibility","Quarter 1",46.31,1,1,999999999]
["Atkinson Phillip",{"$f":"VLOOKUP(F19,ClassCategories!$A$2:$B$42,2,0)","v":"Social Studies"},"Atkinson","Phillip",11,"US/AZ HIS 1",1529,"Torres, Carl","F","Eligibility","Quarter 1",42.93,2,1,999999999]
["Austin Yvette",{"$f":"VLOOKUP(F20,ClassCategories!$A$2:$B$42,2,0)","v":"Math"},"Austin","Yvette",9,"Algebra 1 Sem 1",1119,"Barrera, Melanie","F","Eligibility","Quarter 1",34.28,1,1,999999999]
{"$rows_left_out":445}
{"sheet":"Final","index":2,"n_rows":496,"n_cols":13,"rows_kept":496,"cut":false,"hidden":false,"merged":[]}
["Last","First","English Fail","Math Fail","Science Fail","SocStuFail","PE Fail","PE Teacher","Elective 1","Elective 1 Te","Elective 2","Elective 2 Teac","SE Cat"]
[{"$f":"Failing_Kids!C4","v":"Abbott"},{"$f":"Failing_Kids!D4","v":"Howard"},{"$f":"IF(ISERROR(SEARCH(\"*English*\",Failing_Kids!F4,1)),IF(ISERROR(SEARCH(\"*Literacy*\",Failing_Kids!F4,1)),\"\",\"X\"),\"X\")","v":"X"},{"$f":"IF(ISERROR(SEARCH(\"*Geometry*\",Failing_Kids!$F4,1)),IF(ISERROR(SEARCH(\"*Math*\",Failing_Kids!$F4,1)),IF(ISERROR(SEARCH(\"*Calc*\",Failing_Kids!$F4,1)),IF(ISERROR(SEARCH(\"*Algebra*\",Failing_Kids!$F4,1)),\"\",\"X\"),\"X\"),\"X\"),\"X\")","v":""},{"$f":"IF(ISERROR(SEARCH(\"*Science*\",Failing_Kids!$F4,1)),IF(ISERROR(SEARCH(\"*Bio*\",Failing_Kids!$F4,1)),IF(ISERROR(SEARCH(\"*Chem*\",Failing_Kids!$F4,1)),IF(ISERROR(SEARCH(\"*Physics*\",Failing_Kids!$F4,1)),\"\",\"X\"),\"X\"),\"X\"),\"X\")","v":""},{"$f":"IF(ISERROR(SEARCH(\"*His*\",Failing_Kids!$F4,1)),IF(ISERROR(SEARCH(\"*GOV*\",Failing_Kids!$F4,1)),IF(ISERROR(SEARCH(\"*Econ*\",Failing_Kids!$F4,1)),IF(ISERROR(SEARCH(\"*Soc*\",Failing_Kids!$F4,1)),\"\",\"X\"),\"X\"),\"X\"),\"X\")","v":""},{"$f":"IF(ISERROR(SEARCH(\"*PE*\",Failing_Kids!$F4,1)),\"\",\"X\")","v":""},null,{"$f":"IF(ISERROR(SEARCH(\"*Design*\",Failing_Kids!$F4,1)),IF(ISERROR(SEARCH(\"*Account*\",Failing_Kids!$F4,1)),IF(ISERROR(SEARCH(\"*Art*\",Failing_Kids!$F4,1)),IF(ISERROR(SEARCH(\"*Band*\",Failing_Kids!$F4,1)),IF(ISERROR(SEARCH(\"*Dance*\",Failing_Kids!$F4,1)),IF(ISERROR(SEARCH(\"*Education*\",Failing_Kids!F$4,1)),\"\",\"X\"),\"X\"),\"X\"),\"X\"),\"X\"),\"X\")","v":""}]
[{"$f":"Failing_Kids!C5","v":"Aguilar"},{"$f":"Failing_Kids!D5","v":"Carlos"},{"$f":"IF(ISERROR(SEARCH(\"*English*\",Failing_Kids!F5,1)),\"\",\"X \")","v":""},{"$f":"IF(ISERROR(SEARCH(\"*Geometry*\",Failing_Kids!$F5,1)),IF(ISERROR(SEARCH(\"*Math*\",Failing_Kids!$F5,1)),IF(ISERROR(SEARCH(\"*Calc*\",Failing_Kids!$F5,1)),IF(ISERROR(SEARCH(\"*Algebra*\",Failing_Kids!$F5,1)),\"\",\"X\"),\"X\"),\"X\"),\"X\")","v":"X"},{"$f":"IF(ISERROR(SEARCH(\"*Science*\",Failing_Kids!$F5,1)),IF(ISERROR(SEARCH(\"*Bio*\",Failing_Kids!$F5,1)),IF(ISERROR(SEARCH(\"*Chem*\",Failing_Kids!$F5,1)),IF(ISERROR(SEARCH(\"*Physics*\",Failing_Kids!$F5,1)),\"\",\"X\"),\"X\"),\"X\"),\"X\")","v":""},{"$f":"IF(ISERROR(SEARCH(\"*His*\",Failing_Kids!$F5,1)),IF(ISERROR(SEARCH(\"*GOV*\",Failing_Kids!$F5,1)),IF(ISERROR(SEARCH(\"*Econ*\",Failing_Kids!$F5,1)),IF(ISERROR(SEARCH(\"*Soc*\",Failing_Kids!$F5,1)),\"\",\"X\"),\"X\"),\"X\"),\"X\")","v":""},{"$f":"IF(ISERROR(SEARCH(\"*PE*\",Failing_Kids!$F5,1)),\"\",\"X\")","v":""}]
[{"$f":"Failing_Kids!C6","v":"Aguilar"},{"$f":"Failing_Kids!D6","v":"Carlos"},{"$f":"IF(ISERROR(SEARCH(\"*English*\",Failing_Kids!F6,1)),\"\",\"X \")","v":""},{"$f":"IF(ISERROR(SEARCH(\"*Geometry*\",Failing_Kids!$F6,1)),IF(ISERROR(SEARCH(\"*Math*\",Failing_Kids!$F6,1)),IF(ISERROR(SEARCH(\"*Calc*\",Failing_Kids!$F6,1)),IF(ISERROR(SEARCH(\"*Algebra*\",Failing_Kids!$F6,1)),\"\",\"X\"),\"X\"),\"X\"),\"X\")","v":""},{"$f":"IF(ISERROR(SEARCH(\"*Science*\",Failing_Kids!$F6,1)),IF(ISERROR(SEARCH(\"*Bio*\",Failing_Kids!$F6,1)),IF(ISERROR(SEARCH(\"*Chem*\",Failing_Kids!$F6,1)),IF(ISERROR(SEARCH(\"*Physics*\",Failing_Kids!$F6,1)),\"\",\"X\"),\"X\"),\"X\"),\"X\")","v":""},{"$f":"IF(ISERROR(SEARCH(\"*His*\",Failing_Kids!$F6,1)),IF(ISERROR(SEARCH(\"*GOV*\",Failing_Kids!$F6,1)),IF(ISERROR(SEARCH(\"*Econ*\",Failing_Kids!$F6,1)),IF(ISERROR(SEARCH(\"*Soc*\",Failing_Kids!$F6,1)),\"\",\"X\"),\"X\"),\"X\"),\"X\")","v":"X"},{"$f":"IF(ISERROR(SEARCH(\"*PE*\",Failing_Kids!$F6,1)),\"\",\"X\")","v":""}]
[{"$f":"Failing_Kids!C7","v":"Albert"},{"$f":"Failing_Kids!D7","v":"Harry"},{"$f":"IF(ISERROR(SEARCH(\"*English*\",Failing_Kids!F7,1)),\"\",\"X \")","v":""},{"$f":"IF(ISERROR(SEARCH(\"*Geometry*\",Failing_Kids!$F7,1)),IF(ISERROR(SEARCH(\"*Math*\",Failing_Kids!$F7,1)),IF(ISERROR(SEARCH(\"*Calc*\",Failing_Kids!$F7,1)),IF(ISERROR(SEARCH(\"*Algebra*\",Failing_Kids!$F7,1)),\"\",\"X\"),\"X\"),\"X\"),\"X\")","v":""},{"$f":"IF(ISERROR(SEARCH(\"*Science*\",Failing_Kids!$F7,1)),IF(ISERROR(SEARCH(\"*Bio*\",Failing_Kids!$F7,1)),IF(ISERROR(SEARCH(\"*Chem*\",Failing_Kids!$F7,1)),IF(ISERROR(SEARCH(\"*Physics*\",Failing_Kids!$F7,1)),\"\",\"X\"),\"X\"),\"X\"),\"X\")","v":""},{"$f":"IF(ISERROR(SEARCH(\"*His*\",Failing_Kids!$F7,1)),IF(ISERROR(SEARCH(\"*GOV*\",Failing_Kids!$F7,1)),IF(ISERROR(SEARCH(\"*Econ*\",Failing_Kids!$F7,1)),IF(ISERROR(SEARCH(\"*Soc*\",Failing_Kids!$F7,1)),\"\",\"X\"),\"X\"),\"X\"),\"X\")","v":"X"},{"$f":"IF(ISERROR(SEARCH(\"*PE*\",Failing_Kids!$F7,1)),\"\",\"X\")","v":""}]
[{"$f":"Failing_Kids!C8","v":"Allen"},{"$f":"Failing_Kids!D8","v":"Alfred"},{"$f":"IF(ISERROR(SEARCH(\"*English*\",Failing_Kids!F8,1)),\"\",\"X \")","v":""},{"$f":"IF(ISERROR(SEARCH(\"*Geometry*\",Failing_Kids!$F8,1)),IF(ISERROR(SEARCH(\"*Math*\",Failing_Kids!$F8,1)),IF(ISERROR(SEARCH(\"*Calc*\",Failing_Kids!$F8,1)),IF(ISERROR(SEARCH(\"*Algebra*\",Failing_Kids!$F8,1)),\"\",\"X\"),\"X\"),\"X\"),\"X\")","v":"X"},{"$f":"IF(ISERROR(SEARCH(\"*Science*\",Failing_Kids!$F8,1)),IF(ISERROR(SEARCH(\"*Bio*\",Failing_Kids!$F8,1)),IF(ISERROR(SEARCH(\"*Chem*\",Failing_Kids!$F8,1)),IF(ISERROR(SEARCH(\"*Physics*\",Failing_Kids!$F8,1)),\"\",\"X\"),\"X\"),\"X\"),\"X\")","v":""},{"$f":"IF(ISERROR(SEARCH(\"*His*\",Failing_Kids!$F8,1)),IF(ISERROR(SEARCH(\"*GOV*\",Failing_Kids!$F8,1)),IF(ISERROR(SEARCH(\"*Econ*\",Failing_Kids!$F8,1)),IF(ISERROR(SEARCH(\"*Soc*\",Failing_Kids!$F8,1)),\"\",\"X\"),\"X\"),\"X\"),\"X\")","v":""},{"$f":"IF(ISERROR(SEARCH(\"*PE*\",Failing_Kids!$F8,1)),\"\",\"X\")","v":""}]
[{"$f":"Failing_Kids!C9","v":"Allison"},{"$f":"Failing_Kids!D9","v":"Samuel"},{"$f":"IF(ISERROR(SEARCH(\"*English*\",Failing_Kids!F9,1)),\"\",\"X \")","v":"X "},{"$f":"IF(ISERROR(SEARCH(\"*Geometry*\",Failing_Kids!$F9,1)),IF(ISERROR(SEARCH(\"*Math*\",Failing_Kids!$F9,1)),IF(ISERROR(SEARCH(\"*Calc*\",Failing_Kids!$F9,1)),IF(ISERROR(SEARCH(\"*Algebra*\",Failing_Kids!$F9,1)),\"\",\"X\"),\"X\"),\"X\"),\"X\")","v":""},{"$f":"IF(ISERROR(SEARCH(\"*Science*\",Failing_Kids!$F9,1)),IF(ISERROR(SEARCH(\"*Bio*\",Failing_Kids!$F9,1)),IF(ISERROR(SEARCH(\"*Chem*\",Failing_Kids!$F9,1)),IF(ISERROR(SEARCH(\"*Physics*\",Failing_Kids!$F9,1)),\"\",\"X\"),\"X\"),\"X\"),\"X\")","v":""},{"$f":"IF(ISERROR(SEARCH(\"*His*\",Failing_Kids!$F9,1)),IF(ISERROR(SEARCH(\"*GOV*\",Failing_Kids!$F9,1)),IF(ISERROR(SEARCH(\"*Econ*\",Failing_Kids!$F9,1)),IF(ISERROR(SEARCH(\"*Soc*\",Failing_Kids!$F9,1)),\"\",\"X\"),\"X\"),\"X\"),\"X\")","v":""},{"$f":"IF(ISERROR(SEARCH(\"*PE*\",Failing_Kids!$F9,1)),\"\",\"X\")","v":""}]
[{"$f":"Failing_Kids!C10","v":"Allison"},{"$f":"Failing_Kids!D10","v":"Samuel"},{"$f":"IF(ISERROR(SEARCH(\"*English*\",Failing_Kids!F10,1)),\"\",\"X \")","v":""},{"$f":"IF(ISERROR(SEARCH(\"*Geometry*\",Failing_Kids!$F10,1)),IF(ISERROR(SEARCH(\"*Math*\",Failing_Kids!$F10,1)),IF(ISERROR(SEARCH(\"*Calc*\",Failing_Kids!$F10,1)),IF(ISERROR(SEARCH(\"*Algebra*\",Failing_Kids!$F10,1)),\"\",\"X\"),\"X\"),\"X\"),\"X\")","v":"X"},{"$f":"IF(ISERROR(SEARCH(\"*Science*\",Failing_Kids!$F10,1)),IF(ISERROR(SEARCH(\"*Bio*\",Failing_Kids!$F10,1)),IF(ISERROR(SEARCH(\"*Chem*\",Failing_Kids!$F10,1)),IF(ISERROR(SEARCH(\"*Physics*\",Failing_Kids!$F10,1)),\"\",\"X\"),\"X\"),\"X\"),\"X\")","v":""},{"$f":"IF(ISERROR(SEARCH(\"*His*\",Failing_Kids!$F10,1)),IF(ISERROR(SEARCH(\"*GOV*\",Failing_Kids!$F10,1)),IF(ISERROR(SEARCH(\"*Econ*\",Failing_Kids!$F10,1)),IF(ISERROR(SEARCH(\"*Soc*\",Failing_Kids!$F10,1)),\"\",\"X\"),\"X\"),\"X\"),\"X\")","v":""},{"$f":"IF(ISERROR(SEARCH(\"*PE*\",Failing_Kids!$F10,1)),\"\",\"X\")","v":""}]
[{"$f":"Failing_Kids!C11","v":"Alvarado"},{"$f":"Failing_Kids!D11","v":"Kristin"},{"$f":"IF(ISERROR(SEARCH(\"*English*\",Failing_Kids!F11,1)),\"\",\"X \")","v":""},{"$f":"IF(ISERROR(SEARCH(\"*Geometry*\",Failing_Kids!$F11,1)),IF(ISERROR(SEARCH(\"*Math*\",Failing_Kids!$F11,1)),IF(ISERROR(SEARCH(\"*Calc*\",Failing_Kids!$F11,1)),IF(ISERROR(SEARCH(\"*Algebra*\",Failing_Kids!$F11,1)),\"\",\"X\"),\"X\"),\"X\"),\"X\")","v":"X"},{"$f":"IF(ISERROR(SEARCH(\"*Science*\",Failing_Kids!$F11,1)),IF(ISERROR(SEARCH(\"*Bio*\",Failing_Kids!$F11,1)),IF(ISERROR(SEARCH(\"*Chem*\",Failing_Kids!$F11,1)),IF(ISERROR(SEARCH(\"*Physics*\",Failing_Kids!$F11,1)),\"\",\"X\"),\"X\"),\"X\"),\"X\")","v":""},{"$f":"IF(ISERROR(SEARCH(\"*His*\",Failing_Kids!$F11,1)),IF(ISERROR(SEARCH(\"*GOV*\",Failing_Kids!$F11,1)),IF(ISERROR(SEARCH(\"*Econ*\",Failing_Kids!$F11,1)),IF(ISERROR(SEARCH(\"*Soc*\",Failing_Kids!$F11,1)),\"\",\"X\"),\"X\"),\"X\"),\"X\")","v":""},{"$f":"IF(ISERROR(SEARCH(\"*PE*\",Failing_Kids!$F11,1)),\"\",\"X\")","v":""}]
[{"$f":"Failing_Kids!C12","v":"Armstrong"},{"$f":"Failing_Kids!D12","v":"Joanna"},{"$f":"IF(ISERROR(SEARCH(\"*English*\",Failing_Kids!F12,1)),\"\",\"X \")","v":""},{"$f":"IF(ISERROR(SEARCH(\"*Geometry*\",Failing_Kids!$F12,1)),IF(ISERROR(SEARCH(\"*Math*\",Failing_Kids!$F12,1)),IF(ISERROR(SEARCH(\"*Calc*\",Failing_Kids!$F12,1)),IF(ISERROR(SEARCH(\"*Algebra*\",Failing_Kids!$F12,1)),\"\",\"X\"),\"X\"),\"X\"),\"X\")","v":"X"},{"$f":"IF(ISERROR(SEARCH(\"*Science*\",Failing_Kids!$F12,1)),IF(ISERROR(SEARCH(\"*Bio*\",Failing_Kids!$F12,1)),IF(ISERROR(SEARCH(\"*Chem*\",Failing_Kids!$F12,1)),IF(ISERROR(SEARCH(\"*Physics*\",Failing_Kids!$F12,1)),\"\",\"X\"),\"X\"),\"X\"),\"X\")","v":""},{"$f":"IF(ISERROR(SEARCH(\"*His*\",Failing_Kids!$F12,1)),IF(ISERROR(SEARCH(\"*GOV*\",Failing_Kids!$F12,1)),IF(ISERROR(SEARCH(\"*Econ*\",Failing_Kids!$F12,1)),IF(ISERROR(SEARCH(\"*Soc*\",Failing_Kids!$F12,1)),\"\",\"X\"),\"X\"),\"X\"),\"X\")","v":""},{"$f":"IF(ISERROR(SEARCH(\"*PE*\",Failing_Kids!$F12,1)),\"\",\"X\")","v":""}]
[{"$f":"Failing_Kids!C13","v":"Armstrong"},{"$f":"Failing_Kids!D13","v":"Joanna"},{"$f":"IF(ISERROR(SEARCH(\"*English*\",Failing_Kids!F13,1)),\"\",\"X \")","v":"X "},{"$f":"IF(ISERROR(SEARCH(\"*Geometry*\",Failing_Kids!$F13,1)),IF(ISERROR(SEARCH(\"*Math*\",Failing_Kids!$F13,1)),IF(ISERROR(SEARCH(\"*Calc*\",Failing_Kids!$F13,1)),IF(ISERROR(SEARCH(\"*Algebra*\",Failing_Kids!$F13,1)),\"\",\"X\"),\"X\"),\"X\"),\"X\")","v":""},{"$f":"IF(ISERROR(SEARCH(\"*Science*\",Failing_Kids!$F13,1)),IF(ISERROR(SEARCH(\"*Bio*\",Failing_Kids!$F13,1)),IF(ISERROR(SEARCH(\"*Chem*\",Failing_Kids!$F13,1)),IF(ISERROR(SEARCH(\"*Physics*\",Failing_Kids!$F13,1)),\"\",\"X\"),\"X\"),\"X\"),\"X\")","v":""},{"$f":"IF(ISERROR(SEARCH(\"*His*\",Failing_Kids!$F13,1)),IF(ISERROR(SEARCH(\"*GOV*\",Failing_Kids!$F13,1)),IF(ISERROR(SEARCH(\"*Econ*\",Failing_Kids!$F13,1)),IF(ISERROR(SEARCH(\"*Soc*\",Failing_Kids!$F13,1)),\"\",\"X\"),\"X\"),\"X\"),\"X\")","v":""},{"$f":"IF(ISERROR(SEARCH(\"*PE*\",Failing_Kids!$F13,1)),\"\",\"X\")","v":""}]
[{"$f":"Failing_Kids!C14","v":"Armstrong"},{"$f":"Failing_Kids!D14","v":"Joanna"},{"$f":"IF(ISERROR(SEARCH(\"*English*\",Failing_Kids!F14,1)),\"\",\"X \")","v":""},{"$f":"IF(ISERROR(SEARCH(\"*Geometry*\",Failing_Kids!$F14,1)),IF(ISERROR(SEARCH(\"*Math*\",Failing_Kids!$F14,1)),IF(ISERROR(SEARCH(\"*Calc*\",Failing_Kids!$F14,1)),IF(ISERROR(SEARCH(\"*Algebra*\",Failing_Kids!$F14,1)),\"\",\"X\"),\"X\"),\"X\"),\"X\")","v":""},{"$f":"IF(ISERROR(SEARCH(\"*Science*\",Failing_Kids!$F14,1)),IF(ISERROR(SEARCH(\"*Bio*\",Failing_Kids!$F14,1)),IF(ISERROR(SEARCH(\"*Chem*\",Failing_Kids!$F14,1)),IF(ISERROR(SEARCH(\"*Physics*\",Failing_Kids!$F14,1)),\"\",\"X\"),\"X\"),\"X\"),\"X\")","v":""},{"$f":"IF(ISERROR(SEARCH(\"*His*\",Failing_Kids!$F14,1)),IF(ISERROR(SEARCH(\"*GOV*\",Failing_Kids!$F14,1)),IF(ISERROR(SEARCH(\"*Econ*\",Failing_Kids!$F14,1)),IF(ISERROR(SEARCH(\"*Soc*\",Failing_Kids!$F14,1)),\"\",\"X\"),\"X\"),\"X\"),\"X\")","v":""},{"$f":"IF(ISERROR(SEARCH(\"*PE*\",Failing_Kids!$F14,1)),\"\",\"X\")","v":""}]
[{"$f":"Failing_Kids!C15","v":"Armstrong"},{"$f":"Failing_Kids!D15","v":"Ronald"},{"$f":"IF(ISERROR(SEARCH(\"*English*\",Failing_Kids!F15,1)),\"\",\"X \")","v":"X "},{"$f":"IF(ISERROR(SEARCH(\"*Geometry*\",Failing_Kids!$F15,1)),IF(ISERROR(SEARCH(\"*Math*\",Failing_Kids!$F15,1)),IF(ISERROR(SEARCH(\"*Calc*\",Failing_Kids!$F15,1)),IF(ISERROR(SEARCH(\"*Algebra*\",Failing_Kids!$F15,1)),\"\",\"X\"),\"X\"),\"X\"),\"X\")","v":""},{"$f":"IF(ISERROR(SEARCH(\"*Science*\",Failing_Kids!$F15,1)),IF(ISERROR(SEARCH(\"*Bio*\",Failing_Kids!$F15,1)),IF(ISERROR(SEARCH(\"*Chem*\",Failing_Kids!$F15,1)),IF(ISERROR(SEARCH(\"*Physics*\",Failing_Kids!$F15,1)),\"\",\"X\"),\"X\"),\"X\"),\"X\")","v":""},{"$f":"IF(ISERROR(SEARCH(\"*His*\",Failing_Kids!$F15,1)),IF(ISERROR(SEARCH(\"*GOV*\",Failing_Kids!$F15,1)),IF(ISERROR(SEARCH(\"*Econ*\",Failing_Kids!$F15,1)),IF(ISERROR(SEARCH(\"*Soc*\",Failing_Kids!$F15,1)),\"\",\"X\"),\"X\"),\"X\"),\"X\")","v":""},{"$f":"IF(ISERROR(SEARCH(\"*PE*\",Failing_Kids!$F15,1)),\"\",\"X\")","v":""}]
[{"$f":"Failing_Kids!C16","v":"Arnold"},{"$f":"Failing_Kids!D16","v":"Fred"},{"$f":"IF(ISERROR(SEARCH(\"*English*\",Failing_Kids!F16,1)),\"\",\"X \")","v":""},{"$f":"IF(ISERROR(SEARCH(\"*Geometry*\",Failing_Kids!$F16,1)),IF(ISERROR(SEARCH(\"*Math*\",Failing_Kids!$F16,1)),IF(ISERROR(SEARCH(\"*Calc*\",Failing_Kids!$F16,1)),IF(ISERROR(SEARCH(\"*Algebra*\",Failing_Kids!$F16,1)),\"\",\"X\"),\"X\"),\"X\"),\"X\")","v":""},{"$f":"IF(ISERROR(SEARCH(\"*Science*\",Failing_Kids!$F16,1)),IF(ISERROR(SEARCH(\"*Bio*\",Failing_Kids!$F16,1)),IF(ISERROR(SEARCH(\"*Chem*\",Failing_Kids!$F16,1)),IF(ISERROR(SEARCH(\"*Physics*\",Failing_Kids!$F16,1)),\"\",\"X\"),\"X\"),\"X\"),\"X\")","v":""},{"$f":"IF(ISERROR(SEARCH(\"*His*\",Failing_Kids!$F16,1)),IF(ISERROR(SEARCH(\"*GOV*\",Failing_Kids!$F16,1)),IF(ISERROR(SEARCH(\"*Econ*\",Failing_Kids!$F16,1)),IF(ISERROR(SEARCH(\"*Soc*\",Failing_Kids!$F16,1)),\"\",\"X\"),\"X\"),\"X\"),\"X\")","v":""},{"$f":"IF(ISERROR(SEARCH(\"*PE*\",Failing_Kids!$F16,1)),\"\",\"X\")","v":""}]
[{"$f":"Failing_Kids!C17","v":"Atkins"},{"$f":"Failing_Kids!D17","v":"Glenn"},{"$f":"IF(ISERROR(SEARCH(\"*English*\",Failing_Kids!F17,1)),\"\",\"X \")","v":""},{"$f":"IF(ISERROR(SEARCH(\"*Geometry*\",Failing_Kids!$F17,1)),IF(ISERROR(SEARCH(\"*Math*\",Failing_Kids!$F17,1)),IF(ISERROR(SEARCH(\"*Calc*\",Failing_Kids!$F17,1)),IF(ISERROR(SEARCH(\"*Algebra*\",Failing_Kids!$F17,1)),\"\",\"X\"),\"X\"),\"X\"),\"X\")","v":""},{"$f":"IF(ISERROR(SEARCH(\"*Science*\",Failing_Kids!$F17,1)),IF(ISERROR(SEARCH(\"*Bio*\",Failing_Kids!$F17,1)),IF(ISERROR(SEARCH(\"*Chem*\",Failing_Kids!$F17,1)),IF(ISERROR(SEARCH(\"*Physics*\",Failing_Kids!$F17,1)),\"\",\"X\"),\"X\"),\"X\"),\"X\")","v":"X"},{"$f":"IF(ISERROR(SEARCH(\"*His*\",Failing_Kids!$F17,1)),IF(ISERROR(SEARCH(\"*GOV*\",Failing_Kids!$F17,1)),IF(ISERROR(SEARCH(\"*Econ*\",Failing_Kids!$F17,1)),IF(ISERROR(SEARCH(\"*Soc*\",Failing_Kids!$F17,1)),\"\",\"X\"),\"X\"),\"X\"),\"X\")","v":""},{"$f":"IF(ISERROR(SEARCH(\"*PE*\",Failing_Kids!$F17,1)),\"\",\"X\")","v":""}]
[{"$f":"Failing_Kids!C18","v":"Atkinson"},{"$f":"Failing_Kids!D18","v":"Phillip"},{"$f":"IF(ISERROR(SEARCH(\"*English*\",Failing_Kids!F18,1)),\"\",\"X \")","v":""},{"$f":"IF(ISERROR(SEARCH(\"*Geometry*\",Failing_Kids!$F18,1)),IF(ISERROR(SEARCH(\"*Math*\",Failing_Kids!$F18,1)),IF(ISERROR(SEARCH(\"*Calc*\",Failing_Kids!$F18,1)),IF(ISERROR(SEARCH(\"*Algebra*\",Failing_Kids!$F18,1)),\"\",\"X\"),\"X\"),\"X\"),\"X\")","v":"X"},{"$f":"IF(ISERROR(SEARCH(\"*Science*\",Failing_Kids!$F18,1)),IF(ISERROR(SEARCH(\"*Bio*\",Failing_Kids!$F18,1)),IF(ISERROR(SEARCH(\"*Chem*\",Failing_Kids!$F18,1)),IF(ISERROR(SEARCH(\"*Physics*\",Failing_Kids!$F18,1)),\"\",\"X\"),\"X\"),\"X\"),\"X\")","v":""},{"$f":"IF(ISERROR(SEARCH(\"*His*\",Failing_Kids!$F18,1)),IF(ISERROR(SEARCH(\"*GOV*\",Failing_Kids!$F18,1)),IF(ISERROR(SEARCH(\"*Econ*\",Failing_Kids!$F18,1)),IF(ISERROR(SEARCH(\"*Soc*\",Failing_Kids!$F18,1)),\"\",\"X\"),\"X\"),\"X\"),\"X\")","v":""},{"$f":"IF(ISERROR(SEARCH(\"*PE*\",Failing_Kids!$F18,1)),\"\",\"X\")","v":""}]
[{"$f":"Failing_Kids!C19","v":"Atkinson"},{"$f":"Failing_Kids!D19","v":"Phillip"},{"$f":"IF(ISERROR(SEARCH(\"*English*\",Failing_Kids!F19,1)),\"\",\"X \")","v":""},{"$f":"IF(ISERROR(SEARCH(\"*Geometry*\",Failing_Kids!$F19,1)),IF(ISERROR(SEARCH(\"*Math*\",Failing_Kids!$F19,1)),IF(ISERROR(SEARCH(\"*Calc*\",Failing_Kids!$F19,1)),IF(ISERROR(SEARCH(\"*Algebra*\",Failing_Kids!$F19,1)),\"\",\"X\"),\"X\"),\"X\"),\"X\")","v":""},{"$f":"IF(ISERROR(SEARCH(\"*Science*\",Failing_Kids!$F19,1)),IF(ISERROR(SEARCH(\"*Bio*\",Failing_Kids!$F19,1)),IF(ISERROR(SEARCH(\"*Chem*\",Failing_Kids!$F19,1)),IF(ISERROR(SEARCH(\"*Physics*\",Failing_Kids!$F19,1)),\"\",\"X\"),\"X\"),\"X\"),\"X\")","v":""},{"$f":"IF(ISERROR(SEARCH(\"*His*\",Failing_Kids!$F19,1)),IF(ISERROR(SEARCH(\"*GOV*\",Failing_Kids!$F19,1)),IF(ISERROR(SEARCH(\"*Econ*\",Failing_Kids!$F19,1)),IF(ISERROR(SEARCH(\"*Soc*\",Failing_Kids!$F19,1)),\"\",\"X\"),\"X\"),\"X\"),\"X\")","v":"X"},{"$f":"IF(ISERROR(SEARCH(\"*PE*\",Failing_Kids!$F19,1)),\"\",\"X\")","v":""}]
[{"$f":"Failing_Kids!C20","v":"Austin"},{"$f":"Failing_Kids!D20","v":"Yvette"},{"$f":"IF(ISERROR(SEARCH(\"*English*\",Failing_Kids!F20,1)),\"\",\"X \")","v":""},{"$f":"IF(ISERROR(SEARCH(\"*Geometry*\",Failing_Kids!$F20,1)),IF(ISERROR(SEARCH(\"*Math*\",Failing_Kids!$F20,1)),IF(ISERROR(SEARCH(\"*Calc*\",Failing_Kids!$F20,1)),IF(ISERROR(SEARCH(\"*Algebra*\",Failing_Kids!$F20,1)),\"\",\"X\"),\"X\"),\"X\"),\"X\")","v":"X"},{"$f":"IF(ISERROR(SEARCH(\"*Science*\",Failing_Kids!$F20,1)),IF(ISERROR(SEARCH(\"*Bio*\",Failing_Kids!$F20,1)),IF(ISERROR(SEARCH(\"*Chem*\",Failing_Kids!$F20,1)),IF(ISERROR(SEARCH(\"*Physics*\",Failing_Kids!$F20,1)),\"\",\"X\"),\"X\"),\"X\"),\"X\")","v":""},{"$f":"IF(ISERROR(SEARCH(\"*His*\",Failing_Kids!$F20,1)),IF(ISERROR(SEARCH(\"*GOV*\",Failing_Kids!$F20,1)),IF(ISERROR(SEARCH(\"*Econ*\",Failing_Kids!$F20,1)),IF(ISERROR(SEARCH(\"*Soc*\",Failing_Kids!$F20,1)),\"\",\"X\"),\"X\"),\"X\"),\"X\")","v":""},{"$f":"IF(ISERROR(SEARCH(\"*PE*\",Failing_Kids!$F20,1)),\"\",\"X\")","v":""}]
[{"$f":"Failing_Kids!C21","v":"Austin"},{"$f":"Failing_Kids!D21","v":"Yvette"},{"$f":"IF(ISERROR(SEARCH(\"*English*\",Failing_Kids!F21,1)),\"\",\"X \")","v":""},{"$f":"IF(ISERROR(SEARCH(\"*Geometry*\",Failing_Kids!$F21,1)),IF(ISERROR(SEARCH(\"*Math*\",Failing_Kids!$F21,1)),IF(ISERROR(SEARCH(\"*Calc*\",Failing_Kids!$F21,1)),IF(ISERROR(SEARCH(\"*Algebra*\",Failing_Kids!$F21,1)),\"\",\"X\"),\"X\"),\"X\"),\"X\")","v":""},{"$f":"IF(ISERROR(SEARCH(\"*Science*\",Failing_Kids!$F21,1)),IF(ISERROR(SEARCH(\"*Bio*\",Failing_Kids!$F21,1)),IF(ISERROR(SEARCH(\"*Chem*\",Failing_Kids!$F21,1)),IF(ISERROR(SEARCH(\"*Physics*\",Failing_Kids!$F21,1)),\"\",\"X\"),\"X\"),\"X\"),\"X\")","v":"X"},{"$f":"IF(ISERROR(SEARCH(\"*His*\",Failing_Kids!$F21,1)),IF(ISERROR(SEARCH(\"*GOV*\",Failing_Kids!$F21,1)),IF(ISERROR(SEARCH(\"*Econ*\",Failing_Kids!$F21,1)),IF(ISERROR(SEARCH(\"*Soc*\",Failing_Kids!$F21,1)),\"\",\"X\"),\"X\"),\"X\"),\"X\")","v":""},{"$f":"IF(ISERROR(SEARCH(\"*PE*\",Failing_Kids!$F21,1)),\"\",\"X\")","v":""}]
[{"$f":"Failing_Kids!C22","v":"Avila"},{"$f":"Failing_Kids!D22","v":"Natalie"},{"$f":"IF(ISERROR(SEARCH(\"*English*\",Failing_Kids!F22,1)),\"\",\"X \")","v":""},{"$f":"IF(ISERROR(SEARCH(\"*Geometry*\",Failing_Kids!$F22,1)),IF(ISERROR(SEARCH(\"*Math*\",Failing_Kids!$F22,1)),IF(ISERROR(SEARCH(\"*Calc*\",Failing_Kids!$F22,1)),IF(ISERROR(SEARCH(\"*Algebra*\",Failing_Kids!$F22,1)),\"\",\"X\"),\"X\"),\"X\"),\"X\")","v":""},{"$f":"IF(ISERROR(SEARCH(\"*Science*\",Failing_Kids!$F22,1)),IF(ISERROR(SEARCH(\"*Bio*\",Failing_Kids!$F22,1)),IF(ISERROR(SEARCH(\"*Chem*\",Failing_Kids!$F22,1)),IF(ISERROR(SEARCH(\"*Physics*\",Failing_Kids!$F22,1)),\"\",\"X\"),\"X\"),\"X\"),\"X\")","v":""},{"$f":"IF(ISERROR(SEARCH(\"*His*\",Failing_Kids!$F22,1)),IF(ISERROR(SEARCH(\"*GOV*\",Failing_Kids!$F22,1)),IF(ISERROR(SEARCH(\"*Econ*\",Failing_Kids!$F22,1)),IF(ISERROR(SEARCH(\"*Soc*\",Failing_Kids!$F22,1)),\"\",\"X\"),\"X\"),\"X\"),\"X\")","v":""},{"$f":"IF(ISERROR(SEARCH(\"*PE*\",Failing_Kids!$F22,1)),\"\",\"X\")","v":""}]
{"$rows_left_out":477}
{"sheet":"ClassCategories","index":3,"n_rows":42,"n_cols":2,"rows_kept":42,"cut":false,"hidden":false,"merged":[]}
["Course","MapsTo"]
["3-D DESIGN 3","Elective"]
["ACCOUNT 1","Elective"]
["Algebra 1 Sem 1","Math"]
["Algebra 1 Sem 1/Lab","Math"]
["Algebra 1 Sem 2","Math"]
["Algebra 2 Sem 1","Math"]
["AP BIO 1","Science"]
["AP US/AZ HIS","Social Studies"]
["ARCH DRAFT","Elective"]
["BEGIN GUITAR","Elective"]
["BIOLOGY 1","Science"]
["Business Technology 1","Elective"]
["CHEMISTRY 1","Science"]
["Culinary Arts 1","Elective"]
["ENGLISH 1","English"]
["ENGLISH 3","English"]
["ENGLISH 5","English"]
["English Fundamentals 5","English"]
["Geometry Sem 1","Math"]
{"$rows_left_out":22}