{"text_format":"1","workbook":"xlsx","n_sheets":4,"sheets":["PivotTable","Failing_Kids","Final","ClassCategories"],"not_rendered":{"charts":0,"images":0,"macros":0,"external_links":0,"defined_names":0,"comments":0,"pivot_tables":1},"unopened":[],"bounds":{"document_bytes":16777216,"sheet_cells":100000,"rows_first":2000,"rows_last":500,"rows_between":2000,"halvings":0,"cell_chars":16384,"cell_head_chars":4096},"cells_cut":0,"cells_raw":0,"read":"whole","date_system":"1900"}

{"sheet":"PivotTable","index":0,"n_rows":320,"n_cols":7,"rows_kept":320,"cut":false,"hidden":false,"merged":[]}
[]
[]
["Count of Letter Grade","Category"]
["Name","Elective","English","Math","Phys Ed","Science","Social Studies"]
["Abbott Howard",0,1,0,0,0,0]
["Aguilar Carlos",0,0,1,0,0,1]
["Albert Harry",0,0,0,0,0,1]
["Allen Alfred",0,0,1,0,0,0]
["Allison Samuel",0,1,1,0,0,0]
["Alvarado Kristin",0,0,1,0,0,0]
["Armstrong Joanna",1,1,1,0,0,0]
["Armstrong Ronald",0,1,0,0,0,0]
["Arnold Fred",1,0,0,0,0,0]
["Atkins Glenn",0,0,0,0,1,0]
["Atkinson Phillip",0,0,1,0,0,1]
["Austin Yvette",0,0,1,0,1,0]
["Avila Natalie",1,0,0,0,0,0]
["Baird Whitney",0,0,1,0,0,0]
["Ball Bernice",1,0,0,0,1,0]
["Ballard Terry",0,1,0,0,0,0]
["Barrett Henry",0,0,1,0,0,1]
["Barrett Jenny",0,0,1,0,0,0]
["Barrett Monique",0,0,1,0,0,1]
["Barton Beulah",0,0,0,0,1,0]
["Bass Jesse",1,0,1,0,0,1]
["Bates Catherine",0,1,0,0,0,0]
["Beach Catherine",0,0,0,0,0,1]
["Beasley Erika",0,0,1,0,0,0]
["Beck Russell",0,0,1,0,0,0]
["Bender Richard",0,1,0,0,0,0]
["Berger Marlene",1,1,1,0,0,0]
["Best Brandon",0,0,1,0,0,0]
["Blackburn Martha",0,1,1,0,0,2]
["Blake Kenneth",0,0,0,0,1,0]
["Blanchard Bonnie",0,1,0,0,1,0]
["Blankenship Arthur",0,0,0,0,0,1]
["Blankenship Tracey",0,0,1,0,0,0]
["Booker Kayla",0,0,1,0,0,1]
["Boone Jamie",0,0,0,0,0,1]
["Boone Laura",0,0,1,0,0,0]
["Bowman Ada",0,1,0,0,0,0]
["Bradshaw Marlene",0,0,1,0,0,1]
["Brewer Rebecca",1,0,0,0,0,0]
["Briggs Stanley",0,1,1,0,0,0]
["Britt Marcia",0,0,1,0,0,1]
["Brooks Carolyn",0,1,0,0,0,0]
["Brown William",1,0,0,0,0,0]
["Browning Jeffrey",0,0,1,0,0,0]
["Bryant Tracey",0,1,0,0,0,1]
["Buchanan Ernest",0,0,0,0,1,0]
["Buckner Chad",0,1,0,0,0,0]
["Buckner Ruby",0,1,0,0,0,1]
["Bullock Holly",0,0,1,0,0,0]
["Burks Jacob",1,0,0,0,0,0]
["Burnett Lynn",0,0,0,0,1,0]
["Burnett Rodney",0,0,1,0,0,0]
["Bush Carol",1,0,0,1,0,0]
["Callahan Arthur",0,1,0,0,0,1]
["Camacho Crystal",0,1,0,0,0,0]
["Cantrell Russell",0,0,0,0,0,1]
["Cantu Cora",0,0,1,0,0,0]
["Cantu Terry",0,1,0,0,1,0]
["Carroll Anthony",1,0,0,0,0,0]
["Casey Allison",0,0,1,0,0,0]
["Castaneda Kimberly",0,1,1,0,0,0]
["Castro Mildred",0,0,1,0,0,0]
["Chandler Jeannette",1,0,1,0,0,0]
["Chaney Dale",0,0,1,0,0,0]
["Chapman Joseph",0,1,0,0,0,0]
["Clemons Jennifer",1,0,1,0,1,0]
["Clemons Theresa",0,0,1,0,0,0]
["Cochran Marjorie",1,0,1,0,0,0]
["Cole Andrew",1,0,0,0,1,0]
["Cole Emma",1,1,1,0,1,0]
["Cole Hazel",0,0,0,0,0,1]
["Collins Sean",1,0,0,0,0,0]
["Combs Sheila",0,1,0,0,0,0]
["Conley Naomi",0,1,0,0,0,0]
["Conley Nellie",0,0,0,0,0,1]
["Conner Veronica",0,1,0,0,1,0]
["Contreras Willie",0,1,0,0,0,1]
["Cook Dale",0,0,1,0,0,0]
["Cooke Antonio",0,1,1,0,0,0]
["Cooley Veronica",0,0,1,0,0,0]
["Cooper Melanie",0,1,1,0,0,1]
["Cortez Pearl",0,1,0,0,0,0]
["Cox Roy",0,1,0,0,0,0]
["Cox Thelma",0,0,1,0,0,0]
["Cruz Yolanda",0,0,1,0,0,0]
["Cummings Nicole",0,0,1,0,0,0]
["Dalton Anita",0,0,0,0,1,0]
["Dawson Jacqueline",0,1,1,0,0,1]
["Delacruz Shawn",0,0,1,0,0,0]
["Diaz Glenn",0,0,1,0,0,0]
["Dillard Glenn",0,0,0,0,0,1]
["Dixon Carolyn",0,0,1,0,0,0]
["Drake Glenda",0,0,0,0,1,0]
["Duncan Stanley",0,0,1,0,0,0]
["Durham Brian",0,1,1,0,0,0]
["Durham Vera",0,1,1,0,0,0]
["English Harry",0,1,0,0,0,1]
["Ewing Sharon",0,0,1,0,1,0]
["Faulkner Norman",0,0,1,1,0,0]
["Fernandez Carlos",0,1,0,0,0,0]
["Fields Douglas",0,0,1,0,0,0]
["Fischer Karla",0,0,0,0,0,1]
["Fletcher Judith",0,1,0,0,0,0]
["Fletcher Myrtle",0,0,0,0,0,1]
["Foreman Jan",0,1,0,0,0,0]
["Frank Kimberly",0,0,1,0,0,1]
["Franks Mildred",0,0,1,0,0,0]
["Frederick Kim",0,0,1,0,0,0]
["Frye Julie",0,0,1,0,0,1]
["Galloway Louis",0,1,0,0,0,0]
["Garcia Inez",0,1,1,0,0,0]
["Garner Leonard",0,1,1,0,0,1]
["George Kevin",1,0,0,0,0,0]
["Giles Nancy",0,0,0,0,0,1]
["Glass Bobby",0,0,1,0,0,0]
["Glover Chad",0,0,1,0,0,0]
["Gonzales Justin",0,1,1,0,0,1]
["Goodman Ada",0,1,0,0,0,0]
["Gordon Marie",1,0,0,0,0,0]
["Grant Mark",0,0,1,0,0,0]
["Gray Arthur",0,0,1,0,0,1]
["Griffin Billy",0,0,1,0,0,0]
["Gutierrez Stephen",0,0,1,0,0,0]
["Hamilton Jeanne",0,0,1,0,0,0]
["Hammond Esther",0,0,1,0,0,1]
["Haney Madeline",1,0,0,0,0,1]
["Hardin Esther",0,1,0,0,0,0]
["Harding Allen",0,0,1,0,0,0]
["Harmon Melanie",0,1,2,0,1,0]
["Harrington Keith",0,1,1,0,0,1]
["Hartman Lillian",1,0,0,0,0,0]
["Haynes Alan",0,0,1,0,0,1]
["Hebert Carlos",0,0,2,0,1,0]
["Hendricks Bradley",0,1,1,0,0,0]
["Henry Kathleen",0,0,0,0,0,1]
["Hernandez Lawrence",0,0,1,0,0,0]
["Higgins Claire",0,0,0,0,1,0]
["Hobbs Jamie",0,1,0,0,0,0]
["Hoffman Laura",0,1,0,0,0,0]
["Holt Allen",0,0,0,0,1,0]
["Holt Marian",0,0,0,0,0,1]
["Hood Ella",0,0,0,0,1,0]
["Hoover Marion",0,0,0,0,0,1]
["Horne Brandon",0,1,1,0,0,0]
["Howe Alfred",0,0,0,0,0,1]
["Howe Carla",0,1,1,0,1,1]
["Hubbard Jacqueline",0,1,0,0,0,0]
["Hull Shelly",0,0,1,0,0,0]
["Hunter Jan",0,1,1,0,0,1]
["Hurley Madeline",0,0,1,0,0,0]
["Hurley Melissa",1,0,1,0,0,0]
["Jefferson Jimmy",0,1,0,0,0,0]
["Jensen Martha",0,0,1,0,0,0]
["Jones Paul",0,0,0,0,0,1]
["Jordan Jean",0,0,1,0,0,1]
["Jordan Margarita",0,1,0,0,0,0]
["Justice Myrtle",0,0,0,0,1,0]
["Kane Maxine",0,0,0,0,0,1]
["Kelley Carol",0,1,1,0,0,1]
["Kemp Aaron",0,1,0,0,0,0]
["Kemp Roy",0,0,0,0,0,1]
["Kennedy Eva",0,1,0,0,0,0]
["Kennedy Whitney",0,0,0,0,1,0]
["Kim Myrtle",0,0,0,0,1,0]
["Kinney Christopher",0,1,1,0,0,1]
["Kirby Amy",0,1,0,0,0,1]
["Kramer Norma",0,0,0,0,1,0]
["Lamb Gregory",0,0,1,0,0,1]
["Larsen Allison",0,1,1,0,1,0]
["Le Nathan",0,0,0,0,1,1]
["Lester Ronald",0,0,0,0,0,1]
["Lindsay Mamie",1,1,1,0,0,0]
["Lindsey Marilyn",0,0,0,0,0,1]
["Lindsey Maxine",0,0,0,0,0,2]
["Little Eugene",0,1,0,0,0,0]
["Lloyd Charlotte",0,0,0,0,0,1]
["Lloyd Kathleen",0,0,0,0,0,1]
["Love Jeannette",1,0,0,0,0,0]
["Lowery Carl",0,0,0,0,1,0]
["Lucas Ellen",0,0,1,0,0,0]
["Maddox Gloria",0,0,0,0,0,1]
["Manning Tiffany",0,0,1,0,0,0]
["Marquez Gloria",1,0,0,0,0,0]
["Massey Melissa",1,1,0,0,0,0]
["Maynard Keith",1,1,0,0,0,0]
["Mayo Christy",0,1,0,0,0,0]
["Mccarthy Claudia",1,0,1,0,0,1]
["Mcclain Maureen",0,0,1,0,0,0]
["Mccoy Brandy",0,1,0,0,0,0]
["Mccullough Glenn",0,0,1,0,0,0]
["Mcfadden Shawn",0,1,0,0,0,1]
["Mcfarland Mike",0,0,0,0,1,0]
["Mcgee Robin",0,1,0,0,0,0]
["Mcintyre Barbara",0,1,0,0,0,0]
["Mcintyre Charlotte",0,0,1,0,0,0]
["Mcknight Kim",0,0,2,0,0,0]
["Mcleod Lillian",0,1,0,0,0,0]
["Mcneil Louis",0,0,1,0,0,0]
["Medina Harriet",0,0,0,0,0,1]
["Meyers Rodney",0,0,1,0,0,0]
["Michael Roger",1,0,0,0,0,0]
["Miller Joann",1,1,1,0,0,0]
["Moore Lori",0,1,0,0,0,0]
["Morales Phillip",0,0,1,0,0,0]
["Moreno Samuel",0,0,1,0,0,0]
["Morgan Alfred",1,0,1,0,0,0]
["Morgan Yolanda",0,0,1,0,0,0]
["Morse Ronald",0,0,1,0,0,0]
["Moses Melanie",1,0,2,0,0,0]
["Mullins Juan",0,0,1,0,0,0]
["Munoz Yolanda",0,1,0,0,0,1]
["Murphy Carlos",1,1,1,0,0,0]
["Murphy Douglas",0,0,0,0,1,0]
["Navarro Adam",0,0,0,0,0,1]
["Nichols Gwendolyn",0,0,0,0,1,0]
["Nichols Ryan",0,0,1,0,0,1]
["Nixon Claire",0,1,0,0,0,0]
["Noble Candice",0,0,0,0,0,1]
["Nolan Allen",0,0,1,0,1,0]
["Obrien Melanie",0,1,0,0,0,0]
["Ochoa Daniel",0,0,1,0,0,0]
["Oliver Joshua",0,1,0,0,0,0]
["Oliver Lauren",0,0,0,0,1,0]
["Ortega Walter",0,1,0,0,1,0]
["Palmer Cecilia",0,0,0,0,0,1]
["Park Andrew",0,0,1,0,1,0]
["Park Rita",0,0,1,0,0,0]
["Patel Glenda",0,1,1,1,0,0]
["Patterson Joan",0,1,0,0,0,1]
["Paul Esther",0,0,1,0,1,1]
["Paul Manuel",0,1,0,0,1,0]
["Pearson Charlotte",2,0,1,0,0,0]
["Pearson Marie",0,0,1,0,0,1]
["Pearson Stacy",2,0,0,0,0,0]
["Perry Kathryn",0,1,1,0,0,0]
["Pickett Marilyn",0,1,1,0,0,1]
["Pickett Robert",0,1,1,0,0,0]
["Poole Anthony",1,0,0,0,0,0]
["Pope Michele",0,0,1,0,0,0]
["Pope Natalie",0,2,1,0,0,1]
["Powers Sylvia",0,0,1,0,1,0]
["Price Madeline",1,0,0,0,0,0]
["Quinn Amy",0,1,0,0,0,1]
["Quinn Matthew",0,0,1,0,0,1]
["Richardson Christopher",0,0,1,0,0,0]
["Richmond Emma",0,1,0,0,0,0]
["Riggs Kathryn",0,1,0,0,0,0]
["Riggs Wilma",1,0,0,0,1,0]
["Rivas Jeremy",0,0,0,0,1,0]
["Rocha Mildred",0,1,0,0,0,0]
["Rodriquez Delores",0,1,1,0,1,0]
["Romero Jose",0,0,0,0,1,0]
["Ross Kristin",0,0,1,0,0,0]
["Ross Scott",0,1,1,0,0,1]
["Rowe Chris",0,1,1,0,1,0]
["Ruiz Diane",0,1,1,0,0,0]
["Rush Terry",0,1,0,0,0,0]
["Salas Emma",0,0,0,0,0,1]
["Sanders Gerald",1,1,0,0,0,0]
["Savage Stacy",0,0,0,0,1,0]
["Savage Tony",0,0,0,0,0,1]
["Schmidt Stacy",0,1,0,0,0,0]
["Sears Jeff",0,0,0,0,0,1]
["Serrano Johnny",0,1,0,0,0,0]
["Sexton Emma",0,0,1,0,0,0]
["Shaffer Joshua",0,0,0,0,0,1]
["Shaffer Norman",0,0,0,0,0,1]
["Shelton Justin",0,0,1,0,0,0]
["Shelton Sandra",0,0,1,0,0,0]
["Shepard Sandy",0,1,0,0,0,0]
["Sheppard Judith",0,1,0,0,0,0]
["Silva Jack",0,0,0,0,0,1]
["Silva Lawrence",0,0,1,0,0,0]
["Silva Victor",1,1,1,0,0,0]
["Singleton Grace",0,1,0,0,0,0]
["Sloan Teresa",0,0,0,0,0,1]
["Spencer Nathan",0,0,1,0,0,0]
["Stevens Brian",0,1,0,0,0,0]
["Stevenson Gloria",0,0,1,0,0,0]
["Stout Shelly",0,0,1,0,0,0]
["Strickland John",1,0,0,0,0,0]
["Stuart Jeremy",1,0,0,0,0,0]
["Summers Melissa",0,0,1,0,0,0]
["Swanson Ada",0,1,0,0,0,0]
["Sykes Kevin",1,0,0,0,0,0]
["Tanner Kenneth",0,1,0,0,0,0]
["Thompson Jerry",0,0,1,0,0,0]
["Thornton Rodney",0,0,0,0,0,1]
["Torres Nellie",0,0,0,0,0,1]
["Travis Nancy",0,0,0,0,1,0]
["Valencia Curtis",0,0,1,0,0,0]
["Vance Victoria",0,0,0,0,0,2]
["Vang Glenn",0,0,0,0,0,1]
["Vega Catherine",0,0,1,0,0,1]
["Velazquez Benjamin",0,0,0,0,1,0]
["Waller Ann",0,0,1,1,1,0]
["Waller Benjamin",0,1,0,0,1,0]
["Walls Eugene",0,0,0,0,1,0]
["Walter Thelma",0,0,1,0,0,0]
["Walters Constance",0,0,1,0,0,1]
["Washington Jo",0,0,1,0,0,0]
["Welch Alfred",0,0,1,0,0,0]
["Wheeler James",0,1,0,0,0,0]
["Whitaker Steven",0,1,0,0,0,0]
["Whitfield Tracey",0,0,0,0,0,1]
["Whitley April",0,0,1,0,0,0]
["Whitney Victor",0,2,0,0,0,1]
["Wilcox Veronica",0,0,0,0,0,1]
["Wilkins Ramona",0,0,1,0,0,0]
["Wilkinson Melanie",0,1,0,0,0,1]
["Wilson Gary",0,0,0,0,0,1]
["Wilson Sean",0,0,1,0,0,1]
["Wood Todd",0,0,1,0,0,0]
["Woodard Jeffrey",0,0,0,0,0,1]
["Wyatt Elsie",0,0,1,0,0,0]
["Wynn Ada",0,0,0,0,0,1]

{"sheet":"Failing_Kids","index":1,"n_rows":464,"n_cols":15,"rows_kept":464,"cut":false,"hidden":false,"merged":[[1,2,1,14]]}
[null,null,"Total Records:380"]
[null,null,"All Records"]
["Name","Category","Last","First","Grade","Course","Course #","Teacher","Letter Grade","grading.task","grading.termName","Percent","Period","student.activeToday","ID #"]
[{"$f":"C4&\" \"&D4","v":"Abbott Howard"},{"$f":"VLOOKUP(F4,ClassCategories!$A$2:$B$42,2,0)","v":"English"},"Abbott","Howard",10,"ENGLISH 3",909,"Weiss, Gwendolyn","F","Eligibility","Quarter 1",54.84,1,1,999999999]
[{"$f":"C5&\" \"&D5","v":"Aguilar Carlos"},{"$f":"VLOOKUP(F5,ClassCategories!$A$2:$B$42,2,0)","v":"Math"},"Aguilar","Carlos",11,"Algebra 2 Sem 1",1177,"Riley, Frank","F","Eligibility","Quarter 1",45.14,1,1,999999999]
["Aguilar Carlos",{"$f":"VLOOKUP(F6,ClassCategories!$A$2:$B$42,2,0)","v":"Social Studies"},"Aguilar","Carlos",11,"US/AZ HIS 1",1529,"Espinoza, Adam","F","Eligibility","Quarter 1",35.76,5,1,999999999]
["Albert Harry",{"$f":"VLOOKUP(F7,ClassCategories!$A$2:$B$42,2,0)","v":"Social Studies"},"Albert","Harry",11,"AP US/AZ HIS",1531,"Shepard, Diana","F","Eligibility","Quarter 1",59.15,7,1,999999999]
["Allen Alfred",{"$f":"VLOOKUP(F8,ClassCategories!$A$2:$B$42,2,0)","v":"Math"},"Allen","Alfred",10,"Algebra 1 Sem 1",1119,"James, Lola","F","Eligibility","Quarter 1",27.8,4,1,999999999]
["Allison Samuel",{"$f":"VLOOKUP(F9,ClassCategories!$A$2:$B$42,2,0)","v":"English"},"Allison","Samuel",10,"ENGLISH 3",909,"Sheppard, Chad","F","Eligibility","Quarter 1",55.38,6,1,999999999]
["Allison Samuel",{"$f":"VLOOKUP(F10,ClassCategories!$A$2:$B$42,2,0)","v":"Math"},"Allison","Samuel",10,"Geometry Sem 1",1131,"Ortega, Alma","F","Eligibility","Quarter 1",59.1,2,1,999999999]
["Alvarado Kristin",{"$f":"VLOOKUP(F11,ClassCategories!$A$2:$B$42,2,0)","v":"Math"},"Alvarado","Kristin",11,"Algebra 2 Sem 1",1177,"Riley, Frank","F","Eligibility","Quarter 1",34.619999999999997,1,1,999999999]
["Armstrong Joanna",{"$f":"VLOOKUP(F12,ClassCategories!$A$2:$B$42,2,0)","v":"Math"},"Armstrong","Joanna",11,"Algebra 2 Sem 1",1177,"Riley, Frank","F","Eligibility","Quarter 1",52.54,1,1,999999999]
["Armstrong Joanna",{"$f":"VLOOKUP(F13,ClassCategories!$A$2:$B$42,2,0)","v":"English"},"Armstrong","Joanna",11,"ENGLISH 5",915,"Sawyer, Jeff","F","Eligibility","Quarter 1",35.29,3,1,999999999]
["Armstrong Joanna",{"$f":"VLOOKUP(F14,ClassCategories!$A$2:$B$42,2,0)","v":"Elective"},"Armstrong","Joanna",11,"GERMAN 3",611,"Simon, Guadalupe","F","Eligibility","Quarter 1",57.35,7,1,999999999]
["Armstrong Ronald",{"$f":"VLOOKUP(F15,ClassCategories!$A$2:$B$42,2,0)","v":"English"},"Armstrong","Ronald",11,"ENGLISH 3",909,"Ray, Stacy","F","Eligibility","Quarter 1",41.58,3,1,999999999]
["Arnold Fred",{"$f":"VLOOKUP(F16,ClassCategories!$A$2:$B$42,2,0)","v":"Elective"},"Arnold","Fred",10,"ACCOUNT 1",501,"Richmond, Elsie","F","Eligibility","Quarter 1",46.67,2,1,999999999]
["Atkins Glenn",{"$f":"VLOOKUP(F17,ClassCategories!$A$2:$B$42,2,0)","v":"Science"},"Atkins","Glenn",10,"BIOLOGY 1",1407,"Kaufman, Philip","F","Eligibility","Quarter 1",31.67,6,1,999999999]
["Atkinson Phillip",{"$f":"VLOOKUP(F18,ClassCategories!$A$2:$B$42,2,0)","v":"Math"},"Atkinson","Phillip",11,"Algebra 1 Sem 2",3119,"Gallegos, Brandy","F","Eligibility","Quarter 1",46.31,1,1,999999999]
["Atkinson Phillip",{"$f":"VLOOKUP(F19,ClassCategories!$A$2:$B$42,2,0)","v":"Social Studies"},"Atkinson","Phillip",11,"US/AZ HIS 1",1529,"Torres, Carl","F","Eligibility","Quarter 1",42.93,2,1,999999999]
["Austin Yvette",{"$f":"VLOOKUP(F20,ClassCategories!$A$2:$B$42,2,0)","v":"Math"},"Austin","Yvette",9,"Algebra 1 Sem 1",1119,"Barrera, Melanie","F","Eligibility","Quarter 1",34.28,1,1,999999999]
["Austin Yvette",{"$f":"VLOOKUP(F21,ClassCategories!$A$2:$B$42,2,0)","v":"Science"},"Austin","Yvette",9,"T SCIENCE 1",1429,"Kaufman, Philip","F","Eligibility","Quarter 1",47.08,7,1,999999999]
["Avila Natalie",{"$f":"VLOOKUP(F22,ClassCategories!$A$2:$B$42,2,0)","v":"Elective"},"Avila","Natalie",10,"JAPANESE 3",647,"Carney, Shelly","F","Eligibility","Quarter 1",19.5,2,1,999999999]
["Baird Whitney",{"$f":"VLOOKUP(F23,ClassCategories!$A$2:$B$42,2,0)","v":"Math"},"Baird","Whitney",10,"Hon Algebra 2 Sem 1",1173,"Riley, Frank","F","Eligibility","Quarter 1",31.72,5,1,999999999]
["Ball Bernice",{"$f":"VLOOKUP(F24,ClassCategories!$A$2:$B$42,2,0)","v":"Elective"},"Ball","Bernice",9,"Culinary Arts 1",735,"Chaney, Erin","F","Eligibility","Quarter 1",56,6,1,999999999]
["Ball Bernice",{"$f":"VLOOKUP(F25,ClassCategories!$A$2:$B$42,2,0)","v":"Science"},"Ball","Bernice",9,"T SCIENCE 1",1429,"Kaufman, Philip","F","Eligibility","Quarter 1",40.619999999999997,2,1,999999999]
["Ballard Terry",{"$f":"VLOOKUP(F26,ClassCategories!$A$2:$B$42,2,0)","v":"English"},"Ballard","Terry",10,"ENGLISH 3",909,"Weiss, Gwendolyn","F","Eligibility","Quarter 1",29.21,1,1,999999999]
["Barrett Henry",{"$f":"VLOOKUP(F27,ClassCategories!$A$2:$B$42,2,0)","v":"Math"},"Barrett","Henry",11,"Geometry Sem 1",1131,"Ortega, Alma","F","Eligibility","Quarter 1",35.520000000000003,3,1,999999999]
["Barrett Henry",{"$f":"VLOOKUP(F28,ClassCategories!$A$2:$B$42,2,0)","v":"Social Studies"},"Barrett","Henry",11,"US/AZ HIS 1",1529,"Mccormick, Carla","F","Eligibility","Quarter 1",0,5,1,999999999]
["Barrett Jenny",{"$f":"VLOOKUP(F29,ClassCategories!$A$2:$B$42,2,0)","v":"Math"},"Barrett","Jenny",9,"Algebra 1 Sem 1",1119,"Barrera, Melanie","F","Eligibility","Quarter 1",55.29,2,1,999999999]
["Barrett Monique",{"$f":"VLOOKUP(F30,ClassCategories!$A$2:$B$42,2,0)","v":"Math"},"Barrett","Monique",11,"Algebra 2 Sem 1",1177,"Riley, Frank","F","Eligibility","Quarter 1",36,1,1,999999999]
["Barrett Monique",{"$f":"VLOOKUP(F31,ClassCategories!$A$2:$B$42,2,0)","v":"Social Studies"},"Barrett","Monique",11,"US/AZ HIS 1",1529,"Espinoza, Adam","F","Eligibility","Quarter 1",38.090000000000003,6,1,999999999]
["Barton Beulah",{"$f":"VLOOKUP(F32,ClassCategories!$A$2:$B$42,2,0)","v":"Science"},"Barton","Beulah",9,"T SCIENCE 1",1429,"Kaufman, Philip","F","Eligibility","Quarter 1",43.75,5,1,999999999]
["Bass Jesse",{"$f":"VLOOKUP(F33,ClassCategories!$A$2:$B$42,2,0)","v":"Math"},"Bass","Jesse",11,"Algebra 2 Sem 1",1177,"Talley, Eugene","F","Eligibility","Quarter 1",24.93,2,1,999999999]
["Bass Jesse",{"$f":"VLOOKUP(F34,ClassCategories!$A$2:$B$42,2,0)","v":"Elective"},"Bass","Jesse",11,"Culinary Arts 1",735,"Chaney, Erin","F","Eligibility","Quarter 1",46.3,1,1,999999999]
["Bass Jesse",{"$f":"VLOOKUP(F35,ClassCategories!$A$2:$B$42,2,0)","v":"Social Studies"},"Bass","Jesse",11,"US/AZ HIS 1",1529,"Espinoza, Adam","F","Eligibility","Quarter 1",58.09,3,1,999999999]
["Bates Catherine",{"$f":"VLOOKUP(F36,ClassCategories!$A$2:$B$42,2,0)","v":"English"},"Bates","Catherine",11,"ENGLISH 3",909,"Ray, Stacy","F","Eligibility","Quarter 1",36.94,3,1,999999999]
["Beach Catherine",{"$f":"VLOOKUP(F37,ClassCategories!$A$2:$B$42,2,0)","v":"Social Studies"},"Beach","Catherine",10,"Honors W History/Geography",1505,"Dominguez, Carl","F","Eligibility","Quarter 1",0,7,1,999999999]
["Beasley Erika",{"$f":"VLOOKUP(F38,ClassCategories!$A$2:$B$42,2,0)","v":"Math"},"Beasley","Erika",10,"Geometry Sem 1",1131,"Ortega, Alma","F","Eligibility","Quarter 1",0,1,1,999999999]
["Beck Russell",{"$f":"VLOOKUP(F39,ClassCategories!$A$2:$B$42,2,0)","v":"Math"},"Beck","Russell",9,"Algebra 1 Sem 1",1119,"Gould, George","F","Eligibility","Quarter 1",55.27,3,1,999999999]
["Bender Richard",{"$f":"VLOOKUP(F40,ClassCategories!$A$2:$B$42,2,0)","v":"English"},"Bender","Richard",10,"Honors English 3",941,"Hobbs, Pearl","F","Eligibility","Quarter 1",53.48,3,1,999999999]
["Berger Marlene",{"$f":"VLOOKUP(F41,ClassCategories!$A$2:$B$42,2,0)","v":"English"},"Berger","Marlene",10,"ENGLISH 3",909,"Weiss, Gwendolyn","F","Eligibility","Quarter 1",51.31,1,1,999999999]
["Berger Marlene",{"$f":"VLOOKUP(F42,ClassCategories!$A$2:$B$42,2,0)","v":"Elective"},"Berger","Marlene",10,"GERMAN 3",611,"Simon, Guadalupe","F","Eligibility","Quarter 1",52.81,7,1,999999999]
["Berger Marlene",{"$f":"VLOOKUP(F43,ClassCategories!$A$2:$B$42,2,0)","v":"Math"},"Berger","Marlene",10,"Hon Algebra 2 Sem 1",1173,"Riley, Frank","F","Eligibility","Quarter 1",58.38,5,1,999999999]
["Best Brandon",{"$f":"VLOOKUP(F44,ClassCategories!$A$2:$B$42,2,0)","v":"Math"},"Best","Brandon",10,"Hon Algebra 2 Sem 1",1173,"Riley, Frank","F","Eligibility","Quarter 1",54.95,6,1,999999999]
["Blackburn Martha",{"$f":"VLOOKUP(F45,ClassCategories!$A$2:$B$42,2,0)","v":"English"},"Blackburn","Martha",11,"ENGLISH 5",915,"Sawyer, Jeff","F","Eligibility","Quarter 1",46.67,2,1,999999999]
["Blackburn Martha",{"$f":"VLOOKUP(F46,ClassCategories!$A$2:$B$42,2,0)","v":"Math"},"Blackburn","Martha",11,"Geometry Sem 2",3133,"Lawson, Philip","F","Eligibility","Quarter 1",56.01,1,1,999999999]
["Blackburn Martha",{"$f":"VLOOKUP(F47,ClassCategories!$A$2:$B$42,2,0)","v":"Social Studies"},"Blackburn","Martha",11,"US/AZ HIS 1",1529,"Torres, Carl","F","Eligibility","Quarter 1",21.76,4,1,999999999]
["Blackburn Martha",{"$f":"VLOOKUP(F48,ClassCategories!$A$2:$B$42,2,0)","v":"Social Studies"},"Blackburn","Martha",11,"W HIS/AZ G1",1541,"Raymond, Lillian","F","Eligibility","Quarter 1",51.18,7,1,999999999]
["Blake Kenneth",{"$f":"VLOOKUP(F49,ClassCategories!$A$2:$B$42,2,0)","v":"Science"},"Blake","Kenneth",11,"Honors Pre Calculus",1089,"Small, Kelli","F","Eligibility","Quarter 1",51.28,3,1,999999999]
["Blanchard Bonnie",{"$f":"VLOOKUP(F50,ClassCategories!$A$2:$B$42,2,0)","v":"Science"},"Blanchard","Bonnie",10,"BIOLOGY 1",1407,"Byers, Dale","F","Eligibility","Quarter 1",38.06,5,1,999999999]
["Blanchard Bonnie",{"$f":"VLOOKUP(F51,ClassCategories!$A$2:$B$42,2,0)","v":"English"},"Blanchard","Bonnie",10,"ENGLISH 3",909,"Weiss, Gwendolyn","F","Eligibility","Quarter 1",53.93,1,1,999999999]
["Blankenship Arthur",{"$f":"VLOOKUP(F52,ClassCategories!$A$2:$B$42,2,0)","v":"Social Studies"},"Blankenship","Arthur",11,"US/AZ HIS 1",1529,"Espinoza, Adam","F","Eligibility","Quarter 1",48.03,6,1,999999999]
["Blankenship Tracey",{"$f":"VLOOKUP(F53,ClassCategories!$A$2:$B$42,2,0)","v":"Math"},"Blankenship","Tracey",10,"Geometry Sem 1",1131,"Ortega, Alma","F","Eligibility","Quarter 1",55.35,3,1,999999999]
["Booker Kayla",{"$f":"VLOOKUP(F54,ClassCategories!$A$2:$B$42,2,0)","v":"Math"},"Booker","Kayla",11,"Geometry Sem 1",1131,"Barrera, Melanie","F","Eligibility","Quarter 1",54.12,7,1,999999999]
["Booker Kayla",{"$f":"VLOOKUP(F55,ClassCategories!$A$2:$B$42,2,0)","v":"Social Studies"},"Booker","Kayla",11,"US/AZ HIS 1",1529,"Espinoza, Adam","F","Eligibility","Quarter 1",53.69,6,1,999999999]
["Boone Jamie",{"$f":"VLOOKUP(F56,ClassCategories!$A$2:$B$42,2,0)","v":"Social Studies"},"Boone","Jamie",11,"US/AZ HIS 1",1529,"Espinoza, Adam","F","Eligibility","Quarter 1",36,5,1,999999999]
["Boone Laura",{"$f":"VLOOKUP(F57,ClassCategories!$A$2:$B$42,2,0)","v":"Math"},"Boone","Laura",9,"Algebra 1 Sem 1/Lab",1125,"James, Lola","F","Eligibility","Quarter 1",0,6,1,999999999]
["Bowman Ada",{"$f":"VLOOKUP(F58,ClassCategories!$A$2:$B$42,2,0)","v":"English"},"Bowman","Ada",10,"Honors English 3",941,"Hobbs, Pearl","F","Eligibility","Quarter 1",58.54,2,1,999999999]
["Bradshaw Marlene",{"$f":"VLOOKUP(F59,ClassCategories!$A$2:$B$42,2,0)","v":"Math"},"Bradshaw","Marlene",11,"Algebra 2 Sem 1",1177,"Talley, Eugene","F","Eligibility","Quarter 1",58.4,7,1,999999999]
["Bradshaw Marlene",{"$f":"VLOOKUP(F60,ClassCategories!$A$2:$B$42,2,0)","v":"Social Studies"},"Bradshaw","Marlene",11,"US/AZ HIS 1",1529,"Torres, Carl","F","Eligibility","Quarter 1",34.44,2,1,999999999]
["Brewer Rebecca",{"$f":"VLOOKUP(F61,ClassCategories!$A$2:$B$42,2,0)","v":"Elective"},"Brewer","Rebecca",10,"SPANISH 3",633,"Mcdonald, Amanda","F","Eligibility","Quarter 1",47.19,3,1,999999999]
["Briggs Stanley",{"$f":"VLOOKUP(F62,ClassCategories!$A$2:$B$42,2,0)","v":"Math"},"Briggs","Stanley",11,"Algebra 2 Sem 1",1177,"Riley, Frank","F","Eligibility","Quarter 1",58.42,3,1,999999999]
["Briggs Stanley",{"$f":"VLOOKUP(F63,ClassCategories!$A$2:$B$42,2,0)","v":"English"},"Briggs","Stanley",11,"ENGLISH 3",909,"Sheppard, Chad","F","Eligibility","Quarter 1",51.54,6,1,999999999]
["Britt Marcia",{"$f":"VLOOKUP(F64,ClassCategories!$A$2:$B$42,2,0)","v":"Math"},"Britt","Marcia",11,"Algebra 2 Sem 1",1177,"Talley, Eugene","F","Eligibility","Quarter 1",40,7,1,999999999]
["Britt Marcia",{"$f":"VLOOKUP(F65,ClassCategories!$A$2:$B$42,2,0)","v":"Social Studies"},"Britt","Marcia",11,"US/AZ HIS 1",1529,"Torres, Carl","F","Eligibility","Quarter 1",56.96,2,1,999999999]
["Brooks Carolyn",{"$f":"VLOOKUP(F66,ClassCategories!$A$2:$B$42,2,0)","v":"English"},"Brooks","Carolyn",11,"ENGLISH 3",909,"Sheppard, Chad","F","Eligibility","Quarter 1",46.15,2,1,999999999]
["Brown William",{"$f":"VLOOKUP(F67,ClassCategories!$A$2:$B$42,2,0)","v":"Elective"},"Brown","William",10,"GERMAN 3",611,"Simon, Guadalupe","F","Eligibility","Quarter 1",56.18,6,1,999999999]
["Browning Jeffrey",{"$f":"VLOOKUP(F68,ClassCategories!$A$2:$B$42,2,0)","v":"Math"},"Browning","Jeffrey",9,"Algebra 1 Sem 1",1119,"Curtis, Billie","F","Eligibility","Quarter 1",58.4,3,1,999999999]
[{"$f":"C69&\" \"&D69","v":"Bryant Tracey"},{"$f":"VLOOKUP(F69,ClassCategories!$A$2:$B$42,2,0)","v":"English"},"Bryant","Tracey",10,"ENGLISH 3",909,"Sheppard, Chad","F","Eligibility","Quarter 1",15.38,6,1,999999999]
["Bryant Tracey",{"$f":"VLOOKUP(F70,ClassCategories!$A$2:$B$42,2,0)","v":"Social Studies"},"Bryant","Tracey",10,"W HIS/AZ G1",1541,"Dominguez, Carl","F","Eligibility","Quarter 1",38.979999999999997,1,1,999999999]
["Buchanan Ernest",{"$f":"VLOOKUP(F71,ClassCategories!$A$2:$B$42,2,0)","v":"Science"},"Buchanan","Ernest",9,"Honors Biology 1",1479,"Byers, Dale","F","Eligibility","Quarter 1",52.51,7,1,999999999]
["Buckner Chad",{"$f":"VLOOKUP(F72,ClassCategories!$A$2:$B$42,2,0)","v":"English"},"Buckner","Chad",11,"ENGLISH 3",909,"Weiss, Gwendolyn","F","Eligibility","Quarter 1",38.58,1,1,999999999]
["Buckner Ruby",{"$f":"VLOOKUP(F73,ClassCategories!$A$2:$B$42,2,0)","v":"English"},"Buckner","Ruby",11,"ENGLISH 5",915,"Madden, Allen","F","Eligibility","Quarter 1",53.33,3,1,999999999]
["Buckner Ruby",{"$f":"VLOOKUP(F74,ClassCategories!$A$2:$B$42,2,0)","v":"Social Studies"},"Buckner","Ruby",11,"US/AZ HIS 1",1529,"Espinoza, Adam","F","Eligibility","Quarter 1",45.94,5,1,999999999]
["Bullock Holly",{"$f":"VLOOKUP(F75,ClassCategories!$A$2:$B$42,2,0)","v":"Math"},"Bullock","Holly",11,"Algebra 2 Sem 1",1177,"Riley, Frank","F","Eligibility","Quarter 1",33.53,3,1,999999999]
["Burks Jacob",{"$f":"VLOOKUP(F76,ClassCategories!$A$2:$B$42,2,0)","v":"Elective"},"Burks","Jacob",9,"PHOTO 1",435,"Bartlett, Lucy","F","Eligibility","Quarter 1",44.44,2,1,999999999]
["Burnett Lynn",{"$f":"VLOOKUP(F77,ClassCategories!$A$2:$B$42,2,0)","v":"Science"},"Burnett","Lynn",9,"T SCIENCE 1",1429,"Weiss, Julie","F","Eligibility","Quarter 1",58.7,2,1,999999999]
["Burnett Rodney",{"$f":"VLOOKUP(F78,ClassCategories!$A$2:$B$42,2,0)","v":"Math"},"Burnett","Rodney",10,"Hon Algebra 2 Sem 1",1173,"Riley, Frank","F","Eligibility","Quarter 1",53.54,6,1,999999999]
["Bush Carol",{"$f":"VLOOKUP(F79,ClassCategories!$A$2:$B$42,2,0)","v":"Phys Ed"},"Bush","Carol",9,"PHYS ED 1G",1305,"Jacobs, Jo","F","Eligibility","Quarter 1",56.37,6,1,999999999]
["Bush Carol",{"$f":"VLOOKUP(F80,ClassCategories!$A$2:$B$42,2,0)","v":"Elective"},"Bush","Carol",9,"SPANISH 1",627,"Raymond, Marguerite","F","Eligibility","Quarter 1",25,2,1,999999999]
["Callahan Arthur",{"$f":"VLOOKUP(F81,ClassCategories!$A$2:$B$42,2,0)","v":"English"},"Callahan","Arthur",11,"ENGLISH 5",915,"Madden, Allen","F","Eligibility","Quarter 1",33.33,4,1,999999999]
["Callahan Arthur",{"$f":"VLOOKUP(F82,ClassCategories!$A$2:$B$42,2,0)","v":"Social Studies"},"Callahan","Arthur",11,"US/AZ HIS 1",1529,"Espinoza, Adam","F","Eligibility","Quarter 1",40.81,3,1,999999999]
["Camacho Crystal",{"$f":"VLOOKUP(F83,ClassCategories!$A$2:$B$42,2,0)","v":"English"},"Camacho","Crystal",11,"Honors English 5",943,"Fisher, Sylvia","F","Eligibility","Quarter 1",44.41,6,1,999999999]
["Cantrell Russell",{"$f":"VLOOKUP(F84,ClassCategories!$A$2:$B$42,2,0)","v":"Social Studies"},"Cantrell","Russell",11,"US/AZ HIS 1",1529,"Espinoza, Adam","F","Eligibility","Quarter 1",20.329999999999998,6,1,999999999]
["Cantu Cora",{"$f":"VLOOKUP(F85,ClassCategories!$A$2:$B$42,2,0)","v":"Math"},"Cantu","Cora",9,"Algebra 1 Sem 1",1119,"Barrera, Melanie","F","Eligibility","Quarter 1",43.33,1,1,999999999]
["Cantu Terry",{"$f":"VLOOKUP(F86,ClassCategories!$A$2:$B$42,2,0)","v":"Science"},"Cantu","Terry",10,"Honors Biology 1",1479,"Byers, Dale","F","Eligibility","Quarter 1",47.54,7,1,999999999]
["Cantu Terry",{"$f":"VLOOKUP(F87,ClassCategories!$A$2:$B$42,2,0)","v":"English"},"Cantu","Terry",10,"Honors English 3",941,"Sawyer, Jeff","F","Eligibility","Quarter 1",18.64,6,1,999999999]
["Carroll Anthony",{"$f":"VLOOKUP(F88,ClassCategories!$A$2:$B$42,2,0)","v":"Elective"},"Carroll","Anthony",10,"Culinary Arts 1",735,"Chaney, Erin","F","Eligibility","Quarter 1",51.85,1,1,999999999]
["Casey Allison",{"$f":"VLOOKUP(F89,ClassCategories!$A$2:$B$42,2,0)","v":"Math"},"Casey","Allison",11,"Geometry Sem 1",1131,"Ortega, Alma","F","Eligibility","Quarter 1",51.84,1,1,999999999]
["Castaneda Kimberly",{"$f":"VLOOKUP(F90,ClassCategories!$A$2:$B$42,2,0)","v":"English"},"Castaneda","Kimberly",11,"ENGLISH 3",909,"Weiss, Gwendolyn","F","Eligibility","Quarter 1",51.31,2,1,999999999]
["Castaneda Kimberly",{"$f":"VLOOKUP(F91,ClassCategories!$A$2:$B$42,2,0)","v":"Math"},"Castaneda","Kimberly",11,"Geometry Sem 2",3133,"Lawson, Philip","F","Eligibility","Quarter 1",24.38,1,1,999999999]
["Castro Mildred",{"$f":"VLOOKUP(F92,ClassCategories!$A$2:$B$42,2,0)","v":"Math"},"Castro","Mildred",11,"Hon Algebra 2 Sem 1",1173,"Riley, Frank","F","Eligibility","Quarter 1",34.75,5,1,999999999]
["Chandler Jeannette",{"$f":"VLOOKUP(F93,ClassCategories!$A$2:$B$42,2,0)","v":"Elective"},"Chandler","Jeannette",11,"Culinary Arts 1",735,"Chaney, Erin","F","Eligibility","Quarter 1",37.04,1,1,999999999]
["Chandler Jeannette",{"$f":"VLOOKUP(F94,ClassCategories!$A$2:$B$42,2,0)","v":"Math"},"Chandler","Jeannette",11,"Hon Algebra 2 Sem 1",1173,"Lawson, Philip","F","Eligibility","Quarter 1",57.1,3,1,999999999]
["Chaney Dale",{"$f":"VLOOKUP(F95,ClassCategories!$A$2:$B$42,2,0)","v":"Math"},"Chaney","Dale",11,"Algebra 2 Sem 1",1177,"Talley, Eugene","F","Eligibility","Quarter 1",58.18,7,1,999999999]
["Chapman Joseph",{"$f":"VLOOKUP(F96,ClassCategories!$A$2:$B$42,2,0)","v":"English"},"Chapman","Joseph",10,"ENGLISH 3",909,"Albert, Edward","F","Eligibility","Quarter 1",57.98,4,1,999999999]
["Clemons Jennifer",{"$f":"VLOOKUP(F97,ClassCategories!$A$2:$B$42,2,0)","v":"Elective"},"Clemons","Jennifer",10,"3-D DESIGN 3",423,"Parks, Lucy","F","Eligibility","Quarter 1",7.1,7,1,999999999]
["Clemons Jennifer",{"$f":"VLOOKUP(F98,ClassCategories!$A$2:$B$42,2,0)","v":"Math"},"Clemons","Jennifer",10,"Algebra 1 Sem 2",3119,"Gallegos, Brandy","F","Eligibility","Quarter 1",55.36,1,1,999999999]
["Clemons Jennifer",{"$f":"VLOOKUP(F99,ClassCategories!$A$2:$B$42,2,0)","v":"Science"},"Clemons","Jennifer",10,"BIOLOGY 1",1407,"Kaufman, Philip","F","Eligibility","Quarter 1",53.33,6,1,999999999]
["Clemons Theresa",{"$f":"VLOOKUP(F100,ClassCategories!$A$2:$B$42,2,0)","v":"Math"},"Clemons","Theresa",10,"Geometry Sem 1",1131,"Ortega, Alma","F","Eligibility","Quarter 1",10.61,1,1,999999999]
["Cochran Marjorie",{"$f":"VLOOKUP(F101,ClassCategories!$A$2:$B$42,2,0)","v":"Math"},"Cochran","Marjorie",10,"Geometry Sem 1",1131,"Barrera, Melanie","F","Eligibility","Quarter 1",58.03,7,1,999999999]
["Cochran Marjorie",{"$f":"VLOOKUP(F102,ClassCategories!$A$2:$B$42,2,0)","v":"Elective"},"Cochran","Marjorie",10,"SPANISH 1",627,"Raymond, Marguerite","F","Eligibility","Quarter 1",51.39,2,1,999999999]
["Cole Andrew",{"$f":"VLOOKUP(F103,ClassCategories!$A$2:$B$42,2,0)","v":"Elective"},"Cole","Andrew",10,"GERMAN 3",611,"Simon, Guadalupe","F","Eligibility","Quarter 1",56.18,6,1,999999999]
["Cole Andrew",{"$f":"VLOOKUP(F104,ClassCategories!$A$2:$B$42,2,0)","v":"Science"},"Cole","Andrew",10,"Honors Biology 1",1479,"Richard, John","F","Eligibility","Quarter 1",58.77,3,1,999999999]
["Cole Emma",{"$f":"VLOOKUP(F105,ClassCategories!$A$2:$B$42,2,0)","v":"Math"},"Cole","Emma",10,"Algebra 1 Sem 2",3119,"Gallegos, Brandy","F","Eligibility","Quarter 1",54.73,1,1,999999999]
["Cole Emma",{"$f":"VLOOKUP(F106,ClassCategories!$A$2:$B$42,2,0)","v":"Science"},"Cole","Emma",10,"BIOLOGY 1",1407,"Kaufman, Philip","F","Eligibility","Quarter 1",58.89,6,1,999999999]
["Cole Emma",{"$f":"VLOOKUP(F107,ClassCategories!$A$2:$B$42,2,0)","v":"English"},"Cole","Emma",10,"ENGLISH 3",909,"Albert, Edward","F","Eligibility","Quarter 1",39.5,4,1,999999999]
["Cole Emma",{"$f":"VLOOKUP(F108,ClassCategories!$A$2:$B$42,2,0)","v":"Elective"},"Cole","Emma",10,"PHOTO 1",435,"Bartlett, Lucy","F","Eligibility","Quarter 1",44.44,2,1,999999999]
["Cole Hazel",{"$f":"VLOOKUP(F109,ClassCategories!$A$2:$B$42,2,0)","v":"Social Studies"},"Cole","Hazel",10,"W HIS/AZ G1",1541,"Raymond, Lillian","F","Eligibility","Quarter 1",59.41,4,1,999999999]
["Collins Sean",{"$f":"VLOOKUP(F110,ClassCategories!$A$2:$B$42,2,0)","v":"Elective"},"Collins","Sean",9,"Business Technology 1",541,"Richmond, Elsie","F","Eligibility","Quarter 1",42.5,6,1,999999999]
["Combs Sheila",{"$f":"VLOOKUP(F111,ClassCategories!$A$2:$B$42,2,0)","v":"English"},"Combs","Sheila",10,"ENGLISH 3",909,"Albert, Edward","F","Eligibility","Quarter 1",53.78,4,1,999999999]
["Conley Naomi",{"$f":"VLOOKUP(F112,ClassCategories!$A$2:$B$42,2,0)","v":"English"},"Conley","Naomi",10,"Honors English 3",941,"Sawyer, Jeff","F","Eligibility","Quarter 1",48.7,6,1,999999999]
["Conley Nellie",{"$f":"VLOOKUP(F113,ClassCategories!$A$2:$B$42,2,0)","v":"Social Studies"},"Conley","Nellie",11,"US/AZ HIS 1",1529,"Espinoza, Adam","F","Eligibility","Quarter 1",32.81,6,1,999999999]
["Conner Veronica",{"$f":"VLOOKUP(F114,ClassCategories!$A$2:$B$42,2,0)","v":"Science"},"Conner","Veronica",10,"BIOLOGY 1",1407,"Byers, Dale","F","Eligibility","Quarter 1",57.61,5,1,999999999]
["Conner Veronica",{"$f":"VLOOKUP(F115,ClassCategories!$A$2:$B$42,2,0)","v":"English"},"Conner","Veronica",10,"English Fundamentals 5",387,"England, Harry","F","Eligibility","Quarter 1",0.99,2,1,999999999]
["Contreras Willie",{"$f":"VLOOKUP(F116,ClassCategories!$A$2:$B$42,2,0)","v":"English"},"Contreras","Willie",11,"ENGLISH 3",909,"Weiss, Gwendolyn","F","Eligibility","Quarter 1",55.43,1,1,999999999]
["Contreras Willie",{"$f":"VLOOKUP(F117,ClassCategories!$A$2:$B$42,2,0)","v":"Social Studies"},"Contreras","Willie",11,"US/AZ HIS 1",1529,"Torres, Carl","F","Eligibility","Quarter 1",52.12,4,1,999999999]
["Cook Dale",{"$f":"VLOOKUP(F118,ClassCategories!$A$2:$B$42,2,0)","v":"Math"},"Cook","Dale",11,"Hon Algebra 2 Sem 1",1173,"Riley, Frank","F","Eligibility","Quarter 1",55.56,6,1,999999999]
["Cooke Antonio",{"$f":"VLOOKUP(F119,ClassCategories!$A$2:$B$42,2,0)","v":"Math"},"Cooke","Antonio",9,"Algebra 1 Sem 1",1119,"Curtis, Billie","F","Eligibility","Quarter 1",39.25,7,1,999999999]
["Cooke Antonio",{"$f":"VLOOKUP(F120,ClassCategories!$A$2:$B$42,2,0)","v":"English"},"Cooke","Antonio",9,"ENGLISH 1",903,"Burns, Whitney","F","Eligibility","Quarter 1",50.82,2,1,999999999]
["Cooley Veronica",{"$f":"VLOOKUP(F121,ClassCategories!$A$2:$B$42,2,0)","v":"Math"},"Cooley","Veronica",10,"Geometry Sem 1",1131,"Ortega, Alma","F","Eligibility","Quarter 1",52.3,5,1,999999999]
["Cooper Melanie",{"$f":"VLOOKUP(F122,ClassCategories!$A$2:$B$42,2,0)","v":"English"},"Cooper","Melanie",11,"ENGLISH 3",909,"Ray, Stacy","F","Eligibility","Quarter 1",47.2,3,1,999999999]
["Cooper Melanie",{"$f":"VLOOKUP(F123,ClassCategories!$A$2:$B$42,2,0)","v":"Math"},"Cooper","Melanie",11,"Geometry Sem 1",1131,"Ortega, Alma","F","Eligibility","Quarter 1",9.2899999999999991,1,1,999999999]
["Cooper Melanie",{"$f":"VLOOKUP(F124,ClassCategories!$A$2:$B$42,2,0)","v":"Social Studies"},"Cooper","Melanie",11,"US/AZ HIS 1",1529,"Espinoza, Adam","F","Eligibility","Quarter 1",42.69,5,1,999999999]
["Cortez Pearl",{"$f":"VLOOKUP(F125,ClassCategories!$A$2:$B$42,2,0)","v":"English"},"Cortez","Pearl",9,"ENGLISH 1",903,"Burns, Whitney","F","Eligibility","Quarter 1",50.82,3,1,999999999]
["Cox Roy",{"$f":"VLOOKUP(F126,ClassCategories!$A$2:$B$42,2,0)","v":"English"},"Cox","Roy",10,"ENGLISH 3",909,"Sheppard, Chad","F","Eligibility","Quarter 1",50.77,2,1,999999999]
["Cox Thelma",{"$f":"VLOOKUP(F127,ClassCategories!$A$2:$B$42,2,0)","v":"Math"},"Cox","Thelma",9,"Algebra 1 Sem 1",1119,"Curtis, Billie","F","Eligibility","Quarter 1",40.89,5,1,999999999]
["Cruz Yolanda",{"$f":"VLOOKUP(F128,ClassCategories!$A$2:$B$42,2,0)","v":"Math"},"Cruz","Yolanda",11,"Algebra 2 Sem 1",1177,"Talley, Eugene","F","Eligibility","Quarter 1",30.69,7,1,999999999]
["Cummings Nicole",{"$f":"VLOOKUP(F129,ClassCategories!$A$2:$B$42,2,0)","v":"Math"},"Cummings","Nicole",9,"Algebra 1 Sem 1",1119,"Barrera, Melanie","F","Eligibility","Quarter 1",40.43,2,1,999999999]
["Dalton Anita",{"$f":"VLOOKUP(F130,ClassCategories!$A$2:$B$42,2,0)","v":"Science"},"Dalton","Anita",9,"T SCIENCE 1",1429,"Kaufman, Philip","F","Eligibility","Quarter 1",55.18,3,1,999999999]
["Dawson Jacqueline",{"$f":"VLOOKUP(F131,ClassCategories!$A$2:$B$42,2,0)","v":"Math"},"Dawson","Jacqueline",11,"Algebra 2 Sem 1",1177,"Riley, Frank","F","Eligibility","Quarter 1",34.619999999999997,2,1,999999999]
["Dawson Jacqueline",{"$f":"VLOOKUP(F132,ClassCategories!$A$2:$B$42,2,0)","v":"English"},"Dawson","Jacqueline",11,"ENGLISH 5",915,"Madden, Allen","F","Eligibility","Quarter 1",56.67,6,1,999999999]
[{"$f":"C133&\" \"&D133","v":"Dawson Jacqueline"},{"$f":"VLOOKUP(F133,ClassCategories!$A$2:$B$42,2,0)","v":"Social Studies"},"Dawson","Jacqueline",11,"US/AZ HIS 1",1529,"Torres, Carl","F","Eligibility","Quarter 1",57.54,1,1,999999999]
["Delacruz Shawn",{"$f":"VLOOKUP(F134,ClassCategories!$A$2:$B$42,2,0)","v":"Math"},"Delacruz","Shawn",9,"Algebra 1 Sem 1",1119,"Curtis, Billie","F","Eligibility","Quarter 1",0,5,1,999999999]
["Diaz Glenn",{"$f":"VLOOKUP(F135,ClassCategories!$A$2:$B$42,2,0)","v":"Math"},"Diaz","Glenn",10,"Algebra 1 Sem 1/Lab",1125,"James, Lola","F","Eligibility","Quarter 1",59.35,6,1,999999999]
["Dillard Glenn",{"$f":"VLOOKUP(F136,ClassCategories!$A$2:$B$42,2,0)","v":"Social Studies"},"Dillard","Glenn",10,"W HIS/AZ G1",1541,"Wooten, Joshua","F","Eligibility","Quarter 1",57.13,2,1,999999999]
["Dixon Carolyn",{"$f":"VLOOKUP(F137,ClassCategories!$A$2:$B$42,2,0)","v":"Math"},"Dixon","Carolyn",10,"Algebra 1 Sem 2",3119,"Gallegos, Brandy","F","Eligibility","Quarter 1",45.71,1,1,999999999]
["Drake Glenda",{"$f":"VLOOKUP(F138,ClassCategories!$A$2:$B$42,2,0)","v":"Science"},"Drake","Glenda",11,"AP BIO 1",1403,"Rivera, Patrick","F","Eligibility","Quarter 1",48.99,7,1,999999999]
["Duncan Stanley",{"$f":"VLOOKUP(F139,ClassCategories!$A$2:$B$42,2,0)","v":"Math"},"Duncan","Stanley",11,"Algebra 2 Sem 1",1177,"Talley, Eugene","F","Eligibility","Quarter 1",51.8,7,1,999999999]
["Durham Brian",{"$f":"VLOOKUP(F140,ClassCategories!$A$2:$B$42,2,0)","v":"English"},"Durham","Brian",10,"ENGLISH 3",909,"Sheppard, Chad","F","Eligibility","Quarter 1",50,7,1,999999999]
["Durham Brian",{"$f":"VLOOKUP(F141,ClassCategories!$A$2:$B$42,2,0)","v":"Math"},"Durham","Brian",10,"Geometry Sem 1",1131,"Ortega, Alma","F","Eligibility","Quarter 1",47.78,1,1,999999999]
["Durham Vera",{"$f":"VLOOKUP(F142,ClassCategories!$A$2:$B$42,2,0)","v":"Math"},"Durham","Vera",10,"Algebra 1 Sem 2",3119,"Gallegos, Brandy","F","Eligibility","Quarter 1",38.65,1,1,999999999]
["Durham Vera",{"$f":"VLOOKUP(F143,ClassCategories!$A$2:$B$42,2,0)","v":"English"},"Durham","Vera",10,"ENGLISH 3",909,"Sheppard, Chad","F","Eligibility","Quarter 1",41.54,2,1,999999999]
["English Harry",{"$f":"VLOOKUP(F144,ClassCategories!$A$2:$B$42,2,0)","v":"English"},"English","Harry",11,"ENGLISH 3",909,"Sheppard, Chad","F","Eligibility","Quarter 1",46.92,7,1,999999999]
["English Harry",{"$f":"VLOOKUP(F145,ClassCategories!$A$2:$B$42,2,0)","v":"Social Studies"},"English","Harry",11,"US/AZ HIS 1",1529,"Espinoza, Adam","F","Eligibility","Quarter 1",42.07,6,1,999999999]
["Ewing Sharon",{"$f":"VLOOKUP(F146,ClassCategories!$A$2:$B$42,2,0)","v":"Math"},"Ewing","Sharon",10,"Algebra 1 Sem 2",3119,"Gallegos, Brandy","F","Eligibility","Quarter 1",42.9,1,1,999999999]
["Ewing Sharon",{"$f":"VLOOKUP(F147,ClassCategories!$A$2:$B$42,2,0)","v":"Science"},"Ewing","Sharon",10,"BIOLOGY 1",1407,"Kaufman, Philip","F","Eligibility","Quarter 1",41.39,6,1,999999999]
["Faulkner Norman",{"$f":"VLOOKUP(F148,ClassCategories!$A$2:$B$42,2,0)","v":"Math"},"Faulkner","Norman",9,"Algebra 1 Sem 1",1119,"James, Lola","F","Eligibility","Quarter 1",50.84,4,1,999999999]
["Faulkner Norman",{"$f":"VLOOKUP(F149,ClassCategories!$A$2:$B$42,2,0)","v":"Phys Ed"},"Faulkner","Norman",9,"PHYS ED 1G",1305,"Nelson, Sheila","F","Eligibility","Quarter 1",59,2,1,999999999]
["Fernandez Carlos",{"$f":"VLOOKUP(F150,ClassCategories!$A$2:$B$42,2,0)","v":"English"},"Fernandez","Carlos",10,"ENGLISH 3",909,"Ray, Stacy","F","Eligibility","Quarter 1",43.77,3,1,999999999]
["Fields Douglas",{"$f":"VLOOKUP(F151,ClassCategories!$A$2:$B$42,2,0)","v":"Math"},"Fields","Douglas",11,"Geometry Sem 2",3133,"Lawson, Philip","F","Eligibility","Quarter 1",59.11,1,1,999999999]
["Fischer Karla",{"$f":"VLOOKUP(F152,ClassCategories!$A$2:$B$42,2,0)","v":"Social Studies"},"Fischer","Karla",10,"Honors W History/Geography",1505,"Dominguez, Carl","F","Eligibility","Quarter 1",55.35,2,1,999999999]
["Fletcher Judith",{"$f":"VLOOKUP(F153,ClassCategories!$A$2:$B$42,2,0)","v":"English"},"Fletcher","Judith",9,"ENGLISH 1",903,"Burns, Whitney","F","Eligibility","Quarter 1",26.83,2,1,999999999]
["Fletcher Myrtle",{"$f":"VLOOKUP(F154,ClassCategories!$A$2:$B$42,2,0)","v":"Social Studies"},"Fletcher","Myrtle",10,"W HIS/AZ G1",1541,"Dominguez, Carl","F","Eligibility","Quarter 1",58.31,1,1,999999999]
["Foreman Jan",{"$f":"VLOOKUP(F155,ClassCategories!$A$2:$B$42,2,0)","v":"English"},"Foreman","Jan",9,"Honors English 1",939,"Dudley, Stacy","F","Eligibility","Quarter 1",56.43,7,1,999999999]
["Frank Kimberly",{"$f":"VLOOKUP(F156,ClassCategories!$A$2:$B$42,2,0)","v":"Social Studies"},"Frank","Kimberly",11,"AP US/AZ HIS",1531,"Shepard, Diana","F","Eligibility","Quarter 1",50.98,7,1,999999999]
["Frank Kimberly",{"$f":"VLOOKUP(F157,ClassCategories!$A$2:$B$42,2,0)","v":"Math"},"Frank","Kimberly",11,"Hon Algebra 2 Sem 1",1173,"Riley, Frank","F","Eligibility","Quarter 1",57.98,5,1,999999999]
["Franks Mildred",{"$f":"VLOOKUP(F158,ClassCategories!$A$2:$B$42,2,0)","v":"Math"},"Franks","Mildred",9,"Algebra 1 Sem 1",1119,"Curtis, Billie","F","Eligibility","Quarter 1",48.19,7,1,999999999]
["Frederick Kim",{"$f":"VLOOKUP(F159,ClassCategories!$A$2:$B$42,2,0)","v":"Math"},"Frederick","Kim",10,"Hon Algebra 2 Sem 1",1173,"Riley, Frank","F","Eligibility","Quarter 1",42.22,6,1,999999999]
["Frye Julie",{"$f":"VLOOKUP(F160,ClassCategories!$A$2:$B$42,2,0)","v":"Math"},"Frye","Julie",11,"Algebra 2 Sem 1",1177,"Talley, Eugene","F","Eligibility","Quarter 1",46.27,6,1,999999999]
["Frye Julie",{"$f":"VLOOKUP(F161,ClassCategories!$A$2:$B$42,2,0)","v":"Social Studies"},"Frye","Julie",11,"US/AZ HIS 1",1529,"Espinoza, Adam","F","Eligibility","Quarter 1",44.85,3,1,999999999]
["Galloway Louis",{"$f":"VLOOKUP(F162,ClassCategories!$A$2:$B$42,2,0)","v":"English"},"Galloway","Louis",11,"ENGLISH 3",909,"Ray, Stacy","F","Eligibility","Quarter 1",57.52,6,1,999999999]
["Garcia Inez",{"$f":"VLOOKUP(F163,ClassCategories!$A$2:$B$42,2,0)","v":"Math"},"Garcia","Inez",9,"Algebra 1 Sem 1",1119,"Barrera, Melanie","F","Eligibility","Quarter 1",45.88,2,1,999999999]
["Garcia Inez",{"$f":"VLOOKUP(F164,ClassCategories!$A$2:$B$42,2,0)","v":"English"},"Garcia","Inez",9,"ENGLISH 1",903,"Burns, Whitney","F","Eligibility","Quarter 1",50.82,1,1,999999999]
["Garner Leonard",{"$f":"VLOOKUP(F165,ClassCategories!$A$2:$B$42,2,0)","v":"English"},"Garner","Leonard",11,"ENGLISH 3",909,"Sheppard, Chad","F","Eligibility","Quarter 1",52.31,7,1,999999999]
["Garner Leonard",{"$f":"VLOOKUP(F166,ClassCategories!$A$2:$B$42,2,0)","v":"Math"},"Garner","Leonard",11,"Geometry Sem 1",1131,"Ortega, Alma","F","Eligibility","Quarter 1",56.67,5,1,999999999]
["Garner Leonard",{"$f":"VLOOKUP(F167,ClassCategories!$A$2:$B$42,2,0)","v":"Social Studies"},"Garner","Leonard",11,"US/AZ HIS 1",1529,"Torres, Carl","F","Eligibility","Quarter 1",39.520000000000003,1,1,999999999]
["George Kevin",{"$f":"VLOOKUP(F168,ClassCategories!$A$2:$B$42,2,0)","v":"Elective"},"George","Kevin",9,"Business Technology 1",541,"Richmond, Elsie","F","Eligibility","Quarter 1",50,6,1,999999999]
["Giles Nancy",{"$f":"VLOOKUP(F169,ClassCategories!$A$2:$B$42,2,0)","v":"Social Studies"},"Giles","Nancy",11,"AP US/AZ HIS",1531,"Shepard, Diana","F","Eligibility","Quarter 1",57.38,5,1,999999999]
["Glass Bobby",{"$f":"VLOOKUP(F170,ClassCategories!$A$2:$B$42,2,0)","v":"Math"},"Glass","Bobby",11,"Algebra 2 Sem 1",1177,"Riley, Frank","F","Eligibility","Quarter 1",41.88,3,1,999999999]
["Glover Chad",{"$f":"VLOOKUP(F171,ClassCategories!$A$2:$B$42,2,0)","v":"Math"},"Glover","Chad",10,"Hon Algebra 2 Sem 1",1173,"Riley, Frank","F","Eligibility","Quarter 1",55.56,6,1,999999999]
["Gonzales Justin",{"$f":"VLOOKUP(F172,ClassCategories!$A$2:$B$42,2,0)","v":"English"},"Gonzales","Justin",11,"ENGLISH 3",909,"Weiss, Gwendolyn","F","Eligibility","Quarter 1",43.07,2,1,999999999]
["Gonzales Justin",{"$f":"VLOOKUP(F173,ClassCategories!$A$2:$B$42,2,0)","v":"Math"},"Gonzales","Justin",11,"Geometry Sem 2",3133,"Lawson, Philip","F","Eligibility","Quarter 1",23.18,1,1,999999999]
["Gonzales Justin",{"$f":"VLOOKUP(F174,ClassCategories!$A$2:$B$42,2,0)","v":"Social Studies"},"Gonzales","Justin",11,"US/AZ HIS 1",1529,"Torres, Carl","F","Eligibility","Quarter 1",16.920000000000002,4,1,999999999]
["Goodman Ada",{"$f":"VLOOKUP(F175,ClassCategories!$A$2:$B$42,2,0)","v":"English"},"Goodman","Ada",10,"ENGLISH 3",909,"Ray, Stacy","F","Eligibility","Quarter 1",58.94,6,1,999999999]
["Gordon Marie",{"$f":"VLOOKUP(F176,ClassCategories!$A$2:$B$42,2,0)","v":"Elective"},"Gordon","Marie",10,"SPANISH 3",633,"Raymond, Marguerite","F","Eligibility","Quarter 1",40.11,6,1,999999999]
["Grant Mark",{"$f":"VLOOKUP(F177,ClassCategories!$A$2:$B$42,2,0)","v":"Math"},"Grant","Mark",11,"Algebra 2 Sem 1",1177,"Talley, Eugene","F","Eligibility","Quarter 1",54.07,6,1,999999999]
["Gray Arthur",{"$f":"VLOOKUP(F178,ClassCategories!$A$2:$B$42,2,0)","v":"Math"},"Gray","Arthur",11,"Algebra 2 Sem 1",1177,"Talley, Eugene","F","Eligibility","Quarter 1",47.6,6,1,999999999]
["Gray Arthur",{"$f":"VLOOKUP(F179,ClassCategories!$A$2:$B$42,2,0)","v":"Social Studies"},"Gray","Arthur",11,"SOCIOLOGY",1519,"Madden, Allen","F","Eligibility","Quarter 1",40.909999999999997,1,1,999999999]
["Griffin Billy",{"$f":"VLOOKUP(F180,ClassCategories!$A$2:$B$42,2,0)","v":"Math"},"Griffin","Billy",9,"Algebra 1 Sem 1",1119,"Barrera, Melanie","F","Eligibility","Quarter 1",34.119999999999997,2,1,999999999]
["Gutierrez Stephen",{"$f":"VLOOKUP(F181,ClassCategories!$A$2:$B$42,2,0)","v":"Math"},"Gutierrez","Stephen",10,"Hon Algebra 2 Sem 1",1173,"Riley, Frank","F","Eligibility","Quarter 1",58.99,6,1,999999999]
["Hamilton Jeanne",{"$f":"VLOOKUP(F182,ClassCategories!$A$2:$B$42,2,0)","v":"Math"},"Hamilton","Jeanne",10,"Geometry Sem 1",1131,"Barrera, Melanie","F","Eligibility","Quarter 1",57.18,5,1,999999999]
["Hammond Esther",{"$f":"VLOOKUP(F183,ClassCategories!$A$2:$B$42,2,0)","v":"Math"},"Hammond","Esther",11,"Algebra 2 Sem 1",1177,"Talley, Eugene","F","Eligibility","Quarter 1",55.96,2,1,999999999]
["Hammond Esther",{"$f":"VLOOKUP(F184,ClassCategories!$A$2:$B$42,2,0)","v":"Social Studies"},"Hammond","Esther",11,"US/AZ HIS 1",1529,"Espinoza, Adam","F","Eligibility","Quarter 1",29.46,5,1,999999999]
["Haney Madeline",{"$f":"VLOOKUP(F185,ClassCategories!$A$2:$B$42,2,0)","v":"Elective"},"Haney","Madeline",11,"JAPANESE 3",647,"Carney, Shelly","F","Eligibility","Quarter 1",48.18,2,1,999999999]
["Haney Madeline",{"$f":"VLOOKUP(F186,ClassCategories!$A$2:$B$42,2,0)","v":"Social Studies"},"Haney","Madeline",11,"US/AZ HIS 1",1529,"Espinoza, Adam","F","Eligibility","Quarter 1",44.46,6,1,999999999]
["Hardin Esther",{"$f":"VLOOKUP(F187,ClassCategories!$A$2:$B$42,2,0)","v":"English"},"Hardin","Esther",10,"ENGLISH 3",909,"Albert, Edward","F","Eligibility","Quarter 1",57.14,4,1,999999999]
["Harding Allen",{"$f":"VLOOKUP(F188,ClassCategories!$A$2:$B$42,2,0)","v":"Math"},"Harding","Allen",11,"Hon Algebra 2 Sem 1",1173,"Riley, Frank","F","Eligibility","Quarter 1",55.56,5,1,999999999]
["Harmon Melanie",{"$f":"VLOOKUP(F189,ClassCategories!$A$2:$B$42,2,0)","v":"Math"},"Harmon","Melanie",9,"Algebra 1 Sem 1/Lab",1125,"James, Lola","F","Eligibility","Quarter 1",58,6,1,999999999]
["Harmon Melanie",{"$f":"VLOOKUP(F190,ClassCategories!$A$2:$B$42,2,0)","v":"English"},"Harmon","Melanie",9,"ENGLISH 1",903,"Burns, Whitney","F","Eligibility","Quarter 1",50.82,1,1,999999999]
["Harmon Melanie",{"$f":"VLOOKUP(F191,ClassCategories!$A$2:$B$42,2,0)","v":"Math"},"Harmon","Melanie",9,"Math Intervention Lab",1079,"James, Lola","F","Eligibility","Quarter 1",50,7,1,999999999]
["Harmon Melanie",{"$f":"VLOOKUP(F192,ClassCategories!$A$2:$B$42,2,0)","v":"Science"},"Harmon","Melanie",9,"T SCIENCE 1",1429,"Kaufman, Philip","F","Eligibility","Quarter 1",47.3,5,1,999999999]
["Harrington Keith",{"$f":"VLOOKUP(F193,ClassCategories!$A$2:$B$42,2,0)","v":"Social Studies"},"Harrington","Keith",11,"US/AZ HIS 1",1529,"Espinoza, Adam","F","Eligibility","Quarter 1",41.24,5,1,999999999]
["Harrington Keith",{"$f":"VLOOKUP(F194,ClassCategories!$A$2:$B$42,2,0)","v":"Math"},"Harrington","Keith",9,"Algebra 1 Sem 1",1119,"Barrera, Melanie","F","Eligibility","Quarter 1",41.87,2,1,999999999]
["Harrington Keith",{"$f":"VLOOKUP(F195,ClassCategories!$A$2:$B$42,2,0)","v":"English"},"Harrington","Keith",9,"ENGLISH 1",903,"Burns, Whitney","F","Eligibility","Quarter 1",34.43,1,1,999999999]
["Hartman Lillian",{"$f":"VLOOKUP(F196,ClassCategories!$A$2:$B$42,2,0)","v":"Elective"},"Hartman","Lillian",11,"SPANISH 1",627,"Raymond, Marguerite","F","Eligibility","Quarter 1",0,7,1,999999999]
[{"$f":"C197&\" \"&D197","v":"Haynes Alan"},{"$f":"VLOOKUP(F197,ClassCategories!$A$2:$B$42,2,0)","v":"Math"},"Haynes","Alan",11,"Geometry Sem 1",1131,"Ortega, Alma","F","Eligibility","Quarter 1",30.7,2,1,999999999]
["Haynes Alan",{"$f":"VLOOKUP(F198,ClassCategories!$A$2:$B$42,2,0)","v":"Social Studies"},"Haynes","Alan",11,"US/AZ HIS 1",1529,"Mccormick, Carla","F","Eligibility","Quarter 1",30.89,5,1,999999999]
["Hebert Carlos",{"$f":"VLOOKUP(F199,ClassCategories!$A$2:$B$42,2,0)","v":"Math"},"Hebert","Carlos",9,"Algebra 1 Sem 1/Lab",1125,"James, Lola","F","Eligibility","Quarter 1",47.59,6,1,999999999]
["Hebert Carlos",{"$f":"VLOOKUP(F200,ClassCategories!$A$2:$B$42,2,0)","v":"Math"},"Hebert","Carlos",9,"Math Intervention Lab",1079,"James, Lola","F","Eligibility","Quarter 1",40,7,1,999999999]
["Hebert Carlos",{"$f":"VLOOKUP(F201,ClassCategories!$A$2:$B$42,2,0)","v":"Science"},"Hebert","Carlos",9,"T SCIENCE 1",1429,"Kaufman, Philip","F","Eligibility","Quarter 1",55.97,2,1,999999999]
["Hendricks Bradley",{"$f":"VLOOKUP(F202,ClassCategories!$A$2:$B$42,2,0)","v":"English"},"Hendricks","Bradley",10,"ENGLISH 1",903,"Burns, Whitney","F","Eligibility","Quarter 1",50.82,1,1,999999999]
["Hendricks Bradley",{"$f":"VLOOKUP(F203,ClassCategories!$A$2:$B$42,2,0)","v":"Math"},"Hendricks","Bradley",10,"Geometry Sem 1",1131,"Ortega, Alma","F","Eligibility","Quarter 1",46.75,3,1,999999999]
["Henry Kathleen",{"$f":"VLOOKUP(F204,ClassCategories!$A$2:$B$42,2,0)","v":"Social Studies"},"Henry","Kathleen",11,"US/AZ HIS 1",1529,"Mccormick, Carla","F","Eligibility","Quarter 1",10.75,7,1,999999999]
["Hernandez Lawrence",{"$f":"VLOOKUP(F205,ClassCategories!$A$2:$B$42,2,0)","v":"Math"},"Hernandez","Lawrence",11,"Algebra 2 Sem 1",1177,"Talley, Eugene","F","Eligibility","Quarter 1",59,7,1,999999999]
["Higgins Claire",{"$f":"VLOOKUP(F206,ClassCategories!$A$2:$B$42,2,0)","v":"Science"},"Higgins","Claire",11,"Honors Pre Calculus",1089,"Small, Kelli","F","Eligibility","Quarter 1",56.41,3,1,999999999]
["Hobbs Jamie",{"$f":"VLOOKUP(F207,ClassCategories!$A$2:$B$42,2,0)","v":"English"},"Hobbs","Jamie",11,"ENGLISH 5",915,"Sawyer, Jeff","F","Eligibility","Quarter 1",52,2,1,999999999]
["Hoffman Laura",{"$f":"VLOOKUP(F208,ClassCategories!$A$2:$B$42,2,0)","v":"English"},"Hoffman","Laura",10,"Honors English 3",941,"Sawyer, Jeff","F","Eligibility","Quarter 1",57.2,6,1,999999999]
["Holt Allen",{"$f":"VLOOKUP(F209,ClassCategories!$A$2:$B$42,2,0)","v":"Science"},"Holt","Allen",9,"T SCIENCE 1",1429,"Kaufman, Philip","F","Eligibility","Quarter 1",50.43,7,1,999999999]
["Holt Marian",{"$f":"VLOOKUP(F210,ClassCategories!$A$2:$B$42,2,0)","v":"Social Studies"},"Holt","Marian",11,"US/AZ HIS 1",1529,"Mccormick, Carla","F","Eligibility","Quarter 1",57.04,6,1,999999999]
["Hood Ella",{"$f":"VLOOKUP(F211,ClassCategories!$A$2:$B$42,2,0)","v":"Science"},"Hood","Ella",10,"BIOLOGY 1",1407,"Byers, Dale","F","Eligibility","Quarter 1",55.19,5,1,999999999]
["Hoover Marion",{"$f":"VLOOKUP(F212,ClassCategories!$A$2:$B$42,2,0)","v":"Social Studies"},"Hoover","Marion",11,"AP US/AZ HIS",1531,"Shepard, Diana","F","Eligibility","Quarter 1",43.14,7,1,999999999]
["Horne Brandon",{"$f":"VLOOKUP(F213,ClassCategories!$A$2:$B$42,2,0)","v":"English"},"Horne","Brandon",11,"ENGLISH 3",909,"Sheppard, Chad","F","Eligibility","Quarter 1",47.69,6,1,999999999]
["Horne Brandon",{"$f":"VLOOKUP(F214,ClassCategories!$A$2:$B$42,2,0)","v":"Math"},"Horne","Brandon",11,"Geometry Sem 2",3133,"Lawson, Philip","F","Eligibility","Quarter 1",38.64,1,1,999999999]
["Howe Alfred",{"$f":"VLOOKUP(F215,ClassCategories!$A$2:$B$42,2,0)","v":"Social Studies"},"Howe","Alfred",10,"W HIS/AZ G1",1541,"Wooten, Joshua","F","Eligibility","Quarter 1",50.43,2,1,999999999]
["Howe Carla",{"$f":"VLOOKUP(F216,ClassCategories!$A$2:$B$42,2,0)","v":"Math"},"Howe","Carla",10,"Geometry Sem 1",1131,"Ortega, Alma","F","Eligibility","Quarter 1",54,5,1,999999999]
["Howe Carla",{"$f":"VLOOKUP(F217,ClassCategories!$A$2:$B$42,2,0)","v":"Science"},"Howe","Carla",10,"Honors Biology 1",1479,"Richard, John","F","Eligibility","Quarter 1",58.33,2,1,999999999]
["Howe Carla",{"$f":"VLOOKUP(F218,ClassCategories!$A$2:$B$42,2,0)","v":"English"},"Howe","Carla",10,"Honors English 3",941,"Hobbs, Pearl","F","Eligibility","Quarter 1",47.62,3,1,999999999]
["Howe Carla",{"$f":"VLOOKUP(F219,ClassCategories!$A$2:$B$42,2,0)","v":"Social Studies"},"Howe","Carla",10,"Honors W History/Geography",1505,"Dominguez, Carl","F","Eligibility","Quarter 1",31.56,7,1,999999999]
["Hubbard Jacqueline",{"$f":"VLOOKUP(F220,ClassCategories!$A$2:$B$42,2,0)","v":"English"},"Hubbard","Jacqueline",10,"ENGLISH 3",909,"Albert, Edward","F","Eligibility","Quarter 1",54.26,4,1,999999999]
["Hull Shelly",{"$f":"VLOOKUP(F221,ClassCategories!$A$2:$B$42,2,0)","v":"Math"},"Hull","Shelly",11,"Algebra 2 Sem 1",1177,"Talley, Eugene","F","Eligibility","Quarter 1",55.69,7,1,999999999]
["Hunter Jan",{"$f":"VLOOKUP(F222,ClassCategories!$A$2:$B$42,2,0)","v":"English"},"Hunter","Jan",11,"ENGLISH 3",909,"Sheppard, Chad","F","Eligibility","Quarter 1",42.31,6,1,999999999]
["Hunter Jan",{"$f":"VLOOKUP(F223,ClassCategories!$A$2:$B$42,2,0)","v":"Math"},"Hunter","Jan",11,"Geometry Sem 1",1131,"Ortega, Alma","F","Eligibility","Quarter 1",58.27,1,1,999999999]
["Hunter Jan",{"$f":"VLOOKUP(F224,ClassCategories!$A$2:$B$42,2,0)","v":"Social Studies"},"Hunter","Jan",11,"US/AZ HIS 1",1529,"Espinoza, Adam","F","Eligibility","Quarter 1",39.090000000000003,5,1,999999999]
["Hurley Madeline",{"$f":"VLOOKUP(F225,ClassCategories!$A$2:$B$42,2,0)","v":"Math"},"Hurley","Madeline",11,"Geometry Sem 2",3133,"Lawson, Philip","F","Eligibility","Quarter 1",56.46,1,1,999999999]
["Hurley Melissa",{"$f":"VLOOKUP(F226,ClassCategories!$A$2:$B$42,2,0)","v":"Math"},"Hurley","Melissa",9,"Algebra 1 Sem 1",1119,"Barrera, Melanie","F","Eligibility","Quarter 1",56.74,2,1,999999999]
["Hurley Melissa",{"$f":"VLOOKUP(F227,ClassCategories!$A$2:$B$42,2,0)","v":"Elective"},"Hurley","Melissa",9,"PHOTO 1",435,"Bartlett, Lucy","F","Eligibility","Quarter 1",44.44,4,1,999999999]
["Jefferson Jimmy",{"$f":"VLOOKUP(F228,ClassCategories!$A$2:$B$42,2,0)","v":"English"},"Jefferson","Jimmy",10,"ENGLISH 3",909,"Albert, Edward","F","Eligibility","Quarter 1",34.03,4,1,999999999]
["Jensen Martha",{"$f":"VLOOKUP(F229,ClassCategories!$A$2:$B$42,2,0)","v":"Math"},"Jensen","Martha",11,"Algebra 2 Sem 1",1177,"Riley, Frank","F","Eligibility","Quarter 1",36,2,1,999999999]
["Jones Paul",{"$f":"VLOOKUP(F230,ClassCategories!$A$2:$B$42,2,0)","v":"Social Studies"},"Jones","Paul",11,"US/AZ HIS 1",1529,"Espinoza, Adam","F","Eligibility","Quarter 1",38.46,5,1,999999999]
["Jordan Jean",{"$f":"VLOOKUP(F231,ClassCategories!$A$2:$B$42,2,0)","v":"Math"},"Jordan","Jean",11,"Algebra 2 Sem 1",1177,"Riley, Frank","F","Eligibility","Quarter 1",28.06,3,1,999999999]
["Jordan Jean",{"$f":"VLOOKUP(F232,ClassCategories!$A$2:$B$42,2,0)","v":"Social Studies"},"Jordan","Jean",11,"US/AZ HIS 1",1529,"Mccormick, Carla","F","Eligibility","Quarter 1",14.2,6,1,999999999]
["Jordan Margarita",{"$f":"VLOOKUP(F233,ClassCategories!$A$2:$B$42,2,0)","v":"English"},"Jordan","Margarita",11,"ENGLISH 5",915,"Sawyer, Jeff","F","Eligibility","Quarter 1",54,3,1,999999999]
["Justice Myrtle",{"$f":"VLOOKUP(F234,ClassCategories!$A$2:$B$42,2,0)","v":"Science"},"Justice","Myrtle",10,"BIOLOGY 1",1407,"Byers, Dale","F","Eligibility","Quarter 1",59.47,5,1,999999999]
["Kane Maxine",{"$f":"VLOOKUP(F235,ClassCategories!$A$2:$B$42,2,0)","v":"Social Studies"},"Kane","Maxine",11,"US/AZ HIS 1",1529,"Mccormick, Carla","F","Eligibility","Quarter 1",0,5,1,999999999]
["Kelley Carol",{"$f":"VLOOKUP(F236,ClassCategories!$A$2:$B$42,2,0)","v":"Social Studies"},"Kelley","Carol",11,"AP US/AZ HIS",1531,"Shepard, Diana","F","Eligibility","Quarter 1",58.82,5,1,999999999]
["Kelley Carol",{"$f":"VLOOKUP(F237,ClassCategories!$A$2:$B$42,2,0)","v":"Math"},"Kelley","Carol",11,"Hon Algebra 2 Sem 1",1173,"Riley, Frank","F","Eligibility","Quarter 1",58.38,6,1,999999999]
["Kelley Carol",{"$f":"VLOOKUP(F238,ClassCategories!$A$2:$B$42,2,0)","v":"English"},"Kelley","Carol",11,"Honors English 5",943,"Mcleod, Ada","F","Eligibility","Quarter 1",31.17,2,1,999999999]
["Kemp Aaron",{"$f":"VLOOKUP(F239,ClassCategories!$A$2:$B$42,2,0)","v":"English"},"Kemp","Aaron",10,"ENGLISH 3",909,"Weiss, Gwendolyn","F","Eligibility","Quarter 1",46.44,1,1,999999999]
["Kemp Roy",{"$f":"VLOOKUP(F240,ClassCategories!$A$2:$B$42,2,0)","v":"Social Studies"},"Kemp","Roy",11,"US/AZ HIS 1",1529,"Espinoza, Adam","F","Eligibility","Quarter 1",55.88,3,1,999999999]
["Kennedy Eva",{"$f":"VLOOKUP(F241,ClassCategories!$A$2:$B$42,2,0)","v":"English"},"Kennedy","Eva",10,"ENGLISH 3",909,"Albert, Edward","F","Eligibility","Quarter 1",59.24,4,1,999999999]
["Kennedy Whitney",{"$f":"VLOOKUP(F242,ClassCategories!$A$2:$B$42,2,0)","v":"Science"},"Kennedy","Whitney",10,"BIOLOGY 1",1407,"Kaufman, Philip","F","Eligibility","Quarter 1",39.44,6,1,999999999]
["Kim Myrtle",{"$f":"VLOOKUP(F243,ClassCategories!$A$2:$B$42,2,0)","v":"Science"},"Kim","Myrtle",9,"T SCIENCE 1",1429,"Weiss, Julie","F","Eligibility","Quarter 1",45.55,1,1,999999999]
["Kinney Christopher",{"$f":"VLOOKUP(F244,ClassCategories!$A$2:$B$42,2,0)","v":"Math"},"Kinney","Christopher",11,"Algebra 2 Sem 1",1177,"Riley, Frank","F","Eligibility","Quarter 1",46.67,1,1,999999999]
["Kinney Christopher",{"$f":"VLOOKUP(F245,ClassCategories!$A$2:$B$42,2,0)","v":"Social Studies"},"Kinney","Christopher",11,"AP US/AZ HIS",1531,"Shepard, Diana","F","Eligibility","Quarter 1",45.9,7,1,999999999]
["Kinney Christopher",{"$f":"VLOOKUP(F246,ClassCategories!$A$2:$B$42,2,0)","v":"English"},"Kinney","Christopher",11,"Honors English 5",943,"Fisher, Sylvia","F","Eligibility","Quarter 1",40.590000000000003,6,1,999999999]
["Kirby Amy",{"$f":"VLOOKUP(F247,ClassCategories!$A$2:$B$42,2,0)","v":"English"},"Kirby","Amy",11,"ENGLISH 3",909,"Weiss, Gwendolyn","F","Eligibility","Quarter 1",9.76,2,1,999999999]
["Kirby Amy",{"$f":"VLOOKUP(F248,ClassCategories!$A$2:$B$42,2,0)","v":"Social Studies"},"Kirby","Amy",11,"US/AZ HIS 1",1529,"Mccormick, Carla","F","Eligibility","Quarter 1",0,6,1,999999999]
["Kramer Norma",{"$f":"VLOOKUP(F249,ClassCategories!$A$2:$B$42,2,0)","v":"Science"},"Kramer","Norma",10,"BIOLOGY 1",1407,"Byers, Dale","F","Eligibility","Quarter 1",50.48,5,1,999999999]
["Lamb Gregory",{"$f":"VLOOKUP(F250,ClassCategories!$A$2:$B$42,2,0)","v":"Math"},"Lamb","Gregory",11,"Geometry Sem 1",1131,"Barrera, Melanie","F","Eligibility","Quarter 1",41.62,7,1,999999999]
["Lamb Gregory",{"$f":"VLOOKUP(F251,ClassCategories!$A$2:$B$42,2,0)","v":"Social Studies"},"Lamb","Gregory",11,"US/AZ HIS 1",1529,"Torres, Carl","F","Eligibility","Quarter 1",51.18,1,1,999999999]
["Larsen Allison",{"$f":"VLOOKUP(F252,ClassCategories!$A$2:$B$42,2,0)","v":"Science"},"Larsen","Allison",10,"BIOLOGY 1",1407,"Schwartz, Charles","F","Eligibility","Quarter 1",19.39,1,1,999999999]
["Larsen Allison",{"$f":"VLOOKUP(F253,ClassCategories!$A$2:$B$42,2,0)","v":"English"},"Larsen","Allison",10,"ENGLISH 3",909,"Albert, Edward","F","Eligibility","Quarter 1",30.94,4,1,999999999]
["Larsen Allison",{"$f":"VLOOKUP(F254,ClassCategories!$A$2:$B$42,2,0)","v":"Math"},"Larsen","Allison",10,"Geometry Sem 1",1131,"Ortega, Alma","F","Eligibility","Quarter 1",5.31,2,1,999999999]
["Le Nathan",{"$f":"VLOOKUP(F255,ClassCategories!$A$2:$B$42,2,0)","v":"Science"},"Le","Nathan",11,"BIOLOGY 1",1407,"Byers, Dale","F","Eligibility","Quarter 1",46.52,5,1,999999999]
["Le Nathan",{"$f":"VLOOKUP(F256,ClassCategories!$A$2:$B$42,2,0)","v":"Social Studies"},"Le","Nathan",11,"US/AZ HIS 1",1529,"Mccormick, Carla","F","Eligibility","Quarter 1",52.83,7,1,999999999]
["Lester Ronald",{"$f":"VLOOKUP(F257,ClassCategories!$A$2:$B$42,2,0)","v":"Social Studies"},"Lester","Ronald",11,"US/AZ HIS 1",1529,"Espinoza, Adam","F","Eligibility","Quarter 1",45.96,3,1,999999999]
["Lindsay Mamie",{"$f":"VLOOKUP(F258,ClassCategories!$A$2:$B$42,2,0)","v":"Math"},"Lindsay","Mamie",10,"Algebra 1 Sem 2",3119,"Gallegos, Brandy","F","Eligibility","Quarter 1",44.17,1,1,999999999]
["Lindsay Mamie",{"$f":"VLOOKUP(F259,ClassCategories!$A$2:$B$42,2,0)","v":"Elective"},"Lindsay","Mamie",10,"Culinary Arts 1",735,"Chaney, Erin","F","Eligibility","Quarter 1",50,3,1,999999999]
["Lindsay Mamie",{"$f":"VLOOKUP(F260,ClassCategories!$A$2:$B$42,2,0)","v":"English"},"Lindsay","Mamie",10,"ENGLISH 3",909,"Sheppard, Chad","F","Eligibility","Quarter 1",58.46,7,1,999999999]
[{"$f":"C261&\" \"&D261","v":"Lindsey Marilyn"},{"$f":"VLOOKUP(F261,ClassCategories!$A$2:$B$42,2,0)","v":"Social Studies"},"Lindsey","Marilyn",11,"US/AZ HIS 1",1529,"Torres, Carl","F","Eligibility","Quarter 1",38.99,1,1,999999999]
["Lindsey Maxine",{"$f":"VLOOKUP(F262,ClassCategories!$A$2:$B$42,2,0)","v":"Social Studies"},"Lindsey","Maxine",11,"PSYCHOLOGY",1521,"Madden, Allen","F","Eligibility","Quarter 1",47.62,2,1,999999999]
["Lindsey Maxine",{"$f":"VLOOKUP(F263,ClassCategories!$A$2:$B$42,2,0)","v":"Social Studies"},"Lindsey","Maxine",11,"US/AZ HIS 1",1529,"Espinoza, Adam","F","Eligibility","Quarter 1",43.38,3,1,999999999]
["Little Eugene",{"$f":"VLOOKUP(F264,ClassCategories!$A$2:$B$42,2,0)","v":"English"},"Little","Eugene",11,"Honors English 5",943,"Fisher, Sylvia","F","Eligibility","Quarter 1",22.81,6,1,999999999]
["Lloyd Charlotte",{"$f":"VLOOKUP(F265,ClassCategories!$A$2:$B$42,2,0)","v":"Social Studies"},"Lloyd","Charlotte",10,"W HIS/AZ G1",1541,"Wooten, Joshua","F","Eligibility","Quarter 1",31.81,2,1,999999999]
["Lloyd Kathleen",{"$f":"VLOOKUP(F266,ClassCategories!$A$2:$B$42,2,0)","v":"Social Studies"},"Lloyd","Kathleen",11,"US/AZ HIS 1",1529,"Espinoza, Adam","F","Eligibility","Quarter 1",54.63,6,1,999999999]
["Love Jeannette",{"$f":"VLOOKUP(F267,ClassCategories!$A$2:$B$42,2,0)","v":"Elective"},"Love","Jeannette",10,"GERMAN 3",611,"Simon, Guadalupe","F","Eligibility","Quarter 1",51.69,7,1,999999999]
["Lowery Carl",{"$f":"VLOOKUP(F268,ClassCategories!$A$2:$B$42,2,0)","v":"Science"},"Lowery","Carl",9,"T SCIENCE 1",1429,"Kaufman, Philip","F","Eligibility","Quarter 1",59.21,2,1,999999999]
["Lucas Ellen",{"$f":"VLOOKUP(F269,ClassCategories!$A$2:$B$42,2,0)","v":"Math"},"Lucas","Ellen",11,"Algebra 2 Sem 1",1177,"Talley, Eugene","F","Eligibility","Quarter 1",48.77,7,1,999999999]
["Maddox Gloria",{"$f":"VLOOKUP(F270,ClassCategories!$A$2:$B$42,2,0)","v":"Social Studies"},"Maddox","Gloria",11,"US/AZ HIS 1",1529,"Espinoza, Adam","F","Eligibility","Quarter 1",33.07,6,1,999999999]
["Manning Tiffany",{"$f":"VLOOKUP(F271,ClassCategories!$A$2:$B$42,2,0)","v":"Math"},"Manning","Tiffany",11,"Algebra 2 Sem 1",1177,"Riley, Frank","F","Eligibility","Quarter 1",39.409999999999997,2,1,999999999]
["Marquez Gloria",{"$f":"VLOOKUP(F272,ClassCategories!$A$2:$B$42,2,0)","v":"Elective"},"Marquez","Gloria",9,"Business Technology 1",541,"Richmond, Elsie","F","Eligibility","Quarter 1",50,6,1,999999999]
["Massey Melissa",{"$f":"VLOOKUP(F273,ClassCategories!$A$2:$B$42,2,0)","v":"English"},"Massey","Melissa",10,"ENGLISH 3",909,"Hobbs, Joann","F","Eligibility","Quarter 1",49.33,1,1,999999999]
["Massey Melissa",{"$f":"VLOOKUP(F274,ClassCategories!$A$2:$B$42,2,0)","v":"Elective"},"Massey","Melissa",10,"SPANISH 1",627,"Raymond, Marguerite","F","Eligibility","Quarter 1",57.5,7,1,999999999]
["Maynard Keith",{"$f":"VLOOKUP(F275,ClassCategories!$A$2:$B$42,2,0)","v":"English"},"Maynard","Keith",10,"Honors English 3",941,"Sawyer, Jeff","F","Eligibility","Quarter 1",50,4,1,999999999]
["Maynard Keith",{"$f":"VLOOKUP(F276,ClassCategories!$A$2:$B$42,2,0)","v":"Elective"},"Maynard","Keith",10,"JAPANESE 3",647,"Carney, Shelly","F","Eligibility","Quarter 1",12.53,2,1,999999999]
["Mayo Christy",{"$f":"VLOOKUP(F277,ClassCategories!$A$2:$B$42,2,0)","v":"English"},"Mayo","Christy",10,"ENGLISH 3",909,"Albert, Edward","F","Eligibility","Quarter 1",58.4,4,1,999999999]
["Mccarthy Claudia",{"$f":"VLOOKUP(F278,ClassCategories!$A$2:$B$42,2,0)","v":"Elective"},"Mccarthy","Claudia",11,"ACCOUNT 1",501,"Richmond, Elsie","F","Eligibility","Quarter 1",13.33,1,1,999999999]
["Mccarthy Claudia",{"$f":"VLOOKUP(F279,ClassCategories!$A$2:$B$42,2,0)","v":"Math"},"Mccarthy","Claudia",11,"Algebra 2 Sem 1",1177,"Riley, Frank","F","Eligibility","Quarter 1",45.14,3,1,999999999]
["Mccarthy Claudia",{"$f":"VLOOKUP(F280,ClassCategories!$A$2:$B$42,2,0)","v":"Social Studies"},"Mccarthy","Claudia",11,"US/AZ HIS 1",1529,"Espinoza, Adam","F","Eligibility","Quarter 1",32.9,6,1,999999999]
["Mcclain Maureen",{"$f":"VLOOKUP(F281,ClassCategories!$A$2:$B$42,2,0)","v":"Math"},"Mcclain","Maureen",11,"Algebra 2 Sem 1",1177,"Riley, Frank","F","Eligibility","Quarter 1",43.11,3,1,999999999]
["Mccoy Brandy",{"$f":"VLOOKUP(F282,ClassCategories!$A$2:$B$42,2,0)","v":"English"},"Mccoy","Brandy",9,"ENGLISH 1",903,"Burns, Whitney","F","Eligibility","Quarter 1",50.82,2,1,999999999]
["Mccullough Glenn",{"$f":"VLOOKUP(F283,ClassCategories!$A$2:$B$42,2,0)","v":"Math"},"Mccullough","Glenn",11,"Geometry Sem 2",3133,"Lawson, Philip","F","Eligibility","Quarter 1",53.07,1,1,999999999]
["Mcfadden Shawn",{"$f":"VLOOKUP(F284,ClassCategories!$A$2:$B$42,2,0)","v":"English"},"Mcfadden","Shawn",11,"ENGLISH 5",915,"Sawyer, Jeff","F","Eligibility","Quarter 1",54,3,1,999999999]
["Mcfadden Shawn",{"$f":"VLOOKUP(F285,ClassCategories!$A$2:$B$42,2,0)","v":"Social Studies"},"Mcfadden","Shawn",11,"US/AZ HIS 1",1529,"Torres, Carl","F","Eligibility","Quarter 1",52.76,2,1,999999999]
["Mcfarland Mike",{"$f":"VLOOKUP(F286,ClassCategories!$A$2:$B$42,2,0)","v":"Science"},"Mcfarland","Mike",11,"Honors Pre Calculus",1089,"Small, Kelli","F","Eligibility","Quarter 1",50,3,1,999999999]
["Mcgee Robin",{"$f":"VLOOKUP(F287,ClassCategories!$A$2:$B$42,2,0)","v":"English"},"Mcgee","Robin",10,"ENGLISH 3",909,"Weiss, Gwendolyn","F","Eligibility","Quarter 1",14.23,2,1,999999999]
["Mcintyre Barbara",{"$f":"VLOOKUP(F288,ClassCategories!$A$2:$B$42,2,0)","v":"English"},"Mcintyre","Barbara",10,"ENGLISH 3",909,"Hobbs, Joann","F","Eligibility","Quarter 1",52,1,1,999999999]
["Mcintyre Charlotte",{"$f":"VLOOKUP(F289,ClassCategories!$A$2:$B$42,2,0)","v":"Math"},"Mcintyre","Charlotte",10,"Geometry Sem 1",1131,"Barrera, Melanie","F","Eligibility","Quarter 1",47.24,5,1,999999999]
["Mcknight Kim",{"$f":"VLOOKUP(F290,ClassCategories!$A$2:$B$42,2,0)","v":"Math"},"Mcknight","Kim",11,"Algebra 2 Sem 1",1177,"Riley, Frank","F","Eligibility","Quarter 1",47.75,2,1,999999999]
["Mcknight Kim",{"$f":"VLOOKUP(F291,ClassCategories!$A$2:$B$42,2,0)","v":"Math"},"Mcknight","Kim",11,"Geometry Sem 2",3133,"Lawson, Philip","F","Eligibility","Quarter 1",53.27,1,1,999999999]
["Mcleod Lillian",{"$f":"VLOOKUP(F292,ClassCategories!$A$2:$B$42,2,0)","v":"English"},"Mcleod","Lillian",10,"ENGLISH 3",909,"Hobbs, Joann","F","Eligibility","Quarter 1",54.67,1,1,999999999]
["Mcneil Louis",{"$f":"VLOOKUP(F293,ClassCategories!$A$2:$B$42,2,0)","v":"Math"},"Mcneil","Louis",11,"Algebra 2 Sem 1",1177,"Talley, Eugene","F","Eligibility","Quarter 1",57.67,2,1,999999999]
["Medina Harriet",{"$f":"VLOOKUP(F294,ClassCategories!$A$2:$B$42,2,0)","v":"Social Studies"},"Medina","Harriet",11,"US/AZ HIS 1",1529,"Espinoza, Adam","F","Eligibility","Quarter 1",51.95,6,1,999999999]
["Meyers Rodney",{"$f":"VLOOKUP(F295,ClassCategories!$A$2:$B$42,2,0)","v":"Math"},"Meyers","Rodney",10,"Hon Algebra 2 Sem 1",1173,"Riley, Frank","F","Eligibility","Quarter 1",10.1,5,1,999999999]
["Michael Roger",{"$f":"VLOOKUP(F296,ClassCategories!$A$2:$B$42,2,0)","v":"Elective"},"Michael","Roger",10,"GERMAN 3",611,"Simon, Guadalupe","F","Eligibility","Quarter 1",57.3,7,1,999999999]
["Miller Joann",{"$f":"VLOOKUP(F297,ClassCategories!$A$2:$B$42,2,0)","v":"English"},"Miller","Joann",10,"ENGLISH 3",909,"Sheppard, Chad","F","Eligibility","Quarter 1",50.77,6,1,999999999]
["Miller Joann",{"$f":"VLOOKUP(F298,ClassCategories!$A$2:$B$42,2,0)","v":"Math"},"Miller","Joann",10,"Geometry Sem 1",1131,"Ortega, Alma","F","Eligibility","Quarter 1",38.25,3,1,999999999]
["Miller Joann",{"$f":"VLOOKUP(F299,ClassCategories!$A$2:$B$42,2,0)","v":"Elective"},"Miller","Joann",10,"Stage Craft 1",1015,"Mayo, Todd","F","Eligibility","Quarter 1",51.11,7,1,999999999]
["Moore Lori",{"$f":"VLOOKUP(F300,ClassCategories!$A$2:$B$42,2,0)","v":"English"},"Moore","Lori",10,"ENGLISH 3",909,"Albert, Edward","F","Eligibility","Quarter 1",53.78,4,1,999999999]
["Morales Phillip",{"$f":"VLOOKUP(F301,ClassCategories!$A$2:$B$42,2,0)","v":"Math"},"Morales","Phillip",10,"Geometry Sem 1",1131,"Barrera, Melanie","F","Eligibility","Quarter 1",44.68,7,1,999999999]
["Moreno Samuel",{"$f":"VLOOKUP(F302,ClassCategories!$A$2:$B$42,2,0)","v":"Math"},"Moreno","Samuel",9,"Algebra 1 Sem 1",1119,"James, Lola","F","Eligibility","Quarter 1",24.95,4,1,999999999]
["Morgan Alfred",{"$f":"VLOOKUP(F303,ClassCategories!$A$2:$B$42,2,0)","v":"Elective"},"Morgan","Alfred",10,"ACCOUNT 1",501,"Richmond, Elsie","F","Eligibility","Quarter 1",16.670000000000002,1,1,999999999]
["Morgan Alfred",{"$f":"VLOOKUP(F304,ClassCategories!$A$2:$B$42,2,0)","v":"Math"},"Morgan","Alfred",10,"Geometry Sem 1",1131,"Ortega, Alma","F","Eligibility","Quarter 1",51.61,3,1,999999999]
["Morgan Yolanda",{"$f":"VLOOKUP(F305,ClassCategories!$A$2:$B$42,2,0)","v":"Math"},"Morgan","Yolanda",11,"Algebra 2 Sem 1",1177,"Talley, Eugene","F","Eligibility","Quarter 1",52.8,2,1,999999999]
["Morse Ronald",{"$f":"VLOOKUP(F306,ClassCategories!$A$2:$B$42,2,0)","v":"Math"},"Morse","Ronald",11,"Algebra 2 Sem 1",1177,"Talley, Eugene","F","Eligibility","Quarter 1",45.96,7,1,999999999]
["Moses Melanie",{"$f":"VLOOKUP(F307,ClassCategories!$A$2:$B$42,2,0)","v":"Elective"},"Moses","Melanie",10,"GERMAN 3",611,"Simon, Guadalupe","F","Eligibility","Quarter 1",55.06,7,1,999999999]
["Moses Melanie",{"$f":"VLOOKUP(F308,ClassCategories!$A$2:$B$42,2,0)","v":"Math"},"Moses","Melanie",10,"Hon Algebra 2 Sem 1",1173,"Riley, Frank","F","Eligibility","Quarter 1",6.06,5,1,999999999]
["Moses Melanie",{"$f":"VLOOKUP(F309,ClassCategories!$A$2:$B$42,2,0)","v":"Math"},"Moses","Melanie",9,"Algebra 1 Sem 1",1119,"Barrera, Melanie","F","Eligibility","Quarter 1",32.619999999999997,2,1,999999999]
["Mullins Juan",{"$f":"VLOOKUP(F310,ClassCategories!$A$2:$B$42,2,0)","v":"Math"},"Mullins","Juan",9,"Algebra 1 Sem 1",1119,"Barrera, Melanie","F","Eligibility","Quarter 1",48.77,2,1,999999999]
["Munoz Yolanda",{"$f":"VLOOKUP(F311,ClassCategories!$A$2:$B$42,2,0)","v":"English"},"Munoz","Yolanda",10,"ENGLISH 3",909,"Sheppard, Chad","F","Eligibility","Quarter 1",46.92,6,1,999999999]
["Munoz Yolanda",{"$f":"VLOOKUP(F312,ClassCategories!$A$2:$B$42,2,0)","v":"Social Studies"},"Munoz","Yolanda",10,"W HIS/AZ G1",1541,"Wooten, Joshua","F","Eligibility","Quarter 1",24.52,1,1,999999999]
["Murphy Carlos",{"$f":"VLOOKUP(F313,ClassCategories!$A$2:$B$42,2,0)","v":"Elective"},"Murphy","Carlos",10,"ACCOUNT 1",501,"Richmond, Elsie","F","Eligibility","Quarter 1",30,2,1,999999999]
["Murphy Carlos",{"$f":"VLOOKUP(F314,ClassCategories!$A$2:$B$42,2,0)","v":"Math"},"Murphy","Carlos",10,"Algebra 1 Sem 2",3119,"Gallegos, Brandy","F","Eligibility","Quarter 1",43.2,1,1,999999999]
["Murphy Carlos",{"$f":"VLOOKUP(F315,ClassCategories!$A$2:$B$42,2,0)","v":"English"},"Murphy","Carlos",10,"ENGLISH 3",909,"Sheppard, Chad","F","Eligibility","Quarter 1",40,6,1,999999999]
["Murphy Douglas",{"$f":"VLOOKUP(F316,ClassCategories!$A$2:$B$42,2,0)","v":"Science"},"Murphy","Douglas",10,"BIOLOGY 1",1407,"Kaufman, Philip","F","Eligibility","Quarter 1",47.5,6,1,999999999]
["Navarro Adam",{"$f":"VLOOKUP(F317,ClassCategories!$A$2:$B$42,2,0)","v":"Social Studies"},"Navarro","Adam",11,"US/AZ HIS 1",1529,"Torres, Carl","F","Eligibility","Quarter 1",57.84,1,1,999999999]
["Nichols Gwendolyn",{"$f":"VLOOKUP(F318,ClassCategories!$A$2:$B$42,2,0)","v":"Science"},"Nichols","Gwendolyn",10,"BIOLOGY 1",1407,"Kaufman, Philip","F","Eligibility","Quarter 1",57.22,6,1,999999999]
["Nichols Ryan",{"$f":"VLOOKUP(F319,ClassCategories!$A$2:$B$42,2,0)","v":"Social Studies"},"Nichols","Ryan",11,"AP US/AZ HIS",1531,"Shepard, Diana","F","Eligibility","Quarter 1",56.86,6,1,999999999]
["Nichols Ryan",{"$f":"VLOOKUP(F320,ClassCategories!$A$2:$B$42,2,0)","v":"Math"},"Nichols","Ryan",11,"Hon Algebra 2 Sem 1",1173,"Riley, Frank","F","Eligibility","Quarter 1",7.07,5,1,999999999]
["Nixon Claire",{"$f":"VLOOKUP(F321,ClassCategories!$A$2:$B$42,2,0)","v":"English"},"Nixon","Claire",11,"ENGLISH 5",915,"Madden, Allen","F","Eligibility","Quarter 1",46.67,6,1,999999999]
["Noble Candice",{"$f":"VLOOKUP(F322,ClassCategories!$A$2:$B$42,2,0)","v":"Social Studies"},"Noble","Candice",11,"US/AZ HIS 1",1529,"Mccormick, Carla","F","Eligibility","Quarter 1",0,5,1,999999999]
["Nolan Allen",{"$f":"VLOOKUP(F323,ClassCategories!$A$2:$B$42,2,0)","v":"Math"},"Nolan","Allen",10,"Algebra 1 Sem 2",3119,"Gallegos, Brandy","F","Eligibility","Quarter 1",56.56,1,1,999999999]
["Nolan Allen",{"$f":"VLOOKUP(F324,ClassCategories!$A$2:$B$42,2,0)","v":"Science"},"Nolan","Allen",10,"BIOLOGY 1",1407,"Byers, Dale","F","Eligibility","Quarter 1",54.86,5,1,999999999]
[{"$f":"C325&\" \"&D325","v":"Obrien Melanie"},{"$f":"VLOOKUP(F325,ClassCategories!$A$2:$B$42,2,0)","v":"English"},"Obrien","Melanie",10,"ENGLISH 3",909,"Weiss, Gwendolyn","F","Eligibility","Quarter 1",17.600000000000001,2,1,999999999]
["Ochoa Daniel",{"$f":"VLOOKUP(F326,ClassCategories!$A$2:$B$42,2,0)","v":"Math"},"Ochoa","Daniel",9,"Algebra 1 Sem 1/Lab",1125,"James, Lola","F","Eligibility","Quarter 1",52.35,6,1,999999999]
["Oliver Joshua",{"$f":"VLOOKUP(F327,ClassCategories!$A$2:$B$42,2,0)","v":"English"},"Oliver","Joshua",11,"Honors English 5",943,"Fisher, Sylvia","F","Eligibility","Quarter 1",57.58,3,1,999999999]
["Oliver Lauren",{"$f":"VLOOKUP(F328,ClassCategories!$A$2:$B$42,2,0)","v":"Science"},"Oliver","Lauren",10,"BIOLOGY 1",1407,"Schwartz, Charles","F","Eligibility","Quarter 1",55.94,3,1,999999999]
["Ortega Walter",{"$f":"VLOOKUP(F329,ClassCategories!$A$2:$B$42,2,0)","v":"Science"},"Ortega","Walter",10,"BIOLOGY 1",1407,"Kaufman, Philip","F","Eligibility","Quarter 1",31.67,6,1,999999999]
["Ortega Walter",{"$f":"VLOOKUP(F330,ClassCategories!$A$2:$B$42,2,0)","v":"English"},"Ortega","Walter",10,"ENGLISH 3",909,"Sheppard, Chad","F","Eligibility","Quarter 1",15.38,2,1,999999999]
["Palmer Cecilia",{"$f":"VLOOKUP(F331,ClassCategories!$A$2:$B$42,2,0)","v":"Social Studies"},"Palmer","Cecilia",11,"AP US/AZ HIS",1531,"Shepard, Diana","F","Eligibility","Quarter 1",57.38,6,1,999999999]
["Park Andrew",{"$f":"VLOOKUP(F332,ClassCategories!$A$2:$B$42,2,0)","v":"Math"},"Park","Andrew",10,"Algebra 1 Sem 1",1119,"Curtis, Billie","F","Eligibility","Quarter 1",24.27,5,1,999999999]
["Park Andrew",{"$f":"VLOOKUP(F333,ClassCategories!$A$2:$B$42,2,0)","v":"Science"},"Park","Andrew",10,"T SCIENCE 1",1429,"Kaufman, Philip","F","Eligibility","Quarter 1",39.22,3,1,999999999]
["Park Rita",{"$f":"VLOOKUP(F334,ClassCategories!$A$2:$B$42,2,0)","v":"Math"},"Park","Rita",9,"Algebra 1 Sem 1",1119,"Curtis, Billie","F","Eligibility","Quarter 1",54.4,3,1,999999999]
["Patel Glenda",{"$f":"VLOOKUP(F335,ClassCategories!$A$2:$B$42,2,0)","v":"Math"},"Patel","Glenda",9,"Algebra 1 Sem 1",1119,"Barrera, Melanie","F","Eligibility","Quarter 1",57.81,2,1,999999999]
["Patel Glenda",{"$f":"VLOOKUP(F336,ClassCategories!$A$2:$B$42,2,0)","v":"English"},"Patel","Glenda",9,"Honors English 1",939,"Dudley, Stacy","F","Eligibility","Quarter 1",54.55,3,1,999999999]
["Patel Glenda",{"$f":"VLOOKUP(F337,ClassCategories!$A$2:$B$42,2,0)","v":"Phys Ed"},"Patel","Glenda",9,"PHYS ED 1G",1305,"Nelson, Sheila","F","Eligibility","Quarter 1",50,7,1,999999999]
["Patterson Joan",{"$f":"VLOOKUP(F338,ClassCategories!$A$2:$B$42,2,0)","v":"English"},"Patterson","Joan",11,"ENGLISH 3",909,"Weiss, Gwendolyn","F","Eligibility","Quarter 1",57.68,2,1,999999999]
["Patterson Joan",{"$f":"VLOOKUP(F339,ClassCategories!$A$2:$B$42,2,0)","v":"Social Studies"},"Patterson","Joan",11,"US/AZ HIS 1",1529,"Torres, Carl","F","Eligibility","Quarter 1",48.43,4,1,999999999]
["Paul Esther",{"$f":"VLOOKUP(F340,ClassCategories!$A$2:$B$42,2,0)","v":"Math"},"Paul","Esther",10,"Algebra 1 Sem 1",1119,"Curtis, Billie","F","Eligibility","Quarter 1",59.25,3,1,999999999]
["Paul Esther",{"$f":"VLOOKUP(F341,ClassCategories!$A$2:$B$42,2,0)","v":"Science"},"Paul","Esther",10,"BIOLOGY 1",1407,"Kaufman, Philip","F","Eligibility","Quarter 1",40.28,6,1,999999999]
["Paul Esther",{"$f":"VLOOKUP(F342,ClassCategories!$A$2:$B$42,2,0)","v":"Social Studies"},"Paul","Esther",10,"W HIS/AZ G1",1541,"Raymond, Lillian","F","Eligibility","Quarter 1",55.88,4,1,999999999]
["Paul Manuel",{"$f":"VLOOKUP(F343,ClassCategories!$A$2:$B$42,2,0)","v":"English"},"Paul","Manuel",11,"Honors English 5",943,"Fisher, Sylvia","F","Eligibility","Quarter 1",35.590000000000003,3,1,999999999]
["Paul Manuel",{"$f":"VLOOKUP(F344,ClassCategories!$A$2:$B$42,2,0)","v":"Science"},"Paul","Manuel",11,"Honors Pre Calculus",1089,"Velasquez, Gwendolyn","F","Eligibility","Quarter 1",54.8,6,1,999999999]
["Pearson Charlotte",{"$f":"VLOOKUP(F345,ClassCategories!$A$2:$B$42,2,0)","v":"Math"},"Pearson","Charlotte",11,"Algebra 2 Sem 1",1177,"Talley, Eugene","F","Eligibility","Quarter 1",55.69,2,1,999999999]
["Pearson Charlotte",{"$f":"VLOOKUP(F346,ClassCategories!$A$2:$B$42,2,0)","v":"Elective"},"Pearson","Charlotte",11,"ARCH DRAFT",819,"Avery, Chris","F","Eligibility","Quarter 1",58.17,7,1,999999999]
["Pearson Charlotte",{"$f":"VLOOKUP(F347,ClassCategories!$A$2:$B$42,2,0)","v":"Elective"},"Pearson","Charlotte",11,"SPANISH 3",633,"Raymond, Marguerite","F","Eligibility","Quarter 1",47.49,4,1,999999999]
["Pearson Marie",{"$f":"VLOOKUP(F348,ClassCategories!$A$2:$B$42,2,0)","v":"Math"},"Pearson","Marie",11,"Algebra 2 Sem 1",1177,"Talley, Eugene","F","Eligibility","Quarter 1",47.93,2,1,999999999]
["Pearson Marie",{"$f":"VLOOKUP(F349,ClassCategories!$A$2:$B$42,2,0)","v":"Social Studies"},"Pearson","Marie",11,"US/AZ HIS 1",1529,"Espinoza, Adam","F","Eligibility","Quarter 1",29.61,6,1,999999999]
["Pearson Stacy",{"$f":"VLOOKUP(F350,ClassCategories!$A$2:$B$42,2,0)","v":"Elective"},"Pearson","Stacy",9,"Business Technology 1",541,"Richmond, Elsie","F","Eligibility","Quarter 1",42,6,1,999999999]
["Pearson Stacy",{"$f":"VLOOKUP(F351,ClassCategories!$A$2:$B$42,2,0)","v":"Elective"},"Pearson","Stacy",9,"Culinary Arts 1",735,"Chaney, Erin","F","Eligibility","Quarter 1",56.48,1,1,999999999]
["Perry Kathryn",{"$f":"VLOOKUP(F352,ClassCategories!$A$2:$B$42,2,0)","v":"Math"},"Perry","Kathryn",10,"Algebra 1 Sem 2",3119,"Gallegos, Brandy","F","Eligibility","Quarter 1",49.8,1,1,999999999]
["Perry Kathryn",{"$f":"VLOOKUP(F353,ClassCategories!$A$2:$B$42,2,0)","v":"English"},"Perry","Kathryn",10,"ENGLISH 3",909,"Sheppard, Chad","F","Eligibility","Quarter 1",30.77,2,1,999999999]
["Pickett Marilyn",{"$f":"VLOOKUP(F354,ClassCategories!$A$2:$B$42,2,0)","v":"Math"},"Pickett","Marilyn",11,"Algebra 2 Sem 1",1177,"Talley, Eugene","F","Eligibility","Quarter 1",8.89,2,1,999999999]
["Pickett Marilyn",{"$f":"VLOOKUP(F355,ClassCategories!$A$2:$B$42,2,0)","v":"English"},"Pickett","Marilyn",11,"ENGLISH 5",915,"Fisher, Sylvia","F","Eligibility","Quarter 1",56,1,1,999999999]
["Pickett Marilyn",{"$f":"VLOOKUP(F356,ClassCategories!$A$2:$B$42,2,0)","v":"Social Studies"},"Pickett","Marilyn",11,"US/AZ HIS 1",1529,"Espinoza, Adam","F","Eligibility","Quarter 1",20.329999999999998,5,1,999999999]
["Pickett Robert",{"$f":"VLOOKUP(F357,ClassCategories!$A$2:$B$42,2,0)","v":"English"},"Pickett","Robert",10,"ENGLISH 3",909,"Sheppard, Chad","F","Eligibility","Quarter 1",53.85,2,1,999999999]
["Pickett Robert",{"$f":"VLOOKUP(F358,ClassCategories!$A$2:$B$42,2,0)","v":"Math"},"Pickett","Robert",10,"Geometry Sem 1",1131,"Ortega, Alma","F","Eligibility","Quarter 1",10.61,1,1,999999999]
["Poole Anthony",{"$f":"VLOOKUP(F359,ClassCategories!$A$2:$B$42,2,0)","v":"Elective"},"Poole","Anthony",10,"SPANISH 1",627,"Raymond, Marguerite","F","Eligibility","Quarter 1",59.03,7,1,999999999]
["Pope Michele",{"$f":"VLOOKUP(F360,ClassCategories!$A$2:$B$42,2,0)","v":"Math"},"Pope","Michele",11,"Geometry Sem 2",3133,"Lawson, Philip","F","Eligibility","Quarter 1",42.51,1,1,999999999]
["Pope Natalie",{"$f":"VLOOKUP(F361,ClassCategories!$A$2:$B$42,2,0)","v":"Math"},"Pope","Natalie",11,"Algebra 1 Sem 1",1119,"Barrera, Melanie","F","Eligibility","Quarter 1",38.07,2,1,999999999]
["Pope Natalie",{"$f":"VLOOKUP(F362,ClassCategories!$A$2:$B$42,2,0)","v":"English"},"Pope","Natalie",11,"ENGLISH 3",909,"Sheppard, Chad","F","Eligibility","Quarter 1",30.77,6,1,999999999]
["Pope Natalie",{"$f":"VLOOKUP(F363,ClassCategories!$A$2:$B$42,2,0)","v":"English"},"Pope","Natalie",11,"ENGLISH 5",915,"Sawyer, Jeff","F","Eligibility","Quarter 1",46.34,3,1,999999999]
["Pope Natalie",{"$f":"VLOOKUP(F364,ClassCategories!$A$2:$B$42,2,0)","v":"Social Studies"},"Pope","Natalie",11,"US/AZ HIS 1",1529,"Torres, Carl","F","Eligibility","Quarter 1",35.5,1,1,999999999]
["Powers Sylvia",{"$f":"VLOOKUP(F365,ClassCategories!$A$2:$B$42,2,0)","v":"Math"},"Powers","Sylvia",11,"Algebra 2 Sem 1",1177,"Talley, Eugene","F","Eligibility","Quarter 1",48.2,6,1,999999999]
["Powers Sylvia",{"$f":"VLOOKUP(F366,ClassCategories!$A$2:$B$42,2,0)","v":"Science"},"Powers","Sylvia",11,"CHEMISTRY 1",1413,"Spence, Marlene","F","Eligibility","Quarter 1",55.55,2,1,999999999]
["Price Madeline",{"$f":"VLOOKUP(F367,ClassCategories!$A$2:$B$42,2,0)","v":"Elective"},"Price","Madeline",10,"SPANISH 1",627,"Raymond, Marguerite","F","Eligibility","Quarter 1",0,2,1,999999999]
["Quinn Amy",{"$f":"VLOOKUP(F368,ClassCategories!$A$2:$B$42,2,0)","v":"English"},"Quinn","Amy",10,"ENGLISH 3",909,"Weiss, Gwendolyn","F","Eligibility","Quarter 1",23.6,1,1,999999999]
["Quinn Amy",{"$f":"VLOOKUP(F369,ClassCategories!$A$2:$B$42,2,0)","v":"Social Studies"},"Quinn","Amy",10,"W HIS/AZ G1",1541,"Wooten, Joshua","F","Eligibility","Quarter 1",37.340000000000003,2,1,999999999]
["Quinn Matthew",{"$f":"VLOOKUP(F370,ClassCategories!$A$2:$B$42,2,0)","v":"Math"},"Quinn","Matthew",11,"Algebra 2 Sem 1",1177,"Talley, Eugene","F","Eligibility","Quarter 1",50.13,6,1,999999999]
["Quinn Matthew",{"$f":"VLOOKUP(F371,ClassCategories!$A$2:$B$42,2,0)","v":"Social Studies"},"Quinn","Matthew",11,"US/AZ HIS 1",1529,"Mccormick, Carla","F","Eligibility","Quarter 1",40.24,5,1,999999999]
["Richardson Christopher",{"$f":"VLOOKUP(F372,ClassCategories!$A$2:$B$42,2,0)","v":"Math"},"Richardson","Christopher",10,"Algebra 1 Sem 2",3119,"Gallegos, Brandy","F","Eligibility","Quarter 1",47.5,1,1,999999999]
["Richmond Emma",{"$f":"VLOOKUP(F373,ClassCategories!$A$2:$B$42,2,0)","v":"English"},"Richmond","Emma",11,"ENGLISH 5",915,"Sawyer, Jeff","F","Eligibility","Quarter 1",52,3,1,999999999]
["Riggs Kathryn",{"$f":"VLOOKUP(F374,ClassCategories!$A$2:$B$42,2,0)","v":"English"},"Riggs","Kathryn",10,"ENGLISH 3",909,"Weiss, Gwendolyn","F","Eligibility","Quarter 1",54.31,1,1,999999999]
["Riggs Wilma",{"$f":"VLOOKUP(F375,ClassCategories!$A$2:$B$42,2,0)","v":"Elective"},"Riggs","Wilma",9,"PHOTO 1",435,"Bartlett, Lucy","F","Eligibility","Quarter 1",44.44,4,1,999999999]
["Riggs Wilma",{"$f":"VLOOKUP(F376,ClassCategories!$A$2:$B$42,2,0)","v":"Science"},"Riggs","Wilma",9,"T SCIENCE 1",1429,"Weiss, Julie","F","Eligibility","Quarter 1",50.72,6,1,999999999]
["Rivas Jeremy",{"$f":"VLOOKUP(F377,ClassCategories!$A$2:$B$42,2,0)","v":"Science"},"Rivas","Jeremy",11,"AP BIO 1",1403,"Rivera, Patrick","F","Eligibility","Quarter 1",44.63,7,1,999999999]
["Rocha Mildred",{"$f":"VLOOKUP(F378,ClassCategories!$A$2:$B$42,2,0)","v":"English"},"Rocha","Mildred",10,"ENGLISH 3",909,"Albert, Edward","F","Eligibility","Quarter 1",33.33,4,1,999999999]
["Rodriquez Delores",{"$f":"VLOOKUP(F379,ClassCategories!$A$2:$B$42,2,0)","v":"Math"},"Rodriquez","Delores",10,"Algebra 1 Sem 2",3119,"Gallegos, Brandy","F","Eligibility","Quarter 1",18.39,1,1,999999999]
["Rodriquez Delores",{"$f":"VLOOKUP(F380,ClassCategories!$A$2:$B$42,2,0)","v":"English"},"Rodriquez","Delores",10,"ENGLISH 3",909,"Sheppard, Chad","F","Eligibility","Quarter 1",40,2,1,999999999]
["Rodriquez Delores",{"$f":"VLOOKUP(F381,ClassCategories!$A$2:$B$42,2,0)","v":"Science"},"Rodriquez","Delores",10,"T SCIENCE 1",1429,"Kaufman, Philip","F","Eligibility","Quarter 1",36.65,3,1,999999999]
["Romero Jose",{"$f":"VLOOKUP(F382,ClassCategories!$A$2:$B$42,2,0)","v":"Science"},"Romero","Jose",10,"BIOLOGY 1",1407,"Kaufman, Philip","F","Eligibility","Quarter 1",51.94,6,1,999999999]
["Ross Kristin",{"$f":"VLOOKUP(F383,ClassCategories!$A$2:$B$42,2,0)","v":"Math"},"Ross","Kristin",10,"Geometry Sem 1",1131,"Ortega, Alma","F","Eligibility","Quarter 1",57.9,3,1,999999999]
["Ross Scott",{"$f":"VLOOKUP(F384,ClassCategories!$A$2:$B$42,2,0)","v":"Social Studies"},"Ross","Scott",11,"AP US/AZ HIS",1531,"Shepard, Diana","F","Eligibility","Quarter 1",52.46,5,1,999999999]
["Ross Scott",{"$f":"VLOOKUP(F385,ClassCategories!$A$2:$B$42,2,0)","v":"Math"},"Ross","Scott",11,"Hon Algebra 2 Sem 1",1173,"Lawson, Philip","F","Eligibility","Quarter 1",58.78,2,1,999999999]
["Ross Scott",{"$f":"VLOOKUP(F386,ClassCategories!$A$2:$B$42,2,0)","v":"English"},"Ross","Scott",11,"Honors English 5",943,"Fisher, Sylvia","F","Eligibility","Quarter 1",20.59,3,1,999999999]
["Rowe Chris",{"$f":"VLOOKUP(F387,ClassCategories!$A$2:$B$42,2,0)","v":"Math"},"Rowe","Chris",10,"Algebra 1 Sem 2",3119,"Gallegos, Brandy","F","Eligibility","Quarter 1",42.2,1,1,999999999]
["Rowe Chris",{"$f":"VLOOKUP(F388,ClassCategories!$A$2:$B$42,2,0)","v":"Science"},"Rowe","Chris",10,"BIOLOGY 1",1407,"Byers, Dale","F","Eligibility","Quarter 1",41.59,5,1,999999999]
[{"$f":"C389&\" \"&D389","v":"Rowe Chris"},{"$f":"VLOOKUP(F389,ClassCategories!$A$2:$B$42,2,0)","v":"English"},"Rowe","Chris",10,"Honors English 3",941,"Hobbs, Pearl","F","Eligibility","Quarter 1",31.52,2,1,999999999]
["Ruiz Diane",{"$f":"VLOOKUP(F390,ClassCategories!$A$2:$B$42,2,0)","v":"Math"},"Ruiz","Diane",11,"Algebra 1 Sem 2",3119,"Gallegos, Brandy","F","Eligibility","Quarter 1",44.37,1,1,999999999]
["Ruiz Diane",{"$f":"VLOOKUP(F391,ClassCategories!$A$2:$B$42,2,0)","v":"English"},"Ruiz","Diane",11,"ENGLISH 3",909,"Ray, Stacy","F","Eligibility","Quarter 1",29.13,6,1,999999999]
["Rush Terry",{"$f":"VLOOKUP(F392,ClassCategories!$A$2:$B$42,2,0)","v":"English"},"Rush","Terry",10,"ENGLISH 3",909,"Weiss, Gwendolyn","F","Eligibility","Quarter 1",18.73,2,1,999999999]
["Salas Emma",{"$f":"VLOOKUP(F393,ClassCategories!$A$2:$B$42,2,0)","v":"Social Studies"},"Salas","Emma",10,"W HIS/AZ G1",1541,"Dominguez, Carl","F","Eligibility","Quarter 1",54.78,1,1,999999999]
["Sanders Gerald",{"$f":"VLOOKUP(F394,ClassCategories!$A$2:$B$42,2,0)","v":"English"},"Sanders","Gerald",10,"ENGLISH 3",909,"Albert, Edward","F","Eligibility","Quarter 1",36.700000000000003,4,1,999999999]
["Sanders Gerald",{"$f":"VLOOKUP(F395,ClassCategories!$A$2:$B$42,2,0)","v":"Elective"},"Sanders","Gerald",10,"GERMAN 3",611,"Simon, Guadalupe","F","Eligibility","Quarter 1",49.44,7,1,999999999]
["Savage Stacy",{"$f":"VLOOKUP(F396,ClassCategories!$A$2:$B$42,2,0)","v":"Science"},"Savage","Stacy",10,"BIOLOGY 1",1407,"Schwartz, Charles","F","Eligibility","Quarter 1",53.36,3,1,999999999]
["Savage Tony",{"$f":"VLOOKUP(F397,ClassCategories!$A$2:$B$42,2,0)","v":"Social Studies"},"Savage","Tony",11,"AP US/AZ HIS",1531,"Shepard, Diana","F","Eligibility","Quarter 1",57.75,7,1,999999999]
["Schmidt Stacy",{"$f":"VLOOKUP(F398,ClassCategories!$A$2:$B$42,2,0)","v":"English"},"Schmidt","Stacy",9,"ENGLISH 1",903,"Burns, Whitney","F","Eligibility","Quarter 1",26.83,1,1,999999999]
["Sears Jeff",{"$f":"VLOOKUP(F399,ClassCategories!$A$2:$B$42,2,0)","v":"Social Studies"},"Sears","Jeff",11,"US/AZ HIS 1",1529,"Mccormick, Carla","F","Eligibility","Quarter 1",56.05,7,1,999999999]
["Serrano Johnny",{"$f":"VLOOKUP(F400,ClassCategories!$A$2:$B$42,2,0)","v":"English"},"Serrano","Johnny",11,"Honors English 5",943,"Mcleod, Ada","F","Eligibility","Quarter 1",50.14,2,1,999999999]
["Sexton Emma",{"$f":"VLOOKUP(F401,ClassCategories!$A$2:$B$42,2,0)","v":"Math"},"Sexton","Emma",10,"Geometry Sem 1",1131,"Ortega, Alma","F","Eligibility","Quarter 1",52.4,2,1,999999999]
["Shaffer Joshua",{"$f":"VLOOKUP(F402,ClassCategories!$A$2:$B$42,2,0)","v":"Social Studies"},"Shaffer","Joshua",11,"US/AZ HIS 1",1529,"Mccormick, Carla","F","Eligibility","Quarter 1",42.44,5,1,999999999]
["Shaffer Norman",{"$f":"VLOOKUP(F403,ClassCategories!$A$2:$B$42,2,0)","v":"Social Studies"},"Shaffer","Norman",11,"US/AZ HIS 1",1529,"Espinoza, Adam","F","Eligibility","Quarter 1",33.75,5,1,999999999]
["Shelton Justin",{"$f":"VLOOKUP(F404,ClassCategories!$A$2:$B$42,2,0)","v":"Math"},"Shelton","Justin",10,"Geometry Sem 1",1131,"Ortega, Alma","F","Eligibility","Quarter 1",56.92,3,1,999999999]
["Shelton Sandra",{"$f":"VLOOKUP(F405,ClassCategories!$A$2:$B$42,2,0)","v":"Math"},"Shelton","Sandra",9,"Algebra 1 Sem 1",1119,"Barrera, Melanie","F","Eligibility","Quarter 1",59.09,1,1,999999999]
["Shepard Sandy",{"$f":"VLOOKUP(F406,ClassCategories!$A$2:$B$42,2,0)","v":"English"},"Shepard","Sandy",10,"ENGLISH 3",909,"Weiss, Gwendolyn","F","Eligibility","Quarter 1",36.590000000000003,2,1,999999999]
["Sheppard Judith",{"$f":"VLOOKUP(F407,ClassCategories!$A$2:$B$42,2,0)","v":"English"},"Sheppard","Judith",10,"Honors English 3",941,"Sawyer, Jeff","F","Eligibility","Quarter 1",47.88,4,1,999999999]
["Silva Jack",{"$f":"VLOOKUP(F408,ClassCategories!$A$2:$B$42,2,0)","v":"Social Studies"},"Silva","Jack",11,"US/AZ HIS 1",1529,"Torres, Carl","F","Eligibility","Quarter 1",37.82,1,1,999999999]
["Silva Lawrence",{"$f":"VLOOKUP(F409,ClassCategories!$A$2:$B$42,2,0)","v":"Math"},"Silva","Lawrence",11,"Algebra 2 Sem 1",1177,"Talley, Eugene","F","Eligibility","Quarter 1",48.2,7,1,999999999]
["Silva Victor",{"$f":"VLOOKUP(F410,ClassCategories!$A$2:$B$42,2,0)","v":"Math"},"Silva","Victor",10,"Algebra 1 Sem 2",3119,"Gallegos, Brandy","F","Eligibility","Quarter 1",45.37,1,1,999999999]
["Silva Victor",{"$f":"VLOOKUP(F411,ClassCategories!$A$2:$B$42,2,0)","v":"English"},"Silva","Victor",10,"Honors English 3",941,"Hobbs, Pearl","F","Eligibility","Quarter 1",35.44,2,1,999999999]
["Silva Victor",{"$f":"VLOOKUP(F412,ClassCategories!$A$2:$B$42,2,0)","v":"Elective"},"Silva","Victor",10,"JAPANESE 1",645,"Carney, Shelly","F","Eligibility","Quarter 1",57.28,3,1,999999999]
["Singleton Grace",{"$f":"VLOOKUP(F413,ClassCategories!$A$2:$B$42,2,0)","v":"English"},"Singleton","Grace",10,"ENGLISH 3",909,"Ray, Stacy","F","Eligibility","Quarter 1",46.83,6,1,999999999]
["Sloan Teresa",{"$f":"VLOOKUP(F414,ClassCategories!$A$2:$B$42,2,0)","v":"Social Studies"},"Sloan","Teresa",11,"US/AZ HIS 1",1529,"Torres, Carl","F","Eligibility","Quarter 1",44.6,2,1,999999999]
["Spencer Nathan",{"$f":"VLOOKUP(F415,ClassCategories!$A$2:$B$42,2,0)","v":"Math"},"Spencer","Nathan",10,"Algebra 1 Sem 1",1119,"Barrera, Melanie","F","Eligibility","Quarter 1",18,6,1,999999999]
["Stevens Brian",{"$f":"VLOOKUP(F416,ClassCategories!$A$2:$B$42,2,0)","v":"English"},"Stevens","Brian",9,"ENGLISH 1",903,"Burns, Whitney","F","Eligibility","Quarter 1",50.82,2,1,999999999]
["Stevenson Gloria",{"$f":"VLOOKUP(F417,ClassCategories!$A$2:$B$42,2,0)","v":"Math"},"Stevenson","Gloria",10,"Geometry Sem 1",1131,"Barrera, Melanie","F","Eligibility","Quarter 1",53.51,5,1,999999999]
["Stout Shelly",{"$f":"VLOOKUP(F418,ClassCategories!$A$2:$B$42,2,0)","v":"Math"},"Stout","Shelly",11,"Algebra 2 Sem 1",1177,"Gould, George","F","Eligibility","Quarter 1",52,6,1,999999999]
["Strickland John",{"$f":"VLOOKUP(F419,ClassCategories!$A$2:$B$42,2,0)","v":"Elective"},"Strickland","John",11,"PHOTO 1",435,"Bartlett, Lucy","F","Eligibility","Quarter 1",44.44,1,1,999999999]
["Stuart Jeremy",{"$f":"VLOOKUP(F420,ClassCategories!$A$2:$B$42,2,0)","v":"Elective"},"Stuart","Jeremy",9,"Business Technology 1",541,"Richmond, Elsie","F","Eligibility","Quarter 1",54,6,1,999999999]
["Summers Melissa",{"$f":"VLOOKUP(F421,ClassCategories!$A$2:$B$42,2,0)","v":"Math"},"Summers","Melissa",9,"Algebra 1 Sem 1",1119,"Barrera, Melanie","F","Eligibility","Quarter 1",22.51,1,1,999999999]
["Swanson Ada",{"$f":"VLOOKUP(F422,ClassCategories!$A$2:$B$42,2,0)","v":"English"},"Swanson","Ada",10,"Honors English 3",941,"Hobbs, Pearl","F","Eligibility","Quarter 1",53.02,3,1,999999999]
["Sykes Kevin",{"$f":"VLOOKUP(F423,ClassCategories!$A$2:$B$42,2,0)","v":"Elective"},"Sykes","Kevin",9,"BEGIN GUITAR",1219,"Beach, Kristina","F","Eligibility","Quarter 1",55.47,3,1,999999999]
["Tanner Kenneth",{"$f":"VLOOKUP(F424,ClassCategories!$A$2:$B$42,2,0)","v":"English"},"Tanner","Kenneth",11,"Honors English 5",943,"Fisher, Sylvia","F","Eligibility","Quarter 1",42.95,3,1,999999999]
["Thompson Jerry",{"$f":"VLOOKUP(F425,ClassCategories!$A$2:$B$42,2,0)","v":"Math"},"Thompson","Jerry",10,"Geometry Sem 1",1131,"Ortega, Alma","F","Eligibility","Quarter 1",7.96,1,1,999999999]
["Thornton Rodney",{"$f":"VLOOKUP(F426,ClassCategories!$A$2:$B$42,2,0)","v":"Social Studies"},"Thornton","Rodney",11,"AP US/AZ HIS",1531,"Shepard, Diana","F","Eligibility","Quarter 1",58.82,6,1,999999999]
["Torres Nellie",{"$f":"VLOOKUP(F427,ClassCategories!$A$2:$B$42,2,0)","v":"Social Studies"},"Torres","Nellie",11,"US/AZ HIS 1",1529,"Mccormick, Carla","F","Eligibility","Quarter 1",0,5,1,999999999]
["Travis Nancy",{"$f":"VLOOKUP(F428,ClassCategories!$A$2:$B$42,2,0)","v":"Science"},"Travis","Nancy",10,"BIOLOGY 1",1407,"Kaufman, Philip","F","Eligibility","Quarter 1",54.44,6,1,999999999]
["Valencia Curtis",{"$f":"VLOOKUP(F429,ClassCategories!$A$2:$B$42,2,0)","v":"Math"},"Valencia","Curtis",9,"Algebra 1 Sem 1",1119,"James, Lola","F","Eligibility","Quarter 1",42.72,4,1,999999999]
["Vance Victoria",{"$f":"VLOOKUP(F430,ClassCategories!$A$2:$B$42,2,0)","v":"Social Studies"},"Vance","Victoria",11,"US/AZ HIS 1",1529,"Mccormick, Carla","F","Eligibility","Quarter 1",58.85,7,1,999999999]
["Vance Victoria",{"$f":"VLOOKUP(F431,ClassCategories!$A$2:$B$42,2,0)","v":"Social Studies"},"Vance","Victoria",11,"W HIS/AZ G1",1541,"Wooten, Joshua","F","Eligibility","Quarter 1",19.66,1,1,999999999]
["Vang Glenn",{"$f":"VLOOKUP(F432,ClassCategories!$A$2:$B$42,2,0)","v":"Social Studies"},"Vang","Glenn",10,"W HIS/AZ G1",1541,"Wooten, Joshua","F","Eligibility","Quarter 1",49.56,2,1,999999999]
["Vega Catherine",{"$f":"VLOOKUP(F433,ClassCategories!$A$2:$B$42,2,0)","v":"Math"},"Vega","Catherine",11,"Algebra 2 Sem 1",1177,"Talley, Eugene","F","Eligibility","Quarter 1",56.8,6,1,999999999]
["Vega Catherine",{"$f":"VLOOKUP(F434,ClassCategories!$A$2:$B$42,2,0)","v":"Social Studies"},"Vega","Catherine",11,"US/AZ HIS 1",1529,"Torres, Carl","F","Eligibility","Quarter 1",44.07,1,1,999999999]
["Velazquez Benjamin",{"$f":"VLOOKUP(F435,ClassCategories!$A$2:$B$42,2,0)","v":"Science"},"Velazquez","Benjamin",11,"CHEMISTRY 1",1413,"Spence, Marlene","F","Eligibility","Quarter 1",49.19,1,1,999999999]
["Waller Ann",{"$f":"VLOOKUP(F436,ClassCategories!$A$2:$B$42,2,0)","v":"Math"},"Waller","Ann",9,"Algebra 1 Sem 1",1119,"Curtis, Billie","F","Eligibility","Quarter 1",32.6,5,1,999999999]
["Waller Ann",{"$f":"VLOOKUP(F437,ClassCategories!$A$2:$B$42,2,0)","v":"Phys Ed"},"Waller","Ann",9,"PHYS ED 1G",1305,"Nelson, Sheila","F","Eligibility","Quarter 1",48.75,2,1,999999999]
["Waller Ann",{"$f":"VLOOKUP(F438,ClassCategories!$A$2:$B$42,2,0)","v":"Science"},"Waller","Ann",9,"T SCIENCE 1",1429,"Kaufman, Philip","F","Eligibility","Quarter 1",52.26,7,1,999999999]
["Waller Benjamin",{"$f":"VLOOKUP(F439,ClassCategories!$A$2:$B$42,2,0)","v":"Science"},"Waller","Benjamin",10,"BIOLOGY 1",1407,"Kaufman, Philip","F","Eligibility","Quarter 1",52.5,6,1,999999999]
["Waller Benjamin",{"$f":"VLOOKUP(F440,ClassCategories!$A$2:$B$42,2,0)","v":"English"},"Waller","Benjamin",10,"ENGLISH 3",909,"Weiss, Gwendolyn","F","Eligibility","Quarter 1",50.94,2,1,999999999]
["Walls Eugene",{"$f":"VLOOKUP(F441,ClassCategories!$A$2:$B$42,2,0)","v":"Science"},"Walls","Eugene",9,"T SCIENCE 1",1429,"Kaufman, Philip","F","Eligibility","Quarter 1",55.68,7,1,999999999]
["Walter Thelma",{"$f":"VLOOKUP(F442,ClassCategories!$A$2:$B$42,2,0)","v":"Math"},"Walter","Thelma",10,"Geometry Sem 1",1131,"Ortega, Alma","F","Eligibility","Quarter 1",58.67,3,1,999999999]
["Walters Constance",{"$f":"VLOOKUP(F443,ClassCategories!$A$2:$B$42,2,0)","v":"Math"},"Walters","Constance",11,"Algebra 2 Sem 1",1177,"Talley, Eugene","F","Eligibility","Quarter 1",8.18,7,1,999999999]
["Walters Constance",{"$f":"VLOOKUP(F444,ClassCategories!$A$2:$B$42,2,0)","v":"Social Studies"},"Walters","Constance",11,"US/AZ HIS 1",1529,"Espinoza, Adam","F","Eligibility","Quarter 1",56.26,6,1,999999999]
["Washington Jo",{"$f":"VLOOKUP(F445,ClassCategories!$A$2:$B$42,2,0)","v":"Math"},"Washington","Jo",9,"Algebra 1 Sem 1",1119,"Curtis, Billie","F","Eligibility","Quarter 1",19.53,5,1,999999999]
["Welch Alfred",{"$f":"VLOOKUP(F446,ClassCategories!$A$2:$B$42,2,0)","v":"Math"},"Welch","Alfred",11,"Algebra 2 Sem 1",1177,"Talley, Eugene","F","Eligibility","Quarter 1",56.8,7,1,999999999]
["Wheeler James",{"$f":"VLOOKUP(F447,ClassCategories!$A$2:$B$42,2,0)","v":"English"},"Wheeler","James",11,"ENGLISH 3",909,"Weiss, Gwendolyn","F","Eligibility","Quarter 1",49.81,2,1,999999999]
["Whitaker Steven",{"$f":"VLOOKUP(F448,ClassCategories!$A$2:$B$42,2,0)","v":"English"},"Whitaker","Steven",10,"ENGLISH 3",909,"Weiss, Gwendolyn","F","Eligibility","Quarter 1",57.3,1,1,999999999]
["Whitfield Tracey",{"$f":"VLOOKUP(F449,ClassCategories!$A$2:$B$42,2,0)","v":"Social Studies"},"Whitfield","Tracey",11,"US/AZ HIS 1",1529,"Torres, Carl","F","Eligibility","Quarter 1",48.24,2,1,999999999]
["Whitley April",{"$f":"VLOOKUP(F450,ClassCategories!$A$2:$B$42,2,0)","v":"Math"},"Whitley","April",9,"Algebra 1 Sem 1",1119,"Curtis, Billie","F","Eligibility","Quarter 1",32.270000000000003,7,1,999999999]
["Whitney Victor",{"$f":"VLOOKUP(F451,ClassCategories!$A$2:$B$42,2,0)","v":"English"},"Whitney","Victor",11,"ENGLISH 3",909,"Hobbs, Joann","F","Eligibility","Quarter 1",14.29,1,1,999999999]
["Whitney Victor",{"$f":"VLOOKUP(F452,ClassCategories!$A$2:$B$42,2,0)","v":"English"},"Whitney","Victor",11,"English Fundamentals 5",387,"England, Harry","F","Eligibility","Quarter 1",50.5,2,1,999999999]
[{"$f":"C453&\" \"&D453","v":"Whitney Victor"},{"$f":"VLOOKUP(F453,ClassCategories!$A$2:$B$42,2,0)","v":"Social Studies"},"Whitney","Victor",11,"US/AZ HIS 1",1529,"Espinoza, Adam","F","Eligibility","Quarter 1",25.1,3,1,999999999]
["Wilcox Veronica",{"$f":"VLOOKUP(F454,ClassCategories!$A$2:$B$42,2,0)","v":"Social Studies"},"Wilcox","Veronica",11,"US/AZ HIS 1",1529,"Mccormick, Carla","F","Eligibility","Quarter 1",18.920000000000002,7,1,999999999]
["Wilkins Ramona",{"$f":"VLOOKUP(F455,ClassCategories!$A$2:$B$42,2,0)","v":"Math"},"Wilkins","Ramona",11,"Geometry Sem 2",3133,"Lawson, Philip","F","Eligibility","Quarter 1",54.12,1,1,999999999]
["Wilkinson Melanie",{"$f":"VLOOKUP(F456,ClassCategories!$A$2:$B$42,2,0)","v":"English"},"Wilkinson","Melanie",11,"ENGLISH 5",915,"Sawyer, Jeff","F","Eligibility","Quarter 1",53.33,7,1,999999999]
["Wilkinson Melanie",{"$f":"VLOOKUP(F457,ClassCategories!$A$2:$B$42,2,0)","v":"Social Studies"},"Wilkinson","Melanie",11,"US/AZ HIS 1",1529,"Torres, Carl","F","Eligibility","Quarter 1",58.51,4,1,999999999]
["Wilson Gary",{"$f":"VLOOKUP(F458,ClassCategories!$A$2:$B$42,2,0)","v":"Social Studies"},"Wilson","Gary",11,"US/AZ HIS 1",1529,"Torres, Carl","F","Eligibility","Quarter 1",54.42,4,1,999999999]
["Wilson Sean",{"$f":"VLOOKUP(F459,ClassCategories!$A$2:$B$42,2,0)","v":"Math"},"Wilson","Sean",11,"Geometry Sem 1",1131,"Ortega, Alma","F","Eligibility","Quarter 1",42.65,1,1,999999999]
["Wilson Sean",{"$f":"VLOOKUP(F460,ClassCategories!$A$2:$B$42,2,0)","v":"Social Studies"},"Wilson","Sean",11,"US/AZ HIS 1",1529,"Torres, Carl","F","Eligibility","Quarter 1",56.23,2,1,999999999]
["Wood Todd",{"$f":"VLOOKUP(F461,ClassCategories!$A$2:$B$42,2,0)","v":"Math"},"Wood","Todd",9,"Algebra 1 Sem 1",1119,"Gould, George","F","Eligibility","Quarter 1",29.92,7,1,999999999]
["Woodard Jeffrey",{"$f":"VLOOKUP(F462,ClassCategories!$A$2:$B$42,2,0)","v":"Social Studies"},"Woodard","Jeffrey",11,"US/AZ HIS 1",1529,"Torres, Carl","F","Eligibility","Quarter 1",44.44,1,1,999999999]
["Wyatt Elsie",{"$f":"VLOOKUP(F463,ClassCategories!$A$2:$B$42,2,0)","v":"Math"},"Wyatt","Elsie",9,"Algebra 1 Sem 1",1119,"Curtis, Billie","F","Eligibility","Quarter 1",48.85,7,1,999999999]
["Wynn Ada",{"$f":"VLOOKUP(F464,ClassCategories!$A$2:$B$42,2,0)","v":"Social Studies"},"Wynn","Ada",10,"US/AZ HIS 1",1529,"Torres, Carl","F","Eligibility","Quarter 1",35.07,4,1,999999999]

{"sheet":"Final","index":2,"n_rows":496,"n_cols":13,"rows_kept":496,"cut":false,"hidden":false,"merged":[]}
["Last","First","English Fail","Math Fail","Science Fail","SocStuFail","PE Fail","PE Teacher","Elective 1","Elective 1 Te","Elective 2","Elective 2 Teac","SE Cat"]
[{"$f":"Failing_Kids!C4","v":"Abbott"},{"$f":"Failing_Kids!D4","v":"Howard"},{"$f":"IF(ISERROR(SEARCH(\"*English*\",Failing_Kids!F4,1)),IF(ISERROR(SEARCH(\"*Literacy*\",Failing_Kids!F4,1)),\"\",\"X\"),\"X\")","v":"X"},{"$f":"IF(ISERROR(SEARCH(\"*Geometry*\",Failing_Kids!$F4,1)),IF(ISERROR(SEARCH(\"*Math*\",Failing_Kids!$F4,1)),IF(ISERROR(SEARCH(\"*Calc*\",Failing_Kids!$F4,1)),IF(ISERROR(SEARCH(\"*Algebra*\",Failing_Kids!$F4,1)),\"\",\"X\"),\"X\"),\"X\"),\"X\")","v":""},{"$f":"IF(ISERROR(SEARCH(\"*Science*\",Failing_Kids!$F4,1)),IF(ISERROR(SEARCH(\"*Bio*\",Failing_Kids!$F4,1)),IF(ISERROR(SEARCH(\"*Chem*\",Failing_Kids!$F4,1)),IF(ISERROR(SEARCH(\"*Physics*\",Failing_Kids!$F4,1)),\"\",\"X\"),\"X\"),\"X\"),\"X\")","v":""},{"$f":"IF(ISERROR(SEARCH(\"*His*\",Failing_Kids!$F4,1)),IF(ISERROR(SEARCH(\"*GOV*\",Failing_Kids!$F4,1)),IF(ISERROR(SEARCH(\"*Econ*\",Failing_Kids!$F4,1)),IF(ISERROR(SEARCH(\"*Soc*\",Failing_Kids!$F4,1)),\"\",\"X\"),\"X\"),\"X\"),\"X\")","v":""},{"$f":"IF(ISERROR(SEARCH(\"*PE*\",Failing_Kids!$F4,1)),\"\",\"X\")","v":""},null,{"$f":"IF(ISERROR(SEARCH(\"*Design*\",Failing_Kids!$F4,1)),IF(ISERROR(SEARCH(\"*Account*\",Failing_Kids!$F4,1)),IF(ISERROR(SEARCH(\"*Art*\",Failing_Kids!$F4,1)),IF(ISERROR(SEARCH(\"*Band*\",Failing_Kids!$F4,1)),IF(ISERROR(SEARCH(\"*Dance*\",Failing_Kids!$F4,1)),IF(ISERROR(SEARCH(\"*Education*\",Failing_Kids!F$4,1)),\"\",\"X\"),\"X\"),\"X\"),\"X\"),\"X\"),\"X\")","v":""}]
[{"$f":"Failing_Kids!C5","v":"Aguilar"},{"$f":"Failing_Kids!D5","v":"Carlos"},{"$f":"IF(ISERROR(SEARCH(\"*English*\",Failing_Kids!F5,1)),\"\",\"X \")","v":""},{"$f":"IF(ISERROR(SEARCH(\"*Geometry*\",Failing_Kids!$F5,1)),IF(ISERROR(SEARCH(\"*Math*\",Failing_Kids!$F5,1)),IF(ISERROR(SEARCH(\"*Calc*\",Failing_Kids!$F5,1)),IF(ISERROR(SEARCH(\"*Algebra*\",Failing_Kids!$F5,1)),\"\",\"X\"),\"X\"),\"X\"),\"X\")","v":"X"},{"$f":"IF(ISERROR(SEARCH(\"*Science*\",Failing_Kids!$F5,1)),IF(ISERROR(SEARCH(\"*Bio*\",Failing_Kids!$F5,1)),IF(ISERROR(SEARCH(\"*Chem*\",Failing_Kids!$F5,1)),IF(ISERROR(SEARCH(\"*Physics*\",Failing_Kids!$F5,1)),\"\",\"X\"),\"X\"),\"X\"),\"X\")","v":""},{"$f":"IF(ISERROR(SEARCH(\"*His*\",Failing_Kids!$F5,1)),IF(ISERROR(SEARCH(\"*GOV*\",Failing_Kids!$F5,1)),IF(ISERROR(SEARCH(\"*Econ*\",Failing_Kids!$F5,1)),IF(ISERROR(SEARCH(\"*Soc*\",Failing_Kids!$F5,1)),\"\",\"X\"),\"X\"),\"X\"),\"X\")","v":""},{"$f":"IF(ISERROR(SEARCH(\"*PE*\",Failing_Kids!$F5,1)),\"\",\"X\")","v":""}]
[{"$f":"Failing_Kids!C6","v":"Aguilar"},{"$f":"Failing_Kids!D6","v":"Carlos"},{"$f":"IF(ISERROR(SEARCH(\"*English*\",Failing_Kids!F6,1)),\"\",\"X \")","v":""},{"$f":"IF(ISERROR(SEARCH(\"*Geometry*\",Failing_Kids!$F6,1)),IF(ISERROR(SEARCH(\"*Math*\",Failing_Kids!$F6,1)),IF(ISERROR(SEARCH(\"*Calc*\",Failing_Kids!$F6,1)),IF(ISERROR(SEARCH(\"*Algebra*\",Failing_Kids!$F6,1)),\"\",\"X\"),\"X\"),\"X\"),\"X\")","v":""},{"$f":"IF(ISERROR(SEARCH(\"*Science*\",Failing_Kids!$F6,1)),IF(ISERROR(SEARCH(\"*Bio*\",Failing_Kids!$F6,1)),IF(ISERROR(SEARCH(\"*Chem*\",Failing_Kids!$F6,1)),IF(ISERROR(SEARCH(\"*Physics*\",Failing_Kids!$F6,1)),\"\",\"X\"),\"X\"),\"X\"),\"X\")","v":""},{"$f":"IF(ISERROR(SEARCH(\"*His*\",Failing_Kids!$F6,1)),IF(ISERROR(SEARCH(\"*GOV*\",Failing_Kids!$F6,1)),IF(ISERROR(SEARCH(\"*Econ*\",Failing_Kids!$F6,1)),IF(ISERROR(SEARCH(\"*Soc*\",Failing_Kids!$F6,1)),\"\",\"X\"),\"X\"),\"X\"),\"X\")","v":"X"},{"$f":"IF(ISERROR(SEARCH(\"*PE*\",Failing_Kids!$F6,1)),\"\",\"X\")","v":""}]
[{"$f":"Failing_Kids!C7","v":"Albert"},{"$f":"Failing_Kids!D7","v":"Harry"},{"$f":"IF(ISERROR(SEARCH(\"*English*\",Failing_Kids!F7,1)),\"\",\"X \")","v":""},{"$f":"IF(ISERROR(SEARCH(\"*Geometry*\",Failing_Kids!$F7,1)),IF(ISERROR(SEARCH(\"*Math*\",Failing_Kids!$F7,1)),IF(ISERROR(SEARCH(\"*Calc*\",Failing_Kids!$F7,1)),IF(ISERROR(SEARCH(\"*Algebra*\",Failing_Kids!$F7,1)),\"\",\"X\"),\"X\"),\"X\"),\"X\")","v":""},{"$f":"IF(ISERROR(SEARCH(\"*Science*\",Failing_Kids!$F7,1)),IF(ISERROR(SEARCH(\"*Bio*\",Failing_Kids!$F7,1)),IF(ISERROR(SEARCH(\"*Chem*\",Failing_Kids!$F7,1)),IF(ISERROR(SEARCH(\"*Physics*\",Failing_Kids!$F7,1)),\"\",\"X\"),\"X\"),\"X\"),\"X\")","v":""},{"$f":"IF(ISERROR(SEARCH(\"*His*\",Failing_Kids!$F7,1)),IF(ISERROR(SEARCH(\"*GOV*\",Failing_Kids!$F7,1)),IF(ISERROR(SEARCH(\"*Econ*\",Failing_Kids!$F7,1)),IF(ISERROR(SEARCH(\"*Soc*\",Failing_Kids!$F7,1)),\"\",\"X\"),\"X\"),\"X\"),\"X\")","v":"X"},{"$f":"IF(ISERROR(SEARCH(\"*PE*\",Failing_Kids!$F7,1)),\"\",\"X\")","v":""}]
[{"$f":"Failing_Kids!C8","v":"Allen"},{"$f":"Failing_Kids!D8","v":"Alfred"},{"$f":"IF(ISERROR(SEARCH(\"*English*\",Failing_Kids!F8,1)),\"\",\"X \")","v":""},{"$f":"IF(ISERROR(SEARCH(\"*Geometry*\",Failing_Kids!$F8,1)),IF(ISERROR(SEARCH(\"*Math*\",Failing_Kids!$F8,1)),IF(ISERROR(SEARCH(\"*Calc*\",Failing_Kids!$F8,1)),IF(ISERROR(SEARCH(\"*Algebra*\",Failing_Kids!$F8,1)),\"\",\"X\"),\"X\"),\"X\"),\"X\")","v":"X"},{"$f":"IF(ISERROR(SEARCH(\"*Science*\",Failing_Kids!$F8,1)),IF(ISERROR(SEARCH(\"*Bio*\",Failing_Kids!$F8,1)),IF(ISERROR(SEARCH(\"*Chem*\",Failing_Kids!$F8,1)),IF(ISERROR(SEARCH(\"*Physics*\",Failing_Kids!$F8,1)),\"\",\"X\"),\"X\"),\"X\"),\"X\")","v":""},{"$f":"IF(ISERROR(SEARCH(\"*His*\",Failing_Kids!$F8,1)),IF(ISERROR(SEARCH(\"*GOV*\",Failing_Kids!$F8,1)),IF(ISERROR(SEARCH(\"*Econ*\",Failing_Kids!$F8,1)),IF(ISERROR(SEARCH(\"*Soc*\",Failing_Kids!$F8,1)),\"\",\"X\"),\"X\"),\"X\"),\"X\")","v":""},{"$f":"IF(ISERROR(SEARCH(\"*PE*\",Failing_Kids!$F8,1)),\"\",\"X\")","v":""}]
[{"$f":"Failing_Kids!C9","v":"Allison"},{"$f":"Failing_Kids!D9","v":"Samuel"},{"$f":"IF(ISERROR(SEARCH(\"*English*\",Failing_Kids!F9,1)),\"\",\"X \")","v":"X "},{"$f":"IF(ISERROR(SEARCH(\"*Geometry*\",Failing_Kids!$F9,1)),IF(ISERROR(SEARCH(\"*Math*\",Failing_Kids!$F9,1)),IF(ISERROR(SEARCH(\"*Calc*\",Failing_Kids!$F9,1)),IF(ISERROR(SEARCH(\"*Algebra*\",Failing_Kids!$F9,1)),\"\",\"X\"),\"X\"),\"X\"),\"X\")","v":""},{"$f":"IF(ISERROR(SEARCH(\"*Science*\",Failing_Kids!$F9,1)),IF(ISERROR(SEARCH(\"*Bio*\",Failing_Kids!$F9,1)),IF(ISERROR(SEARCH(\"*Chem*\",Failing_Kids!$F9,1)),IF(ISERROR(SEARCH(\"*Physics*\",Failing_Kids!$F9,1)),\"\",\"X\"),\"X\"),\"X\"),\"X\")","v":""},{"$f":"IF(ISERROR(SEARCH(\"*His*\",Failing_Kids!$F9,1)),IF(ISERROR(SEARCH(\"*GOV*\",Failing_Kids!$F9,1)),IF(ISERROR(SEARCH(\"*Econ*\",Failing_Kids!$F9,1)),IF(ISERROR(SEARCH(\"*Soc*\",Failing_Kids!$F9,1)),\"\",\"X\"),\"X\"),\"X\"),\"X\")","v":""},{"$f":"IF(ISERROR(SEARCH(\"*PE*\",Failing_Kids!$F9,1)),\"\",\"X\")","v":""}]
[{"$f":"Failing_Kids!C10","v":"Allison"},{"$f":"Failing_Kids!D10","v":"Samuel"},{"$f":"IF(ISERROR(SEARCH(\"*English*\",Failing_Kids!F10,1)),\"\",\"X \")","v":""},{"$f":"IF(ISERROR(SEARCH(\"*Geometry*\",Failing_Kids!$F10,1)),IF(ISERROR(SEARCH(\"*Math*\",Failing_Kids!$F10,1)),IF(ISERROR(SEARCH(\"*Calc*\",Failing_Kids!$F10,1)),IF(ISERROR(SEARCH(\"*Algebra*\",Failing_Kids!$F10,1)),\"\",\"X\"),\"X\"),\"X\"),\"X\")","v":"X"},{"$f":"IF(ISERROR(SEARCH(\"*Science*\",Failing_Kids!$F10,1)),IF(ISERROR(SEARCH(\"*Bio*\",Failing_Kids!$F10,1)),IF(ISERROR(SEARCH(\"*Chem*\",Failing_Kids!$F10,1)),IF(ISERROR(SEARCH(\"*Physics*\",Failing_Kids!$F10,1)),\"\",\"X\"),\"X\"),\"X\"),\"X\")","v":""},{"$f":"IF(ISERROR(SEARCH(\"*His*\",Failing_Kids!$F10,1)),IF(ISERROR(SEARCH(\"*GOV*\",Failing_Kids!$F10,1)),IF(ISERROR(SEARCH(\"*Econ*\",Failing_Kids!$F10,1)),IF(ISERROR(SEARCH(\"*Soc*\",Failing_Kids!$F10,1)),\"\",\"X\"),\"X\"),\"X\"),\"X\")","v":""},{"$f":"IF(ISERROR(SEARCH(\"*PE*\",Failing_Kids!$F10,1)),\"\",\"X\")","v":""}]
[{"$f":"Failing_Kids!C11","v":"Alvarado"},{"$f":"Failing_Kids!D11","v":"Kristin"},{"$f":"IF(ISERROR(SEARCH(\"*English*\",Failing_Kids!F11,1)),\"\",\"X \")","v":""},{"$f":"IF(ISERROR(SEARCH(\"*Geometry*\",Failing_Kids!$F11,1)),IF(ISERROR(SEARCH(\"*Math*\",Failing_Kids!$F11,1)),IF(ISERROR(SEARCH(\"*Calc*\",Failing_Kids!$F11,1)),IF(ISERROR(SEARCH(\"*Algebra*\",Failing_Kids!$F11,1)),\"\",\"X\"),\"X\"),\"X\"),\"X\")","v":"X"},{"$f":"IF(ISERROR(SEARCH(\"*Science*\",Failing_Kids!$F11,1)),IF(ISERROR(SEARCH(\"*Bio*\",Failing_Kids!$F11,1)),IF(ISERROR(SEARCH(\"*Chem*\",Failing_Kids!$F11,1)),IF(ISERROR(SEARCH(\"*Physics*\",Failing_Kids!$F11,1)),\"\",\"X\"),\"X\"),\"X\"),\"X\")","v":""},{"$f":"IF(ISERROR(SEARCH(\"*His*\",Failing_Kids!$F11,1)),IF(ISERROR(SEARCH(\"*GOV*\",Failing_Kids!$F11,1)),IF(ISERROR(SEARCH(\"*Econ*\",Failing_Kids!$F11,1)),IF(ISERROR(SEARCH(\"*Soc*\",Failing_Kids!$F11,1)),\"\",\"X\"),\"X\"),\"X\"),\"X\")","v":""},{"$f":"IF(ISERROR(SEARCH(\"*PE*\",Failing_Kids!$F11,1)),\"\",\"X\")","v":""}]
[{"$f":"Failing_Kids!C12","v":"Armstrong"},{"$f":"Failing_Kids!D12","v":"Joanna"},{"$f":"IF(ISERROR(SEARCH(\"*English*\",Failing_Kids!F12,1)),\"\",\"X \")","v":""},{"$f":"IF(ISERROR(SEARCH(\"*Geometry*\",Failing_Kids!$F12,1)),IF(ISERROR(SEARCH(\"*Math*\",Failing_Kids!$F12,1)),IF(ISERROR(SEARCH(\"*Calc*\",Failing_Kids!$F12,1)),IF(ISERROR(SEARCH(\"*Algebra*\",Failing_Kids!$F12,1)),\"\",\"X\"),\"X\"),\"X\"),\"X\")","v":"X"},{"$f":"IF(ISERROR(SEARCH(\"*Science*\",Failing_Kids!$F12,1)),IF(ISERROR(SEARCH(\"*Bio*\",Failing_Kids!$F12,1)),IF(ISERROR(SEARCH(\"*Chem*\",Failing_Kids!$F12,1)),IF(ISERROR(SEARCH(\"*Physics*\",Failing_Kids!$F12,1)),\"\",\"X\"),\"X\"),\"X\"),\"X\")","v":""},{"$f":"IF(ISERROR(SEARCH(\"*His*\",Failing_Kids!$F12,1)),IF(ISERROR(SEARCH(\"*GOV*\",Failing_Kids!$F12,1)),IF(ISERROR(SEARCH(\"*Econ*\",Failing_Kids!$F12,1)),IF(ISERROR(SEARCH(\"*Soc*\",Failing_Kids!$F12,1)),\"\",\"X\"),\"X\"),\"X\"),\"X\")","v":""},{"$f":"IF(ISERROR(SEARCH(\"*PE*\",Failing_Kids!$F12,1)),\"\",\"X\")","v":""}]
[{"$f":"Failing_Kids!C13","v":"Armstrong"},{"$f":"Failing_Kids!D13","v":"Joanna"},{"$f":"IF(ISERROR(SEARCH(\"*English*\",Failing_Kids!F13,1)),\"\",\"X \")","v":"X "},{"$f":"IF(ISERROR(SEARCH(\"*Geometry*\",Failing_Kids!$F13,1)),IF(ISERROR(SEARCH(\"*Math*\",Failing_Kids!$F13,1)),IF(ISERROR(SEARCH(\"*Calc*\",Failing_Kids!$F13,1)),IF(ISERROR(SEARCH(\"*Algebra*\",Failing_Kids!$F13,1)),\"\",\"X\"),\"X\"),\"X\"),\"X\")","v":""},{"$f":"IF(ISERROR(SEARCH(\"*Science*\",Failing_Kids!$F13,1)),IF(ISERROR(SEARCH(\"*Bio*\",Failing_Kids!$F13,1)),IF(ISERROR(SEARCH(\"*Chem*\",Failing_Kids!$F13,1)),IF(ISERROR(SEARCH(\"*Physics*\",Failing_Kids!$F13,1)),\"\",\"X\"),\"X\"),\"X\"),\"X\")","v":""},{"$f":"IF(ISERROR(SEARCH(\"*His*\",Failing_Kids!$F13,1)),IF(ISERROR(SEARCH(\"*GOV*\",Failing_Kids!$F13,1)),IF(ISERROR(SEARCH(\"*Econ*\",Failing_Kids!$F13,1)),IF(ISERROR(SEARCH(\"*Soc*\",Failing_Kids!$F13,1)),\"\",\"X\"),\"X\"),\"X\"),\"X\")","v":""},{"$f":"IF(ISERROR(SEARCH(\"*PE*\",Failing_Kids!$F13,1)),\"\",\"X\")","v":""}]
[{"$f":"Failing_Kids!C14","v":"Armstrong"},{"$f":"Failing_Kids!D14","v":"Joanna"},{"$f":"IF(ISERROR(SEARCH(\"*English*\",Failing_Kids!F14,1)),\"\",\"X \")","v":""},{"$f":"IF(ISERROR(SEARCH(\"*Geometry*\",Failing_Kids!$F14,1)),IF(ISERROR(SEARCH(\"*Math*\",Failing_Kids!$F14,1)),IF(ISERROR(SEARCH(\"*Calc*\",Failing_Kids!$F14,1)),IF(ISERROR(SEARCH(\"*Algebra*\",Failing_Kids!$F14,1)),\"\",\"X\"),\"X\"),\"X\"),\"X\")","v":""},{"$f":"IF(ISERROR(SEARCH(\"*Science*\",Failing_Kids!$F14,1)),IF(ISERROR(SEARCH(\"*Bio*\",Failing_Kids!$F14,1)),IF(ISERROR(SEARCH(\"*Chem*\",Failing_Kids!$F14,1)),IF(ISERROR(SEARCH(\"*Physics*\",Failing_Kids!$F14,1)),\"\",\"X\"),\"X\"),\"X\"),\"X\")","v":""},{"$f":"IF(ISERROR(SEARCH(\"*His*\",Failing_Kids!$F14,1)),IF(ISERROR(SEARCH(\"*GOV*\",Failing_Kids!$F14,1)),IF(ISERROR(SEARCH(\"*Econ*\",Failing_Kids!$F14,1)),IF(ISERROR(SEARCH(\"*Soc*\",Failing_Kids!$F14,1)),\"\",\"X\"),\"X\"),\"X\"),\"X\")","v":""},{"$f":"IF(ISERROR(SEARCH(\"*PE*\",Failing_Kids!$F14,1)),\"\",\"X\")","v":""}]
[{"$f":"Failing_Kids!C15","v":"Armstrong"},{"$f":"Failing_Kids!D15","v":"Ronald"},{"$f":"IF(ISERROR(SEARCH(\"*English*\",Failing_Kids!F15,1)),\"\",\"X \")","v":"X "},{"$f":"IF(ISERROR(SEARCH(\"*Geometry*\",Failing_Kids!$F15,1)),IF(ISERROR(SEARCH(\"*Math*\",Failing_Kids!$F15,1)),IF(ISERROR(SEARCH(\"*Calc*\",Failing_Kids!$F15,1)),IF(ISERROR(SEARCH(\"*Algebra*\",Failing_Kids!$F15,1)),\"\",\"X\"),\"X\"),\"X\"),\"X\")","v":""},{"$f":"IF(ISERROR(SEARCH(\"*Science*\",Failing_Kids!$F15,1)),IF(ISERROR(SEARCH(\"*Bio*\",Failing_Kids!$F15,1)),IF(ISERROR(SEARCH(\"*Chem*\",Failing_Kids!$F15,1)),IF(ISERROR(SEARCH(\"*Physics*\",Failing_Kids!$F15,1)),\"\",\"X\"),\"X\"),\"X\"),\"X\")","v":""},{"$f":"IF(ISERROR(SEARCH(\"*His*\",Failing_Kids!$F15,1)),IF(ISERROR(SEARCH(\"*GOV*\",Failing_Kids!$F15,1)),IF(ISERROR(SEARCH(\"*Econ*\",Failing_Kids!$F15,1)),IF(ISERROR(SEARCH(\"*Soc*\",Failing_Kids!$F15,1)),\"\",\"X\"),\"X\"),\"X\"),\"X\")","v":""},{"$f":"IF(ISERROR(SEARCH(\"*PE*\",Failing_Kids!$F15,1)),\"\",\"X\")","v":""}]
[{"$f":"Failing_Kids!C16","v":"Arnold"},{"$f":"Failing_Kids!D16","v":"Fred"},{"$f":"IF(ISERROR(SEARCH(\"*English*\",Failing_Kids!F16,1)),\"\",\"X \")","v":""},{"$f":"IF(ISERROR(SEARCH(\"*Geometry*\",Failing_Kids!$F16,1)),IF(ISERROR(SEARCH(\"*Math*\",Failing_Kids!$F16,1)),IF(ISERROR(SEARCH(\"*Calc*\",Failing_Kids!$F16,1)),IF(ISERROR(SEARCH(\"*Algebra*\",Failing_Kids!$F16,1)),\"\",\"X\"),\"X\"),\"X\"),\"X\")","v":""},{"$f":"IF(ISERROR(SEARCH(\"*Science*\",Failing_Kids!$F16,1)),IF(ISERROR(SEARCH(\"*Bio*\",Failing_Kids!$F16,1)),IF(ISERROR(SEARCH(\"*Chem*\",Failing_Kids!$F16,1)),IF(ISERROR(SEARCH(\"*Physics*\",Failing_Kids!$F16,1)),\"\",\"X\"),\"X\"),\"X\"),\"X\")","v":""},{"$f":"IF(ISERROR(SEARCH(\"*His*\",Failing_Kids!$F16,1)),IF(ISERROR(SEARCH(\"*GOV*\",Failing_Kids!$F16,1)),IF(ISERROR(SEARCH(\"*Econ*\",Failing_Kids!$F16,1)),IF(ISERROR(SEARCH(\"*Soc*\",Failing_Kids!$F16,1)),\"\",\"X\"),\"X\"),\"X\"),\"X\")","v":""},{"$f":"IF(ISERROR(SEARCH(\"*PE*\",Failing_Kids!$F16,1)),\"\",\"X\")","v":""}]
[{"$f":"Failing_Kids!C17","v":"Atkins"},{"$f":"Failing_Kids!D17","v":"Glenn"},{"$f":"IF(ISERROR(SEARCH(\"*English*\",Failing_Kids!F17,1)),\"\",\"X \")","v":""},{"$f":"IF(ISERROR(SEARCH(\"*Geometry*\",Failing_Kids!$F17,1)),IF(ISERROR(SEARCH(\"*Math*\",Failing_Kids!$F17,1)),IF(ISERROR(SEARCH(\"*Calc*\",Failing_Kids!$F17,1)),IF(ISERROR(SEARCH(\"*Algebra*\",Failing_Kids!$F17,1)),\"\",\"X\"),\"X\"),\"X\"),\"X\")","v":""},{"$f":"IF(ISERROR(SEARCH(\"*Science*\",Failing_Kids!$F17,1)),IF(ISERROR(SEARCH(\"*Bio*\",Failing_Kids!$F17,1)),IF(ISERROR(SEARCH(\"*Chem*\",Failing_Kids!$F17,1)),IF(ISERROR(SEARCH(\"*Physics*\",Failing_Kids!$F17,1)),\"\",\"X\"),\"X\"),\"X\"),\"X\")","v":"X"},{"$f":"IF(ISERROR(SEARCH(\"*His*\",Failing_Kids!$F17,1)),IF(ISERROR(SEARCH(\"*GOV*\",Failing_Kids!$F17,1)),IF(ISERROR(SEARCH(\"*Econ*\",Failing_Kids!$F17,1)),IF(ISERROR(SEARCH(\"*Soc*\",Failing_Kids!$F17,1)),\"\",\"X\"),\"X\"),\"X\"),\"X\")","v":""},{"$f":"IF(ISERROR(SEARCH(\"*PE*\",Failing_Kids!$F17,1)),\"\",\"X\")","v":""}]
[{"$f":"Failing_Kids!C18","v":"Atkinson"},{"$f":"Failing_Kids!D18","v":"Phillip"},{"$f":"IF(ISERROR(SEARCH(\"*English*\",Failing_Kids!F18,1)),\"\",\"X \")","v":""},{"$f":"IF(ISERROR(SEARCH(\"*Geometry*\",Failing_Kids!$F18,1)),IF(ISERROR(SEARCH(\"*Math*\",Failing_Kids!$F18,1)),IF(ISERROR(SEARCH(\"*Calc*\",Failing_Kids!$F18,1)),IF(ISERROR(SEARCH(\"*Algebra*\",Failing_Kids!$F18,1)),\"\",\"X\"),\"X\"),\"X\"),\"X\")","v":"X"},{"$f":"IF(ISERROR(SEARCH(\"*Science*\",Failing_Kids!$F18,1)),IF(ISERROR(SEARCH(\"*Bio*\",Failing_Kids!$F18,1)),IF(ISERROR(SEARCH(\"*Chem*\",Failing_Kids!$F18,1)),IF(ISERROR(SEARCH(\"*Physics*\",Failing_Kids!$F18,1)),\"\",\"X\"),\"X\"),\"X\"),\"X\")","v":""},{"$f":"IF(ISERROR(SEARCH(\"*His*\",Failing_Kids!$F18,1)),IF(ISERROR(SEARCH(\"*GOV*\",Failing_Kids!$F18,1)),IF(ISERROR(SEARCH(\"*Econ*\",Failing_Kids!$F18,1)),IF(ISERROR(SEARCH(\"*Soc*\",Failing_Kids!$F18,1)),\"\",\"X\"),\"X\"),\"X\"),\"X\")","v":""},{"$f":"IF(ISERROR(SEARCH(\"*PE*\",Failing_Kids!$F18,1)),\"\",\"X\")","v":""}]
[{"$f":"Failing_Kids!C19","v":"Atkinson"},{"$f":"Failing_Kids!D19","v":"Phillip"},{"$f":"IF(ISERROR(SEARCH(\"*English*\",Failing_Kids!F19,1)),\"\",\"X \")","v":""},{"$f":"IF(ISERROR(SEARCH(\"*Geometry*\",Failing_Kids!$F19,1)),IF(ISERROR(SEARCH(\"*Math*\",Failing_Kids!$F19,1)),IF(ISERROR(SEARCH(\"*Calc*\",Failing_Kids!$F19,1)),IF(ISERROR(SEARCH(\"*Algebra*\",Failing_Kids!$F19,1)),\"\",\"X\"),\"X\"),\"X\"),\"X\")","v":""},{"$f":"IF(ISERROR(SEARCH(\"*Science*\",Failing_Kids!$F19,1)),IF(ISERROR(SEARCH(\"*Bio*\",Failing_Kids!$F19,1)),IF(ISERROR(SEARCH(\"*Chem*\",Failing_Kids!$F19,1)),IF(ISERROR(SEARCH(\"*Physics*\",Failing_Kids!$F19,1)),\"\",\"X\"),\"X\"),\"X\"),\"X\")","v":""},{"$f":"IF(ISERROR(SEARCH(\"*His*\",Failing_Kids!$F19,1)),IF(ISERROR(SEARCH(\"*GOV*\",Failing_Kids!$F19,1)),IF(ISERROR(SEARCH(\"*Econ*\",Failing_Kids!$F19,1)),IF(ISERROR(SEARCH(\"*Soc*\",Failing_Kids!$F19,1)),\"\",\"X\"),\"X\"),\"X\"),\"X\")","v":"X"},{"$f":"IF(ISERROR(SEARCH(\"*PE*\",Failing_Kids!$F19,1)),\"\",\"X\")","v":""}]
[{"$f":"Failing_Kids!C20","v":"Austin"},{"$f":"Failing_Kids!D20","v":"Yvette"},{"$f":"IF(ISERROR(SEARCH(\"*English*\",Failing_Kids!F20,1)),\"\",\"X \")","v":""},{"$f":"IF(ISERROR(SEARCH(\"*Geometry*\",Failing_Kids!$F20,1)),IF(ISERROR(SEARCH(\"*Math*\",Failing_Kids!$F20,1)),IF(ISERROR(SEARCH(\"*Calc*\",Failing_Kids!$F20,1)),IF(ISERROR(SEARCH(\"*Algebra*\",Failing_Kids!$F20,1)),\"\",\"X\"),\"X\"),\"X\"),\"X\")","v":"X"},{"$f":"IF(ISERROR(SEARCH(\"*Science*\",Failing_Kids!$F20,1)),IF(ISERROR(SEARCH(\"*Bio*\",Failing_Kids!$F20,1)),IF(ISERROR(SEARCH(\"*Chem*\",Failing_Kids!$F20,1)),IF(ISERROR(SEARCH(\"*Physics*\",Failing_Kids!$F20,1)),\"\",\"X\"),\"X\"),\"X\"),\"X\")","v":""},{"$f":"IF(ISERROR(SEARCH(\"*His*\",Failing_Kids!$F20,1)),IF(ISERROR(SEARCH(\"*GOV*\",Failing_Kids!$F20,1)),IF(ISERROR(SEARCH(\"*Econ*\",Failing_Kids!$F20,1)),IF(ISERROR(SEARCH(\"*Soc*\",Failing_Kids!$F20,1)),\"\",\"X\"),\"X\"),\"X\"),\"X\")","v":""},{"$f":"IF(ISERROR(SEARCH(\"*PE*\",Failing_Kids!$F20,1)),\"\",\"X\")","v":""}]
[{"$f":"Failing_Kids!C21","v":"Austin"},{"$f":"Failing_Kids!D21","v":"Yvette"},{"$f":"IF(ISERROR(SEARCH(\"*English*\",Failing_Kids!F21,1)),\"\",\"X \")","v":""},{"$f":"IF(ISERROR(SEARCH(\"*Geometry*\",Failing_Kids!$F21,1)),IF(ISERROR(SEARCH(\"*Math*\",Failing_Kids!$F21,1)),IF(ISERROR(SEARCH(\"*Calc*\",Failing_Kids!$F21,1)),IF(ISERROR(SEARCH(\"*Algebra*\",Failing_Kids!$F21,1)),\"\",\"X\"),\"X\"),\"X\"),\"X\")","v":""},{"$f":"IF(ISERROR(SEARCH(\"*Science*\",Failing_Kids!$F21,1)),IF(ISERROR(SEARCH(\"*Bio*\",Failing_Kids!$F21,1)),IF(ISERROR(SEARCH(\"*Chem*\",Failing_Kids!$F21,1)),IF(ISERROR(SEARCH(\"*Physics*\",Failing_Kids!$F21,1)),\"\",\"X\"),\"X\"),\"X\"),\"X\")","v":"X"},{"$f":"IF(ISERROR(SEARCH(\"*His*\",Failing_Kids!$F21,1)),IF(ISERROR(SEARCH(\"*GOV*\",Failing_Kids!$F21,1)),IF(ISERROR(SEARCH(\"*Econ*\",Failing_Kids!$F21,1)),IF(ISERROR(SEARCH(\"*Soc*\",Failing_Kids!$F21,1)),\"\",\"X\"),\"X\"),\"X\"),\"X\")","v":""},{"$f":"IF(ISERROR(SEARCH(\"*PE*\",Failing_Kids!$F21,1)),\"\",\"X\")","v":""}]
[{"$f":"Failing_Kids!C22","v":"Avila"},{"$f":"Failing_Kids!D22","v":"Natalie"},{"$f":"IF(ISERROR(SEARCH(\"*English*\",Failing_Kids!F22,1)),\"\",\"X \")","v":""},{"$f":"IF(ISERROR(SEARCH(\"*Geometry*\",Failing_Kids!$F22,1)),IF(ISERROR(SEARCH(\"*Math*\",Failing_Kids!$F22,1)),IF(ISERROR(SEARCH(\"*Calc*\",Failing_Kids!$F22,1)),IF(ISERROR(SEARCH(\"*Algebra*\",Failing_Kids!$F22,1)),\"\",\"X\"),\"X\"),\"X\"),\"X\")","v":""},{"$f":"IF(ISERROR(SEARCH(\"*Science*\",Failing_Kids!$F22,1)),IF(ISERROR(SEARCH(\"*Bio*\",Failing_Kids!$F22,1)),IF(ISERROR(SEARCH(\"*Chem*\",Failing_Kids!$F22,1)),IF(ISERROR(SEARCH(\"*Physics*\",Failing_Kids!$F22,1)),\"\",\"X\"),\"X\"),\"X\"),\"X\")","v":""},{"$f":"IF(ISERROR(SEARCH(\"*His*\",Failing_Kids!$F22,1)),IF(ISERROR(SEARCH(\"*GOV*\",Failing_Kids!$F22,1)),IF(ISERROR(SEARCH(\"*Econ*\",Failing_Kids!$F22,1)),IF(ISERROR(SEARCH(\"*Soc*\",Failing_Kids!$F22,1)),\"\",\"X\"),\"X\"),\"X\"),\"X\")","v":""},{"$f":"IF(ISERROR(SEARCH(\"*PE*\",Failing_Kids!$F22,1)),\"\",\"X\")","v":""}]
[{"$f":"Failing_Kids!C23","v":"Baird"},{"$f":"Failing_Kids!D23","v":"Whitney"},{"$f":"IF(ISERROR(SEARCH(\"*English*\",Failing_Kids!F23,1)),\"\",\"X \")","v":""},{"$f":"IF(ISERROR(SEARCH(\"*Geometry*\",Failing_Kids!$F23,1)),IF(ISERROR(SEARCH(\"*Math*\",Failing_Kids!$F23,1)),IF(ISERROR(SEARCH(\"*Calc*\",Failing_Kids!$F23,1)),IF(ISERROR(SEARCH(\"*Algebra*\",Failing_Kids!$F23,1)),\"\",\"X\"),\"X\"),\"X\"),\"X\")","v":"X"},{"$f":"IF(ISERROR(SEARCH(\"*Science*\",Failing_Kids!$F23,1)),IF(ISERROR(SEARCH(\"*Bio*\",Failing_Kids!$F23,1)),IF(ISERROR(SEARCH(\"*Chem*\",Failing_Kids!$F23,1)),IF(ISERROR(SEARCH(\"*Physics*\",Failing_Kids!$F23,1)),\"\",\"X\"),\"X\"),\"X\"),\"X\")","v":""},{"$f":"IF(ISERROR(SEARCH(\"*His*\",Failing_Kids!$F23,1)),IF(ISERROR(SEARCH(\"*GOV*\",Failing_Kids!$F23,1)),IF(ISERROR(SEARCH(\"*Econ*\",Failing_Kids!$F23,1)),IF(ISERROR(SEARCH(\"*Soc*\",Failing_Kids!$F23,1)),\"\",\"X\"),\"X\"),\"X\"),\"X\")","v":""},{"$f":"IF(ISERROR(SEARCH(\"*PE*\",Failing_Kids!$F23,1)),\"\",\"X\")","v":""}]
[{"$f":"Failing_Kids!C24","v":"Ball"},{"$f":"Failing_Kids!D24","v":"Bernice"},{"$f":"IF(ISERROR(SEARCH(\"*English*\",Failing_Kids!F24,1)),\"\",\"X \")","v":""},{"$f":"IF(ISERROR(SEARCH(\"*Geometry*\",Failing_Kids!$F24,1)),IF(ISERROR(SEARCH(\"*Math*\",Failing_Kids!$F24,1)),IF(ISERROR(SEARCH(\"*Calc*\",Failing_Kids!$F24,1)),IF(ISERROR(SEARCH(\"*Algebra*\",Failing_Kids!$F24,1)),\"\",\"X\"),\"X\"),\"X\"),\"X\")","v":""},{"$f":"IF(ISERROR(SEARCH(\"*Science*\",Failing_Kids!$F24,1)),IF(ISERROR(SEARCH(\"*Bio*\",Failing_Kids!$F24,1)),IF(ISERROR(SEARCH(\"*Chem*\",Failing_Kids!$F24,1)),IF(ISERROR(SEARCH(\"*Physics*\",Failing_Kids!$F24,1)),\"\",\"X\"),\"X\"),\"X\"),\"X\")","v":""},{"$f":"IF(ISERROR(SEARCH(\"*His*\",Failing_Kids!$F24,1)),IF(ISERROR(SEARCH(\"*GOV*\",Failing_Kids!$F24,1)),IF(ISERROR(SEARCH(\"*Econ*\",Failing_Kids!$F24,1)),IF(ISERROR(SEARCH(\"*Soc*\",Failing_Kids!$F24,1)),\"\",\"X\"),\"X\"),\"X\"),\"X\")","v":""},{"$f":"IF(ISERROR(SEARCH(\"*PE*\",Failing_Kids!$F24,1)),\"\",\"X\")","v":""}]
[{"$f":"Failing_Kids!C25","v":"Ball"},{"$f":"Failing_Kids!D25","v":"Bernice"},{"$f":"IF(ISERROR(SEARCH(\"*English*\",Failing_Kids!F25,1)),\"\",\"X \")","v":""},{"$f":"IF(ISERROR(SEARCH(\"*Geometry*\",Failing_Kids!$F25,1)),IF(ISERROR(SEARCH(\"*Math*\",Failing_Kids!$F25,1)),IF(ISERROR(SEARCH(\"*Calc*\",Failing_Kids!$F25,1)),IF(ISERROR(SEARCH(\"*Algebra*\",Failing_Kids!$F25,1)),\"\",\"X\"),\"X\"),\"X\"),\"X\")","v":""},{"$f":"IF(ISERROR(SEARCH(\"*Science*\",Failing_Kids!$F25,1)),IF(ISERROR(SEARCH(\"*Bio*\",Failing_Kids!$F25,1)),IF(ISERROR(SEARCH(\"*Chem*\",Failing_Kids!$F25,1)),IF(ISERROR(SEARCH(\"*Physics*\",Failing_Kids!$F25,1)),\"\",\"X\"),\"X\"),\"X\"),\"X\")","v":"X"},{"$f":"IF(ISERROR(SEARCH(\"*His*\",Failing_Kids!$F25,1)),IF(ISERROR(SEARCH(\"*GOV*\",Failing_Kids!$F25,1)),IF(ISERROR(SEARCH(\"*Econ*\",Failing_Kids!$F25,1)),IF(ISERROR(SEARCH(\"*Soc*\",Failing_Kids!$F25,1)),\"\",\"X\"),\"X\"),\"X\"),\"X\")","v":""},{"$f":"IF(ISERROR(SEARCH(\"*PE*\",Failing_Kids!$F25,1)),\"\",\"X\")","v":""}]
[{"$f":"Failing_Kids!C26","v":"Ballard"},{"$f":"Failing_Kids!D26","v":"Terry"},{"$f":"IF(ISERROR(SEARCH(\"*English*\",Failing_Kids!F26,1)),\"\",\"X \")","v":"X "},{"$f":"IF(ISERROR(SEARCH(\"*Geometry*\",Failing_Kids!$F26,1)),IF(ISERROR(SEARCH(\"*Math*\",Failing_Kids!$F26,1)),IF(ISERROR(SEARCH(\"*Calc*\",Failing_Kids!$F26,1)),IF(ISERROR(SEARCH(\"*Algebra*\",Failing_Kids!$F26,1)),\"\",\"X\"),\"X\"),\"X\"),\"X\")","v":""},{"$f":"IF(ISERROR(SEARCH(\"*Science*\",Failing_Kids!$F26,1)),IF(ISERROR(SEARCH(\"*Bio*\",Failing_Kids!$F26,1)),IF(ISERROR(SEARCH(\"*Chem*\",Failing_Kids!$F26,1)),IF(ISERROR(SEARCH(\"*Physics*\",Failing_Kids!$F26,1)),\"\",\"X\"),\"X\"),\"X\"),\"X\")","v":""},{"$f":"IF(ISERROR(SEARCH(\"*His*\",Failing_Kids!$F26,1)),IF(ISERROR(SEARCH(\"*GOV*\",Failing_Kids!$F26,1)),IF(ISERROR(SEARCH(\"*Econ*\",Failing_Kids!$F26,1)),IF(ISERROR(SEARCH(\"*Soc*\",Failing_Kids!$F26,1)),\"\",\"X\"),\"X\"),\"X\"),\"X\")","v":""},{"$f":"IF(ISERROR(SEARCH(\"*PE*\",Failing_Kids!$F26,1)),\"\",\"X\")","v":""}]
[{"$f":"Failing_Kids!C27","v":"Barrett"},{"$f":"Failing_Kids!D27","v":"Henry"},{"$f":"IF(ISERROR(SEARCH(\"*English*\",Failing_Kids!F27,1)),\"\",\"X \")","v":""},{"$f":"IF(ISERROR(SEARCH(\"*Geometry*\",Failing_Kids!$F27,1)),IF(ISERROR(SEARCH(\"*Math*\",Failing_Kids!$F27,1)),IF(ISERROR(SEARCH(\"*Calc*\",Failing_Kids!$F27,1)),IF(ISERROR(SEARCH(\"*Algebra*\",Failing_Kids!$F27,1)),\"\",\"X\"),\"X\"),\"X\"),\"X\")","v":"X"},{"$f":"IF(ISERROR(SEARCH(\"*Science*\",Failing_Kids!$F27,1)),IF(ISERROR(SEARCH(\"*Bio*\",Failing_Kids!$F27,1)),IF(ISERROR(SEARCH(\"*Chem*\",Failing_Kids!$F27,1)),IF(ISERROR(SEARCH(\"*Physics*\",Failing_Kids!$F27,1)),\"\",\"X\"),\"X\"),\"X\"),\"X\")","v":""},{"$f":"IF(ISERROR(SEARCH(\"*His*\",Failing_Kids!$F27,1)),IF(ISERROR(SEARCH(\"*GOV*\",Failing_Kids!$F27,1)),IF(ISERROR(SEARCH(\"*Econ*\",Failing_Kids!$F27,1)),IF(ISERROR(SEARCH(\"*Soc*\",Failing_Kids!$F27,1)),\"\",\"X\"),\"X\"),\"X\"),\"X\")","v":""},{"$f":"IF(ISERROR(SEARCH(\"*PE*\",Failing_Kids!$F27,1)),\"\",\"X\")","v":""}]
[{"$f":"Failing_Kids!C28","v":"Barrett"},{"$f":"Failing_Kids!D28","v":"Henry"},{"$f":"IF(ISERROR(SEARCH(\"*English*\",Failing_Kids!F28,1)),\"\",\"X \")","v":""},{"$f":"IF(ISERROR(SEARCH(\"*Geometry*\",Failing_Kids!$F28,1)),IF(ISERROR(SEARCH(\"*Math*\",Failing_Kids!$F28,1)),IF(ISERROR(SEARCH(\"*Calc*\",Failing_Kids!$F28,1)),IF(ISERROR(SEARCH(\"*Algebra*\",Failing_Kids!$F28,1)),\"\",\"X\"),\"X\"),\"X\"),\"X\")","v":""},{"$f":"IF(ISERROR(SEARCH(\"*Science*\",Failing_Kids!$F28,1)),IF(ISERROR(SEARCH(\"*Bio*\",Failing_Kids!$F28,1)),IF(ISERROR(SEARCH(\"*Chem*\",Failing_Kids!$F28,1)),IF(ISERROR(SEARCH(\"*Physics*\",Failing_Kids!$F28,1)),\"\",\"X\"),\"X\"),\"X\"),\"X\")","v":""},{"$f":"IF(ISERROR(SEARCH(\"*His*\",Failing_Kids!$F28,1)),IF(ISERROR(SEARCH(\"*GOV*\",Failing_Kids!$F28,1)),IF(ISERROR(SEARCH(\"*Econ*\",Failing_Kids!$F28,1)),IF(ISERROR(SEARCH(\"*Soc*\",Failing_Kids!$F28,1)),\"\",\"X\"),\"X\"),\"X\"),\"X\")","v":"X"},{"$f":"IF(ISERROR(SEARCH(\"*PE*\",Failing_Kids!$F28,1)),\"\",\"X\")","v":""}]
[{"$f":"Failing_Kids!C29","v":"Barrett"},{"$f":"Failing_Kids!D29","v":"Jenny"},{"$f":"IF(ISERROR(SEARCH(\"*English*\",Failing_Kids!F29,1)),\"\",\"X \")","v":""},{"$f":"IF(ISERROR(SEARCH(\"*Geometry*\",Failing_Kids!$F29,1)),IF(ISERROR(SEARCH(\"*Math*\",Failing_Kids!$F29,1)),IF(ISERROR(SEARCH(\"*Calc*\",Failing_Kids!$F29,1)),IF(ISERROR(SEARCH(\"*Algebra*\",Failing_Kids!$F29,1)),\"\",\"X\"),\"X\"),\"X\"),\"X\")","v":"X"},{"$f":"IF(ISERROR(SEARCH(\"*Science*\",Failing_Kids!$F29,1)),IF(ISERROR(SEARCH(\"*Bio*\",Failing_Kids!$F29,1)),IF(ISERROR(SEARCH(\"*Chem*\",Failing_Kids!$F29,1)),IF(ISERROR(SEARCH(\"*Physics*\",Failing_Kids!$F29,1)),\"\",\"X\"),\"X\"),\"X\"),\"X\")","v":""},{"$f":"IF(ISERROR(SEARCH(\"*His*\",Failing_Kids!$F29,1)),IF(ISERROR(SEARCH(\"*GOV*\",Failing_Kids!$F29,1)),IF(ISERROR(SEARCH(\"*Econ*\",Failing_Kids!$F29,1)),IF(ISERROR(SEARCH(\"*Soc*\",Failing_Kids!$F29,1)),\"\",\"X\"),\"X\"),\"X\"),\"X\")","v":""},{"$f":"IF(ISERROR(SEARCH(\"*PE*\",Failing_Kids!$F29,1)),\"\",\"X\")","v":""}]
[{"$f":"Failing_Kids!C30","v":"Barrett"},{"$f":"Failing_Kids!D30","v":"Monique"},{"$f":"IF(ISERROR(SEARCH(\"*English*\",Failing_Kids!F30,1)),\"\",\"X \")","v":""},{"$f":"IF(ISERROR(SEARCH(\"*Geometry*\",Failing_Kids!$F30,1)),IF(ISERROR(SEARCH(\"*Math*\",Failing_Kids!$F30,1)),IF(ISERROR(SEARCH(\"*Calc*\",Failing_Kids!$F30,1)),IF(ISERROR(SEARCH(\"*Algebra*\",Failing_Kids!$F30,1)),\"\",\"X\"),\"X\"),\"X\"),\"X\")","v":"X"},{"$f":"IF(ISERROR(SEARCH(\"*Science*\",Failing_Kids!$F30,1)),IF(ISERROR(SEARCH(\"*Bio*\",Failing_Kids!$F30,1)),IF(ISERROR(SEARCH(\"*Chem*\",Failing_Kids!$F30,1)),IF(ISERROR(SEARCH(\"*Physics*\",Failing_Kids!$F30,1)),\"\",\"X\"),\"X\"),\"X\"),\"X\")","v":""},{"$f":"IF(ISERROR(SEARCH(\"*His*\",Failing_Kids!$F30,1)),IF(ISERROR(SEARCH(\"*GOV*\",Failing_Kids!$F30,1)),IF(ISERROR(SEARCH(\"*Econ*\",Failing_Kids!$F30,1)),IF(ISERROR(SEARCH(\"*Soc*\",Failing_Kids!$F30,1)),\"\",\"X\"),\"X\"),\"X\"),\"X\")","v":""},{"$f":"IF(ISERROR(SEARCH(\"*PE*\",Failing_Kids!$F30,1)),\"\",\"X\")","v":""}]
[{"$f":"Failing_Kids!C31","v":"Barrett"},{"$f":"Failing_Kids!D31","v":"Monique"},{"$f":"IF(ISERROR(SEARCH(\"*English*\",Failing_Kids!F31,1)),\"\",\"X \")","v":""},{"$f":"IF(ISERROR(SEARCH(\"*Geometry*\",Failing_Kids!$F31,1)),IF(ISERROR(SEARCH(\"*Math*\",Failing_Kids!$F31,1)),IF(ISERROR(SEARCH(\"*Calc*\",Failing_Kids!$F31,1)),IF(ISERROR(SEARCH(\"*Algebra*\",Failing_Kids!$F31,1)),\"\",\"X\"),\"X\"),\"X\"),\"X\")","v":""},{"$f":"IF(ISERROR(SEARCH(\"*Science*\",Failing_Kids!$F31,1)),IF(ISERROR(SEARCH(\"*Bio*\",Failing_Kids!$F31,1)),IF(ISERROR(SEARCH(\"*Chem*\",Failing_Kids!$F31,1)),IF(ISERROR(SEARCH(\"*Physics*\",Failing_Kids!$F31,1)),\"\",\"X\"),\"X\"),\"X\"),\"X\")","v":""},{"$f":"IF(ISERROR(SEARCH(\"*His*\",Failing_Kids!$F31,1)),IF(ISERROR(SEARCH(\"*GOV*\",Failing_Kids!$F31,1)),IF(ISERROR(SEARCH(\"*Econ*\",Failing_Kids!$F31,1)),IF(ISERROR(SEARCH(\"*Soc*\",Failing_Kids!$F31,1)),\"\",\"X\"),\"X\"),\"X\"),\"X\")","v":"X"},{"$f":"IF(ISERROR(SEARCH(\"*PE*\",Failing_Kids!$F31,1)),\"\",\"X\")","v":""}]
[{"$f":"Failing_Kids!C32","v":"Barton"},{"$f":"Failing_Kids!D32","v":"Beulah"},{"$f":"IF(ISERROR(SEARCH(\"*English*\",Failing_Kids!F32,1)),\"\",\"X \")","v":""},{"$f":"IF(ISERROR(SEARCH(\"*Geometry*\",Failing_Kids!$F32,1)),IF(ISERROR(SEARCH(\"*Math*\",Failing_Kids!$F32,1)),IF(ISERROR(SEARCH(\"*Calc*\",Failing_Kids!$F32,1)),IF(ISERROR(SEARCH(\"*Algebra*\",Failing_Kids!$F32,1)),\"\",\"X\"),\"X\"),\"X\"),\"X\")","v":""},{"$f":"IF(ISERROR(SEARCH(\"*Science*\",Failing_Kids!$F32,1)),IF(ISERROR(SEARCH(\"*Bio*\",Failing_Kids!$F32,1)),IF(ISERROR(SEARCH(\"*Chem*\",Failing_Kids!$F32,1)),IF(ISERROR(SEARCH(\"*Physics*\",Failing_Kids!$F32,1)),\"\",\"X\"),\"X\"),\"X\"),\"X\")","v":"X"},{"$f":"IF(ISERROR(SEARCH(\"*His*\",Failing_Kids!$F32,1)),IF(ISERROR(SEARCH(\"*GOV*\",Failing_Kids!$F32,1)),IF(ISERROR(SEARCH(\"*Econ*\",Failing_Kids!$F32,1)),IF(ISERROR(SEARCH(\"*Soc*\",Failing_Kids!$F32,1)),\"\",\"X\"),\"X\"),\"X\"),\"X\")","v":""},{"$f":"IF(ISERROR(SEARCH(\"*PE*\",Failing_Kids!$F32,1)),\"\",\"X\")","v":""}]
[{"$f":"Failing_Kids!C33","v":"Bass"},{"$f":"Failing_Kids!D33","v":"Jesse"},{"$f":"IF(ISERROR(SEARCH(\"*English*\",Failing_Kids!F33,1)),\"\",\"X \")","v":""},{"$f":"IF(ISERROR(SEARCH(\"*Geometry*\",Failing_Kids!$F33,1)),IF(ISERROR(SEARCH(\"*Math*\",Failing_Kids!$F33,1)),IF(ISERROR(SEARCH(\"*Calc*\",Failing_Kids!$F33,1)),IF(ISERROR(SEARCH(\"*Algebra*\",Failing_Kids!$F33,1)),\"\",\"X\"),\"X\"),\"X\"),\"X\")","v":"X"},{"$f":"IF(ISERROR(SEARCH(\"*Science*\",Failing_Kids!$F33,1)),IF(ISERROR(SEARCH(\"*Bio*\",Failing_Kids!$F33,1)),IF(ISERROR(SEARCH(\"*Chem*\",Failing_Kids!$F33,1)),IF(ISERROR(SEARCH(\"*Physics*\",Failing_Kids!$F33,1)),\"\",\"X\"),\"X\"),\"X\"),\"X\")","v":""},{"$f":"IF(ISERROR(SEARCH(\"*His*\",Failing_Kids!$F33,1)),IF(ISERROR(SEARCH(\"*GOV*\",Failing_Kids!$F33,1)),IF(ISERROR(SEARCH(\"*Econ*\",Failing_Kids!$F33,1)),IF(ISERROR(SEARCH(\"*Soc*\",Failing_Kids!$F33,1)),\"\",\"X\"),\"X\"),\"X\"),\"X\")","v":""},{"$f":"IF(ISERROR(SEARCH(\"*PE*\",Failing_Kids!$F33,1)),\"\",\"X\")","v":""}]
[{"$f":"Failing_Kids!C34","v":"Bass"},{"$f":"Failing_Kids!D34","v":"Jesse"},{"$f":"IF(ISERROR(SEARCH(\"*English*\",Failing_Kids!F34,1)),\"\",\"X \")","v":""},{"$f":"IF(ISERROR(SEARCH(\"*Geometry*\",Failing_Kids!$F34,1)),IF(ISERROR(SEARCH(\"*Math*\",Failing_Kids!$F34,1)),IF(ISERROR(SEARCH(\"*Calc*\",Failing_Kids!$F34,1)),IF(ISERROR(SEARCH(\"*Algebra*\",Failing_Kids!$F34,1)),\"\",\"X\"),\"X\"),\"X\"),\"X\")","v":""},{"$f":"IF(ISERROR(SEARCH(\"*Science*\",Failing_Kids!$F34,1)),IF(ISERROR(SEARCH(\"*Bio*\",Failing_Kids!$F34,1)),IF(ISERROR(SEARCH(\"*Chem*\",Failing_Kids!$F34,1)),IF(ISERROR(SEARCH(\"*Physics*\",Failing_Kids!$F34,1)),\"\",\"X\"),\"X\"),\"X\"),\"X\")","v":""},{"$f":"IF(ISERROR(SEARCH(\"*His*\",Failing_Kids!$F34,1)),IF(ISERROR(SEARCH(\"*GOV*\",Failing_Kids!$F34,1)),IF(ISERROR(SEARCH(\"*Econ*\",Failing_Kids!$F34,1)),IF(ISERROR(SEARCH(\"*Soc*\",Failing_Kids!$F34,1)),\"\",\"X\"),\"X\"),\"X\"),\"X\")","v":""},{"$f":"IF(ISERROR(SEARCH(\"*PE*\",Failing_Kids!$F34,1)),\"\",\"X\")","v":""}]
[{"$f":"Failing_Kids!C35","v":"Bass"},{"$f":"Failing_Kids!D35","v":"Jesse"},{"$f":"IF(ISERROR(SEARCH(\"*English*\",Failing_Kids!F35,1)),\"\",\"X \")","v":""},{"$f":"IF(ISERROR(SEARCH(\"*Geometry*\",Failing_Kids!$F35,1)),IF(ISERROR(SEARCH(\"*Math*\",Failing_Kids!$F35,1)),IF(ISERROR(SEARCH(\"*Calc*\",Failing_Kids!$F35,1)),IF(ISERROR(SEARCH(\"*Algebra*\",Failing_Kids!$F35,1)),\"\",\"X\"),\"X\"),\"X\"),\"X\")","v":""},{"$f":"IF(ISERROR(SEARCH(\"*Science*\",Failing_Kids!$F35,1)),IF(ISERROR(SEARCH(\"*Bio*\",Failing_Kids!$F35,1)),IF(ISERROR(SEARCH(\"*Chem*\",Failing_Kids!$F35,1)),IF(ISERROR(SEARCH(\"*Physics*\",Failing_Kids!$F35,1)),\"\",\"X\"),\"X\"),\"X\"),\"X\")","v":""},{"$f":"IF(ISERROR(SEARCH(\"*His*\",Failing_Kids!$F35,1)),IF(ISERROR(SEARCH(\"*GOV*\",Failing_Kids!$F35,1)),IF(ISERROR(SEARCH(\"*Econ*\",Failing_Kids!$F35,1)),IF(ISERROR(SEARCH(\"*Soc*\",Failing_Kids!$F35,1)),\"\",\"X\"),\"X\"),\"X\"),\"X\")","v":"X"},{"$f":"IF(ISERROR(SEARCH(\"*PE*\",Failing_Kids!$F35,1)),\"\",\"X\")","v":""}]
[{"$f":"Failing_Kids!C36","v":"Bates"},{"$f":"Failing_Kids!D36","v":"Catherine"},{"$f":"IF(ISERROR(SEARCH(\"*English*\",Failing_Kids!F36,1)),\"\",\"X \")","v":"X "},{"$f":"IF(ISERROR(SEARCH(\"*Geometry*\",Failing_Kids!$F36,1)),IF(ISERROR(SEARCH(\"*Math*\",Failing_Kids!$F36,1)),IF(ISERROR(SEARCH(\"*Calc*\",Failing_Kids!$F36,1)),IF(ISERROR(SEARCH(\"*Algebra*\",Failing_Kids!$F36,1)),\"\",\"X\"),\"X\"),\"X\"),\"X\")","v":""},{"$f":"IF(ISERROR(SEARCH(\"*Science*\",Failing_Kids!$F36,1)),IF(ISERROR(SEARCH(\"*Bio*\",Failing_Kids!$F36,1)),IF(ISERROR(SEARCH(\"*Chem*\",Failing_Kids!$F36,1)),IF(ISERROR(SEARCH(\"*Physics*\",Failing_Kids!$F36,1)),\"\",\"X\"),\"X\"),\"X\"),\"X\")","v":""},{"$f":"IF(ISERROR(SEARCH(\"*His*\",Failing_Kids!$F36,1)),IF(ISERROR(SEARCH(\"*GOV*\",Failing_Kids!$F36,1)),IF(ISERROR(SEARCH(\"*Econ*\",Failing_Kids!$F36,1)),IF(ISERROR(SEARCH(\"*Soc*\",Failing_Kids!$F36,1)),\"\",\"X\"),\"X\"),\"X\"),\"X\")","v":""},{"$f":"IF(ISERROR(SEARCH(\"*PE*\",Failing_Kids!$F36,1)),\"\",\"X\")","v":""}]
[{"$f":"Failing_Kids!C37","v":"Beach"},{"$f":"Failing_Kids!D37","v":"Catherine"},{"$f":"IF(ISERROR(SEARCH(\"*English*\",Failing_Kids!F37,1)),\"\",\"X \")","v":""},{"$f":"IF(ISERROR(SEARCH(\"*Geometry*\",Failing_Kids!$F37,1)),IF(ISERROR(SEARCH(\"*Math*\",Failing_Kids!$F37,1)),IF(ISERROR(SEARCH(\"*Calc*\",Failing_Kids!$F37,1)),IF(ISERROR(SEARCH(\"*Algebra*\",Failing_Kids!$F37,1)),\"\",\"X\"),\"X\"),\"X\"),\"X\")","v":""},{"$f":"IF(ISERROR(SEARCH(\"*Science*\",Failing_Kids!$F37,1)),IF(ISERROR(SEARCH(\"*Bio*\",Failing_Kids!$F37,1)),IF(ISERROR(SEARCH(\"*Chem*\",Failing_Kids!$F37,1)),IF(ISERROR(SEARCH(\"*Physics*\",Failing_Kids!$F37,1)),\"\",\"X\"),\"X\"),\"X\"),\"X\")","v":""},{"$f":"IF(ISERROR(SEARCH(\"*His*\",Failing_Kids!$F37,1)),IF(ISERROR(SEARCH(\"*GOV*\",Failing_Kids!$F37,1)),IF(ISERROR(SEARCH(\"*Econ*\",Failing_Kids!$F37,1)),IF(ISERROR(SEARCH(\"*Soc*\",Failing_Kids!$F37,1)),\"\",\"X\"),\"X\"),\"X\"),\"X\")","v":"X"},{"$f":"IF(ISERROR(SEARCH(\"*PE*\",Failing_Kids!$F37,1)),\"\",\"X\")","v":""}]
[{"$f":"Failing_Kids!C38","v":"Beasley"},{"$f":"Failing_Kids!D38","v":"Erika"},{"$f":"IF(ISERROR(SEARCH(\"*English*\",Failing_Kids!F38,1)),\"\",\"X \")","v":""},{"$f":"IF(ISERROR(SEARCH(\"*Geometry*\",Failing_Kids!$F38,1)),IF(ISERROR(SEARCH(\"*Math*\",Failing_Kids!$F38,1)),IF(ISERROR(SEARCH(\"*Calc*\",Failing_Kids!$F38,1)),IF(ISERROR(SEARCH(\"*Algebra*\",Failing_Kids!$F38,1)),\"\",\"X\"),\"X\"),\"X\"),\"X\")","v":"X"},{"$f":"IF(ISERROR(SEARCH(\"*Science*\",Failing_Kids!$F38,1)),IF(ISERROR(SEARCH(\"*Bio*\",Failing_Kids!$F38,1)),IF(ISERROR(SEARCH(\"*Chem*\",Failing_Kids!$F38,1)),IF(ISERROR(SEARCH(\"*Physics*\",Failing_Kids!$F38,1)),\"\",\"X\"),\"X\"),\"X\"),\"X\")","v":""},{"$f":"IF(ISERROR(SEARCH(\"*His*\",Failing_Kids!$F38,1)),IF(ISERROR(SEARCH(\"*GOV*\",Failing_Kids!$F38,1)),IF(ISERROR(SEARCH(\"*Econ*\",Failing_Kids!$F38,1)),IF(ISERROR(SEARCH(\"*Soc*\",Failing_Kids!$F38,1)),\"\",\"X\"),\"X\"),\"X\"),\"X\")","v":""},{"$f":"IF(ISERROR(SEARCH(\"*PE*\",Failing_Kids!$F38,1)),\"\",\"X\")","v":""}]
[{"$f":"Failing_Kids!C39","v":"Beck"},{"$f":"Failing_Kids!D39","v":"Russell"},{"$f":"IF(ISERROR(SEARCH(\"*English*\",Failing_Kids!F39,1)),\"\",\"X \")","v":""},{"$f":"IF(ISERROR(SEARCH(\"*Geometry*\",Failing_Kids!$F39,1)),IF(ISERROR(SEARCH(\"*Math*\",Failing_Kids!$F39,1)),IF(ISERROR(SEARCH(\"*Calc*\",Failing_Kids!$F39,1)),IF(ISERROR(SEARCH(\"*Algebra*\",Failing_Kids!$F39,1)),\"\",\"X\"),\"X\"),\"X\"),\"X\")","v":"X"},{"$f":"IF(ISERROR(SEARCH(\"*Science*\",Failing_Kids!$F39,1)),IF(ISERROR(SEARCH(\"*Bio*\",Failing_Kids!$F39,1)),IF(ISERROR(SEARCH(\"*Chem*\",Failing_Kids!$F39,1)),IF(ISERROR(SEARCH(\"*Physics*\",Failing_Kids!$F39,1)),\"\",\"X\"),\"X\"),\"X\"),\"X\")","v":""},{"$f":"IF(ISERROR(SEARCH(\"*His*\",Failing_Kids!$F39,1)),IF(ISERROR(SEARCH(\"*GOV*\",Failing_Kids!$F39,1)),IF(ISERROR(SEARCH(\"*Econ*\",Failing_Kids!$F39,1)),IF(ISERROR(SEARCH(\"*Soc*\",Failing_Kids!$F39,1)),\"\",\"X\"),\"X\"),\"X\"),\"X\")","v":""},{"$f":"IF(ISERROR(SEARCH(\"*PE*\",Failing_Kids!$F39,1)),\"\",\"X\")","v":""}]
[{"$f":"Failing_Kids!C40","v":"Bender"},{"$f":"Failing_Kids!D40","v":"Richard"},{"$f":"IF(ISERROR(SEARCH(\"*English*\",Failing_Kids!F40,1)),\"\",\"X \")","v":"X "},{"$f":"IF(ISERROR(SEARCH(\"*Geometry*\",Failing_Kids!$F40,1)),IF(ISERROR(SEARCH(\"*Math*\",Failing_Kids!$F40,1)),IF(ISERROR(SEARCH(\"*Calc*\",Failing_Kids!$F40,1)),IF(ISERROR(SEARCH(\"*Algebra*\",Failing_Kids!$F40,1)),\"\",\"X\"),\"X\"),\"X\"),\"X\")","v":""},{"$f":"IF(ISERROR(SEARCH(\"*Science*\",Failing_Kids!$F40,1)),IF(ISERROR(SEARCH(\"*Bio*\",Failing_Kids!$F40,1)),IF(ISERROR(SEARCH(\"*Chem*\",Failing_Kids!$F40,1)),IF(ISERROR(SEARCH(\"*Physics*\",Failing_Kids!$F40,1)),\"\",\"X\"),\"X\"),\"X\"),\"X\")","v":""},{"$f":"IF(ISERROR(SEARCH(\"*His*\",Failing_Kids!$F40,1)),IF(ISERROR(SEARCH(\"*GOV*\",Failing_Kids!$F40,1)),IF(ISERROR(SEARCH(\"*Econ*\",Failing_Kids!$F40,1)),IF(ISERROR(SEARCH(\"*Soc*\",Failing_Kids!$F40,1)),\"\",\"X\"),\"X\"),\"X\"),\"X\")","v":""},{"$f":"IF(ISERROR(SEARCH(\"*PE*\",Failing_Kids!$F40,1)),\"\",\"X\")","v":""}]
[{"$f":"Failing_Kids!C41","v":"Berger"},{"$f":"Failing_Kids!D41","v":"Marlene"},{"$f":"IF(ISERROR(SEARCH(\"*English*\",Failing_Kids!F41,1)),\"\",\"X \")","v":"X "},{"$f":"IF(ISERROR(SEARCH(\"*Geometry*\",Failing_Kids!$F41,1)),IF(ISERROR(SEARCH(\"*Math*\",Failing_Kids!$F41,1)),IF(ISERROR(SEARCH(\"*Calc*\",Failing_Kids!$F41,1)),IF(ISERROR(SEARCH(\"*Algebra*\",Failing_Kids!$F41,1)),\"\",\"X\"),\"X\"),\"X\"),\"X\")","v":""},{"$f":"IF(ISERROR(SEARCH(\"*Science*\",Failing_Kids!$F41,1)),IF(ISERROR(SEARCH(\"*Bio*\",Failing_Kids!$F41,1)),IF(ISERROR(SEARCH(\"*Chem*\",Failing_Kids!$F41,1)),IF(ISERROR(SEARCH(\"*Physics*\",Failing_Kids!$F41,1)),\"\",\"X\"),\"X\"),\"X\"),\"X\")","v":""},{"$f":"IF(ISERROR(SEARCH(\"*His*\",Failing_Kids!$F41,1)),IF(ISERROR(SEARCH(\"*GOV*\",Failing_Kids!$F41,1)),IF(ISERROR(SEARCH(\"*Econ*\",Failing_Kids!$F41,1)),IF(ISERROR(SEARCH(\"*Soc*\",Failing_Kids!$F41,1)),\"\",\"X\"),\"X\"),\"X\"),\"X\")","v":""},{"$f":"IF(ISERROR(SEARCH(\"*PE*\",Failing_Kids!$F41,1)),\"\",\"X\")","v":""}]
[{"$f":"Failing_Kids!C42","v":"Berger"},{"$f":"Failing_Kids!D42","v":"Marlene"},{"$f":"IF(ISERROR(SEARCH(\"*English*\",Failing_Kids!F42,1)),\"\",\"X \")","v":""},{"$f":"IF(ISERROR(SEARCH(\"*Geometry*\",Failing_Kids!$F42,1)),IF(ISERROR(SEARCH(\"*Math*\",Failing_Kids!$F42,1)),IF(ISERROR(SEARCH(\"*Calc*\",Failing_Kids!$F42,1)),IF(ISERROR(SEARCH(\"*Algebra*\",Failing_Kids!$F42,1)),\"\",\"X\"),\"X\"),\"X\"),\"X\")","v":""},{"$f":"IF(ISERROR(SEARCH(\"*Science*\",Failing_Kids!$F42,1)),IF(ISERROR(SEARCH(\"*Bio*\",Failing_Kids!$F42,1)),IF(ISERROR(SEARCH(\"*Chem*\",Failing_Kids!$F42,1)),IF(ISERROR(SEARCH(\"*Physics*\",Failing_Kids!$F42,1)),\"\",\"X\"),\"X\"),\"X\"),\"X\")","v":""},{"$f":"IF(ISERROR(SEARCH(\"*His*\",Failing_Kids!$F42,1)),IF(ISERROR(SEARCH(\"*GOV*\",Failing_Kids!$F42,1)),IF(ISERROR(SEARCH(\"*Econ*\",Failing_Kids!$F42,1)),IF(ISERROR(SEARCH(\"*Soc*\",Failing_Kids!$F42,1)),\"\",\"X\"),\"X\"),\"X\"),\"X\")","v":""},{"$f":"IF(ISERROR(SEARCH(\"*PE*\",Failing_Kids!$F42,1)),\"\",\"X\")","v":""}]
[{"$f":"Failing_Kids!C43","v":"Berger"},{"$f":"Failing_Kids!D43","v":"Marlene"},{"$f":"IF(ISERROR(SEARCH(\"*English*\",Failing_Kids!F43,1)),\"\",\"X \")","v":""},{"$f":"IF(ISERROR(SEARCH(\"*Geometry*\",Failing_Kids!$F43,1)),IF(ISERROR(SEARCH(\"*Math*\",Failing_Kids!$F43,1)),IF(ISERROR(SEARCH(\"*Calc*\",Failing_Kids!$F43,1)),IF(ISERROR(SEARCH(\"*Algebra*\",Failing_Kids!$F43,1)),\"\",\"X\"),\"X\"),\"X\"),\"X\")","v":"X"},{"$f":"IF(ISERROR(SEARCH(\"*Science*\",Failing_Kids!$F43,1)),IF(ISERROR(SEARCH(\"*Bio*\",Failing_Kids!$F43,1)),IF(ISERROR(SEARCH(\"*Chem*\",Failing_Kids!$F43,1)),IF(ISERROR(SEARCH(\"*Physics*\",Failing_Kids!$F43,1)),\"\",\"X\"),\"X\"),\"X\"),\"X\")","v":""},{"$f":"IF(ISERROR(SEARCH(\"*His*\",Failing_Kids!$F43,1)),IF(ISERROR(SEARCH(\"*GOV*\",Failing_Kids!$F43,1)),IF(ISERROR(SEARCH(\"*Econ*\",Failing_Kids!$F43,1)),IF(ISERROR(SEARCH(\"*Soc*\",Failing_Kids!$F43,1)),\"\",\"X\"),\"X\"),\"X\"),\"X\")","v":""},{"$f":"IF(ISERROR(SEARCH(\"*PE*\",Failing_Kids!$F43,1)),\"\",\"X\")","v":""}]
[{"$f":"Failing_Kids!C44","v":"Best"},{"$f":"Failing_Kids!D44","v":"Brandon"},{"$f":"IF(ISERROR(SEARCH(\"*English*\",Failing_Kids!F44,1)),\"\",\"X \")","v":""},{"$f":"IF(ISERROR(SEARCH(\"*Geometry*\",Failing_Kids!$F44,1)),IF(ISERROR(SEARCH(\"*Math*\",Failing_Kids!$F44,1)),IF(ISERROR(SEARCH(\"*Calc*\",Failing_Kids!$F44,1)),IF(ISERROR(SEARCH(\"*Algebra*\",Failing_Kids!$F44,1)),\"\",\"X\"),\"X\"),\"X\"),\"X\")","v":"X"},{"$f":"IF(ISERROR(SEARCH(\"*Science*\",Failing_Kids!$F44,1)),IF(ISERROR(SEARCH(\"*Bio*\",Failing_Kids!$F44,1)),IF(ISERROR(SEARCH(\"*Chem*\",Failing_Kids!$F44,1)),IF(ISERROR(SEARCH(\"*Physics*\",Failing_Kids!$F44,1)),\"\",\"X\"),\"X\"),\"X\"),\"X\")","v":""},{"$f":"IF(ISERROR(SEARCH(\"*His*\",Failing_Kids!$F44,1)),IF(ISERROR(SEARCH(\"*GOV*\",Failing_Kids!$F44,1)),IF(ISERROR(SEARCH(\"*Econ*\",Failing_Kids!$F44,1)),IF(ISERROR(SEARCH(\"*Soc*\",Failing_Kids!$F44,1)),\"\",\"X\"),\"X\"),\"X\"),\"X\")","v":""},{"$f":"IF(ISERROR(SEARCH(\"*PE*\",Failing_Kids!$F44,1)),\"\",\"X\")","v":""}]
[{"$f":"Failing_Kids!C45","v":"Blackburn"},{"$f":"Failing_Kids!D45","v":"Martha"},{"$f":"IF(ISERROR(SEARCH(\"*English*\",Failing_Kids!F45,1)),\"\",\"X \")","v":"X "},{"$f":"IF(ISERROR(SEARCH(\"*Geometry*\",Failing_Kids!$F45,1)),IF(ISERROR(SEARCH(\"*Math*\",Failing_Kids!$F45,1)),IF(ISERROR(SEARCH(\"*Calc*\",Failing_Kids!$F45,1)),IF(ISERROR(SEARCH(\"*Algebra*\",Failing_Kids!$F45,1)),\"\",\"X\"),\"X\"),\"X\"),\"X\")","v":""},{"$f":"IF(ISERROR(SEARCH(\"*Science*\",Failing_Kids!$F45,1)),IF(ISERROR(SEARCH(\"*Bio*\",Failing_Kids!$F45,1)),IF(ISERROR(SEARCH(\"*Chem*\",Failing_Kids!$F45,1)),IF(ISERROR(SEARCH(\"*Physics*\",Failing_Kids!$F45,1)),\"\",\"X\"),\"X\"),\"X\"),\"X\")","v":""},{"$f":"IF(ISERROR(SEARCH(\"*His*\",Failing_Kids!$F45,1)),IF(ISERROR(SEARCH(\"*GOV*\",Failing_Kids!$F45,1)),IF(ISERROR(SEARCH(\"*Econ*\",Failing_Kids!$F45,1)),IF(ISERROR(SEARCH(\"*Soc*\",Failing_Kids!$F45,1)),\"\",\"X\"),\"X\"),\"X\"),\"X\")","v":""},{"$f":"IF(ISERROR(SEARCH(\"*PE*\",Failing_Kids!$F45,1)),\"\",\"X\")","v":""}]
[{"$f":"Failing_Kids!C46","v":"Blackburn"},{"$f":"Failing_Kids!D46","v":"Martha"},{"$f":"IF(ISERROR(SEARCH(\"*English*\",Failing_Kids!F46,1)),\"\",\"X \")","v":""},{"$f":"IF(ISERROR(SEARCH(\"*Geometry*\",Failing_Kids!$F46,1)),IF(ISERROR(SEARCH(\"*Math*\",Failing_Kids!$F46,1)),IF(ISERROR(SEARCH(\"*Calc*\",Failing_Kids!$F46,1)),IF(ISERROR(SEARCH(\"*Algebra*\",Failing_Kids!$F46,1)),\"\",\"X\"),\"X\"),\"X\"),\"X\")","v":"X"},{"$f":"IF(ISERROR(SEARCH(\"*Science*\",Failing_Kids!$F46,1)),IF(ISERROR(SEARCH(\"*Bio*\",Failing_Kids!$F46,1)),IF(ISERROR(SEARCH(\"*Chem*\",Failing_Kids!$F46,1)),IF(ISERROR(SEARCH(\"*Physics*\",Failing_Kids!$F46,1)),\"\",\"X\"),\"X\"),\"X\"),\"X\")","v":""},{"$f":"IF(ISERROR(SEARCH(\"*His*\",Failing_Kids!$F46,1)),IF(ISERROR(SEARCH(\"*GOV*\",Failing_Kids!$F46,1)),IF(ISERROR(SEARCH(\"*Econ*\",Failing_Kids!$F46,1)),IF(ISERROR(SEARCH(\"*Soc*\",Failing_Kids!$F46,1)),\"\",\"X\"),\"X\"),\"X\"),\"X\")","v":""},{"$f":"IF(ISERROR(SEARCH(\"*PE*\",Failing_Kids!$F46,1)),\"\",\"X\")","v":""}]
[{"$f":"Failing_Kids!C47","v":"Blackburn"},{"$f":"Failing_Kids!D47","v":"Martha"},{"$f":"IF(ISERROR(SEARCH(\"*English*\",Failing_Kids!F47,1)),\"\",\"X \")","v":""},{"$f":"IF(ISERROR(SEARCH(\"*Geometry*\",Failing_Kids!$F47,1)),IF(ISERROR(SEARCH(\"*Math*\",Failing_Kids!$F47,1)),IF(ISERROR(SEARCH(\"*Calc*\",Failing_Kids!$F47,1)),IF(ISERROR(SEARCH(\"*Algebra*\",Failing_Kids!$F47,1)),\"\",\"X\"),\"X\"),\"X\"),\"X\")","v":""},{"$f":"IF(ISERROR(SEARCH(\"*Science*\",Failing_Kids!$F47,1)),IF(ISERROR(SEARCH(\"*Bio*\",Failing_Kids!$F47,1)),IF(ISERROR(SEARCH(\"*Chem*\",Failing_Kids!$F47,1)),IF(ISERROR(SEARCH(\"*Physics*\",Failing_Kids!$F47,1)),\"\",\"X\"),\"X\"),\"X\"),\"X\")","v":""},{"$f":"IF(ISERROR(SEARCH(\"*His*\",Failing_Kids!$F47,1)),IF(ISERROR(SEARCH(\"*GOV*\",Failing_Kids!$F47,1)),IF(ISERROR(SEARCH(\"*Econ*\",Failing_Kids!$F47,1)),IF(ISERROR(SEARCH(\"*Soc*\",Failing_Kids!$F47,1)),\"\",\"X\"),\"X\"),\"X\"),\"X\")","v":"X"},{"$f":"IF(ISERROR(SEARCH(\"*PE*\",Failing_Kids!$F47,1)),\"\",\"X\")","v":""}]
[{"$f":"Failing_Kids!C48","v":"Blackburn"},{"$f":"Failing_Kids!D48","v":"Martha"},{"$f":"IF(ISERROR(SEARCH(\"*English*\",Failing_Kids!F48,1)),\"\",\"X \")","v":""},{"$f":"IF(ISERROR(SEARCH(\"*Geometry*\",Failing_Kids!$F48,1)),IF(ISERROR(SEARCH(\"*Math*\",Failing_Kids!$F48,1)),IF(ISERROR(SEARCH(\"*Calc*\",Failing_Kids!$F48,1)),IF(ISERROR(SEARCH(\"*Algebra*\",Failing_Kids!$F48,1)),\"\",\"X\"),\"X\"),\"X\"),\"X\")","v":""},{"$f":"IF(ISERROR(SEARCH(\"*Science*\",Failing_Kids!$F48,1)),IF(ISERROR(SEARCH(\"*Bio*\",Failing_Kids!$F48,1)),IF(ISERROR(SEARCH(\"*Chem*\",Failing_Kids!$F48,1)),IF(ISERROR(SEARCH(\"*Physics*\",Failing_Kids!$F48,1)),\"\",\"X\"),\"X\"),\"X\"),\"X\")","v":""},{"$f":"IF(ISERROR(SEARCH(\"*His*\",Failing_Kids!$F48,1)),IF(ISERROR(SEARCH(\"*GOV*\",Failing_Kids!$F48,1)),IF(ISERROR(SEARCH(\"*Econ*\",Failing_Kids!$F48,1)),IF(ISERROR(SEARCH(\"*Soc*\",Failing_Kids!$F48,1)),\"\",\"X\"),\"X\"),\"X\"),\"X\")","v":"X"},{"$f":"IF(ISERROR(SEARCH(\"*PE*\",Failing_Kids!$F48,1)),\"\",\"X\")","v":""}]
[{"$f":"Failing_Kids!C49","v":"Blake"},{"$f":"Failing_Kids!D49","v":"Kenneth"},{"$f":"IF(ISERROR(SEARCH(\"*English*\",Failing_Kids!F49,1)),\"\",\"X \")","v":""},{"$f":"IF(ISERROR(SEARCH(\"*Geometry*\",Failing_Kids!$F49,1)),IF(ISERROR(SEARCH(\"*Math*\",Failing_Kids!$F49,1)),IF(ISERROR(SEARCH(\"*Calc*\",Failing_Kids!$F49,1)),IF(ISERROR(SEARCH(\"*Algebra*\",Failing_Kids!$F49,1)),\"\",\"X\"),\"X\"),\"X\"),\"X\")","v":"X"},{"$f":"IF(ISERROR(SEARCH(\"*Science*\",Failing_Kids!$F49,1)),IF(ISERROR(SEARCH(\"*Bio*\",Failing_Kids!$F49,1)),IF(ISERROR(SEARCH(\"*Chem*\",Failing_Kids!$F49,1)),IF(ISERROR(SEARCH(\"*Physics*\",Failing_Kids!$F49,1)),\"\",\"X\"),\"X\"),\"X\"),\"X\")","v":""},{"$f":"IF(ISERROR(SEARCH(\"*His*\",Failing_Kids!$F49,1)),IF(ISERROR(SEARCH(\"*GOV*\",Failing_Kids!$F49,1)),IF(ISERROR(SEARCH(\"*Econ*\",Failing_Kids!$F49,1)),IF(ISERROR(SEARCH(\"*Soc*\",Failing_Kids!$F49,1)),\"\",\"X\"),\"X\"),\"X\"),\"X\")","v":""},{"$f":"IF(ISERROR(SEARCH(\"*PE*\",Failing_Kids!$F49,1)),\"\",\"X\")","v":""}]
[{"$f":"Failing_Kids!C50","v":"Blanchard"},{"$f":"Failing_Kids!D50","v":"Bonnie"},{"$f":"IF(ISERROR(SEARCH(\"*English*\",Failing_Kids!F50,1)),\"\",\"X \")","v":""},{"$f":"IF(ISERROR(SEARCH(\"*Geometry*\",Failing_Kids!$F50,1)),IF(ISERROR(SEARCH(\"*Math*\",Failing_Kids!$F50,1)),IF(ISERROR(SEARCH(\"*Calc*\",Failing_Kids!$F50,1)),IF(ISERROR(SEARCH(\"*Algebra*\",Failing_Kids!$F50,1)),\"\",\"X\"),\"X\"),\"X\"),\"X\")","v":""},{"$f":"IF(ISERROR(SEARCH(\"*Science*\",Failing_Kids!$F50,1)),IF(ISERROR(SEARCH(\"*Bio*\",Failing_Kids!$F50,1)),IF(ISERROR(SEARCH(\"*Chem*\",Failing_Kids!$F50,1)),IF(ISERROR(SEARCH(\"*Physics*\",Failing_Kids!$F50,1)),\"\",\"X\"),\"X\"),\"X\"),\"X\")","v":"X"},{"$f":"IF(ISERROR(SEARCH(\"*His*\",Failing_Kids!$F50,1)),IF(ISERROR(SEARCH(\"*GOV*\",Failing_Kids!$F50,1)),IF(ISERROR(SEARCH(\"*Econ*\",Failing_Kids!$F50,1)),IF(ISERROR(SEARCH(\"*Soc*\",Failing_Kids!$F50,1)),\"\",\"X\"),\"X\"),\"X\"),\"X\")","v":""},{"$f":"IF(ISERROR(SEARCH(\"*PE*\",Failing_Kids!$F50,1)),\"\",\"X\")","v":""}]
[{"$f":"Failing_Kids!C51","v":"Blanchard"},{"$f":"Failing_Kids!D51","v":"Bonnie"},{"$f":"IF(ISERROR(SEARCH(\"*English*\",Failing_Kids!F51,1)),\"\",\"X \")","v":"X "},{"$f":"IF(ISERROR(SEARCH(\"*Geometry*\",Failing_Kids!$F51,1)),IF(ISERROR(SEARCH(\"*Math*\",Failing_Kids!$F51,1)),IF(ISERROR(SEARCH(\"*Calc*\",Failing_Kids!$F51,1)),IF(ISERROR(SEARCH(\"*Algebra*\",Failing_Kids!$F51,1)),\"\",\"X\"),\"X\"),\"X\"),\"X\")","v":""},{"$f":"IF(ISERROR(SEARCH(\"*Science*\",Failing_Kids!$F51,1)),IF(ISERROR(SEARCH(\"*Bio*\",Failing_Kids!$F51,1)),IF(ISERROR(SEARCH(\"*Chem*\",Failing_Kids!$F51,1)),IF(ISERROR(SEARCH(\"*Physics*\",Failing_Kids!$F51,1)),\"\",\"X\"),\"X\"),\"X\"),\"X\")","v":""},{"$f":"IF(ISERROR(SEARCH(\"*His*\",Failing_Kids!$F51,1)),IF(ISERROR(SEARCH(\"*GOV*\",Failing_Kids!$F51,1)),IF(ISERROR(SEARCH(\"*Econ*\",Failing_Kids!$F51,1)),IF(ISERROR(SEARCH(\"*Soc*\",Failing_Kids!$F51,1)),\"\",\"X\"),\"X\"),\"X\"),\"X\")","v":""},{"$f":"IF(ISERROR(SEARCH(\"*PE*\",Failing_Kids!$F51,1)),\"\",\"X\")","v":""}]
[{"$f":"Failing_Kids!C52","v":"Blankenship"},{"$f":"Failing_Kids!D52","v":"Arthur"},{"$f":"IF(ISERROR(SEARCH(\"*English*\",Failing_Kids!F52,1)),\"\",\"X \")","v":""},{"$f":"IF(ISERROR(SEARCH(\"*Geometry*\",Failing_Kids!$F52,1)),IF(ISERROR(SEARCH(\"*Math*\",Failing_Kids!$F52,1)),IF(ISERROR(SEARCH(\"*Calc*\",Failing_Kids!$F52,1)),IF(ISERROR(SEARCH(\"*Algebra*\",Failing_Kids!$F52,1)),\"\",\"X\"),\"X\"),\"X\"),\"X\")","v":""},{"$f":"IF(ISERROR(SEARCH(\"*Science*\",Failing_Kids!$F52,1)),IF(ISERROR(SEARCH(\"*Bio*\",Failing_Kids!$F52,1)),IF(ISERROR(SEARCH(\"*Chem*\",Failing_Kids!$F52,1)),IF(ISERROR(SEARCH(\"*Physics*\",Failing_Kids!$F52,1)),\"\",\"X\"),\"X\"),\"X\"),\"X\")","v":""},{"$f":"IF(ISERROR(SEARCH(\"*His*\",Failing_Kids!$F52,1)),IF(ISERROR(SEARCH(\"*GOV*\",Failing_Kids!$F52,1)),IF(ISERROR(SEARCH(\"*Econ*\",Failing_Kids!$F52,1)),IF(ISERROR(SEARCH(\"*Soc*\",Failing_Kids!$F52,1)),\"\",\"X\"),\"X\"),\"X\"),\"X\")","v":"X"},{"$f":"IF(ISERROR(SEARCH(\"*PE*\",Failing_Kids!$F52,1)),\"\",\"X\")","v":""}]
[{"$f":"Failing_Kids!C53","v":"Blankenship"},{"$f":"Failing_Kids!D53","v":"Tracey"},{"$f":"IF(ISERROR(SEARCH(\"*English*\",Failing_Kids!F53,1)),\"\",\"X \")","v":""},{"$f":"IF(ISERROR(SEARCH(\"*Geometry*\",Failing_Kids!$F53,1)),IF(ISERROR(SEARCH(\"*Math*\",Failing_Kids!$F53,1)),IF(ISERROR(SEARCH(\"*Calc*\",Failing_Kids!$F53,1)),IF(ISERROR(SEARCH(\"*Algebra*\",Failing_Kids!$F53,1)),\"\",\"X\"),\"X\"),\"X\"),\"X\")","v":"X"},{"$f":"IF(ISERROR(SEARCH(\"*Science*\",Failing_Kids!$F53,1)),IF(ISERROR(SEARCH(\"*Bio*\",Failing_Kids!$F53,1)),IF(ISERROR(SEARCH(\"*Chem*\",Failing_Kids!$F53,1)),IF(ISERROR(SEARCH(\"*Physics*\",Failing_Kids!$F53,1)),\"\",\"X\"),\"X\"),\"X\"),\"X\")","v":""},{"$f":"IF(ISERROR(SEARCH(\"*His*\",Failing_Kids!$F53,1)),IF(ISERROR(SEARCH(\"*GOV*\",Failing_Kids!$F53,1)),IF(ISERROR(SEARCH(\"*Econ*\",Failing_Kids!$F53,1)),IF(ISERROR(SEARCH(\"*Soc*\",Failing_Kids!$F53,1)),\"\",\"X\"),\"X\"),\"X\"),\"X\")","v":""},{"$f":"IF(ISERROR(SEARCH(\"*PE*\",Failing_Kids!$F53,1)),\"\",\"X\")","v":""}]
[{"$f":"Failing_Kids!C54","v":"Booker"},{"$f":"Failing_Kids!D54","v":"Kayla"},{"$f":"IF(ISERROR(SEARCH(\"*English*\",Failing_Kids!F54,1)),\"\",\"X \")","v":""},{"$f":"IF(ISERROR(SEARCH(\"*Geometry*\",Failing_Kids!$F54,1)),IF(ISERROR(SEARCH(\"*Math*\",Failing_Kids!$F54,1)),IF(ISERROR(SEARCH(\"*Calc*\",Failing_Kids!$F54,1)),IF(ISERROR(SEARCH(\"*Algebra*\",Failing_Kids!$F54,1)),\"\",\"X\"),\"X\"),\"X\"),\"X\")","v":"X"},{"$f":"IF(ISERROR(SEARCH(\"*Science*\",Failing_Kids!$F54,1)),IF(ISERROR(SEARCH(\"*Bio*\",Failing_Kids!$F54,1)),IF(ISERROR(SEARCH(\"*Chem*\",Failing_Kids!$F54,1)),IF(ISERROR(SEARCH(\"*Physics*\",Failing_Kids!$F54,1)),\"\",\"X\"),\"X\"),\"X\"),\"X\")","v":""},{"$f":"IF(ISERROR(SEARCH(\"*His*\",Failing_Kids!$F54,1)),IF(ISERROR(SEARCH(\"*GOV*\",Failing_Kids!$F54,1)),IF(ISERROR(SEARCH(\"*Econ*\",Failing_Kids!$F54,1)),IF(ISERROR(SEARCH(\"*Soc*\",Failing_Kids!$F54,1)),\"\",\"X\"),\"X\"),\"X\"),\"X\")","v":""},{"$f":"IF(ISERROR(SEARCH(\"*PE*\",Failing_Kids!$F54,1)),\"\",\"X\")","v":""}]
[{"$f":"Failing_Kids!C55","v":"Booker"},{"$f":"Failing_Kids!D55","v":"Kayla"},{"$f":"IF(ISERROR(SEARCH(\"*English*\",Failing_Kids!F55,1)),\"\",\"X \")","v":""},{"$f":"IF(ISERROR(SEARCH(\"*Geometry*\",Failing_Kids!$F55,1)),IF(ISERROR(SEARCH(\"*Math*\",Failing_Kids!$F55,1)),IF(ISERROR(SEARCH(\"*Calc*\",Failing_Kids!$F55,1)),IF(ISERROR(SEARCH(\"*Algebra*\",Failing_Kids!$F55,1)),\"\",\"X\"),\"X\"),\"X\"),\"X\")","v":""},{"$f":"IF(ISERROR(SEARCH(\"*Science*\",Failing_Kids!$F55,1)),IF(ISERROR(SEARCH(\"*Bio*\",Failing_Kids!$F55,1)),IF(ISERROR(SEARCH(\"*Chem*\",Failing_Kids!$F55,1)),IF(ISERROR(SEARCH(\"*Physics*\",Failing_Kids!$F55,1)),\"\",\"X\"),\"X\"),\"X\"),\"X\")","v":""},{"$f":"IF(ISERROR(SEARCH(\"*His*\",Failing_Kids!$F55,1)),IF(ISERROR(SEARCH(\"*GOV*\",Failing_Kids!$F55,1)),IF(ISERROR(SEARCH(\"*Econ*\",Failing_Kids!$F55,1)),IF(ISERROR(SEARCH(\"*Soc*\",Failing_Kids!$F55,1)),\"\",\"X\"),\"X\"),\"X\"),\"X\")","v":"X"},{"$f":"IF(ISERROR(SEARCH(\"*PE*\",Failing_Kids!$F55,1)),\"\",\"X\")","v":""}]
[{"$f":"Failing_Kids!C56","v":"Boone"},{"$f":"Failing_Kids!D56","v":"Jamie"},{"$f":"IF(ISERROR(SEARCH(\"*English*\",Failing_Kids!F56,1)),\"\",\"X \")","v":""},{"$f":"IF(ISERROR(SEARCH(\"*Geometry*\",Failing_Kids!$F56,1)),IF(ISERROR(SEARCH(\"*Math*\",Failing_Kids!$F56,1)),IF(ISERROR(SEARCH(\"*Calc*\",Failing_Kids!$F56,1)),IF(ISERROR(SEARCH(\"*Algebra*\",Failing_Kids!$F56,1)),\"\",\"X\"),\"X\"),\"X\"),\"X\")","v":""},{"$f":"IF(ISERROR(SEARCH(\"*Science*\",Failing_Kids!$F56,1)),IF(ISERROR(SEARCH(\"*Bio*\",Failing_Kids!$F56,1)),IF(ISERROR(SEARCH(\"*Chem*\",Failing_Kids!$F56,1)),IF(ISERROR(SEARCH(\"*Physics*\",Failing_Kids!$F56,1)),\"\",\"X\"),\"X\"),\"X\"),\"X\")","v":""},{"$f":"IF(ISERROR(SEARCH(\"*His*\",Failing_Kids!$F56,1)),IF(ISERROR(SEARCH(\"*GOV*\",Failing_Kids!$F56,1)),IF(ISERROR(SEARCH(\"*Econ*\",Failing_Kids!$F56,1)),IF(ISERROR(SEARCH(\"*Soc*\",Failing_Kids!$F56,1)),\"\",\"X\"),\"X\"),\"X\"),\"X\")","v":"X"},{"$f":"IF(ISERROR(SEARCH(\"*PE*\",Failing_Kids!$F56,1)),\"\",\"X\")","v":""}]
[{"$f":"Failing_Kids!C57","v":"Boone"},{"$f":"Failing_Kids!D57","v":"Laura"},{"$f":"IF(ISERROR(SEARCH(\"*English*\",Failing_Kids!F57,1)),\"\",\"X \")","v":""},{"$f":"IF(ISERROR(SEARCH(\"*Geometry*\",Failing_Kids!$F57,1)),IF(ISERROR(SEARCH(\"*Math*\",Failing_Kids!$F57,1)),IF(ISERROR(SEARCH(\"*Calc*\",Failing_Kids!$F57,1)),IF(ISERROR(SEARCH(\"*Algebra*\",Failing_Kids!$F57,1)),\"\",\"X\"),\"X\"),\"X\"),\"X\")","v":"X"},{"$f":"IF(ISERROR(SEARCH(\"*Science*\",Failing_Kids!$F57,1)),IF(ISERROR(SEARCH(\"*Bio*\",Failing_Kids!$F57,1)),IF(ISERROR(SEARCH(\"*Chem*\",Failing_Kids!$F57,1)),IF(ISERROR(SEARCH(\"*Physics*\",Failing_Kids!$F57,1)),\"\",\"X\"),\"X\"),\"X\"),\"X\")","v":""},{"$f":"IF(ISERROR(SEARCH(\"*His*\",Failing_Kids!$F57,1)),IF(ISERROR(SEARCH(\"*GOV*\",Failing_Kids!$F57,1)),IF(ISERROR(SEARCH(\"*Econ*\",Failing_Kids!$F57,1)),IF(ISERROR(SEARCH(\"*Soc*\",Failing_Kids!$F57,1)),\"\",\"X\"),\"X\"),\"X\"),\"X\")","v":""},{"$f":"IF(ISERROR(SEARCH(\"*PE*\",Failing_Kids!$F57,1)),\"\",\"X\")","v":""}]
[{"$f":"Failing_Kids!C58","v":"Bowman"},{"$f":"Failing_Kids!D58","v":"Ada"},{"$f":"IF(ISERROR(SEARCH(\"*English*\",Failing_Kids!F58,1)),\"\",\"X \")","v":"X "},{"$f":"IF(ISERROR(SEARCH(\"*Geometry*\",Failing_Kids!$F58,1)),IF(ISERROR(SEARCH(\"*Math*\",Failing_Kids!$F58,1)),IF(ISERROR(SEARCH(\"*Calc*\",Failing_Kids!$F58,1)),IF(ISERROR(SEARCH(\"*Algebra*\",Failing_Kids!$F58,1)),\"\",\"X\"),\"X\"),\"X\"),\"X\")","v":""},{"$f":"IF(ISERROR(SEARCH(\"*Science*\",Failing_Kids!$F58,1)),IF(ISERROR(SEARCH(\"*Bio*\",Failing_Kids!$F58,1)),IF(ISERROR(SEARCH(\"*Chem*\",Failing_Kids!$F58,1)),IF(ISERROR(SEARCH(\"*Physics*\",Failing_Kids!$F58,1)),\"\",\"X\"),\"X\"),\"X\"),\"X\")","v":""},{"$f":"IF(ISERROR(SEARCH(\"*His*\",Failing_Kids!$F58,1)),IF(ISERROR(SEARCH(\"*GOV*\",Failing_Kids!$F58,1)),IF(ISERROR(SEARCH(\"*Econ*\",Failing_Kids!$F58,1)),IF(ISERROR(SEARCH(\"*Soc*\",Failing_Kids!$F58,1)),\"\",\"X\"),\"X\"),\"X\"),\"X\")","v":""},{"$f":"IF(ISERROR(SEARCH(\"*PE*\",Failing_Kids!$F58,1)),\"\",\"X\")","v":""}]
[{"$f":"Failing_Kids!C59","v":"Bradshaw"},{"$f":"Failing_Kids!D59","v":"Marlene"},{"$f":"IF(ISERROR(SEARCH(\"*English*\",Failing_Kids!F59,1)),\"\",\"X \")","v":""},{"$f":"IF(ISERROR(SEARCH(\"*Geometry*\",Failing_Kids!$F59,1)),IF(ISERROR(SEARCH(\"*Math*\",Failing_Kids!$F59,1)),IF(ISERROR(SEARCH(\"*Calc*\",Failing_Kids!$F59,1)),IF(ISERROR(SEARCH(\"*Algebra*\",Failing_Kids!$F59,1)),\"\",\"X\"),\"X\"),\"X\"),\"X\")","v":"X"},{"$f":"IF(ISERROR(SEARCH(\"*Science*\",Failing_Kids!$F59,1)),IF(ISERROR(SEARCH(\"*Bio*\",Failing_Kids!$F59,1)),IF(ISERROR(SEARCH(\"*Chem*\",Failing_Kids!$F59,1)),IF(ISERROR(SEARCH(\"*Physics*\",Failing_Kids!$F59,1)),\"\",\"X\"),\"X\"),\"X\"),\"X\")","v":""},{"$f":"IF(ISERROR(SEARCH(\"*His*\",Failing_Kids!$F59,1)),IF(ISERROR(SEARCH(\"*GOV*\",Failing_Kids!$F59,1)),IF(ISERROR(SEARCH(\"*Econ*\",Failing_Kids!$F59,1)),IF(ISERROR(SEARCH(\"*Soc*\",Failing_Kids!$F59,1)),\"\",\"X\"),\"X\"),\"X\"),\"X\")","v":""},{"$f":"IF(ISERROR(SEARCH(\"*PE*\",Failing_Kids!$F59,1)),\"\",\"X\")","v":""}]
[{"$f":"Failing_Kids!C60","v":"Bradshaw"},{"$f":"Failing_Kids!D60","v":"Marlene"},{"$f":"IF(ISERROR(SEARCH(\"*English*\",Failing_Kids!F60,1)),\"\",\"X \")","v":""},{"$f":"IF(ISERROR(SEARCH(\"*Geometry*\",Failing_Kids!$F60,1)),IF(ISERROR(SEARCH(\"*Math*\",Failing_Kids!$F60,1)),IF(ISERROR(SEARCH(\"*Calc*\",Failing_Kids!$F60,1)),IF(ISERROR(SEARCH(\"*Algebra*\",Failing_Kids!$F60,1)),\"\",\"X\"),\"X\"),\"X\"),\"X\")","v":""},{"$f":"IF(ISERROR(SEARCH(\"*Science*\",Failing_Kids!$F60,1)),IF(ISERROR(SEARCH(\"*Bio*\",Failing_Kids!$F60,1)),IF(ISERROR(SEARCH(\"*Chem*\",Failing_Kids!$F60,1)),IF(ISERROR(SEARCH(\"*Physics*\",Failing_Kids!$F60,1)),\"\",\"X\"),\"X\"),\"X\"),\"X\")","v":""},{"$f":"IF(ISERROR(SEARCH(\"*His*\",Failing_Kids!$F60,1)),IF(ISERROR(SEARCH(\"*GOV*\",Failing_Kids!$F60,1)),IF(ISERROR(SEARCH(\"*Econ*\",Failing_Kids!$F60,1)),IF(ISERROR(SEARCH(\"*Soc*\",Failing_Kids!$F60,1)),\"\",\"X\"),\"X\"),\"X\"),\"X\")","v":"X"},{"$f":"IF(ISERROR(SEARCH(\"*PE*\",Failing_Kids!$F60,1)),\"\",\"X\")","v":""}]
[{"$f":"Failing_Kids!C61","v":"Brewer"},{"$f":"Failing_Kids!D61","v":"Rebecca"},{"$f":"IF(ISERROR(SEARCH(\"*English*\",Failing_Kids!F61,1)),\"\",\"X \")","v":""},{"$f":"IF(ISERROR(SEARCH(\"*Geometry*\",Failing_Kids!$F61,1)),IF(ISERROR(SEARCH(\"*Math*\",Failing_Kids!$F61,1)),IF(ISERROR(SEARCH(\"*Calc*\",Failing_Kids!$F61,1)),IF(ISERROR(SEARCH(\"*Algebra*\",Failing_Kids!$F61,1)),\"\",\"X\"),\"X\"),\"X\"),\"X\")","v":""},{"$f":"IF(ISERROR(SEARCH(\"*Science*\",Failing_Kids!$F61,1)),IF(ISERROR(SEARCH(\"*Bio*\",Failing_Kids!$F61,1)),IF(ISERROR(SEARCH(\"*Chem*\",Failing_Kids!$F61,1)),IF(ISERROR(SEARCH(\"*Physics*\",Failing_Kids!$F61,1)),\"\",\"X\"),\"X\"),\"X\"),\"X\")","v":""},{"$f":"IF(ISERROR(SEARCH(\"*His*\",Failing_Kids!$F61,1)),IF(ISERROR(SEARCH(\"*GOV*\",Failing_Kids!$F61,1)),IF(ISERROR(SEARCH(\"*Econ*\",Failing_Kids!$F61,1)),IF(ISERROR(SEARCH(\"*Soc*\",Failing_Kids!$F61,1)),\"\",\"X\"),\"X\"),\"X\"),\"X\")","v":""},{"$f":"IF(ISERROR(SEARCH(\"*PE*\",Failing_Kids!$F61,1)),\"\",\"X\")","v":""}]
[{"$f":"Failing_Kids!C62","v":"Briggs"},{"$f":"Failing_Kids!D62","v":"Stanley"},{"$f":"IF(ISERROR(SEARCH(\"*English*\",Failing_Kids!F62,1)),\"\",\"X \")","v":""},{"$f":"IF(ISERROR(SEARCH(\"*Geometry*\",Failing_Kids!$F62,1)),IF(ISERROR(SEARCH(\"*Math*\",Failing_Kids!$F62,1)),IF(ISERROR(SEARCH(\"*Calc*\",Failing_Kids!$F62,1)),IF(ISERROR(SEARCH(\"*Algebra*\",Failing_Kids!$F62,1)),\"\",\"X\"),\"X\"),\"X\"),\"X\")","v":"X"},{"$f":"IF(ISERROR(SEARCH(\"*Science*\",Failing_Kids!$F62,1)),IF(ISERROR(SEARCH(\"*Bio*\",Failing_Kids!$F62,1)),IF(ISERROR(SEARCH(\"*Chem*\",Failing_Kids!$F62,1)),IF(ISERROR(SEARCH(\"*Physics*\",Failing_Kids!$F62,1)),\"\",\"X\"),\"X\"),\"X\"),\"X\")","v":""},{"$f":"IF(ISERROR(SEARCH(\"*His*\",Failing_Kids!$F62,1)),IF(ISERROR(SEARCH(\"*GOV*\",Failing_Kids!$F62,1)),IF(ISERROR(SEARCH(\"*Econ*\",Failing_Kids!$F62,1)),IF(ISERROR(SEARCH(\"*Soc*\",Failing_Kids!$F62,1)),\"\",\"X\"),\"X\"),\"X\"),\"X\")","v":""},{"$f":"IF(ISERROR(SEARCH(\"*PE*\",Failing_Kids!$F62,1)),\"\",\"X\")","v":""}]
[{"$f":"Failing_Kids!C63","v":"Briggs"},{"$f":"Failing_Kids!D63","v":"Stanley"},{"$f":"IF(ISERROR(SEARCH(\"*English*\",Failing_Kids!F63,1)),\"\",\"X \")","v":"X "},{"$f":"IF(ISERROR(SEARCH(\"*Geometry*\",Failing_Kids!$F63,1)),IF(ISERROR(SEARCH(\"*Math*\",Failing_Kids!$F63,1)),IF(ISERROR(SEARCH(\"*Calc*\",Failing_Kids!$F63,1)),IF(ISERROR(SEARCH(\"*Algebra*\",Failing_Kids!$F63,1)),\"\",\"X\"),\"X\"),\"X\"),\"X\")","v":""},{"$f":"IF(ISERROR(SEARCH(\"*Science*\",Failing_Kids!$F63,1)),IF(ISERROR(SEARCH(\"*Bio*\",Failing_Kids!$F63,1)),IF(ISERROR(SEARCH(\"*Chem*\",Failing_Kids!$F63,1)),IF(ISERROR(SEARCH(\"*Physics*\",Failing_Kids!$F63,1)),\"\",\"X\"),\"X\"),\"X\"),\"X\")","v":""},{"$f":"IF(ISERROR(SEARCH(\"*His*\",Failing_Kids!$F63,1)),IF(ISERROR(SEARCH(\"*GOV*\",Failing_Kids!$F63,1)),IF(ISERROR(SEARCH(\"*Econ*\",Failing_Kids!$F63,1)),IF(ISERROR(SEARCH(\"*Soc*\",Failing_Kids!$F63,1)),\"\",\"X\"),\"X\"),\"X\"),\"X\")","v":""},{"$f":"IF(ISERROR(SEARCH(\"*PE*\",Failing_Kids!$F63,1)),\"\",\"X\")","v":""}]
[{"$f":"Failing_Kids!C64","v":"Britt"},{"$f":"Failing_Kids!D64","v":"Marcia"},{"$f":"IF(ISERROR(SEARCH(\"*English*\",Failing_Kids!F64,1)),\"\",\"X \")","v":""},{"$f":"IF(ISERROR(SEARCH(\"*Geometry*\",Failing_Kids!$F64,1)),IF(ISERROR(SEARCH(\"*Math*\",Failing_Kids!$F64,1)),IF(ISERROR(SEARCH(\"*Calc*\",Failing_Kids!$F64,1)),IF(ISERROR(SEARCH(\"*Algebra*\",Failing_Kids!$F64,1)),\"\",\"X\"),\"X\"),\"X\"),\"X\")","v":"X"},{"$f":"IF(ISERROR(SEARCH(\"*Science*\",Failing_Kids!$F64,1)),IF(ISERROR(SEARCH(\"*Bio*\",Failing_Kids!$F64,1)),IF(ISERROR(SEARCH(\"*Chem*\",Failing_Kids!$F64,1)),IF(ISERROR(SEARCH(\"*Physics*\",Failing_Kids!$F64,1)),\"\",\"X\"),\"X\"),\"X\"),\"X\")","v":""},{"$f":"IF(ISERROR(SEARCH(\"*His*\",Failing_Kids!$F64,1)),IF(ISERROR(SEARCH(\"*GOV*\",Failing_Kids!$F64,1)),IF(ISERROR(SEARCH(\"*Econ*\",Failing_Kids!$F64,1)),IF(ISERROR(SEARCH(\"*Soc*\",Failing_Kids!$F64,1)),\"\",\"X\"),\"X\"),\"X\"),\"X\")","v":""},{"$f":"IF(ISERROR(SEARCH(\"*PE*\",Failing_Kids!$F64,1)),\"\",\"X\")","v":""}]
[{"$f":"Failing_Kids!C65","v":"Britt"},{"$f":"Failing_Kids!D65","v":"Marcia"},{"$f":"IF(ISERROR(SEARCH(\"*English*\",Failing_Kids!F65,1)),\"\",\"X \")","v":""},{"$f":"IF(ISERROR(SEARCH(\"*Geometry*\",Failing_Kids!$F65,1)),IF(ISERROR(SEARCH(\"*Math*\",Failing_Kids!$F65,1)),IF(ISERROR(SEARCH(\"*Calc*\",Failing_Kids!$F65,1)),IF(ISERROR(SEARCH(\"*Algebra*\",Failing_Kids!$F65,1)),\"\",\"X\"),\"X\"),\"X\"),\"X\")","v":""},{"$f":"IF(ISERROR(SEARCH(\"*Science*\",Failing_Kids!$F65,1)),IF(ISERROR(SEARCH(\"*Bio*\",Failing_Kids!$F65,1)),IF(ISERROR(SEARCH(\"*Chem*\",Failing_Kids!$F65,1)),IF(ISERROR(SEARCH(\"*Physics*\",Failing_Kids!$F65,1)),\"\",\"X\"),\"X\"),\"X\"),\"X\")","v":""},{"$f":"IF(ISERROR(SEARCH(\"*His*\",Failing_Kids!$F65,1)),IF(ISERROR(SEARCH(\"*GOV*\",Failing_Kids!$F65,1)),IF(ISERROR(SEARCH(\"*Econ*\",Failing_Kids!$F65,1)),IF(ISERROR(SEARCH(\"*Soc*\",Failing_Kids!$F65,1)),\"\",\"X\"),\"X\"),\"X\"),\"X\")","v":"X"},{"$f":"IF(ISERROR(SEARCH(\"*PE*\",Failing_Kids!$F65,1)),\"\",\"X\")","v":""}]
[{"$f":"Failing_Kids!C66","v":"Brooks"},{"$f":"Failing_Kids!D66","v":"Carolyn"},{"$f":"IF(ISERROR(SEARCH(\"*English*\",Failing_Kids!F66,1)),\"\",\"X \")","v":"X "},{"$f":"IF(ISERROR(SEARCH(\"*Geometry*\",Failing_Kids!$F66,1)),IF(ISERROR(SEARCH(\"*Math*\",Failing_Kids!$F66,1)),IF(ISERROR(SEARCH(\"*Calc*\",Failing_Kids!$F66,1)),IF(ISERROR(SEARCH(\"*Algebra*\",Failing_Kids!$F66,1)),\"\",\"X\"),\"X\"),\"X\"),\"X\")","v":""},{"$f":"IF(ISERROR(SEARCH(\"*Science*\",Failing_Kids!$F66,1)),IF(ISERROR(SEARCH(\"*Bio*\",Failing_Kids!$F66,1)),IF(ISERROR(SEARCH(\"*Chem*\",Failing_Kids!$F66,1)),IF(ISERROR(SEARCH(\"*Physics*\",Failing_Kids!$F66,1)),\"\",\"X\"),\"X\"),\"X\"),\"X\")","v":""},{"$f":"IF(ISERROR(SEARCH(\"*His*\",Failing_Kids!$F66,1)),IF(ISERROR(SEARCH(\"*GOV*\",Failing_Kids!$F66,1)),IF(ISERROR(SEARCH(\"*Econ*\",Failing_Kids!$F66,1)),IF(ISERROR(SEARCH(\"*Soc*\",Failing_Kids!$F66,1)),\"\",\"X\"),\"X\"),\"X\"),\"X\")","v":""},{"$f":"IF(ISERROR(SEARCH(\"*PE*\",Failing_Kids!$F66,1)),\"\",\"X\")","v":""}]
[{"$f":"Failing_Kids!C67","v":"Brown"},{"$f":"Failing_Kids!D67","v":"William"},{"$f":"IF(ISERROR(SEARCH(\"*English*\",Failing_Kids!F67,1)),\"\",\"X \")","v":""},{"$f":"IF(ISERROR(SEARCH(\"*Geometry*\",Failing_Kids!$F67,1)),IF(ISERROR(SEARCH(\"*Math*\",Failing_Kids!$F67,1)),IF(ISERROR(SEARCH(\"*Calc*\",Failing_Kids!$F67,1)),IF(ISERROR(SEARCH(\"*Algebra*\",Failing_Kids!$F67,1)),\"\",\"X\"),\"X\"),\"X\"),\"X\")","v":""},{"$f":"IF(ISERROR(SEARCH(\"*Science*\",Failing_Kids!$F67,1)),IF(ISERROR(SEARCH(\"*Bio*\",Failing_Kids!$F67,1)),IF(ISERROR(SEARCH(\"*Chem*\",Failing_Kids!$F67,1)),IF(ISERROR(SEARCH(\"*Physics*\",Failing_Kids!$F67,1)),\"\",\"X\"),\"X\"),\"X\"),\"X\")","v":""},{"$f":"IF(ISERROR(SEARCH(\"*His*\",Failing_Kids!$F67,1)),IF(ISERROR(SEARCH(\"*GOV*\",Failing_Kids!$F67,1)),IF(ISERROR(SEARCH(\"*Econ*\",Failing_Kids!$F67,1)),IF(ISERROR(SEARCH(\"*Soc*\",Failing_Kids!$F67,1)),\"\",\"X\"),\"X\"),\"X\"),\"X\")","v":""},{"$f":"IF(ISERROR(SEARCH(\"*PE*\",Failing_Kids!$F67,1)),\"\",\"X\")","v":""}]
[{"$f":"Failing_Kids!C68","v":"Browning"},{"$f":"Failing_Kids!D68","v":"Jeffrey"},{"$f":"IF(ISERROR(SEARCH(\"*English*\",Failing_Kids!F68,1)),\"\",\"X \")","v":""},{"$f":"IF(ISERROR(SEARCH(\"*Geometry*\",Failing_Kids!$F68,1)),IF(ISERROR(SEARCH(\"*Math*\",Failing_Kids!$F68,1)),IF(ISERROR(SEARCH(\"*Calc*\",Failing_Kids!$F68,1)),IF(ISERROR(SEARCH(\"*Algebra*\",Failing_Kids!$F68,1)),\"\",\"X\"),\"X\"),\"X\"),\"X\")","v":"X"},{"$f":"IF(ISERROR(SEARCH(\"*Science*\",Failing_Kids!$F68,1)),IF(ISERROR(SEARCH(\"*Bio*\",Failing_Kids!$F68,1)),IF(ISERROR(SEARCH(\"*Chem*\",Failing_Kids!$F68,1)),IF(ISERROR(SEARCH(\"*Physics*\",Failing_Kids!$F68,1)),\"\",\"X\"),\"X\"),\"X\"),\"X\")","v":""},{"$f":"IF(ISERROR(SEARCH(\"*His*\",Failing_Kids!$F68,1)),IF(ISERROR(SEARCH(\"*GOV*\",Failing_Kids!$F68,1)),IF(ISERROR(SEARCH(\"*Econ*\",Failing_Kids!$F68,1)),IF(ISERROR(SEARCH(\"*Soc*\",Failing_Kids!$F68,1)),\"\",\"X\"),\"X\"),\"X\"),\"X\")","v":""},{"$f":"IF(ISERROR(SEARCH(\"*PE*\",Failing_Kids!$F68,1)),\"\",\"X\")","v":""}]
[{"$f":"Failing_Kids!C69","v":"Bryant"},{"$f":"Failing_Kids!D69","v":"Tracey"},{"$f":"IF(ISERROR(SEARCH(\"*English*\",Failing_Kids!F69,1)),\"\",\"X \")","v":"X "},{"$f":"IF(ISERROR(SEARCH(\"*Geometry*\",Failing_Kids!$F69,1)),IF(ISERROR(SEARCH(\"*Math*\",Failing_Kids!$F69,1)),IF(ISERROR(SEARCH(\"*Calc*\",Failing_Kids!$F69,1)),IF(ISERROR(SEARCH(\"*Algebra*\",Failing_Kids!$F69,1)),\"\",\"X\"),\"X\"),\"X\"),\"X\")","v":""},{"$f":"IF(ISERROR(SEARCH(\"*Science*\",Failing_Kids!$F69,1)),IF(ISERROR(SEARCH(\"*Bio*\",Failing_Kids!$F69,1)),IF(ISERROR(SEARCH(\"*Chem*\",Failing_Kids!$F69,1)),IF(ISERROR(SEARCH(\"*Physics*\",Failing_Kids!$F69,1)),\"\",\"X\"),\"X\"),\"X\"),\"X\")","v":""},{"$f":"IF(ISERROR(SEARCH(\"*His*\",Failing_Kids!$F69,1)),IF(ISERROR(SEARCH(\"*GOV*\",Failing_Kids!$F69,1)),IF(ISERROR(SEARCH(\"*Econ*\",Failing_Kids!$F69,1)),IF(ISERROR(SEARCH(\"*Soc*\",Failing_Kids!$F69,1)),\"\",\"X\"),\"X\"),\"X\"),\"X\")","v":""},{"$f":"IF(ISERROR(SEARCH(\"*PE*\",Failing_Kids!$F69,1)),\"\",\"X\")","v":""}]
[{"$f":"Failing_Kids!C70","v":"Bryant"},{"$f":"Failing_Kids!D70","v":"Tracey"},{"$f":"IF(ISERROR(SEARCH(\"*English*\",Failing_Kids!F70,1)),\"\",\"X \")","v":""},{"$f":"IF(ISERROR(SEARCH(\"*Geometry*\",Failing_Kids!$F70,1)),IF(ISERROR(SEARCH(\"*Math*\",Failing_Kids!$F70,1)),IF(ISERROR(SEARCH(\"*Calc*\",Failing_Kids!$F70,1)),IF(ISERROR(SEARCH(\"*Algebra*\",Failing_Kids!$F70,1)),\"\",\"X\"),\"X\"),\"X\"),\"X\")","v":""},{"$f":"IF(ISERROR(SEARCH(\"*Science*\",Failing_Kids!$F70,1)),IF(ISERROR(SEARCH(\"*Bio*\",Failing_Kids!$F70,1)),IF(ISERROR(SEARCH(\"*Chem*\",Failing_Kids!$F70,1)),IF(ISERROR(SEARCH(\"*Physics*\",Failing_Kids!$F70,1)),\"\",\"X\"),\"X\"),\"X\"),\"X\")","v":""},{"$f":"IF(ISERROR(SEARCH(\"*His*\",Failing_Kids!$F70,1)),IF(ISERROR(SEARCH(\"*GOV*\",Failing_Kids!$F70,1)),IF(ISERROR(SEARCH(\"*Econ*\",Failing_Kids!$F70,1)),IF(ISERROR(SEARCH(\"*Soc*\",Failing_Kids!$F70,1)),\"\",\"X\"),\"X\"),\"X\"),\"X\")","v":"X"},{"$f":"IF(ISERROR(SEARCH(\"*PE*\",Failing_Kids!$F70,1)),\"\",\"X\")","v":""}]
[{"$f":"Failing_Kids!C71","v":"Buchanan"},{"$f":"Failing_Kids!D71","v":"Ernest"},{"$f":"IF(ISERROR(SEARCH(\"*English*\",Failing_Kids!F71,1)),\"\",\"X \")","v":""},{"$f":"IF(ISERROR(SEARCH(\"*Geometry*\",Failing_Kids!$F71,1)),IF(ISERROR(SEARCH(\"*Math*\",Failing_Kids!$F71,1)),IF(ISERROR(SEARCH(\"*Calc*\",Failing_Kids!$F71,1)),IF(ISERROR(SEARCH(\"*Algebra*\",Failing_Kids!$F71,1)),\"\",\"X\"),\"X\"),\"X\"),\"X\")","v":""},{"$f":"IF(ISERROR(SEARCH(\"*Science*\",Failing_Kids!$F71,1)),IF(ISERROR(SEARCH(\"*Bio*\",Failing_Kids!$F71,1)),IF(ISERROR(SEARCH(\"*Chem*\",Failing_Kids!$F71,1)),IF(ISERROR(SEARCH(\"*Physics*\",Failing_Kids!$F71,1)),\"\",\"X\"),\"X\"),\"X\"),\"X\")","v":"X"},{"$f":"IF(ISERROR(SEARCH(\"*His*\",Failing_Kids!$F71,1)),IF(ISERROR(SEARCH(\"*GOV*\",Failing_Kids!$F71,1)),IF(ISERROR(SEARCH(\"*Econ*\",Failing_Kids!$F71,1)),IF(ISERROR(SEARCH(\"*Soc*\",Failing_Kids!$F71,1)),\"\",\"X\"),\"X\"),\"X\"),\"X\")","v":""},{"$f":"IF(ISERROR(SEARCH(\"*PE*\",Failing_Kids!$F71,1)),\"\",\"X\")","v":""}]
[{"$f":"Failing_Kids!C72","v":"Buckner"},{"$f":"Failing_Kids!D72","v":"Chad"},{"$f":"IF(ISERROR(SEARCH(\"*English*\",Failing_Kids!F72,1)),\"\",\"X \")","v":"X "},{"$f":"IF(ISERROR(SEARCH(\"*Geometry*\",Failing_Kids!$F72,1)),IF(ISERROR(SEARCH(\"*Math*\",Failing_Kids!$F72,1)),IF(ISERROR(SEARCH(\"*Calc*\",Failing_Kids!$F72,1)),IF(ISERROR(SEARCH(\"*Algebra*\",Failing_Kids!$F72,1)),\"\",\"X\"),\"X\"),\"X\"),\"X\")","v":""},{"$f":"IF(ISERROR(SEARCH(\"*Science*\",Failing_Kids!$F72,1)),IF(ISERROR(SEARCH(\"*Bio*\",Failing_Kids!$F72,1)),IF(ISERROR(SEARCH(\"*Chem*\",Failing_Kids!$F72,1)),IF(ISERROR(SEARCH(\"*Physics*\",Failing_Kids!$F72,1)),\"\",\"X\"),\"X\"),\"X\"),\"X\")","v":""},{"$f":"IF(ISERROR(SEARCH(\"*His*\",Failing_Kids!$F72,1)),IF(ISERROR(SEARCH(\"*GOV*\",Failing_Kids!$F72,1)),IF(ISERROR(SEARCH(\"*Econ*\",Failing_Kids!$F72,1)),IF(ISERROR(SEARCH(\"*Soc*\",Failing_Kids!$F72,1)),\"\",\"X\"),\"X\"),\"X\"),\"X\")","v":""},{"$f":"IF(ISERROR(SEARCH(\"*PE*\",Failing_Kids!$F72,1)),\"\",\"X\")","v":""}]
[{"$f":"Failing_Kids!C73","v":"Buckner"},{"$f":"Failing_Kids!D73","v":"Ruby"},{"$f":"IF(ISERROR(SEARCH(\"*English*\",Failing_Kids!F73,1)),\"\",\"X \")","v":"X "},{"$f":"IF(ISERROR(SEARCH(\"*Geometry*\",Failing_Kids!$F73,1)),IF(ISERROR(SEARCH(\"*Math*\",Failing_Kids!$F73,1)),IF(ISERROR(SEARCH(\"*Calc*\",Failing_Kids!$F73,1)),IF(ISERROR(SEARCH(\"*Algebra*\",Failing_Kids!$F73,1)),\"\",\"X\"),\"X\"),\"X\"),\"X\")","v":""},{"$f":"IF(ISERROR(SEARCH(\"*Science*\",Failing_Kids!$F73,1)),IF(ISERROR(SEARCH(\"*Bio*\",Failing_Kids!$F73,1)),IF(ISERROR(SEARCH(\"*Chem*\",Failing_Kids!$F73,1)),IF(ISERROR(SEARCH(\"*Physics*\",Failing_Kids!$F73,1)),\"\",\"X\"),\"X\"),\"X\"),\"X\")","v":""},{"$f":"IF(ISERROR(SEARCH(\"*His*\",Failing_Kids!$F73,1)),IF(ISERROR(SEARCH(\"*GOV*\",Failing_Kids!$F73,1)),IF(ISERROR(SEARCH(\"*Econ*\",Failing_Kids!$F73,1)),IF(ISERROR(SEARCH(\"*Soc*\",Failing_Kids!$F73,1)),\"\",\"X\"),\"X\"),\"X\"),\"X\")","v":""},{"$f":"IF(ISERROR(SEARCH(\"*PE*\",Failing_Kids!$F73,1)),\"\",\"X\")","v":""}]
[{"$f":"Failing_Kids!C74","v":"Buckner"},{"$f":"Failing_Kids!D74","v":"Ruby"},{"$f":"IF(ISERROR(SEARCH(\"*English*\",Failing_Kids!F74,1)),\"\",\"X \")","v":""},{"$f":"IF(ISERROR(SEARCH(\"*Geometry*\",Failing_Kids!$F74,1)),IF(ISERROR(SEARCH(\"*Math*\",Failing_Kids!$F74,1)),IF(ISERROR(SEARCH(\"*Calc*\",Failing_Kids!$F74,1)),IF(ISERROR(SEARCH(\"*Algebra*\",Failing_Kids!$F74,1)),\"\",\"X\"),\"X\"),\"X\"),\"X\")","v":""},{"$f":"IF(ISERROR(SEARCH(\"*Science*\",Failing_Kids!$F74,1)),IF(ISERROR(SEARCH(\"*Bio*\",Failing_Kids!$F74,1)),IF(ISERROR(SEARCH(\"*Chem*\",Failing_Kids!$F74,1)),IF(ISERROR(SEARCH(\"*Physics*\",Failing_Kids!$F74,1)),\"\",\"X\"),\"X\"),\"X\"),\"X\")","v":""},{"$f":"IF(ISERROR(SEARCH(\"*His*\",Failing_Kids!$F74,1)),IF(ISERROR(SEARCH(\"*GOV*\",Failing_Kids!$F74,1)),IF(ISERROR(SEARCH(\"*Econ*\",Failing_Kids!$F74,1)),IF(ISERROR(SEARCH(\"*Soc*\",Failing_Kids!$F74,1)),\"\",\"X\"),\"X\"),\"X\"),\"X\")","v":"X"},{"$f":"IF(ISERROR(SEARCH(\"*PE*\",Failing_Kids!$F74,1)),\"\",\"X\")","v":""}]
[{"$f":"Failing_Kids!C75","v":"Bullock"},{"$f":"Failing_Kids!D75","v":"Holly"},{"$f":"IF(ISERROR(SEARCH(\"*English*\",Failing_Kids!F75,1)),\"\",\"X \")","v":""},{"$f":"IF(ISERROR(SEARCH(\"*Geometry*\",Failing_Kids!$F75,1)),IF(ISERROR(SEARCH(\"*Math*\",Failing_Kids!$F75,1)),IF(ISERROR(SEARCH(\"*Calc*\",Failing_Kids!$F75,1)),IF(ISERROR(SEARCH(\"*Algebra*\",Failing_Kids!$F75,1)),\"\",\"X\"),\"X\"),\"X\"),\"X\")","v":"X"},{"$f":"IF(ISERROR(SEARCH(\"*Science*\",Failing_Kids!$F75,1)),IF(ISERROR(SEARCH(\"*Bio*\",Failing_Kids!$F75,1)),IF(ISERROR(SEARCH(\"*Chem*\",Failing_Kids!$F75,1)),IF(ISERROR(SEARCH(\"*Physics*\",Failing_Kids!$F75,1)),\"\",\"X\"),\"X\"),\"X\"),\"X\")","v":""},{"$f":"IF(ISERROR(SEARCH(\"*His*\",Failing_Kids!$F75,1)),IF(ISERROR(SEARCH(\"*GOV*\",Failing_Kids!$F75,1)),IF(ISERROR(SEARCH(\"*Econ*\",Failing_Kids!$F75,1)),IF(ISERROR(SEARCH(\"*Soc*\",Failing_Kids!$F75,1)),\"\",\"X\"),\"X\"),\"X\"),\"X\")","v":""},{"$f":"IF(ISERROR(SEARCH(\"*PE*\",Failing_Kids!$F75,1)),\"\",\"X\")","v":""}]
[{"$f":"Failing_Kids!C76","v":"Burks"},{"$f":"Failing_Kids!D76","v":"Jacob"},{"$f":"IF(ISERROR(SEARCH(\"*English*\",Failing_Kids!F76,1)),\"\",\"X \")","v":""},{"$f":"IF(ISERROR(SEARCH(\"*Geometry*\",Failing_Kids!$F76,1)),IF(ISERROR(SEARCH(\"*Math*\",Failing_Kids!$F76,1)),IF(ISERROR(SEARCH(\"*Calc*\",Failing_Kids!$F76,1)),IF(ISERROR(SEARCH(\"*Algebra*\",Failing_Kids!$F76,1)),\"\",\"X\"),\"X\"),\"X\"),\"X\")","v":""},{"$f":"IF(ISERROR(SEARCH(\"*Science*\",Failing_Kids!$F76,1)),IF(ISERROR(SEARCH(\"*Bio*\",Failing_Kids!$F76,1)),IF(ISERROR(SEARCH(\"*Chem*\",Failing_Kids!$F76,1)),IF(ISERROR(SEARCH(\"*Physics*\",Failing_Kids!$F76,1)),\"\",\"X\"),\"X\"),\"X\"),\"X\")","v":""},{"$f":"IF(ISERROR(SEARCH(\"*His*\",Failing_Kids!$F76,1)),IF(ISERROR(SEARCH(\"*GOV*\",Failing_Kids!$F76,1)),IF(ISERROR(SEARCH(\"*Econ*\",Failing_Kids!$F76,1)),IF(ISERROR(SEARCH(\"*Soc*\",Failing_Kids!$F76,1)),\"\",\"X\"),\"X\"),\"X\"),\"X\")","v":""},{"$f":"IF(ISERROR(SEARCH(\"*PE*\",Failing_Kids!$F76,1)),\"\",\"X\")","v":""}]
[{"$f":"Failing_Kids!C77","v":"Burnett"},{"$f":"Failing_Kids!D77","v":"Lynn"},{"$f":"IF(ISERROR(SEARCH(\"*English*\",Failing_Kids!F77,1)),\"\",\"X \")","v":""},{"$f":"IF(ISERROR(SEARCH(\"*Geometry*\",Failing_Kids!$F77,1)),IF(ISERROR(SEARCH(\"*Math*\",Failing_Kids!$F77,1)),IF(ISERROR(SEARCH(\"*Calc*\",Failing_Kids!$F77,1)),IF(ISERROR(SEARCH(\"*Algebra*\",Failing_Kids!$F77,1)),\"\",\"X\"),\"X\"),\"X\"),\"X\")","v":""},{"$f":"IF(ISERROR(SEARCH(\"*Science*\",Failing_Kids!$F77,1)),IF(ISERROR(SEARCH(\"*Bio*\",Failing_Kids!$F77,1)),IF(ISERROR(SEARCH(\"*Chem*\",Failing_Kids!$F77,1)),IF(ISERROR(SEARCH(\"*Physics*\",Failing_Kids!$F77,1)),\"\",\"X\"),\"X\"),\"X\"),\"X\")","v":"X"},{"$f":"IF(ISERROR(SEARCH(\"*His*\",Failing_Kids!$F77,1)),IF(ISERROR(SEARCH(\"*GOV*\",Failing_Kids!$F77,1)),IF(ISERROR(SEARCH(\"*Econ*\",Failing_Kids!$F77,1)),IF(ISERROR(SEARCH(\"*Soc*\",Failing_Kids!$F77,1)),\"\",\"X\"),\"X\"),\"X\"),\"X\")","v":""},{"$f":"IF(ISERROR(SEARCH(\"*PE*\",Failing_Kids!$F77,1)),\"\",\"X\")","v":""}]
[{"$f":"Failing_Kids!C78","v":"Burnett"},{"$f":"Failing_Kids!D78","v":"Rodney"},{"$f":"IF(ISERROR(SEARCH(\"*English*\",Failing_Kids!F78,1)),\"\",\"X \")","v":""},{"$f":"IF(ISERROR(SEARCH(\"*Geometry*\",Failing_Kids!$F78,1)),IF(ISERROR(SEARCH(\"*Math*\",Failing_Kids!$F78,1)),IF(ISERROR(SEARCH(\"*Calc*\",Failing_Kids!$F78,1)),IF(ISERROR(SEARCH(\"*Algebra*\",Failing_Kids!$F78,1)),\"\",\"X\"),\"X\"),\"X\"),\"X\")","v":"X"},{"$f":"IF(ISERROR(SEARCH(\"*Science*\",Failing_Kids!$F78,1)),IF(ISERROR(SEARCH(\"*Bio*\",Failing_Kids!$F78,1)),IF(ISERROR(SEARCH(\"*Chem*\",Failing_Kids!$F78,1)),IF(ISERROR(SEARCH(\"*Physics*\",Failing_Kids!$F78,1)),\"\",\"X\"),\"X\"),\"X\"),\"X\")","v":""},{"$f":"IF(ISERROR(SEARCH(\"*His*\",Failing_Kids!$F78,1)),IF(ISERROR(SEARCH(\"*GOV*\",Failing_Kids!$F78,1)),IF(ISERROR(SEARCH(\"*Econ*\",Failing_Kids!$F78,1)),IF(ISERROR(SEARCH(\"*Soc*\",Failing_Kids!$F78,1)),\"\",\"X\"),\"X\"),\"X\"),\"X\")","v":""},{"$f":"IF(ISERROR(SEARCH(\"*PE*\",Failing_Kids!$F78,1)),\"\",\"X\")","v":""}]
[{"$f":"Failing_Kids!C79","v":"Bush"},{"$f":"Failing_Kids!D79","v":"Carol"},{"$f":"IF(ISERROR(SEARCH(\"*English*\",Failing_Kids!F79,1)),\"\",\"X \")","v":""},{"$f":"IF(ISERROR(SEARCH(\"*Geometry*\",Failing_Kids!$F79,1)),IF(ISERROR(SEARCH(\"*Math*\",Failing_Kids!$F79,1)),IF(ISERROR(SEARCH(\"*Calc*\",Failing_Kids!$F79,1)),IF(ISERROR(SEARCH(\"*Algebra*\",Failing_Kids!$F79,1)),\"\",\"X\"),\"X\"),\"X\"),\"X\")","v":""},{"$f":"IF(ISERROR(SEARCH(\"*Science*\",Failing_Kids!$F79,1)),IF(ISERROR(SEARCH(\"*Bio*\",Failing_Kids!$F79,1)),IF(ISERROR(SEARCH(\"*Chem*\",Failing_Kids!$F79,1)),IF(ISERROR(SEARCH(\"*Physics*\",Failing_Kids!$F79,1)),\"\",\"X\"),\"X\"),\"X\"),\"X\")","v":""},{"$f":"IF(ISERROR(SEARCH(\"*His*\",Failing_Kids!$F79,1)),IF(ISERROR(SEARCH(\"*GOV*\",Failing_Kids!$F79,1)),IF(ISERROR(SEARCH(\"*Econ*\",Failing_Kids!$F79,1)),IF(ISERROR(SEARCH(\"*Soc*\",Failing_Kids!$F79,1)),\"\",\"X\"),\"X\"),\"X\"),\"X\")","v":""},{"$f":"IF(ISERROR(SEARCH(\"*PE*\",Failing_Kids!$F79,1)),\"\",\"X\")","v":""}]
[{"$f":"Failing_Kids!C80","v":"Bush"},{"$f":"Failing_Kids!D80","v":"Carol"},{"$f":"IF(ISERROR(SEARCH(\"*English*\",Failing_Kids!F80,1)),\"\",\"X \")","v":""},{"$f":"IF(ISERROR(SEARCH(\"*Geometry*\",Failing_Kids!$F80,1)),IF(ISERROR(SEARCH(\"*Math*\",Failing_Kids!$F80,1)),IF(ISERROR(SEARCH(\"*Calc*\",Failing_Kids!$F80,1)),IF(ISERROR(SEARCH(\"*Algebra*\",Failing_Kids!$F80,1)),\"\",\"X\"),\"X\"),\"X\"),\"X\")","v":""},{"$f":"IF(ISERROR(SEARCH(\"*Science*\",Failing_Kids!$F80,1)),IF(ISERROR(SEARCH(\"*Bio*\",Failing_Kids!$F80,1)),IF(ISERROR(SEARCH(\"*Chem*\",Failing_Kids!$F80,1)),IF(ISERROR(SEARCH(\"*Physics*\",Failing_Kids!$F80,1)),\"\",\"X\"),\"X\"),\"X\"),\"X\")","v":""},{"$f":"IF(ISERROR(SEARCH(\"*His*\",Failing_Kids!$F80,1)),IF(ISERROR(SEARCH(\"*GOV*\",Failing_Kids!$F80,1)),IF(ISERROR(SEARCH(\"*Econ*\",Failing_Kids!$F80,1)),IF(ISERROR(SEARCH(\"*Soc*\",Failing_Kids!$F80,1)),\"\",\"X\"),\"X\"),\"X\"),\"X\")","v":""},{"$f":"IF(ISERROR(SEARCH(\"*PE*\",Failing_Kids!$F80,1)),\"\",\"X\")","v":""}]
[{"$f":"Failing_Kids!C81","v":"Callahan"},{"$f":"Failing_Kids!D81","v":"Arthur"},{"$f":"IF(ISERROR(SEARCH(\"*English*\",Failing_Kids!F81,1)),\"\",\"X \")","v":"X "},{"$f":"IF(ISERROR(SEARCH(\"*Geometry*\",Failing_Kids!$F81,1)),IF(ISERROR(SEARCH(\"*Math*\",Failing_Kids!$F81,1)),IF(ISERROR(SEARCH(\"*Calc*\",Failing_Kids!$F81,1)),IF(ISERROR(SEARCH(\"*Algebra*\",Failing_Kids!$F81,1)),\"\",\"X\"),\"X\"),\"X\"),\"X\")","v":""},{"$f":"IF(ISERROR(SEARCH(\"*Science*\",Failing_Kids!$F81,1)),IF(ISERROR(SEARCH(\"*Bio*\",Failing_Kids!$F81,1)),IF(ISERROR(SEARCH(\"*Chem*\",Failing_Kids!$F81,1)),IF(ISERROR(SEARCH(\"*Physics*\",Failing_Kids!$F81,1)),\"\",\"X\"),\"X\"),\"X\"),\"X\")","v":""},{"$f":"IF(ISERROR(SEARCH(\"*His*\",Failing_Kids!$F81,1)),IF(ISERROR(SEARCH(\"*GOV*\",Failing_Kids!$F81,1)),IF(ISERROR(SEARCH(\"*Econ*\",Failing_Kids!$F81,1)),IF(ISERROR(SEARCH(\"*Soc*\",Failing_Kids!$F81,1)),\"\",\"X\"),\"X\"),\"X\"),\"X\")","v":""},{"$f":"IF(ISERROR(SEARCH(\"*PE*\",Failing_Kids!$F81,1)),\"\",\"X\")","v":""}]
[{"$f":"Failing_Kids!C82","v":"Callahan"},{"$f":"Failing_Kids!D82","v":"Arthur"},{"$f":"IF(ISERROR(SEARCH(\"*English*\",Failing_Kids!F82,1)),\"\",\"X \")","v":""},{"$f":"IF(ISERROR(SEARCH(\"*Geometry*\",Failing_Kids!$F82,1)),IF(ISERROR(SEARCH(\"*Math*\",Failing_Kids!$F82,1)),IF(ISERROR(SEARCH(\"*Calc*\",Failing_Kids!$F82,1)),IF(ISERROR(SEARCH(\"*Algebra*\",Failing_Kids!$F82,1)),\"\",\"X\"),\"X\"),\"X\"),\"X\")","v":""},{"$f":"IF(ISERROR(SEARCH(\"*Science*\",Failing_Kids!$F82,1)),IF(ISERROR(SEARCH(\"*Bio*\",Failing_Kids!$F82,1)),IF(ISERROR(SEARCH(\"*Chem*\",Failing_Kids!$F82,1)),IF(ISERROR(SEARCH(\"*Physics*\",Failing_Kids!$F82,1)),\"\",\"X\"),\"X\"),\"X\"),\"X\")","v":""},{"$f":"IF(ISERROR(SEARCH(\"*His*\",Failing_Kids!$F82,1)),IF(ISERROR(SEARCH(\"*GOV*\",Failing_Kids!$F82,1)),IF(ISERROR(SEARCH(\"*Econ*\",Failing_Kids!$F82,1)),IF(ISERROR(SEARCH(\"*Soc*\",Failing_Kids!$F82,1)),\"\",\"X\"),\"X\"),\"X\"),\"X\")","v":"X"},{"$f":"IF(ISERROR(SEARCH(\"*PE*\",Failing_Kids!$F82,1)),\"\",\"X\")","v":""}]
[{"$f":"Failing_Kids!C83","v":"Camacho"},{"$f":"Failing_Kids!D83","v":"Crystal"},{"$f":"IF(ISERROR(SEARCH(\"*English*\",Failing_Kids!F83,1)),\"\",\"X \")","v":"X "},{"$f":"IF(ISERROR(SEARCH(\"*Geometry*\",Failing_Kids!$F83,1)),IF(ISERROR(SEARCH(\"*Math*\",Failing_Kids!$F83,1)),IF(ISERROR(SEARCH(\"*Calc*\",Failing_Kids!$F83,1)),IF(ISERROR(SEARCH(\"*Algebra*\",Failing_Kids!$F83,1)),\"\",\"X\"),\"X\"),\"X\"),\"X\")","v":""},{"$f":"IF(ISERROR(SEARCH(\"*Science*\",Failing_Kids!$F83,1)),IF(ISERROR(SEARCH(\"*Bio*\",Failing_Kids!$F83,1)),IF(ISERROR(SEARCH(\"*Chem*\",Failing_Kids!$F83,1)),IF(ISERROR(SEARCH(\"*Physics*\",Failing_Kids!$F83,1)),\"\",\"X\"),\"X\"),\"X\"),\"X\")","v":""},{"$f":"IF(ISERROR(SEARCH(\"*His*\",Failing_Kids!$F83,1)),IF(ISERROR(SEARCH(\"*GOV*\",Failing_Kids!$F83,1)),IF(ISERROR(SEARCH(\"*Econ*\",Failing_Kids!$F83,1)),IF(ISERROR(SEARCH(\"*Soc*\",Failing_Kids!$F83,1)),\"\",\"X\"),\"X\"),\"X\"),\"X\")","v":""},{"$f":"IF(ISERROR(SEARCH(\"*PE*\",Failing_Kids!$F83,1)),\"\",\"X\")","v":""}]
[{"$f":"Failing_Kids!C84","v":"Cantrell"},{"$f":"Failing_Kids!D84","v":"Russell"},{"$f":"IF(ISERROR(SEARCH(\"*English*\",Failing_Kids!F84,1)),\"\",\"X \")","v":""},{"$f":"IF(ISERROR(SEARCH(\"*Geometry*\",Failing_Kids!$F84,1)),IF(ISERROR(SEARCH(\"*Math*\",Failing_Kids!$F84,1)),IF(ISERROR(SEARCH(\"*Calc*\",Failing_Kids!$F84,1)),IF(ISERROR(SEARCH(\"*Algebra*\",Failing_Kids!$F84,1)),\"\",\"X\"),\"X\"),\"X\"),\"X\")","v":""},{"$f":"IF(ISERROR(SEARCH(\"*Science*\",Failing_Kids!$F84,1)),IF(ISERROR(SEARCH(\"*Bio*\",Failing_Kids!$F84,1)),IF(ISERROR(SEARCH(\"*Chem*\",Failing_Kids!$F84,1)),IF(ISERROR(SEARCH(\"*Physics*\",Failing_Kids!$F84,1)),\"\",\"X\"),\"X\"),\"X\"),\"X\")","v":""},{"$f":"IF(ISERROR(SEARCH(\"*His*\",Failing_Kids!$F84,1)),IF(ISERROR(SEARCH(\"*GOV*\",Failing_Kids!$F84,1)),IF(ISERROR(SEARCH(\"*Econ*\",Failing_Kids!$F84,1)),IF(ISERROR(SEARCH(\"*Soc*\",Failing_Kids!$F84,1)),\"\",\"X\"),\"X\"),\"X\"),\"X\")","v":"X"},{"$f":"IF(ISERROR(SEARCH(\"*PE*\",Failing_Kids!$F84,1)),\"\",\"X\")","v":""}]
[{"$f":"Failing_Kids!C85","v":"Cantu"},{"$f":"Failing_Kids!D85","v":"Cora"},{"$f":"IF(ISERROR(SEARCH(\"*English*\",Failing_Kids!F85,1)),\"\",\"X \")","v":""},{"$f":"IF(ISERROR(SEARCH(\"*Geometry*\",Failing_Kids!$F85,1)),IF(ISERROR(SEARCH(\"*Math*\",Failing_Kids!$F85,1)),IF(ISERROR(SEARCH(\"*Calc*\",Failing_Kids!$F85,1)),IF(ISERROR(SEARCH(\"*Algebra*\",Failing_Kids!$F85,1)),\"\",\"X\"),\"X\"),\"X\"),\"X\")","v":"X"},{"$f":"IF(ISERROR(SEARCH(\"*Science*\",Failing_Kids!$F85,1)),IF(ISERROR(SEARCH(\"*Bio*\",Failing_Kids!$F85,1)),IF(ISERROR(SEARCH(\"*Chem*\",Failing_Kids!$F85,1)),IF(ISERROR(SEARCH(\"*Physics*\",Failing_Kids!$F85,1)),\"\",\"X\"),\"X\"),\"X\"),\"X\")","v":""},{"$f":"IF(ISERROR(SEARCH(\"*His*\",Failing_Kids!$F85,1)),IF(ISERROR(SEARCH(\"*GOV*\",Failing_Kids!$F85,1)),IF(ISERROR(SEARCH(\"*Econ*\",Failing_Kids!$F85,1)),IF(ISERROR(SEARCH(\"*Soc*\",Failing_Kids!$F85,1)),\"\",\"X\"),\"X\"),\"X\"),\"X\")","v":""},{"$f":"IF(ISERROR(SEARCH(\"*PE*\",Failing_Kids!$F85,1)),\"\",\"X\")","v":""}]
[{"$f":"Failing_Kids!C86","v":"Cantu"},{"$f":"Failing_Kids!D86","v":"Terry"},{"$f":"IF(ISERROR(SEARCH(\"*English*\",Failing_Kids!F86,1)),\"\",\"X \")","v":""},{"$f":"IF(ISERROR(SEARCH(\"*Geometry*\",Failing_Kids!$F86,1)),IF(ISERROR(SEARCH(\"*Math*\",Failing_Kids!$F86,1)),IF(ISERROR(SEARCH(\"*Calc*\",Failing_Kids!$F86,1)),IF(ISERROR(SEARCH(\"*Algebra*\",Failing_Kids!$F86,1)),\"\",\"X\"),\"X\"),\"X\"),\"X\")","v":""},{"$f":"IF(ISERROR(SEARCH(\"*Science*\",Failing_Kids!$F86,1)),IF(ISERROR(SEARCH(\"*Bio*\",Failing_Kids!$F86,1)),IF(ISERROR(SEARCH(\"*Chem*\",Failing_Kids!$F86,1)),IF(ISERROR(SEARCH(\"*Physics*\",Failing_Kids!$F86,1)),\"\",\"X\"),\"X\"),\"X\"),\"X\")","v":"X"},{"$f":"IF(ISERROR(SEARCH(\"*His*\",Failing_Kids!$F86,1)),IF(ISERROR(SEARCH(\"*GOV*\",Failing_Kids!$F86,1)),IF(ISERROR(SEARCH(\"*Econ*\",Failing_Kids!$F86,1)),IF(ISERROR(SEARCH(\"*Soc*\",Failing_Kids!$F86,1)),\"\",\"X\"),\"X\"),\"X\"),\"X\")","v":""},{"$f":"IF(ISERROR(SEARCH(\"*PE*\",Failing_Kids!$F86,1)),\"\",\"X\")","v":""}]
[{"$f":"Failing_Kids!C87","v":"Cantu"},{"$f":"Failing_Kids!D87","v":"Terry"},{"$f":"IF(ISERROR(SEARCH(\"*English*\",Failing_Kids!F87,1)),\"\",\"X \")","v":"X "},{"$f":"IF(ISERROR(SEARCH(\"*Geometry*\",Failing_Kids!$F87,1)),IF(ISERROR(SEARCH(\"*Math*\",Failing_Kids!$F87,1)),IF(ISERROR(SEARCH(\"*Calc*\",Failing_Kids!$F87,1)),IF(ISERROR(SEARCH(\"*Algebra*\",Failing_Kids!$F87,1)),\"\",\"X\"),\"X\"),\"X\"),\"X\")","v":""},{"$f":"IF(ISERROR(SEARCH(\"*Science*\",Failing_Kids!$F87,1)),IF(ISERROR(SEARCH(\"*Bio*\",Failing_Kids!$F87,1)),IF(ISERROR(SEARCH(\"*Chem*\",Failing_Kids!$F87,1)),IF(ISERROR(SEARCH(\"*Physics*\",Failing_Kids!$F87,1)),\"\",\"X\"),\"X\"),\"X\"),\"X\")","v":""},{"$f":"IF(ISERROR(SEARCH(\"*His*\",Failing_Kids!$F87,1)),IF(ISERROR(SEARCH(\"*GOV*\",Failing_Kids!$F87,1)),IF(ISERROR(SEARCH(\"*Econ*\",Failing_Kids!$F87,1)),IF(ISERROR(SEARCH(\"*Soc*\",Failing_Kids!$F87,1)),\"\",\"X\"),\"X\"),\"X\"),\"X\")","v":""},{"$f":"IF(ISERROR(SEARCH(\"*PE*\",Failing_Kids!$F87,1)),\"\",\"X\")","v":""}]
[{"$f":"Failing_Kids!C88","v":"Carroll"},{"$f":"Failing_Kids!D88","v":"Anthony"},{"$f":"IF(ISERROR(SEARCH(\"*English*\",Failing_Kids!F88,1)),\"\",\"X \")","v":""},{"$f":"IF(ISERROR(SEARCH(\"*Geometry*\",Failing_Kids!$F88,1)),IF(ISERROR(SEARCH(\"*Math*\",Failing_Kids!$F88,1)),IF(ISERROR(SEARCH(\"*Calc*\",Failing_Kids!$F88,1)),IF(ISERROR(SEARCH(\"*Algebra*\",Failing_Kids!$F88,1)),\"\",\"X\"),\"X\"),\"X\"),\"X\")","v":""},{"$f":"IF(ISERROR(SEARCH(\"*Science*\",Failing_Kids!$F88,1)),IF(ISERROR(SEARCH(\"*Bio*\",Failing_Kids!$F88,1)),IF(ISERROR(SEARCH(\"*Chem*\",Failing_Kids!$F88,1)),IF(ISERROR(SEARCH(\"*Physics*\",Failing_Kids!$F88,1)),\"\",\"X\"),\"X\"),\"X\"),\"X\")","v":""},{"$f":"IF(ISERROR(SEARCH(\"*His*\",Failing_Kids!$F88,1)),IF(ISERROR(SEARCH(\"*GOV*\",Failing_Kids!$F88,1)),IF(ISERROR(SEARCH(\"*Econ*\",Failing_Kids!$F88,1)),IF(ISERROR(SEARCH(\"*Soc*\",Failing_Kids!$F88,1)),\"\",\"X\"),\"X\"),\"X\"),\"X\")","v":""},{"$f":"IF(ISERROR(SEARCH(\"*PE*\",Failing_Kids!$F88,1)),\"\",\"X\")","v":""}]
[{"$f":"Failing_Kids!C89","v":"Casey"},{"$f":"Failing_Kids!D89","v":"Allison"},{"$f":"IF(ISERROR(SEARCH(\"*English*\",Failing_Kids!F89,1)),\"\",\"X \")","v":""},{"$f":"IF(ISERROR(SEARCH(\"*Geometry*\",Failing_Kids!$F89,1)),IF(ISERROR(SEARCH(\"*Math*\",Failing_Kids!$F89,1)),IF(ISERROR(SEARCH(\"*Calc*\",Failing_Kids!$F89,1)),IF(ISERROR(SEARCH(\"*Algebra*\",Failing_Kids!$F89,1)),\"\",\"X\"),\"X\"),\"X\"),\"X\")","v":"X"},{"$f":"IF(ISERROR(SEARCH(\"*Science*\",Failing_Kids!$F89,1)),IF(ISERROR(SEARCH(\"*Bio*\",Failing_Kids!$F89,1)),IF(ISERROR(SEARCH(\"*Chem*\",Failing_Kids!$F89,1)),IF(ISERROR(SEARCH(\"*Physics*\",Failing_Kids!$F89,1)),\"\",\"X\"),\"X\"),\"X\"),\"X\")","v":""},{"$f":"IF(ISERROR(SEARCH(\"*His*\",Failing_Kids!$F89,1)),IF(ISERROR(SEARCH(\"*GOV*\",Failing_Kids!$F89,1)),IF(ISERROR(SEARCH(\"*Econ*\",Failing_Kids!$F89,1)),IF(ISERROR(SEARCH(\"*Soc*\",Failing_Kids!$F89,1)),\"\",\"X\"),\"X\"),\"X\"),\"X\")","v":""},{"$f":"IF(ISERROR(SEARCH(\"*PE*\",Failing_Kids!$F89,1)),\"\",\"X\")","v":""}]
[{"$f":"Failing_Kids!C90","v":"Castaneda"},{"$f":"Failing_Kids!D90","v":"Kimberly"},{"$f":"IF(ISERROR(SEARCH(\"*English*\",Failing_Kids!F90,1)),\"\",\"X \")","v":"X "},{"$f":"IF(ISERROR(SEARCH(\"*Geometry*\",Failing_Kids!$F90,1)),IF(ISERROR(SEARCH(\"*Math*\",Failing_Kids!$F90,1)),IF(ISERROR(SEARCH(\"*Calc*\",Failing_Kids!$F90,1)),IF(ISERROR(SEARCH(\"*Algebra*\",Failing_Kids!$F90,1)),\"\",\"X\"),\"X\"),\"X\"),\"X\")","v":""},{"$f":"IF(ISERROR(SEARCH(\"*Science*\",Failing_Kids!$F90,1)),IF(ISERROR(SEARCH(\"*Bio*\",Failing_Kids!$F90,1)),IF(ISERROR(SEARCH(\"*Chem*\",Failing_Kids!$F90,1)),IF(ISERROR(SEARCH(\"*Physics*\",Failing_Kids!$F90,1)),\"\",\"X\"),\"X\"),\"X\"),\"X\")","v":""},{"$f":"IF(ISERROR(SEARCH(\"*His*\",Failing_Kids!$F90,1)),IF(ISERROR(SEARCH(\"*GOV*\",Failing_Kids!$F90,1)),IF(ISERROR(SEARCH(\"*Econ*\",Failing_Kids!$F90,1)),IF(ISERROR(SEARCH(\"*Soc*\",Failing_Kids!$F90,1)),\"\",\"X\"),\"X\"),\"X\"),\"X\")","v":""},{"$f":"IF(ISERROR(SEARCH(\"*PE*\",Failing_Kids!$F90,1)),\"\",\"X\")","v":""}]
[{"$f":"Failing_Kids!C91","v":"Castaneda"},{"$f":"Failing_Kids!D91","v":"Kimberly"},{"$f":"IF(ISERROR(SEARCH(\"*English*\",Failing_Kids!F91,1)),\"\",\"X \")","v":""},{"$f":"IF(ISERROR(SEARCH(\"*Geometry*\",Failing_Kids!$F91,1)),IF(ISERROR(SEARCH(\"*Math*\",Failing_Kids!$F91,1)),IF(ISERROR(SEARCH(\"*Calc*\",Failing_Kids!$F91,1)),IF(ISERROR(SEARCH(\"*Algebra*\",Failing_Kids!$F91,1)),\"\",\"X\"),\"X\"),\"X\"),\"X\")","v":"X"},{"$f":"IF(ISERROR(SEARCH(\"*Science*\",Failing_Kids!$F91,1)),IF(ISERROR(SEARCH(\"*Bio*\",Failing_Kids!$F91,1)),IF(ISERROR(SEARCH(\"*Chem*\",Failing_Kids!$F91,1)),IF(ISERROR(SEARCH(\"*Physics*\",Failing_Kids!$F91,1)),\"\",\"X\"),\"X\"),\"X\"),\"X\")","v":""},{"$f":"IF(ISERROR(SEARCH(\"*His*\",Failing_Kids!$F91,1)),IF(ISERROR(SEARCH(\"*GOV*\",Failing_Kids!$F91,1)),IF(ISERROR(SEARCH(\"*Econ*\",Failing_Kids!$F91,1)),IF(ISERROR(SEARCH(\"*Soc*\",Failing_Kids!$F91,1)),\"\",\"X\"),\"X\"),\"X\"),\"X\")","v":""},{"$f":"IF(ISERROR(SEARCH(\"*PE*\",Failing_Kids!$F91,1)),\"\",\"X\")","v":""}]
[{"$f":"Failing_Kids!C92","v":"Castro"},{"$f":"Failing_Kids!D92","v":"Mildred"},{"$f":"IF(ISERROR(SEARCH(\"*English*\",Failing_Kids!F92,1)),\"\",\"X \")","v":""},{"$f":"IF(ISERROR(SEARCH(\"*Geometry*\",Failing_Kids!$F92,1)),IF(ISERROR(SEARCH(\"*Math*\",Failing_Kids!$F92,1)),IF(ISERROR(SEARCH(\"*Calc*\",Failing_Kids!$F92,1)),IF(ISERROR(SEARCH(\"*Algebra*\",Failing_Kids!$F92,1)),\"\",\"X\"),\"X\"),\"X\"),\"X\")","v":"X"},{"$f":"IF(ISERROR(SEARCH(\"*Science*\",Failing_Kids!$F92,1)),IF(ISERROR(SEARCH(\"*Bio*\",Failing_Kids!$F92,1)),IF(ISERROR(SEARCH(\"*Chem*\",Failing_Kids!$F92,1)),IF(ISERROR(SEARCH(\"*Physics*\",Failing_Kids!$F92,1)),\"\",\"X\"),\"X\"),\"X\"),\"X\")","v":""},{"$f":"IF(ISERROR(SEARCH(\"*His*\",Failing_Kids!$F92,1)),IF(ISERROR(SEARCH(\"*GOV*\",Failing_Kids!$F92,1)),IF(ISERROR(SEARCH(\"*Econ*\",Failing_Kids!$F92,1)),IF(ISERROR(SEARCH(\"*Soc*\",Failing_Kids!$F92,1)),\"\",\"X\"),\"X\"),\"X\"),\"X\")","v":""},{"$f":"IF(ISERROR(SEARCH(\"*PE*\",Failing_Kids!$F92,1)),\"\",\"X\")","v":""}]
[{"$f":"Failing_Kids!C93","v":"Chandler"},{"$f":"Failing_Kids!D93","v":"Jeannette"},{"$f":"IF(ISERROR(SEARCH(\"*English*\",Failing_Kids!F93,1)),\"\",\"X \")","v":""},{"$f":"IF(ISERROR(SEARCH(\"*Geometry*\",Failing_Kids!$F93,1)),IF(ISERROR(SEARCH(\"*Math*\",Failing_Kids!$F93,1)),IF(ISERROR(SEARCH(\"*Calc*\",Failing_Kids!$F93,1)),IF(ISERROR(SEARCH(\"*Algebra*\",Failing_Kids!$F93,1)),\"\",\"X\"),\"X\"),\"X\"),\"X\")","v":""},{"$f":"IF(ISERROR(SEARCH(\"*Science*\",Failing_Kids!$F93,1)),IF(ISERROR(SEARCH(\"*Bio*\",Failing_Kids!$F93,1)),IF(ISERROR(SEARCH(\"*Chem*\",Failing_Kids!$F93,1)),IF(ISERROR(SEARCH(\"*Physics*\",Failing_Kids!$F93,1)),\"\",\"X\"),\"X\"),\"X\"),\"X\")","v":""},{"$f":"IF(ISERROR(SEARCH(\"*His*\",Failing_Kids!$F93,1)),IF(ISERROR(SEARCH(\"*GOV*\",Failing_Kids!$F93,1)),IF(ISERROR(SEARCH(\"*Econ*\",Failing_Kids!$F93,1)),IF(ISERROR(SEARCH(\"*Soc*\",Failing_Kids!$F93,1)),\"\",\"X\"),\"X\"),\"X\"),\"X\")","v":""},{"$f":"IF(ISERROR(SEARCH(\"*PE*\",Failing_Kids!$F93,1)),\"\",\"X\")","v":""}]
[{"$f":"Failing_Kids!C94","v":"Chandler"},{"$f":"Failing_Kids!D94","v":"Jeannette"},{"$f":"IF(ISERROR(SEARCH(\"*English*\",Failing_Kids!F94,1)),\"\",\"X \")","v":""},{"$f":"IF(ISERROR(SEARCH(\"*Geometry*\",Failing_Kids!$F94,1)),IF(ISERROR(SEARCH(\"*Math*\",Failing_Kids!$F94,1)),IF(ISERROR(SEARCH(\"*Calc*\",Failing_Kids!$F94,1)),IF(ISERROR(SEARCH(\"*Algebra*\",Failing_Kids!$F94,1)),\"\",\"X\"),\"X\"),\"X\"),\"X\")","v":"X"},{"$f":"IF(ISERROR(SEARCH(\"*Science*\",Failing_Kids!$F94,1)),IF(ISERROR(SEARCH(\"*Bio*\",Failing_Kids!$F94,1)),IF(ISERROR(SEARCH(\"*Chem*\",Failing_Kids!$F94,1)),IF(ISERROR(SEARCH(\"*Physics*\",Failing_Kids!$F94,1)),\"\",\"X\"),\"X\"),\"X\"),\"X\")","v":""},{"$f":"IF(ISERROR(SEARCH(\"*His*\",Failing_Kids!$F94,1)),IF(ISERROR(SEARCH(\"*GOV*\",Failing_Kids!$F94,1)),IF(ISERROR(SEARCH(\"*Econ*\",Failing_Kids!$F94,1)),IF(ISERROR(SEARCH(\"*Soc*\",Failing_Kids!$F94,1)),\"\",\"X\"),\"X\"),\"X\"),\"X\")","v":""},{"$f":"IF(ISERROR(SEARCH(\"*PE*\",Failing_Kids!$F94,1)),\"\",\"X\")","v":""}]
[{"$f":"Failing_Kids!C95","v":"Chaney"},{"$f":"Failing_Kids!D95","v":"Dale"},{"$f":"IF(ISERROR(SEARCH(\"*English*\",Failing_Kids!F95,1)),\"\",\"X \")","v":""},{"$f":"IF(ISERROR(SEARCH(\"*Geometry*\",Failing_Kids!$F95,1)),IF(ISERROR(SEARCH(\"*Math*\",Failing_Kids!$F95,1)),IF(ISERROR(SEARCH(\"*Calc*\",Failing_Kids!$F95,1)),IF(ISERROR(SEARCH(\"*Algebra*\",Failing_Kids!$F95,1)),\"\",\"X\"),\"X\"),\"X\"),\"X\")","v":"X"},{"$f":"IF(ISERROR(SEARCH(\"*Science*\",Failing_Kids!$F95,1)),IF(ISERROR(SEARCH(\"*Bio*\",Failing_Kids!$F95,1)),IF(ISERROR(SEARCH(\"*Chem*\",Failing_Kids!$F95,1)),IF(ISERROR(SEARCH(\"*Physics*\",Failing_Kids!$F95,1)),\"\",\"X\"),\"X\"),\"X\"),\"X\")","v":""},{"$f":"IF(ISERROR(SEARCH(\"*His*\",Failing_Kids!$F95,1)),IF(ISERROR(SEARCH(\"*GOV*\",Failing_Kids!$F95,1)),IF(ISERROR(SEARCH(\"*Econ*\",Failing_Kids!$F95,1)),IF(ISERROR(SEARCH(\"*Soc*\",Failing_Kids!$F95,1)),\"\",\"X\"),\"X\"),\"X\"),\"X\")","v":""},{"$f":"IF(ISERROR(SEARCH(\"*PE*\",Failing_Kids!$F95,1)),\"\",\"X\")","v":""}]
[{"$f":"Failing_Kids!C96","v":"Chapman"},{"$f":"Failing_Kids!D96","v":"Joseph"},{"$f":"IF(ISERROR(SEARCH(\"*English*\",Failing_Kids!F96,1)),\"\",\"X \")","v":"X "},{"$f":"IF(ISERROR(SEARCH(\"*Geometry*\",Failing_Kids!$F96,1)),IF(ISERROR(SEARCH(\"*Math*\",Failing_Kids!$F96,1)),IF(ISERROR(SEARCH(\"*Calc*\",Failing_Kids!$F96,1)),IF(ISERROR(SEARCH(\"*Algebra*\",Failing_Kids!$F96,1)),\"\",\"X\"),\"X\"),\"X\"),\"X\")","v":""},{"$f":"IF(ISERROR(SEARCH(\"*Science*\",Failing_Kids!$F96,1)),IF(ISERROR(SEARCH(\"*Bio*\",Failing_Kids!$F96,1)),IF(ISERROR(SEARCH(\"*Chem*\",Failing_Kids!$F96,1)),IF(ISERROR(SEARCH(\"*Physics*\",Failing_Kids!$F96,1)),\"\",\"X\"),\"X\"),\"X\"),\"X\")","v":""},{"$f":"IF(ISERROR(SEARCH(\"*His*\",Failing_Kids!$F96,1)),IF(ISERROR(SEARCH(\"*GOV*\",Failing_Kids!$F96,1)),IF(ISERROR(SEARCH(\"*Econ*\",Failing_Kids!$F96,1)),IF(ISERROR(SEARCH(\"*Soc*\",Failing_Kids!$F96,1)),\"\",\"X\"),\"X\"),\"X\"),\"X\")","v":""},{"$f":"IF(ISERROR(SEARCH(\"*PE*\",Failing_Kids!$F96,1)),\"\",\"X\")","v":""}]
[{"$f":"Failing_Kids!C97","v":"Clemons"},{"$f":"Failing_Kids!D97","v":"Jennifer"},{"$f":"IF(ISERROR(SEARCH(\"*English*\",Failing_Kids!F97,1)),\"\",\"X \")","v":""},{"$f":"IF(ISERROR(SEARCH(\"*Geometry*\",Failing_Kids!$F97,1)),IF(ISERROR(SEARCH(\"*Math*\",Failing_Kids!$F97,1)),IF(ISERROR(SEARCH(\"*Calc*\",Failing_Kids!$F97,1)),IF(ISERROR(SEARCH(\"*Algebra*\",Failing_Kids!$F97,1)),\"\",\"X\"),\"X\"),\"X\"),\"X\")","v":""},{"$f":"IF(ISERROR(SEARCH(\"*Science*\",Failing_Kids!$F97,1)),IF(ISERROR(SEARCH(\"*Bio*\",Failing_Kids!$F97,1)),IF(ISERROR(SEARCH(\"*Chem*\",Failing_Kids!$F97,1)),IF(ISERROR(SEARCH(\"*Physics*\",Failing_Kids!$F97,1)),\"\",\"X\"),\"X\"),\"X\"),\"X\")","v":""},{"$f":"IF(ISERROR(SEARCH(\"*His*\",Failing_Kids!$F97,1)),IF(ISERROR(SEARCH(\"*GOV*\",Failing_Kids!$F97,1)),IF(ISERROR(SEARCH(\"*Econ*\",Failing_Kids!$F97,1)),IF(ISERROR(SEARCH(\"*Soc*\",Failing_Kids!$F97,1)),\"\",\"X\"),\"X\"),\"X\"),\"X\")","v":""},{"$f":"IF(ISERROR(SEARCH(\"*PE*\",Failing_Kids!$F97,1)),\"\",\"X\")","v":""}]
[{"$f":"Failing_Kids!C98","v":"Clemons"},{"$f":"Failing_Kids!D98","v":"Jennifer"},{"$f":"IF(ISERROR(SEARCH(\"*English*\",Failing_Kids!F98,1)),\"\",\"X \")","v":""},{"$f":"IF(ISERROR(SEARCH(\"*Geometry*\",Failing_Kids!$F98,1)),IF(ISERROR(SEARCH(\"*Math*\",Failing_Kids!$F98,1)),IF(ISERROR(SEARCH(\"*Calc*\",Failing_Kids!$F98,1)),IF(ISERROR(SEARCH(\"*Algebra*\",Failing_Kids!$F98,1)),\"\",\"X\"),\"X\"),\"X\"),\"X\")","v":"X"},{"$f":"IF(ISERROR(SEARCH(\"*Science*\",Failing_Kids!$F98,1)),IF(ISERROR(SEARCH(\"*Bio*\",Failing_Kids!$F98,1)),IF(ISERROR(SEARCH(\"*Chem*\",Failing_Kids!$F98,1)),IF(ISERROR(SEARCH(\"*Physics*\",Failing_Kids!$F98,1)),\"\",\"X\"),\"X\"),\"X\"),\"X\")","v":""},{"$f":"IF(ISERROR(SEARCH(\"*His*\",Failing_Kids!$F98,1)),IF(ISERROR(SEARCH(\"*GOV*\",Failing_Kids!$F98,1)),IF(ISERROR(SEARCH(\"*Econ*\",Failing_Kids!$F98,1)),IF(ISERROR(SEARCH(\"*Soc*\",Failing_Kids!$F98,1)),\"\",\"X\"),\"X\"),\"X\"),\"X\")","v":""},{"$f":"IF(ISERROR(SEARCH(\"*PE*\",Failing_Kids!$F98,1)),\"\",\"X\")","v":""}]
[{"$f":"Failing_Kids!C99","v":"Clemons"},{"$f":"Failing_Kids!D99","v":"Jennifer"},{"$f":"IF(ISERROR(SEARCH(\"*English*\",Failing_Kids!F99,1)),\"\",\"X \")","v":""},{"$f":"IF(ISERROR(SEARCH(\"*Geometry*\",Failing_Kids!$F99,1)),IF(ISERROR(SEARCH(\"*Math*\",Failing_Kids!$F99,1)),IF(ISERROR(SEARCH(\"*Calc*\",Failing_Kids!$F99,1)),IF(ISERROR(SEARCH(\"*Algebra*\",Failing_Kids!$F99,1)),\"\",\"X\"),\"X\"),\"X\"),\"X\")","v":""},{"$f":"IF(ISERROR(SEARCH(\"*Science*\",Failing_Kids!$F99,1)),IF(ISERROR(SEARCH(\"*Bio*\",Failing_Kids!$F99,1)),IF(ISERROR(SEARCH(\"*Chem*\",Failing_Kids!$F99,1)),IF(ISERROR(SEARCH(\"*Physics*\",Failing_Kids!$F99,1)),\"\",\"X\"),\"X\"),\"X\"),\"X\")","v":"X"},{"$f":"IF(ISERROR(SEARCH(\"*His*\",Failing_Kids!$F99,1)),IF(ISERROR(SEARCH(\"*GOV*\",Failing_Kids!$F99,1)),IF(ISERROR(SEARCH(\"*Econ*\",Failing_Kids!$F99,1)),IF(ISERROR(SEARCH(\"*Soc*\",Failing_Kids!$F99,1)),\"\",\"X\"),\"X\"),\"X\"),\"X\")","v":""},{"$f":"IF(ISERROR(SEARCH(\"*PE*\",Failing_Kids!$F99,1)),\"\",\"X\")","v":""}]
[{"$f":"Failing_Kids!C100","v":"Clemons"},{"$f":"Failing_Kids!D100","v":"Theresa"},{"$f":"IF(ISERROR(SEARCH(\"*English*\",Failing_Kids!F100,1)),\"\",\"X \")","v":""},{"$f":"IF(ISERROR(SEARCH(\"*Geometry*\",Failing_Kids!$F100,1)),IF(ISERROR(SEARCH(\"*Math*\",Failing_Kids!$F100,1)),IF(ISERROR(SEARCH(\"*Calc*\",Failing_Kids!$F100,1)),IF(ISERROR(SEARCH(\"*Algebra*\",Failing_Kids!$F100,1)),\"\",\"X\"),\"X\"),\"X\"),\"X\")","v":"X"},{"$f":"IF(ISERROR(SEARCH(\"*Science*\",Failing_Kids!$F100,1)),IF(ISERROR(SEARCH(\"*Bio*\",Failing_Kids!$F100,1)),IF(ISERROR(SEARCH(\"*Chem*\",Failing_Kids!$F100,1)),IF(ISERROR(SEARCH(\"*Physics*\",Failing_Kids!$F100,1)),\"\",\"X\"),\"X\"),\"X\"),\"X\")","v":""},{"$f":"IF(ISERROR(SEARCH(\"*His*\",Failing_Kids!$F100,1)),IF(ISERROR(SEARCH(\"*GOV*\",Failing_Kids!$F100,1)),IF(ISERROR(SEARCH(\"*Econ*\",Failing_Kids!$F100,1)),IF(ISERROR(SEARCH(\"*Soc*\",Failing_Kids!$F100,1)),\"\",\"X\"),\"X\"),\"X\"),\"X\")","v":""},{"$f":"IF(ISERROR(SEARCH(\"*PE*\",Failing_Kids!$F100,1)),\"\",\"X\")","v":""}]
[{"$f":"Failing_Kids!C101","v":"Cochran"},{"$f":"Failing_Kids!D101","v":"Marjorie"},{"$f":"IF(ISERROR(SEARCH(\"*English*\",Failing_Kids!F101,1)),\"\",\"X \")","v":""},{"$f":"IF(ISERROR(SEARCH(\"*Geometry*\",Failing_Kids!$F101,1)),IF(ISERROR(SEARCH(\"*Math*\",Failing_Kids!$F101,1)),IF(ISERROR(SEARCH(\"*Calc*\",Failing_Kids!$F101,1)),IF(ISERROR(SEARCH(\"*Algebra*\",Failing_Kids!$F101,1)),\"\",\"X\"),\"X\"),\"X\"),\"X\")","v":"X"},{"$f":"IF(ISERROR(SEARCH(\"*Science*\",Failing_Kids!$F101,1)),IF(ISERROR(SEARCH(\"*Bio*\",Failing_Kids!$F101,1)),IF(ISERROR(SEARCH(\"*Chem*\",Failing_Kids!$F101,1)),IF(ISERROR(SEARCH(\"*Physics*\",Failing_Kids!$F101,1)),\"\",\"X\"),\"X\"),\"X\"),\"X\")","v":""},{"$f":"IF(ISERROR(SEARCH(\"*His*\",Failing_Kids!$F101,1)),IF(ISERROR(SEARCH(\"*GOV*\",Failing_Kids!$F101,1)),IF(ISERROR(SEARCH(\"*Econ*\",Failing_Kids!$F101,1)),IF(ISERROR(SEARCH(\"*Soc*\",Failing_Kids!$F101,1)),\"\",\"X\"),\"X\"),\"X\"),\"X\")","v":""},{"$f":"IF(ISERROR(SEARCH(\"*PE*\",Failing_Kids!$F101,1)),\"\",\"X\")","v":""}]
[{"$f":"Failing_Kids!C102","v":"Cochran"},{"$f":"Failing_Kids!D102","v":"Marjorie"},{"$f":"IF(ISERROR(SEARCH(\"*English*\",Failing_Kids!F102,1)),\"\",\"X \")","v":""},{"$f":"IF(ISERROR(SEARCH(\"*Geometry*\",Failing_Kids!$F102,1)),IF(ISERROR(SEARCH(\"*Math*\",Failing_Kids!$F102,1)),IF(ISERROR(SEARCH(\"*Calc*\",Failing_Kids!$F102,1)),IF(ISERROR(SEARCH(\"*Algebra*\",Failing_Kids!$F102,1)),\"\",\"X\"),\"X\"),\"X\"),\"X\")","v":""},{"$f":"IF(ISERROR(SEARCH(\"*Science*\",Failing_Kids!$F102,1)),IF(ISERROR(SEARCH(\"*Bio*\",Failing_Kids!$F102,1)),IF(ISERROR(SEARCH(\"*Chem*\",Failing_Kids!$F102,1)),IF(ISERROR(SEARCH(\"*Physics*\",Failing_Kids!$F102,1)),\"\",\"X\"),\"X\"),\"X\"),\"X\")","v":""},{"$f":"IF(ISERROR(SEARCH(\"*His*\",Failing_Kids!$F102,1)),IF(ISERROR(SEARCH(\"*GOV*\",Failing_Kids!$F102,1)),IF(ISERROR(SEARCH(\"*Econ*\",Failing_Kids!$F102,1)),IF(ISERROR(SEARCH(\"*Soc*\",Failing_Kids!$F102,1)),\"\",\"X\"),\"X\"),\"X\"),\"X\")","v":""},{"$f":"IF(ISERROR(SEARCH(\"*PE*\",Failing_Kids!$F102,1)),\"\",\"X\")","v":""}]
[{"$f":"Failing_Kids!C103","v":"Cole"},{"$f":"Failing_Kids!D103","v":"Andrew"},{"$f":"IF(ISERROR(SEARCH(\"*English*\",Failing_Kids!F103,1)),\"\",\"X \")","v":""},{"$f":"IF(ISERROR(SEARCH(\"*Geometry*\",Failing_Kids!$F103,1)),IF(ISERROR(SEARCH(\"*Math*\",Failing_Kids!$F103,1)),IF(ISERROR(SEARCH(\"*Calc*\",Failing_Kids!$F103,1)),IF(ISERROR(SEARCH(\"*Algebra*\",Failing_Kids!$F103,1)),\"\",\"X\"),\"X\"),\"X\"),\"X\")","v":""},{"$f":"IF(ISERROR(SEARCH(\"*Science*\",Failing_Kids!$F103,1)),IF(ISERROR(SEARCH(\"*Bio*\",Failing_Kids!$F103,1)),IF(ISERROR(SEARCH(\"*Chem*\",Failing_Kids!$F103,1)),IF(ISERROR(SEARCH(\"*Physics*\",Failing_Kids!$F103,1)),\"\",\"X\"),\"X\"),\"X\"),\"X\")","v":""},{"$f":"IF(ISERROR(SEARCH(\"*His*\",Failing_Kids!$F103,1)),IF(ISERROR(SEARCH(\"*GOV*\",Failing_Kids!$F103,1)),IF(ISERROR(SEARCH(\"*Econ*\",Failing_Kids!$F103,1)),IF(ISERROR(SEARCH(\"*Soc*\",Failing_Kids!$F103,1)),\"\",\"X\"),\"X\"),\"X\"),\"X\")","v":""},{"$f":"IF(ISERROR(SEARCH(\"*PE*\",Failing_Kids!$F103,1)),\"\",\"X\")","v":""}]
[{"$f":"Failing_Kids!C104","v":"Cole"},{"$f":"Failing_Kids!D104","v":"Andrew"},{"$f":"IF(ISERROR(SEARCH(\"*English*\",Failing_Kids!F104,1)),\"\",\"X \")","v":""},{"$f":"IF(ISERROR(SEARCH(\"*Geometry*\",Failing_Kids!$F104,1)),IF(ISERROR(SEARCH(\"*Math*\",Failing_Kids!$F104,1)),IF(ISERROR(SEARCH(\"*Calc*\",Failing_Kids!$F104,1)),IF(ISERROR(SEARCH(\"*Algebra*\",Failing_Kids!$F104,1)),\"\",\"X\"),\"X\"),\"X\"),\"X\")","v":""},{"$f":"IF(ISERROR(SEARCH(\"*Science*\",Failing_Kids!$F104,1)),IF(ISERROR(SEARCH(\"*Bio*\",Failing_Kids!$F104,1)),IF(ISERROR(SEARCH(\"*Chem*\",Failing_Kids!$F104,1)),IF(ISERROR(SEARCH(\"*Physics*\",Failing_Kids!$F104,1)),\"\",\"X\"),\"X\"),\"X\"),\"X\")","v":"X"},{"$f":"IF(ISERROR(SEARCH(\"*His*\",Failing_Kids!$F104,1)),IF(ISERROR(SEARCH(\"*GOV*\",Failing_Kids!$F104,1)),IF(ISERROR(SEARCH(\"*Econ*\",Failing_Kids!$F104,1)),IF(ISERROR(SEARCH(\"*Soc*\",Failing_Kids!$F104,1)),\"\",\"X\"),\"X\"),\"X\"),\"X\")","v":""},{"$f":"IF(ISERROR(SEARCH(\"*PE*\",Failing_Kids!$F104,1)),\"\",\"X\")","v":""}]
[{"$f":"Failing_Kids!C105","v":"Cole"},{"$f":"Failing_Kids!D105","v":"Emma"},{"$f":"IF(ISERROR(SEARCH(\"*English*\",Failing_Kids!F105,1)),\"\",\"X \")","v":""},{"$f":"IF(ISERROR(SEARCH(\"*Geometry*\",Failing_Kids!$F105,1)),IF(ISERROR(SEARCH(\"*Math*\",Failing_Kids!$F105,1)),IF(ISERROR(SEARCH(\"*Calc*\",Failing_Kids!$F105,1)),IF(ISERROR(SEARCH(\"*Algebra*\",Failing_Kids!$F105,1)),\"\",\"X\"),\"X\"),\"X\"),\"X\")","v":"X"},{"$f":"IF(ISERROR(SEARCH(\"*Science*\",Failing_Kids!$F105,1)),IF(ISERROR(SEARCH(\"*Bio*\",Failing_Kids!$F105,1)),IF(ISERROR(SEARCH(\"*Chem*\",Failing_Kids!$F105,1)),IF(ISERROR(SEARCH(\"*Physics*\",Failing_Kids!$F105,1)),\"\",\"X\"),\"X\"),\"X\"),\"X\")","v":""},{"$f":"IF(ISERROR(SEARCH(\"*His*\",Failing_Kids!$F105,1)),IF(ISERROR(SEARCH(\"*GOV*\",Failing_Kids!$F105,1)),IF(ISERROR(SEARCH(\"*Econ*\",Failing_Kids!$F105,1)),IF(ISERROR(SEARCH(\"*Soc*\",Failing_Kids!$F105,1)),\"\",\"X\"),\"X\"),\"X\"),\"X\")","v":""},{"$f":"IF(ISERROR(SEARCH(\"*PE*\",Failing_Kids!$F105,1)),\"\",\"X\")","v":""}]
[{"$f":"Failing_Kids!C106","v":"Cole"},{"$f":"Failing_Kids!D106","v":"Emma"},{"$f":"IF(ISERROR(SEARCH(\"*English*\",Failing_Kids!F106,1)),\"\",\"X \")","v":""},{"$f":"IF(ISERROR(SEARCH(\"*Geometry*\",Failing_Kids!$F106,1)),IF(ISERROR(SEARCH(\"*Math*\",Failing_Kids!$F106,1)),IF(ISERROR(SEARCH(\"*Calc*\",Failing_Kids!$F106,1)),IF(ISERROR(SEARCH(\"*Algebra*\",Failing_Kids!$F106,1)),\"\",\"X\"),\"X\"),\"X\"),\"X\")","v":""},{"$f":"IF(ISERROR(SEARCH(\"*Science*\",Failing_Kids!$F106,1)),IF(ISERROR(SEARCH(\"*Bio*\",Failing_Kids!$F106,1)),IF(ISERROR(SEARCH(\"*Chem*\",Failing_Kids!$F106,1)),IF(ISERROR(SEARCH(\"*Physics*\",Failing_Kids!$F106,1)),\"\",\"X\"),\"X\"),\"X\"),\"X\")","v":"X"},{"$f":"IF(ISERROR(SEARCH(\"*His*\",Failing_Kids!$F106,1)),IF(ISERROR(SEARCH(\"*GOV*\",Failing_Kids!$F106,1)),IF(ISERROR(SEARCH(\"*Econ*\",Failing_Kids!$F106,1)),IF(ISERROR(SEARCH(\"*Soc*\",Failing_Kids!$F106,1)),\"\",\"X\"),\"X\"),\"X\"),\"X\")","v":""},{"$f":"IF(ISERROR(SEARCH(\"*PE*\",Failing_Kids!$F106,1)),\"\",\"X\")","v":""}]
[{"$f":"Failing_Kids!C107","v":"Cole"},{"$f":"Failing_Kids!D107","v":"Emma"},{"$f":"IF(ISERROR(SEARCH(\"*English*\",Failing_Kids!F107,1)),\"\",\"X \")","v":"X "},{"$f":"IF(ISERROR(SEARCH(\"*Geometry*\",Failing_Kids!$F107,1)),IF(ISERROR(SEARCH(\"*Math*\",Failing_Kids!$F107,1)),IF(ISERROR(SEARCH(\"*Calc*\",Failing_Kids!$F107,1)),IF(ISERROR(SEARCH(\"*Algebra*\",Failing_Kids!$F107,1)),\"\",\"X\"),\"X\"),\"X\"),\"X\")","v":""},{"$f":"IF(ISERROR(SEARCH(\"*Science*\",Failing_Kids!$F107,1)),IF(ISERROR(SEARCH(\"*Bio*\",Failing_Kids!$F107,1)),IF(ISERROR(SEARCH(\"*Chem*\",Failing_Kids!$F107,1)),IF(ISERROR(SEARCH(\"*Physics*\",Failing_Kids!$F107,1)),\"\",\"X\"),\"X\"),\"X\"),\"X\")","v":""},{"$f":"IF(ISERROR(SEARCH(\"*His*\",Failing_Kids!$F107,1)),IF(ISERROR(SEARCH(\"*GOV*\",Failing_Kids!$F107,1)),IF(ISERROR(SEARCH(\"*Econ*\",Failing_Kids!$F107,1)),IF(ISERROR(SEARCH(\"*Soc*\",Failing_Kids!$F107,1)),\"\",\"X\"),\"X\"),\"X\"),\"X\")","v":""},{"$f":"IF(ISERROR(SEARCH(\"*PE*\",Failing_Kids!$F107,1)),\"\",\"X\")","v":""}]
[{"$f":"Failing_Kids!C108","v":"Cole"},{"$f":"Failing_Kids!D108","v":"Emma"},{"$f":"IF(ISERROR(SEARCH(\"*English*\",Failing_Kids!F108,1)),\"\",\"X \")","v":""},{"$f":"IF(ISERROR(SEARCH(\"*Geometry*\",Failing_Kids!$F108,1)),IF(ISERROR(SEARCH(\"*Math*\",Failing_Kids!$F108,1)),IF(ISERROR(SEARCH(\"*Calc*\",Failing_Kids!$F108,1)),IF(ISERROR(SEARCH(\"*Algebra*\",Failing_Kids!$F108,1)),\"\",\"X\"),\"X\"),\"X\"),\"X\")","v":""},{"$f":"IF(ISERROR(SEARCH(\"*Science*\",Failing_Kids!$F108,1)),IF(ISERROR(SEARCH(\"*Bio*\",Failing_Kids!$F108,1)),IF(ISERROR(SEARCH(\"*Chem*\",Failing_Kids!$F108,1)),IF(ISERROR(SEARCH(\"*Physics*\",Failing_Kids!$F108,1)),\"\",\"X\"),\"X\"),\"X\"),\"X\")","v":""},{"$f":"IF(ISERROR(SEARCH(\"*His*\",Failing_Kids!$F108,1)),IF(ISERROR(SEARCH(\"*GOV*\",Failing_Kids!$F108,1)),IF(ISERROR(SEARCH(\"*Econ*\",Failing_Kids!$F108,1)),IF(ISERROR(SEARCH(\"*Soc*\",Failing_Kids!$F108,1)),\"\",\"X\"),\"X\"),\"X\"),\"X\")","v":""},{"$f":"IF(ISERROR(SEARCH(\"*PE*\",Failing_Kids!$F108,1)),\"\",\"X\")","v":""}]
[{"$f":"Failing_Kids!C109","v":"Cole"},{"$f":"Failing_Kids!D109","v":"Hazel"},{"$f":"IF(ISERROR(SEARCH(\"*English*\",Failing_Kids!F109,1)),\"\",\"X \")","v":""},{"$f":"IF(ISERROR(SEARCH(\"*Geometry*\",Failing_Kids!$F109,1)),IF(ISERROR(SEARCH(\"*Math*\",Failing_Kids!$F109,1)),IF(ISERROR(SEARCH(\"*Calc*\",Failing_Kids!$F109,1)),IF(ISERROR(SEARCH(\"*Algebra*\",Failing_Kids!$F109,1)),\"\",\"X\"),\"X\"),\"X\"),\"X\")","v":""},{"$f":"IF(ISERROR(SEARCH(\"*Science*\",Failing_Kids!$F109,1)),IF(ISERROR(SEARCH(\"*Bio*\",Failing_Kids!$F109,1)),IF(ISERROR(SEARCH(\"*Chem*\",Failing_Kids!$F109,1)),IF(ISERROR(SEARCH(\"*Physics*\",Failing_Kids!$F109,1)),\"\",\"X\"),\"X\"),\"X\"),\"X\")","v":""},{"$f":"IF(ISERROR(SEARCH(\"*His*\",Failing_Kids!$F109,1)),IF(ISERROR(SEARCH(\"*GOV*\",Failing_Kids!$F109,1)),IF(ISERROR(SEARCH(\"*Econ*\",Failing_Kids!$F109,1)),IF(ISERROR(SEARCH(\"*Soc*\",Failing_Kids!$F109,1)),\"\",\"X\"),\"X\"),\"X\"),\"X\")","v":"X"},{"$f":"IF(ISERROR(SEARCH(\"*PE*\",Failing_Kids!$F109,1)),\"\",\"X\")","v":""}]
[{"$f":"Failing_Kids!C110","v":"Collins"},{"$f":"Failing_Kids!D110","v":"Sean"},{"$f":"IF(ISERROR(SEARCH(\"*English*\",Failing_Kids!F110,1)),\"\",\"X \")","v":""},{"$f":"IF(ISERROR(SEARCH(\"*Geometry*\",Failing_Kids!$F110,1)),IF(ISERROR(SEARCH(\"*Math*\",Failing_Kids!$F110,1)),IF(ISERROR(SEARCH(\"*Calc*\",Failing_Kids!$F110,1)),IF(ISERROR(SEARCH(\"*Algebra*\",Failing_Kids!$F110,1)),\"\",\"X\"),\"X\"),\"X\"),\"X\")","v":""},{"$f":"IF(ISERROR(SEARCH(\"*Science*\",Failing_Kids!$F110,1)),IF(ISERROR(SEARCH(\"*Bio*\",Failing_Kids!$F110,1)),IF(ISERROR(SEARCH(\"*Chem*\",Failing_Kids!$F110,1)),IF(ISERROR(SEARCH(\"*Physics*\",Failing_Kids!$F110,1)),\"\",\"X\"),\"X\"),\"X\"),\"X\")","v":""},{"$f":"IF(ISERROR(SEARCH(\"*His*\",Failing_Kids!$F110,1)),IF(ISERROR(SEARCH(\"*GOV*\",Failing_Kids!$F110,1)),IF(ISERROR(SEARCH(\"*Econ*\",Failing_Kids!$F110,1)),IF(ISERROR(SEARCH(\"*Soc*\",Failing_Kids!$F110,1)),\"\",\"X\"),\"X\"),\"X\"),\"X\")","v":""},{"$f":"IF(ISERROR(SEARCH(\"*PE*\",Failing_Kids!$F110,1)),\"\",\"X\")","v":""}]
[{"$f":"Failing_Kids!C111","v":"Combs"},{"$f":"Failing_Kids!D111","v":"Sheila"},{"$f":"IF(ISERROR(SEARCH(\"*English*\",Failing_Kids!F111,1)),\"\",\"X \")","v":"X "},{"$f":"IF(ISERROR(SEARCH(\"*Geometry*\",Failing_Kids!$F111,1)),IF(ISERROR(SEARCH(\"*Math*\",Failing_Kids!$F111,1)),IF(ISERROR(SEARCH(\"*Calc*\",Failing_Kids!$F111,1)),IF(ISERROR(SEARCH(\"*Algebra*\",Failing_Kids!$F111,1)),\"\",\"X\"),\"X\"),\"X\"),\"X\")","v":""},{"$f":"IF(ISERROR(SEARCH(\"*Science*\",Failing_Kids!$F111,1)),IF(ISERROR(SEARCH(\"*Bio*\",Failing_Kids!$F111,1)),IF(ISERROR(SEARCH(\"*Chem*\",Failing_Kids!$F111,1)),IF(ISERROR(SEARCH(\"*Physics*\",Failing_Kids!$F111,1)),\"\",\"X\"),\"X\"),\"X\"),\"X\")","v":""},{"$f":"IF(ISERROR(SEARCH(\"*His*\",Failing_Kids!$F111,1)),IF(ISERROR(SEARCH(\"*GOV*\",Failing_Kids!$F111,1)),IF(ISERROR(SEARCH(\"*Econ*\",Failing_Kids!$F111,1)),IF(ISERROR(SEARCH(\"*Soc*\",Failing_Kids!$F111,1)),\"\",\"X\"),\"X\"),\"X\"),\"X\")","v":""},{"$f":"IF(ISERROR(SEARCH(\"*PE*\",Failing_Kids!$F111,1)),\"\",\"X\")","v":""}]
[{"$f":"Failing_Kids!C112","v":"Conley"},{"$f":"Failing_Kids!D112","v":"Naomi"},{"$f":"IF(ISERROR(SEARCH(\"*English*\",Failing_Kids!F112,1)),\"\",\"X \")","v":"X "},{"$f":"IF(ISERROR(SEARCH(\"*Geometry*\",Failing_Kids!$F112,1)),IF(ISERROR(SEARCH(\"*Math*\",Failing_Kids!$F112,1)),IF(ISERROR(SEARCH(\"*Calc*\",Failing_Kids!$F112,1)),IF(ISERROR(SEARCH(\"*Algebra*\",Failing_Kids!$F112,1)),\"\",\"X\"),\"X\"),\"X\"),\"X\")","v":""},{"$f":"IF(ISERROR(SEARCH(\"*Science*\",Failing_Kids!$F112,1)),IF(ISERROR(SEARCH(\"*Bio*\",Failing_Kids!$F112,1)),IF(ISERROR(SEARCH(\"*Chem*\",Failing_Kids!$F112,1)),IF(ISERROR(SEARCH(\"*Physics*\",Failing_Kids!$F112,1)),\"\",\"X\"),\"X\"),\"X\"),\"X\")","v":""},{"$f":"IF(ISERROR(SEARCH(\"*His*\",Failing_Kids!$F112,1)),IF(ISERROR(SEARCH(\"*GOV*\",Failing_Kids!$F112,1)),IF(ISERROR(SEARCH(\"*Econ*\",Failing_Kids!$F112,1)),IF(ISERROR(SEARCH(\"*Soc*\",Failing_Kids!$F112,1)),\"\",\"X\"),\"X\"),\"X\"),\"X\")","v":""},{"$f":"IF(ISERROR(SEARCH(\"*PE*\",Failing_Kids!$F112,1)),\"\",\"X\")","v":""}]
[{"$f":"Failing_Kids!C113","v":"Conley"},{"$f":"Failing_Kids!D113","v":"Nellie"},{"$f":"IF(ISERROR(SEARCH(\"*English*\",Failing_Kids!F113,1)),\"\",\"X \")","v":""},{"$f":"IF(ISERROR(SEARCH(\"*Geometry*\",Failing_Kids!$F113,1)),IF(ISERROR(SEARCH(\"*Math*\",Failing_Kids!$F113,1)),IF(ISERROR(SEARCH(\"*Calc*\",Failing_Kids!$F113,1)),IF(ISERROR(SEARCH(\"*Algebra*\",Failing_Kids!$F113,1)),\"\",\"X\"),\"X\"),\"X\"),\"X\")","v":""},{"$f":"IF(ISERROR(SEARCH(\"*Science*\",Failing_Kids!$F113,1)),IF(ISERROR(SEARCH(\"*Bio*\",Failing_Kids!$F113,1)),IF(ISERROR(SEARCH(\"*Chem*\",Failing_Kids!$F113,1)),IF(ISERROR(SEARCH(\"*Physics*\",Failing_Kids!$F113,1)),\"\",\"X\"),\"X\"),\"X\"),\"X\")","v":""},{"$f":"IF(ISERROR(SEARCH(\"*His*\",Failing_Kids!$F113,1)),IF(ISERROR(SEARCH(\"*GOV*\",Failing_Kids!$F113,1)),IF(ISERROR(SEARCH(\"*Econ*\",Failing_Kids!$F113,1)),IF(ISERROR(SEARCH(\"*Soc*\",Failing_Kids!$F113,1)),\"\",\"X\"),\"X\"),\"X\"),\"X\")","v":"X"},{"$f":"IF(ISERROR(SEARCH(\"*PE*\",Failing_Kids!$F113,1)),\"\",\"X\")","v":""}]
[{"$f":"Failing_Kids!C114","v":"Conner"},{"$f":"Failing_Kids!D114","v":"Veronica"},{"$f":"IF(ISERROR(SEARCH(\"*English*\",Failing_Kids!F114,1)),\"\",\"X \")","v":""},{"$f":"IF(ISERROR(SEARCH(\"*Geometry*\",Failing_Kids!$F114,1)),IF(ISERROR(SEARCH(\"*Math*\",Failing_Kids!$F114,1)),IF(ISERROR(SEARCH(\"*Calc*\",Failing_Kids!$F114,1)),IF(ISERROR(SEARCH(\"*Algebra*\",Failing_Kids!$F114,1)),\"\",\"X\"),\"X\"),\"X\"),\"X\")","v":""},{"$f":"IF(ISERROR(SEARCH(\"*Science*\",Failing_Kids!$F114,1)),IF(ISERROR(SEARCH(\"*Bio*\",Failing_Kids!$F114,1)),IF(ISERROR(SEARCH(\"*Chem*\",Failing_Kids!$F114,1)),IF(ISERROR(SEARCH(\"*Physics*\",Failing_Kids!$F114,1)),\"\",\"X\"),\"X\"),\"X\"),\"X\")","v":"X"},{"$f":"IF(ISERROR(SEARCH(\"*His*\",Failing_Kids!$F114,1)),IF(ISERROR(SEARCH(\"*GOV*\",Failing_Kids!$F114,1)),IF(ISERROR(SEARCH(\"*Econ*\",Failing_Kids!$F114,1)),IF(ISERROR(SEARCH(\"*Soc*\",Failing_Kids!$F114,1)),\"\",\"X\"),\"X\"),\"X\"),\"X\")","v":""},{"$f":"IF(ISERROR(SEARCH(\"*PE*\",Failing_Kids!$F114,1)),\"\",\"X\")","v":""}]
[{"$f":"Failing_Kids!C115","v":"Conner"},{"$f":"Failing_Kids!D115","v":"Veronica"},{"$f":"IF(ISERROR(SEARCH(\"*English*\",Failing_Kids!F115,1)),\"\",\"X \")","v":"X "},{"$f":"IF(ISERROR(SEARCH(\"*Geometry*\",Failing_Kids!$F115,1)),IF(ISERROR(SEARCH(\"*Math*\",Failing_Kids!$F115,1)),IF(ISERROR(SEARCH(\"*Calc*\",Failing_Kids!$F115,1)),IF(ISERROR(SEARCH(\"*Algebra*\",Failing_Kids!$F115,1)),\"\",\"X\"),\"X\"),\"X\"),\"X\")","v":""},{"$f":"IF(ISERROR(SEARCH(\"*Science*\",Failing_Kids!$F115,1)),IF(ISERROR(SEARCH(\"*Bio*\",Failing_Kids!$F115,1)),IF(ISERROR(SEARCH(\"*Chem*\",Failing_Kids!$F115,1)),IF(ISERROR(SEARCH(\"*Physics*\",Failing_Kids!$F115,1)),\"\",\"X\"),\"X\"),\"X\"),\"X\")","v":""},{"$f":"IF(ISERROR(SEARCH(\"*His*\",Failing_Kids!$F115,1)),IF(ISERROR(SEARCH(\"*GOV*\",Failing_Kids!$F115,1)),IF(ISERROR(SEARCH(\"*Econ*\",Failing_Kids!$F115,1)),IF(ISERROR(SEARCH(\"*Soc*\",Failing_Kids!$F115,1)),\"\",\"X\"),\"X\"),\"X\"),\"X\")","v":""},{"$f":"IF(ISERROR(SEARCH(\"*PE*\",Failing_Kids!$F115,1)),\"\",\"X\")","v":""}]
[{"$f":"Failing_Kids!C116","v":"Contreras"},{"$f":"Failing_Kids!D116","v":"Willie"},{"$f":"IF(ISERROR(SEARCH(\"*English*\",Failing_Kids!F116,1)),\"\",\"X \")","v":"X "},{"$f":"IF(ISERROR(SEARCH(\"*Geometry*\",Failing_Kids!$F116,1)),IF(ISERROR(SEARCH(\"*Math*\",Failing_Kids!$F116,1)),IF(ISERROR(SEARCH(\"*Calc*\",Failing_Kids!$F116,1)),IF(ISERROR(SEARCH(\"*Algebra*\",Failing_Kids!$F116,1)),\"\",\"X\"),\"X\"),\"X\"),\"X\")","v":""},{"$f":"IF(ISERROR(SEARCH(\"*Science*\",Failing_Kids!$F116,1)),IF(ISERROR(SEARCH(\"*Bio*\",Failing_Kids!$F116,1)),IF(ISERROR(SEARCH(\"*Chem*\",Failing_Kids!$F116,1)),IF(ISERROR(SEARCH(\"*Physics*\",Failing_Kids!$F116,1)),\"\",\"X\"),\"X\"),\"X\"),\"X\")","v":""},{"$f":"IF(ISERROR(SEARCH(\"*His*\",Failing_Kids!$F116,1)),IF(ISERROR(SEARCH(\"*GOV*\",Failing_Kids!$F116,1)),IF(ISERROR(SEARCH(\"*Econ*\",Failing_Kids!$F116,1)),IF(ISERROR(SEARCH(\"*Soc*\",Failing_Kids!$F116,1)),\"\",\"X\"),\"X\"),\"X\"),\"X\")","v":""},{"$f":"IF(ISERROR(SEARCH(\"*PE*\",Failing_Kids!$F116,1)),\"\",\"X\")","v":""}]
[{"$f":"Failing_Kids!C117","v":"Contreras"},{"$f":"Failing_Kids!D117","v":"Willie"},{"$f":"IF(ISERROR(SEARCH(\"*English*\",Failing_Kids!F117,1)),\"\",\"X \")","v":""},{"$f":"IF(ISERROR(SEARCH(\"*Geometry*\",Failing_Kids!$F117,1)),IF(ISERROR(SEARCH(\"*Math*\",Failing_Kids!$F117,1)),IF(ISERROR(SEARCH(\"*Calc*\",Failing_Kids!$F117,1)),IF(ISERROR(SEARCH(\"*Algebra*\",Failing_Kids!$F117,1)),\"\",\"X\"),\"X\"),\"X\"),\"X\")","v":""},{"$f":"IF(ISERROR(SEARCH(\"*Science*\",Failing_Kids!$F117,1)),IF(ISERROR(SEARCH(\"*Bio*\",Failing_Kids!$F117,1)),IF(ISERROR(SEARCH(\"*Chem*\",Failing_Kids!$F117,1)),IF(ISERROR(SEARCH(\"*Physics*\",Failing_Kids!$F117,1)),\"\",\"X\"),\"X\"),\"X\"),\"X\")","v":""},{"$f":"IF(ISERROR(SEARCH(\"*His*\",Failing_Kids!$F117,1)),IF(ISERROR(SEARCH(\"*GOV*\",Failing_Kids!$F117,1)),IF(ISERROR(SEARCH(\"*Econ*\",Failing_Kids!$F117,1)),IF(ISERROR(SEARCH(\"*Soc*\",Failing_Kids!$F117,1)),\"\",\"X\"),\"X\"),\"X\"),\"X\")","v":"X"},{"$f":"IF(ISERROR(SEARCH(\"*PE*\",Failing_Kids!$F117,1)),\"\",\"X\")","v":""}]
[{"$f":"Failing_Kids!C118","v":"Cook"},{"$f":"Failing_Kids!D118","v":"Dale"},{"$f":"IF(ISERROR(SEARCH(\"*English*\",Failing_Kids!F118,1)),\"\",\"X \")","v":""},{"$f":"IF(ISERROR(SEARCH(\"*Geometry*\",Failing_Kids!$F118,1)),IF(ISERROR(SEARCH(\"*Math*\",Failing_Kids!$F118,1)),IF(ISERROR(SEARCH(\"*Calc*\",Failing_Kids!$F118,1)),IF(ISERROR(SEARCH(\"*Algebra*\",Failing_Kids!$F118,1)),\"\",\"X\"),\"X\"),\"X\"),\"X\")","v":"X"},{"$f":"IF(ISERROR(SEARCH(\"*Science*\",Failing_Kids!$F118,1)),IF(ISERROR(SEARCH(\"*Bio*\",Failing_Kids!$F118,1)),IF(ISERROR(SEARCH(\"*Chem*\",Failing_Kids!$F118,1)),IF(ISERROR(SEARCH(\"*Physics*\",Failing_Kids!$F118,1)),\"\",\"X\"),\"X\"),\"X\"),\"X\")","v":""},{"$f":"IF(ISERROR(SEARCH(\"*His*\",Failing_Kids!$F118,1)),IF(ISERROR(SEARCH(\"*GOV*\",Failing_Kids!$F118,1)),IF(ISERROR(SEARCH(\"*Econ*\",Failing_Kids!$F118,1)),IF(ISERROR(SEARCH(\"*Soc*\",Failing_Kids!$F118,1)),\"\",\"X\"),\"X\"),\"X\"),\"X\")","v":""},{"$f":"IF(ISERROR(SEARCH(\"*PE*\",Failing_Kids!$F118,1)),\"\",\"X\")","v":""}]
[{"$f":"Failing_Kids!C119","v":"Cooke"},{"$f":"Failing_Kids!D119","v":"Antonio"},{"$f":"IF(ISERROR(SEARCH(\"*English*\",Failing_Kids!F119,1)),\"\",\"X \")","v":""},{"$f":"IF(ISERROR(SEARCH(\"*Geometry*\",Failing_Kids!$F119,1)),IF(ISERROR(SEARCH(\"*Math*\",Failing_Kids!$F119,1)),IF(ISERROR(SEARCH(\"*Calc*\",Failing_Kids!$F119,1)),IF(ISERROR(SEARCH(\"*Algebra*\",Failing_Kids!$F119,1)),\"\",\"X\"),\"X\"),\"X\"),\"X\")","v":"X"},{"$f":"IF(ISERROR(SEARCH(\"*Science*\",Failing_Kids!$F119,1)),IF(ISERROR(SEARCH(\"*Bio*\",Failing_Kids!$F119,1)),IF(ISERROR(SEARCH(\"*Chem*\",Failing_Kids!$F119,1)),IF(ISERROR(SEARCH(\"*Physics*\",Failing_Kids!$F119,1)),\"\",\"X\"),\"X\"),\"X\"),\"X\")","v":""},{"$f":"IF(ISERROR(SEARCH(\"*His*\",Failing_Kids!$F119,1)),IF(ISERROR(SEARCH(\"*GOV*\",Failing_Kids!$F119,1)),IF(ISERROR(SEARCH(\"*Econ*\",Failing_Kids!$F119,1)),IF(ISERROR(SEARCH(\"*Soc*\",Failing_Kids!$F119,1)),\"\",\"X\"),\"X\"),\"X\"),\"X\")","v":""},{"$f":"IF(ISERROR(SEARCH(\"*PE*\",Failing_Kids!$F119,1)),\"\",\"X\")","v":""}]
[{"$f":"Failing_Kids!C120","v":"Cooke"},{"$f":"Failing_Kids!D120","v":"Antonio"},{"$f":"IF(ISERROR(SEARCH(\"*English*\",Failing_Kids!F120,1)),\"\",\"X \")","v":"X "},{"$f":"IF(ISERROR(SEARCH(\"*Geometry*\",Failing_Kids!$F120,1)),IF(ISERROR(SEARCH(\"*Math*\",Failing_Kids!$F120,1)),IF(ISERROR(SEARCH(\"*Calc*\",Failing_Kids!$F120,1)),IF(ISERROR(SEARCH(\"*Algebra*\",Failing_Kids!$F120,1)),\"\",\"X\"),\"X\"),\"X\"),\"X\")","v":""},{"$f":"IF(ISERROR(SEARCH(\"*Science*\",Failing_Kids!$F120,1)),IF(ISERROR(SEARCH(\"*Bio*\",Failing_Kids!$F120,1)),IF(ISERROR(SEARCH(\"*Chem*\",Failing_Kids!$F120,1)),IF(ISERROR(SEARCH(\"*Physics*\",Failing_Kids!$F120,1)),\"\",\"X\"),\"X\"),\"X\"),\"X\")","v":""},{"$f":"IF(ISERROR(SEARCH(\"*His*\",Failing_Kids!$F120,1)),IF(ISERROR(SEARCH(\"*GOV*\",Failing_Kids!$F120,1)),IF(ISERROR(SEARCH(\"*Econ*\",Failing_Kids!$F120,1)),IF(ISERROR(SEARCH(\"*Soc*\",Failing_Kids!$F120,1)),\"\",\"X\"),\"X\"),\"X\"),\"X\")","v":""},{"$f":"IF(ISERROR(SEARCH(\"*PE*\",Failing_Kids!$F120,1)),\"\",\"X\")","v":""}]
[{"$f":"Failing_Kids!C121","v":"Cooley"},{"$f":"Failing_Kids!D121","v":"Veronica"},{"$f":"IF(ISERROR(SEARCH(\"*English*\",Failing_Kids!F121,1)),\"\",\"X \")","v":""},{"$f":"IF(ISERROR(SEARCH(\"*Geometry*\",Failing_Kids!$F121,1)),IF(ISERROR(SEARCH(\"*Math*\",Failing_Kids!$F121,1)),IF(ISERROR(SEARCH(\"*Calc*\",Failing_Kids!$F121,1)),IF(ISERROR(SEARCH(\"*Algebra*\",Failing_Kids!$F121,1)),\"\",\"X\"),\"X\"),\"X\"),\"X\")","v":"X"},{"$f":"IF(ISERROR(SEARCH(\"*Science*\",Failing_Kids!$F121,1)),IF(ISERROR(SEARCH(\"*Bio*\",Failing_Kids!$F121,1)),IF(ISERROR(SEARCH(\"*Chem*\",Failing_Kids!$F121,1)),IF(ISERROR(SEARCH(\"*Physics*\",Failing_Kids!$F121,1)),\"\",\"X\"),\"X\"),\"X\"),\"X\")","v":""},{"$f":"IF(ISERROR(SEARCH(\"*His*\",Failing_Kids!$F121,1)),IF(ISERROR(SEARCH(\"*GOV*\",Failing_Kids!$F121,1)),IF(ISERROR(SEARCH(\"*Econ*\",Failing_Kids!$F121,1)),IF(ISERROR(SEARCH(\"*Soc*\",Failing_Kids!$F121,1)),\"\",\"X\"),\"X\"),\"X\"),\"X\")","v":""},{"$f":"IF(ISERROR(SEARCH(\"*PE*\",Failing_Kids!$F121,1)),\"\",\"X\")","v":""}]
[{"$f":"Failing_Kids!C122","v":"Cooper"},{"$f":"Failing_Kids!D122","v":"Melanie"},{"$f":"IF(ISERROR(SEARCH(\"*English*\",Failing_Kids!F122,1)),\"\",\"X \")","v":"X "},{"$f":"IF(ISERROR(SEARCH(\"*Geometry*\",Failing_Kids!$F122,1)),IF(ISERROR(SEARCH(\"*Math*\",Failing_Kids!$F122,1)),IF(ISERROR(SEARCH(\"*Calc*\",Failing_Kids!$F122,1)),IF(ISERROR(SEARCH(\"*Algebra*\",Failing_Kids!$F122,1)),\"\",\"X\"),\"X\"),\"X\"),\"X\")","v":""},{"$f":"IF(ISERROR(SEARCH(\"*Science*\",Failing_Kids!$F122,1)),IF(ISERROR(SEARCH(\"*Bio*\",Failing_Kids!$F122,1)),IF(ISERROR(SEARCH(\"*Chem*\",Failing_Kids!$F122,1)),IF(ISERROR(SEARCH(\"*Physics*\",Failing_Kids!$F122,1)),\"\",\"X\"),\"X\"),\"X\"),\"X\")","v":""},{"$f":"IF(ISERROR(SEARCH(\"*His*\",Failing_Kids!$F122,1)),IF(ISERROR(SEARCH(\"*GOV*\",Failing_Kids!$F122,1)),IF(ISERROR(SEARCH(\"*Econ*\",Failing_Kids!$F122,1)),IF(ISERROR(SEARCH(\"*Soc*\",Failing_Kids!$F122,1)),\"\",\"X\"),\"X\"),\"X\"),\"X\")","v":""},{"$f":"IF(ISERROR(SEARCH(\"*PE*\",Failing_Kids!$F122,1)),\"\",\"X\")","v":""}]
[{"$f":"Failing_Kids!C123","v":"Cooper"},{"$f":"Failing_Kids!D123","v":"Melanie"},{"$f":"IF(ISERROR(SEARCH(\"*English*\",Failing_Kids!F123,1)),\"\",\"X \")","v":""},{"$f":"IF(ISERROR(SEARCH(\"*Geometry*\",Failing_Kids!$F123,1)),IF(ISERROR(SEARCH(\"*Math*\",Failing_Kids!$F123,1)),IF(ISERROR(SEARCH(\"*Calc*\",Failing_Kids!$F123,1)),IF(ISERROR(SEARCH(\"*Algebra*\",Failing_Kids!$F123,1)),\"\",\"X\"),\"X\"),\"X\"),\"X\")","v":"X"},{"$f":"IF(ISERROR(SEARCH(\"*Science*\",Failing_Kids!$F123,1)),IF(ISERROR(SEARCH(\"*Bio*\",Failing_Kids!$F123,1)),IF(ISERROR(SEARCH(\"*Chem*\",Failing_Kids!$F123,1)),IF(ISERROR(SEARCH(\"*Physics*\",Failing_Kids!$F123,1)),\"\",\"X\"),\"X\"),\"X\"),\"X\")","v":""},{"$f":"IF(ISERROR(SEARCH(\"*His*\",Failing_Kids!$F123,1)),IF(ISERROR(SEARCH(\"*GOV*\",Failing_Kids!$F123,1)),IF(ISERROR(SEARCH(\"*Econ*\",Failing_Kids!$F123,1)),IF(ISERROR(SEARCH(\"*Soc*\",Failing_Kids!$F123,1)),\"\",\"X\"),\"X\"),\"X\"),\"X\")","v":""},{"$f":"IF(ISERROR(SEARCH(\"*PE*\",Failing_Kids!$F123,1)),\"\",\"X\")","v":""}]
[{"$f":"Failing_Kids!C124","v":"Cooper"},{"$f":"Failing_Kids!D124","v":"Melanie"},{"$f":"IF(ISERROR(SEARCH(\"*English*\",Failing_Kids!F124,1)),\"\",\"X \")","v":""},{"$f":"IF(ISERROR(SEARCH(\"*Geometry*\",Failing_Kids!$F124,1)),IF(ISERROR(SEARCH(\"*Math*\",Failing_Kids!$F124,1)),IF(ISERROR(SEARCH(\"*Calc*\",Failing_Kids!$F124,1)),IF(ISERROR(SEARCH(\"*Algebra*\",Failing_Kids!$F124,1)),\"\",\"X\"),\"X\"),\"X\"),\"X\")","v":""},{"$f":"IF(ISERROR(SEARCH(\"*Science*\",Failing_Kids!$F124,1)),IF(ISERROR(SEARCH(\"*Bio*\",Failing_Kids!$F124,1)),IF(ISERROR(SEARCH(\"*Chem*\",Failing_Kids!$F124,1)),IF(ISERROR(SEARCH(\"*Physics*\",Failing_Kids!$F124,1)),\"\",\"X\"),\"X\"),\"X\"),\"X\")","v":""},{"$f":"IF(ISERROR(SEARCH(\"*His*\",Failing_Kids!$F124,1)),IF(ISERROR(SEARCH(\"*GOV*\",Failing_Kids!$F124,1)),IF(ISERROR(SEARCH(\"*Econ*\",Failing_Kids!$F124,1)),IF(ISERROR(SEARCH(\"*Soc*\",Failing_Kids!$F124,1)),\"\",\"X\"),\"X\"),\"X\"),\"X\")","v":"X"},{"$f":"IF(ISERROR(SEARCH(\"*PE*\",Failing_Kids!$F124,1)),\"\",\"X\")","v":""}]
[{"$f":"Failing_Kids!C125","v":"Cortez"},{"$f":"Failing_Kids!D125","v":"Pearl"},{"$f":"IF(ISERROR(SEARCH(\"*English*\",Failing_Kids!F125,1)),\"\",\"X \")","v":"X "},{"$f":"IF(ISERROR(SEARCH(\"*Geometry*\",Failing_Kids!$F125,1)),IF(ISERROR(SEARCH(\"*Math*\",Failing_Kids!$F125,1)),IF(ISERROR(SEARCH(\"*Calc*\",Failing_Kids!$F125,1)),IF(ISERROR(SEARCH(\"*Algebra*\",Failing_Kids!$F125,1)),\"\",\"X\"),\"X\"),\"X\"),\"X\")","v":""},{"$f":"IF(ISERROR(SEARCH(\"*Science*\",Failing_Kids!$F125,1)),IF(ISERROR(SEARCH(\"*Bio*\",Failing_Kids!$F125,1)),IF(ISERROR(SEARCH(\"*Chem*\",Failing_Kids!$F125,1)),IF(ISERROR(SEARCH(\"*Physics*\",Failing_Kids!$F125,1)),\"\",\"X\"),\"X\"),\"X\"),\"X\")","v":""},{"$f":"IF(ISERROR(SEARCH(\"*His*\",Failing_Kids!$F125,1)),IF(ISERROR(SEARCH(\"*GOV*\",Failing_Kids!$F125,1)),IF(ISERROR(SEARCH(\"*Econ*\",Failing_Kids!$F125,1)),IF(ISERROR(SEARCH(\"*Soc*\",Failing_Kids!$F125,1)),\"\",\"X\"),\"X\"),\"X\"),\"X\")","v":""},{"$f":"IF(ISERROR(SEARCH(\"*PE*\",Failing_Kids!$F125,1)),\"\",\"X\")","v":""}]
[{"$f":"Failing_Kids!C126","v":"Cox"},{"$f":"Failing_Kids!D126","v":"Roy"},{"$f":"IF(ISERROR(SEARCH(\"*English*\",Failing_Kids!F126,1)),\"\",\"X \")","v":"X "},{"$f":"IF(ISERROR(SEARCH(\"*Geometry*\",Failing_Kids!$F126,1)),IF(ISERROR(SEARCH(\"*Math*\",Failing_Kids!$F126,1)),IF(ISERROR(SEARCH(\"*Calc*\",Failing_Kids!$F126,1)),IF(ISERROR(SEARCH(\"*Algebra*\",Failing_Kids!$F126,1)),\"\",\"X\"),\"X\"),\"X\"),\"X\")","v":""},{"$f":"IF(ISERROR(SEARCH(\"*Science*\",Failing_Kids!$F126,1)),IF(ISERROR(SEARCH(\"*Bio*\",Failing_Kids!$F126,1)),IF(ISERROR(SEARCH(\"*Chem*\",Failing_Kids!$F126,1)),IF(ISERROR(SEARCH(\"*Physics*\",Failing_Kids!$F126,1)),\"\",\"X\"),\"X\"),\"X\"),\"X\")","v":""},{"$f":"IF(ISERROR(SEARCH(\"*His*\",Failing_Kids!$F126,1)),IF(ISERROR(SEARCH(\"*GOV*\",Failing_Kids!$F126,1)),IF(ISERROR(SEARCH(\"*Econ*\",Failing_Kids!$F126,1)),IF(ISERROR(SEARCH(\"*Soc*\",Failing_Kids!$F126,1)),\"\",\"X\"),\"X\"),\"X\"),\"X\")","v":""},{"$f":"IF(ISERROR(SEARCH(\"*PE*\",Failing_Kids!$F126,1)),\"\",\"X\")","v":""}]
[{"$f":"Failing_Kids!C127","v":"Cox"},{"$f":"Failing_Kids!D127","v":"Thelma"},{"$f":"IF(ISERROR(SEARCH(\"*English*\",Failing_Kids!F127,1)),\"\",\"X \")","v":""},{"$f":"IF(ISERROR(SEARCH(\"*Geometry*\",Failing_Kids!$F127,1)),IF(ISERROR(SEARCH(\"*Math*\",Failing_Kids!$F127,1)),IF(ISERROR(SEARCH(\"*Calc*\",Failing_Kids!$F127,1)),IF(ISERROR(SEARCH(\"*Algebra*\",Failing_Kids!$F127,1)),\"\",\"X\"),\"X\"),\"X\"),\"X\")","v":"X"},{"$f":"IF(ISERROR(SEARCH(\"*Science*\",Failing_Kids!$F127,1)),IF(ISERROR(SEARCH(\"*Bio*\",Failing_Kids!$F127,1)),IF(ISERROR(SEARCH(\"*Chem*\",Failing_Kids!$F127,1)),IF(ISERROR(SEARCH(\"*Physics*\",Failing_Kids!$F127,1)),\"\",\"X\"),\"X\"),\"X\"),\"X\")","v":""},{"$f":"IF(ISERROR(SEARCH(\"*His*\",Failing_Kids!$F127,1)),IF(ISERROR(SEARCH(\"*GOV*\",Failing_Kids!$F127,1)),IF(ISERROR(SEARCH(\"*Econ*\",Failing_Kids!$F127,1)),IF(ISERROR(SEARCH(\"*Soc*\",Failing_Kids!$F127,1)),\"\",\"X\"),\"X\"),\"X\"),\"X\")","v":""},{"$f":"IF(ISERROR(SEARCH(\"*PE*\",Failing_Kids!$F127,1)),\"\",\"X\")","v":""}]
[{"$f":"Failing_Kids!C128","v":"Cruz"},{"$f":"Failing_Kids!D128","v":"Yolanda"},{"$f":"IF(ISERROR(SEARCH(\"*English*\",Failing_Kids!F128,1)),\"\",\"X \")","v":""},{"$f":"IF(ISERROR(SEARCH(\"*Geometry*\",Failing_Kids!$F128,1)),IF(ISERROR(SEARCH(\"*Math*\",Failing_Kids!$F128,1)),IF(ISERROR(SEARCH(\"*Calc*\",Failing_Kids!$F128,1)),IF(ISERROR(SEARCH(\"*Algebra*\",Failing_Kids!$F128,1)),\"\",\"X\"),\"X\"),\"X\"),\"X\")","v":"X"},{"$f":"IF(ISERROR(SEARCH(\"*Science*\",Failing_Kids!$F128,1)),IF(ISERROR(SEARCH(\"*Bio*\",Failing_Kids!$F128,1)),IF(ISERROR(SEARCH(\"*Chem*\",Failing_Kids!$F128,1)),IF(ISERROR(SEARCH(\"*Physics*\",Failing_Kids!$F128,1)),\"\",\"X\"),\"X\"),\"X\"),\"X\")","v":""},{"$f":"IF(ISERROR(SEARCH(\"*His*\",Failing_Kids!$F128,1)),IF(ISERROR(SEARCH(\"*GOV*\",Failing_Kids!$F128,1)),IF(ISERROR(SEARCH(\"*Econ*\",Failing_Kids!$F128,1)),IF(ISERROR(SEARCH(\"*Soc*\",Failing_Kids!$F128,1)),\"\",\"X\"),\"X\"),\"X\"),\"X\")","v":""},{"$f":"IF(ISERROR(SEARCH(\"*PE*\",Failing_Kids!$F128,1)),\"\",\"X\")","v":""}]
[{"$f":"Failing_Kids!C129","v":"Cummings"},{"$f":"Failing_Kids!D129","v":"Nicole"},{"$f":"IF(ISERROR(SEARCH(\"*English*\",Failing_Kids!F129,1)),\"\",\"X \")","v":""},{"$f":"IF(ISERROR(SEARCH(\"*Geometry*\",Failing_Kids!$F129,1)),IF(ISERROR(SEARCH(\"*Math*\",Failing_Kids!$F129,1)),IF(ISERROR(SEARCH(\"*Calc*\",Failing_Kids!$F129,1)),IF(ISERROR(SEARCH(\"*Algebra*\",Failing_Kids!$F129,1)),\"\",\"X\"),\"X\"),\"X\"),\"X\")","v":"X"},{"$f":"IF(ISERROR(SEARCH(\"*Science*\",Failing_Kids!$F129,1)),IF(ISERROR(SEARCH(\"*Bio*\",Failing_Kids!$F129,1)),IF(ISERROR(SEARCH(\"*Chem*\",Failing_Kids!$F129,1)),IF(ISERROR(SEARCH(\"*Physics*\",Failing_Kids!$F129,1)),\"\",\"X\"),\"X\"),\"X\"),\"X\")","v":""},{"$f":"IF(ISERROR(SEARCH(\"*His*\",Failing_Kids!$F129,1)),IF(ISERROR(SEARCH(\"*GOV*\",Failing_Kids!$F129,1)),IF(ISERROR(SEARCH(\"*Econ*\",Failing_Kids!$F129,1)),IF(ISERROR(SEARCH(\"*Soc*\",Failing_Kids!$F129,1)),\"\",\"X\"),\"X\"),\"X\"),\"X\")","v":""},{"$f":"IF(ISERROR(SEARCH(\"*PE*\",Failing_Kids!$F129,1)),\"\",\"X\")","v":""}]
[{"$f":"Failing_Kids!C130","v":"Dalton"},{"$f":"Failing_Kids!D130","v":"Anita"},{"$f":"IF(ISERROR(SEARCH(\"*English*\",Failing_Kids!F130,1)),\"\",\"X \")","v":""},{"$f":"IF(ISERROR(SEARCH(\"*Geometry*\",Failing_Kids!$F130,1)),IF(ISERROR(SEARCH(\"*Math*\",Failing_Kids!$F130,1)),IF(ISERROR(SEARCH(\"*Calc*\",Failing_Kids!$F130,1)),IF(ISERROR(SEARCH(\"*Algebra*\",Failing_Kids!$F130,1)),\"\",\"X\"),\"X\"),\"X\"),\"X\")","v":""},{"$f":"IF(ISERROR(SEARCH(\"*Science*\",Failing_Kids!$F130,1)),IF(ISERROR(SEARCH(\"*Bio*\",Failing_Kids!$F130,1)),IF(ISERROR(SEARCH(\"*Chem*\",Failing_Kids!$F130,1)),IF(ISERROR(SEARCH(\"*Physics*\",Failing_Kids!$F130,1)),\"\",\"X\"),\"X\"),\"X\"),\"X\")","v":"X"},{"$f":"IF(ISERROR(SEARCH(\"*His*\",Failing_Kids!$F130,1)),IF(ISERROR(SEARCH(\"*GOV*\",Failing_Kids!$F130,1)),IF(ISERROR(SEARCH(\"*Econ*\",Failing_Kids!$F130,1)),IF(ISERROR(SEARCH(\"*Soc*\",Failing_Kids!$F130,1)),\"\",\"X\"),\"X\"),\"X\"),\"X\")","v":""},{"$f":"IF(ISERROR(SEARCH(\"*PE*\",Failing_Kids!$F130,1)),\"\",\"X\")","v":""}]
[{"$f":"Failing_Kids!C131","v":"Dawson"},{"$f":"Failing_Kids!D131","v":"Jacqueline"},{"$f":"IF(ISERROR(SEARCH(\"*English*\",Failing_Kids!F131,1)),\"\",\"X \")","v":""},{"$f":"IF(ISERROR(SEARCH(\"*Geometry*\",Failing_Kids!$F131,1)),IF(ISERROR(SEARCH(\"*Math*\",Failing_Kids!$F131,1)),IF(ISERROR(SEARCH(\"*Calc*\",Failing_Kids!$F131,1)),IF(ISERROR(SEARCH(\"*Algebra*\",Failing_Kids!$F131,1)),\"\",\"X\"),\"X\"),\"X\"),\"X\")","v":"X"},{"$f":"IF(ISERROR(SEARCH(\"*Science*\",Failing_Kids!$F131,1)),IF(ISERROR(SEARCH(\"*Bio*\",Failing_Kids!$F131,1)),IF(ISERROR(SEARCH(\"*Chem*\",Failing_Kids!$F131,1)),IF(ISERROR(SEARCH(\"*Physics*\",Failing_Kids!$F131,1)),\"\",\"X\"),\"X\"),\"X\"),\"X\")","v":""},{"$f":"IF(ISERROR(SEARCH(\"*His*\",Failing_Kids!$F131,1)),IF(ISERROR(SEARCH(\"*GOV*\",Failing_Kids!$F131,1)),IF(ISERROR(SEARCH(\"*Econ*\",Failing_Kids!$F131,1)),IF(ISERROR(SEARCH(\"*Soc*\",Failing_Kids!$F131,1)),\"\",\"X\"),\"X\"),\"X\"),\"X\")","v":""},{"$f":"IF(ISERROR(SEARCH(\"*PE*\",Failing_Kids!$F131,1)),\"\",\"X\")","v":""}]
[{"$f":"Failing_Kids!C132","v":"Dawson"},{"$f":"Failing_Kids!D132","v":"Jacqueline"},{"$f":"IF(ISERROR(SEARCH(\"*English*\",Failing_Kids!F132,1)),\"\",\"X \")","v":"X "},{"$f":"IF(ISERROR(SEARCH(\"*Geometry*\",Failing_Kids!$F132,1)),IF(ISERROR(SEARCH(\"*Math*\",Failing_Kids!$F132,1)),IF(ISERROR(SEARCH(\"*Calc*\",Failing_Kids!$F132,1)),IF(ISERROR(SEARCH(\"*Algebra*\",Failing_Kids!$F132,1)),\"\",\"X\"),\"X\"),\"X\"),\"X\")","v":""},{"$f":"IF(ISERROR(SEARCH(\"*Science*\",Failing_Kids!$F132,1)),IF(ISERROR(SEARCH(\"*Bio*\",Failing_Kids!$F132,1)),IF(ISERROR(SEARCH(\"*Chem*\",Failing_Kids!$F132,1)),IF(ISERROR(SEARCH(\"*Physics*\",Failing_Kids!$F132,1)),\"\",\"X\"),\"X\"),\"X\"),\"X\")","v":""},{"$f":"IF(ISERROR(SEARCH(\"*His*\",Failing_Kids!$F132,1)),IF(ISERROR(SEARCH(\"*GOV*\",Failing_Kids!$F132,1)),IF(ISERROR(SEARCH(\"*Econ*\",Failing_Kids!$F132,1)),IF(ISERROR(SEARCH(\"*Soc*\",Failing_Kids!$F132,1)),\"\",\"X\"),\"X\"),\"X\"),\"X\")","v":""},{"$f":"IF(ISERROR(SEARCH(\"*PE*\",Failing_Kids!$F132,1)),\"\",\"X\")","v":""}]
[{"$f":"Failing_Kids!C133","v":"Dawson"},{"$f":"Failing_Kids!D133","v":"Jacqueline"},{"$f":"IF(ISERROR(SEARCH(\"*English*\",Failing_Kids!F133,1)),\"\",\"X \")","v":""},{"$f":"IF(ISERROR(SEARCH(\"*Geometry*\",Failing_Kids!$F133,1)),IF(ISERROR(SEARCH(\"*Math*\",Failing_Kids!$F133,1)),IF(ISERROR(SEARCH(\"*Calc*\",Failing_Kids!$F133,1)),IF(ISERROR(SEARCH(\"*Algebra*\",Failing_Kids!$F133,1)),\"\",\"X\"),\"X\"),\"X\"),\"X\")","v":""},{"$f":"IF(ISERROR(SEARCH(\"*Science*\",Failing_Kids!$F133,1)),IF(ISERROR(SEARCH(\"*Bio*\",Failing_Kids!$F133,1)),IF(ISERROR(SEARCH(\"*Chem*\",Failing_Kids!$F133,1)),IF(ISERROR(SEARCH(\"*Physics*\",Failing_Kids!$F133,1)),\"\",\"X\"),\"X\"),\"X\"),\"X\")","v":""},{"$f":"IF(ISERROR(SEARCH(\"*His*\",Failing_Kids!$F133,1)),IF(ISERROR(SEARCH(\"*GOV*\",Failing_Kids!$F133,1)),IF(ISERROR(SEARCH(\"*Econ*\",Failing_Kids!$F133,1)),IF(ISERROR(SEARCH(\"*Soc*\",Failing_Kids!$F133,1)),\"\",\"X\"),\"X\"),\"X\"),\"X\")","v":"X"},{"$f":"IF(ISERROR(SEARCH(\"*PE*\",Failing_Kids!$F133,1)),\"\",\"X\")","v":""}]
[{"$f":"Failing_Kids!C134","v":"Delacruz"},{"$f":"Failing_Kids!D134","v":"Shawn"},{"$f":"IF(ISERROR(SEARCH(\"*English*\",Failing_Kids!F134,1)),\"\",\"X \")","v":""},{"$f":"IF(ISERROR(SEARCH(\"*Geometry*\",Failing_Kids!$F134,1)),IF(ISERROR(SEARCH(\"*Math*\",Failing_Kids!$F134,1)),IF(ISERROR(SEARCH(\"*Calc*\",Failing_Kids!$F134,1)),IF(ISERROR(SEARCH(\"*Algebra*\",Failing_Kids!$F134,1)),\"\",\"X\"),\"X\"),\"X\"),\"X\")","v":"X"},{"$f":"IF(ISERROR(SEARCH(\"*Science*\",Failing_Kids!$F134,1)),IF(ISERROR(SEARCH(\"*Bio*\",Failing_Kids!$F134,1)),IF(ISERROR(SEARCH(\"*Chem*\",Failing_Kids!$F134,1)),IF(ISERROR(SEARCH(\"*Physics*\",Failing_Kids!$F134,1)),\"\",\"X\"),\"X\"),\"X\"),\"X\")","v":""},{"$f":"IF(ISERROR(SEARCH(\"*His*\",Failing_Kids!$F134,1)),IF(ISERROR(SEARCH(\"*GOV*\",Failing_Kids!$F134,1)),IF(ISERROR(SEARCH(\"*Econ*\",Failing_Kids!$F134,1)),IF(ISERROR(SEARCH(\"*Soc*\",Failing_Kids!$F134,1)),\"\",\"X\"),\"X\"),\"X\"),\"X\")","v":""},{"$f":"IF(ISERROR(SEARCH(\"*PE*\",Failing_Kids!$F134,1)),\"\",\"X\")","v":""}]
[{"$f":"Failing_Kids!C135","v":"Diaz"},{"$f":"Failing_Kids!D135","v":"Glenn"},{"$f":"IF(ISERROR(SEARCH(\"*English*\",Failing_Kids!F135,1)),\"\",\"X \")","v":""},{"$f":"IF(ISERROR(SEARCH(\"*Geometry*\",Failing_Kids!$F135,1)),IF(ISERROR(SEARCH(\"*Math*\",Failing_Kids!$F135,1)),IF(ISERROR(SEARCH(\"*Calc*\",Failing_Kids!$F135,1)),IF(ISERROR(SEARCH(\"*Algebra*\",Failing_Kids!$F135,1)),\"\",\"X\"),\"X\"),\"X\"),\"X\")","v":"X"},{"$f":"IF(ISERROR(SEARCH(\"*Science*\",Failing_Kids!$F135,1)),IF(ISERROR(SEARCH(\"*Bio*\",Failing_Kids!$F135,1)),IF(ISERROR(SEARCH(\"*Chem*\",Failing_Kids!$F135,1)),IF(ISERROR(SEARCH(\"*Physics*\",Failing_Kids!$F135,1)),\"\",\"X\"),\"X\"),\"X\"),\"X\")","v":""},{"$f":"IF(ISERROR(SEARCH(\"*His*\",Failing_Kids!$F135,1)),IF(ISERROR(SEARCH(\"*GOV*\",Failing_Kids!$F135,1)),IF(ISERROR(SEARCH(\"*Econ*\",Failing_Kids!$F135,1)),IF(ISERROR(SEARCH(\"*Soc*\",Failing_Kids!$F135,1)),\"\",\"X\"),\"X\"),\"X\"),\"X\")","v":""},{"$f":"IF(ISERROR(SEARCH(\"*PE*\",Failing_Kids!$F135,1)),\"\",\"X\")","v":""}]
[{"$f":"Failing_Kids!C136","v":"Dillard"},{"$f":"Failing_Kids!D136","v":"Glenn"},{"$f":"IF(ISERROR(SEARCH(\"*English*\",Failing_Kids!F136,1)),\"\",\"X \")","v":""},{"$f":"IF(ISERROR(SEARCH(\"*Geometry*\",Failing_Kids!$F136,1)),IF(ISERROR(SEARCH(\"*Math*\",Failing_Kids!$F136,1)),IF(ISERROR(SEARCH(\"*Calc*\",Failing_Kids!$F136,1)),IF(ISERROR(SEARCH(\"*Algebra*\",Failing_Kids!$F136,1)),\"\",\"X\"),\"X\"),\"X\"),\"X\")","v":""},{"$f":"IF(ISERROR(SEARCH(\"*Science*\",Failing_Kids!$F136,1)),IF(ISERROR(SEARCH(\"*Bio*\",Failing_Kids!$F136,1)),IF(ISERROR(SEARCH(\"*Chem*\",Failing_Kids!$F136,1)),IF(ISERROR(SEARCH(\"*Physics*\",Failing_Kids!$F136,1)),\"\",\"X\"),\"X\"),\"X\"),\"X\")","v":""},{"$f":"IF(ISERROR(SEARCH(\"*His*\",Failing_Kids!$F136,1)),IF(ISERROR(SEARCH(\"*GOV*\",Failing_Kids!$F136,1)),IF(ISERROR(SEARCH(\"*Econ*\",Failing_Kids!$F136,1)),IF(ISERROR(SEARCH(\"*Soc*\",Failing_Kids!$F136,1)),\"\",\"X\"),\"X\"),\"X\"),\"X\")","v":"X"},{"$f":"IF(ISERROR(SEARCH(\"*PE*\",Failing_Kids!$F136,1)),\"\",\"X\")","v":""}]
[{"$f":"Failing_Kids!C137","v":"Dixon"},{"$f":"Failing_Kids!D137","v":"Carolyn"},{"$f":"IF(ISERROR(SEARCH(\"*English*\",Failing_Kids!F137,1)),\"\",\"X \")","v":""},{"$f":"IF(ISERROR(SEARCH(\"*Geometry*\",Failing_Kids!$F137,1)),IF(ISERROR(SEARCH(\"*Math*\",Failing_Kids!$F137,1)),IF(ISERROR(SEARCH(\"*Calc*\",Failing_Kids!$F137,1)),IF(ISERROR(SEARCH(\"*Algebra*\",Failing_Kids!$F137,1)),\"\",\"X\"),\"X\"),\"X\"),\"X\")","v":"X"},{"$f":"IF(ISERROR(SEARCH(\"*Science*\",Failing_Kids!$F137,1)),IF(ISERROR(SEARCH(\"*Bio*\",Failing_Kids!$F137,1)),IF(ISERROR(SEARCH(\"*Chem*\",Failing_Kids!$F137,1)),IF(ISERROR(SEARCH(\"*Physics*\",Failing_Kids!$F137,1)),\"\",\"X\"),\"X\"),\"X\"),\"X\")","v":""},{"$f":"IF(ISERROR(SEARCH(\"*His*\",Failing_Kids!$F137,1)),IF(ISERROR(SEARCH(\"*GOV*\",Failing_Kids!$F137,1)),IF(ISERROR(SEARCH(\"*Econ*\",Failing_Kids!$F137,1)),IF(ISERROR(SEARCH(\"*Soc*\",Failing_Kids!$F137,1)),\"\",\"X\"),\"X\"),\"X\"),\"X\")","v":""},{"$f":"IF(ISERROR(SEARCH(\"*PE*\",Failing_Kids!$F137,1)),\"\",\"X\")","v":""}]
[{"$f":"Failing_Kids!C138","v":"Drake"},{"$f":"Failing_Kids!D138","v":"Glenda"},{"$f":"IF(ISERROR(SEARCH(\"*English*\",Failing_Kids!F138,1)),\"\",\"X \")","v":""},{"$f":"IF(ISERROR(SEARCH(\"*Geometry*\",Failing_Kids!$F138,1)),IF(ISERROR(SEARCH(\"*Math*\",Failing_Kids!$F138,1)),IF(ISERROR(SEARCH(\"*Calc*\",Failing_Kids!$F138,1)),IF(ISERROR(SEARCH(\"*Algebra*\",Failing_Kids!$F138,1)),\"\",\"X\"),\"X\"),\"X\"),\"X\")","v":""},{"$f":"IF(ISERROR(SEARCH(\"*Science*\",Failing_Kids!$F138,1)),IF(ISERROR(SEARCH(\"*Bio*\",Failing_Kids!$F138,1)),IF(ISERROR(SEARCH(\"*Chem*\",Failing_Kids!$F138,1)),IF(ISERROR(SEARCH(\"*Physics*\",Failing_Kids!$F138,1)),\"\",\"X\"),\"X\"),\"X\"),\"X\")","v":"X"},{"$f":"IF(ISERROR(SEARCH(\"*His*\",Failing_Kids!$F138,1)),IF(ISERROR(SEARCH(\"*GOV*\",Failing_Kids!$F138,1)),IF(ISERROR(SEARCH(\"*Econ*\",Failing_Kids!$F138,1)),IF(ISERROR(SEARCH(\"*Soc*\",Failing_Kids!$F138,1)),\"\",\"X\"),\"X\"),\"X\"),\"X\")","v":""},{"$f":"IF(ISERROR(SEARCH(\"*PE*\",Failing_Kids!$F138,1)),\"\",\"X\")","v":""}]
[{"$f":"Failing_Kids!C139","v":"Duncan"},{"$f":"Failing_Kids!D139","v":"Stanley"},{"$f":"IF(ISERROR(SEARCH(\"*English*\",Failing_Kids!F139,1)),\"\",\"X \")","v":""},{"$f":"IF(ISERROR(SEARCH(\"*Geometry*\",Failing_Kids!$F139,1)),IF(ISERROR(SEARCH(\"*Math*\",Failing_Kids!$F139,1)),IF(ISERROR(SEARCH(\"*Calc*\",Failing_Kids!$F139,1)),IF(ISERROR(SEARCH(\"*Algebra*\",Failing_Kids!$F139,1)),\"\",\"X\"),\"X\"),\"X\"),\"X\")","v":"X"},{"$f":"IF(ISERROR(SEARCH(\"*Science*\",Failing_Kids!$F139,1)),IF(ISERROR(SEARCH(\"*Bio*\",Failing_Kids!$F139,1)),IF(ISERROR(SEARCH(\"*Chem*\",Failing_Kids!$F139,1)),IF(ISERROR(SEARCH(\"*Physics*\",Failing_Kids!$F139,1)),\"\",\"X\"),\"X\"),\"X\"),\"X\")","v":""},{"$f":"IF(ISERROR(SEARCH(\"*His*\",Failing_Kids!$F139,1)),IF(ISERROR(SEARCH(\"*GOV*\",Failing_Kids!$F139,1)),IF(ISERROR(SEARCH(\"*Econ*\",Failing_Kids!$F139,1)),IF(ISERROR(SEARCH(\"*Soc*\",Failing_Kids!$F139,1)),\"\",\"X\"),\"X\"),\"X\"),\"X\")","v":""},{"$f":"IF(ISERROR(SEARCH(\"*PE*\",Failing_Kids!$F139,1)),\"\",\"X\")","v":""}]
[{"$f":"Failing_Kids!C140","v":"Durham"},{"$f":"Failing_Kids!D140","v":"Brian"},{"$f":"IF(ISERROR(SEARCH(\"*English*\",Failing_Kids!F140,1)),\"\",\"X \")","v":"X "},{"$f":"IF(ISERROR(SEARCH(\"*Geometry*\",Failing_Kids!$F140,1)),IF(ISERROR(SEARCH(\"*Math*\",Failing_Kids!$F140,1)),IF(ISERROR(SEARCH(\"*Calc*\",Failing_Kids!$F140,1)),IF(ISERROR(SEARCH(\"*Algebra*\",Failing_Kids!$F140,1)),\"\",\"X\"),\"X\"),\"X\"),\"X\")","v":""},{"$f":"IF(ISERROR(SEARCH(\"*Science*\",Failing_Kids!$F140,1)),IF(ISERROR(SEARCH(\"*Bio*\",Failing_Kids!$F140,1)),IF(ISERROR(SEARCH(\"*Chem*\",Failing_Kids!$F140,1)),IF(ISERROR(SEARCH(\"*Physics*\",Failing_Kids!$F140,1)),\"\",\"X\"),\"X\"),\"X\"),\"X\")","v":""},{"$f":"IF(ISERROR(SEARCH(\"*His*\",Failing_Kids!$F140,1)),IF(ISERROR(SEARCH(\"*GOV*\",Failing_Kids!$F140,1)),IF(ISERROR(SEARCH(\"*Econ*\",Failing_Kids!$F140,1)),IF(ISERROR(SEARCH(\"*Soc*\",Failing_Kids!$F140,1)),\"\",\"X\"),\"X\"),\"X\"),\"X\")","v":""},{"$f":"IF(ISERROR(SEARCH(\"*PE*\",Failing_Kids!$F140,1)),\"\",\"X\")","v":""}]
[{"$f":"Failing_Kids!C141","v":"Durham"},{"$f":"Failing_Kids!D141","v":"Brian"},{"$f":"IF(ISERROR(SEARCH(\"*English*\",Failing_Kids!F141,1)),\"\",\"X \")","v":""},{"$f":"IF(ISERROR(SEARCH(\"*Geometry*\",Failing_Kids!$F141,1)),IF(ISERROR(SEARCH(\"*Math*\",Failing_Kids!$F141,1)),IF(ISERROR(SEARCH(\"*Calc*\",Failing_Kids!$F141,1)),IF(ISERROR(SEARCH(\"*Algebra*\",Failing_Kids!$F141,1)),\"\",\"X\"),\"X\"),\"X\"),\"X\")","v":"X"},{"$f":"IF(ISERROR(SEARCH(\"*Science*\",Failing_Kids!$F141,1)),IF(ISERROR(SEARCH(\"*Bio*\",Failing_Kids!$F141,1)),IF(ISERROR(SEARCH(\"*Chem*\",Failing_Kids!$F141,1)),IF(ISERROR(SEARCH(\"*Physics*\",Failing_Kids!$F141,1)),\"\",\"X\"),\"X\"),\"X\"),\"X\")","v":""},{"$f":"IF(ISERROR(SEARCH(\"*His*\",Failing_Kids!$F141,1)),IF(ISERROR(SEARCH(\"*GOV*\",Failing_Kids!$F141,1)),IF(ISERROR(SEARCH(\"*Econ*\",Failing_Kids!$F141,1)),IF(ISERROR(SEARCH(\"*Soc*\",Failing_Kids!$F141,1)),\"\",\"X\"),\"X\"),\"X\"),\"X\")","v":""},{"$f":"IF(ISERROR(SEARCH(\"*PE*\",Failing_Kids!$F141,1)),\"\",\"X\")","v":""}]
[{"$f":"Failing_Kids!C142","v":"Durham"},{"$f":"Failing_Kids!D142","v":"Vera"},{"$f":"IF(ISERROR(SEARCH(\"*English*\",Failing_Kids!F142,1)),\"\",\"X \")","v":""},{"$f":"IF(ISERROR(SEARCH(\"*Geometry*\",Failing_Kids!$F142,1)),IF(ISERROR(SEARCH(\"*Math*\",Failing_Kids!$F142,1)),IF(ISERROR(SEARCH(\"*Calc*\",Failing_Kids!$F142,1)),IF(ISERROR(SEARCH(\"*Algebra*\",Failing_Kids!$F142,1)),\"\",\"X\"),\"X\"),\"X\"),\"X\")","v":"X"},{"$f":"IF(ISERROR(SEARCH(\"*Science*\",Failing_Kids!$F142,1)),IF(ISERROR(SEARCH(\"*Bio*\",Failing_Kids!$F142,1)),IF(ISERROR(SEARCH(\"*Chem*\",Failing_Kids!$F142,1)),IF(ISERROR(SEARCH(\"*Physics*\",Failing_Kids!$F142,1)),\"\",\"X\"),\"X\"),\"X\"),\"X\")","v":""},{"$f":"IF(ISERROR(SEARCH(\"*His*\",Failing_Kids!$F142,1)),IF(ISERROR(SEARCH(\"*GOV*\",Failing_Kids!$F142,1)),IF(ISERROR(SEARCH(\"*Econ*\",Failing_Kids!$F142,1)),IF(ISERROR(SEARCH(\"*Soc*\",Failing_Kids!$F142,1)),\"\",\"X\"),\"X\"),\"X\"),\"X\")","v":""},{"$f":"IF(ISERROR(SEARCH(\"*PE*\",Failing_Kids!$F142,1)),\"\",\"X\")","v":""}]
[{"$f":"Failing_Kids!C143","v":"Durham"},{"$f":"Failing_Kids!D143","v":"Vera"},{"$f":"IF(ISERROR(SEARCH(\"*English*\",Failing_Kids!F143,1)),\"\",\"X \")","v":"X "},{"$f":"IF(ISERROR(SEARCH(\"*Geometry*\",Failing_Kids!$F143,1)),IF(ISERROR(SEARCH(\"*Math*\",Failing_Kids!$F143,1)),IF(ISERROR(SEARCH(\"*Calc*\",Failing_Kids!$F143,1)),IF(ISERROR(SEARCH(\"*Algebra*\",Failing_Kids!$F143,1)),\"\",\"X\"),\"X\"),\"X\"),\"X\")","v":""},{"$f":"IF(ISERROR(SEARCH(\"*Science*\",Failing_Kids!$F143,1)),IF(ISERROR(SEARCH(\"*Bio*\",Failing_Kids!$F143,1)),IF(ISERROR(SEARCH(\"*Chem*\",Failing_Kids!$F143,1)),IF(ISERROR(SEARCH(\"*Physics*\",Failing_Kids!$F143,1)),\"\",\"X\"),\"X\"),\"X\"),\"X\")","v":""},{"$f":"IF(ISERROR(SEARCH(\"*His*\",Failing_Kids!$F143,1)),IF(ISERROR(SEARCH(\"*GOV*\",Failing_Kids!$F143,1)),IF(ISERROR(SEARCH(\"*Econ*\",Failing_Kids!$F143,1)),IF(ISERROR(SEARCH(\"*Soc*\",Failing_Kids!$F143,1)),\"\",\"X\"),\"X\"),\"X\"),\"X\")","v":""},{"$f":"IF(ISERROR(SEARCH(\"*PE*\",Failing_Kids!$F143,1)),\"\",\"X\")","v":""}]
[{"$f":"Failing_Kids!C144","v":"English"},{"$f":"Failing_Kids!D144","v":"Harry"},{"$f":"IF(ISERROR(SEARCH(\"*English*\",Failing_Kids!F144,1)),\"\",\"X \")","v":"X "},{"$f":"IF(ISERROR(SEARCH(\"*Geometry*\",Failing_Kids!$F144,1)),IF(ISERROR(SEARCH(\"*Math*\",Failing_Kids!$F144,1)),IF(ISERROR(SEARCH(\"*Calc*\",Failing_Kids!$F144,1)),IF(ISERROR(SEARCH(\"*Algebra*\",Failing_Kids!$F144,1)),\"\",\"X\"),\"X\"),\"X\"),\"X\")","v":""},{"$f":"IF(ISERROR(SEARCH(\"*Science*\",Failing_Kids!$F144,1)),IF(ISERROR(SEARCH(\"*Bio*\",Failing_Kids!$F144,1)),IF(ISERROR(SEARCH(\"*Chem*\",Failing_Kids!$F144,1)),IF(ISERROR(SEARCH(\"*Physics*\",Failing_Kids!$F144,1)),\"\",\"X\"),\"X\"),\"X\"),\"X\")","v":""},{"$f":"IF(ISERROR(SEARCH(\"*His*\",Failing_Kids!$F144,1)),IF(ISERROR(SEARCH(\"*GOV*\",Failing_Kids!$F144,1)),IF(ISERROR(SEARCH(\"*Econ*\",Failing_Kids!$F144,1)),IF(ISERROR(SEARCH(\"*Soc*\",Failing_Kids!$F144,1)),\"\",\"X\"),\"X\"),\"X\"),\"X\")","v":""},{"$f":"IF(ISERROR(SEARCH(\"*PE*\",Failing_Kids!$F144,1)),\"\",\"X\")","v":""}]
[{"$f":"Failing_Kids!C145","v":"English"},{"$f":"Failing_Kids!D145","v":"Harry"},{"$f":"IF(ISERROR(SEARCH(\"*English*\",Failing_Kids!F145,1)),\"\",\"X \")","v":""},{"$f":"IF(ISERROR(SEARCH(\"*Geometry*\",Failing_Kids!$F145,1)),IF(ISERROR(SEARCH(\"*Math*\",Failing_Kids!$F145,1)),IF(ISERROR(SEARCH(\"*Calc*\",Failing_Kids!$F145,1)),IF(ISERROR(SEARCH(\"*Algebra*\",Failing_Kids!$F145,1)),\"\",\"X\"),\"X\"),\"X\"),\"X\")","v":""},{"$f":"IF(ISERROR(SEARCH(\"*Science*\",Failing_Kids!$F145,1)),IF(ISERROR(SEARCH(\"*Bio*\",Failing_Kids!$F145,1)),IF(ISERROR(SEARCH(\"*Chem*\",Failing_Kids!$F145,1)),IF(ISERROR(SEARCH(\"*Physics*\",Failing_Kids!$F145,1)),\"\",\"X\"),\"X\"),\"X\"),\"X\")","v":""},{"$f":"IF(ISERROR(SEARCH(\"*His*\",Failing_Kids!$F145,1)),IF(ISERROR(SEARCH(\"*GOV*\",Failing_Kids!$F145,1)),IF(ISERROR(SEARCH(\"*Econ*\",Failing_Kids!$F145,1)),IF(ISERROR(SEARCH(\"*Soc*\",Failing_Kids!$F145,1)),\"\",\"X\"),\"X\"),\"X\"),\"X\")","v":"X"},{"$f":"IF(ISERROR(SEARCH(\"*PE*\",Failing_Kids!$F145,1)),\"\",\"X\")","v":""}]
[{"$f":"Failing_Kids!C146","v":"Ewing"},{"$f":"Failing_Kids!D146","v":"Sharon"},{"$f":"IF(ISERROR(SEARCH(\"*English*\",Failing_Kids!F146,1)),\"\",\"X \")","v":""},{"$f":"IF(ISERROR(SEARCH(\"*Geometry*\",Failing_Kids!$F146,1)),IF(ISERROR(SEARCH(\"*Math*\",Failing_Kids!$F146,1)),IF(ISERROR(SEARCH(\"*Calc*\",Failing_Kids!$F146,1)),IF(ISERROR(SEARCH(\"*Algebra*\",Failing_Kids!$F146,1)),\"\",\"X\"),\"X\"),\"X\"),\"X\")","v":"X"},{"$f":"IF(ISERROR(SEARCH(\"*Science*\",Failing_Kids!$F146,1)),IF(ISERROR(SEARCH(\"*Bio*\",Failing_Kids!$F146,1)),IF(ISERROR(SEARCH(\"*Chem*\",Failing_Kids!$F146,1)),IF(ISERROR(SEARCH(\"*Physics*\",Failing_Kids!$F146,1)),\"\",\"X\"),\"X\"),\"X\"),\"X\")","v":""},{"$f":"IF(ISERROR(SEARCH(\"*His*\",Failing_Kids!$F146,1)),IF(ISERROR(SEARCH(\"*GOV*\",Failing_Kids!$F146,1)),IF(ISERROR(SEARCH(\"*Econ*\",Failing_Kids!$F146,1)),IF(ISERROR(SEARCH(\"*Soc*\",Failing_Kids!$F146,1)),\"\",\"X\"),\"X\"),\"X\"),\"X\")","v":""},{"$f":"IF(ISERROR(SEARCH(\"*PE*\",Failing_Kids!$F146,1)),\"\",\"X\")","v":""}]
[{"$f":"Failing_Kids!C147","v":"Ewing"},{"$f":"Failing_Kids!D147","v":"Sharon"},{"$f":"IF(ISERROR(SEARCH(\"*English*\",Failing_Kids!F147,1)),\"\",\"X \")","v":""},{"$f":"IF(ISERROR(SEARCH(\"*Geometry*\",Failing_Kids!$F147,1)),IF(ISERROR(SEARCH(\"*Math*\",Failing_Kids!$F147,1)),IF(ISERROR(SEARCH(\"*Calc*\",Failing_Kids!$F147,1)),IF(ISERROR(SEARCH(\"*Algebra*\",Failing_Kids!$F147,1)),\"\",\"X\"),\"X\"),\"X\"),\"X\")","v":""},{"$f":"IF(ISERROR(SEARCH(\"*Science*\",Failing_Kids!$F147,1)),IF(ISERROR(SEARCH(\"*Bio*\",Failing_Kids!$F147,1)),IF(ISERROR(SEARCH(\"*Chem*\",Failing_Kids!$F147,1)),IF(ISERROR(SEARCH(\"*Physics*\",Failing_Kids!$F147,1)),\"\",\"X\"),\"X\"),\"X\"),\"X\")","v":"X"},{"$f":"IF(ISERROR(SEARCH(\"*His*\",Failing_Kids!$F147,1)),IF(ISERROR(SEARCH(\"*GOV*\",Failing_Kids!$F147,1)),IF(ISERROR(SEARCH(\"*Econ*\",Failing_Kids!$F147,1)),IF(ISERROR(SEARCH(\"*Soc*\",Failing_Kids!$F147,1)),\"\",\"X\"),\"X\"),\"X\"),\"X\")","v":""},{"$f":"IF(ISERROR(SEARCH(\"*PE*\",Failing_Kids!$F147,1)),\"\",\"X\")","v":""}]
[{"$f":"Failing_Kids!C148","v":"Faulkner"},{"$f":"Failing_Kids!D148","v":"Norman"},{"$f":"IF(ISERROR(SEARCH(\"*English*\",Failing_Kids!F148,1)),\"\",\"X \")","v":""},{"$f":"IF(ISERROR(SEARCH(\"*Geometry*\",Failing_Kids!$F148,1)),IF(ISERROR(SEARCH(\"*Math*\",Failing_Kids!$F148,1)),IF(ISERROR(SEARCH(\"*Calc*\",Failing_Kids!$F148,1)),IF(ISERROR(SEARCH(\"*Algebra*\",Failing_Kids!$F148,1)),\"\",\"X\"),\"X\"),\"X\"),\"X\")","v":"X"},{"$f":"IF(ISERROR(SEARCH(\"*Science*\",Failing_Kids!$F148,1)),IF(ISERROR(SEARCH(\"*Bio*\",Failing_Kids!$F148,1)),IF(ISERROR(SEARCH(\"*Chem*\",Failing_Kids!$F148,1)),IF(ISERROR(SEARCH(\"*Physics*\",Failing_Kids!$F148,1)),\"\",\"X\"),\"X\"),\"X\"),\"X\")","v":""},{"$f":"IF(ISERROR(SEARCH(\"*His*\",Failing_Kids!$F148,1)),IF(ISERROR(SEARCH(\"*GOV*\",Failing_Kids!$F148,1)),IF(ISERROR(SEARCH(\"*Econ*\",Failing_Kids!$F148,1)),IF(ISERROR(SEARCH(\"*Soc*\",Failing_Kids!$F148,1)),\"\",\"X\"),\"X\"),\"X\"),\"X\")","v":""},{"$f":"IF(ISERROR(SEARCH(\"*PE*\",Failing_Kids!$F148,1)),\"\",\"X\")","v":""}]
[{"$f":"Failing_Kids!C149","v":"Faulkner"},{"$f":"Failing_Kids!D149","v":"Norman"},{"$f":"IF(ISERROR(SEARCH(\"*English*\",Failing_Kids!F149,1)),\"\",\"X \")","v":""},{"$f":"IF(ISERROR(SEARCH(\"*Geometry*\",Failing_Kids!$F149,1)),IF(ISERROR(SEARCH(\"*Math*\",Failing_Kids!$F149,1)),IF(ISERROR(SEARCH(\"*Calc*\",Failing_Kids!$F149,1)),IF(ISERROR(SEARCH(\"*Algebra*\",Failing_Kids!$F149,1)),\"\",\"X\"),\"X\"),\"X\"),\"X\")","v":""},{"$f":"IF(ISERROR(SEARCH(\"*Science*\",Failing_Kids!$F149,1)),IF(ISERROR(SEARCH(\"*Bio*\",Failing_Kids!$F149,1)),IF(ISERROR(SEARCH(\"*Chem*\",Failing_Kids!$F149,1)),IF(ISERROR(SEARCH(\"*Physics*\",Failing_Kids!$F149,1)),\"\",\"X\"),\"X\"),\"X\"),\"X\")","v":""},{"$f":"IF(ISERROR(SEARCH(\"*His*\",Failing_Kids!$F149,1)),IF(ISERROR(SEARCH(\"*GOV*\",Failing_Kids!$F149,1)),IF(ISERROR(SEARCH(\"*Econ*\",Failing_Kids!$F149,1)),IF(ISERROR(SEARCH(\"*Soc*\",Failing_Kids!$F149,1)),\"\",\"X\"),\"X\"),\"X\"),\"X\")","v":""},{"$f":"IF(ISERROR(SEARCH(\"*PE*\",Failing_Kids!$F149,1)),\"\",\"X\")","v":""}]
[{"$f":"Failing_Kids!C150","v":"Fernandez"},{"$f":"Failing_Kids!D150","v":"Carlos"},{"$f":"IF(ISERROR(SEARCH(\"*English*\",Failing_Kids!F150,1)),\"\",\"X \")","v":"X "},{"$f":"IF(ISERROR(SEARCH(\"*Geometry*\",Failing_Kids!$F150,1)),IF(ISERROR(SEARCH(\"*Math*\",Failing_Kids!$F150,1)),IF(ISERROR(SEARCH(\"*Calc*\",Failing_Kids!$F150,1)),IF(ISERROR(SEARCH(\"*Algebra*\",Failing_Kids!$F150,1)),\"\",\"X\"),\"X\"),\"X\"),\"X\")","v":""},{"$f":"IF(ISERROR(SEARCH(\"*Science*\",Failing_Kids!$F150,1)),IF(ISERROR(SEARCH(\"*Bio*\",Failing_Kids!$F150,1)),IF(ISERROR(SEARCH(\"*Chem*\",Failing_Kids!$F150,1)),IF(ISERROR(SEARCH(\"*Physics*\",Failing_Kids!$F150,1)),\"\",\"X\"),\"X\"),\"X\"),\"X\")","v":""},{"$f":"IF(ISERROR(SEARCH(\"*His*\",Failing_Kids!$F150,1)),IF(ISERROR(SEARCH(\"*GOV*\",Failing_Kids!$F150,1)),IF(ISERROR(SEARCH(\"*Econ*\",Failing_Kids!$F150,1)),IF(ISERROR(SEARCH(\"*Soc*\",Failing_Kids!$F150,1)),\"\",\"X\"),\"X\"),\"X\"),\"X\")","v":""},{"$f":"IF(ISERROR(SEARCH(\"*PE*\",Failing_Kids!$F150,1)),\"\",\"X\")","v":""}]
[{"$f":"Failing_Kids!C151","v":"Fields"},{"$f":"Failing_Kids!D151","v":"Douglas"},{"$f":"IF(ISERROR(SEARCH(\"*English*\",Failing_Kids!F151,1)),\"\",\"X \")","v":""},{"$f":"IF(ISERROR(SEARCH(\"*Geometry*\",Failing_Kids!$F151,1)),IF(ISERROR(SEARCH(\"*Math*\",Failing_Kids!$F151,1)),IF(ISERROR(SEARCH(\"*Calc*\",Failing_Kids!$F151,1)),IF(ISERROR(SEARCH(\"*Algebra*\",Failing_Kids!$F151,1)),\"\",\"X\"),\"X\"),\"X\"),\"X\")","v":"X"},{"$f":"IF(ISERROR(SEARCH(\"*Science*\",Failing_Kids!$F151,1)),IF(ISERROR(SEARCH(\"*Bio*\",Failing_Kids!$F151,1)),IF(ISERROR(SEARCH(\"*Chem*\",Failing_Kids!$F151,1)),IF(ISERROR(SEARCH(\"*Physics*\",Failing_Kids!$F151,1)),\"\",\"X\"),\"X\"),\"X\"),\"X\")","v":""},{"$f":"IF(ISERROR(SEARCH(\"*His*\",Failing_Kids!$F151,1)),IF(ISERROR(SEARCH(\"*GOV*\",Failing_Kids!$F151,1)),IF(ISERROR(SEARCH(\"*Econ*\",Failing_Kids!$F151,1)),IF(ISERROR(SEARCH(\"*Soc*\",Failing_Kids!$F151,1)),\"\",\"X\"),\"X\"),\"X\"),\"X\")","v":""},{"$f":"IF(ISERROR(SEARCH(\"*PE*\",Failing_Kids!$F151,1)),\"\",\"X\")","v":""}]
[{"$f":"Failing_Kids!C152","v":"Fischer"},{"$f":"Failing_Kids!D152","v":"Karla"},{"$f":"IF(ISERROR(SEARCH(\"*English*\",Failing_Kids!F152,1)),\"\",\"X \")","v":""},{"$f":"IF(ISERROR(SEARCH(\"*Geometry*\",Failing_Kids!$F152,1)),IF(ISERROR(SEARCH(\"*Math*\",Failing_Kids!$F152,1)),IF(ISERROR(SEARCH(\"*Calc*\",Failing_Kids!$F152,1)),IF(ISERROR(SEARCH(\"*Algebra*\",Failing_Kids!$F152,1)),\"\",\"X\"),\"X\"),\"X\"),\"X\")","v":""},{"$f":"IF(ISERROR(SEARCH(\"*Science*\",Failing_Kids!$F152,1)),IF(ISERROR(SEARCH(\"*Bio*\",Failing_Kids!$F152,1)),IF(ISERROR(SEARCH(\"*Chem*\",Failing_Kids!$F152,1)),IF(ISERROR(SEARCH(\"*Physics*\",Failing_Kids!$F152,1)),\"\",\"X\"),\"X\"),\"X\"),\"X\")","v":""},{"$f":"IF(ISERROR(SEARCH(\"*His*\",Failing_Kids!$F152,1)),IF(ISERROR(SEARCH(\"*GOV*\",Failing_Kids!$F152,1)),IF(ISERROR(SEARCH(\"*Econ*\",Failing_Kids!$F152,1)),IF(ISERROR(SEARCH(\"*Soc*\",Failing_Kids!$F152,1)),\"\",\"X\"),\"X\"),\"X\"),\"X\")","v":"X"},{"$f":"IF(ISERROR(SEARCH(\"*PE*\",Failing_Kids!$F152,1)),\"\",\"X\")","v":""}]
[{"$f":"Failing_Kids!C153","v":"Fletcher"},{"$f":"Failing_Kids!D153","v":"Judith"},{"$f":"IF(ISERROR(SEARCH(\"*English*\",Failing_Kids!F153,1)),\"\",\"X \")","v":"X "},{"$f":"IF(ISERROR(SEARCH(\"*Geometry*\",Failing_Kids!$F153,1)),IF(ISERROR(SEARCH(\"*Math*\",Failing_Kids!$F153,1)),IF(ISERROR(SEARCH(\"*Calc*\",Failing_Kids!$F153,1)),IF(ISERROR(SEARCH(\"*Algebra*\",Failing_Kids!$F153,1)),\"\",\"X\"),\"X\"),\"X\"),\"X\")","v":""},{"$f":"IF(ISERROR(SEARCH(\"*Science*\",Failing_Kids!$F153,1)),IF(ISERROR(SEARCH(\"*Bio*\",Failing_Kids!$F153,1)),IF(ISERROR(SEARCH(\"*Chem*\",Failing_Kids!$F153,1)),IF(ISERROR(SEARCH(\"*Physics*\",Failing_Kids!$F153,1)),\"\",\"X\"),\"X\"),\"X\"),\"X\")","v":""},{"$f":"IF(ISERROR(SEARCH(\"*His*\",Failing_Kids!$F153,1)),IF(ISERROR(SEARCH(\"*GOV*\",Failing_Kids!$F153,1)),IF(ISERROR(SEARCH(\"*Econ*\",Failing_Kids!$F153,1)),IF(ISERROR(SEARCH(\"*Soc*\",Failing_Kids!$F153,1)),\"\",\"X\"),\"X\"),\"X\"),\"X\")","v":""},{"$f":"IF(ISERROR(SEARCH(\"*PE*\",Failing_Kids!$F153,1)),\"\",\"X\")","v":""}]
[{"$f":"Failing_Kids!C154","v":"Fletcher"},{"$f":"Failing_Kids!D154","v":"Myrtle"},{"$f":"IF(ISERROR(SEARCH(\"*English*\",Failing_Kids!F154,1)),\"\",\"X \")","v":""},{"$f":"IF(ISERROR(SEARCH(\"*Geometry*\",Failing_Kids!$F154,1)),IF(ISERROR(SEARCH(\"*Math*\",Failing_Kids!$F154,1)),IF(ISERROR(SEARCH(\"*Calc*\",Failing_Kids!$F154,1)),IF(ISERROR(SEARCH(\"*Algebra*\",Failing_Kids!$F154,1)),\"\",\"X\"),\"X\"),\"X\"),\"X\")","v":""},{"$f":"IF(ISERROR(SEARCH(\"*Science*\",Failing_Kids!$F154,1)),IF(ISERROR(SEARCH(\"*Bio*\",Failing_Kids!$F154,1)),IF(ISERROR(SEARCH(\"*Chem*\",Failing_Kids!$F154,1)),IF(ISERROR(SEARCH(\"*Physics*\",Failing_Kids!$F154,1)),\"\",\"X\"),\"X\"),\"X\"),\"X\")","v":""},{"$f":"IF(ISERROR(SEARCH(\"*His*\",Failing_Kids!$F154,1)),IF(ISERROR(SEARCH(\"*GOV*\",Failing_Kids!$F154,1)),IF(ISERROR(SEARCH(\"*Econ*\",Failing_Kids!$F154,1)),IF(ISERROR(SEARCH(\"*Soc*\",Failing_Kids!$F154,1)),\"\",\"X\"),\"X\"),\"X\"),\"X\")","v":"X"},{"$f":"IF(ISERROR(SEARCH(\"*PE*\",Failing_Kids!$F154,1)),\"\",\"X\")","v":""}]
[{"$f":"Failing_Kids!C155","v":"Foreman"},{"$f":"Failing_Kids!D155","v":"Jan"},{"$f":"IF(ISERROR(SEARCH(\"*English*\",Failing_Kids!F155,1)),\"\",\"X \")","v":"X "},{"$f":"IF(ISERROR(SEARCH(\"*Geometry*\",Failing_Kids!$F155,1)),IF(ISERROR(SEARCH(\"*Math*\",Failing_Kids!$F155,1)),IF(ISERROR(SEARCH(\"*Calc*\",Failing_Kids!$F155,1)),IF(ISERROR(SEARCH(\"*Algebra*\",Failing_Kids!$F155,1)),\"\",\"X\"),\"X\"),\"X\"),\"X\")","v":""},{"$f":"IF(ISERROR(SEARCH(\"*Science*\",Failing_Kids!$F155,1)),IF(ISERROR(SEARCH(\"*Bio*\",Failing_Kids!$F155,1)),IF(ISERROR(SEARCH(\"*Chem*\",Failing_Kids!$F155,1)),IF(ISERROR(SEARCH(\"*Physics*\",Failing_Kids!$F155,1)),\"\",\"X\"),\"X\"),\"X\"),\"X\")","v":""},{"$f":"IF(ISERROR(SEARCH(\"*His*\",Failing_Kids!$F155,1)),IF(ISERROR(SEARCH(\"*GOV*\",Failing_Kids!$F155,1)),IF(ISERROR(SEARCH(\"*Econ*\",Failing_Kids!$F155,1)),IF(ISERROR(SEARCH(\"*Soc*\",Failing_Kids!$F155,1)),\"\",\"X\"),\"X\"),\"X\"),\"X\")","v":""},{"$f":"IF(ISERROR(SEARCH(\"*PE*\",Failing_Kids!$F155,1)),\"\",\"X\")","v":""}]
[{"$f":"Failing_Kids!C156","v":"Frank"},{"$f":"Failing_Kids!D156","v":"Kimberly"},{"$f":"IF(ISERROR(SEARCH(\"*English*\",Failing_Kids!F156,1)),\"\",\"X \")","v":""},{"$f":"IF(ISERROR(SEARCH(\"*Geometry*\",Failing_Kids!$F156,1)),IF(ISERROR(SEARCH(\"*Math*\",Failing_Kids!$F156,1)),IF(ISERROR(SEARCH(\"*Calc*\",Failing_Kids!$F156,1)),IF(ISERROR(SEARCH(\"*Algebra*\",Failing_Kids!$F156,1)),\"\",\"X\"),\"X\"),\"X\"),\"X\")","v":""},{"$f":"IF(ISERROR(SEARCH(\"*Science*\",Failing_Kids!$F156,1)),IF(ISERROR(SEARCH(\"*Bio*\",Failing_Kids!$F156,1)),IF(ISERROR(SEARCH(\"*Chem*\",Failing_Kids!$F156,1)),IF(ISERROR(SEARCH(\"*Physics*\",Failing_Kids!$F156,1)),\"\",\"X\"),\"X\"),\"X\"),\"X\")","v":""},{"$f":"IF(ISERROR(SEARCH(\"*His*\",Failing_Kids!$F156,1)),IF(ISERROR(SEARCH(\"*GOV*\",Failing_Kids!$F156,1)),IF(ISERROR(SEARCH(\"*Econ*\",Failing_Kids!$F156,1)),IF(ISERROR(SEARCH(\"*Soc*\",Failing_Kids!$F156,1)),\"\",\"X\"),\"X\"),\"X\"),\"X\")","v":"X"},{"$f":"IF(ISERROR(SEARCH(\"*PE*\",Failing_Kids!$F156,1)),\"\",\"X\")","v":""}]
[{"$f":"Failing_Kids!C157","v":"Frank"},{"$f":"Failing_Kids!D157","v":"Kimberly"},{"$f":"IF(ISERROR(SEARCH(\"*English*\",Failing_Kids!F157,1)),\"\",\"X \")","v":""},{"$f":"IF(ISERROR(SEARCH(\"*Geometry*\",Failing_Kids!$F157,1)),IF(ISERROR(SEARCH(\"*Math*\",Failing_Kids!$F157,1)),IF(ISERROR(SEARCH(\"*Calc*\",Failing_Kids!$F157,1)),IF(ISERROR(SEARCH(\"*Algebra*\",Failing_Kids!$F157,1)),\"\",\"X\"),\"X\"),\"X\"),\"X\")","v":"X"},{"$f":"IF(ISERROR(SEARCH(\"*Science*\",Failing_Kids!$F157,1)),IF(ISERROR(SEARCH(\"*Bio*\",Failing_Kids!$F157,1)),IF(ISERROR(SEARCH(\"*Chem*\",Failing_Kids!$F157,1)),IF(ISERROR(SEARCH(\"*Physics*\",Failing_Kids!$F157,1)),\"\",\"X\"),\"X\"),\"X\"),\"X\")","v":""},{"$f":"IF(ISERROR(SEARCH(\"*His*\",Failing_Kids!$F157,1)),IF(ISERROR(SEARCH(\"*GOV*\",Failing_Kids!$F157,1)),IF(ISERROR(SEARCH(\"*Econ*\",Failing_Kids!$F157,1)),IF(ISERROR(SEARCH(\"*Soc*\",Failing_Kids!$F157,1)),\"\",\"X\"),\"X\"),\"X\"),\"X\")","v":""},{"$f":"IF(ISERROR(SEARCH(\"*PE*\",Failing_Kids!$F157,1)),\"\",\"X\")","v":""}]
[{"$f":"Failing_Kids!C158","v":"Franks"},{"$f":"Failing_Kids!D158","v":"Mildred"},{"$f":"IF(ISERROR(SEARCH(\"*English*\",Failing_Kids!F158,1)),\"\",\"X \")","v":""},{"$f":"IF(ISERROR(SEARCH(\"*Geometry*\",Failing_Kids!$F158,1)),IF(ISERROR(SEARCH(\"*Math*\",Failing_Kids!$F158,1)),IF(ISERROR(SEARCH(\"*Calc*\",Failing_Kids!$F158,1)),IF(ISERROR(SEARCH(\"*Algebra*\",Failing_Kids!$F158,1)),\"\",\"X\"),\"X\"),\"X\"),\"X\")","v":"X"},{"$f":"IF(ISERROR(SEARCH(\"*Science*\",Failing_Kids!$F158,1)),IF(ISERROR(SEARCH(\"*Bio*\",Failing_Kids!$F158,1)),IF(ISERROR(SEARCH(\"*Chem*\",Failing_Kids!$F158,1)),IF(ISERROR(SEARCH(\"*Physics*\",Failing_Kids!$F158,1)),\"\",\"X\"),\"X\"),\"X\"),\"X\")","v":""},{"$f":"IF(ISERROR(SEARCH(\"*His*\",Failing_Kids!$F158,1)),IF(ISERROR(SEARCH(\"*GOV*\",Failing_Kids!$F158,1)),IF(ISERROR(SEARCH(\"*Econ*\",Failing_Kids!$F158,1)),IF(ISERROR(SEARCH(\"*Soc*\",Failing_Kids!$F158,1)),\"\",\"X\"),\"X\"),\"X\"),\"X\")","v":""},{"$f":"IF(ISERROR(SEARCH(\"*PE*\",Failing_Kids!$F158,1)),\"\",\"X\")","v":""}]
[{"$f":"Failing_Kids!C159","v":"Frederick"},{"$f":"Failing_Kids!D159","v":"Kim"},{"$f":"IF(ISERROR(SEARCH(\"*English*\",Failing_Kids!F159,1)),\"\",\"X \")","v":""},{"$f":"IF(ISERROR(SEARCH(\"*Geometry*\",Failing_Kids!$F159,1)),IF(ISERROR(SEARCH(\"*Math*\",Failing_Kids!$F159,1)),IF(ISERROR(SEARCH(\"*Calc*\",Failing_Kids!$F159,1)),IF(ISERROR(SEARCH(\"*Algebra*\",Failing_Kids!$F159,1)),\"\",\"X\"),\"X\"),\"X\"),\"X\")","v":"X"},{"$f":"IF(ISERROR(SEARCH(\"*Science*\",Failing_Kids!$F159,1)),IF(ISERROR(SEARCH(\"*Bio*\",Failing_Kids!$F159,1)),IF(ISERROR(SEARCH(\"*Chem*\",Failing_Kids!$F159,1)),IF(ISERROR(SEARCH(\"*Physics*\",Failing_Kids!$F159,1)),\"\",\"X\"),\"X\"),\"X\"),\"X\")","v":""},{"$f":"IF(ISERROR(SEARCH(\"*His*\",Failing_Kids!$F159,1)),IF(ISERROR(SEARCH(\"*GOV*\",Failing_Kids!$F159,1)),IF(ISERROR(SEARCH(\"*Econ*\",Failing_Kids!$F159,1)),IF(ISERROR(SEARCH(\"*Soc*\",Failing_Kids!$F159,1)),\"\",\"X\"),\"X\"),\"X\"),\"X\")","v":""},{"$f":"IF(ISERROR(SEARCH(\"*PE*\",Failing_Kids!$F159,1)),\"\",\"X\")","v":""}]
[{"$f":"Failing_Kids!C160","v":"Frye"},{"$f":"Failing_Kids!D160","v":"Julie"},{"$f":"IF(ISERROR(SEARCH(\"*English*\",Failing_Kids!F160,1)),\"\",\"X \")","v":""},{"$f":"IF(ISERROR(SEARCH(\"*Geometry*\",Failing_Kids!$F160,1)),IF(ISERROR(SEARCH(\"*Math*\",Failing_Kids!$F160,1)),IF(ISERROR(SEARCH(\"*Calc*\",Failing_Kids!$F160,1)),IF(ISERROR(SEARCH(\"*Algebra*\",Failing_Kids!$F160,1)),\"\",\"X\"),\"X\"),\"X\"),\"X\")","v":"X"},{"$f":"IF(ISERROR(SEARCH(\"*Science*\",Failing_Kids!$F160,1)),IF(ISERROR(SEARCH(\"*Bio*\",Failing_Kids!$F160,1)),IF(ISERROR(SEARCH(\"*Chem*\",Failing_Kids!$F160,1)),IF(ISERROR(SEARCH(\"*Physics*\",Failing_Kids!$F160,1)),\"\",\"X\"),\"X\"),\"X\"),\"X\")","v":""},{"$f":"IF(ISERROR(SEARCH(\"*His*\",Failing_Kids!$F160,1)),IF(ISERROR(SEARCH(\"*GOV*\",Failing_Kids!$F160,1)),IF(ISERROR(SEARCH(\"*Econ*\",Failing_Kids!$F160,1)),IF(ISERROR(SEARCH(\"*Soc*\",Failing_Kids!$F160,1)),\"\",\"X\"),\"X\"),\"X\"),\"X\")","v":""},{"$f":"IF(ISERROR(SEARCH(\"*PE*\",Failing_Kids!$F160,1)),\"\",\"X\")","v":""}]
[{"$f":"Failing_Kids!C161","v":"Frye"},{"$f":"Failing_Kids!D161","v":"Julie"},{"$f":"IF(ISERROR(SEARCH(\"*English*\",Failing_Kids!F161,1)),\"\",\"X \")","v":""},{"$f":"IF(ISERROR(SEARCH(\"*Geometry*\",Failing_Kids!$F161,1)),IF(ISERROR(SEARCH(\"*Math*\",Failing_Kids!$F161,1)),IF(ISERROR(SEARCH(\"*Calc*\",Failing_Kids!$F161,1)),IF(ISERROR(SEARCH(\"*Algebra*\",Failing_Kids!$F161,1)),\"\",\"X\"),\"X\"),\"X\"),\"X\")","v":""},{"$f":"IF(ISERROR(SEARCH(\"*Science*\",Failing_Kids!$F161,1)),IF(ISERROR(SEARCH(\"*Bio*\",Failing_Kids!$F161,1)),IF(ISERROR(SEARCH(\"*Chem*\",Failing_Kids!$F161,1)),IF(ISERROR(SEARCH(\"*Physics*\",Failing_Kids!$F161,1)),\"\",\"X\"),\"X\"),\"X\"),\"X\")","v":""},{"$f":"IF(ISERROR(SEARCH(\"*His*\",Failing_Kids!$F161,1)),IF(ISERROR(SEARCH(\"*GOV*\",Failing_Kids!$F161,1)),IF(ISERROR(SEARCH(\"*Econ*\",Failing_Kids!$F161,1)),IF(ISERROR(SEARCH(\"*Soc*\",Failing_Kids!$F161,1)),\"\",\"X\"),\"X\"),\"X\"),\"X\")","v":"X"},{"$f":"IF(ISERROR(SEARCH(\"*PE*\",Failing_Kids!$F161,1)),\"\",\"X\")","v":""}]
[{"$f":"Failing_Kids!C162","v":"Galloway"},{"$f":"Failing_Kids!D162","v":"Louis"},{"$f":"IF(ISERROR(SEARCH(\"*English*\",Failing_Kids!F162,1)),\"\",\"X \")","v":"X "},{"$f":"IF(ISERROR(SEARCH(\"*Geometry*\",Failing_Kids!$F162,1)),IF(ISERROR(SEARCH(\"*Math*\",Failing_Kids!$F162,1)),IF(ISERROR(SEARCH(\"*Calc*\",Failing_Kids!$F162,1)),IF(ISERROR(SEARCH(\"*Algebra*\",Failing_Kids!$F162,1)),\"\",\"X\"),\"X\"),\"X\"),\"X\")","v":""},{"$f":"IF(ISERROR(SEARCH(\"*Science*\",Failing_Kids!$F162,1)),IF(ISERROR(SEARCH(\"*Bio*\",Failing_Kids!$F162,1)),IF(ISERROR(SEARCH(\"*Chem*\",Failing_Kids!$F162,1)),IF(ISERROR(SEARCH(\"*Physics*\",Failing_Kids!$F162,1)),\"\",\"X\"),\"X\"),\"X\"),\"X\")","v":""},{"$f":"IF(ISERROR(SEARCH(\"*His*\",Failing_Kids!$F162,1)),IF(ISERROR(SEARCH(\"*GOV*\",Failing_Kids!$F162,1)),IF(ISERROR(SEARCH(\"*Econ*\",Failing_Kids!$F162,1)),IF(ISERROR(SEARCH(\"*Soc*\",Failing_Kids!$F162,1)),\"\",\"X\"),\"X\"),\"X\"),\"X\")","v":""},{"$f":"IF(ISERROR(SEARCH(\"*PE*\",Failing_Kids!$F162,1)),\"\",\"X\")","v":""}]
[{"$f":"Failing_Kids!C163","v":"Garcia"},{"$f":"Failing_Kids!D163","v":"Inez"},{"$f":"IF(ISERROR(SEARCH(\"*English*\",Failing_Kids!F163,1)),\"\",\"X \")","v":""},{"$f":"IF(ISERROR(SEARCH(\"*Geometry*\",Failing_Kids!$F163,1)),IF(ISERROR(SEARCH(\"*Math*\",Failing_Kids!$F163,1)),IF(ISERROR(SEARCH(\"*Calc*\",Failing_Kids!$F163,1)),IF(ISERROR(SEARCH(\"*Algebra*\",Failing_Kids!$F163,1)),\"\",\"X\"),\"X\"),\"X\"),\"X\")","v":"X"},{"$f":"IF(ISERROR(SEARCH(\"*Science*\",Failing_Kids!$F163,1)),IF(ISERROR(SEARCH(\"*Bio*\",Failing_Kids!$F163,1)),IF(ISERROR(SEARCH(\"*Chem*\",Failing_Kids!$F163,1)),IF(ISERROR(SEARCH(\"*Physics*\",Failing_Kids!$F163,1)),\"\",\"X\"),\"X\"),\"X\"),\"X\")","v":""},{"$f":"IF(ISERROR(SEARCH(\"*His*\",Failing_Kids!$F163,1)),IF(ISERROR(SEARCH(\"*GOV*\",Failing_Kids!$F163,1)),IF(ISERROR(SEARCH(\"*Econ*\",Failing_Kids!$F163,1)),IF(ISERROR(SEARCH(\"*Soc*\",Failing_Kids!$F163,1)),\"\",\"X\"),\"X\"),\"X\"),\"X\")","v":""},{"$f":"IF(ISERROR(SEARCH(\"*PE*\",Failing_Kids!$F163,1)),\"\",\"X\")","v":""}]
[{"$f":"Failing_Kids!C164","v":"Garcia"},{"$f":"Failing_Kids!D164","v":"Inez"},{"$f":"IF(ISERROR(SEARCH(\"*English*\",Failing_Kids!F164,1)),\"\",\"X \")","v":"X "},{"$f":"IF(ISERROR(SEARCH(\"*Geometry*\",Failing_Kids!$F164,1)),IF(ISERROR(SEARCH(\"*Math*\",Failing_Kids!$F164,1)),IF(ISERROR(SEARCH(\"*Calc*\",Failing_Kids!$F164,1)),IF(ISERROR(SEARCH(\"*Algebra*\",Failing_Kids!$F164,1)),\"\",\"X\"),\"X\"),\"X\"),\"X\")","v":""},{"$f":"IF(ISERROR(SEARCH(\"*Science*\",Failing_Kids!$F164,1)),IF(ISERROR(SEARCH(\"*Bio*\",Failing_Kids!$F164,1)),IF(ISERROR(SEARCH(\"*Chem*\",Failing_Kids!$F164,1)),IF(ISERROR(SEARCH(\"*Physics*\",Failing_Kids!$F164,1)),\"\",\"X\"),\"X\"),\"X\"),\"X\")","v":""},{"$f":"IF(ISERROR(SEARCH(\"*His*\",Failing_Kids!$F164,1)),IF(ISERROR(SEARCH(\"*GOV*\",Failing_Kids!$F164,1)),IF(ISERROR(SEARCH(\"*Econ*\",Failing_Kids!$F164,1)),IF(ISERROR(SEARCH(\"*Soc*\",Failing_Kids!$F164,1)),\"\",\"X\"),\"X\"),\"X\"),\"X\")","v":""},{"$f":"IF(ISERROR(SEARCH(\"*PE*\",Failing_Kids!$F164,1)),\"\",\"X\")","v":""}]
[{"$f":"Failing_Kids!C165","v":"Garner"},{"$f":"Failing_Kids!D165","v":"Leonard"},{"$f":"IF(ISERROR(SEARCH(\"*English*\",Failing_Kids!F165,1)),\"\",\"X \")","v":"X "},{"$f":"IF(ISERROR(SEARCH(\"*Geometry*\",Failing_Kids!$F165,1)),IF(ISERROR(SEARCH(\"*Math*\",Failing_Kids!$F165,1)),IF(ISERROR(SEARCH(\"*Calc*\",Failing_Kids!$F165,1)),IF(ISERROR(SEARCH(\"*Algebra*\",Failing_Kids!$F165,1)),\"\",\"X\"),\"X\"),\"X\"),\"X\")","v":""},{"$f":"IF(ISERROR(SEARCH(\"*Science*\",Failing_Kids!$F165,1)),IF(ISERROR(SEARCH(\"*Bio*\",Failing_Kids!$F165,1)),IF(ISERROR(SEARCH(\"*Chem*\",Failing_Kids!$F165,1)),IF(ISERROR(SEARCH(\"*Physics*\",Failing_Kids!$F165,1)),\"\",\"X\"),\"X\"),\"X\"),\"X\")","v":""},{"$f":"IF(ISERROR(SEARCH(\"*His*\",Failing_Kids!$F165,1)),IF(ISERROR(SEARCH(\"*GOV*\",Failing_Kids!$F165,1)),IF(ISERROR(SEARCH(\"*Econ*\",Failing_Kids!$F165,1)),IF(ISERROR(SEARCH(\"*Soc*\",Failing_Kids!$F165,1)),\"\",\"X\"),\"X\"),\"X\"),\"X\")","v":""},{"$f":"IF(ISERROR(SEARCH(\"*PE*\",Failing_Kids!$F165,1)),\"\",\"X\")","v":""}]
[{"$f":"Failing_Kids!C166","v":"Garner"},{"$f":"Failing_Kids!D166","v":"Leonard"},{"$f":"IF(ISERROR(SEARCH(\"*English*\",Failing_Kids!F166,1)),\"\",\"X \")","v":""},{"$f":"IF(ISERROR(SEARCH(\"*Geometry*\",Failing_Kids!$F166,1)),IF(ISERROR(SEARCH(\"*Math*\",Failing_Kids!$F166,1)),IF(ISERROR(SEARCH(\"*Calc*\",Failing_Kids!$F166,1)),IF(ISERROR(SEARCH(\"*Algebra*\",Failing_Kids!$F166,1)),\"\",\"X\"),\"X\"),\"X\"),\"X\")","v":"X"},{"$f":"IF(ISERROR(SEARCH(\"*Science*\",Failing_Kids!$F166,1)),IF(ISERROR(SEARCH(\"*Bio*\",Failing_Kids!$F166,1)),IF(ISERROR(SEARCH(\"*Chem*\",Failing_Kids!$F166,1)),IF(ISERROR(SEARCH(\"*Physics*\",Failing_Kids!$F166,1)),\"\",\"X\"),\"X\"),\"X\"),\"X\")","v":""},{"$f":"IF(ISERROR(SEARCH(\"*His*\",Failing_Kids!$F166,1)),IF(ISERROR(SEARCH(\"*GOV*\",Failing_Kids!$F166,1)),IF(ISERROR(SEARCH(\"*Econ*\",Failing_Kids!$F166,1)),IF(ISERROR(SEARCH(\"*Soc*\",Failing_Kids!$F166,1)),\"\",\"X\"),\"X\"),\"X\"),\"X\")","v":""},{"$f":"IF(ISERROR(SEARCH(\"*PE*\",Failing_Kids!$F166,1)),\"\",\"X\")","v":""}]
[{"$f":"Failing_Kids!C167","v":"Garner"},{"$f":"Failing_Kids!D167","v":"Leonard"},{"$f":"IF(ISERROR(SEARCH(\"*English*\",Failing_Kids!F167,1)),\"\",\"X \")","v":""},{"$f":"IF(ISERROR(SEARCH(\"*Geometry*\",Failing_Kids!$F167,1)),IF(ISERROR(SEARCH(\"*Math*\",Failing_Kids!$F167,1)),IF(ISERROR(SEARCH(\"*Calc*\",Failing_Kids!$F167,1)),IF(ISERROR(SEARCH(\"*Algebra*\",Failing_Kids!$F167,1)),\"\",\"X\"),\"X\"),\"X\"),\"X\")","v":""},{"$f":"IF(ISERROR(SEARCH(\"*Science*\",Failing_Kids!$F167,1)),IF(ISERROR(SEARCH(\"*Bio*\",Failing_Kids!$F167,1)),IF(ISERROR(SEARCH(\"*Chem*\",Failing_Kids!$F167,1)),IF(ISERROR(SEARCH(\"*Physics*\",Failing_Kids!$F167,1)),\"\",\"X\"),\"X\"),\"X\"),\"X\")","v":""},{"$f":"IF(ISERROR(SEARCH(\"*His*\",Failing_Kids!$F167,1)),IF(ISERROR(SEARCH(\"*GOV*\",Failing_Kids!$F167,1)),IF(ISERROR(SEARCH(\"*Econ*\",Failing_Kids!$F167,1)),IF(ISERROR(SEARCH(\"*Soc*\",Failing_Kids!$F167,1)),\"\",\"X\"),\"X\"),\"X\"),\"X\")","v":"X"},{"$f":"IF(ISERROR(SEARCH(\"*PE*\",Failing_Kids!$F167,1)),\"\",\"X\")","v":""}]
[{"$f":"Failing_Kids!C168","v":"George"},{"$f":"Failing_Kids!D168","v":"Kevin"},{"$f":"IF(ISERROR(SEARCH(\"*English*\",Failing_Kids!F168,1)),\"\",\"X \")","v":""},{"$f":"IF(ISERROR(SEARCH(\"*Geometry*\",Failing_Kids!$F168,1)),IF(ISERROR(SEARCH(\"*Math*\",Failing_Kids!$F168,1)),IF(ISERROR(SEARCH(\"*Calc*\",Failing_Kids!$F168,1)),IF(ISERROR(SEARCH(\"*Algebra*\",Failing_Kids!$F168,1)),\"\",\"X\"),\"X\"),\"X\"),\"X\")","v":""},{"$f":"IF(ISERROR(SEARCH(\"*Science*\",Failing_Kids!$F168,1)),IF(ISERROR(SEARCH(\"*Bio*\",Failing_Kids!$F168,1)),IF(ISERROR(SEARCH(\"*Chem*\",Failing_Kids!$F168,1)),IF(ISERROR(SEARCH(\"*Physics*\",Failing_Kids!$F168,1)),\"\",\"X\"),\"X\"),\"X\"),\"X\")","v":""},{"$f":"IF(ISERROR(SEARCH(\"*His*\",Failing_Kids!$F168,1)),IF(ISERROR(SEARCH(\"*GOV*\",Failing_Kids!$F168,1)),IF(ISERROR(SEARCH(\"*Econ*\",Failing_Kids!$F168,1)),IF(ISERROR(SEARCH(\"*Soc*\",Failing_Kids!$F168,1)),\"\",\"X\"),\"X\"),\"X\"),\"X\")","v":""},{"$f":"IF(ISERROR(SEARCH(\"*PE*\",Failing_Kids!$F168,1)),\"\",\"X\")","v":""}]
[{"$f":"Failing_Kids!C169","v":"Giles"},{"$f":"Failing_Kids!D169","v":"Nancy"},{"$f":"IF(ISERROR(SEARCH(\"*English*\",Failing_Kids!F169,1)),\"\",\"X \")","v":""},{"$f":"IF(ISERROR(SEARCH(\"*Geometry*\",Failing_Kids!$F169,1)),IF(ISERROR(SEARCH(\"*Math*\",Failing_Kids!$F169,1)),IF(ISERROR(SEARCH(\"*Calc*\",Failing_Kids!$F169,1)),IF(ISERROR(SEARCH(\"*Algebra*\",Failing_Kids!$F169,1)),\"\",\"X\"),\"X\"),\"X\"),\"X\")","v":""},{"$f":"IF(ISERROR(SEARCH(\"*Science*\",Failing_Kids!$F169,1)),IF(ISERROR(SEARCH(\"*Bio*\",Failing_Kids!$F169,1)),IF(ISERROR(SEARCH(\"*Chem*\",Failing_Kids!$F169,1)),IF(ISERROR(SEARCH(\"*Physics*\",Failing_Kids!$F169,1)),\"\",\"X\"),\"X\"),\"X\"),\"X\")","v":""},{"$f":"IF(ISERROR(SEARCH(\"*His*\",Failing_Kids!$F169,1)),IF(ISERROR(SEARCH(\"*GOV*\",Failing_Kids!$F169,1)),IF(ISERROR(SEARCH(\"*Econ*\",Failing_Kids!$F169,1)),IF(ISERROR(SEARCH(\"*Soc*\",Failing_Kids!$F169,1)),\"\",\"X\"),\"X\"),\"X\"),\"X\")","v":"X"},{"$f":"IF(ISERROR(SEARCH(\"*PE*\",Failing_Kids!$F169,1)),\"\",\"X\")","v":""}]
[{"$f":"Failing_Kids!C170","v":"Glass"},{"$f":"Failing_Kids!D170","v":"Bobby"},{"$f":"IF(ISERROR(SEARCH(\"*English*\",Failing_Kids!F170,1)),\"\",\"X \")","v":""},{"$f":"IF(ISERROR(SEARCH(\"*Geometry*\",Failing_Kids!$F170,1)),IF(ISERROR(SEARCH(\"*Math*\",Failing_Kids!$F170,1)),IF(ISERROR(SEARCH(\"*Calc*\",Failing_Kids!$F170,1)),IF(ISERROR(SEARCH(\"*Algebra*\",Failing_Kids!$F170,1)),\"\",\"X\"),\"X\"),\"X\"),\"X\")","v":"X"},{"$f":"IF(ISERROR(SEARCH(\"*Science*\",Failing_Kids!$F170,1)),IF(ISERROR(SEARCH(\"*Bio*\",Failing_Kids!$F170,1)),IF(ISERROR(SEARCH(\"*Chem*\",Failing_Kids!$F170,1)),IF(ISERROR(SEARCH(\"*Physics*\",Failing_Kids!$F170,1)),\"\",\"X\"),\"X\"),\"X\"),\"X\")","v":""},{"$f":"IF(ISERROR(SEARCH(\"*His*\",Failing_Kids!$F170,1)),IF(ISERROR(SEARCH(\"*GOV*\",Failing_Kids!$F170,1)),IF(ISERROR(SEARCH(\"*Econ*\",Failing_Kids!$F170,1)),IF(ISERROR(SEARCH(\"*Soc*\",Failing_Kids!$F170,1)),\"\",\"X\"),\"X\"),\"X\"),\"X\")","v":""},{"$f":"IF(ISERROR(SEARCH(\"*PE*\",Failing_Kids!$F170,1)),\"\",\"X\")","v":""}]
[{"$f":"Failing_Kids!C171","v":"Glover"},{"$f":"Failing_Kids!D171","v":"Chad"},{"$f":"IF(ISERROR(SEARCH(\"*English*\",Failing_Kids!F171,1)),\"\",\"X \")","v":""},{"$f":"IF(ISERROR(SEARCH(\"*Geometry*\",Failing_Kids!$F171,1)),IF(ISERROR(SEARCH(\"*Math*\",Failing_Kids!$F171,1)),IF(ISERROR(SEARCH(\"*Calc*\",Failing_Kids!$F171,1)),IF(ISERROR(SEARCH(\"*Algebra*\",Failing_Kids!$F171,1)),\"\",\"X\"),\"X\"),\"X\"),\"X\")","v":"X"},{"$f":"IF(ISERROR(SEARCH(\"*Science*\",Failing_Kids!$F171,1)),IF(ISERROR(SEARCH(\"*Bio*\",Failing_Kids!$F171,1)),IF(ISERROR(SEARCH(\"*Chem*\",Failing_Kids!$F171,1)),IF(ISERROR(SEARCH(\"*Physics*\",Failing_Kids!$F171,1)),\"\",\"X\"),\"X\"),\"X\"),\"X\")","v":""},{"$f":"IF(ISERROR(SEARCH(\"*His*\",Failing_Kids!$F171,1)),IF(ISERROR(SEARCH(\"*GOV*\",Failing_Kids!$F171,1)),IF(ISERROR(SEARCH(\"*Econ*\",Failing_Kids!$F171,1)),IF(ISERROR(SEARCH(\"*Soc*\",Failing_Kids!$F171,1)),\"\",\"X\"),\"X\"),\"X\"),\"X\")","v":""},{"$f":"IF(ISERROR(SEARCH(\"*PE*\",Failing_Kids!$F171,1)),\"\",\"X\")","v":""}]
[{"$f":"Failing_Kids!C172","v":"Gonzales"},{"$f":"Failing_Kids!D172","v":"Justin"},{"$f":"IF(ISERROR(SEARCH(\"*English*\",Failing_Kids!F172,1)),\"\",\"X \")","v":"X "},{"$f":"IF(ISERROR(SEARCH(\"*Geometry*\",Failing_Kids!$F172,1)),IF(ISERROR(SEARCH(\"*Math*\",Failing_Kids!$F172,1)),IF(ISERROR(SEARCH(\"*Calc*\",Failing_Kids!$F172,1)),IF(ISERROR(SEARCH(\"*Algebra*\",Failing_Kids!$F172,1)),\"\",\"X\"),\"X\"),\"X\"),\"X\")","v":""},{"$f":"IF(ISERROR(SEARCH(\"*Science*\",Failing_Kids!$F172,1)),IF(ISERROR(SEARCH(\"*Bio*\",Failing_Kids!$F172,1)),IF(ISERROR(SEARCH(\"*Chem*\",Failing_Kids!$F172,1)),IF(ISERROR(SEARCH(\"*Physics*\",Failing_Kids!$F172,1)),\"\",\"X\"),\"X\"),\"X\"),\"X\")","v":""},{"$f":"IF(ISERROR(SEARCH(\"*His*\",Failing_Kids!$F172,1)),IF(ISERROR(SEARCH(\"*GOV*\",Failing_Kids!$F172,1)),IF(ISERROR(SEARCH(\"*Econ*\",Failing_Kids!$F172,1)),IF(ISERROR(SEARCH(\"*Soc*\",Failing_Kids!$F172,1)),\"\",\"X\"),\"X\"),\"X\"),\"X\")","v":""},{"$f":"IF(ISERROR(SEARCH(\"*PE*\",Failing_Kids!$F172,1)),\"\",\"X\")","v":""}]
[{"$f":"Failing_Kids!C173","v":"Gonzales"},{"$f":"Failing_Kids!D173","v":"Justin"},{"$f":"IF(ISERROR(SEARCH(\"*English*\",Failing_Kids!F173,1)),\"\",\"X \")","v":""},{"$f":"IF(ISERROR(SEARCH(\"*Geometry*\",Failing_Kids!$F173,1)),IF(ISERROR(SEARCH(\"*Math*\",Failing_Kids!$F173,1)),IF(ISERROR(SEARCH(\"*Calc*\",Failing_Kids!$F173,1)),IF(ISERROR(SEARCH(\"*Algebra*\",Failing_Kids!$F173,1)),\"\",\"X\"),\"X\"),\"X\"),\"X\")","v":"X"},{"$f":"IF(ISERROR(SEARCH(\"*Science*\",Failing_Kids!$F173,1)),IF(ISERROR(SEARCH(\"*Bio*\",Failing_Kids!$F173,1)),IF(ISERROR(SEARCH(\"*Chem*\",Failing_Kids!$F173,1)),IF(ISERROR(SEARCH(\"*Physics*\",Failing_Kids!$F173,1)),\"\",\"X\"),\"X\"),\"X\"),\"X\")","v":""},{"$f":"IF(ISERROR(SEARCH(\"*His*\",Failing_Kids!$F173,1)),IF(ISERROR(SEARCH(\"*GOV*\",Failing_Kids!$F173,1)),IF(ISERROR(SEARCH(\"*Econ*\",Failing_Kids!$F173,1)),IF(ISERROR(SEARCH(\"*Soc*\",Failing_Kids!$F173,1)),\"\",\"X\"),\"X\"),\"X\"),\"X\")","v":""},{"$f":"IF(ISERROR(SEARCH(\"*PE*\",Failing_Kids!$F173,1)),\"\",\"X\")","v":""}]
[{"$f":"Failing_Kids!C174","v":"Gonzales"},{"$f":"Failing_Kids!D174","v":"Justin"},{"$f":"IF(ISERROR(SEARCH(\"*English*\",Failing_Kids!F174,1)),\"\",\"X \")","v":""},{"$f":"IF(ISERROR(SEARCH(\"*Geometry*\",Failing_Kids!$F174,1)),IF(ISERROR(SEARCH(\"*Math*\",Failing_Kids!$F174,1)),IF(ISERROR(SEARCH(\"*Calc*\",Failing_Kids!$F174,1)),IF(ISERROR(SEARCH(\"*Algebra*\",Failing_Kids!$F174,1)),\"\",\"X\"),\"X\"),\"X\"),\"X\")","v":""},{"$f":"IF(ISERROR(SEARCH(\"*Science*\",Failing_Kids!$F174,1)),IF(ISERROR(SEARCH(\"*Bio*\",Failing_Kids!$F174,1)),IF(ISERROR(SEARCH(\"*Chem*\",Failing_Kids!$F174,1)),IF(ISERROR(SEARCH(\"*Physics*\",Failing_Kids!$F174,1)),\"\",\"X\"),\"X\"),\"X\"),\"X\")","v":""},{"$f":"IF(ISERROR(SEARCH(\"*His*\",Failing_Kids!$F174,1)),IF(ISERROR(SEARCH(\"*GOV*\",Failing_Kids!$F174,1)),IF(ISERROR(SEARCH(\"*Econ*\",Failing_Kids!$F174,1)),IF(ISERROR(SEARCH(\"*Soc*\",Failing_Kids!$F174,1)),\"\",\"X\"),\"X\"),\"X\"),\"X\")","v":"X"},{"$f":"IF(ISERROR(SEARCH(\"*PE*\",Failing_Kids!$F174,1)),\"\",\"X\")","v":""}]
[{"$f":"Failing_Kids!C175","v":"Goodman"},{"$f":"Failing_Kids!D175","v":"Ada"},{"$f":"IF(ISERROR(SEARCH(\"*English*\",Failing_Kids!F175,1)),\"\",\"X \")","v":"X "},{"$f":"IF(ISERROR(SEARCH(\"*Geometry*\",Failing_Kids!$F175,1)),IF(ISERROR(SEARCH(\"*Math*\",Failing_Kids!$F175,1)),IF(ISERROR(SEARCH(\"*Calc*\",Failing_Kids!$F175,1)),IF(ISERROR(SEARCH(\"*Algebra*\",Failing_Kids!$F175,1)),\"\",\"X\"),\"X\"),\"X\"),\"X\")","v":""},{"$f":"IF(ISERROR(SEARCH(\"*Science*\",Failing_Kids!$F175,1)),IF(ISERROR(SEARCH(\"*Bio*\",Failing_Kids!$F175,1)),IF(ISERROR(SEARCH(\"*Chem*\",Failing_Kids!$F175,1)),IF(ISERROR(SEARCH(\"*Physics*\",Failing_Kids!$F175,1)),\"\",\"X\"),\"X\"),\"X\"),\"X\")","v":""},{"$f":"IF(ISERROR(SEARCH(\"*His*\",Failing_Kids!$F175,1)),IF(ISERROR(SEARCH(\"*GOV*\",Failing_Kids!$F175,1)),IF(ISERROR(SEARCH(\"*Econ*\",Failing_Kids!$F175,1)),IF(ISERROR(SEARCH(\"*Soc*\",Failing_Kids!$F175,1)),\"\",\"X\"),\"X\"),\"X\"),\"X\")","v":""},{"$f":"IF(ISERROR(SEARCH(\"*PE*\",Failing_Kids!$F175,1)),\"\",\"X\")","v":""}]
[{"$f":"Failing_Kids!C176","v":"Gordon"},{"$f":"Failing_Kids!D176","v":"Marie"},{"$f":"IF(ISERROR(SEARCH(\"*English*\",Failing_Kids!F176,1)),\"\",\"X \")","v":""},{"$f":"IF(ISERROR(SEARCH(\"*Geometry*\",Failing_Kids!$F176,1)),IF(ISERROR(SEARCH(\"*Math*\",Failing_Kids!$F176,1)),IF(ISERROR(SEARCH(\"*Calc*\",Failing_Kids!$F176,1)),IF(ISERROR(SEARCH(\"*Algebra*\",Failing_Kids!$F176,1)),\"\",\"X\"),\"X\"),\"X\"),\"X\")","v":""},{"$f":"IF(ISERROR(SEARCH(\"*Science*\",Failing_Kids!$F176,1)),IF(ISERROR(SEARCH(\"*Bio*\",Failing_Kids!$F176,1)),IF(ISERROR(SEARCH(\"*Chem*\",Failing_Kids!$F176,1)),IF(ISERROR(SEARCH(\"*Physics*\",Failing_Kids!$F176,1)),\"\",\"X\"),\"X\"),\"X\"),\"X\")","v":""},{"$f":"IF(ISERROR(SEARCH(\"*His*\",Failing_Kids!$F176,1)),IF(ISERROR(SEARCH(\"*GOV*\",Failing_Kids!$F176,1)),IF(ISERROR(SEARCH(\"*Econ*\",Failing_Kids!$F176,1)),IF(ISERROR(SEARCH(\"*Soc*\",Failing_Kids!$F176,1)),\"\",\"X\"),\"X\"),\"X\"),\"X\")","v":""},{"$f":"IF(ISERROR(SEARCH(\"*PE*\",Failing_Kids!$F176,1)),\"\",\"X\")","v":""}]
[{"$f":"Failing_Kids!C177","v":"Grant"},{"$f":"Failing_Kids!D177","v":"Mark"},{"$f":"IF(ISERROR(SEARCH(\"*English*\",Failing_Kids!F177,1)),\"\",\"X \")","v":""},{"$f":"IF(ISERROR(SEARCH(\"*Geometry*\",Failing_Kids!$F177,1)),IF(ISERROR(SEARCH(\"*Math*\",Failing_Kids!$F177,1)),IF(ISERROR(SEARCH(\"*Calc*\",Failing_Kids!$F177,1)),IF(ISERROR(SEARCH(\"*Algebra*\",Failing_Kids!$F177,1)),\"\",\"X\"),\"X\"),\"X\"),\"X\")","v":"X"},{"$f":"IF(ISERROR(SEARCH(\"*Science*\",Failing_Kids!$F177,1)),IF(ISERROR(SEARCH(\"*Bio*\",Failing_Kids!$F177,1)),IF(ISERROR(SEARCH(\"*Chem*\",Failing_Kids!$F177,1)),IF(ISERROR(SEARCH(\"*Physics*\",Failing_Kids!$F177,1)),\"\",\"X\"),\"X\"),\"X\"),\"X\")","v":""},{"$f":"IF(ISERROR(SEARCH(\"*His*\",Failing_Kids!$F177,1)),IF(ISERROR(SEARCH(\"*GOV*\",Failing_Kids!$F177,1)),IF(ISERROR(SEARCH(\"*Econ*\",Failing_Kids!$F177,1)),IF(ISERROR(SEARCH(\"*Soc*\",Failing_Kids!$F177,1)),\"\",\"X\"),\"X\"),\"X\"),\"X\")","v":""},{"$f":"IF(ISERROR(SEARCH(\"*PE*\",Failing_Kids!$F177,1)),\"\",\"X\")","v":""}]
[{"$f":"Failing_Kids!C178","v":"Gray"},{"$f":"Failing_Kids!D178","v":"Arthur"},{"$f":"IF(ISERROR(SEARCH(\"*English*\",Failing_Kids!F178,1)),\"\",\"X \")","v":""},{"$f":"IF(ISERROR(SEARCH(\"*Geometry*\",Failing_Kids!$F178,1)),IF(ISERROR(SEARCH(\"*Math*\",Failing_Kids!$F178,1)),IF(ISERROR(SEARCH(\"*Calc*\",Failing_Kids!$F178,1)),IF(ISERROR(SEARCH(\"*Algebra*\",Failing_Kids!$F178,1)),\"\",\"X\"),\"X\"),\"X\"),\"X\")","v":"X"},{"$f":"IF(ISERROR(SEARCH(\"*Science*\",Failing_Kids!$F178,1)),IF(ISERROR(SEARCH(\"*Bio*\",Failing_Kids!$F178,1)),IF(ISERROR(SEARCH(\"*Chem*\",Failing_Kids!$F178,1)),IF(ISERROR(SEARCH(\"*Physics*\",Failing_Kids!$F178,1)),\"\",\"X\"),\"X\"),\"X\"),\"X\")","v":""},{"$f":"IF(ISERROR(SEARCH(\"*His*\",Failing_Kids!$F178,1)),IF(ISERROR(SEARCH(\"*GOV*\",Failing_Kids!$F178,1)),IF(ISERROR(SEARCH(\"*Econ*\",Failing_Kids!$F178,1)),IF(ISERROR(SEARCH(\"*Soc*\",Failing_Kids!$F178,1)),\"\",\"X\"),\"X\"),\"X\"),\"X\")","v":""},{"$f":"IF(ISERROR(SEARCH(\"*PE*\",Failing_Kids!$F178,1)),\"\",\"X\")","v":""}]
[{"$f":"Failing_Kids!C179","v":"Gray"},{"$f":"Failing_Kids!D179","v":"Arthur"},{"$f":"IF(ISERROR(SEARCH(\"*English*\",Failing_Kids!F179,1)),\"\",\"X \")","v":""},{"$f":"IF(ISERROR(SEARCH(\"*Geometry*\",Failing_Kids!$F179,1)),IF(ISERROR(SEARCH(\"*Math*\",Failing_Kids!$F179,1)),IF(ISERROR(SEARCH(\"*Calc*\",Failing_Kids!$F179,1)),IF(ISERROR(SEARCH(\"*Algebra*\",Failing_Kids!$F179,1)),\"\",\"X\"),\"X\"),\"X\"),\"X\")","v":""},{"$f":"IF(ISERROR(SEARCH(\"*Science*\",Failing_Kids!$F179,1)),IF(ISERROR(SEARCH(\"*Bio*\",Failing_Kids!$F179,1)),IF(ISERROR(SEARCH(\"*Chem*\",Failing_Kids!$F179,1)),IF(ISERROR(SEARCH(\"*Physics*\",Failing_Kids!$F179,1)),\"\",\"X\"),\"X\"),\"X\"),\"X\")","v":""},{"$f":"IF(ISERROR(SEARCH(\"*His*\",Failing_Kids!$F179,1)),IF(ISERROR(SEARCH(\"*GOV*\",Failing_Kids!$F179,1)),IF(ISERROR(SEARCH(\"*Econ*\",Failing_Kids!$F179,1)),IF(ISERROR(SEARCH(\"*Soc*\",Failing_Kids!$F179,1)),\"\",\"X\"),\"X\"),\"X\"),\"X\")","v":"X"},{"$f":"IF(ISERROR(SEARCH(\"*PE*\",Failing_Kids!$F179,1)),\"\",\"X\")","v":""}]
[{"$f":"Failing_Kids!C180","v":"Griffin"},{"$f":"Failing_Kids!D180","v":"Billy"},{"$f":"IF(ISERROR(SEARCH(\"*English*\",Failing_Kids!F180,1)),\"\",\"X \")","v":""},{"$f":"IF(ISERROR(SEARCH(\"*Geometry*\",Failing_Kids!$F180,1)),IF(ISERROR(SEARCH(\"*Math*\",Failing_Kids!$F180,1)),IF(ISERROR(SEARCH(\"*Calc*\",Failing_Kids!$F180,1)),IF(ISERROR(SEARCH(\"*Algebra*\",Failing_Kids!$F180,1)),\"\",\"X\"),\"X\"),\"X\"),\"X\")","v":"X"},{"$f":"IF(ISERROR(SEARCH(\"*Science*\",Failing_Kids!$F180,1)),IF(ISERROR(SEARCH(\"*Bio*\",Failing_Kids!$F180,1)),IF(ISERROR(SEARCH(\"*Chem*\",Failing_Kids!$F180,1)),IF(ISERROR(SEARCH(\"*Physics*\",Failing_Kids!$F180,1)),\"\",\"X\"),\"X\"),\"X\"),\"X\")","v":""},{"$f":"IF(ISERROR(SEARCH(\"*His*\",Failing_Kids!$F180,1)),IF(ISERROR(SEARCH(\"*GOV*\",Failing_Kids!$F180,1)),IF(ISERROR(SEARCH(\"*Econ*\",Failing_Kids!$F180,1)),IF(ISERROR(SEARCH(\"*Soc*\",Failing_Kids!$F180,1)),\"\",\"X\"),\"X\"),\"X\"),\"X\")","v":""},{"$f":"IF(ISERROR(SEARCH(\"*PE*\",Failing_Kids!$F180,1)),\"\",\"X\")","v":""}]
[{"$f":"Failing_Kids!C181","v":"Gutierrez"},{"$f":"Failing_Kids!D181","v":"Stephen"},{"$f":"IF(ISERROR(SEARCH(\"*English*\",Failing_Kids!F181,1)),\"\",\"X \")","v":""},{"$f":"IF(ISERROR(SEARCH(\"*Geometry*\",Failing_Kids!$F181,1)),IF(ISERROR(SEARCH(\"*Math*\",Failing_Kids!$F181,1)),IF(ISERROR(SEARCH(\"*Calc*\",Failing_Kids!$F181,1)),IF(ISERROR(SEARCH(\"*Algebra*\",Failing_Kids!$F181,1)),\"\",\"X\"),\"X\"),\"X\"),\"X\")","v":"X"},{"$f":"IF(ISERROR(SEARCH(\"*Science*\",Failing_Kids!$F181,1)),IF(ISERROR(SEARCH(\"*Bio*\",Failing_Kids!$F181,1)),IF(ISERROR(SEARCH(\"*Chem*\",Failing_Kids!$F181,1)),IF(ISERROR(SEARCH(\"*Physics*\",Failing_Kids!$F181,1)),\"\",\"X\"),\"X\"),\"X\"),\"X\")","v":""},{"$f":"IF(ISERROR(SEARCH(\"*His*\",Failing_Kids!$F181,1)),IF(ISERROR(SEARCH(\"*GOV*\",Failing_Kids!$F181,1)),IF(ISERROR(SEARCH(\"*Econ*\",Failing_Kids!$F181,1)),IF(ISERROR(SEARCH(\"*Soc*\",Failing_Kids!$F181,1)),\"\",\"X\"),\"X\"),\"X\"),\"X\")","v":""},{"$f":"IF(ISERROR(SEARCH(\"*PE*\",Failing_Kids!$F181,1)),\"\",\"X\")","v":""}]
[{"$f":"Failing_Kids!C182","v":"Hamilton"},{"$f":"Failing_Kids!D182","v":"Jeanne"},{"$f":"IF(ISERROR(SEARCH(\"*English*\",Failing_Kids!F182,1)),\"\",\"X \")","v":""},{"$f":"IF(ISERROR(SEARCH(\"*Geometry*\",Failing_Kids!$F182,1)),IF(ISERROR(SEARCH(\"*Math*\",Failing_Kids!$F182,1)),IF(ISERROR(SEARCH(\"*Calc*\",Failing_Kids!$F182,1)),IF(ISERROR(SEARCH(\"*Algebra*\",Failing_Kids!$F182,1)),\"\",\"X\"),\"X\"),\"X\"),\"X\")","v":"X"},{"$f":"IF(ISERROR(SEARCH(\"*Science*\",Failing_Kids!$F182,1)),IF(ISERROR(SEARCH(\"*Bio*\",Failing_Kids!$F182,1)),IF(ISERROR(SEARCH(\"*Chem*\",Failing_Kids!$F182,1)),IF(ISERROR(SEARCH(\"*Physics*\",Failing_Kids!$F182,1)),\"\",\"X\"),\"X\"),\"X\"),\"X\")","v":""},{"$f":"IF(ISERROR(SEARCH(\"*His*\",Failing_Kids!$F182,1)),IF(ISERROR(SEARCH(\"*GOV*\",Failing_Kids!$F182,1)),IF(ISERROR(SEARCH(\"*Econ*\",Failing_Kids!$F182,1)),IF(ISERROR(SEARCH(\"*Soc*\",Failing_Kids!$F182,1)),\"\",\"X\"),\"X\"),\"X\"),\"X\")","v":""},{"$f":"IF(ISERROR(SEARCH(\"*PE*\",Failing_Kids!$F182,1)),\"\",\"X\")","v":""}]
[{"$f":"Failing_Kids!C183","v":"Hammond"},{"$f":"Failing_Kids!D183","v":"Esther"},{"$f":"IF(ISERROR(SEARCH(\"*English*\",Failing_Kids!F183,1)),\"\",\"X \")","v":""},{"$f":"IF(ISERROR(SEARCH(\"*Geometry*\",Failing_Kids!$F183,1)),IF(ISERROR(SEARCH(\"*Math*\",Failing_Kids!$F183,1)),IF(ISERROR(SEARCH(\"*Calc*\",Failing_Kids!$F183,1)),IF(ISERROR(SEARCH(\"*Algebra*\",Failing_Kids!$F183,1)),\"\",\"X\"),\"X\"),\"X\"),\"X\")","v":"X"},{"$f":"IF(ISERROR(SEARCH(\"*Science*\",Failing_Kids!$F183,1)),IF(ISERROR(SEARCH(\"*Bio*\",Failing_Kids!$F183,1)),IF(ISERROR(SEARCH(\"*Chem*\",Failing_Kids!$F183,1)),IF(ISERROR(SEARCH(\"*Physics*\",Failing_Kids!$F183,1)),\"\",\"X\"),\"X\"),\"X\"),\"X\")","v":""},{"$f":"IF(ISERROR(SEARCH(\"*His*\",Failing_Kids!$F183,1)),IF(ISERROR(SEARCH(\"*GOV*\",Failing_Kids!$F183,1)),IF(ISERROR(SEARCH(\"*Econ*\",Failing_Kids!$F183,1)),IF(ISERROR(SEARCH(\"*Soc*\",Failing_Kids!$F183,1)),\"\",\"X\"),\"X\"),\"X\"),\"X\")","v":""},{"$f":"IF(ISERROR(SEARCH(\"*PE*\",Failing_Kids!$F183,1)),\"\",\"X\")","v":""}]
[{"$f":"Failing_Kids!C184","v":"Hammond"},{"$f":"Failing_Kids!D184","v":"Esther"},{"$f":"IF(ISERROR(SEARCH(\"*English*\",Failing_Kids!F184,1)),\"\",\"X \")","v":""},{"$f":"IF(ISERROR(SEARCH(\"*Geometry*\",Failing_Kids!$F184,1)),IF(ISERROR(SEARCH(\"*Math*\",Failing_Kids!$F184,1)),IF(ISERROR(SEARCH(\"*Calc*\",Failing_Kids!$F184,1)),IF(ISERROR(SEARCH(\"*Algebra*\",Failing_Kids!$F184,1)),\"\",\"X\"),\"X\"),\"X\"),\"X\")","v":""},{"$f":"IF(ISERROR(SEARCH(\"*Science*\",Failing_Kids!$F184,1)),IF(ISERROR(SEARCH(\"*Bio*\",Failing_Kids!$F184,1)),IF(ISERROR(SEARCH(\"*Chem*\",Failing_Kids!$F184,1)),IF(ISERROR(SEARCH(\"*Physics*\",Failing_Kids!$F184,1)),\"\",\"X\"),\"X\"),\"X\"),\"X\")","v":""},{"$f":"IF(ISERROR(SEARCH(\"*His*\",Failing_Kids!$F184,1)),IF(ISERROR(SEARCH(\"*GOV*\",Failing_Kids!$F184,1)),IF(ISERROR(SEARCH(\"*Econ*\",Failing_Kids!$F184,1)),IF(ISERROR(SEARCH(\"*Soc*\",Failing_Kids!$F184,1)),\"\",\"X\"),\"X\"),\"X\"),\"X\")","v":"X"},{"$f":"IF(ISERROR(SEARCH(\"*PE*\",Failing_Kids!$F184,1)),\"\",\"X\")","v":""}]
[{"$f":"Failing_Kids!C185","v":"Haney"},{"$f":"Failing_Kids!D185","v":"Madeline"},{"$f":"IF(ISERROR(SEARCH(\"*English*\",Failing_Kids!F185,1)),\"\",\"X \")","v":""},{"$f":"IF(ISERROR(SEARCH(\"*Geometry*\",Failing_Kids!$F185,1)),IF(ISERROR(SEARCH(\"*Math*\",Failing_Kids!$F185,1)),IF(ISERROR(SEARCH(\"*Calc*\",Failing_Kids!$F185,1)),IF(ISERROR(SEARCH(\"*Algebra*\",Failing_Kids!$F185,1)),\"\",\"X\"),\"X\"),\"X\"),\"X\")","v":""},{"$f":"IF(ISERROR(SEARCH(\"*Science*\",Failing_Kids!$F185,1)),IF(ISERROR(SEARCH(\"*Bio*\",Failing_Kids!$F185,1)),IF(ISERROR(SEARCH(\"*Chem*\",Failing_Kids!$F185,1)),IF(ISERROR(SEARCH(\"*Physics*\",Failing_Kids!$F185,1)),\"\",\"X\"),\"X\"),\"X\"),\"X\")","v":""},{"$f":"IF(ISERROR(SEARCH(\"*His*\",Failing_Kids!$F185,1)),IF(ISERROR(SEARCH(\"*GOV*\",Failing_Kids!$F185,1)),IF(ISERROR(SEARCH(\"*Econ*\",Failing_Kids!$F185,1)),IF(ISERROR(SEARCH(\"*Soc*\",Failing_Kids!$F185,1)),\"\",\"X\"),\"X\"),\"X\"),\"X\")","v":""},{"$f":"IF(ISERROR(SEARCH(\"*PE*\",Failing_Kids!$F185,1)),\"\",\"X\")","v":""}]
[{"$f":"Failing_Kids!C186","v":"Haney"},{"$f":"Failing_Kids!D186","v":"Madeline"},{"$f":"IF(ISERROR(SEARCH(\"*English*\",Failing_Kids!F186,1)),\"\",\"X \")","v":""},{"$f":"IF(ISERROR(SEARCH(\"*Geometry*\",Failing_Kids!$F186,1)),IF(ISERROR(SEARCH(\"*Math*\",Failing_Kids!$F186,1)),IF(ISERROR(SEARCH(\"*Calc*\",Failing_Kids!$F186,1)),IF(ISERROR(SEARCH(\"*Algebra*\",Failing_Kids!$F186,1)),\"\",\"X\"),\"X\"),\"X\"),\"X\")","v":""},{"$f":"IF(ISERROR(SEARCH(\"*Science*\",Failing_Kids!$F186,1)),IF(ISERROR(SEARCH(\"*Bio*\",Failing_Kids!$F186,1)),IF(ISERROR(SEARCH(\"*Chem*\",Failing_Kids!$F186,1)),IF(ISERROR(SEARCH(\"*Physics*\",Failing_Kids!$F186,1)),\"\",\"X\"),\"X\"),\"X\"),\"X\")","v":""},{"$f":"IF(ISERROR(SEARCH(\"*His*\",Failing_Kids!$F186,1)),IF(ISERROR(SEARCH(\"*GOV*\",Failing_Kids!$F186,1)),IF(ISERROR(SEARCH(\"*Econ*\",Failing_Kids!$F186,1)),IF(ISERROR(SEARCH(\"*Soc*\",Failing_Kids!$F186,1)),\"\",\"X\"),\"X\"),\"X\"),\"X\")","v":"X"},{"$f":"IF(ISERROR(SEARCH(\"*PE*\",Failing_Kids!$F186,1)),\"\",\"X\")","v":""}]
[{"$f":"Failing_Kids!C187","v":"Hardin"},{"$f":"Failing_Kids!D187","v":"Esther"},{"$f":"IF(ISERROR(SEARCH(\"*English*\",Failing_Kids!F187,1)),\"\",\"X \")","v":"X "},{"$f":"IF(ISERROR(SEARCH(\"*Geometry*\",Failing_Kids!$F187,1)),IF(ISERROR(SEARCH(\"*Math*\",Failing_Kids!$F187,1)),IF(ISERROR(SEARCH(\"*Calc*\",Failing_Kids!$F187,1)),IF(ISERROR(SEARCH(\"*Algebra*\",Failing_Kids!$F187,1)),\"\",\"X\"),\"X\"),\"X\"),\"X\")","v":""},{"$f":"IF(ISERROR(SEARCH(\"*Science*\",Failing_Kids!$F187,1)),IF(ISERROR(SEARCH(\"*Bio*\",Failing_Kids!$F187,1)),IF(ISERROR(SEARCH(\"*Chem*\",Failing_Kids!$F187,1)),IF(ISERROR(SEARCH(\"*Physics*\",Failing_Kids!$F187,1)),\"\",\"X\"),\"X\"),\"X\"),\"X\")","v":""},{"$f":"IF(ISERROR(SEARCH(\"*His*\",Failing_Kids!$F187,1)),IF(ISERROR(SEARCH(\"*GOV*\",Failing_Kids!$F187,1)),IF(ISERROR(SEARCH(\"*Econ*\",Failing_Kids!$F187,1)),IF(ISERROR(SEARCH(\"*Soc*\",Failing_Kids!$F187,1)),\"\",\"X\"),\"X\"),\"X\"),\"X\")","v":""},{"$f":"IF(ISERROR(SEARCH(\"*PE*\",Failing_Kids!$F187,1)),\"\",\"X\")","v":""}]
[{"$f":"Failing_Kids!C188","v":"Harding"},{"$f":"Failing_Kids!D188","v":"Allen"},{"$f":"IF(ISERROR(SEARCH(\"*English*\",Failing_Kids!F188,1)),\"\",\"X \")","v":""},{"$f":"IF(ISERROR(SEARCH(\"*Geometry*\",Failing_Kids!$F188,1)),IF(ISERROR(SEARCH(\"*Math*\",Failing_Kids!$F188,1)),IF(ISERROR(SEARCH(\"*Calc*\",Failing_Kids!$F188,1)),IF(ISERROR(SEARCH(\"*Algebra*\",Failing_Kids!$F188,1)),\"\",\"X\"),\"X\"),\"X\"),\"X\")","v":"X"},{"$f":"IF(ISERROR(SEARCH(\"*Science*\",Failing_Kids!$F188,1)),IF(ISERROR(SEARCH(\"*Bio*\",Failing_Kids!$F188,1)),IF(ISERROR(SEARCH(\"*Chem*\",Failing_Kids!$F188,1)),IF(ISERROR(SEARCH(\"*Physics*\",Failing_Kids!$F188,1)),\"\",\"X\"),\"X\"),\"X\"),\"X\")","v":""},{"$f":"IF(ISERROR(SEARCH(\"*His*\",Failing_Kids!$F188,1)),IF(ISERROR(SEARCH(\"*GOV*\",Failing_Kids!$F188,1)),IF(ISERROR(SEARCH(\"*Econ*\",Failing_Kids!$F188,1)),IF(ISERROR(SEARCH(\"*Soc*\",Failing_Kids!$F188,1)),\"\",\"X\"),\"X\"),\"X\"),\"X\")","v":""},{"$f":"IF(ISERROR(SEARCH(\"*PE*\",Failing_Kids!$F188,1)),\"\",\"X\")","v":""}]
[{"$f":"Failing_Kids!C189","v":"Harmon"},{"$f":"Failing_Kids!D189","v":"Melanie"},{"$f":"IF(ISERROR(SEARCH(\"*English*\",Failing_Kids!F189,1)),\"\",\"X \")","v":""},{"$f":"IF(ISERROR(SEARCH(\"*Geometry*\",Failing_Kids!$F189,1)),IF(ISERROR(SEARCH(\"*Math*\",Failing_Kids!$F189,1)),IF(ISERROR(SEARCH(\"*Calc*\",Failing_Kids!$F189,1)),IF(ISERROR(SEARCH(\"*Algebra*\",Failing_Kids!$F189,1)),\"\",\"X\"),\"X\"),\"X\"),\"X\")","v":"X"},{"$f":"IF(ISERROR(SEARCH(\"*Science*\",Failing_Kids!$F189,1)),IF(ISERROR(SEARCH(\"*Bio*\",Failing_Kids!$F189,1)),IF(ISERROR(SEARCH(\"*Chem*\",Failing_Kids!$F189,1)),IF(ISERROR(SEARCH(\"*Physics*\",Failing_Kids!$F189,1)),\"\",\"X\"),\"X\"),\"X\"),\"X\")","v":""},{"$f":"IF(ISERROR(SEARCH(\"*His*\",Failing_Kids!$F189,1)),IF(ISERROR(SEARCH(\"*GOV*\",Failing_Kids!$F189,1)),IF(ISERROR(SEARCH(\"*Econ*\",Failing_Kids!$F189,1)),IF(ISERROR(SEARCH(\"*Soc*\",Failing_Kids!$F189,1)),\"\",\"X\"),\"X\"),\"X\"),\"X\")","v":""},{"$f":"IF(ISERROR(SEARCH(\"*PE*\",Failing_Kids!$F189,1)),\"\",\"X\")","v":""}]
[{"$f":"Failing_Kids!C190","v":"Harmon"},{"$f":"Failing_Kids!D190","v":"Melanie"},{"$f":"IF(ISERROR(SEARCH(\"*English*\",Failing_Kids!F190,1)),\"\",\"X \")","v":"X "},{"$f":"IF(ISERROR(SEARCH(\"*Geometry*\",Failing_Kids!$F190,1)),IF(ISERROR(SEARCH(\"*Math*\",Failing_Kids!$F190,1)),IF(ISERROR(SEARCH(\"*Calc*\",Failing_Kids!$F190,1)),IF(ISERROR(SEARCH(\"*Algebra*\",Failing_Kids!$F190,1)),\"\",\"X\"),\"X\"),\"X\"),\"X\")","v":""},{"$f":"IF(ISERROR(SEARCH(\"*Science*\",Failing_Kids!$F190,1)),IF(ISERROR(SEARCH(\"*Bio*\",Failing_Kids!$F190,1)),IF(ISERROR(SEARCH(\"*Chem*\",Failing_Kids!$F190,1)),IF(ISERROR(SEARCH(\"*Physics*\",Failing_Kids!$F190,1)),\"\",\"X\"),\"X\"),\"X\"),\"X\")","v":""},{"$f":"IF(ISERROR(SEARCH(\"*His*\",Failing_Kids!$F190,1)),IF(ISERROR(SEARCH(\"*GOV*\",Failing_Kids!$F190,1)),IF(ISERROR(SEARCH(\"*Econ*\",Failing_Kids!$F190,1)),IF(ISERROR(SEARCH(\"*Soc*\",Failing_Kids!$F190,1)),\"\",\"X\"),\"X\"),\"X\"),\"X\")","v":""},{"$f":"IF(ISERROR(SEARCH(\"*PE*\",Failing_Kids!$F190,1)),\"\",\"X\")","v":""}]
[{"$f":"Failing_Kids!C191","v":"Harmon"},{"$f":"Failing_Kids!D191","v":"Melanie"},{"$f":"IF(ISERROR(SEARCH(\"*English*\",Failing_Kids!F191,1)),\"\",\"X \")","v":""},{"$f":"IF(ISERROR(SEARCH(\"*Geometry*\",Failing_Kids!$F191,1)),IF(ISERROR(SEARCH(\"*Math*\",Failing_Kids!$F191,1)),IF(ISERROR(SEARCH(\"*Calc*\",Failing_Kids!$F191,1)),IF(ISERROR(SEARCH(\"*Algebra*\",Failing_Kids!$F191,1)),\"\",\"X\"),\"X\"),\"X\"),\"X\")","v":"X"},{"$f":"IF(ISERROR(SEARCH(\"*Science*\",Failing_Kids!$F191,1)),IF(ISERROR(SEARCH(\"*Bio*\",Failing_Kids!$F191,1)),IF(ISERROR(SEARCH(\"*Chem*\",Failing_Kids!$F191,1)),IF(ISERROR(SEARCH(\"*Physics*\",Failing_Kids!$F191,1)),\"\",\"X\"),\"X\"),\"X\"),\"X\")","v":""},{"$f":"IF(ISERROR(SEARCH(\"*His*\",Failing_Kids!$F191,1)),IF(ISERROR(SEARCH(\"*GOV*\",Failing_Kids!$F191,1)),IF(ISERROR(SEARCH(\"*Econ*\",Failing_Kids!$F191,1)),IF(ISERROR(SEARCH(\"*Soc*\",Failing_Kids!$F191,1)),\"\",\"X\"),\"X\"),\"X\"),\"X\")","v":""},{"$f":"IF(ISERROR(SEARCH(\"*PE*\",Failing_Kids!$F191,1)),\"\",\"X\")","v":""}]
[{"$f":"Failing_Kids!C192","v":"Harmon"},{"$f":"Failing_Kids!D192","v":"Melanie"},{"$f":"IF(ISERROR(SEARCH(\"*English*\",Failing_Kids!F192,1)),\"\",\"X \")","v":""},{"$f":"IF(ISERROR(SEARCH(\"*Geometry*\",Failing_Kids!$F192,1)),IF(ISERROR(SEARCH(\"*Math*\",Failing_Kids!$F192,1)),IF(ISERROR(SEARCH(\"*Calc*\",Failing_Kids!$F192,1)),IF(ISERROR(SEARCH(\"*Algebra*\",Failing_Kids!$F192,1)),\"\",\"X\"),\"X\"),\"X\"),\"X\")","v":""},{"$f":"IF(ISERROR(SEARCH(\"*Science*\",Failing_Kids!$F192,1)),IF(ISERROR(SEARCH(\"*Bio*\",Failing_Kids!$F192,1)),IF(ISERROR(SEARCH(\"*Chem*\",Failing_Kids!$F192,1)),IF(ISERROR(SEARCH(\"*Physics*\",Failing_Kids!$F192,1)),\"\",\"X\"),\"X\"),\"X\"),\"X\")","v":"X"},{"$f":"IF(ISERROR(SEARCH(\"*His*\",Failing_Kids!$F192,1)),IF(ISERROR(SEARCH(\"*GOV*\",Failing_Kids!$F192,1)),IF(ISERROR(SEARCH(\"*Econ*\",Failing_Kids!$F192,1)),IF(ISERROR(SEARCH(\"*Soc*\",Failing_Kids!$F192,1)),\"\",\"X\"),\"X\"),\"X\"),\"X\")","v":""},{"$f":"IF(ISERROR(SEARCH(\"*PE*\",Failing_Kids!$F192,1)),\"\",\"X\")","v":""}]
[{"$f":"Failing_Kids!C193","v":"Harrington"},{"$f":"Failing_Kids!D193","v":"Keith"},{"$f":"IF(ISERROR(SEARCH(\"*English*\",Failing_Kids!F193,1)),\"\",\"X \")","v":""},{"$f":"IF(ISERROR(SEARCH(\"*Geometry*\",Failing_Kids!$F193,1)),IF(ISERROR(SEARCH(\"*Math*\",Failing_Kids!$F193,1)),IF(ISERROR(SEARCH(\"*Calc*\",Failing_Kids!$F193,1)),IF(ISERROR(SEARCH(\"*Algebra*\",Failing_Kids!$F193,1)),\"\",\"X\"),\"X\"),\"X\"),\"X\")","v":""},{"$f":"IF(ISERROR(SEARCH(\"*Science*\",Failing_Kids!$F193,1)),IF(ISERROR(SEARCH(\"*Bio*\",Failing_Kids!$F193,1)),IF(ISERROR(SEARCH(\"*Chem*\",Failing_Kids!$F193,1)),IF(ISERROR(SEARCH(\"*Physics*\",Failing_Kids!$F193,1)),\"\",\"X\"),\"X\"),\"X\"),\"X\")","v":""},{"$f":"IF(ISERROR(SEARCH(\"*His*\",Failing_Kids!$F193,1)),IF(ISERROR(SEARCH(\"*GOV*\",Failing_Kids!$F193,1)),IF(ISERROR(SEARCH(\"*Econ*\",Failing_Kids!$F193,1)),IF(ISERROR(SEARCH(\"*Soc*\",Failing_Kids!$F193,1)),\"\",\"X\"),\"X\"),\"X\"),\"X\")","v":"X"},{"$f":"IF(ISERROR(SEARCH(\"*PE*\",Failing_Kids!$F193,1)),\"\",\"X\")","v":""}]
[{"$f":"Failing_Kids!C194","v":"Harrington"},{"$f":"Failing_Kids!D194","v":"Keith"},{"$f":"IF(ISERROR(SEARCH(\"*English*\",Failing_Kids!F194,1)),\"\",\"X \")","v":""},{"$f":"IF(ISERROR(SEARCH(\"*Geometry*\",Failing_Kids!$F194,1)),IF(ISERROR(SEARCH(\"*Math*\",Failing_Kids!$F194,1)),IF(ISERROR(SEARCH(\"*Calc*\",Failing_Kids!$F194,1)),IF(ISERROR(SEARCH(\"*Algebra*\",Failing_Kids!$F194,1)),\"\",\"X\"),\"X\"),\"X\"),\"X\")","v":"X"},{"$f":"IF(ISERROR(SEARCH(\"*Science*\",Failing_Kids!$F194,1)),IF(ISERROR(SEARCH(\"*Bio*\",Failing_Kids!$F194,1)),IF(ISERROR(SEARCH(\"*Chem*\",Failing_Kids!$F194,1)),IF(ISERROR(SEARCH(\"*Physics*\",Failing_Kids!$F194,1)),\"\",\"X\"),\"X\"),\"X\"),\"X\")","v":""},{"$f":"IF(ISERROR(SEARCH(\"*His*\",Failing_Kids!$F194,1)),IF(ISERROR(SEARCH(\"*GOV*\",Failing_Kids!$F194,1)),IF(ISERROR(SEARCH(\"*Econ*\",Failing_Kids!$F194,1)),IF(ISERROR(SEARCH(\"*Soc*\",Failing_Kids!$F194,1)),\"\",\"X\"),\"X\"),\"X\"),\"X\")","v":""},{"$f":"IF(ISERROR(SEARCH(\"*PE*\",Failing_Kids!$F194,1)),\"\",\"X\")","v":""}]
[{"$f":"Failing_Kids!C195","v":"Harrington"},{"$f":"Failing_Kids!D195","v":"Keith"},{"$f":"IF(ISERROR(SEARCH(\"*English*\",Failing_Kids!F195,1)),\"\",\"X \")","v":"X "},{"$f":"IF(ISERROR(SEARCH(\"*Geometry*\",Failing_Kids!$F195,1)),IF(ISERROR(SEARCH(\"*Math*\",Failing_Kids!$F195,1)),IF(ISERROR(SEARCH(\"*Calc*\",Failing_Kids!$F195,1)),IF(ISERROR(SEARCH(\"*Algebra*\",Failing_Kids!$F195,1)),\"\",\"X\"),\"X\"),\"X\"),\"X\")","v":""},{"$f":"IF(ISERROR(SEARCH(\"*Science*\",Failing_Kids!$F195,1)),IF(ISERROR(SEARCH(\"*Bio*\",Failing_Kids!$F195,1)),IF(ISERROR(SEARCH(\"*Chem*\",Failing_Kids!$F195,1)),IF(ISERROR(SEARCH(\"*Physics*\",Failing_Kids!$F195,1)),\"\",\"X\"),\"X\"),\"X\"),\"X\")","v":""},{"$f":"IF(ISERROR(SEARCH(\"*His*\",Failing_Kids!$F195,1)),IF(ISERROR(SEARCH(\"*GOV*\",Failing_Kids!$F195,1)),IF(ISERROR(SEARCH(\"*Econ*\",Failing_Kids!$F195,1)),IF(ISERROR(SEARCH(\"*Soc*\",Failing_Kids!$F195,1)),\"\",\"X\"),\"X\"),\"X\"),\"X\")","v":""},{"$f":"IF(ISERROR(SEARCH(\"*PE*\",Failing_Kids!$F195,1)),\"\",\"X\")","v":""}]
[{"$f":"Failing_Kids!C196","v":"Hartman"},{"$f":"Failing_Kids!D196","v":"Lillian"},{"$f":"IF(ISERROR(SEARCH(\"*English*\",Failing_Kids!F196,1)),\"\",\"X \")","v":""},{"$f":"IF(ISERROR(SEARCH(\"*Geometry*\",Failing_Kids!$F196,1)),IF(ISERROR(SEARCH(\"*Math*\",Failing_Kids!$F196,1)),IF(ISERROR(SEARCH(\"*Calc*\",Failing_Kids!$F196,1)),IF(ISERROR(SEARCH(\"*Algebra*\",Failing_Kids!$F196,1)),\"\",\"X\"),\"X\"),\"X\"),\"X\")","v":""},{"$f":"IF(ISERROR(SEARCH(\"*Science*\",Failing_Kids!$F196,1)),IF(ISERROR(SEARCH(\"*Bio*\",Failing_Kids!$F196,1)),IF(ISERROR(SEARCH(\"*Chem*\",Failing_Kids!$F196,1)),IF(ISERROR(SEARCH(\"*Physics*\",Failing_Kids!$F196,1)),\"\",\"X\"),\"X\"),\"X\"),\"X\")","v":""},{"$f":"IF(ISERROR(SEARCH(\"*His*\",Failing_Kids!$F196,1)),IF(ISERROR(SEARCH(\"*GOV*\",Failing_Kids!$F196,1)),IF(ISERROR(SEARCH(\"*Econ*\",Failing_Kids!$F196,1)),IF(ISERROR(SEARCH(\"*Soc*\",Failing_Kids!$F196,1)),\"\",\"X\"),\"X\"),\"X\"),\"X\")","v":""},{"$f":"IF(ISERROR(SEARCH(\"*PE*\",Failing_Kids!$F196,1)),\"\",\"X\")","v":""}]
[{"$f":"Failing_Kids!C197","v":"Haynes"},{"$f":"Failing_Kids!D197","v":"Alan"},{"$f":"IF(ISERROR(SEARCH(\"*English*\",Failing_Kids!F197,1)),\"\",\"X \")","v":""},{"$f":"IF(ISERROR(SEARCH(\"*Geometry*\",Failing_Kids!$F197,1)),IF(ISERROR(SEARCH(\"*Math*\",Failing_Kids!$F197,1)),IF(ISERROR(SEARCH(\"*Calc*\",Failing_Kids!$F197,1)),IF(ISERROR(SEARCH(\"*Algebra*\",Failing_Kids!$F197,1)),\"\",\"X\"),\"X\"),\"X\"),\"X\")","v":"X"},{"$f":"IF(ISERROR(SEARCH(\"*Science*\",Failing_Kids!$F197,1)),IF(ISERROR(SEARCH(\"*Bio*\",Failing_Kids!$F197,1)),IF(ISERROR(SEARCH(\"*Chem*\",Failing_Kids!$F197,1)),IF(ISERROR(SEARCH(\"*Physics*\",Failing_Kids!$F197,1)),\"\",\"X\"),\"X\"),\"X\"),\"X\")","v":""},{"$f":"IF(ISERROR(SEARCH(\"*His*\",Failing_Kids!$F197,1)),IF(ISERROR(SEARCH(\"*GOV*\",Failing_Kids!$F197,1)),IF(ISERROR(SEARCH(\"*Econ*\",Failing_Kids!$F197,1)),IF(ISERROR(SEARCH(\"*Soc*\",Failing_Kids!$F197,1)),\"\",\"X\"),\"X\"),\"X\"),\"X\")","v":""},{"$f":"IF(ISERROR(SEARCH(\"*PE*\",Failing_Kids!$F197,1)),\"\",\"X\")","v":""}]
[{"$f":"Failing_Kids!C198","v":"Haynes"},{"$f":"Failing_Kids!D198","v":"Alan"},{"$f":"IF(ISERROR(SEARCH(\"*English*\",Failing_Kids!F198,1)),\"\",\"X \")","v":""},{"$f":"IF(ISERROR(SEARCH(\"*Geometry*\",Failing_Kids!$F198,1)),IF(ISERROR(SEARCH(\"*Math*\",Failing_Kids!$F198,1)),IF(ISERROR(SEARCH(\"*Calc*\",Failing_Kids!$F198,1)),IF(ISERROR(SEARCH(\"*Algebra*\",Failing_Kids!$F198,1)),\"\",\"X\"),\"X\"),\"X\"),\"X\")","v":""},{"$f":"IF(ISERROR(SEARCH(\"*Science*\",Failing_Kids!$F198,1)),IF(ISERROR(SEARCH(\"*Bio*\",Failing_Kids!$F198,1)),IF(ISERROR(SEARCH(\"*Chem*\",Failing_Kids!$F198,1)),IF(ISERROR(SEARCH(\"*Physics*\",Failing_Kids!$F198,1)),\"\",\"X\"),\"X\"),\"X\"),\"X\")","v":""},{"$f":"IF(ISERROR(SEARCH(\"*His*\",Failing_Kids!$F198,1)),IF(ISERROR(SEARCH(\"*GOV*\",Failing_Kids!$F198,1)),IF(ISERROR(SEARCH(\"*Econ*\",Failing_Kids!$F198,1)),IF(ISERROR(SEARCH(\"*Soc*\",Failing_Kids!$F198,1)),\"\",\"X\"),\"X\"),\"X\"),\"X\")","v":"X"},{"$f":"IF(ISERROR(SEARCH(\"*PE*\",Failing_Kids!$F198,1)),\"\",\"X\")","v":""}]
[{"$f":"Failing_Kids!C199","v":"Hebert"},{"$f":"Failing_Kids!D199","v":"Carlos"},{"$f":"IF(ISERROR(SEARCH(\"*English*\",Failing_Kids!F199,1)),\"\",\"X \")","v":""},{"$f":"IF(ISERROR(SEARCH(\"*Geometry*\",Failing_Kids!$F199,1)),IF(ISERROR(SEARCH(\"*Math*\",Failing_Kids!$F199,1)),IF(ISERROR(SEARCH(\"*Calc*\",Failing_Kids!$F199,1)),IF(ISERROR(SEARCH(\"*Algebra*\",Failing_Kids!$F199,1)),\"\",\"X\"),\"X\"),\"X\"),\"X\")","v":"X"},{"$f":"IF(ISERROR(SEARCH(\"*Science*\",Failing_Kids!$F199,1)),IF(ISERROR(SEARCH(\"*Bio*\",Failing_Kids!$F199,1)),IF(ISERROR(SEARCH(\"*Chem*\",Failing_Kids!$F199,1)),IF(ISERROR(SEARCH(\"*Physics*\",Failing_Kids!$F199,1)),\"\",\"X\"),\"X\"),\"X\"),\"X\")","v":""},{"$f":"IF(ISERROR(SEARCH(\"*His*\",Failing_Kids!$F199,1)),IF(ISERROR(SEARCH(\"*GOV*\",Failing_Kids!$F199,1)),IF(ISERROR(SEARCH(\"*Econ*\",Failing_Kids!$F199,1)),IF(ISERROR(SEARCH(\"*Soc*\",Failing_Kids!$F199,1)),\"\",\"X\"),\"X\"),\"X\"),\"X\")","v":""},{"$f":"IF(ISERROR(SEARCH(\"*PE*\",Failing_Kids!$F199,1)),\"\",\"X\")","v":""}]
[{"$f":"Failing_Kids!C200","v":"Hebert"},{"$f":"Failing_Kids!D200","v":"Carlos"},{"$f":"IF(ISERROR(SEARCH(\"*English*\",Failing_Kids!F200,1)),\"\",\"X \")","v":""},{"$f":"IF(ISERROR(SEARCH(\"*Geometry*\",Failing_Kids!$F200,1)),IF(ISERROR(SEARCH(\"*Math*\",Failing_Kids!$F200,1)),IF(ISERROR(SEARCH(\"*Calc*\",Failing_Kids!$F200,1)),IF(ISERROR(SEARCH(\"*Algebra*\",Failing_Kids!$F200,1)),\"\",\"X\"),\"X\"),\"X\"),\"X\")","v":"X"},{"$f":"IF(ISERROR(SEARCH(\"*Science*\",Failing_Kids!$F200,1)),IF(ISERROR(SEARCH(\"*Bio*\",Failing_Kids!$F200,1)),IF(ISERROR(SEARCH(\"*Chem*\",Failing_Kids!$F200,1)),IF(ISERROR(SEARCH(\"*Physics*\",Failing_Kids!$F200,1)),\"\",\"X\"),\"X\"),\"X\"),\"X\")","v":""},{"$f":"IF(ISERROR(SEARCH(\"*His*\",Failing_Kids!$F200,1)),IF(ISERROR(SEARCH(\"*GOV*\",Failing_Kids!$F200,1)),IF(ISERROR(SEARCH(\"*Econ*\",Failing_Kids!$F200,1)),IF(ISERROR(SEARCH(\"*Soc*\",Failing_Kids!$F200,1)),\"\",\"X\"),\"X\"),\"X\"),\"X\")","v":""},{"$f":"IF(ISERROR(SEARCH(\"*PE*\",Failing_Kids!$F200,1)),\"\",\"X\")","v":""}]
[{"$f":"Failing_Kids!C201","v":"Hebert"},{"$f":"Failing_Kids!D201","v":"Carlos"},{"$f":"IF(ISERROR(SEARCH(\"*English*\",Failing_Kids!F201,1)),\"\",\"X \")","v":""},{"$f":"IF(ISERROR(SEARCH(\"*Geometry*\",Failing_Kids!$F201,1)),IF(ISERROR(SEARCH(\"*Math*\",Failing_Kids!$F201,1)),IF(ISERROR(SEARCH(\"*Calc*\",Failing_Kids!$F201,1)),IF(ISERROR(SEARCH(\"*Algebra*\",Failing_Kids!$F201,1)),\"\",\"X\"),\"X\"),\"X\"),\"X\")","v":""},{"$f":"IF(ISERROR(SEARCH(\"*Science*\",Failing_Kids!$F201,1)),IF(ISERROR(SEARCH(\"*Bio*\",Failing_Kids!$F201,1)),IF(ISERROR(SEARCH(\"*Chem*\",Failing_Kids!$F201,1)),IF(ISERROR(SEARCH(\"*Physics*\",Failing_Kids!$F201,1)),\"\",\"X\"),\"X\"),\"X\"),\"X\")","v":"X"},{"$f":"IF(ISERROR(SEARCH(\"*His*\",Failing_Kids!$F201,1)),IF(ISERROR(SEARCH(\"*GOV*\",Failing_Kids!$F201,1)),IF(ISERROR(SEARCH(\"*Econ*\",Failing_Kids!$F201,1)),IF(ISERROR(SEARCH(\"*Soc*\",Failing_Kids!$F201,1)),\"\",\"X\"),\"X\"),\"X\"),\"X\")","v":""},{"$f":"IF(ISERROR(SEARCH(\"*PE*\",Failing_Kids!$F201,1)),\"\",\"X\")","v":""}]
[{"$f":"Failing_Kids!C202","v":"Hendricks"},{"$f":"Failing_Kids!D202","v":"Bradley"},{"$f":"IF(ISERROR(SEARCH(\"*English*\",Failing_Kids!F202,1)),\"\",\"X \")","v":"X "},{"$f":"IF(ISERROR(SEARCH(\"*Geometry*\",Failing_Kids!$F202,1)),IF(ISERROR(SEARCH(\"*Math*\",Failing_Kids!$F202,1)),IF(ISERROR(SEARCH(\"*Calc*\",Failing_Kids!$F202,1)),IF(ISERROR(SEARCH(\"*Algebra*\",Failing_Kids!$F202,1)),\"\",\"X\"),\"X\"),\"X\"),\"X\")","v":""},{"$f":"IF(ISERROR(SEARCH(\"*Science*\",Failing_Kids!$F202,1)),IF(ISERROR(SEARCH(\"*Bio*\",Failing_Kids!$F202,1)),IF(ISERROR(SEARCH(\"*Chem*\",Failing_Kids!$F202,1)),IF(ISERROR(SEARCH(\"*Physics*\",Failing_Kids!$F202,1)),\"\",\"X\"),\"X\"),\"X\"),\"X\")","v":""},{"$f":"IF(ISERROR(SEARCH(\"*His*\",Failing_Kids!$F202,1)),IF(ISERROR(SEARCH(\"*GOV*\",Failing_Kids!$F202,1)),IF(ISERROR(SEARCH(\"*Econ*\",Failing_Kids!$F202,1)),IF(ISERROR(SEARCH(\"*Soc*\",Failing_Kids!$F202,1)),\"\",\"X\"),\"X\"),\"X\"),\"X\")","v":""},{"$f":"IF(ISERROR(SEARCH(\"*PE*\",Failing_Kids!$F202,1)),\"\",\"X\")","v":""}]
[{"$f":"Failing_Kids!C203","v":"Hendricks"},{"$f":"Failing_Kids!D203","v":"Bradley"},{"$f":"IF(ISERROR(SEARCH(\"*English*\",Failing_Kids!F203,1)),\"\",\"X \")","v":""},{"$f":"IF(ISERROR(SEARCH(\"*Geometry*\",Failing_Kids!$F203,1)),IF(ISERROR(SEARCH(\"*Math*\",Failing_Kids!$F203,1)),IF(ISERROR(SEARCH(\"*Calc*\",Failing_Kids!$F203,1)),IF(ISERROR(SEARCH(\"*Algebra*\",Failing_Kids!$F203,1)),\"\",\"X\"),\"X\"),\"X\"),\"X\")","v":"X"},{"$f":"IF(ISERROR(SEARCH(\"*Science*\",Failing_Kids!$F203,1)),IF(ISERROR(SEARCH(\"*Bio*\",Failing_Kids!$F203,1)),IF(ISERROR(SEARCH(\"*Chem*\",Failing_Kids!$F203,1)),IF(ISERROR(SEARCH(\"*Physics*\",Failing_Kids!$F203,1)),\"\",\"X\"),\"X\"),\"X\"),\"X\")","v":""},{"$f":"IF(ISERROR(SEARCH(\"*His*\",Failing_Kids!$F203,1)),IF(ISERROR(SEARCH(\"*GOV*\",Failing_Kids!$F203,1)),IF(ISERROR(SEARCH(\"*Econ*\",Failing_Kids!$F203,1)),IF(ISERROR(SEARCH(\"*Soc*\",Failing_Kids!$F203,1)),\"\",\"X\"),\"X\"),\"X\"),\"X\")","v":""},{"$f":"IF(ISERROR(SEARCH(\"*PE*\",Failing_Kids!$F203,1)),\"\",\"X\")","v":""}]
[{"$f":"Failing_Kids!C204","v":"Henry"},{"$f":"Failing_Kids!D204","v":"Kathleen"},{"$f":"IF(ISERROR(SEARCH(\"*English*\",Failing_Kids!F204,1)),\"\",\"X \")","v":""},{"$f":"IF(ISERROR(SEARCH(\"*Geometry*\",Failing_Kids!$F204,1)),IF(ISERROR(SEARCH(\"*Math*\",Failing_Kids!$F204,1)),IF(ISERROR(SEARCH(\"*Calc*\",Failing_Kids!$F204,1)),IF(ISERROR(SEARCH(\"*Algebra*\",Failing_Kids!$F204,1)),\"\",\"X\"),\"X\"),\"X\"),\"X\")","v":""},{"$f":"IF(ISERROR(SEARCH(\"*Science*\",Failing_Kids!$F204,1)),IF(ISERROR(SEARCH(\"*Bio*\",Failing_Kids!$F204,1)),IF(ISERROR(SEARCH(\"*Chem*\",Failing_Kids!$F204,1)),IF(ISERROR(SEARCH(\"*Physics*\",Failing_Kids!$F204,1)),\"\",\"X\"),\"X\"),\"X\"),\"X\")","v":""},{"$f":"IF(ISERROR(SEARCH(\"*His*\",Failing_Kids!$F204,1)),IF(ISERROR(SEARCH(\"*GOV*\",Failing_Kids!$F204,1)),IF(ISERROR(SEARCH(\"*Econ*\",Failing_Kids!$F204,1)),IF(ISERROR(SEARCH(\"*Soc*\",Failing_Kids!$F204,1)),\"\",\"X\"),\"X\"),\"X\"),\"X\")","v":"X"},{"$f":"IF(ISERROR(SEARCH(\"*PE*\",Failing_Kids!$F204,1)),\"\",\"X\")","v":""}]
[{"$f":"Failing_Kids!C205","v":"Hernandez"},{"$f":"Failing_Kids!D205","v":"Lawrence"},{"$f":"IF(ISERROR(SEARCH(\"*English*\",Failing_Kids!F205,1)),\"\",\"X \")","v":""},{"$f":"IF(ISERROR(SEARCH(\"*Geometry*\",Failing_Kids!$F205,1)),IF(ISERROR(SEARCH(\"*Math*\",Failing_Kids!$F205,1)),IF(ISERROR(SEARCH(\"*Calc*\",Failing_Kids!$F205,1)),IF(ISERROR(SEARCH(\"*Algebra*\",Failing_Kids!$F205,1)),\"\",\"X\"),\"X\"),\"X\"),\"X\")","v":"X"},{"$f":"IF(ISERROR(SEARCH(\"*Science*\",Failing_Kids!$F205,1)),IF(ISERROR(SEARCH(\"*Bio*\",Failing_Kids!$F205,1)),IF(ISERROR(SEARCH(\"*Chem*\",Failing_Kids!$F205,1)),IF(ISERROR(SEARCH(\"*Physics*\",Failing_Kids!$F205,1)),\"\",\"X\"),\"X\"),\"X\"),\"X\")","v":""},{"$f":"IF(ISERROR(SEARCH(\"*His*\",Failing_Kids!$F205,1)),IF(ISERROR(SEARCH(\"*GOV*\",Failing_Kids!$F205,1)),IF(ISERROR(SEARCH(\"*Econ*\",Failing_Kids!$F205,1)),IF(ISERROR(SEARCH(\"*Soc*\",Failing_Kids!$F205,1)),\"\",\"X\"),\"X\"),\"X\"),\"X\")","v":""},{"$f":"IF(ISERROR(SEARCH(\"*PE*\",Failing_Kids!$F205,1)),\"\",\"X\")","v":""}]
[{"$f":"Failing_Kids!C206","v":"Higgins"},{"$f":"Failing_Kids!D206","v":"Claire"},{"$f":"IF(ISERROR(SEARCH(\"*English*\",Failing_Kids!F206,1)),\"\",\"X \")","v":""},{"$f":"IF(ISERROR(SEARCH(\"*Geometry*\",Failing_Kids!$F206,1)),IF(ISERROR(SEARCH(\"*Math*\",Failing_Kids!$F206,1)),IF(ISERROR(SEARCH(\"*Calc*\",Failing_Kids!$F206,1)),IF(ISERROR(SEARCH(\"*Algebra*\",Failing_Kids!$F206,1)),\"\",\"X\"),\"X\"),\"X\"),\"X\")","v":"X"},{"$f":"IF(ISERROR(SEARCH(\"*Science*\",Failing_Kids!$F206,1)),IF(ISERROR(SEARCH(\"*Bio*\",Failing_Kids!$F206,1)),IF(ISERROR(SEARCH(\"*Chem*\",Failing_Kids!$F206,1)),IF(ISERROR(SEARCH(\"*Physics*\",Failing_Kids!$F206,1)),\"\",\"X\"),\"X\"),\"X\"),\"X\")","v":""},{"$f":"IF(ISERROR(SEARCH(\"*His*\",Failing_Kids!$F206,1)),IF(ISERROR(SEARCH(\"*GOV*\",Failing_Kids!$F206,1)),IF(ISERROR(SEARCH(\"*Econ*\",Failing_Kids!$F206,1)),IF(ISERROR(SEARCH(\"*Soc*\",Failing_Kids!$F206,1)),\"\",\"X\"),\"X\"),\"X\"),\"X\")","v":""},{"$f":"IF(ISERROR(SEARCH(\"*PE*\",Failing_Kids!$F206,1)),\"\",\"X\")","v":""}]
[{"$f":"Failing_Kids!C207","v":"Hobbs"},{"$f":"Failing_Kids!D207","v":"Jamie"},{"$f":"IF(ISERROR(SEARCH(\"*English*\",Failing_Kids!F207,1)),\"\",\"X \")","v":"X "},{"$f":"IF(ISERROR(SEARCH(\"*Geometry*\",Failing_Kids!$F207,1)),IF(ISERROR(SEARCH(\"*Math*\",Failing_Kids!$F207,1)),IF(ISERROR(SEARCH(\"*Calc*\",Failing_Kids!$F207,1)),IF(ISERROR(SEARCH(\"*Algebra*\",Failing_Kids!$F207,1)),\"\",\"X\"),\"X\"),\"X\"),\"X\")","v":""},{"$f":"IF(ISERROR(SEARCH(\"*Science*\",Failing_Kids!$F207,1)),IF(ISERROR(SEARCH(\"*Bio*\",Failing_Kids!$F207,1)),IF(ISERROR(SEARCH(\"*Chem*\",Failing_Kids!$F207,1)),IF(ISERROR(SEARCH(\"*Physics*\",Failing_Kids!$F207,1)),\"\",\"X\"),\"X\"),\"X\"),\"X\")","v":""},{"$f":"IF(ISERROR(SEARCH(\"*His*\",Failing_Kids!$F207,1)),IF(ISERROR(SEARCH(\"*GOV*\",Failing_Kids!$F207,1)),IF(ISERROR(SEARCH(\"*Econ*\",Failing_Kids!$F207,1)),IF(ISERROR(SEARCH(\"*Soc*\",Failing_Kids!$F207,1)),\"\",\"X\"),\"X\"),\"X\"),\"X\")","v":""},{"$f":"IF(ISERROR(SEARCH(\"*PE*\",Failing_Kids!$F207,1)),\"\",\"X\")","v":""}]
[{"$f":"Failing_Kids!C208","v":"Hoffman"},{"$f":"Failing_Kids!D208","v":"Laura"},{"$f":"IF(ISERROR(SEARCH(\"*English*\",Failing_Kids!F208,1)),\"\",\"X \")","v":"X "},{"$f":"IF(ISERROR(SEARCH(\"*Geometry*\",Failing_Kids!$F208,1)),IF(ISERROR(SEARCH(\"*Math*\",Failing_Kids!$F208,1)),IF(ISERROR(SEARCH(\"*Calc*\",Failing_Kids!$F208,1)),IF(ISERROR(SEARCH(\"*Algebra*\",Failing_Kids!$F208,1)),\"\",\"X\"),\"X\"),\"X\"),\"X\")","v":""},{"$f":"IF(ISERROR(SEARCH(\"*Science*\",Failing_Kids!$F208,1)),IF(ISERROR(SEARCH(\"*Bio*\",Failing_Kids!$F208,1)),IF(ISERROR(SEARCH(\"*Chem*\",Failing_Kids!$F208,1)),IF(ISERROR(SEARCH(\"*Physics*\",Failing_Kids!$F208,1)),\"\",\"X\"),\"X\"),\"X\"),\"X\")","v":""},{"$f":"IF(ISERROR(SEARCH(\"*His*\",Failing_Kids!$F208,1)),IF(ISERROR(SEARCH(\"*GOV*\",Failing_Kids!$F208,1)),IF(ISERROR(SEARCH(\"*Econ*\",Failing_Kids!$F208,1)),IF(ISERROR(SEARCH(\"*Soc*\",Failing_Kids!$F208,1)),\"\",\"X\"),\"X\"),\"X\"),\"X\")","v":""},{"$f":"IF(ISERROR(SEARCH(\"*PE*\",Failing_Kids!$F208,1)),\"\",\"X\")","v":""}]
[{"$f":"Failing_Kids!C209","v":"Holt"},{"$f":"Failing_Kids!D209","v":"Allen"},{"$f":"IF(ISERROR(SEARCH(\"*English*\",Failing_Kids!F209,1)),\"\",\"X \")","v":""},{"$f":"IF(ISERROR(SEARCH(\"*Geometry*\",Failing_Kids!$F209,1)),IF(ISERROR(SEARCH(\"*Math*\",Failing_Kids!$F209,1)),IF(ISERROR(SEARCH(\"*Calc*\",Failing_Kids!$F209,1)),IF(ISERROR(SEARCH(\"*Algebra*\",Failing_Kids!$F209,1)),\"\",\"X\"),\"X\"),\"X\"),\"X\")","v":""},{"$f":"IF(ISERROR(SEARCH(\"*Science*\",Failing_Kids!$F209,1)),IF(ISERROR(SEARCH(\"*Bio*\",Failing_Kids!$F209,1)),IF(ISERROR(SEARCH(\"*Chem*\",Failing_Kids!$F209,1)),IF(ISERROR(SEARCH(\"*Physics*\",Failing_Kids!$F209,1)),\"\",\"X\"),\"X\"),\"X\"),\"X\")","v":"X"},{"$f":"IF(ISERROR(SEARCH(\"*His*\",Failing_Kids!$F209,1)),IF(ISERROR(SEARCH(\"*GOV*\",Failing_Kids!$F209,1)),IF(ISERROR(SEARCH(\"*Econ*\",Failing_Kids!$F209,1)),IF(ISERROR(SEARCH(\"*Soc*\",Failing_Kids!$F209,1)),\"\",\"X\"),\"X\"),\"X\"),\"X\")","v":""},{"$f":"IF(ISERROR(SEARCH(\"*PE*\",Failing_Kids!$F209,1)),\"\",\"X\")","v":""}]
[{"$f":"Failing_Kids!C210","v":"Holt"},{"$f":"Failing_Kids!D210","v":"Marian"},{"$f":"IF(ISERROR(SEARCH(\"*English*\",Failing_Kids!F210,1)),\"\",\"X \")","v":""},{"$f":"IF(ISERROR(SEARCH(\"*Geometry*\",Failing_Kids!$F210,1)),IF(ISERROR(SEARCH(\"*Math*\",Failing_Kids!$F210,1)),IF(ISERROR(SEARCH(\"*Calc*\",Failing_Kids!$F210,1)),IF(ISERROR(SEARCH(\"*Algebra*\",Failing_Kids!$F210,1)),\"\",\"X\"),\"X\"),\"X\"),\"X\")","v":""},{"$f":"IF(ISERROR(SEARCH(\"*Science*\",Failing_Kids!$F210,1)),IF(ISERROR(SEARCH(\"*Bio*\",Failing_Kids!$F210,1)),IF(ISERROR(SEARCH(\"*Chem*\",Failing_Kids!$F210,1)),IF(ISERROR(SEARCH(\"*Physics*\",Failing_Kids!$F210,1)),\"\",\"X\"),\"X\"),\"X\"),\"X\")","v":""},{"$f":"IF(ISERROR(SEARCH(\"*His*\",Failing_Kids!$F210,1)),IF(ISERROR(SEARCH(\"*GOV*\",Failing_Kids!$F210,1)),IF(ISERROR(SEARCH(\"*Econ*\",Failing_Kids!$F210,1)),IF(ISERROR(SEARCH(\"*Soc*\",Failing_Kids!$F210,1)),\"\",\"X\"),\"X\"),\"X\"),\"X\")","v":"X"},{"$f":"IF(ISERROR(SEARCH(\"*PE*\",Failing_Kids!$F210,1)),\"\",\"X\")","v":""}]
[{"$f":"Failing_Kids!C211","v":"Hood"},{"$f":"Failing_Kids!D211","v":"Ella"},{"$f":"IF(ISERROR(SEARCH(\"*English*\",Failing_Kids!F211,1)),\"\",\"X \")","v":""},{"$f":"IF(ISERROR(SEARCH(\"*Geometry*\",Failing_Kids!$F211,1)),IF(ISERROR(SEARCH(\"*Math*\",Failing_Kids!$F211,1)),IF(ISERROR(SEARCH(\"*Calc*\",Failing_Kids!$F211,1)),IF(ISERROR(SEARCH(\"*Algebra*\",Failing_Kids!$F211,1)),\"\",\"X\"),\"X\"),\"X\"),\"X\")","v":""},{"$f":"IF(ISERROR(SEARCH(\"*Science*\",Failing_Kids!$F211,1)),IF(ISERROR(SEARCH(\"*Bio*\",Failing_Kids!$F211,1)),IF(ISERROR(SEARCH(\"*Chem*\",Failing_Kids!$F211,1)),IF(ISERROR(SEARCH(\"*Physics*\",Failing_Kids!$F211,1)),\"\",\"X\"),\"X\"),\"X\"),\"X\")","v":"X"},{"$f":"IF(ISERROR(SEARCH(\"*His*\",Failing_Kids!$F211,1)),IF(ISERROR(SEARCH(\"*GOV*\",Failing_Kids!$F211,1)),IF(ISERROR(SEARCH(\"*Econ*\",Failing_Kids!$F211,1)),IF(ISERROR(SEARCH(\"*Soc*\",Failing_Kids!$F211,1)),\"\",\"X\"),\"X\"),\"X\"),\"X\")","v":""},{"$f":"IF(ISERROR(SEARCH(\"*PE*\",Failing_Kids!$F211,1)),\"\",\"X\")","v":""}]
[{"$f":"Failing_Kids!C212","v":"Hoover"},{"$f":"Failing_Kids!D212","v":"Marion"},{"$f":"IF(ISERROR(SEARCH(\"*English*\",Failing_Kids!F212,1)),\"\",\"X \")","v":""},{"$f":"IF(ISERROR(SEARCH(\"*Geometry*\",Failing_Kids!$F212,1)),IF(ISERROR(SEARCH(\"*Math*\",Failing_Kids!$F212,1)),IF(ISERROR(SEARCH(\"*Calc*\",Failing_Kids!$F212,1)),IF(ISERROR(SEARCH(\"*Algebra*\",Failing_Kids!$F212,1)),\"\",\"X\"),\"X\"),\"X\"),\"X\")","v":""},{"$f":"IF(ISERROR(SEARCH(\"*Science*\",Failing_Kids!$F212,1)),IF(ISERROR(SEARCH(\"*Bio*\",Failing_Kids!$F212,1)),IF(ISERROR(SEARCH(\"*Chem*\",Failing_Kids!$F212,1)),IF(ISERROR(SEARCH(\"*Physics*\",Failing_Kids!$F212,1)),\"\",\"X\"),\"X\"),\"X\"),\"X\")","v":""},{"$f":"IF(ISERROR(SEARCH(\"*His*\",Failing_Kids!$F212,1)),IF(ISERROR(SEARCH(\"*GOV*\",Failing_Kids!$F212,1)),IF(ISERROR(SEARCH(\"*Econ*\",Failing_Kids!$F212,1)),IF(ISERROR(SEARCH(\"*Soc*\",Failing_Kids!$F212,1)),\"\",\"X\"),\"X\"),\"X\"),\"X\")","v":"X"},{"$f":"IF(ISERROR(SEARCH(\"*PE*\",Failing_Kids!$F212,1)),\"\",\"X\")","v":""}]
[{"$f":"Failing_Kids!C213","v":"Horne"},{"$f":"Failing_Kids!D213","v":"Brandon"},{"$f":"IF(ISERROR(SEARCH(\"*English*\",Failing_Kids!F213,1)),\"\",\"X \")","v":"X "},{"$f":"IF(ISERROR(SEARCH(\"*Geometry*\",Failing_Kids!$F213,1)),IF(ISERROR(SEARCH(\"*Math*\",Failing_Kids!$F213,1)),IF(ISERROR(SEARCH(\"*Calc*\",Failing_Kids!$F213,1)),IF(ISERROR(SEARCH(\"*Algebra*\",Failing_Kids!$F213,1)),\"\",\"X\"),\"X\"),\"X\"),\"X\")","v":""},{"$f":"IF(ISERROR(SEARCH(\"*Science*\",Failing_Kids!$F213,1)),IF(ISERROR(SEARCH(\"*Bio*\",Failing_Kids!$F213,1)),IF(ISERROR(SEARCH(\"*Chem*\",Failing_Kids!$F213,1)),IF(ISERROR(SEARCH(\"*Physics*\",Failing_Kids!$F213,1)),\"\",\"X\"),\"X\"),\"X\"),\"X\")","v":""},{"$f":"IF(ISERROR(SEARCH(\"*His*\",Failing_Kids!$F213,1)),IF(ISERROR(SEARCH(\"*GOV*\",Failing_Kids!$F213,1)),IF(ISERROR(SEARCH(\"*Econ*\",Failing_Kids!$F213,1)),IF(ISERROR(SEARCH(\"*Soc*\",Failing_Kids!$F213,1)),\"\",\"X\"),\"X\"),\"X\"),\"X\")","v":""},{"$f":"IF(ISERROR(SEARCH(\"*PE*\",Failing_Kids!$F213,1)),\"\",\"X\")","v":""}]
[{"$f":"Failing_Kids!C214","v":"Horne"},{"$f":"Failing_Kids!D214","v":"Brandon"},{"$f":"IF(ISERROR(SEARCH(\"*English*\",Failing_Kids!F214,1)),\"\",\"X \")","v":""},{"$f":"IF(ISERROR(SEARCH(\"*Geometry*\",Failing_Kids!$F214,1)),IF(ISERROR(SEARCH(\"*Math*\",Failing_Kids!$F214,1)),IF(ISERROR(SEARCH(\"*Calc*\",Failing_Kids!$F214,1)),IF(ISERROR(SEARCH(\"*Algebra*\",Failing_Kids!$F214,1)),\"\",\"X\"),\"X\"),\"X\"),\"X\")","v":"X"},{"$f":"IF(ISERROR(SEARCH(\"*Science*\",Failing_Kids!$F214,1)),IF(ISERROR(SEARCH(\"*Bio*\",Failing_Kids!$F214,1)),IF(ISERROR(SEARCH(\"*Chem*\",Failing_Kids!$F214,1)),IF(ISERROR(SEARCH(\"*Physics*\",Failing_Kids!$F214,1)),\"\",\"X\"),\"X\"),\"X\"),\"X\")","v":""},{"$f":"IF(ISERROR(SEARCH(\"*His*\",Failing_Kids!$F214,1)),IF(ISERROR(SEARCH(\"*GOV*\",Failing_Kids!$F214,1)),IF(ISERROR(SEARCH(\"*Econ*\",Failing_Kids!$F214,1)),IF(ISERROR(SEARCH(\"*Soc*\",Failing_Kids!$F214,1)),\"\",\"X\"),\"X\"),\"X\"),\"X\")","v":""},{"$f":"IF(ISERROR(SEARCH(\"*PE*\",Failing_Kids!$F214,1)),\"\",\"X\")","v":""}]
[{"$f":"Failing_Kids!C215","v":"Howe"},{"$f":"Failing_Kids!D215","v":"Alfred"},{"$f":"IF(ISERROR(SEARCH(\"*English*\",Failing_Kids!F215,1)),\"\",\"X \")","v":""},{"$f":"IF(ISERROR(SEARCH(\"*Geometry*\",Failing_Kids!$F215,1)),IF(ISERROR(SEARCH(\"*Math*\",Failing_Kids!$F215,1)),IF(ISERROR(SEARCH(\"*Calc*\",Failing_Kids!$F215,1)),IF(ISERROR(SEARCH(\"*Algebra*\",Failing_Kids!$F215,1)),\"\",\"X\"),\"X\"),\"X\"),\"X\")","v":""},{"$f":"IF(ISERROR(SEARCH(\"*Science*\",Failing_Kids!$F215,1)),IF(ISERROR(SEARCH(\"*Bio*\",Failing_Kids!$F215,1)),IF(ISERROR(SEARCH(\"*Chem*\",Failing_Kids!$F215,1)),IF(ISERROR(SEARCH(\"*Physics*\",Failing_Kids!$F215,1)),\"\",\"X\"),\"X\"),\"X\"),\"X\")","v":""},{"$f":"IF(ISERROR(SEARCH(\"*His*\",Failing_Kids!$F215,1)),IF(ISERROR(SEARCH(\"*GOV*\",Failing_Kids!$F215,1)),IF(ISERROR(SEARCH(\"*Econ*\",Failing_Kids!$F215,1)),IF(ISERROR(SEARCH(\"*Soc*\",Failing_Kids!$F215,1)),\"\",\"X\"),\"X\"),\"X\"),\"X\")","v":"X"},{"$f":"IF(ISERROR(SEARCH(\"*PE*\",Failing_Kids!$F215,1)),\"\",\"X\")","v":""}]
[{"$f":"Failing_Kids!C216","v":"Howe"},{"$f":"Failing_Kids!D216","v":"Carla"},{"$f":"IF(ISERROR(SEARCH(\"*English*\",Failing_Kids!F216,1)),\"\",\"X \")","v":""},{"$f":"IF(ISERROR(SEARCH(\"*Geometry*\",Failing_Kids!$F216,1)),IF(ISERROR(SEARCH(\"*Math*\",Failing_Kids!$F216,1)),IF(ISERROR(SEARCH(\"*Calc*\",Failing_Kids!$F216,1)),IF(ISERROR(SEARCH(\"*Algebra*\",Failing_Kids!$F216,1)),\"\",\"X\"),\"X\"),\"X\"),\"X\")","v":"X"},{"$f":"IF(ISERROR(SEARCH(\"*Science*\",Failing_Kids!$F216,1)),IF(ISERROR(SEARCH(\"*Bio*\",Failing_Kids!$F216,1)),IF(ISERROR(SEARCH(\"*Chem*\",Failing_Kids!$F216,1)),IF(ISERROR(SEARCH(\"*Physics*\",Failing_Kids!$F216,1)),\"\",\"X\"),\"X\"),\"X\"),\"X\")","v":""},{"$f":"IF(ISERROR(SEARCH(\"*His*\",Failing_Kids!$F216,1)),IF(ISERROR(SEARCH(\"*GOV*\",Failing_Kids!$F216,1)),IF(ISERROR(SEARCH(\"*Econ*\",Failing_Kids!$F216,1)),IF(ISERROR(SEARCH(\"*Soc*\",Failing_Kids!$F216,1)),\"\",\"X\"),\"X\"),\"X\"),\"X\")","v":""},{"$f":"IF(ISERROR(SEARCH(\"*PE*\",Failing_Kids!$F216,1)),\"\",\"X\")","v":""}]
[{"$f":"Failing_Kids!C217","v":"Howe"},{"$f":"Failing_Kids!D217","v":"Carla"},{"$f":"IF(ISERROR(SEARCH(\"*English*\",Failing_Kids!F217,1)),\"\",\"X \")","v":""},{"$f":"IF(ISERROR(SEARCH(\"*Geometry*\",Failing_Kids!$F217,1)),IF(ISERROR(SEARCH(\"*Math*\",Failing_Kids!$F217,1)),IF(ISERROR(SEARCH(\"*Calc*\",Failing_Kids!$F217,1)),IF(ISERROR(SEARCH(\"*Algebra*\",Failing_Kids!$F217,1)),\"\",\"X\"),\"X\"),\"X\"),\"X\")","v":""},{"$f":"IF(ISERROR(SEARCH(\"*Science*\",Failing_Kids!$F217,1)),IF(ISERROR(SEARCH(\"*Bio*\",Failing_Kids!$F217,1)),IF(ISERROR(SEARCH(\"*Chem*\",Failing_Kids!$F217,1)),IF(ISERROR(SEARCH(\"*Physics*\",Failing_Kids!$F217,1)),\"\",\"X\"),\"X\"),\"X\"),\"X\")","v":"X"},{"$f":"IF(ISERROR(SEARCH(\"*His*\",Failing_Kids!$F217,1)),IF(ISERROR(SEARCH(\"*GOV*\",Failing_Kids!$F217,1)),IF(ISERROR(SEARCH(\"*Econ*\",Failing_Kids!$F217,1)),IF(ISERROR(SEARCH(\"*Soc*\",Failing_Kids!$F217,1)),\"\",\"X\"),\"X\"),\"X\"),\"X\")","v":""},{"$f":"IF(ISERROR(SEARCH(\"*PE*\",Failing_Kids!$F217,1)),\"\",\"X\")","v":""}]
[{"$f":"Failing_Kids!C218","v":"Howe"},{"$f":"Failing_Kids!D218","v":"Carla"},{"$f":"IF(ISERROR(SEARCH(\"*English*\",Failing_Kids!F218,1)),\"\",\"X \")","v":"X "},{"$f":"IF(ISERROR(SEARCH(\"*Geometry*\",Failing_Kids!$F218,1)),IF(ISERROR(SEARCH(\"*Math*\",Failing_Kids!$F218,1)),IF(ISERROR(SEARCH(\"*Calc*\",Failing_Kids!$F218,1)),IF(ISERROR(SEARCH(\"*Algebra*\",Failing_Kids!$F218,1)),\"\",\"X\"),\"X\"),\"X\"),\"X\")","v":""},{"$f":"IF(ISERROR(SEARCH(\"*Science*\",Failing_Kids!$F218,1)),IF(ISERROR(SEARCH(\"*Bio*\",Failing_Kids!$F218,1)),IF(ISERROR(SEARCH(\"*Chem*\",Failing_Kids!$F218,1)),IF(ISERROR(SEARCH(\"*Physics*\",Failing_Kids!$F218,1)),\"\",\"X\"),\"X\"),\"X\"),\"X\")","v":""},{"$f":"IF(ISERROR(SEARCH(\"*His*\",Failing_Kids!$F218,1)),IF(ISERROR(SEARCH(\"*GOV*\",Failing_Kids!$F218,1)),IF(ISERROR(SEARCH(\"*Econ*\",Failing_Kids!$F218,1)),IF(ISERROR(SEARCH(\"*Soc*\",Failing_Kids!$F218,1)),\"\",\"X\"),\"X\"),\"X\"),\"X\")","v":""},{"$f":"IF(ISERROR(SEARCH(\"*PE*\",Failing_Kids!$F218,1)),\"\",\"X\")","v":""}]
[{"$f":"Failing_Kids!C219","v":"Howe"},{"$f":"Failing_Kids!D219","v":"Carla"},{"$f":"IF(ISERROR(SEARCH(\"*English*\",Failing_Kids!F219,1)),\"\",\"X \")","v":""},{"$f":"IF(ISERROR(SEARCH(\"*Geometry*\",Failing_Kids!$F219,1)),IF(ISERROR(SEARCH(\"*Math*\",Failing_Kids!$F219,1)),IF(ISERROR(SEARCH(\"*Calc*\",Failing_Kids!$F219,1)),IF(ISERROR(SEARCH(\"*Algebra*\",Failing_Kids!$F219,1)),\"\",\"X\"),\"X\"),\"X\"),\"X\")","v":""},{"$f":"IF(ISERROR(SEARCH(\"*Science*\",Failing_Kids!$F219,1)),IF(ISERROR(SEARCH(\"*Bio*\",Failing_Kids!$F219,1)),IF(ISERROR(SEARCH(\"*Chem*\",Failing_Kids!$F219,1)),IF(ISERROR(SEARCH(\"*Physics*\",Failing_Kids!$F219,1)),\"\",\"X\"),\"X\"),\"X\"),\"X\")","v":""},{"$f":"IF(ISERROR(SEARCH(\"*His*\",Failing_Kids!$F219,1)),IF(ISERROR(SEARCH(\"*GOV*\",Failing_Kids!$F219,1)),IF(ISERROR(SEARCH(\"*Econ*\",Failing_Kids!$F219,1)),IF(ISERROR(SEARCH(\"*Soc*\",Failing_Kids!$F219,1)),\"\",\"X\"),\"X\"),\"X\"),\"X\")","v":"X"},{"$f":"IF(ISERROR(SEARCH(\"*PE*\",Failing_Kids!$F219,1)),\"\",\"X\")","v":""}]
[{"$f":"Failing_Kids!C220","v":"Hubbard"},{"$f":"Failing_Kids!D220","v":"Jacqueline"},{"$f":"IF(ISERROR(SEARCH(\"*English*\",Failing_Kids!F220,1)),\"\",\"X \")","v":"X "},{"$f":"IF(ISERROR(SEARCH(\"*Geometry*\",Failing_Kids!$F220,1)),IF(ISERROR(SEARCH(\"*Math*\",Failing_Kids!$F220,1)),IF(ISERROR(SEARCH(\"*Calc*\",Failing_Kids!$F220,1)),IF(ISERROR(SEARCH(\"*Algebra*\",Failing_Kids!$F220,1)),\"\",\"X\"),\"X\"),\"X\"),\"X\")","v":""},{"$f":"IF(ISERROR(SEARCH(\"*Science*\",Failing_Kids!$F220,1)),IF(ISERROR(SEARCH(\"*Bio*\",Failing_Kids!$F220,1)),IF(ISERROR(SEARCH(\"*Chem*\",Failing_Kids!$F220,1)),IF(ISERROR(SEARCH(\"*Physics*\",Failing_Kids!$F220,1)),\"\",\"X\"),\"X\"),\"X\"),\"X\")","v":""},{"$f":"IF(ISERROR(SEARCH(\"*His*\",Failing_Kids!$F220,1)),IF(ISERROR(SEARCH(\"*GOV*\",Failing_Kids!$F220,1)),IF(ISERROR(SEARCH(\"*Econ*\",Failing_Kids!$F220,1)),IF(ISERROR(SEARCH(\"*Soc*\",Failing_Kids!$F220,1)),\"\",\"X\"),\"X\"),\"X\"),\"X\")","v":""},{"$f":"IF(ISERROR(SEARCH(\"*PE*\",Failing_Kids!$F220,1)),\"\",\"X\")","v":""}]
[{"$f":"Failing_Kids!C221","v":"Hull"},{"$f":"Failing_Kids!D221","v":"Shelly"},{"$f":"IF(ISERROR(SEARCH(\"*English*\",Failing_Kids!F221,1)),\"\",\"X \")","v":""},{"$f":"IF(ISERROR(SEARCH(\"*Geometry*\",Failing_Kids!$F221,1)),IF(ISERROR(SEARCH(\"*Math*\",Failing_Kids!$F221,1)),IF(ISERROR(SEARCH(\"*Calc*\",Failing_Kids!$F221,1)),IF(ISERROR(SEARCH(\"*Algebra*\",Failing_Kids!$F221,1)),\"\",\"X\"),\"X\"),\"X\"),\"X\")","v":"X"},{"$f":"IF(ISERROR(SEARCH(\"*Science*\",Failing_Kids!$F221,1)),IF(ISERROR(SEARCH(\"*Bio*\",Failing_Kids!$F221,1)),IF(ISERROR(SEARCH(\"*Chem*\",Failing_Kids!$F221,1)),IF(ISERROR(SEARCH(\"*Physics*\",Failing_Kids!$F221,1)),\"\",\"X\"),\"X\"),\"X\"),\"X\")","v":""},{"$f":"IF(ISERROR(SEARCH(\"*His*\",Failing_Kids!$F221,1)),IF(ISERROR(SEARCH(\"*GOV*\",Failing_Kids!$F221,1)),IF(ISERROR(SEARCH(\"*Econ*\",Failing_Kids!$F221,1)),IF(ISERROR(SEARCH(\"*Soc*\",Failing_Kids!$F221,1)),\"\",\"X\"),\"X\"),\"X\"),\"X\")","v":""},{"$f":"IF(ISERROR(SEARCH(\"*PE*\",Failing_Kids!$F221,1)),\"\",\"X\")","v":""}]
[{"$f":"Failing_Kids!C222","v":"Hunter"},{"$f":"Failing_Kids!D222","v":"Jan"},{"$f":"IF(ISERROR(SEARCH(\"*English*\",Failing_Kids!F222,1)),\"\",\"X \")","v":"X "},{"$f":"IF(ISERROR(SEARCH(\"*Geometry*\",Failing_Kids!$F222,1)),IF(ISERROR(SEARCH(\"*Math*\",Failing_Kids!$F222,1)),IF(ISERROR(SEARCH(\"*Calc*\",Failing_Kids!$F222,1)),IF(ISERROR(SEARCH(\"*Algebra*\",Failing_Kids!$F222,1)),\"\",\"X\"),\"X\"),\"X\"),\"X\")","v":""},{"$f":"IF(ISERROR(SEARCH(\"*Science*\",Failing_Kids!$F222,1)),IF(ISERROR(SEARCH(\"*Bio*\",Failing_Kids!$F222,1)),IF(ISERROR(SEARCH(\"*Chem*\",Failing_Kids!$F222,1)),IF(ISERROR(SEARCH(\"*Physics*\",Failing_Kids!$F222,1)),\"\",\"X\"),\"X\"),\"X\"),\"X\")","v":""},{"$f":"IF(ISERROR(SEARCH(\"*His*\",Failing_Kids!$F222,1)),IF(ISERROR(SEARCH(\"*GOV*\",Failing_Kids!$F222,1)),IF(ISERROR(SEARCH(\"*Econ*\",Failing_Kids!$F222,1)),IF(ISERROR(SEARCH(\"*Soc*\",Failing_Kids!$F222,1)),\"\",\"X\"),\"X\"),\"X\"),\"X\")","v":""},{"$f":"IF(ISERROR(SEARCH(\"*PE*\",Failing_Kids!$F222,1)),\"\",\"X\")","v":""}]
[{"$f":"Failing_Kids!C223","v":"Hunter"},{"$f":"Failing_Kids!D223","v":"Jan"},{"$f":"IF(ISERROR(SEARCH(\"*English*\",Failing_Kids!F223,1)),\"\",\"X \")","v":""},{"$f":"IF(ISERROR(SEARCH(\"*Geometry*\",Failing_Kids!$F223,1)),IF(ISERROR(SEARCH(\"*Math*\",Failing_Kids!$F223,1)),IF(ISERROR(SEARCH(\"*Calc*\",Failing_Kids!$F223,1)),IF(ISERROR(SEARCH(\"*Algebra*\",Failing_Kids!$F223,1)),\"\",\"X\"),\"X\"),\"X\"),\"X\")","v":"X"},{"$f":"IF(ISERROR(SEARCH(\"*Science*\",Failing_Kids!$F223,1)),IF(ISERROR(SEARCH(\"*Bio*\",Failing_Kids!$F223,1)),IF(ISERROR(SEARCH(\"*Chem*\",Failing_Kids!$F223,1)),IF(ISERROR(SEARCH(\"*Physics*\",Failing_Kids!$F223,1)),\"\",\"X\"),\"X\"),\"X\"),\"X\")","v":""},{"$f":"IF(ISERROR(SEARCH(\"*His*\",Failing_Kids!$F223,1)),IF(ISERROR(SEARCH(\"*GOV*\",Failing_Kids!$F223,1)),IF(ISERROR(SEARCH(\"*Econ*\",Failing_Kids!$F223,1)),IF(ISERROR(SEARCH(\"*Soc*\",Failing_Kids!$F223,1)),\"\",\"X\"),\"X\"),\"X\"),\"X\")","v":""},{"$f":"IF(ISERROR(SEARCH(\"*PE*\",Failing_Kids!$F223,1)),\"\",\"X\")","v":""}]
[{"$f":"Failing_Kids!C224","v":"Hunter"},{"$f":"Failing_Kids!D224","v":"Jan"},{"$f":"IF(ISERROR(SEARCH(\"*English*\",Failing_Kids!F224,1)),\"\",\"X \")","v":""},{"$f":"IF(ISERROR(SEARCH(\"*Geometry*\",Failing_Kids!$F224,1)),IF(ISERROR(SEARCH(\"*Math*\",Failing_Kids!$F224,1)),IF(ISERROR(SEARCH(\"*Calc*\",Failing_Kids!$F224,1)),IF(ISERROR(SEARCH(\"*Algebra*\",Failing_Kids!$F224,1)),\"\",\"X\"),\"X\"),\"X\"),\"X\")","v":""},{"$f":"IF(ISERROR(SEARCH(\"*Science*\",Failing_Kids!$F224,1)),IF(ISERROR(SEARCH(\"*Bio*\",Failing_Kids!$F224,1)),IF(ISERROR(SEARCH(\"*Chem*\",Failing_Kids!$F224,1)),IF(ISERROR(SEARCH(\"*Physics*\",Failing_Kids!$F224,1)),\"\",\"X\"),\"X\"),\"X\"),\"X\")","v":""},{"$f":"IF(ISERROR(SEARCH(\"*His*\",Failing_Kids!$F224,1)),IF(ISERROR(SEARCH(\"*GOV*\",Failing_Kids!$F224,1)),IF(ISERROR(SEARCH(\"*Econ*\",Failing_Kids!$F224,1)),IF(ISERROR(SEARCH(\"*Soc*\",Failing_Kids!$F224,1)),\"\",\"X\"),\"X\"),\"X\"),\"X\")","v":"X"},{"$f":"IF(ISERROR(SEARCH(\"*PE*\",Failing_Kids!$F224,1)),\"\",\"X\")","v":""}]
[{"$f":"Failing_Kids!C225","v":"Hurley"},{"$f":"Failing_Kids!D225","v":"Madeline"},{"$f":"IF(ISERROR(SEARCH(\"*English*\",Failing_Kids!F225,1)),\"\",\"X \")","v":""},{"$f":"IF(ISERROR(SEARCH(\"*Geometry*\",Failing_Kids!$F225,1)),IF(ISERROR(SEARCH(\"*Math*\",Failing_Kids!$F225,1)),IF(ISERROR(SEARCH(\"*Calc*\",Failing_Kids!$F225,1)),IF(ISERROR(SEARCH(\"*Algebra*\",Failing_Kids!$F225,1)),\"\",\"X\"),\"X\"),\"X\"),\"X\")","v":"X"},{"$f":"IF(ISERROR(SEARCH(\"*Science*\",Failing_Kids!$F225,1)),IF(ISERROR(SEARCH(\"*Bio*\",Failing_Kids!$F225,1)),IF(ISERROR(SEARCH(\"*Chem*\",Failing_Kids!$F225,1)),IF(ISERROR(SEARCH(\"*Physics*\",Failing_Kids!$F225,1)),\"\",\"X\"),\"X\"),\"X\"),\"X\")","v":""},{"$f":"IF(ISERROR(SEARCH(\"*His*\",Failing_Kids!$F225,1)),IF(ISERROR(SEARCH(\"*GOV*\",Failing_Kids!$F225,1)),IF(ISERROR(SEARCH(\"*Econ*\",Failing_Kids!$F225,1)),IF(ISERROR(SEARCH(\"*Soc*\",Failing_Kids!$F225,1)),\"\",\"X\"),\"X\"),\"X\"),\"X\")","v":""},{"$f":"IF(ISERROR(SEARCH(\"*PE*\",Failing_Kids!$F225,1)),\"\",\"X\")","v":""}]
[{"$f":"Failing_Kids!C226","v":"Hurley"},{"$f":"Failing_Kids!D226","v":"Melissa"},{"$f":"IF(ISERROR(SEARCH(\"*English*\",Failing_Kids!F226,1)),\"\",\"X \")","v":""},{"$f":"IF(ISERROR(SEARCH(\"*Geometry*\",Failing_Kids!$F226,1)),IF(ISERROR(SEARCH(\"*Math*\",Failing_Kids!$F226,1)),IF(ISERROR(SEARCH(\"*Calc*\",Failing_Kids!$F226,1)),IF(ISERROR(SEARCH(\"*Algebra*\",Failing_Kids!$F226,1)),\"\",\"X\"),\"X\"),\"X\"),\"X\")","v":"X"},{"$f":"IF(ISERROR(SEARCH(\"*Science*\",Failing_Kids!$F226,1)),IF(ISERROR(SEARCH(\"*Bio*\",Failing_Kids!$F226,1)),IF(ISERROR(SEARCH(\"*Chem*\",Failing_Kids!$F226,1)),IF(ISERROR(SEARCH(\"*Physics*\",Failing_Kids!$F226,1)),\"\",\"X\"),\"X\"),\"X\"),\"X\")","v":""},{"$f":"IF(ISERROR(SEARCH(\"*His*\",Failing_Kids!$F226,1)),IF(ISERROR(SEARCH(\"*GOV*\",Failing_Kids!$F226,1)),IF(ISERROR(SEARCH(\"*Econ*\",Failing_Kids!$F226,1)),IF(ISERROR(SEARCH(\"*Soc*\",Failing_Kids!$F226,1)),\"\",\"X\"),\"X\"),\"X\"),\"X\")","v":""},{"$f":"IF(ISERROR(SEARCH(\"*PE*\",Failing_Kids!$F226,1)),\"\",\"X\")","v":""}]
[{"$f":"Failing_Kids!C227","v":"Hurley"},{"$f":"Failing_Kids!D227","v":"Melissa"},{"$f":"IF(ISERROR(SEARCH(\"*English*\",Failing_Kids!F227,1)),\"\",\"X \")","v":""},{"$f":"IF(ISERROR(SEARCH(\"*Geometry*\",Failing_Kids!$F227,1)),IF(ISERROR(SEARCH(\"*Math*\",Failing_Kids!$F227,1)),IF(ISERROR(SEARCH(\"*Calc*\",Failing_Kids!$F227,1)),IF(ISERROR(SEARCH(\"*Algebra*\",Failing_Kids!$F227,1)),\"\",\"X\"),\"X\"),\"X\"),\"X\")","v":""},{"$f":"IF(ISERROR(SEARCH(\"*Science*\",Failing_Kids!$F227,1)),IF(ISERROR(SEARCH(\"*Bio*\",Failing_Kids!$F227,1)),IF(ISERROR(SEARCH(\"*Chem*\",Failing_Kids!$F227,1)),IF(ISERROR(SEARCH(\"*Physics*\",Failing_Kids!$F227,1)),\"\",\"X\"),\"X\"),\"X\"),\"X\")","v":""},{"$f":"IF(ISERROR(SEARCH(\"*His*\",Failing_Kids!$F227,1)),IF(ISERROR(SEARCH(\"*GOV*\",Failing_Kids!$F227,1)),IF(ISERROR(SEARCH(\"*Econ*\",Failing_Kids!$F227,1)),IF(ISERROR(SEARCH(\"*Soc*\",Failing_Kids!$F227,1)),\"\",\"X\"),\"X\"),\"X\"),\"X\")","v":""},{"$f":"IF(ISERROR(SEARCH(\"*PE*\",Failing_Kids!$F227,1)),\"\",\"X\")","v":""}]
[{"$f":"Failing_Kids!C228","v":"Jefferson"},{"$f":"Failing_Kids!D228","v":"Jimmy"},{"$f":"IF(ISERROR(SEARCH(\"*English*\",Failing_Kids!F228,1)),\"\",\"X \")","v":"X "},{"$f":"IF(ISERROR(SEARCH(\"*Geometry*\",Failing_Kids!$F228,1)),IF(ISERROR(SEARCH(\"*Math*\",Failing_Kids!$F228,1)),IF(ISERROR(SEARCH(\"*Calc*\",Failing_Kids!$F228,1)),IF(ISERROR(SEARCH(\"*Algebra*\",Failing_Kids!$F228,1)),\"\",\"X\"),\"X\"),\"X\"),\"X\")","v":""},{"$f":"IF(ISERROR(SEARCH(\"*Science*\",Failing_Kids!$F228,1)),IF(ISERROR(SEARCH(\"*Bio*\",Failing_Kids!$F228,1)),IF(ISERROR(SEARCH(\"*Chem*\",Failing_Kids!$F228,1)),IF(ISERROR(SEARCH(\"*Physics*\",Failing_Kids!$F228,1)),\"\",\"X\"),\"X\"),\"X\"),\"X\")","v":""},{"$f":"IF(ISERROR(SEARCH(\"*His*\",Failing_Kids!$F228,1)),IF(ISERROR(SEARCH(\"*GOV*\",Failing_Kids!$F228,1)),IF(ISERROR(SEARCH(\"*Econ*\",Failing_Kids!$F228,1)),IF(ISERROR(SEARCH(\"*Soc*\",Failing_Kids!$F228,1)),\"\",\"X\"),\"X\"),\"X\"),\"X\")","v":""},{"$f":"IF(ISERROR(SEARCH(\"*PE*\",Failing_Kids!$F228,1)),\"\",\"X\")","v":""}]
[{"$f":"Failing_Kids!C229","v":"Jensen"},{"$f":"Failing_Kids!D229","v":"Martha"},{"$f":"IF(ISERROR(SEARCH(\"*English*\",Failing_Kids!F229,1)),\"\",\"X \")","v":""},{"$f":"IF(ISERROR(SEARCH(\"*Geometry*\",Failing_Kids!$F229,1)),IF(ISERROR(SEARCH(\"*Math*\",Failing_Kids!$F229,1)),IF(ISERROR(SEARCH(\"*Calc*\",Failing_Kids!$F229,1)),IF(ISERROR(SEARCH(\"*Algebra*\",Failing_Kids!$F229,1)),\"\",\"X\"),\"X\"),\"X\"),\"X\")","v":"X"},{"$f":"IF(ISERROR(SEARCH(\"*Science*\",Failing_Kids!$F229,1)),IF(ISERROR(SEARCH(\"*Bio*\",Failing_Kids!$F229,1)),IF(ISERROR(SEARCH(\"*Chem*\",Failing_Kids!$F229,1)),IF(ISERROR(SEARCH(\"*Physics*\",Failing_Kids!$F229,1)),\"\",\"X\"),\"X\"),\"X\"),\"X\")","v":""},{"$f":"IF(ISERROR(SEARCH(\"*His*\",Failing_Kids!$F229,1)),IF(ISERROR(SEARCH(\"*GOV*\",Failing_Kids!$F229,1)),IF(ISERROR(SEARCH(\"*Econ*\",Failing_Kids!$F229,1)),IF(ISERROR(SEARCH(\"*Soc*\",Failing_Kids!$F229,1)),\"\",\"X\"),\"X\"),\"X\"),\"X\")","v":""},{"$f":"IF(ISERROR(SEARCH(\"*PE*\",Failing_Kids!$F229,1)),\"\",\"X\")","v":""}]
[{"$f":"Failing_Kids!C230","v":"Jones"},{"$f":"Failing_Kids!D230","v":"Paul"},{"$f":"IF(ISERROR(SEARCH(\"*English*\",Failing_Kids!F230,1)),\"\",\"X \")","v":""},{"$f":"IF(ISERROR(SEARCH(\"*Geometry*\",Failing_Kids!$F230,1)),IF(ISERROR(SEARCH(\"*Math*\",Failing_Kids!$F230,1)),IF(ISERROR(SEARCH(\"*Calc*\",Failing_Kids!$F230,1)),IF(ISERROR(SEARCH(\"*Algebra*\",Failing_Kids!$F230,1)),\"\",\"X\"),\"X\"),\"X\"),\"X\")","v":""},{"$f":"IF(ISERROR(SEARCH(\"*Science*\",Failing_Kids!$F230,1)),IF(ISERROR(SEARCH(\"*Bio*\",Failing_Kids!$F230,1)),IF(ISERROR(SEARCH(\"*Chem*\",Failing_Kids!$F230,1)),IF(ISERROR(SEARCH(\"*Physics*\",Failing_Kids!$F230,1)),\"\",\"X\"),\"X\"),\"X\"),\"X\")","v":""},{"$f":"IF(ISERROR(SEARCH(\"*His*\",Failing_Kids!$F230,1)),IF(ISERROR(SEARCH(\"*GOV*\",Failing_Kids!$F230,1)),IF(ISERROR(SEARCH(\"*Econ*\",Failing_Kids!$F230,1)),IF(ISERROR(SEARCH(\"*Soc*\",Failing_Kids!$F230,1)),\"\",\"X\"),\"X\"),\"X\"),\"X\")","v":"X"},{"$f":"IF(ISERROR(SEARCH(\"*PE*\",Failing_Kids!$F230,1)),\"\",\"X\")","v":""}]
[{"$f":"Failing_Kids!C231","v":"Jordan"},{"$f":"Failing_Kids!D231","v":"Jean"},{"$f":"IF(ISERROR(SEARCH(\"*English*\",Failing_Kids!F231,1)),\"\",\"X \")","v":""},{"$f":"IF(ISERROR(SEARCH(\"*Geometry*\",Failing_Kids!$F231,1)),IF(ISERROR(SEARCH(\"*Math*\",Failing_Kids!$F231,1)),IF(ISERROR(SEARCH(\"*Calc*\",Failing_Kids!$F231,1)),IF(ISERROR(SEARCH(\"*Algebra*\",Failing_Kids!$F231,1)),\"\",\"X\"),\"X\"),\"X\"),\"X\")","v":"X"},{"$f":"IF(ISERROR(SEARCH(\"*Science*\",Failing_Kids!$F231,1)),IF(ISERROR(SEARCH(\"*Bio*\",Failing_Kids!$F231,1)),IF(ISERROR(SEARCH(\"*Chem*\",Failing_Kids!$F231,1)),IF(ISERROR(SEARCH(\"*Physics*\",Failing_Kids!$F231,1)),\"\",\"X\"),\"X\"),\"X\"),\"X\")","v":""},{"$f":"IF(ISERROR(SEARCH(\"*His*\",Failing_Kids!$F231,1)),IF(ISERROR(SEARCH(\"*GOV*\",Failing_Kids!$F231,1)),IF(ISERROR(SEARCH(\"*Econ*\",Failing_Kids!$F231,1)),IF(ISERROR(SEARCH(\"*Soc*\",Failing_Kids!$F231,1)),\"\",\"X\"),\"X\"),\"X\"),\"X\")","v":""},{"$f":"IF(ISERROR(SEARCH(\"*PE*\",Failing_Kids!$F231,1)),\"\",\"X\")","v":""}]
[{"$f":"Failing_Kids!C232","v":"Jordan"},{"$f":"Failing_Kids!D232","v":"Jean"},{"$f":"IF(ISERROR(SEARCH(\"*English*\",Failing_Kids!F232,1)),\"\",\"X \")","v":""},{"$f":"IF(ISERROR(SEARCH(\"*Geometry*\",Failing_Kids!$F232,1)),IF(ISERROR(SEARCH(\"*Math*\",Failing_Kids!$F232,1)),IF(ISERROR(SEARCH(\"*Calc*\",Failing_Kids!$F232,1)),IF(ISERROR(SEARCH(\"*Algebra*\",Failing_Kids!$F232,1)),\"\",\"X\"),\"X\"),\"X\"),\"X\")","v":""},{"$f":"IF(ISERROR(SEARCH(\"*Science*\",Failing_Kids!$F232,1)),IF(ISERROR(SEARCH(\"*Bio*\",Failing_Kids!$F232,1)),IF(ISERROR(SEARCH(\"*Chem*\",Failing_Kids!$F232,1)),IF(ISERROR(SEARCH(\"*Physics*\",Failing_Kids!$F232,1)),\"\",\"X\"),\"X\"),\"X\"),\"X\")","v":""},{"$f":"IF(ISERROR(SEARCH(\"*His*\",Failing_Kids!$F232,1)),IF(ISERROR(SEARCH(\"*GOV*\",Failing_Kids!$F232,1)),IF(ISERROR(SEARCH(\"*Econ*\",Failing_Kids!$F232,1)),IF(ISERROR(SEARCH(\"*Soc*\",Failing_Kids!$F232,1)),\"\",\"X\"),\"X\"),\"X\"),\"X\")","v":"X"},{"$f":"IF(ISERROR(SEARCH(\"*PE*\",Failing_Kids!$F232,1)),\"\",\"X\")","v":""}]
[{"$f":"Failing_Kids!C233","v":"Jordan"},{"$f":"Failing_Kids!D233","v":"Margarita"},{"$f":"IF(ISERROR(SEARCH(\"*English*\",Failing_Kids!F233,1)),\"\",\"X \")","v":"X "},{"$f":"IF(ISERROR(SEARCH(\"*Geometry*\",Failing_Kids!$F233,1)),IF(ISERROR(SEARCH(\"*Math*\",Failing_Kids!$F233,1)),IF(ISERROR(SEARCH(\"*Calc*\",Failing_Kids!$F233,1)),IF(ISERROR(SEARCH(\"*Algebra*\",Failing_Kids!$F233,1)),\"\",\"X\"),\"X\"),\"X\"),\"X\")","v":""},{"$f":"IF(ISERROR(SEARCH(\"*Science*\",Failing_Kids!$F233,1)),IF(ISERROR(SEARCH(\"*Bio*\",Failing_Kids!$F233,1)),IF(ISERROR(SEARCH(\"*Chem*\",Failing_Kids!$F233,1)),IF(ISERROR(SEARCH(\"*Physics*\",Failing_Kids!$F233,1)),\"\",\"X\"),\"X\"),\"X\"),\"X\")","v":""},{"$f":"IF(ISERROR(SEARCH(\"*His*\",Failing_Kids!$F233,1)),IF(ISERROR(SEARCH(\"*GOV*\",Failing_Kids!$F233,1)),IF(ISERROR(SEARCH(\"*Econ*\",Failing_Kids!$F233,1)),IF(ISERROR(SEARCH(\"*Soc*\",Failing_Kids!$F233,1)),\"\",\"X\"),\"X\"),\"X\"),\"X\")","v":""},{"$f":"IF(ISERROR(SEARCH(\"*PE*\",Failing_Kids!$F233,1)),\"\",\"X\")","v":""}]
[{"$f":"Failing_Kids!C234","v":"Justice"},{"$f":"Failing_Kids!D234","v":"Myrtle"},{"$f":"IF(ISERROR(SEARCH(\"*English*\",Failing_Kids!F234,1)),\"\",\"X \")","v":""},{"$f":"IF(ISERROR(SEARCH(\"*Geometry*\",Failing_Kids!$F234,1)),IF(ISERROR(SEARCH(\"*Math*\",Failing_Kids!$F234,1)),IF(ISERROR(SEARCH(\"*Calc*\",Failing_Kids!$F234,1)),IF(ISERROR(SEARCH(\"*Algebra*\",Failing_Kids!$F234,1)),\"\",\"X\"),\"X\"),\"X\"),\"X\")","v":""},{"$f":"IF(ISERROR(SEARCH(\"*Science*\",Failing_Kids!$F234,1)),IF(ISERROR(SEARCH(\"*Bio*\",Failing_Kids!$F234,1)),IF(ISERROR(SEARCH(\"*Chem*\",Failing_Kids!$F234,1)),IF(ISERROR(SEARCH(\"*Physics*\",Failing_Kids!$F234,1)),\"\",\"X\"),\"X\"),\"X\"),\"X\")","v":"X"},{"$f":"IF(ISERROR(SEARCH(\"*His*\",Failing_Kids!$F234,1)),IF(ISERROR(SEARCH(\"*GOV*\",Failing_Kids!$F234,1)),IF(ISERROR(SEARCH(\"*Econ*\",Failing_Kids!$F234,1)),IF(ISERROR(SEARCH(\"*Soc*\",Failing_Kids!$F234,1)),\"\",\"X\"),\"X\"),\"X\"),\"X\")","v":""},{"$f":"IF(ISERROR(SEARCH(\"*PE*\",Failing_Kids!$F234,1)),\"\",\"X\")","v":""}]
[{"$f":"Failing_Kids!C235","v":"Kane"},{"$f":"Failing_Kids!D235","v":"Maxine"},{"$f":"IF(ISERROR(SEARCH(\"*English*\",Failing_Kids!F235,1)),\"\",\"X \")","v":""},{"$f":"IF(ISERROR(SEARCH(\"*Geometry*\",Failing_Kids!$F235,1)),IF(ISERROR(SEARCH(\"*Math*\",Failing_Kids!$F235,1)),IF(ISERROR(SEARCH(\"*Calc*\",Failing_Kids!$F235,1)),IF(ISERROR(SEARCH(\"*Algebra*\",Failing_Kids!$F235,1)),\"\",\"X\"),\"X\"),\"X\"),\"X\")","v":""},{"$f":"IF(ISERROR(SEARCH(\"*Science*\",Failing_Kids!$F235,1)),IF(ISERROR(SEARCH(\"*Bio*\",Failing_Kids!$F235,1)),IF(ISERROR(SEARCH(\"*Chem*\",Failing_Kids!$F235,1)),IF(ISERROR(SEARCH(\"*Physics*\",Failing_Kids!$F235,1)),\"\",\"X\"),\"X\"),\"X\"),\"X\")","v":""},{"$f":"IF(ISERROR(SEARCH(\"*His*\",Failing_Kids!$F235,1)),IF(ISERROR(SEARCH(\"*GOV*\",Failing_Kids!$F235,1)),IF(ISERROR(SEARCH(\"*Econ*\",Failing_Kids!$F235,1)),IF(ISERROR(SEARCH(\"*Soc*\",Failing_Kids!$F235,1)),\"\",\"X\"),\"X\"),\"X\"),\"X\")","v":"X"},{"$f":"IF(ISERROR(SEARCH(\"*PE*\",Failing_Kids!$F235,1)),\"\",\"X\")","v":""}]
[{"$f":"Failing_Kids!C236","v":"Kelley"},{"$f":"Failing_Kids!D236","v":"Carol"},{"$f":"IF(ISERROR(SEARCH(\"*English*\",Failing_Kids!F236,1)),\"\",\"X \")","v":""},{"$f":"IF(ISERROR(SEARCH(\"*Geometry*\",Failing_Kids!$F236,1)),IF(ISERROR(SEARCH(\"*Math*\",Failing_Kids!$F236,1)),IF(ISERROR(SEARCH(\"*Calc*\",Failing_Kids!$F236,1)),IF(ISERROR(SEARCH(\"*Algebra*\",Failing_Kids!$F236,1)),\"\",\"X\"),\"X\"),\"X\"),\"X\")","v":""},{"$f":"IF(ISERROR(SEARCH(\"*Science*\",Failing_Kids!$F236,1)),IF(ISERROR(SEARCH(\"*Bio*\",Failing_Kids!$F236,1)),IF(ISERROR(SEARCH(\"*Chem*\",Failing_Kids!$F236,1)),IF(ISERROR(SEARCH(\"*Physics*\",Failing_Kids!$F236,1)),\"\",\"X\"),\"X\"),\"X\"),\"X\")","v":""},{"$f":"IF(ISERROR(SEARCH(\"*His*\",Failing_Kids!$F236,1)),IF(ISERROR(SEARCH(\"*GOV*\",Failing_Kids!$F236,1)),IF(ISERROR(SEARCH(\"*Econ*\",Failing_Kids!$F236,1)),IF(ISERROR(SEARCH(\"*Soc*\",Failing_Kids!$F236,1)),\"\",\"X\"),\"X\"),\"X\"),\"X\")","v":"X"},{"$f":"IF(ISERROR(SEARCH(\"*PE*\",Failing_Kids!$F236,1)),\"\",\"X\")","v":""}]
[{"$f":"Failing_Kids!C237","v":"Kelley"},{"$f":"Failing_Kids!D237","v":"Carol"},{"$f":"IF(ISERROR(SEARCH(\"*English*\",Failing_Kids!F237,1)),\"\",\"X \")","v":""},{"$f":"IF(ISERROR(SEARCH(\"*Geometry*\",Failing_Kids!$F237,1)),IF(ISERROR(SEARCH(\"*Math*\",Failing_Kids!$F237,1)),IF(ISERROR(SEARCH(\"*Calc*\",Failing_Kids!$F237,1)),IF(ISERROR(SEARCH(\"*Algebra*\",Failing_Kids!$F237,1)),\"\",\"X\"),\"X\"),\"X\"),\"X\")","v":"X"},{"$f":"IF(ISERROR(SEARCH(\"*Science*\",Failing_Kids!$F237,1)),IF(ISERROR(SEARCH(\"*Bio*\",Failing_Kids!$F237,1)),IF(ISERROR(SEARCH(\"*Chem*\",Failing_Kids!$F237,1)),IF(ISERROR(SEARCH(\"*Physics*\",Failing_Kids!$F237,1)),\"\",\"X\"),\"X\"),\"X\"),\"X\")","v":""},{"$f":"IF(ISERROR(SEARCH(\"*His*\",Failing_Kids!$F237,1)),IF(ISERROR(SEARCH(\"*GOV*\",Failing_Kids!$F237,1)),IF(ISERROR(SEARCH(\"*Econ*\",Failing_Kids!$F237,1)),IF(ISERROR(SEARCH(\"*Soc*\",Failing_Kids!$F237,1)),\"\",\"X\"),\"X\"),\"X\"),\"X\")","v":""},{"$f":"IF(ISERROR(SEARCH(\"*PE*\",Failing_Kids!$F237,1)),\"\",\"X\")","v":""}]
[{"$f":"Failing_Kids!C238","v":"Kelley"},{"$f":"Failing_Kids!D238","v":"Carol"},{"$f":"IF(ISERROR(SEARCH(\"*English*\",Failing_Kids!F238,1)),\"\",\"X \")","v":"X "},{"$f":"IF(ISERROR(SEARCH(\"*Geometry*\",Failing_Kids!$F238,1)),IF(ISERROR(SEARCH(\"*Math*\",Failing_Kids!$F238,1)),IF(ISERROR(SEARCH(\"*Calc*\",Failing_Kids!$F238,1)),IF(ISERROR(SEARCH(\"*Algebra*\",Failing_Kids!$F238,1)),\"\",\"X\"),\"X\"),\"X\"),\"X\")","v":""},{"$f":"IF(ISERROR(SEARCH(\"*Science*\",Failing_Kids!$F238,1)),IF(ISERROR(SEARCH(\"*Bio*\",Failing_Kids!$F238,1)),IF(ISERROR(SEARCH(\"*Chem*\",Failing_Kids!$F238,1)),IF(ISERROR(SEARCH(\"*Physics*\",Failing_Kids!$F238,1)),\"\",\"X\"),\"X\"),\"X\"),\"X\")","v":""},{"$f":"IF(ISERROR(SEARCH(\"*His*\",Failing_Kids!$F238,1)),IF(ISERROR(SEARCH(\"*GOV*\",Failing_Kids!$F238,1)),IF(ISERROR(SEARCH(\"*Econ*\",Failing_Kids!$F238,1)),IF(ISERROR(SEARCH(\"*Soc*\",Failing_Kids!$F238,1)),\"\",\"X\"),\"X\"),\"X\"),\"X\")","v":""},{"$f":"IF(ISERROR(SEARCH(\"*PE*\",Failing_Kids!$F238,1)),\"\",\"X\")","v":""}]
[{"$f":"Failing_Kids!C239","v":"Kemp"},{"$f":"Failing_Kids!D239","v":"Aaron"},{"$f":"IF(ISERROR(SEARCH(\"*English*\",Failing_Kids!F239,1)),\"\",\"X \")","v":"X "},{"$f":"IF(ISERROR(SEARCH(\"*Geometry*\",Failing_Kids!$F239,1)),IF(ISERROR(SEARCH(\"*Math*\",Failing_Kids!$F239,1)),IF(ISERROR(SEARCH(\"*Calc*\",Failing_Kids!$F239,1)),IF(ISERROR(SEARCH(\"*Algebra*\",Failing_Kids!$F239,1)),\"\",\"X\"),\"X\"),\"X\"),\"X\")","v":""},{"$f":"IF(ISERROR(SEARCH(\"*Science*\",Failing_Kids!$F239,1)),IF(ISERROR(SEARCH(\"*Bio*\",Failing_Kids!$F239,1)),IF(ISERROR(SEARCH(\"*Chem*\",Failing_Kids!$F239,1)),IF(ISERROR(SEARCH(\"*Physics*\",Failing_Kids!$F239,1)),\"\",\"X\"),\"X\"),\"X\"),\"X\")","v":""},{"$f":"IF(ISERROR(SEARCH(\"*His*\",Failing_Kids!$F239,1)),IF(ISERROR(SEARCH(\"*GOV*\",Failing_Kids!$F239,1)),IF(ISERROR(SEARCH(\"*Econ*\",Failing_Kids!$F239,1)),IF(ISERROR(SEARCH(\"*Soc*\",Failing_Kids!$F239,1)),\"\",\"X\"),\"X\"),\"X\"),\"X\")","v":""},{"$f":"IF(ISERROR(SEARCH(\"*PE*\",Failing_Kids!$F239,1)),\"\",\"X\")","v":""}]
[{"$f":"Failing_Kids!C240","v":"Kemp"},{"$f":"Failing_Kids!D240","v":"Roy"},{"$f":"IF(ISERROR(SEARCH(\"*English*\",Failing_Kids!F240,1)),\"\",\"X \")","v":""},{"$f":"IF(ISERROR(SEARCH(\"*Geometry*\",Failing_Kids!$F240,1)),IF(ISERROR(SEARCH(\"*Math*\",Failing_Kids!$F240,1)),IF(ISERROR(SEARCH(\"*Calc*\",Failing_Kids!$F240,1)),IF(ISERROR(SEARCH(\"*Algebra*\",Failing_Kids!$F240,1)),\"\",\"X\"),\"X\"),\"X\"),\"X\")","v":""},{"$f":"IF(ISERROR(SEARCH(\"*Science*\",Failing_Kids!$F240,1)),IF(ISERROR(SEARCH(\"*Bio*\",Failing_Kids!$F240,1)),IF(ISERROR(SEARCH(\"*Chem*\",Failing_Kids!$F240,1)),IF(ISERROR(SEARCH(\"*Physics*\",Failing_Kids!$F240,1)),\"\",\"X\"),\"X\"),\"X\"),\"X\")","v":""},{"$f":"IF(ISERROR(SEARCH(\"*His*\",Failing_Kids!$F240,1)),IF(ISERROR(SEARCH(\"*GOV*\",Failing_Kids!$F240,1)),IF(ISERROR(SEARCH(\"*Econ*\",Failing_Kids!$F240,1)),IF(ISERROR(SEARCH(\"*Soc*\",Failing_Kids!$F240,1)),\"\",\"X\"),\"X\"),\"X\"),\"X\")","v":"X"},{"$f":"IF(ISERROR(SEARCH(\"*PE*\",Failing_Kids!$F240,1)),\"\",\"X\")","v":""}]
[{"$f":"Failing_Kids!C241","v":"Kennedy"},{"$f":"Failing_Kids!D241","v":"Eva"},{"$f":"IF(ISERROR(SEARCH(\"*English*\",Failing_Kids!F241,1)),\"\",\"X \")","v":"X "},{"$f":"IF(ISERROR(SEARCH(\"*Geometry*\",Failing_Kids!$F241,1)),IF(ISERROR(SEARCH(\"*Math*\",Failing_Kids!$F241,1)),IF(ISERROR(SEARCH(\"*Calc*\",Failing_Kids!$F241,1)),IF(ISERROR(SEARCH(\"*Algebra*\",Failing_Kids!$F241,1)),\"\",\"X\"),\"X\"),\"X\"),\"X\")","v":""},{"$f":"IF(ISERROR(SEARCH(\"*Science*\",Failing_Kids!$F241,1)),IF(ISERROR(SEARCH(\"*Bio*\",Failing_Kids!$F241,1)),IF(ISERROR(SEARCH(\"*Chem*\",Failing_Kids!$F241,1)),IF(ISERROR(SEARCH(\"*Physics*\",Failing_Kids!$F241,1)),\"\",\"X\"),\"X\"),\"X\"),\"X\")","v":""},{"$f":"IF(ISERROR(SEARCH(\"*His*\",Failing_Kids!$F241,1)),IF(ISERROR(SEARCH(\"*GOV*\",Failing_Kids!$F241,1)),IF(ISERROR(SEARCH(\"*Econ*\",Failing_Kids!$F241,1)),IF(ISERROR(SEARCH(\"*Soc*\",Failing_Kids!$F241,1)),\"\",\"X\"),\"X\"),\"X\"),\"X\")","v":""},{"$f":"IF(ISERROR(SEARCH(\"*PE*\",Failing_Kids!$F241,1)),\"\",\"X\")","v":""}]
[{"$f":"Failing_Kids!C242","v":"Kennedy"},{"$f":"Failing_Kids!D242","v":"Whitney"},{"$f":"IF(ISERROR(SEARCH(\"*English*\",Failing_Kids!F242,1)),\"\",\"X \")","v":""},{"$f":"IF(ISERROR(SEARCH(\"*Geometry*\",Failing_Kids!$F242,1)),IF(ISERROR(SEARCH(\"*Math*\",Failing_Kids!$F242,1)),IF(ISERROR(SEARCH(\"*Calc*\",Failing_Kids!$F242,1)),IF(ISERROR(SEARCH(\"*Algebra*\",Failing_Kids!$F242,1)),\"\",\"X\"),\"X\"),\"X\"),\"X\")","v":""},{"$f":"IF(ISERROR(SEARCH(\"*Science*\",Failing_Kids!$F242,1)),IF(ISERROR(SEARCH(\"*Bio*\",Failing_Kids!$F242,1)),IF(ISERROR(SEARCH(\"*Chem*\",Failing_Kids!$F242,1)),IF(ISERROR(SEARCH(\"*Physics*\",Failing_Kids!$F242,1)),\"\",\"X\"),\"X\"),\"X\"),\"X\")","v":"X"},{"$f":"IF(ISERROR(SEARCH(\"*His*\",Failing_Kids!$F242,1)),IF(ISERROR(SEARCH(\"*GOV*\",Failing_Kids!$F242,1)),IF(ISERROR(SEARCH(\"*Econ*\",Failing_Kids!$F242,1)),IF(ISERROR(SEARCH(\"*Soc*\",Failing_Kids!$F242,1)),\"\",\"X\"),\"X\"),\"X\"),\"X\")","v":""},{"$f":"IF(ISERROR(SEARCH(\"*PE*\",Failing_Kids!$F242,1)),\"\",\"X\")","v":""}]
[{"$f":"Failing_Kids!C243","v":"Kim"},{"$f":"Failing_Kids!D243","v":"Myrtle"},{"$f":"IF(ISERROR(SEARCH(\"*English*\",Failing_Kids!F243,1)),\"\",\"X \")","v":""},{"$f":"IF(ISERROR(SEARCH(\"*Geometry*\",Failing_Kids!$F243,1)),IF(ISERROR(SEARCH(\"*Math*\",Failing_Kids!$F243,1)),IF(ISERROR(SEARCH(\"*Calc*\",Failing_Kids!$F243,1)),IF(ISERROR(SEARCH(\"*Algebra*\",Failing_Kids!$F243,1)),\"\",\"X\"),\"X\"),\"X\"),\"X\")","v":""},{"$f":"IF(ISERROR(SEARCH(\"*Science*\",Failing_Kids!$F243,1)),IF(ISERROR(SEARCH(\"*Bio*\",Failing_Kids!$F243,1)),IF(ISERROR(SEARCH(\"*Chem*\",Failing_Kids!$F243,1)),IF(ISERROR(SEARCH(\"*Physics*\",Failing_Kids!$F243,1)),\"\",\"X\"),\"X\"),\"X\"),\"X\")","v":"X"},{"$f":"IF(ISERROR(SEARCH(\"*His*\",Failing_Kids!$F243,1)),IF(ISERROR(SEARCH(\"*GOV*\",Failing_Kids!$F243,1)),IF(ISERROR(SEARCH(\"*Econ*\",Failing_Kids!$F243,1)),IF(ISERROR(SEARCH(\"*Soc*\",Failing_Kids!$F243,1)),\"\",\"X\"),\"X\"),\"X\"),\"X\")","v":""},{"$f":"IF(ISERROR(SEARCH(\"*PE*\",Failing_Kids!$F243,1)),\"\",\"X\")","v":""}]
[{"$f":"Failing_Kids!C244","v":"Kinney"},{"$f":"Failing_Kids!D244","v":"Christopher"},{"$f":"IF(ISERROR(SEARCH(\"*English*\",Failing_Kids!F244,1)),\"\",\"X \")","v":""},{"$f":"IF(ISERROR(SEARCH(\"*Geometry*\",Failing_Kids!$F244,1)),IF(ISERROR(SEARCH(\"*Math*\",Failing_Kids!$F244,1)),IF(ISERROR(SEARCH(\"*Calc*\",Failing_Kids!$F244,1)),IF(ISERROR(SEARCH(\"*Algebra*\",Failing_Kids!$F244,1)),\"\",\"X\"),\"X\"),\"X\"),\"X\")","v":"X"},{"$f":"IF(ISERROR(SEARCH(\"*Science*\",Failing_Kids!$F244,1)),IF(ISERROR(SEARCH(\"*Bio*\",Failing_Kids!$F244,1)),IF(ISERROR(SEARCH(\"*Chem*\",Failing_Kids!$F244,1)),IF(ISERROR(SEARCH(\"*Physics*\",Failing_Kids!$F244,1)),\"\",\"X\"),\"X\"),\"X\"),\"X\")","v":""},{"$f":"IF(ISERROR(SEARCH(\"*His*\",Failing_Kids!$F244,1)),IF(ISERROR(SEARCH(\"*GOV*\",Failing_Kids!$F244,1)),IF(ISERROR(SEARCH(\"*Econ*\",Failing_Kids!$F244,1)),IF(ISERROR(SEARCH(\"*Soc*\",Failing_Kids!$F244,1)),\"\",\"X\"),\"X\"),\"X\"),\"X\")","v":""},{"$f":"IF(ISERROR(SEARCH(\"*PE*\",Failing_Kids!$F244,1)),\"\",\"X\")","v":""}]
[{"$f":"Failing_Kids!C245","v":"Kinney"},{"$f":"Failing_Kids!D245","v":"Christopher"},{"$f":"IF(ISERROR(SEARCH(\"*English*\",Failing_Kids!F245,1)),\"\",\"X \")","v":""},{"$f":"IF(ISERROR(SEARCH(\"*Geometry*\",Failing_Kids!$F245,1)),IF(ISERROR(SEARCH(\"*Math*\",Failing_Kids!$F245,1)),IF(ISERROR(SEARCH(\"*Calc*\",Failing_Kids!$F245,1)),IF(ISERROR(SEARCH(\"*Algebra*\",Failing_Kids!$F245,1)),\"\",\"X\"),\"X\"),\"X\"),\"X\")","v":""},{"$f":"IF(ISERROR(SEARCH(\"*Science*\",Failing_Kids!$F245,1)),IF(ISERROR(SEARCH(\"*Bio*\",Failing_Kids!$F245,1)),IF(ISERROR(SEARCH(\"*Chem*\",Failing_Kids!$F245,1)),IF(ISERROR(SEARCH(\"*Physics*\",Failing_Kids!$F245,1)),\"\",\"X\"),\"X\"),\"X\"),\"X\")","v":""},{"$f":"IF(ISERROR(SEARCH(\"*His*\",Failing_Kids!$F245,1)),IF(ISERROR(SEARCH(\"*GOV*\",Failing_Kids!$F245,1)),IF(ISERROR(SEARCH(\"*Econ*\",Failing_Kids!$F245,1)),IF(ISERROR(SEARCH(\"*Soc*\",Failing_Kids!$F245,1)),\"\",\"X\"),\"X\"),\"X\"),\"X\")","v":"X"},{"$f":"IF(ISERROR(SEARCH(\"*PE*\",Failing_Kids!$F245,1)),\"\",\"X\")","v":""}]
[{"$f":"Failing_Kids!C246","v":"Kinney"},{"$f":"Failing_Kids!D246","v":"Christopher"},{"$f":"IF(ISERROR(SEARCH(\"*English*\",Failing_Kids!F246,1)),\"\",\"X \")","v":"X "},{"$f":"IF(ISERROR(SEARCH(\"*Geometry*\",Failing_Kids!$F246,1)),IF(ISERROR(SEARCH(\"*Math*\",Failing_Kids!$F246,1)),IF(ISERROR(SEARCH(\"*Calc*\",Failing_Kids!$F246,1)),IF(ISERROR(SEARCH(\"*Algebra*\",Failing_Kids!$F246,1)),\"\",\"X\"),\"X\"),\"X\"),\"X\")","v":""},{"$f":"IF(ISERROR(SEARCH(\"*Science*\",Failing_Kids!$F246,1)),IF(ISERROR(SEARCH(\"*Bio*\",Failing_Kids!$F246,1)),IF(ISERROR(SEARCH(\"*Chem*\",Failing_Kids!$F246,1)),IF(ISERROR(SEARCH(\"*Physics*\",Failing_Kids!$F246,1)),\"\",\"X\"),\"X\"),\"X\"),\"X\")","v":""},{"$f":"IF(ISERROR(SEARCH(\"*His*\",Failing_Kids!$F246,1)),IF(ISERROR(SEARCH(\"*GOV*\",Failing_Kids!$F246,1)),IF(ISERROR(SEARCH(\"*Econ*\",Failing_Kids!$F246,1)),IF(ISERROR(SEARCH(\"*Soc*\",Failing_Kids!$F246,1)),\"\",\"X\"),\"X\"),\"X\"),\"X\")","v":""},{"$f":"IF(ISERROR(SEARCH(\"*PE*\",Failing_Kids!$F246,1)),\"\",\"X\")","v":""}]
[{"$f":"Failing_Kids!C247","v":"Kirby"},{"$f":"Failing_Kids!D247","v":"Amy"},{"$f":"IF(ISERROR(SEARCH(\"*English*\",Failing_Kids!F247,1)),\"\",\"X \")","v":"X "},{"$f":"IF(ISERROR(SEARCH(\"*Geometry*\",Failing_Kids!$F247,1)),IF(ISERROR(SEARCH(\"*Math*\",Failing_Kids!$F247,1)),IF(ISERROR(SEARCH(\"*Calc*\",Failing_Kids!$F247,1)),IF(ISERROR(SEARCH(\"*Algebra*\",Failing_Kids!$F247,1)),\"\",\"X\"),\"X\"),\"X\"),\"X\")","v":""},{"$f":"IF(ISERROR(SEARCH(\"*Science*\",Failing_Kids!$F247,1)),IF(ISERROR(SEARCH(\"*Bio*\",Failing_Kids!$F247,1)),IF(ISERROR(SEARCH(\"*Chem*\",Failing_Kids!$F247,1)),IF(ISERROR(SEARCH(\"*Physics*\",Failing_Kids!$F247,1)),\"\",\"X\"),\"X\"),\"X\"),\"X\")","v":""},{"$f":"IF(ISERROR(SEARCH(\"*His*\",Failing_Kids!$F247,1)),IF(ISERROR(SEARCH(\"*GOV*\",Failing_Kids!$F247,1)),IF(ISERROR(SEARCH(\"*Econ*\",Failing_Kids!$F247,1)),IF(ISERROR(SEARCH(\"*Soc*\",Failing_Kids!$F247,1)),\"\",\"X\"),\"X\"),\"X\"),\"X\")","v":""},{"$f":"IF(ISERROR(SEARCH(\"*PE*\",Failing_Kids!$F247,1)),\"\",\"X\")","v":""}]
[{"$f":"Failing_Kids!C248","v":"Kirby"},{"$f":"Failing_Kids!D248","v":"Amy"},{"$f":"IF(ISERROR(SEARCH(\"*English*\",Failing_Kids!F248,1)),\"\",\"X \")","v":""},{"$f":"IF(ISERROR(SEARCH(\"*Geometry*\",Failing_Kids!$F248,1)),IF(ISERROR(SEARCH(\"*Math*\",Failing_Kids!$F248,1)),IF(ISERROR(SEARCH(\"*Calc*\",Failing_Kids!$F248,1)),IF(ISERROR(SEARCH(\"*Algebra*\",Failing_Kids!$F248,1)),\"\",\"X\"),\"X\"),\"X\"),\"X\")","v":""},{"$f":"IF(ISERROR(SEARCH(\"*Science*\",Failing_Kids!$F248,1)),IF(ISERROR(SEARCH(\"*Bio*\",Failing_Kids!$F248,1)),IF(ISERROR(SEARCH(\"*Chem*\",Failing_Kids!$F248,1)),IF(ISERROR(SEARCH(\"*Physics*\",Failing_Kids!$F248,1)),\"\",\"X\"),\"X\"),\"X\"),\"X\")","v":""},{"$f":"IF(ISERROR(SEARCH(\"*His*\",Failing_Kids!$F248,1)),IF(ISERROR(SEARCH(\"*GOV*\",Failing_Kids!$F248,1)),IF(ISERROR(SEARCH(\"*Econ*\",Failing_Kids!$F248,1)),IF(ISERROR(SEARCH(\"*Soc*\",Failing_Kids!$F248,1)),\"\",\"X\"),\"X\"),\"X\"),\"X\")","v":"X"},{"$f":"IF(ISERROR(SEARCH(\"*PE*\",Failing_Kids!$F248,1)),\"\",\"X\")","v":""}]
[{"$f":"Failing_Kids!C249","v":"Kramer"},{"$f":"Failing_Kids!D249","v":"Norma"},{"$f":"IF(ISERROR(SEARCH(\"*English*\",Failing_Kids!F249,1)),\"\",\"X \")","v":""},{"$f":"IF(ISERROR(SEARCH(\"*Geometry*\",Failing_Kids!$F249,1)),IF(ISERROR(SEARCH(\"*Math*\",Failing_Kids!$F249,1)),IF(ISERROR(SEARCH(\"*Calc*\",Failing_Kids!$F249,1)),IF(ISERROR(SEARCH(\"*Algebra*\",Failing_Kids!$F249,1)),\"\",\"X\"),\"X\"),\"X\"),\"X\")","v":""},{"$f":"IF(ISERROR(SEARCH(\"*Science*\",Failing_Kids!$F249,1)),IF(ISERROR(SEARCH(\"*Bio*\",Failing_Kids!$F249,1)),IF(ISERROR(SEARCH(\"*Chem*\",Failing_Kids!$F249,1)),IF(ISERROR(SEARCH(\"*Physics*\",Failing_Kids!$F249,1)),\"\",\"X\"),\"X\"),\"X\"),\"X\")","v":"X"},{"$f":"IF(ISERROR(SEARCH(\"*His*\",Failing_Kids!$F249,1)),IF(ISERROR(SEARCH(\"*GOV*\",Failing_Kids!$F249,1)),IF(ISERROR(SEARCH(\"*Econ*\",Failing_Kids!$F249,1)),IF(ISERROR(SEARCH(\"*Soc*\",Failing_Kids!$F249,1)),\"\",\"X\"),\"X\"),\"X\"),\"X\")","v":""},{"$f":"IF(ISERROR(SEARCH(\"*PE*\",Failing_Kids!$F249,1)),\"\",\"X\")","v":""}]
[{"$f":"Failing_Kids!C250","v":"Lamb"},{"$f":"Failing_Kids!D250","v":"Gregory"},{"$f":"IF(ISERROR(SEARCH(\"*English*\",Failing_Kids!F250,1)),\"\",\"X \")","v":""},{"$f":"IF(ISERROR(SEARCH(\"*Geometry*\",Failing_Kids!$F250,1)),IF(ISERROR(SEARCH(\"*Math*\",Failing_Kids!$F250,1)),IF(ISERROR(SEARCH(\"*Calc*\",Failing_Kids!$F250,1)),IF(ISERROR(SEARCH(\"*Algebra*\",Failing_Kids!$F250,1)),\"\",\"X\"),\"X\"),\"X\"),\"X\")","v":"X"},{"$f":"IF(ISERROR(SEARCH(\"*Science*\",Failing_Kids!$F250,1)),IF(ISERROR(SEARCH(\"*Bio*\",Failing_Kids!$F250,1)),IF(ISERROR(SEARCH(\"*Chem*\",Failing_Kids!$F250,1)),IF(ISERROR(SEARCH(\"*Physics*\",Failing_Kids!$F250,1)),\"\",\"X\"),\"X\"),\"X\"),\"X\")","v":""},{"$f":"IF(ISERROR(SEARCH(\"*His*\",Failing_Kids!$F250,1)),IF(ISERROR(SEARCH(\"*GOV*\",Failing_Kids!$F250,1)),IF(ISERROR(SEARCH(\"*Econ*\",Failing_Kids!$F250,1)),IF(ISERROR(SEARCH(\"*Soc*\",Failing_Kids!$F250,1)),\"\",\"X\"),\"X\"),\"X\"),\"X\")","v":""},{"$f":"IF(ISERROR(SEARCH(\"*PE*\",Failing_Kids!$F250,1)),\"\",\"X\")","v":""}]
[{"$f":"Failing_Kids!C251","v":"Lamb"},{"$f":"Failing_Kids!D251","v":"Gregory"},{"$f":"IF(ISERROR(SEARCH(\"*English*\",Failing_Kids!F251,1)),\"\",\"X \")","v":""},{"$f":"IF(ISERROR(SEARCH(\"*Geometry*\",Failing_Kids!$F251,1)),IF(ISERROR(SEARCH(\"*Math*\",Failing_Kids!$F251,1)),IF(ISERROR(SEARCH(\"*Calc*\",Failing_Kids!$F251,1)),IF(ISERROR(SEARCH(\"*Algebra*\",Failing_Kids!$F251,1)),\"\",\"X\"),\"X\"),\"X\"),\"X\")","v":""},{"$f":"IF(ISERROR(SEARCH(\"*Science*\",Failing_Kids!$F251,1)),IF(ISERROR(SEARCH(\"*Bio*\",Failing_Kids!$F251,1)),IF(ISERROR(SEARCH(\"*Chem*\",Failing_Kids!$F251,1)),IF(ISERROR(SEARCH(\"*Physics*\",Failing_Kids!$F251,1)),\"\",\"X\"),\"X\"),\"X\"),\"X\")","v":""},{"$f":"IF(ISERROR(SEARCH(\"*His*\",Failing_Kids!$F251,1)),IF(ISERROR(SEARCH(\"*GOV*\",Failing_Kids!$F251,1)),IF(ISERROR(SEARCH(\"*Econ*\",Failing_Kids!$F251,1)),IF(ISERROR(SEARCH(\"*Soc*\",Failing_Kids!$F251,1)),\"\",\"X\"),\"X\"),\"X\"),\"X\")","v":"X"},{"$f":"IF(ISERROR(SEARCH(\"*PE*\",Failing_Kids!$F251,1)),\"\",\"X\")","v":""}]
[{"$f":"Failing_Kids!C252","v":"Larsen"},{"$f":"Failing_Kids!D252","v":"Allison"},{"$f":"IF(ISERROR(SEARCH(\"*English*\",Failing_Kids!F252,1)),\"\",\"X \")","v":""},{"$f":"IF(ISERROR(SEARCH(\"*Geometry*\",Failing_Kids!$F252,1)),IF(ISERROR(SEARCH(\"*Math*\",Failing_Kids!$F252,1)),IF(ISERROR(SEARCH(\"*Calc*\",Failing_Kids!$F252,1)),IF(ISERROR(SEARCH(\"*Algebra*\",Failing_Kids!$F252,1)),\"\",\"X\"),\"X\"),\"X\"),\"X\")","v":""},{"$f":"IF(ISERROR(SEARCH(\"*Science*\",Failing_Kids!$F252,1)),IF(ISERROR(SEARCH(\"*Bio*\",Failing_Kids!$F252,1)),IF(ISERROR(SEARCH(\"*Chem*\",Failing_Kids!$F252,1)),IF(ISERROR(SEARCH(\"*Physics*\",Failing_Kids!$F252,1)),\"\",\"X\"),\"X\"),\"X\"),\"X\")","v":"X"},{"$f":"IF(ISERROR(SEARCH(\"*His*\",Failing_Kids!$F252,1)),IF(ISERROR(SEARCH(\"*GOV*\",Failing_Kids!$F252,1)),IF(ISERROR(SEARCH(\"*Econ*\",Failing_Kids!$F252,1)),IF(ISERROR(SEARCH(\"*Soc*\",Failing_Kids!$F252,1)),\"\",\"X\"),\"X\"),\"X\"),\"X\")","v":""},{"$f":"IF(ISERROR(SEARCH(\"*PE*\",Failing_Kids!$F252,1)),\"\",\"X\")","v":""}]
[{"$f":"Failing_Kids!C253","v":"Larsen"},{"$f":"Failing_Kids!D253","v":"Allison"},{"$f":"IF(ISERROR(SEARCH(\"*English*\",Failing_Kids!F253,1)),\"\",\"X \")","v":"X "},{"$f":"IF(ISERROR(SEARCH(\"*Geometry*\",Failing_Kids!$F253,1)),IF(ISERROR(SEARCH(\"*Math*\",Failing_Kids!$F253,1)),IF(ISERROR(SEARCH(\"*Calc*\",Failing_Kids!$F253,1)),IF(ISERROR(SEARCH(\"*Algebra*\",Failing_Kids!$F253,1)),\"\",\"X\"),\"X\"),\"X\"),\"X\")","v":""},{"$f":"IF(ISERROR(SEARCH(\"*Science*\",Failing_Kids!$F253,1)),IF(ISERROR(SEARCH(\"*Bio*\",Failing_Kids!$F253,1)),IF(ISERROR(SEARCH(\"*Chem*\",Failing_Kids!$F253,1)),IF(ISERROR(SEARCH(\"*Physics*\",Failing_Kids!$F253,1)),\"\",\"X\"),\"X\"),\"X\"),\"X\")","v":""},{"$f":"IF(ISERROR(SEARCH(\"*His*\",Failing_Kids!$F253,1)),IF(ISERROR(SEARCH(\"*GOV*\",Failing_Kids!$F253,1)),IF(ISERROR(SEARCH(\"*Econ*\",Failing_Kids!$F253,1)),IF(ISERROR(SEARCH(\"*Soc*\",Failing_Kids!$F253,1)),\"\",\"X\"),\"X\"),\"X\"),\"X\")","v":""},{"$f":"IF(ISERROR(SEARCH(\"*PE*\",Failing_Kids!$F253,1)),\"\",\"X\")","v":""}]
[{"$f":"Failing_Kids!C254","v":"Larsen"},{"$f":"Failing_Kids!D254","v":"Allison"},{"$f":"IF(ISERROR(SEARCH(\"*English*\",Failing_Kids!F254,1)),\"\",\"X \")","v":""},{"$f":"IF(ISERROR(SEARCH(\"*Geometry*\",Failing_Kids!$F254,1)),IF(ISERROR(SEARCH(\"*Math*\",Failing_Kids!$F254,1)),IF(ISERROR(SEARCH(\"*Calc*\",Failing_Kids!$F254,1)),IF(ISERROR(SEARCH(\"*Algebra*\",Failing_Kids!$F254,1)),\"\",\"X\"),\"X\"),\"X\"),\"X\")","v":"X"},{"$f":"IF(ISERROR(SEARCH(\"*Science*\",Failing_Kids!$F254,1)),IF(ISERROR(SEARCH(\"*Bio*\",Failing_Kids!$F254,1)),IF(ISERROR(SEARCH(\"*Chem*\",Failing_Kids!$F254,1)),IF(ISERROR(SEARCH(\"*Physics*\",Failing_Kids!$F254,1)),\"\",\"X\"),\"X\"),\"X\"),\"X\")","v":""},{"$f":"IF(ISERROR(SEARCH(\"*His*\",Failing_Kids!$F254,1)),IF(ISERROR(SEARCH(\"*GOV*\",Failing_Kids!$F254,1)),IF(ISERROR(SEARCH(\"*Econ*\",Failing_Kids!$F254,1)),IF(ISERROR(SEARCH(\"*Soc*\",Failing_Kids!$F254,1)),\"\",\"X\"),\"X\"),\"X\"),\"X\")","v":""},{"$f":"IF(ISERROR(SEARCH(\"*PE*\",Failing_Kids!$F254,1)),\"\",\"X\")","v":""}]
[{"$f":"Failing_Kids!C255","v":"Le"},{"$f":"Failing_Kids!D255","v":"Nathan"},{"$f":"IF(ISERROR(SEARCH(\"*English*\",Failing_Kids!F255,1)),\"\",\"X \")","v":""},{"$f":"IF(ISERROR(SEARCH(\"*Geometry*\",Failing_Kids!$F255,1)),IF(ISERROR(SEARCH(\"*Math*\",Failing_Kids!$F255,1)),IF(ISERROR(SEARCH(\"*Calc*\",Failing_Kids!$F255,1)),IF(ISERROR(SEARCH(\"*Algebra*\",Failing_Kids!$F255,1)),\"\",\"X\"),\"X\"),\"X\"),\"X\")","v":""},{"$f":"IF(ISERROR(SEARCH(\"*Science*\",Failing_Kids!$F255,1)),IF(ISERROR(SEARCH(\"*Bio*\",Failing_Kids!$F255,1)),IF(ISERROR(SEARCH(\"*Chem*\",Failing_Kids!$F255,1)),IF(ISERROR(SEARCH(\"*Physics*\",Failing_Kids!$F255,1)),\"\",\"X\"),\"X\"),\"X\"),\"X\")","v":"X"},{"$f":"IF(ISERROR(SEARCH(\"*His*\",Failing_Kids!$F255,1)),IF(ISERROR(SEARCH(\"*GOV*\",Failing_Kids!$F255,1)),IF(ISERROR(SEARCH(\"*Econ*\",Failing_Kids!$F255,1)),IF(ISERROR(SEARCH(\"*Soc*\",Failing_Kids!$F255,1)),\"\",\"X\"),\"X\"),\"X\"),\"X\")","v":""},{"$f":"IF(ISERROR(SEARCH(\"*PE*\",Failing_Kids!$F255,1)),\"\",\"X\")","v":""}]
[{"$f":"Failing_Kids!C256","v":"Le"},{"$f":"Failing_Kids!D256","v":"Nathan"},{"$f":"IF(ISERROR(SEARCH(\"*English*\",Failing_Kids!F256,1)),\"\",\"X \")","v":""},{"$f":"IF(ISERROR(SEARCH(\"*Geometry*\",Failing_Kids!$F256,1)),IF(ISERROR(SEARCH(\"*Math*\",Failing_Kids!$F256,1)),IF(ISERROR(SEARCH(\"*Calc*\",Failing_Kids!$F256,1)),IF(ISERROR(SEARCH(\"*Algebra*\",Failing_Kids!$F256,1)),\"\",\"X\"),\"X\"),\"X\"),\"X\")","v":""},{"$f":"IF(ISERROR(SEARCH(\"*Science*\",Failing_Kids!$F256,1)),IF(ISERROR(SEARCH(\"*Bio*\",Failing_Kids!$F256,1)),IF(ISERROR(SEARCH(\"*Chem*\",Failing_Kids!$F256,1)),IF(ISERROR(SEARCH(\"*Physics*\",Failing_Kids!$F256,1)),\"\",\"X\"),\"X\"),\"X\"),\"X\")","v":""},{"$f":"IF(ISERROR(SEARCH(\"*His*\",Failing_Kids!$F256,1)),IF(ISERROR(SEARCH(\"*GOV*\",Failing_Kids!$F256,1)),IF(ISERROR(SEARCH(\"*Econ*\",Failing_Kids!$F256,1)),IF(ISERROR(SEARCH(\"*Soc*\",Failing_Kids!$F256,1)),\"\",\"X\"),\"X\"),\"X\"),\"X\")","v":"X"},{"$f":"IF(ISERROR(SEARCH(\"*PE*\",Failing_Kids!$F256,1)),\"\",\"X\")","v":""}]
[{"$f":"Failing_Kids!C257","v":"Lester"},{"$f":"Failing_Kids!D257","v":"Ronald"},{"$f":"IF(ISERROR(SEARCH(\"*English*\",Failing_Kids!F257,1)),\"\",\"X \")","v":""},{"$f":"IF(ISERROR(SEARCH(\"*Geometry*\",Failing_Kids!$F257,1)),IF(ISERROR(SEARCH(\"*Math*\",Failing_Kids!$F257,1)),IF(ISERROR(SEARCH(\"*Calc*\",Failing_Kids!$F257,1)),IF(ISERROR(SEARCH(\"*Algebra*\",Failing_Kids!$F257,1)),\"\",\"X\"),\"X\"),\"X\"),\"X\")","v":""},{"$f":"IF(ISERROR(SEARCH(\"*Science*\",Failing_Kids!$F257,1)),IF(ISERROR(SEARCH(\"*Bio*\",Failing_Kids!$F257,1)),IF(ISERROR(SEARCH(\"*Chem*\",Failing_Kids!$F257,1)),IF(ISERROR(SEARCH(\"*Physics*\",Failing_Kids!$F257,1)),\"\",\"X\"),\"X\"),\"X\"),\"X\")","v":""},{"$f":"IF(ISERROR(SEARCH(\"*His*\",Failing_Kids!$F257,1)),IF(ISERROR(SEARCH(\"*GOV*\",Failing_Kids!$F257,1)),IF(ISERROR(SEARCH(\"*Econ*\",Failing_Kids!$F257,1)),IF(ISERROR(SEARCH(\"*Soc*\",Failing_Kids!$F257,1)),\"\",\"X\"),\"X\"),\"X\"),\"X\")","v":"X"},{"$f":"IF(ISERROR(SEARCH(\"*PE*\",Failing_Kids!$F257,1)),\"\",\"X\")","v":""}]
[{"$f":"Failing_Kids!C258","v":"Lindsay"},{"$f":"Failing_Kids!D258","v":"Mamie"},{"$f":"IF(ISERROR(SEARCH(\"*English*\",Failing_Kids!F258,1)),\"\",\"X \")","v":""},{"$f":"IF(ISERROR(SEARCH(\"*Geometry*\",Failing_Kids!$F258,1)),IF(ISERROR(SEARCH(\"*Math*\",Failing_Kids!$F258,1)),IF(ISERROR(SEARCH(\"*Calc*\",Failing_Kids!$F258,1)),IF(ISERROR(SEARCH(\"*Algebra*\",Failing_Kids!$F258,1)),\"\",\"X\"),\"X\"),\"X\"),\"X\")","v":"X"},{"$f":"IF(ISERROR(SEARCH(\"*Science*\",Failing_Kids!$F258,1)),IF(ISERROR(SEARCH(\"*Bio*\",Failing_Kids!$F258,1)),IF(ISERROR(SEARCH(\"*Chem*\",Failing_Kids!$F258,1)),IF(ISERROR(SEARCH(\"*Physics*\",Failing_Kids!$F258,1)),\"\",\"X\"),\"X\"),\"X\"),\"X\")","v":""},{"$f":"IF(ISERROR(SEARCH(\"*His*\",Failing_Kids!$F258,1)),IF(ISERROR(SEARCH(\"*GOV*\",Failing_Kids!$F258,1)),IF(ISERROR(SEARCH(\"*Econ*\",Failing_Kids!$F258,1)),IF(ISERROR(SEARCH(\"*Soc*\",Failing_Kids!$F258,1)),\"\",\"X\"),\"X\"),\"X\"),\"X\")","v":""},{"$f":"IF(ISERROR(SEARCH(\"*PE*\",Failing_Kids!$F258,1)),\"\",\"X\")","v":""}]
[{"$f":"Failing_Kids!C259","v":"Lindsay"},{"$f":"Failing_Kids!D259","v":"Mamie"},{"$f":"IF(ISERROR(SEARCH(\"*English*\",Failing_Kids!F259,1)),\"\",\"X \")","v":""},{"$f":"IF(ISERROR(SEARCH(\"*Geometry*\",Failing_Kids!$F259,1)),IF(ISERROR(SEARCH(\"*Math*\",Failing_Kids!$F259,1)),IF(ISERROR(SEARCH(\"*Calc*\",Failing_Kids!$F259,1)),IF(ISERROR(SEARCH(\"*Algebra*\",Failing_Kids!$F259,1)),\"\",\"X\"),\"X\"),\"X\"),\"X\")","v":""},{"$f":"IF(ISERROR(SEARCH(\"*Science*\",Failing_Kids!$F259,1)),IF(ISERROR(SEARCH(\"*Bio*\",Failing_Kids!$F259,1)),IF(ISERROR(SEARCH(\"*Chem*\",Failing_Kids!$F259,1)),IF(ISERROR(SEARCH(\"*Physics*\",Failing_Kids!$F259,1)),\"\",\"X\"),\"X\"),\"X\"),\"X\")","v":""},{"$f":"IF(ISERROR(SEARCH(\"*His*\",Failing_Kids!$F259,1)),IF(ISERROR(SEARCH(\"*GOV*\",Failing_Kids!$F259,1)),IF(ISERROR(SEARCH(\"*Econ*\",Failing_Kids!$F259,1)),IF(ISERROR(SEARCH(\"*Soc*\",Failing_Kids!$F259,1)),\"\",\"X\"),\"X\"),\"X\"),\"X\")","v":""},{"$f":"IF(ISERROR(SEARCH(\"*PE*\",Failing_Kids!$F259,1)),\"\",\"X\")","v":""}]
[{"$f":"Failing_Kids!C260","v":"Lindsay"},{"$f":"Failing_Kids!D260","v":"Mamie"},{"$f":"IF(ISERROR(SEARCH(\"*English*\",Failing_Kids!F260,1)),\"\",\"X \")","v":"X "},{"$f":"IF(ISERROR(SEARCH(\"*Geometry*\",Failing_Kids!$F260,1)),IF(ISERROR(SEARCH(\"*Math*\",Failing_Kids!$F260,1)),IF(ISERROR(SEARCH(\"*Calc*\",Failing_Kids!$F260,1)),IF(ISERROR(SEARCH(\"*Algebra*\",Failing_Kids!$F260,1)),\"\",\"X\"),\"X\"),\"X\"),\"X\")","v":""},{"$f":"IF(ISERROR(SEARCH(\"*Science*\",Failing_Kids!$F260,1)),IF(ISERROR(SEARCH(\"*Bio*\",Failing_Kids!$F260,1)),IF(ISERROR(SEARCH(\"*Chem*\",Failing_Kids!$F260,1)),IF(ISERROR(SEARCH(\"*Physics*\",Failing_Kids!$F260,1)),\"\",\"X\"),\"X\"),\"X\"),\"X\")","v":""},{"$f":"IF(ISERROR(SEARCH(\"*His*\",Failing_Kids!$F260,1)),IF(ISERROR(SEARCH(\"*GOV*\",Failing_Kids!$F260,1)),IF(ISERROR(SEARCH(\"*Econ*\",Failing_Kids!$F260,1)),IF(ISERROR(SEARCH(\"*Soc*\",Failing_Kids!$F260,1)),\"\",\"X\"),\"X\"),\"X\"),\"X\")","v":""},{"$f":"IF(ISERROR(SEARCH(\"*PE*\",Failing_Kids!$F260,1)),\"\",\"X\")","v":""}]
[{"$f":"Failing_Kids!C261","v":"Lindsey"},{"$f":"Failing_Kids!D261","v":"Marilyn"},{"$f":"IF(ISERROR(SEARCH(\"*English*\",Failing_Kids!F261,1)),\"\",\"X \")","v":""},{"$f":"IF(ISERROR(SEARCH(\"*Geometry*\",Failing_Kids!$F261,1)),IF(ISERROR(SEARCH(\"*Math*\",Failing_Kids!$F261,1)),IF(ISERROR(SEARCH(\"*Calc*\",Failing_Kids!$F261,1)),IF(ISERROR(SEARCH(\"*Algebra*\",Failing_Kids!$F261,1)),\"\",\"X\"),\"X\"),\"X\"),\"X\")","v":""},{"$f":"IF(ISERROR(SEARCH(\"*Science*\",Failing_Kids!$F261,1)),IF(ISERROR(SEARCH(\"*Bio*\",Failing_Kids!$F261,1)),IF(ISERROR(SEARCH(\"*Chem*\",Failing_Kids!$F261,1)),IF(ISERROR(SEARCH(\"*Physics*\",Failing_Kids!$F261,1)),\"\",\"X\"),\"X\"),\"X\"),\"X\")","v":""},{"$f":"IF(ISERROR(SEARCH(\"*His*\",Failing_Kids!$F261,1)),IF(ISERROR(SEARCH(\"*GOV*\",Failing_Kids!$F261,1)),IF(ISERROR(SEARCH(\"*Econ*\",Failing_Kids!$F261,1)),IF(ISERROR(SEARCH(\"*Soc*\",Failing_Kids!$F261,1)),\"\",\"X\"),\"X\"),\"X\"),\"X\")","v":"X"},{"$f":"IF(ISERROR(SEARCH(\"*PE*\",Failing_Kids!$F261,1)),\"\",\"X\")","v":""}]
[{"$f":"Failing_Kids!C262","v":"Lindsey"},{"$f":"Failing_Kids!D262","v":"Maxine"},{"$f":"IF(ISERROR(SEARCH(\"*English*\",Failing_Kids!F262,1)),\"\",\"X \")","v":""},{"$f":"IF(ISERROR(SEARCH(\"*Geometry*\",Failing_Kids!$F262,1)),IF(ISERROR(SEARCH(\"*Math*\",Failing_Kids!$F262,1)),IF(ISERROR(SEARCH(\"*Calc*\",Failing_Kids!$F262,1)),IF(ISERROR(SEARCH(\"*Algebra*\",Failing_Kids!$F262,1)),\"\",\"X\"),\"X\"),\"X\"),\"X\")","v":""},{"$f":"IF(ISERROR(SEARCH(\"*Science*\",Failing_Kids!$F262,1)),IF(ISERROR(SEARCH(\"*Bio*\",Failing_Kids!$F262,1)),IF(ISERROR(SEARCH(\"*Chem*\",Failing_Kids!$F262,1)),IF(ISERROR(SEARCH(\"*Physics*\",Failing_Kids!$F262,1)),\"\",\"X\"),\"X\"),\"X\"),\"X\")","v":""},{"$f":"IF(ISERROR(SEARCH(\"*His*\",Failing_Kids!$F262,1)),IF(ISERROR(SEARCH(\"*GOV*\",Failing_Kids!$F262,1)),IF(ISERROR(SEARCH(\"*Econ*\",Failing_Kids!$F262,1)),IF(ISERROR(SEARCH(\"*Soc*\",Failing_Kids!$F262,1)),\"\",\"X\"),\"X\"),\"X\"),\"X\")","v":""},{"$f":"IF(ISERROR(SEARCH(\"*PE*\",Failing_Kids!$F262,1)),\"\",\"X\")","v":""}]
[{"$f":"Failing_Kids!C263","v":"Lindsey"},{"$f":"Failing_Kids!D263","v":"Maxine"},{"$f":"IF(ISERROR(SEARCH(\"*English*\",Failing_Kids!F263,1)),\"\",\"X \")","v":""},{"$f":"IF(ISERROR(SEARCH(\"*Geometry*\",Failing_Kids!$F263,1)),IF(ISERROR(SEARCH(\"*Math*\",Failing_Kids!$F263,1)),IF(ISERROR(SEARCH(\"*Calc*\",Failing_Kids!$F263,1)),IF(ISERROR(SEARCH(\"*Algebra*\",Failing_Kids!$F263,1)),\"\",\"X\"),\"X\"),\"X\"),\"X\")","v":""},{"$f":"IF(ISERROR(SEARCH(\"*Science*\",Failing_Kids!$F263,1)),IF(ISERROR(SEARCH(\"*Bio*\",Failing_Kids!$F263,1)),IF(ISERROR(SEARCH(\"*Chem*\",Failing_Kids!$F263,1)),IF(ISERROR(SEARCH(\"*Physics*\",Failing_Kids!$F263,1)),\"\",\"X\"),\"X\"),\"X\"),\"X\")","v":""},{"$f":"IF(ISERROR(SEARCH(\"*His*\",Failing_Kids!$F263,1)),IF(ISERROR(SEARCH(\"*GOV*\",Failing_Kids!$F263,1)),IF(ISERROR(SEARCH(\"*Econ*\",Failing_Kids!$F263,1)),IF(ISERROR(SEARCH(\"*Soc*\",Failing_Kids!$F263,1)),\"\",\"X\"),\"X\"),\"X\"),\"X\")","v":"X"},{"$f":"IF(ISERROR(SEARCH(\"*PE*\",Failing_Kids!$F263,1)),\"\",\"X\")","v":""}]
[{"$f":"Failing_Kids!C264","v":"Little"},{"$f":"Failing_Kids!D264","v":"Eugene"},{"$f":"IF(ISERROR(SEARCH(\"*English*\",Failing_Kids!F264,1)),\"\",\"X \")","v":"X "},{"$f":"IF(ISERROR(SEARCH(\"*Geometry*\",Failing_Kids!$F264,1)),IF(ISERROR(SEARCH(\"*Math*\",Failing_Kids!$F264,1)),IF(ISERROR(SEARCH(\"*Calc*\",Failing_Kids!$F264,1)),IF(ISERROR(SEARCH(\"*Algebra*\",Failing_Kids!$F264,1)),\"\",\"X\"),\"X\"),\"X\"),\"X\")","v":""},{"$f":"IF(ISERROR(SEARCH(\"*Science*\",Failing_Kids!$F264,1)),IF(ISERROR(SEARCH(\"*Bio*\",Failing_Kids!$F264,1)),IF(ISERROR(SEARCH(\"*Chem*\",Failing_Kids!$F264,1)),IF(ISERROR(SEARCH(\"*Physics*\",Failing_Kids!$F264,1)),\"\",\"X\"),\"X\"),\"X\"),\"X\")","v":""},{"$f":"IF(ISERROR(SEARCH(\"*His*\",Failing_Kids!$F264,1)),IF(ISERROR(SEARCH(\"*GOV*\",Failing_Kids!$F264,1)),IF(ISERROR(SEARCH(\"*Econ*\",Failing_Kids!$F264,1)),IF(ISERROR(SEARCH(\"*Soc*\",Failing_Kids!$F264,1)),\"\",\"X\"),\"X\"),\"X\"),\"X\")","v":""},{"$f":"IF(ISERROR(SEARCH(\"*PE*\",Failing_Kids!$F264,1)),\"\",\"X\")","v":""}]
[{"$f":"Failing_Kids!C265","v":"Lloyd"},{"$f":"Failing_Kids!D265","v":"Charlotte"},{"$f":"IF(ISERROR(SEARCH(\"*English*\",Failing_Kids!F265,1)),\"\",\"X \")","v":""},{"$f":"IF(ISERROR(SEARCH(\"*Geometry*\",Failing_Kids!$F265,1)),IF(ISERROR(SEARCH(\"*Math*\",Failing_Kids!$F265,1)),IF(ISERROR(SEARCH(\"*Calc*\",Failing_Kids!$F265,1)),IF(ISERROR(SEARCH(\"*Algebra*\",Failing_Kids!$F265,1)),\"\",\"X\"),\"X\"),\"X\"),\"X\")","v":""},{"$f":"IF(ISERROR(SEARCH(\"*Science*\",Failing_Kids!$F265,1)),IF(ISERROR(SEARCH(\"*Bio*\",Failing_Kids!$F265,1)),IF(ISERROR(SEARCH(\"*Chem*\",Failing_Kids!$F265,1)),IF(ISERROR(SEARCH(\"*Physics*\",Failing_Kids!$F265,1)),\"\",\"X\"),\"X\"),\"X\"),\"X\")","v":""},{"$f":"IF(ISERROR(SEARCH(\"*His*\",Failing_Kids!$F265,1)),IF(ISERROR(SEARCH(\"*GOV*\",Failing_Kids!$F265,1)),IF(ISERROR(SEARCH(\"*Econ*\",Failing_Kids!$F265,1)),IF(ISERROR(SEARCH(\"*Soc*\",Failing_Kids!$F265,1)),\"\",\"X\"),\"X\"),\"X\"),\"X\")","v":"X"},{"$f":"IF(ISERROR(SEARCH(\"*PE*\",Failing_Kids!$F265,1)),\"\",\"X\")","v":""}]
[{"$f":"Failing_Kids!C266","v":"Lloyd"},{"$f":"Failing_Kids!D266","v":"Kathleen"},{"$f":"IF(ISERROR(SEARCH(\"*English*\",Failing_Kids!F266,1)),\"\",\"X \")","v":""},{"$f":"IF(ISERROR(SEARCH(\"*Geometry*\",Failing_Kids!$F266,1)),IF(ISERROR(SEARCH(\"*Math*\",Failing_Kids!$F266,1)),IF(ISERROR(SEARCH(\"*Calc*\",Failing_Kids!$F266,1)),IF(ISERROR(SEARCH(\"*Algebra*\",Failing_Kids!$F266,1)),\"\",\"X\"),\"X\"),\"X\"),\"X\")","v":""},{"$f":"IF(ISERROR(SEARCH(\"*Science*\",Failing_Kids!$F266,1)),IF(ISERROR(SEARCH(\"*Bio*\",Failing_Kids!$F266,1)),IF(ISERROR(SEARCH(\"*Chem*\",Failing_Kids!$F266,1)),IF(ISERROR(SEARCH(\"*Physics*\",Failing_Kids!$F266,1)),\"\",\"X\"),\"X\"),\"X\"),\"X\")","v":""},{"$f":"IF(ISERROR(SEARCH(\"*His*\",Failing_Kids!$F266,1)),IF(ISERROR(SEARCH(\"*GOV*\",Failing_Kids!$F266,1)),IF(ISERROR(SEARCH(\"*Econ*\",Failing_Kids!$F266,1)),IF(ISERROR(SEARCH(\"*Soc*\",Failing_Kids!$F266,1)),\"\",\"X\"),\"X\"),\"X\"),\"X\")","v":"X"},{"$f":"IF(ISERROR(SEARCH(\"*PE*\",Failing_Kids!$F266,1)),\"\",\"X\")","v":""}]
[{"$f":"Failing_Kids!C267","v":"Love"},{"$f":"Failing_Kids!D267","v":"Jeannette"},{"$f":"IF(ISERROR(SEARCH(\"*English*\",Failing_Kids!F267,1)),\"\",\"X \")","v":""},{"$f":"IF(ISERROR(SEARCH(\"*Geometry*\",Failing_Kids!$F267,1)),IF(ISERROR(SEARCH(\"*Math*\",Failing_Kids!$F267,1)),IF(ISERROR(SEARCH(\"*Calc*\",Failing_Kids!$F267,1)),IF(ISERROR(SEARCH(\"*Algebra*\",Failing_Kids!$F267,1)),\"\",\"X\"),\"X\"),\"X\"),\"X\")","v":""},{"$f":"IF(ISERROR(SEARCH(\"*Science*\",Failing_Kids!$F267,1)),IF(ISERROR(SEARCH(\"*Bio*\",Failing_Kids!$F267,1)),IF(ISERROR(SEARCH(\"*Chem*\",Failing_Kids!$F267,1)),IF(ISERROR(SEARCH(\"*Physics*\",Failing_Kids!$F267,1)),\"\",\"X\"),\"X\"),\"X\"),\"X\")","v":""},{"$f":"IF(ISERROR(SEARCH(\"*His*\",Failing_Kids!$F267,1)),IF(ISERROR(SEARCH(\"*GOV*\",Failing_Kids!$F267,1)),IF(ISERROR(SEARCH(\"*Econ*\",Failing_Kids!$F267,1)),IF(ISERROR(SEARCH(\"*Soc*\",Failing_Kids!$F267,1)),\"\",\"X\"),\"X\"),\"X\"),\"X\")","v":""},{"$f":"IF(ISERROR(SEARCH(\"*PE*\",Failing_Kids!$F267,1)),\"\",\"X\")","v":""}]
[{"$f":"Failing_Kids!C268","v":"Lowery"},{"$f":"Failing_Kids!D268","v":"Carl"},{"$f":"IF(ISERROR(SEARCH(\"*English*\",Failing_Kids!F268,1)),\"\",\"X \")","v":""},{"$f":"IF(ISERROR(SEARCH(\"*Geometry*\",Failing_Kids!$F268,1)),IF(ISERROR(SEARCH(\"*Math*\",Failing_Kids!$F268,1)),IF(ISERROR(SEARCH(\"*Calc*\",Failing_Kids!$F268,1)),IF(ISERROR(SEARCH(\"*Algebra*\",Failing_Kids!$F268,1)),\"\",\"X\"),\"X\"),\"X\"),\"X\")","v":""},{"$f":"IF(ISERROR(SEARCH(\"*Science*\",Failing_Kids!$F268,1)),IF(ISERROR(SEARCH(\"*Bio*\",Failing_Kids!$F268,1)),IF(ISERROR(SEARCH(\"*Chem*\",Failing_Kids!$F268,1)),IF(ISERROR(SEARCH(\"*Physics*\",Failing_Kids!$F268,1)),\"\",\"X\"),\"X\"),\"X\"),\"X\")","v":"X"},{"$f":"IF(ISERROR(SEARCH(\"*His*\",Failing_Kids!$F268,1)),IF(ISERROR(SEARCH(\"*GOV*\",Failing_Kids!$F268,1)),IF(ISERROR(SEARCH(\"*Econ*\",Failing_Kids!$F268,1)),IF(ISERROR(SEARCH(\"*Soc*\",Failing_Kids!$F268,1)),\"\",\"X\"),\"X\"),\"X\"),\"X\")","v":""},{"$f":"IF(ISERROR(SEARCH(\"*PE*\",Failing_Kids!$F268,1)),\"\",\"X\")","v":""}]
[{"$f":"Failing_Kids!C269","v":"Lucas"},{"$f":"Failing_Kids!D269","v":"Ellen"},{"$f":"IF(ISERROR(SEARCH(\"*English*\",Failing_Kids!F269,1)),\"\",\"X \")","v":""},{"$f":"IF(ISERROR(SEARCH(\"*Geometry*\",Failing_Kids!$F269,1)),IF(ISERROR(SEARCH(\"*Math*\",Failing_Kids!$F269,1)),IF(ISERROR(SEARCH(\"*Calc*\",Failing_Kids!$F269,1)),IF(ISERROR(SEARCH(\"*Algebra*\",Failing_Kids!$F269,1)),\"\",\"X\"),\"X\"),\"X\"),\"X\")","v":"X"},{"$f":"IF(ISERROR(SEARCH(\"*Science*\",Failing_Kids!$F269,1)),IF(ISERROR(SEARCH(\"*Bio*\",Failing_Kids!$F269,1)),IF(ISERROR(SEARCH(\"*Chem*\",Failing_Kids!$F269,1)),IF(ISERROR(SEARCH(\"*Physics*\",Failing_Kids!$F269,1)),\"\",\"X\"),\"X\"),\"X\"),\"X\")","v":""},{"$f":"IF(ISERROR(SEARCH(\"*His*\",Failing_Kids!$F269,1)),IF(ISERROR(SEARCH(\"*GOV*\",Failing_Kids!$F269,1)),IF(ISERROR(SEARCH(\"*Econ*\",Failing_Kids!$F269,1)),IF(ISERROR(SEARCH(\"*Soc*\",Failing_Kids!$F269,1)),\"\",\"X\"),\"X\"),\"X\"),\"X\")","v":""},{"$f":"IF(ISERROR(SEARCH(\"*PE*\",Failing_Kids!$F269,1)),\"\",\"X\")","v":""}]
[{"$f":"Failing_Kids!C270","v":"Maddox"},{"$f":"Failing_Kids!D270","v":"Gloria"},{"$f":"IF(ISERROR(SEARCH(\"*English*\",Failing_Kids!F270,1)),\"\",\"X \")","v":""},{"$f":"IF(ISERROR(SEARCH(\"*Geometry*\",Failing_Kids!$F270,1)),IF(ISERROR(SEARCH(\"*Math*\",Failing_Kids!$F270,1)),IF(ISERROR(SEARCH(\"*Calc*\",Failing_Kids!$F270,1)),IF(ISERROR(SEARCH(\"*Algebra*\",Failing_Kids!$F270,1)),\"\",\"X\"),\"X\"),\"X\"),\"X\")","v":""},{"$f":"IF(ISERROR(SEARCH(\"*Science*\",Failing_Kids!$F270,1)),IF(ISERROR(SEARCH(\"*Bio*\",Failing_Kids!$F270,1)),IF(ISERROR(SEARCH(\"*Chem*\",Failing_Kids!$F270,1)),IF(ISERROR(SEARCH(\"*Physics*\",Failing_Kids!$F270,1)),\"\",\"X\"),\"X\"),\"X\"),\"X\")","v":""},{"$f":"IF(ISERROR(SEARCH(\"*His*\",Failing_Kids!$F270,1)),IF(ISERROR(SEARCH(\"*GOV*\",Failing_Kids!$F270,1)),IF(ISERROR(SEARCH(\"*Econ*\",Failing_Kids!$F270,1)),IF(ISERROR(SEARCH(\"*Soc*\",Failing_Kids!$F270,1)),\"\",\"X\"),\"X\"),\"X\"),\"X\")","v":"X"},{"$f":"IF(ISERROR(SEARCH(\"*PE*\",Failing_Kids!$F270,1)),\"\",\"X\")","v":""}]
[{"$f":"Failing_Kids!C271","v":"Manning"},{"$f":"Failing_Kids!D271","v":"Tiffany"},{"$f":"IF(ISERROR(SEARCH(\"*English*\",Failing_Kids!F271,1)),\"\",\"X \")","v":""},{"$f":"IF(ISERROR(SEARCH(\"*Geometry*\",Failing_Kids!$F271,1)),IF(ISERROR(SEARCH(\"*Math*\",Failing_Kids!$F271,1)),IF(ISERROR(SEARCH(\"*Calc*\",Failing_Kids!$F271,1)),IF(ISERROR(SEARCH(\"*Algebra*\",Failing_Kids!$F271,1)),\"\",\"X\"),\"X\"),\"X\"),\"X\")","v":"X"},{"$f":"IF(ISERROR(SEARCH(\"*Science*\",Failing_Kids!$F271,1)),IF(ISERROR(SEARCH(\"*Bio*\",Failing_Kids!$F271,1)),IF(ISERROR(SEARCH(\"*Chem*\",Failing_Kids!$F271,1)),IF(ISERROR(SEARCH(\"*Physics*\",Failing_Kids!$F271,1)),\"\",\"X\"),\"X\"),\"X\"),\"X\")","v":""},{"$f":"IF(ISERROR(SEARCH(\"*His*\",Failing_Kids!$F271,1)),IF(ISERROR(SEARCH(\"*GOV*\",Failing_Kids!$F271,1)),IF(ISERROR(SEARCH(\"*Econ*\",Failing_Kids!$F271,1)),IF(ISERROR(SEARCH(\"*Soc*\",Failing_Kids!$F271,1)),\"\",\"X\"),\"X\"),\"X\"),\"X\")","v":""},{"$f":"IF(ISERROR(SEARCH(\"*PE*\",Failing_Kids!$F271,1)),\"\",\"X\")","v":""}]
[{"$f":"Failing_Kids!C272","v":"Marquez"},{"$f":"Failing_Kids!D272","v":"Gloria"},{"$f":"IF(ISERROR(SEARCH(\"*English*\",Failing_Kids!F272,1)),\"\",\"X \")","v":""},{"$f":"IF(ISERROR(SEARCH(\"*Geometry*\",Failing_Kids!$F272,1)),IF(ISERROR(SEARCH(\"*Math*\",Failing_Kids!$F272,1)),IF(ISERROR(SEARCH(\"*Calc*\",Failing_Kids!$F272,1)),IF(ISERROR(SEARCH(\"*Algebra*\",Failing_Kids!$F272,1)),\"\",\"X\"),\"X\"),\"X\"),\"X\")","v":""},{"$f":"IF(ISERROR(SEARCH(\"*Science*\",Failing_Kids!$F272,1)),IF(ISERROR(SEARCH(\"*Bio*\",Failing_Kids!$F272,1)),IF(ISERROR(SEARCH(\"*Chem*\",Failing_Kids!$F272,1)),IF(ISERROR(SEARCH(\"*Physics*\",Failing_Kids!$F272,1)),\"\",\"X\"),\"X\"),\"X\"),\"X\")","v":""},{"$f":"IF(ISERROR(SEARCH(\"*His*\",Failing_Kids!$F272,1)),IF(ISERROR(SEARCH(\"*GOV*\",Failing_Kids!$F272,1)),IF(ISERROR(SEARCH(\"*Econ*\",Failing_Kids!$F272,1)),IF(ISERROR(SEARCH(\"*Soc*\",Failing_Kids!$F272,1)),\"\",\"X\"),\"X\"),\"X\"),\"X\")","v":""},{"$f":"IF(ISERROR(SEARCH(\"*PE*\",Failing_Kids!$F272,1)),\"\",\"X\")","v":""}]
[{"$f":"Failing_Kids!C273","v":"Massey"},{"$f":"Failing_Kids!D273","v":"Melissa"},{"$f":"IF(ISERROR(SEARCH(\"*English*\",Failing_Kids!F273,1)),\"\",\"X \")","v":"X "},{"$f":"IF(ISERROR(SEARCH(\"*Geometry*\",Failing_Kids!$F273,1)),IF(ISERROR(SEARCH(\"*Math*\",Failing_Kids!$F273,1)),IF(ISERROR(SEARCH(\"*Calc*\",Failing_Kids!$F273,1)),IF(ISERROR(SEARCH(\"*Algebra*\",Failing_Kids!$F273,1)),\"\",\"X\"),\"X\"),\"X\"),\"X\")","v":""},{"$f":"IF(ISERROR(SEARCH(\"*Science*\",Failing_Kids!$F273,1)),IF(ISERROR(SEARCH(\"*Bio*\",Failing_Kids!$F273,1)),IF(ISERROR(SEARCH(\"*Chem*\",Failing_Kids!$F273,1)),IF(ISERROR(SEARCH(\"*Physics*\",Failing_Kids!$F273,1)),\"\",\"X\"),\"X\"),\"X\"),\"X\")","v":""},{"$f":"IF(ISERROR(SEARCH(\"*His*\",Failing_Kids!$F273,1)),IF(ISERROR(SEARCH(\"*GOV*\",Failing_Kids!$F273,1)),IF(ISERROR(SEARCH(\"*Econ*\",Failing_Kids!$F273,1)),IF(ISERROR(SEARCH(\"*Soc*\",Failing_Kids!$F273,1)),\"\",\"X\"),\"X\"),\"X\"),\"X\")","v":""},{"$f":"IF(ISERROR(SEARCH(\"*PE*\",Failing_Kids!$F273,1)),\"\",\"X\")","v":""}]
[{"$f":"Failing_Kids!C274","v":"Massey"},{"$f":"Failing_Kids!D274","v":"Melissa"},{"$f":"IF(ISERROR(SEARCH(\"*English*\",Failing_Kids!F274,1)),\"\",\"X \")","v":""},{"$f":"IF(ISERROR(SEARCH(\"*Geometry*\",Failing_Kids!$F274,1)),IF(ISERROR(SEARCH(\"*Math*\",Failing_Kids!$F274,1)),IF(ISERROR(SEARCH(\"*Calc*\",Failing_Kids!$F274,1)),IF(ISERROR(SEARCH(\"*Algebra*\",Failing_Kids!$F274,1)),\"\",\"X\"),\"X\"),\"X\"),\"X\")","v":""},{"$f":"IF(ISERROR(SEARCH(\"*Science*\",Failing_Kids!$F274,1)),IF(ISERROR(SEARCH(\"*Bio*\",Failing_Kids!$F274,1)),IF(ISERROR(SEARCH(\"*Chem*\",Failing_Kids!$F274,1)),IF(ISERROR(SEARCH(\"*Physics*\",Failing_Kids!$F274,1)),\"\",\"X\"),\"X\"),\"X\"),\"X\")","v":""},{"$f":"IF(ISERROR(SEARCH(\"*His*\",Failing_Kids!$F274,1)),IF(ISERROR(SEARCH(\"*GOV*\",Failing_Kids!$F274,1)),IF(ISERROR(SEARCH(\"*Econ*\",Failing_Kids!$F274,1)),IF(ISERROR(SEARCH(\"*Soc*\",Failing_Kids!$F274,1)),\"\",\"X\"),\"X\"),\"X\"),\"X\")","v":""},{"$f":"IF(ISERROR(SEARCH(\"*PE*\",Failing_Kids!$F274,1)),\"\",\"X\")","v":""}]
[{"$f":"Failing_Kids!C275","v":"Maynard"},{"$f":"Failing_Kids!D275","v":"Keith"},{"$f":"IF(ISERROR(SEARCH(\"*English*\",Failing_Kids!F275,1)),\"\",\"X \")","v":"X "},{"$f":"IF(ISERROR(SEARCH(\"*Geometry*\",Failing_Kids!$F275,1)),IF(ISERROR(SEARCH(\"*Math*\",Failing_Kids!$F275,1)),IF(ISERROR(SEARCH(\"*Calc*\",Failing_Kids!$F275,1)),IF(ISERROR(SEARCH(\"*Algebra*\",Failing_Kids!$F275,1)),\"\",\"X\"),\"X\"),\"X\"),\"X\")","v":""},{"$f":"IF(ISERROR(SEARCH(\"*Science*\",Failing_Kids!$F275,1)),IF(ISERROR(SEARCH(\"*Bio*\",Failing_Kids!$F275,1)),IF(ISERROR(SEARCH(\"*Chem*\",Failing_Kids!$F275,1)),IF(ISERROR(SEARCH(\"*Physics*\",Failing_Kids!$F275,1)),\"\",\"X\"),\"X\"),\"X\"),\"X\")","v":""},{"$f":"IF(ISERROR(SEARCH(\"*His*\",Failing_Kids!$F275,1)),IF(ISERROR(SEARCH(\"*GOV*\",Failing_Kids!$F275,1)),IF(ISERROR(SEARCH(\"*Econ*\",Failing_Kids!$F275,1)),IF(ISERROR(SEARCH(\"*Soc*\",Failing_Kids!$F275,1)),\"\",\"X\"),\"X\"),\"X\"),\"X\")","v":""},{"$f":"IF(ISERROR(SEARCH(\"*PE*\",Failing_Kids!$F275,1)),\"\",\"X\")","v":""}]
[{"$f":"Failing_Kids!C276","v":"Maynard"},{"$f":"Failing_Kids!D276","v":"Keith"},{"$f":"IF(ISERROR(SEARCH(\"*English*\",Failing_Kids!F276,1)),\"\",\"X \")","v":""},{"$f":"IF(ISERROR(SEARCH(\"*Geometry*\",Failing_Kids!$F276,1)),IF(ISERROR(SEARCH(\"*Math*\",Failing_Kids!$F276,1)),IF(ISERROR(SEARCH(\"*Calc*\",Failing_Kids!$F276,1)),IF(ISERROR(SEARCH(\"*Algebra*\",Failing_Kids!$F276,1)),\"\",\"X\"),\"X\"),\"X\"),\"X\")","v":""},{"$f":"IF(ISERROR(SEARCH(\"*Science*\",Failing_Kids!$F276,1)),IF(ISERROR(SEARCH(\"*Bio*\",Failing_Kids!$F276,1)),IF(ISERROR(SEARCH(\"*Chem*\",Failing_Kids!$F276,1)),IF(ISERROR(SEARCH(\"*Physics*\",Failing_Kids!$F276,1)),\"\",\"X\"),\"X\"),\"X\"),\"X\")","v":""},{"$f":"IF(ISERROR(SEARCH(\"*His*\",Failing_Kids!$F276,1)),IF(ISERROR(SEARCH(\"*GOV*\",Failing_Kids!$F276,1)),IF(ISERROR(SEARCH(\"*Econ*\",Failing_Kids!$F276,1)),IF(ISERROR(SEARCH(\"*Soc*\",Failing_Kids!$F276,1)),\"\",\"X\"),\"X\"),\"X\"),\"X\")","v":""},{"$f":"IF(ISERROR(SEARCH(\"*PE*\",Failing_Kids!$F276,1)),\"\",\"X\")","v":""}]
[{"$f":"Failing_Kids!C277","v":"Mayo"},{"$f":"Failing_Kids!D277","v":"Christy"},{"$f":"IF(ISERROR(SEARCH(\"*English*\",Failing_Kids!F277,1)),\"\",\"X \")","v":"X "},{"$f":"IF(ISERROR(SEARCH(\"*Geometry*\",Failing_Kids!$F277,1)),IF(ISERROR(SEARCH(\"*Math*\",Failing_Kids!$F277,1)),IF(ISERROR(SEARCH(\"*Calc*\",Failing_Kids!$F277,1)),IF(ISERROR(SEARCH(\"*Algebra*\",Failing_Kids!$F277,1)),\"\",\"X\"),\"X\"),\"X\"),\"X\")","v":""},{"$f":"IF(ISERROR(SEARCH(\"*Science*\",Failing_Kids!$F277,1)),IF(ISERROR(SEARCH(\"*Bio*\",Failing_Kids!$F277,1)),IF(ISERROR(SEARCH(\"*Chem*\",Failing_Kids!$F277,1)),IF(ISERROR(SEARCH(\"*Physics*\",Failing_Kids!$F277,1)),\"\",\"X\"),\"X\"),\"X\"),\"X\")","v":""},{"$f":"IF(ISERROR(SEARCH(\"*His*\",Failing_Kids!$F277,1)),IF(ISERROR(SEARCH(\"*GOV*\",Failing_Kids!$F277,1)),IF(ISERROR(SEARCH(\"*Econ*\",Failing_Kids!$F277,1)),IF(ISERROR(SEARCH(\"*Soc*\",Failing_Kids!$F277,1)),\"\",\"X\"),\"X\"),\"X\"),\"X\")","v":""},{"$f":"IF(ISERROR(SEARCH(\"*PE*\",Failing_Kids!$F277,1)),\"\",\"X\")","v":""}]
[{"$f":"Failing_Kids!C278","v":"Mccarthy"},{"$f":"Failing_Kids!D278","v":"Claudia"},{"$f":"IF(ISERROR(SEARCH(\"*English*\",Failing_Kids!F278,1)),\"\",\"X \")","v":""},{"$f":"IF(ISERROR(SEARCH(\"*Geometry*\",Failing_Kids!$F278,1)),IF(ISERROR(SEARCH(\"*Math*\",Failing_Kids!$F278,1)),IF(ISERROR(SEARCH(\"*Calc*\",Failing_Kids!$F278,1)),IF(ISERROR(SEARCH(\"*Algebra*\",Failing_Kids!$F278,1)),\"\",\"X\"),\"X\"),\"X\"),\"X\")","v":""},{"$f":"IF(ISERROR(SEARCH(\"*Science*\",Failing_Kids!$F278,1)),IF(ISERROR(SEARCH(\"*Bio*\",Failing_Kids!$F278,1)),IF(ISERROR(SEARCH(\"*Chem*\",Failing_Kids!$F278,1)),IF(ISERROR(SEARCH(\"*Physics*\",Failing_Kids!$F278,1)),\"\",\"X\"),\"X\"),\"X\"),\"X\")","v":""},{"$f":"IF(ISERROR(SEARCH(\"*His*\",Failing_Kids!$F278,1)),IF(ISERROR(SEARCH(\"*GOV*\",Failing_Kids!$F278,1)),IF(ISERROR(SEARCH(\"*Econ*\",Failing_Kids!$F278,1)),IF(ISERROR(SEARCH(\"*Soc*\",Failing_Kids!$F278,1)),\"\",\"X\"),\"X\"),\"X\"),\"X\")","v":""},{"$f":"IF(ISERROR(SEARCH(\"*PE*\",Failing_Kids!$F278,1)),\"\",\"X\")","v":""}]
[{"$f":"Failing_Kids!C279","v":"Mccarthy"},{"$f":"Failing_Kids!D279","v":"Claudia"},{"$f":"IF(ISERROR(SEARCH(\"*English*\",Failing_Kids!F279,1)),\"\",\"X \")","v":""},{"$f":"IF(ISERROR(SEARCH(\"*Geometry*\",Failing_Kids!$F279,1)),IF(ISERROR(SEARCH(\"*Math*\",Failing_Kids!$F279,1)),IF(ISERROR(SEARCH(\"*Calc*\",Failing_Kids!$F279,1)),IF(ISERROR(SEARCH(\"*Algebra*\",Failing_Kids!$F279,1)),\"\",\"X\"),\"X\"),\"X\"),\"X\")","v":"X"},{"$f":"IF(ISERROR(SEARCH(\"*Science*\",Failing_Kids!$F279,1)),IF(ISERROR(SEARCH(\"*Bio*\",Failing_Kids!$F279,1)),IF(ISERROR(SEARCH(\"*Chem*\",Failing_Kids!$F279,1)),IF(ISERROR(SEARCH(\"*Physics*\",Failing_Kids!$F279,1)),\"\",\"X\"),\"X\"),\"X\"),\"X\")","v":""},{"$f":"IF(ISERROR(SEARCH(\"*His*\",Failing_Kids!$F279,1)),IF(ISERROR(SEARCH(\"*GOV*\",Failing_Kids!$F279,1)),IF(ISERROR(SEARCH(\"*Econ*\",Failing_Kids!$F279,1)),IF(ISERROR(SEARCH(\"*Soc*\",Failing_Kids!$F279,1)),\"\",\"X\"),\"X\"),\"X\"),\"X\")","v":""},{"$f":"IF(ISERROR(SEARCH(\"*PE*\",Failing_Kids!$F279,1)),\"\",\"X\")","v":""}]
[{"$f":"Failing_Kids!C280","v":"Mccarthy"},{"$f":"Failing_Kids!D280","v":"Claudia"},{"$f":"IF(ISERROR(SEARCH(\"*English*\",Failing_Kids!F280,1)),\"\",\"X \")","v":""},{"$f":"IF(ISERROR(SEARCH(\"*Geometry*\",Failing_Kids!$F280,1)),IF(ISERROR(SEARCH(\"*Math*\",Failing_Kids!$F280,1)),IF(ISERROR(SEARCH(\"*Calc*\",Failing_Kids!$F280,1)),IF(ISERROR(SEARCH(\"*Algebra*\",Failing_Kids!$F280,1)),\"\",\"X\"),\"X\"),\"X\"),\"X\")","v":""},{"$f":"IF(ISERROR(SEARCH(\"*Science*\",Failing_Kids!$F280,1)),IF(ISERROR(SEARCH(\"*Bio*\",Failing_Kids!$F280,1)),IF(ISERROR(SEARCH(\"*Chem*\",Failing_Kids!$F280,1)),IF(ISERROR(SEARCH(\"*Physics*\",Failing_Kids!$F280,1)),\"\",\"X\"),\"X\"),\"X\"),\"X\")","v":""},{"$f":"IF(ISERROR(SEARCH(\"*His*\",Failing_Kids!$F280,1)),IF(ISERROR(SEARCH(\"*GOV*\",Failing_Kids!$F280,1)),IF(ISERROR(SEARCH(\"*Econ*\",Failing_Kids!$F280,1)),IF(ISERROR(SEARCH(\"*Soc*\",Failing_Kids!$F280,1)),\"\",\"X\"),\"X\"),\"X\"),\"X\")","v":"X"},{"$f":"IF(ISERROR(SEARCH(\"*PE*\",Failing_Kids!$F280,1)),\"\",\"X\")","v":""}]
[{"$f":"Failing_Kids!C281","v":"Mcclain"},{"$f":"Failing_Kids!D281","v":"Maureen"},{"$f":"IF(ISERROR(SEARCH(\"*English*\",Failing_Kids!F281,1)),\"\",\"X \")","v":""},{"$f":"IF(ISERROR(SEARCH(\"*Geometry*\",Failing_Kids!$F281,1)),IF(ISERROR(SEARCH(\"*Math*\",Failing_Kids!$F281,1)),IF(ISERROR(SEARCH(\"*Calc*\",Failing_Kids!$F281,1)),IF(ISERROR(SEARCH(\"*Algebra*\",Failing_Kids!$F281,1)),\"\",\"X\"),\"X\"),\"X\"),\"X\")","v":"X"},{"$f":"IF(ISERROR(SEARCH(\"*Science*\",Failing_Kids!$F281,1)),IF(ISERROR(SEARCH(\"*Bio*\",Failing_Kids!$F281,1)),IF(ISERROR(SEARCH(\"*Chem*\",Failing_Kids!$F281,1)),IF(ISERROR(SEARCH(\"*Physics*\",Failing_Kids!$F281,1)),\"\",\"X\"),\"X\"),\"X\"),\"X\")","v":""},{"$f":"IF(ISERROR(SEARCH(\"*His*\",Failing_Kids!$F281,1)),IF(ISERROR(SEARCH(\"*GOV*\",Failing_Kids!$F281,1)),IF(ISERROR(SEARCH(\"*Econ*\",Failing_Kids!$F281,1)),IF(ISERROR(SEARCH(\"*Soc*\",Failing_Kids!$F281,1)),\"\",\"X\"),\"X\"),\"X\"),\"X\")","v":""},{"$f":"IF(ISERROR(SEARCH(\"*PE*\",Failing_Kids!$F281,1)),\"\",\"X\")","v":""}]
[{"$f":"Failing_Kids!C282","v":"Mccoy"},{"$f":"Failing_Kids!D282","v":"Brandy"},{"$f":"IF(ISERROR(SEARCH(\"*English*\",Failing_Kids!F282,1)),\"\",\"X \")","v":"X "},{"$f":"IF(ISERROR(SEARCH(\"*Geometry*\",Failing_Kids!$F282,1)),IF(ISERROR(SEARCH(\"*Math*\",Failing_Kids!$F282,1)),IF(ISERROR(SEARCH(\"*Calc*\",Failing_Kids!$F282,1)),IF(ISERROR(SEARCH(\"*Algebra*\",Failing_Kids!$F282,1)),\"\",\"X\"),\"X\"),\"X\"),\"X\")","v":""},{"$f":"IF(ISERROR(SEARCH(\"*Science*\",Failing_Kids!$F282,1)),IF(ISERROR(SEARCH(\"*Bio*\",Failing_Kids!$F282,1)),IF(ISERROR(SEARCH(\"*Chem*\",Failing_Kids!$F282,1)),IF(ISERROR(SEARCH(\"*Physics*\",Failing_Kids!$F282,1)),\"\",\"X\"),\"X\"),\"X\"),\"X\")","v":""},{"$f":"IF(ISERROR(SEARCH(\"*His*\",Failing_Kids!$F282,1)),IF(ISERROR(SEARCH(\"*GOV*\",Failing_Kids!$F282,1)),IF(ISERROR(SEARCH(\"*Econ*\",Failing_Kids!$F282,1)),IF(ISERROR(SEARCH(\"*Soc*\",Failing_Kids!$F282,1)),\"\",\"X\"),\"X\"),\"X\"),\"X\")","v":""},{"$f":"IF(ISERROR(SEARCH(\"*PE*\",Failing_Kids!$F282,1)),\"\",\"X\")","v":""}]
[{"$f":"Failing_Kids!C283","v":"Mccullough"},{"$f":"Failing_Kids!D283","v":"Glenn"},{"$f":"IF(ISERROR(SEARCH(\"*English*\",Failing_Kids!F283,1)),\"\",\"X \")","v":""},{"$f":"IF(ISERROR(SEARCH(\"*Geometry*\",Failing_Kids!$F283,1)),IF(ISERROR(SEARCH(\"*Math*\",Failing_Kids!$F283,1)),IF(ISERROR(SEARCH(\"*Calc*\",Failing_Kids!$F283,1)),IF(ISERROR(SEARCH(\"*Algebra*\",Failing_Kids!$F283,1)),\"\",\"X\"),\"X\"),\"X\"),\"X\")","v":"X"},{"$f":"IF(ISERROR(SEARCH(\"*Science*\",Failing_Kids!$F283,1)),IF(ISERROR(SEARCH(\"*Bio*\",Failing_Kids!$F283,1)),IF(ISERROR(SEARCH(\"*Chem*\",Failing_Kids!$F283,1)),IF(ISERROR(SEARCH(\"*Physics*\",Failing_Kids!$F283,1)),\"\",\"X\"),\"X\"),\"X\"),\"X\")","v":""},{"$f":"IF(ISERROR(SEARCH(\"*His*\",Failing_Kids!$F283,1)),IF(ISERROR(SEARCH(\"*GOV*\",Failing_Kids!$F283,1)),IF(ISERROR(SEARCH(\"*Econ*\",Failing_Kids!$F283,1)),IF(ISERROR(SEARCH(\"*Soc*\",Failing_Kids!$F283,1)),\"\",\"X\"),\"X\"),\"X\"),\"X\")","v":""},{"$f":"IF(ISERROR(SEARCH(\"*PE*\",Failing_Kids!$F283,1)),\"\",\"X\")","v":""}]
[{"$f":"Failing_Kids!C284","v":"Mcfadden"},{"$f":"Failing_Kids!D284","v":"Shawn"},{"$f":"IF(ISERROR(SEARCH(\"*English*\",Failing_Kids!F284,1)),\"\",\"X \")","v":"X "},{"$f":"IF(ISERROR(SEARCH(\"*Geometry*\",Failing_Kids!$F284,1)),IF(ISERROR(SEARCH(\"*Math*\",Failing_Kids!$F284,1)),IF(ISERROR(SEARCH(\"*Calc*\",Failing_Kids!$F284,1)),IF(ISERROR(SEARCH(\"*Algebra*\",Failing_Kids!$F284,1)),\"\",\"X\"),\"X\"),\"X\"),\"X\")","v":""},{"$f":"IF(ISERROR(SEARCH(\"*Science*\",Failing_Kids!$F284,1)),IF(ISERROR(SEARCH(\"*Bio*\",Failing_Kids!$F284,1)),IF(ISERROR(SEARCH(\"*Chem*\",Failing_Kids!$F284,1)),IF(ISERROR(SEARCH(\"*Physics*\",Failing_Kids!$F284,1)),\"\",\"X\"),\"X\"),\"X\"),\"X\")","v":""},{"$f":"IF(ISERROR(SEARCH(\"*His*\",Failing_Kids!$F284,1)),IF(ISERROR(SEARCH(\"*GOV*\",Failing_Kids!$F284,1)),IF(ISERROR(SEARCH(\"*Econ*\",Failing_Kids!$F284,1)),IF(ISERROR(SEARCH(\"*Soc*\",Failing_Kids!$F284,1)),\"\",\"X\"),\"X\"),\"X\"),\"X\")","v":""},{"$f":"IF(ISERROR(SEARCH(\"*PE*\",Failing_Kids!$F284,1)),\"\",\"X\")","v":""}]
[{"$f":"Failing_Kids!C285","v":"Mcfadden"},{"$f":"Failing_Kids!D285","v":"Shawn"},{"$f":"IF(ISERROR(SEARCH(\"*English*\",Failing_Kids!F285,1)),\"\",\"X \")","v":""},{"$f":"IF(ISERROR(SEARCH(\"*Geometry*\",Failing_Kids!$F285,1)),IF(ISERROR(SEARCH(\"*Math*\",Failing_Kids!$F285,1)),IF(ISERROR(SEARCH(\"*Calc*\",Failing_Kids!$F285,1)),IF(ISERROR(SEARCH(\"*Algebra*\",Failing_Kids!$F285,1)),\"\",\"X\"),\"X\"),\"X\"),\"X\")","v":""},{"$f":"IF(ISERROR(SEARCH(\"*Science*\",Failing_Kids!$F285,1)),IF(ISERROR(SEARCH(\"*Bio*\",Failing_Kids!$F285,1)),IF(ISERROR(SEARCH(\"*Chem*\",Failing_Kids!$F285,1)),IF(ISERROR(SEARCH(\"*Physics*\",Failing_Kids!$F285,1)),\"\",\"X\"),\"X\"),\"X\"),\"X\")","v":""},{"$f":"IF(ISERROR(SEARCH(\"*His*\",Failing_Kids!$F285,1)),IF(ISERROR(SEARCH(\"*GOV*\",Failing_Kids!$F285,1)),IF(ISERROR(SEARCH(\"*Econ*\",Failing_Kids!$F285,1)),IF(ISERROR(SEARCH(\"*Soc*\",Failing_Kids!$F285,1)),\"\",\"X\"),\"X\"),\"X\"),\"X\")","v":"X"},{"$f":"IF(ISERROR(SEARCH(\"*PE*\",Failing_Kids!$F285,1)),\"\",\"X\")","v":""}]
[{"$f":"Failing_Kids!C286","v":"Mcfarland"},{"$f":"Failing_Kids!D286","v":"Mike"},{"$f":"IF(ISERROR(SEARCH(\"*English*\",Failing_Kids!F286,1)),\"\",\"X \")","v":""},{"$f":"IF(ISERROR(SEARCH(\"*Geometry*\",Failing_Kids!$F286,1)),IF(ISERROR(SEARCH(\"*Math*\",Failing_Kids!$F286,1)),IF(ISERROR(SEARCH(\"*Calc*\",Failing_Kids!$F286,1)),IF(ISERROR(SEARCH(\"*Algebra*\",Failing_Kids!$F286,1)),\"\",\"X\"),\"X\"),\"X\"),\"X\")","v":"X"},{"$f":"IF(ISERROR(SEARCH(\"*Science*\",Failing_Kids!$F286,1)),IF(ISERROR(SEARCH(\"*Bio*\",Failing_Kids!$F286,1)),IF(ISERROR(SEARCH(\"*Chem*\",Failing_Kids!$F286,1)),IF(ISERROR(SEARCH(\"*Physics*\",Failing_Kids!$F286,1)),\"\",\"X\"),\"X\"),\"X\"),\"X\")","v":""},{"$f":"IF(ISERROR(SEARCH(\"*His*\",Failing_Kids!$F286,1)),IF(ISERROR(SEARCH(\"*GOV*\",Failing_Kids!$F286,1)),IF(ISERROR(SEARCH(\"*Econ*\",Failing_Kids!$F286,1)),IF(ISERROR(SEARCH(\"*Soc*\",Failing_Kids!$F286,1)),\"\",\"X\"),\"X\"),\"X\"),\"X\")","v":""},{"$f":"IF(ISERROR(SEARCH(\"*PE*\",Failing_Kids!$F286,1)),\"\",\"X\")","v":""}]
[{"$f":"Failing_Kids!C287","v":"Mcgee"},{"$f":"Failing_Kids!D287","v":"Robin"},{"$f":"IF(ISERROR(SEARCH(\"*English*\",Failing_Kids!F287,1)),\"\",\"X \")","v":"X "},{"$f":"IF(ISERROR(SEARCH(\"*Geometry*\",Failing_Kids!$F287,1)),IF(ISERROR(SEARCH(\"*Math*\",Failing_Kids!$F287,1)),IF(ISERROR(SEARCH(\"*Calc*\",Failing_Kids!$F287,1)),IF(ISERROR(SEARCH(\"*Algebra*\",Failing_Kids!$F287,1)),\"\",\"X\"),\"X\"),\"X\"),\"X\")","v":""},{"$f":"IF(ISERROR(SEARCH(\"*Science*\",Failing_Kids!$F287,1)),IF(ISERROR(SEARCH(\"*Bio*\",Failing_Kids!$F287,1)),IF(ISERROR(SEARCH(\"*Chem*\",Failing_Kids!$F287,1)),IF(ISERROR(SEARCH(\"*Physics*\",Failing_Kids!$F287,1)),\"\",\"X\"),\"X\"),\"X\"),\"X\")","v":""},{"$f":"IF(ISERROR(SEARCH(\"*His*\",Failing_Kids!$F287,1)),IF(ISERROR(SEARCH(\"*GOV*\",Failing_Kids!$F287,1)),IF(ISERROR(SEARCH(\"*Econ*\",Failing_Kids!$F287,1)),IF(ISERROR(SEARCH(\"*Soc*\",Failing_Kids!$F287,1)),\"\",\"X\"),\"X\"),\"X\"),\"X\")","v":""},{"$f":"IF(ISERROR(SEARCH(\"*PE*\",Failing_Kids!$F287,1)),\"\",\"X\")","v":""}]
[{"$f":"Failing_Kids!C288","v":"Mcintyre"},{"$f":"Failing_Kids!D288","v":"Barbara"},{"$f":"IF(ISERROR(SEARCH(\"*English*\",Failing_Kids!F288,1)),\"\",\"X \")","v":"X "},{"$f":"IF(ISERROR(SEARCH(\"*Geometry*\",Failing_Kids!$F288,1)),IF(ISERROR(SEARCH(\"*Math*\",Failing_Kids!$F288,1)),IF(ISERROR(SEARCH(\"*Calc*\",Failing_Kids!$F288,1)),IF(ISERROR(SEARCH(\"*Algebra*\",Failing_Kids!$F288,1)),\"\",\"X\"),\"X\"),\"X\"),\"X\")","v":""},{"$f":"IF(ISERROR(SEARCH(\"*Science*\",Failing_Kids!$F288,1)),IF(ISERROR(SEARCH(\"*Bio*\",Failing_Kids!$F288,1)),IF(ISERROR(SEARCH(\"*Chem*\",Failing_Kids!$F288,1)),IF(ISERROR(SEARCH(\"*Physics*\",Failing_Kids!$F288,1)),\"\",\"X\"),\"X\"),\"X\"),\"X\")","v":""},{"$f":"IF(ISERROR(SEARCH(\"*His*\",Failing_Kids!$F288,1)),IF(ISERROR(SEARCH(\"*GOV*\",Failing_Kids!$F288,1)),IF(ISERROR(SEARCH(\"*Econ*\",Failing_Kids!$F288,1)),IF(ISERROR(SEARCH(\"*Soc*\",Failing_Kids!$F288,1)),\"\",\"X\"),\"X\"),\"X\"),\"X\")","v":""},{"$f":"IF(ISERROR(SEARCH(\"*PE*\",Failing_Kids!$F288,1)),\"\",\"X\")","v":""}]
[{"$f":"Failing_Kids!C289","v":"Mcintyre"},{"$f":"Failing_Kids!D289","v":"Charlotte"},{"$f":"IF(ISERROR(SEARCH(\"*English*\",Failing_Kids!F289,1)),\"\",\"X \")","v":""},{"$f":"IF(ISERROR(SEARCH(\"*Geometry*\",Failing_Kids!$F289,1)),IF(ISERROR(SEARCH(\"*Math*\",Failing_Kids!$F289,1)),IF(ISERROR(SEARCH(\"*Calc*\",Failing_Kids!$F289,1)),IF(ISERROR(SEARCH(\"*Algebra*\",Failing_Kids!$F289,1)),\"\",\"X\"),\"X\"),\"X\"),\"X\")","v":"X"},{"$f":"IF(ISERROR(SEARCH(\"*Science*\",Failing_Kids!$F289,1)),IF(ISERROR(SEARCH(\"*Bio*\",Failing_Kids!$F289,1)),IF(ISERROR(SEARCH(\"*Chem*\",Failing_Kids!$F289,1)),IF(ISERROR(SEARCH(\"*Physics*\",Failing_Kids!$F289,1)),\"\",\"X\"),\"X\"),\"X\"),\"X\")","v":""},{"$f":"IF(ISERROR(SEARCH(\"*His*\",Failing_Kids!$F289,1)),IF(ISERROR(SEARCH(\"*GOV*\",Failing_Kids!$F289,1)),IF(ISERROR(SEARCH(\"*Econ*\",Failing_Kids!$F289,1)),IF(ISERROR(SEARCH(\"*Soc*\",Failing_Kids!$F289,1)),\"\",\"X\"),\"X\"),\"X\"),\"X\")","v":""},{"$f":"IF(ISERROR(SEARCH(\"*PE*\",Failing_Kids!$F289,1)),\"\",\"X\")","v":""}]
[{"$f":"Failing_Kids!C290","v":"Mcknight"},{"$f":"Failing_Kids!D290","v":"Kim"},{"$f":"IF(ISERROR(SEARCH(\"*English*\",Failing_Kids!F290,1)),\"\",\"X \")","v":""},{"$f":"IF(ISERROR(SEARCH(\"*Geometry*\",Failing_Kids!$F290,1)),IF(ISERROR(SEARCH(\"*Math*\",Failing_Kids!$F290,1)),IF(ISERROR(SEARCH(\"*Calc*\",Failing_Kids!$F290,1)),IF(ISERROR(SEARCH(\"*Algebra*\",Failing_Kids!$F290,1)),\"\",\"X\"),\"X\"),\"X\"),\"X\")","v":"X"},{"$f":"IF(ISERROR(SEARCH(\"*Science*\",Failing_Kids!$F290,1)),IF(ISERROR(SEARCH(\"*Bio*\",Failing_Kids!$F290,1)),IF(ISERROR(SEARCH(\"*Chem*\",Failing_Kids!$F290,1)),IF(ISERROR(SEARCH(\"*Physics*\",Failing_Kids!$F290,1)),\"\",\"X\"),\"X\"),\"X\"),\"X\")","v":""},{"$f":"IF(ISERROR(SEARCH(\"*His*\",Failing_Kids!$F290,1)),IF(ISERROR(SEARCH(\"*GOV*\",Failing_Kids!$F290,1)),IF(ISERROR(SEARCH(\"*Econ*\",Failing_Kids!$F290,1)),IF(ISERROR(SEARCH(\"*Soc*\",Failing_Kids!$F290,1)),\"\",\"X\"),\"X\"),\"X\"),\"X\")","v":""},{"$f":"IF(ISERROR(SEARCH(\"*PE*\",Failing_Kids!$F290,1)),\"\",\"X\")","v":""}]
[{"$f":"Failing_Kids!C291","v":"Mcknight"},{"$f":"Failing_Kids!D291","v":"Kim"},{"$f":"IF(ISERROR(SEARCH(\"*English*\",Failing_Kids!F291,1)),\"\",\"X \")","v":""},{"$f":"IF(ISERROR(SEARCH(\"*Geometry*\",Failing_Kids!$F291,1)),IF(ISERROR(SEARCH(\"*Math*\",Failing_Kids!$F291,1)),IF(ISERROR(SEARCH(\"*Calc*\",Failing_Kids!$F291,1)),IF(ISERROR(SEARCH(\"*Algebra*\",Failing_Kids!$F291,1)),\"\",\"X\"),\"X\"),\"X\"),\"X\")","v":"X"},{"$f":"IF(ISERROR(SEARCH(\"*Science*\",Failing_Kids!$F291,1)),IF(ISERROR(SEARCH(\"*Bio*\",Failing_Kids!$F291,1)),IF(ISERROR(SEARCH(\"*Chem*\",Failing_Kids!$F291,1)),IF(ISERROR(SEARCH(\"*Physics*\",Failing_Kids!$F291,1)),\"\",\"X\"),\"X\"),\"X\"),\"X\")","v":""},{"$f":"IF(ISERROR(SEARCH(\"*His*\",Failing_Kids!$F291,1)),IF(ISERROR(SEARCH(\"*GOV*\",Failing_Kids!$F291,1)),IF(ISERROR(SEARCH(\"*Econ*\",Failing_Kids!$F291,1)),IF(ISERROR(SEARCH(\"*Soc*\",Failing_Kids!$F291,1)),\"\",\"X\"),\"X\"),\"X\"),\"X\")","v":""},{"$f":"IF(ISERROR(SEARCH(\"*PE*\",Failing_Kids!$F291,1)),\"\",\"X\")","v":""}]
[{"$f":"Failing_Kids!C292","v":"Mcleod"},{"$f":"Failing_Kids!D292","v":"Lillian"},{"$f":"IF(ISERROR(SEARCH(\"*English*\",Failing_Kids!F292,1)),\"\",\"X \")","v":"X "},{"$f":"IF(ISERROR(SEARCH(\"*Geometry*\",Failing_Kids!$F292,1)),IF(ISERROR(SEARCH(\"*Math*\",Failing_Kids!$F292,1)),IF(ISERROR(SEARCH(\"*Calc*\",Failing_Kids!$F292,1)),IF(ISERROR(SEARCH(\"*Algebra*\",Failing_Kids!$F292,1)),\"\",\"X\"),\"X\"),\"X\"),\"X\")","v":""},{"$f":"IF(ISERROR(SEARCH(\"*Science*\",Failing_Kids!$F292,1)),IF(ISERROR(SEARCH(\"*Bio*\",Failing_Kids!$F292,1)),IF(ISERROR(SEARCH(\"*Chem*\",Failing_Kids!$F292,1)),IF(ISERROR(SEARCH(\"*Physics*\",Failing_Kids!$F292,1)),\"\",\"X\"),\"X\"),\"X\"),\"X\")","v":""},{"$f":"IF(ISERROR(SEARCH(\"*His*\",Failing_Kids!$F292,1)),IF(ISERROR(SEARCH(\"*GOV*\",Failing_Kids!$F292,1)),IF(ISERROR(SEARCH(\"*Econ*\",Failing_Kids!$F292,1)),IF(ISERROR(SEARCH(\"*Soc*\",Failing_Kids!$F292,1)),\"\",\"X\"),\"X\"),\"X\"),\"X\")","v":""},{"$f":"IF(ISERROR(SEARCH(\"*PE*\",Failing_Kids!$F292,1)),\"\",\"X\")","v":""}]
[{"$f":"Failing_Kids!C293","v":"Mcneil"},{"$f":"Failing_Kids!D293","v":"Louis"},{"$f":"IF(ISERROR(SEARCH(\"*English*\",Failing_Kids!F293,1)),\"\",\"X \")","v":""},{"$f":"IF(ISERROR(SEARCH(\"*Geometry*\",Failing_Kids!$F293,1)),IF(ISERROR(SEARCH(\"*Math*\",Failing_Kids!$F293,1)),IF(ISERROR(SEARCH(\"*Calc*\",Failing_Kids!$F293,1)),IF(ISERROR(SEARCH(\"*Algebra*\",Failing_Kids!$F293,1)),\"\",\"X\"),\"X\"),\"X\"),\"X\")","v":"X"},{"$f":"IF(ISERROR(SEARCH(\"*Science*\",Failing_Kids!$F293,1)),IF(ISERROR(SEARCH(\"*Bio*\",Failing_Kids!$F293,1)),IF(ISERROR(SEARCH(\"*Chem*\",Failing_Kids!$F293,1)),IF(ISERROR(SEARCH(\"*Physics*\",Failing_Kids!$F293,1)),\"\",\"X\"),\"X\"),\"X\"),\"X\")","v":""},{"$f":"IF(ISERROR(SEARCH(\"*His*\",Failing_Kids!$F293,1)),IF(ISERROR(SEARCH(\"*GOV*\",Failing_Kids!$F293,1)),IF(ISERROR(SEARCH(\"*Econ*\",Failing_Kids!$F293,1)),IF(ISERROR(SEARCH(\"*Soc*\",Failing_Kids!$F293,1)),\"\",\"X\"),\"X\"),\"X\"),\"X\")","v":""},{"$f":"IF(ISERROR(SEARCH(\"*PE*\",Failing_Kids!$F293,1)),\"\",\"X\")","v":""}]
[{"$f":"Failing_Kids!C294","v":"Medina"},{"$f":"Failing_Kids!D294","v":"Harriet"},{"$f":"IF(ISERROR(SEARCH(\"*English*\",Failing_Kids!F294,1)),\"\",\"X \")","v":""},{"$f":"IF(ISERROR(SEARCH(\"*Geometry*\",Failing_Kids!$F294,1)),IF(ISERROR(SEARCH(\"*Math*\",Failing_Kids!$F294,1)),IF(ISERROR(SEARCH(\"*Calc*\",Failing_Kids!$F294,1)),IF(ISERROR(SEARCH(\"*Algebra*\",Failing_Kids!$F294,1)),\"\",\"X\"),\"X\"),\"X\"),\"X\")","v":""},{"$f":"IF(ISERROR(SEARCH(\"*Science*\",Failing_Kids!$F294,1)),IF(ISERROR(SEARCH(\"*Bio*\",Failing_Kids!$F294,1)),IF(ISERROR(SEARCH(\"*Chem*\",Failing_Kids!$F294,1)),IF(ISERROR(SEARCH(\"*Physics*\",Failing_Kids!$F294,1)),\"\",\"X\"),\"X\"),\"X\"),\"X\")","v":""},{"$f":"IF(ISERROR(SEARCH(\"*His*\",Failing_Kids!$F294,1)),IF(ISERROR(SEARCH(\"*GOV*\",Failing_Kids!$F294,1)),IF(ISERROR(SEARCH(\"*Econ*\",Failing_Kids!$F294,1)),IF(ISERROR(SEARCH(\"*Soc*\",Failing_Kids!$F294,1)),\"\",\"X\"),\"X\"),\"X\"),\"X\")","v":"X"},{"$f":"IF(ISERROR(SEARCH(\"*PE*\",Failing_Kids!$F294,1)),\"\",\"X\")","v":""}]
[{"$f":"Failing_Kids!C295","v":"Meyers"},{"$f":"Failing_Kids!D295","v":"Rodney"},{"$f":"IF(ISERROR(SEARCH(\"*English*\",Failing_Kids!F295,1)),\"\",\"X \")","v":""},{"$f":"IF(ISERROR(SEARCH(\"*Geometry*\",Failing_Kids!$F295,1)),IF(ISERROR(SEARCH(\"*Math*\",Failing_Kids!$F295,1)),IF(ISERROR(SEARCH(\"*Calc*\",Failing_Kids!$F295,1)),IF(ISERROR(SEARCH(\"*Algebra*\",Failing_Kids!$F295,1)),\"\",\"X\"),\"X\"),\"X\"),\"X\")","v":"X"},{"$f":"IF(ISERROR(SEARCH(\"*Science*\",Failing_Kids!$F295,1)),IF(ISERROR(SEARCH(\"*Bio*\",Failing_Kids!$F295,1)),IF(ISERROR(SEARCH(\"*Chem*\",Failing_Kids!$F295,1)),IF(ISERROR(SEARCH(\"*Physics*\",Failing_Kids!$F295,1)),\"\",\"X\"),\"X\"),\"X\"),\"X\")","v":""},{"$f":"IF(ISERROR(SEARCH(\"*His*\",Failing_Kids!$F295,1)),IF(ISERROR(SEARCH(\"*GOV*\",Failing_Kids!$F295,1)),IF(ISERROR(SEARCH(\"*Econ*\",Failing_Kids!$F295,1)),IF(ISERROR(SEARCH(\"*Soc*\",Failing_Kids!$F295,1)),\"\",\"X\"),\"X\"),\"X\"),\"X\")","v":""},{"$f":"IF(ISERROR(SEARCH(\"*PE*\",Failing_Kids!$F295,1)),\"\",\"X\")","v":""}]
[{"$f":"Failing_Kids!C296","v":"Michael"},{"$f":"Failing_Kids!D296","v":"Roger"},{"$f":"IF(ISERROR(SEARCH(\"*English*\",Failing_Kids!F296,1)),\"\",\"X \")","v":""},{"$f":"IF(ISERROR(SEARCH(\"*Geometry*\",Failing_Kids!$F296,1)),IF(ISERROR(SEARCH(\"*Math*\",Failing_Kids!$F296,1)),IF(ISERROR(SEARCH(\"*Calc*\",Failing_Kids!$F296,1)),IF(ISERROR(SEARCH(\"*Algebra*\",Failing_Kids!$F296,1)),\"\",\"X\"),\"X\"),\"X\"),\"X\")","v":""},{"$f":"IF(ISERROR(SEARCH(\"*Science*\",Failing_Kids!$F296,1)),IF(ISERROR(SEARCH(\"*Bio*\",Failing_Kids!$F296,1)),IF(ISERROR(SEARCH(\"*Chem*\",Failing_Kids!$F296,1)),IF(ISERROR(SEARCH(\"*Physics*\",Failing_Kids!$F296,1)),\"\",\"X\"),\"X\"),\"X\"),\"X\")","v":""},{"$f":"IF(ISERROR(SEARCH(\"*His*\",Failing_Kids!$F296,1)),IF(ISERROR(SEARCH(\"*GOV*\",Failing_Kids!$F296,1)),IF(ISERROR(SEARCH(\"*Econ*\",Failing_Kids!$F296,1)),IF(ISERROR(SEARCH(\"*Soc*\",Failing_Kids!$F296,1)),\"\",\"X\"),\"X\"),\"X\"),\"X\")","v":""},{"$f":"IF(ISERROR(SEARCH(\"*PE*\",Failing_Kids!$F296,1)),\"\",\"X\")","v":""}]
[{"$f":"Failing_Kids!C297","v":"Miller"},{"$f":"Failing_Kids!D297","v":"Joann"},{"$f":"IF(ISERROR(SEARCH(\"*English*\",Failing_Kids!F297,1)),\"\",\"X \")","v":"X "},{"$f":"IF(ISERROR(SEARCH(\"*Geometry*\",Failing_Kids!$F297,1)),IF(ISERROR(SEARCH(\"*Math*\",Failing_Kids!$F297,1)),IF(ISERROR(SEARCH(\"*Calc*\",Failing_Kids!$F297,1)),IF(ISERROR(SEARCH(\"*Algebra*\",Failing_Kids!$F297,1)),\"\",\"X\"),\"X\"),\"X\"),\"X\")","v":""},{"$f":"IF(ISERROR(SEARCH(\"*Science*\",Failing_Kids!$F297,1)),IF(ISERROR(SEARCH(\"*Bio*\",Failing_Kids!$F297,1)),IF(ISERROR(SEARCH(\"*Chem*\",Failing_Kids!$F297,1)),IF(ISERROR(SEARCH(\"*Physics*\",Failing_Kids!$F297,1)),\"\",\"X\"),\"X\"),\"X\"),\"X\")","v":""},{"$f":"IF(ISERROR(SEARCH(\"*His*\",Failing_Kids!$F297,1)),IF(ISERROR(SEARCH(\"*GOV*\",Failing_Kids!$F297,1)),IF(ISERROR(SEARCH(\"*Econ*\",Failing_Kids!$F297,1)),IF(ISERROR(SEARCH(\"*Soc*\",Failing_Kids!$F297,1)),\"\",\"X\"),\"X\"),\"X\"),\"X\")","v":""},{"$f":"IF(ISERROR(SEARCH(\"*PE*\",Failing_Kids!$F297,1)),\"\",\"X\")","v":""}]
[{"$f":"Failing_Kids!C298","v":"Miller"},{"$f":"Failing_Kids!D298","v":"Joann"},{"$f":"IF(ISERROR(SEARCH(\"*English*\",Failing_Kids!F298,1)),\"\",\"X \")","v":""},{"$f":"IF(ISERROR(SEARCH(\"*Geometry*\",Failing_Kids!$F298,1)),IF(ISERROR(SEARCH(\"*Math*\",Failing_Kids!$F298,1)),IF(ISERROR(SEARCH(\"*Calc*\",Failing_Kids!$F298,1)),IF(ISERROR(SEARCH(\"*Algebra*\",Failing_Kids!$F298,1)),\"\",\"X\"),\"X\"),\"X\"),\"X\")","v":"X"},{"$f":"IF(ISERROR(SEARCH(\"*Science*\",Failing_Kids!$F298,1)),IF(ISERROR(SEARCH(\"*Bio*\",Failing_Kids!$F298,1)),IF(ISERROR(SEARCH(\"*Chem*\",Failing_Kids!$F298,1)),IF(ISERROR(SEARCH(\"*Physics*\",Failing_Kids!$F298,1)),\"\",\"X\"),\"X\"),\"X\"),\"X\")","v":""},{"$f":"IF(ISERROR(SEARCH(\"*His*\",Failing_Kids!$F298,1)),IF(ISERROR(SEARCH(\"*GOV*\",Failing_Kids!$F298,1)),IF(ISERROR(SEARCH(\"*Econ*\",Failing_Kids!$F298,1)),IF(ISERROR(SEARCH(\"*Soc*\",Failing_Kids!$F298,1)),\"\",\"X\"),\"X\"),\"X\"),\"X\")","v":""},{"$f":"IF(ISERROR(SEARCH(\"*PE*\",Failing_Kids!$F298,1)),\"\",\"X\")","v":""}]
[{"$f":"Failing_Kids!C299","v":"Miller"},{"$f":"Failing_Kids!D299","v":"Joann"},{"$f":"IF(ISERROR(SEARCH(\"*English*\",Failing_Kids!F299,1)),\"\",\"X \")","v":""},{"$f":"IF(ISERROR(SEARCH(\"*Geometry*\",Failing_Kids!$F299,1)),IF(ISERROR(SEARCH(\"*Math*\",Failing_Kids!$F299,1)),IF(ISERROR(SEARCH(\"*Calc*\",Failing_Kids!$F299,1)),IF(ISERROR(SEARCH(\"*Algebra*\",Failing_Kids!$F299,1)),\"\",\"X\"),\"X\"),\"X\"),\"X\")","v":""},{"$f":"IF(ISERROR(SEARCH(\"*Science*\",Failing_Kids!$F299,1)),IF(ISERROR(SEARCH(\"*Bio*\",Failing_Kids!$F299,1)),IF(ISERROR(SEARCH(\"*Chem*\",Failing_Kids!$F299,1)),IF(ISERROR(SEARCH(\"*Physics*\",Failing_Kids!$F299,1)),\"\",\"X\"),\"X\"),\"X\"),\"X\")","v":""},{"$f":"IF(ISERROR(SEARCH(\"*His*\",Failing_Kids!$F299,1)),IF(ISERROR(SEARCH(\"*GOV*\",Failing_Kids!$F299,1)),IF(ISERROR(SEARCH(\"*Econ*\",Failing_Kids!$F299,1)),IF(ISERROR(SEARCH(\"*Soc*\",Failing_Kids!$F299,1)),\"\",\"X\"),\"X\"),\"X\"),\"X\")","v":""},{"$f":"IF(ISERROR(SEARCH(\"*PE*\",Failing_Kids!$F299,1)),\"\",\"X\")","v":""}]
[{"$f":"Failing_Kids!C300","v":"Moore"},{"$f":"Failing_Kids!D300","v":"Lori"},{"$f":"IF(ISERROR(SEARCH(\"*English*\",Failing_Kids!F300,1)),\"\",\"X \")","v":"X "},{"$f":"IF(ISERROR(SEARCH(\"*Geometry*\",Failing_Kids!$F300,1)),IF(ISERROR(SEARCH(\"*Math*\",Failing_Kids!$F300,1)),IF(ISERROR(SEARCH(\"*Calc*\",Failing_Kids!$F300,1)),IF(ISERROR(SEARCH(\"*Algebra*\",Failing_Kids!$F300,1)),\"\",\"X\"),\"X\"),\"X\"),\"X\")","v":""},{"$f":"IF(ISERROR(SEARCH(\"*Science*\",Failing_Kids!$F300,1)),IF(ISERROR(SEARCH(\"*Bio*\",Failing_Kids!$F300,1)),IF(ISERROR(SEARCH(\"*Chem*\",Failing_Kids!$F300,1)),IF(ISERROR(SEARCH(\"*Physics*\",Failing_Kids!$F300,1)),\"\",\"X\"),\"X\"),\"X\"),\"X\")","v":""},{"$f":"IF(ISERROR(SEARCH(\"*His*\",Failing_Kids!$F300,1)),IF(ISERROR(SEARCH(\"*GOV*\",Failing_Kids!$F300,1)),IF(ISERROR(SEARCH(\"*Econ*\",Failing_Kids!$F300,1)),IF(ISERROR(SEARCH(\"*Soc*\",Failing_Kids!$F300,1)),\"\",\"X\"),\"X\"),\"X\"),\"X\")","v":""},{"$f":"IF(ISERROR(SEARCH(\"*PE*\",Failing_Kids!$F300,1)),\"\",\"X\")","v":""}]
[{"$f":"Failing_Kids!C301","v":"Morales"},{"$f":"Failing_Kids!D301","v":"Phillip"},{"$f":"IF(ISERROR(SEARCH(\"*English*\",Failing_Kids!F301,1)),\"\",\"X \")","v":""},{"$f":"IF(ISERROR(SEARCH(\"*Geometry*\",Failing_Kids!$F301,1)),IF(ISERROR(SEARCH(\"*Math*\",Failing_Kids!$F301,1)),IF(ISERROR(SEARCH(\"*Calc*\",Failing_Kids!$F301,1)),IF(ISERROR(SEARCH(\"*Algebra*\",Failing_Kids!$F301,1)),\"\",\"X\"),\"X\"),\"X\"),\"X\")","v":"X"},{"$f":"IF(ISERROR(SEARCH(\"*Science*\",Failing_Kids!$F301,1)),IF(ISERROR(SEARCH(\"*Bio*\",Failing_Kids!$F301,1)),IF(ISERROR(SEARCH(\"*Chem*\",Failing_Kids!$F301,1)),IF(ISERROR(SEARCH(\"*Physics*\",Failing_Kids!$F301,1)),\"\",\"X\"),\"X\"),\"X\"),\"X\")","v":""},{"$f":"IF(ISERROR(SEARCH(\"*His*\",Failing_Kids!$F301,1)),IF(ISERROR(SEARCH(\"*GOV*\",Failing_Kids!$F301,1)),IF(ISERROR(SEARCH(\"*Econ*\",Failing_Kids!$F301,1)),IF(ISERROR(SEARCH(\"*Soc*\",Failing_Kids!$F301,1)),\"\",\"X\"),\"X\"),\"X\"),\"X\")","v":""},{"$f":"IF(ISERROR(SEARCH(\"*PE*\",Failing_Kids!$F301,1)),\"\",\"X\")","v":""}]
[{"$f":"Failing_Kids!C302","v":"Moreno"},{"$f":"Failing_Kids!D302","v":"Samuel"},{"$f":"IF(ISERROR(SEARCH(\"*English*\",Failing_Kids!F302,1)),\"\",\"X \")","v":""},{"$f":"IF(ISERROR(SEARCH(\"*Geometry*\",Failing_Kids!$F302,1)),IF(ISERROR(SEARCH(\"*Math*\",Failing_Kids!$F302,1)),IF(ISERROR(SEARCH(\"*Calc*\",Failing_Kids!$F302,1)),IF(ISERROR(SEARCH(\"*Algebra*\",Failing_Kids!$F302,1)),\"\",\"X\"),\"X\"),\"X\"),\"X\")","v":"X"},{"$f":"IF(ISERROR(SEARCH(\"*Science*\",Failing_Kids!$F302,1)),IF(ISERROR(SEARCH(\"*Bio*\",Failing_Kids!$F302,1)),IF(ISERROR(SEARCH(\"*Chem*\",Failing_Kids!$F302,1)),IF(ISERROR(SEARCH(\"*Physics*\",Failing_Kids!$F302,1)),\"\",\"X\"),\"X\"),\"X\"),\"X\")","v":""},{"$f":"IF(ISERROR(SEARCH(\"*His*\",Failing_Kids!$F302,1)),IF(ISERROR(SEARCH(\"*GOV*\",Failing_Kids!$F302,1)),IF(ISERROR(SEARCH(\"*Econ*\",Failing_Kids!$F302,1)),IF(ISERROR(SEARCH(\"*Soc*\",Failing_Kids!$F302,1)),\"\",\"X\"),\"X\"),\"X\"),\"X\")","v":""},{"$f":"IF(ISERROR(SEARCH(\"*PE*\",Failing_Kids!$F302,1)),\"\",\"X\")","v":""}]
[{"$f":"Failing_Kids!C303","v":"Morgan"},{"$f":"Failing_Kids!D303","v":"Alfred"},{"$f":"IF(ISERROR(SEARCH(\"*English*\",Failing_Kids!F303,1)),\"\",\"X \")","v":""},{"$f":"IF(ISERROR(SEARCH(\"*Geometry*\",Failing_Kids!$F303,1)),IF(ISERROR(SEARCH(\"*Math*\",Failing_Kids!$F303,1)),IF(ISERROR(SEARCH(\"*Calc*\",Failing_Kids!$F303,1)),IF(ISERROR(SEARCH(\"*Algebra*\",Failing_Kids!$F303,1)),\"\",\"X\"),\"X\"),\"X\"),\"X\")","v":""},{"$f":"IF(ISERROR(SEARCH(\"*Science*\",Failing_Kids!$F303,1)),IF(ISERROR(SEARCH(\"*Bio*\",Failing_Kids!$F303,1)),IF(ISERROR(SEARCH(\"*Chem*\",Failing_Kids!$F303,1)),IF(ISERROR(SEARCH(\"*Physics*\",Failing_Kids!$F303,1)),\"\",\"X\"),\"X\"),\"X\"),\"X\")","v":""},{"$f":"IF(ISERROR(SEARCH(\"*His*\",Failing_Kids!$F303,1)),IF(ISERROR(SEARCH(\"*GOV*\",Failing_Kids!$F303,1)),IF(ISERROR(SEARCH(\"*Econ*\",Failing_Kids!$F303,1)),IF(ISERROR(SEARCH(\"*Soc*\",Failing_Kids!$F303,1)),\"\",\"X\"),\"X\"),\"X\"),\"X\")","v":""},{"$f":"IF(ISERROR(SEARCH(\"*PE*\",Failing_Kids!$F303,1)),\"\",\"X\")","v":""}]
[{"$f":"Failing_Kids!C304","v":"Morgan"},{"$f":"Failing_Kids!D304","v":"Alfred"},{"$f":"IF(ISERROR(SEARCH(\"*English*\",Failing_Kids!F304,1)),\"\",\"X \")","v":""},{"$f":"IF(ISERROR(SEARCH(\"*Geometry*\",Failing_Kids!$F304,1)),IF(ISERROR(SEARCH(\"*Math*\",Failing_Kids!$F304,1)),IF(ISERROR(SEARCH(\"*Calc*\",Failing_Kids!$F304,1)),IF(ISERROR(SEARCH(\"*Algebra*\",Failing_Kids!$F304,1)),\"\",\"X\"),\"X\"),\"X\"),\"X\")","v":"X"},{"$f":"IF(ISERROR(SEARCH(\"*Science*\",Failing_Kids!$F304,1)),IF(ISERROR(SEARCH(\"*Bio*\",Failing_Kids!$F304,1)),IF(ISERROR(SEARCH(\"*Chem*\",Failing_Kids!$F304,1)),IF(ISERROR(SEARCH(\"*Physics*\",Failing_Kids!$F304,1)),\"\",\"X\"),\"X\"),\"X\"),\"X\")","v":""},{"$f":"IF(ISERROR(SEARCH(\"*His*\",Failing_Kids!$F304,1)),IF(ISERROR(SEARCH(\"*GOV*\",Failing_Kids!$F304,1)),IF(ISERROR(SEARCH(\"*Econ*\",Failing_Kids!$F304,1)),IF(ISERROR(SEARCH(\"*Soc*\",Failing_Kids!$F304,1)),\"\",\"X\"),\"X\"),\"X\"),\"X\")","v":""},{"$f":"IF(ISERROR(SEARCH(\"*PE*\",Failing_Kids!$F304,1)),\"\",\"X\")","v":""}]
[{"$f":"Failing_Kids!C305","v":"Morgan"},{"$f":"Failing_Kids!D305","v":"Yolanda"},{"$f":"IF(ISERROR(SEARCH(\"*English*\",Failing_Kids!F305,1)),\"\",\"X \")","v":""},{"$f":"IF(ISERROR(SEARCH(\"*Geometry*\",Failing_Kids!$F305,1)),IF(ISERROR(SEARCH(\"*Math*\",Failing_Kids!$F305,1)),IF(ISERROR(SEARCH(\"*Calc*\",Failing_Kids!$F305,1)),IF(ISERROR(SEARCH(\"*Algebra*\",Failing_Kids!$F305,1)),\"\",\"X\"),\"X\"),\"X\"),\"X\")","v":"X"},{"$f":"IF(ISERROR(SEARCH(\"*Science*\",Failing_Kids!$F305,1)),IF(ISERROR(SEARCH(\"*Bio*\",Failing_Kids!$F305,1)),IF(ISERROR(SEARCH(\"*Chem*\",Failing_Kids!$F305,1)),IF(ISERROR(SEARCH(\"*Physics*\",Failing_Kids!$F305,1)),\"\",\"X\"),\"X\"),\"X\"),\"X\")","v":""},{"$f":"IF(ISERROR(SEARCH(\"*His*\",Failing_Kids!$F305,1)),IF(ISERROR(SEARCH(\"*GOV*\",Failing_Kids!$F305,1)),IF(ISERROR(SEARCH(\"*Econ*\",Failing_Kids!$F305,1)),IF(ISERROR(SEARCH(\"*Soc*\",Failing_Kids!$F305,1)),\"\",\"X\"),\"X\"),\"X\"),\"X\")","v":""},{"$f":"IF(ISERROR(SEARCH(\"*PE*\",Failing_Kids!$F305,1)),\"\",\"X\")","v":""}]
[{"$f":"Failing_Kids!C306","v":"Morse"},{"$f":"Failing_Kids!D306","v":"Ronald"},{"$f":"IF(ISERROR(SEARCH(\"*English*\",Failing_Kids!F306,1)),\"\",\"X \")","v":""},{"$f":"IF(ISERROR(SEARCH(\"*Geometry*\",Failing_Kids!$F306,1)),IF(ISERROR(SEARCH(\"*Math*\",Failing_Kids!$F306,1)),IF(ISERROR(SEARCH(\"*Calc*\",Failing_Kids!$F306,1)),IF(ISERROR(SEARCH(\"*Algebra*\",Failing_Kids!$F306,1)),\"\",\"X\"),\"X\"),\"X\"),\"X\")","v":"X"},{"$f":"IF(ISERROR(SEARCH(\"*Science*\",Failing_Kids!$F306,1)),IF(ISERROR(SEARCH(\"*Bio*\",Failing_Kids!$F306,1)),IF(ISERROR(SEARCH(\"*Chem*\",Failing_Kids!$F306,1)),IF(ISERROR(SEARCH(\"*Physics*\",Failing_Kids!$F306,1)),\"\",\"X\"),\"X\"),\"X\"),\"X\")","v":""},{"$f":"IF(ISERROR(SEARCH(\"*His*\",Failing_Kids!$F306,1)),IF(ISERROR(SEARCH(\"*GOV*\",Failing_Kids!$F306,1)),IF(ISERROR(SEARCH(\"*Econ*\",Failing_Kids!$F306,1)),IF(ISERROR(SEARCH(\"*Soc*\",Failing_Kids!$F306,1)),\"\",\"X\"),\"X\"),\"X\"),\"X\")","v":""},{"$f":"IF(ISERROR(SEARCH(\"*PE*\",Failing_Kids!$F306,1)),\"\",\"X\")","v":""}]
[{"$f":"Failing_Kids!C307","v":"Moses"},{"$f":"Failing_Kids!D307","v":"Melanie"},{"$f":"IF(ISERROR(SEARCH(\"*English*\",Failing_Kids!F307,1)),\"\",\"X \")","v":""},{"$f":"IF(ISERROR(SEARCH(\"*Geometry*\",Failing_Kids!$F307,1)),IF(ISERROR(SEARCH(\"*Math*\",Failing_Kids!$F307,1)),IF(ISERROR(SEARCH(\"*Calc*\",Failing_Kids!$F307,1)),IF(ISERROR(SEARCH(\"*Algebra*\",Failing_Kids!$F307,1)),\"\",\"X\"),\"X\"),\"X\"),\"X\")","v":""},{"$f":"IF(ISERROR(SEARCH(\"*Science*\",Failing_Kids!$F307,1)),IF(ISERROR(SEARCH(\"*Bio*\",Failing_Kids!$F307,1)),IF(ISERROR(SEARCH(\"*Chem*\",Failing_Kids!$F307,1)),IF(ISERROR(SEARCH(\"*Physics*\",Failing_Kids!$F307,1)),\"\",\"X\"),\"X\"),\"X\"),\"X\")","v":""},{"$f":"IF(ISERROR(SEARCH(\"*His*\",Failing_Kids!$F307,1)),IF(ISERROR(SEARCH(\"*GOV*\",Failing_Kids!$F307,1)),IF(ISERROR(SEARCH(\"*Econ*\",Failing_Kids!$F307,1)),IF(ISERROR(SEARCH(\"*Soc*\",Failing_Kids!$F307,1)),\"\",\"X\"),\"X\"),\"X\"),\"X\")","v":""},{"$f":"IF(ISERROR(SEARCH(\"*PE*\",Failing_Kids!$F307,1)),\"\",\"X\")","v":""}]
[{"$f":"Failing_Kids!C308","v":"Moses"},{"$f":"Failing_Kids!D308","v":"Melanie"},{"$f":"IF(ISERROR(SEARCH(\"*English*\",Failing_Kids!F308,1)),\"\",\"X \")","v":""},{"$f":"IF(ISERROR(SEARCH(\"*Geometry*\",Failing_Kids!$F308,1)),IF(ISERROR(SEARCH(\"*Math*\",Failing_Kids!$F308,1)),IF(ISERROR(SEARCH(\"*Calc*\",Failing_Kids!$F308,1)),IF(ISERROR(SEARCH(\"*Algebra*\",Failing_Kids!$F308,1)),\"\",\"X\"),\"X\"),\"X\"),\"X\")","v":"X"},{"$f":"IF(ISERROR(SEARCH(\"*Science*\",Failing_Kids!$F308,1)),IF(ISERROR(SEARCH(\"*Bio*\",Failing_Kids!$F308,1)),IF(ISERROR(SEARCH(\"*Chem*\",Failing_Kids!$F308,1)),IF(ISERROR(SEARCH(\"*Physics*\",Failing_Kids!$F308,1)),\"\",\"X\"),\"X\"),\"X\"),\"X\")","v":""},{"$f":"IF(ISERROR(SEARCH(\"*His*\",Failing_Kids!$F308,1)),IF(ISERROR(SEARCH(\"*GOV*\",Failing_Kids!$F308,1)),IF(ISERROR(SEARCH(\"*Econ*\",Failing_Kids!$F308,1)),IF(ISERROR(SEARCH(\"*Soc*\",Failing_Kids!$F308,1)),\"\",\"X\"),\"X\"),\"X\"),\"X\")","v":""},{"$f":"IF(ISERROR(SEARCH(\"*PE*\",Failing_Kids!$F308,1)),\"\",\"X\")","v":""}]
[{"$f":"Failing_Kids!C309","v":"Moses"},{"$f":"Failing_Kids!D309","v":"Melanie"},{"$f":"IF(ISERROR(SEARCH(\"*English*\",Failing_Kids!F309,1)),\"\",\"X \")","v":""},{"$f":"IF(ISERROR(SEARCH(\"*Geometry*\",Failing_Kids!$F309,1)),IF(ISERROR(SEARCH(\"*Math*\",Failing_Kids!$F309,1)),IF(ISERROR(SEARCH(\"*Calc*\",Failing_Kids!$F309,1)),IF(ISERROR(SEARCH(\"*Algebra*\",Failing_Kids!$F309,1)),\"\",\"X\"),\"X\"),\"X\"),\"X\")","v":"X"},{"$f":"IF(ISERROR(SEARCH(\"*Science*\",Failing_Kids!$F309,1)),IF(ISERROR(SEARCH(\"*Bio*\",Failing_Kids!$F309,1)),IF(ISERROR(SEARCH(\"*Chem*\",Failing_Kids!$F309,1)),IF(ISERROR(SEARCH(\"*Physics*\",Failing_Kids!$F309,1)),\"\",\"X\"),\"X\"),\"X\"),\"X\")","v":""},{"$f":"IF(ISERROR(SEARCH(\"*His*\",Failing_Kids!$F309,1)),IF(ISERROR(SEARCH(\"*GOV*\",Failing_Kids!$F309,1)),IF(ISERROR(SEARCH(\"*Econ*\",Failing_Kids!$F309,1)),IF(ISERROR(SEARCH(\"*Soc*\",Failing_Kids!$F309,1)),\"\",\"X\"),\"X\"),\"X\"),\"X\")","v":""},{"$f":"IF(ISERROR(SEARCH(\"*PE*\",Failing_Kids!$F309,1)),\"\",\"X\")","v":""}]
[{"$f":"Failing_Kids!C310","v":"Mullins"},{"$f":"Failing_Kids!D310","v":"Juan"},{"$f":"IF(ISERROR(SEARCH(\"*English*\",Failing_Kids!F310,1)),\"\",\"X \")","v":""},{"$f":"IF(ISERROR(SEARCH(\"*Geometry*\",Failing_Kids!$F310,1)),IF(ISERROR(SEARCH(\"*Math*\",Failing_Kids!$F310,1)),IF(ISERROR(SEARCH(\"*Calc*\",Failing_Kids!$F310,1)),IF(ISERROR(SEARCH(\"*Algebra*\",Failing_Kids!$F310,1)),\"\",\"X\"),\"X\"),\"X\"),\"X\")","v":"X"},{"$f":"IF(ISERROR(SEARCH(\"*Science*\",Failing_Kids!$F310,1)),IF(ISERROR(SEARCH(\"*Bio*\",Failing_Kids!$F310,1)),IF(ISERROR(SEARCH(\"*Chem*\",Failing_Kids!$F310,1)),IF(ISERROR(SEARCH(\"*Physics*\",Failing_Kids!$F310,1)),\"\",\"X\"),\"X\"),\"X\"),\"X\")","v":""},{"$f":"IF(ISERROR(SEARCH(\"*His*\",Failing_Kids!$F310,1)),IF(ISERROR(SEARCH(\"*GOV*\",Failing_Kids!$F310,1)),IF(ISERROR(SEARCH(\"*Econ*\",Failing_Kids!$F310,1)),IF(ISERROR(SEARCH(\"*Soc*\",Failing_Kids!$F310,1)),\"\",\"X\"),\"X\"),\"X\"),\"X\")","v":""},{"$f":"IF(ISERROR(SEARCH(\"*PE*\",Failing_Kids!$F310,1)),\"\",\"X\")","v":""}]
[{"$f":"Failing_Kids!C311","v":"Munoz"},{"$f":"Failing_Kids!D311","v":"Yolanda"},{"$f":"IF(ISERROR(SEARCH(\"*English*\",Failing_Kids!F311,1)),\"\",\"X \")","v":"X "},{"$f":"IF(ISERROR(SEARCH(\"*Geometry*\",Failing_Kids!$F311,1)),IF(ISERROR(SEARCH(\"*Math*\",Failing_Kids!$F311,1)),IF(ISERROR(SEARCH(\"*Calc*\",Failing_Kids!$F311,1)),IF(ISERROR(SEARCH(\"*Algebra*\",Failing_Kids!$F311,1)),\"\",\"X\"),\"X\"),\"X\"),\"X\")","v":""},{"$f":"IF(ISERROR(SEARCH(\"*Science*\",Failing_Kids!$F311,1)),IF(ISERROR(SEARCH(\"*Bio*\",Failing_Kids!$F311,1)),IF(ISERROR(SEARCH(\"*Chem*\",Failing_Kids!$F311,1)),IF(ISERROR(SEARCH(\"*Physics*\",Failing_Kids!$F311,1)),\"\",\"X\"),\"X\"),\"X\"),\"X\")","v":""},{"$f":"IF(ISERROR(SEARCH(\"*His*\",Failing_Kids!$F311,1)),IF(ISERROR(SEARCH(\"*GOV*\",Failing_Kids!$F311,1)),IF(ISERROR(SEARCH(\"*Econ*\",Failing_Kids!$F311,1)),IF(ISERROR(SEARCH(\"*Soc*\",Failing_Kids!$F311,1)),\"\",\"X\"),\"X\"),\"X\"),\"X\")","v":""},{"$f":"IF(ISERROR(SEARCH(\"*PE*\",Failing_Kids!$F311,1)),\"\",\"X\")","v":""}]
[{"$f":"Failing_Kids!C312","v":"Munoz"},{"$f":"Failing_Kids!D312","v":"Yolanda"},{"$f":"IF(ISERROR(SEARCH(\"*English*\",Failing_Kids!F312,1)),\"\",\"X \")","v":""},{"$f":"IF(ISERROR(SEARCH(\"*Geometry*\",Failing_Kids!$F312,1)),IF(ISERROR(SEARCH(\"*Math*\",Failing_Kids!$F312,1)),IF(ISERROR(SEARCH(\"*Calc*\",Failing_Kids!$F312,1)),IF(ISERROR(SEARCH(\"*Algebra*\",Failing_Kids!$F312,1)),\"\",\"X\"),\"X\"),\"X\"),\"X\")","v":""},{"$f":"IF(ISERROR(SEARCH(\"*Science*\",Failing_Kids!$F312,1)),IF(ISERROR(SEARCH(\"*Bio*\",Failing_Kids!$F312,1)),IF(ISERROR(SEARCH(\"*Chem*\",Failing_Kids!$F312,1)),IF(ISERROR(SEARCH(\"*Physics*\",Failing_Kids!$F312,1)),\"\",\"X\"),\"X\"),\"X\"),\"X\")","v":""},{"$f":"IF(ISERROR(SEARCH(\"*His*\",Failing_Kids!$F312,1)),IF(ISERROR(SEARCH(\"*GOV*\",Failing_Kids!$F312,1)),IF(ISERROR(SEARCH(\"*Econ*\",Failing_Kids!$F312,1)),IF(ISERROR(SEARCH(\"*Soc*\",Failing_Kids!$F312,1)),\"\",\"X\"),\"X\"),\"X\"),\"X\")","v":"X"},{"$f":"IF(ISERROR(SEARCH(\"*PE*\",Failing_Kids!$F312,1)),\"\",\"X\")","v":""}]
[{"$f":"Failing_Kids!C313","v":"Murphy"},{"$f":"Failing_Kids!D313","v":"Carlos"},{"$f":"IF(ISERROR(SEARCH(\"*English*\",Failing_Kids!F313,1)),\"\",\"X \")","v":""},{"$f":"IF(ISERROR(SEARCH(\"*Geometry*\",Failing_Kids!$F313,1)),IF(ISERROR(SEARCH(\"*Math*\",Failing_Kids!$F313,1)),IF(ISERROR(SEARCH(\"*Calc*\",Failing_Kids!$F313,1)),IF(ISERROR(SEARCH(\"*Algebra*\",Failing_Kids!$F313,1)),\"\",\"X\"),\"X\"),\"X\"),\"X\")","v":""},{"$f":"IF(ISERROR(SEARCH(\"*Science*\",Failing_Kids!$F313,1)),IF(ISERROR(SEARCH(\"*Bio*\",Failing_Kids!$F313,1)),IF(ISERROR(SEARCH(\"*Chem*\",Failing_Kids!$F313,1)),IF(ISERROR(SEARCH(\"*Physics*\",Failing_Kids!$F313,1)),\"\",\"X\"),\"X\"),\"X\"),\"X\")","v":""},{"$f":"IF(ISERROR(SEARCH(\"*His*\",Failing_Kids!$F313,1)),IF(ISERROR(SEARCH(\"*GOV*\",Failing_Kids!$F313,1)),IF(ISERROR(SEARCH(\"*Econ*\",Failing_Kids!$F313,1)),IF(ISERROR(SEARCH(\"*Soc*\",Failing_Kids!$F313,1)),\"\",\"X\"),\"X\"),\"X\"),\"X\")","v":""},{"$f":"IF(ISERROR(SEARCH(\"*PE*\",Failing_Kids!$F313,1)),\"\",\"X\")","v":""}]
[{"$f":"Failing_Kids!C314","v":"Murphy"},{"$f":"Failing_Kids!D314","v":"Carlos"},{"$f":"IF(ISERROR(SEARCH(\"*English*\",Failing_Kids!F314,1)),\"\",\"X \")","v":""},{"$f":"IF(ISERROR(SEARCH(\"*Geometry*\",Failing_Kids!$F314,1)),IF(ISERROR(SEARCH(\"*Math*\",Failing_Kids!$F314,1)),IF(ISERROR(SEARCH(\"*Calc*\",Failing_Kids!$F314,1)),IF(ISERROR(SEARCH(\"*Algebra*\",Failing_Kids!$F314,1)),\"\",\"X\"),\"X\"),\"X\"),\"X\")","v":"X"},{"$f":"IF(ISERROR(SEARCH(\"*Science*\",Failing_Kids!$F314,1)),IF(ISERROR(SEARCH(\"*Bio*\",Failing_Kids!$F314,1)),IF(ISERROR(SEARCH(\"*Chem*\",Failing_Kids!$F314,1)),IF(ISERROR(SEARCH(\"*Physics*\",Failing_Kids!$F314,1)),\"\",\"X\"),\"X\"),\"X\"),\"X\")","v":""},{"$f":"IF(ISERROR(SEARCH(\"*His*\",Failing_Kids!$F314,1)),IF(ISERROR(SEARCH(\"*GOV*\",Failing_Kids!$F314,1)),IF(ISERROR(SEARCH(\"*Econ*\",Failing_Kids!$F314,1)),IF(ISERROR(SEARCH(\"*Soc*\",Failing_Kids!$F314,1)),\"\",\"X\"),\"X\"),\"X\"),\"X\")","v":""},{"$f":"IF(ISERROR(SEARCH(\"*PE*\",Failing_Kids!$F314,1)),\"\",\"X\")","v":""}]
[{"$f":"Failing_Kids!C315","v":"Murphy"},{"$f":"Failing_Kids!D315","v":"Carlos"},{"$f":"IF(ISERROR(SEARCH(\"*English*\",Failing_Kids!F315,1)),\"\",\"X \")","v":"X "},{"$f":"IF(ISERROR(SEARCH(\"*Geometry*\",Failing_Kids!$F315,1)),IF(ISERROR(SEARCH(\"*Math*\",Failing_Kids!$F315,1)),IF(ISERROR(SEARCH(\"*Calc*\",Failing_Kids!$F315,1)),IF(ISERROR(SEARCH(\"*Algebra*\",Failing_Kids!$F315,1)),\"\",\"X\"),\"X\"),\"X\"),\"X\")","v":""},{"$f":"IF(ISERROR(SEARCH(\"*Science*\",Failing_Kids!$F315,1)),IF(ISERROR(SEARCH(\"*Bio*\",Failing_Kids!$F315,1)),IF(ISERROR(SEARCH(\"*Chem*\",Failing_Kids!$F315,1)),IF(ISERROR(SEARCH(\"*Physics*\",Failing_Kids!$F315,1)),\"\",\"X\"),\"X\"),\"X\"),\"X\")","v":""},{"$f":"IF(ISERROR(SEARCH(\"*His*\",Failing_Kids!$F315,1)),IF(ISERROR(SEARCH(\"*GOV*\",Failing_Kids!$F315,1)),IF(ISERROR(SEARCH(\"*Econ*\",Failing_Kids!$F315,1)),IF(ISERROR(SEARCH(\"*Soc*\",Failing_Kids!$F315,1)),\"\",\"X\"),\"X\"),\"X\"),\"X\")","v":""},{"$f":"IF(ISERROR(SEARCH(\"*PE*\",Failing_Kids!$F315,1)),\"\",\"X\")","v":""}]
[{"$f":"Failing_Kids!C316","v":"Murphy"},{"$f":"Failing_Kids!D316","v":"Douglas"},{"$f":"IF(ISERROR(SEARCH(\"*English*\",Failing_Kids!F316,1)),\"\",\"X \")","v":""},{"$f":"IF(ISERROR(SEARCH(\"*Geometry*\",Failing_Kids!$F316,1)),IF(ISERROR(SEARCH(\"*Math*\",Failing_Kids!$F316,1)),IF(ISERROR(SEARCH(\"*Calc*\",Failing_Kids!$F316,1)),IF(ISERROR(SEARCH(\"*Algebra*\",Failing_Kids!$F316,1)),\"\",\"X\"),\"X\"),\"X\"),\"X\")","v":""},{"$f":"IF(ISERROR(SEARCH(\"*Science*\",Failing_Kids!$F316,1)),IF(ISERROR(SEARCH(\"*Bio*\",Failing_Kids!$F316,1)),IF(ISERROR(SEARCH(\"*Chem*\",Failing_Kids!$F316,1)),IF(ISERROR(SEARCH(\"*Physics*\",Failing_Kids!$F316,1)),\"\",\"X\"),\"X\"),\"X\"),\"X\")","v":"X"},{"$f":"IF(ISERROR(SEARCH(\"*His*\",Failing_Kids!$F316,1)),IF(ISERROR(SEARCH(\"*GOV*\",Failing_Kids!$F316,1)),IF(ISERROR(SEARCH(\"*Econ*\",Failing_Kids!$F316,1)),IF(ISERROR(SEARCH(\"*Soc*\",Failing_Kids!$F316,1)),\"\",\"X\"),\"X\"),\"X\"),\"X\")","v":""},{"$f":"IF(ISERROR(SEARCH(\"*PE*\",Failing_Kids!$F316,1)),\"\",\"X\")","v":""}]
[{"$f":"Failing_Kids!C317","v":"Navarro"},{"$f":"Failing_Kids!D317","v":"Adam"},{"$f":"IF(ISERROR(SEARCH(\"*English*\",Failing_Kids!F317,1)),\"\",\"X \")","v":""},{"$f":"IF(ISERROR(SEARCH(\"*Geometry*\",Failing_Kids!$F317,1)),IF(ISERROR(SEARCH(\"*Math*\",Failing_Kids!$F317,1)),IF(ISERROR(SEARCH(\"*Calc*\",Failing_Kids!$F317,1)),IF(ISERROR(SEARCH(\"*Algebra*\",Failing_Kids!$F317,1)),\"\",\"X\"),\"X\"),\"X\"),\"X\")","v":""},{"$f":"IF(ISERROR(SEARCH(\"*Science*\",Failing_Kids!$F317,1)),IF(ISERROR(SEARCH(\"*Bio*\",Failing_Kids!$F317,1)),IF(ISERROR(SEARCH(\"*Chem*\",Failing_Kids!$F317,1)),IF(ISERROR(SEARCH(\"*Physics*\",Failing_Kids!$F317,1)),\"\",\"X\"),\"X\"),\"X\"),\"X\")","v":""},{"$f":"IF(ISERROR(SEARCH(\"*His*\",Failing_Kids!$F317,1)),IF(ISERROR(SEARCH(\"*GOV*\",Failing_Kids!$F317,1)),IF(ISERROR(SEARCH(\"*Econ*\",Failing_Kids!$F317,1)),IF(ISERROR(SEARCH(\"*Soc*\",Failing_Kids!$F317,1)),\"\",\"X\"),\"X\"),\"X\"),\"X\")","v":"X"},{"$f":"IF(ISERROR(SEARCH(\"*PE*\",Failing_Kids!$F317,1)),\"\",\"X\")","v":""}]
[{"$f":"Failing_Kids!C318","v":"Nichols"},{"$f":"Failing_Kids!D318","v":"Gwendolyn"},{"$f":"IF(ISERROR(SEARCH(\"*English*\",Failing_Kids!F318,1)),\"\",\"X \")","v":""},{"$f":"IF(ISERROR(SEARCH(\"*Geometry*\",Failing_Kids!$F318,1)),IF(ISERROR(SEARCH(\"*Math*\",Failing_Kids!$F318,1)),IF(ISERROR(SEARCH(\"*Calc*\",Failing_Kids!$F318,1)),IF(ISERROR(SEARCH(\"*Algebra*\",Failing_Kids!$F318,1)),\"\",\"X\"),\"X\"),\"X\"),\"X\")","v":""},{"$f":"IF(ISERROR(SEARCH(\"*Science*\",Failing_Kids!$F318,1)),IF(ISERROR(SEARCH(\"*Bio*\",Failing_Kids!$F318,1)),IF(ISERROR(SEARCH(\"*Chem*\",Failing_Kids!$F318,1)),IF(ISERROR(SEARCH(\"*Physics*\",Failing_Kids!$F318,1)),\"\",\"X\"),\"X\"),\"X\"),\"X\")","v":"X"},{"$f":"IF(ISERROR(SEARCH(\"*His*\",Failing_Kids!$F318,1)),IF(ISERROR(SEARCH(\"*GOV*\",Failing_Kids!$F318,1)),IF(ISERROR(SEARCH(\"*Econ*\",Failing_Kids!$F318,1)),IF(ISERROR(SEARCH(\"*Soc*\",Failing_Kids!$F318,1)),\"\",\"X\"),\"X\"),\"X\"),\"X\")","v":""},{"$f":"IF(ISERROR(SEARCH(\"*PE*\",Failing_Kids!$F318,1)),\"\",\"X\")","v":""}]
[{"$f":"Failing_Kids!C319","v":"Nichols"},{"$f":"Failing_Kids!D319","v":"Ryan"},{"$f":"IF(ISERROR(SEARCH(\"*English*\",Failing_Kids!F319,1)),\"\",\"X \")","v":""},{"$f":"IF(ISERROR(SEARCH(\"*Geometry*\",Failing_Kids!$F319,1)),IF(ISERROR(SEARCH(\"*Math*\",Failing_Kids!$F319,1)),IF(ISERROR(SEARCH(\"*Calc*\",Failing_Kids!$F319,1)),IF(ISERROR(SEARCH(\"*Algebra*\",Failing_Kids!$F319,1)),\"\",\"X\"),\"X\"),\"X\"),\"X\")","v":""},{"$f":"IF(ISERROR(SEARCH(\"*Science*\",Failing_Kids!$F319,1)),IF(ISERROR(SEARCH(\"*Bio*\",Failing_Kids!$F319,1)),IF(ISERROR(SEARCH(\"*Chem*\",Failing_Kids!$F319,1)),IF(ISERROR(SEARCH(\"*Physics*\",Failing_Kids!$F319,1)),\"\",\"X\"),\"X\"),\"X\"),\"X\")","v":""},{"$f":"IF(ISERROR(SEARCH(\"*His*\",Failing_Kids!$F319,1)),IF(ISERROR(SEARCH(\"*GOV*\",Failing_Kids!$F319,1)),IF(ISERROR(SEARCH(\"*Econ*\",Failing_Kids!$F319,1)),IF(ISERROR(SEARCH(\"*Soc*\",Failing_Kids!$F319,1)),\"\",\"X\"),\"X\"),\"X\"),\"X\")","v":"X"},{"$f":"IF(ISERROR(SEARCH(\"*PE*\",Failing_Kids!$F319,1)),\"\",\"X\")","v":""}]
[{"$f":"Failing_Kids!C320","v":"Nichols"},{"$f":"Failing_Kids!D320","v":"Ryan"},{"$f":"IF(ISERROR(SEARCH(\"*English*\",Failing_Kids!F320,1)),\"\",\"X \")","v":""},{"$f":"IF(ISERROR(SEARCH(\"*Geometry*\",Failing_Kids!$F320,1)),IF(ISERROR(SEARCH(\"*Math*\",Failing_Kids!$F320,1)),IF(ISERROR(SEARCH(\"*Calc*\",Failing_Kids!$F320,1)),IF(ISERROR(SEARCH(\"*Algebra*\",Failing_Kids!$F320,1)),\"\",\"X\"),\"X\"),\"X\"),\"X\")","v":"X"},{"$f":"IF(ISERROR(SEARCH(\"*Science*\",Failing_Kids!$F320,1)),IF(ISERROR(SEARCH(\"*Bio*\",Failing_Kids!$F320,1)),IF(ISERROR(SEARCH(\"*Chem*\",Failing_Kids!$F320,1)),IF(ISERROR(SEARCH(\"*Physics*\",Failing_Kids!$F320,1)),\"\",\"X\"),\"X\"),\"X\"),\"X\")","v":""},{"$f":"IF(ISERROR(SEARCH(\"*His*\",Failing_Kids!$F320,1)),IF(ISERROR(SEARCH(\"*GOV*\",Failing_Kids!$F320,1)),IF(ISERROR(SEARCH(\"*Econ*\",Failing_Kids!$F320,1)),IF(ISERROR(SEARCH(\"*Soc*\",Failing_Kids!$F320,1)),\"\",\"X\"),\"X\"),\"X\"),\"X\")","v":""},{"$f":"IF(ISERROR(SEARCH(\"*PE*\",Failing_Kids!$F320,1)),\"\",\"X\")","v":""}]
[{"$f":"Failing_Kids!C321","v":"Nixon"},{"$f":"Failing_Kids!D321","v":"Claire"},{"$f":"IF(ISERROR(SEARCH(\"*English*\",Failing_Kids!F321,1)),\"\",\"X \")","v":"X "},{"$f":"IF(ISERROR(SEARCH(\"*Geometry*\",Failing_Kids!$F321,1)),IF(ISERROR(SEARCH(\"*Math*\",Failing_Kids!$F321,1)),IF(ISERROR(SEARCH(\"*Calc*\",Failing_Kids!$F321,1)),IF(ISERROR(SEARCH(\"*Algebra*\",Failing_Kids!$F321,1)),\"\",\"X\"),\"X\"),\"X\"),\"X\")","v":""},{"$f":"IF(ISERROR(SEARCH(\"*Science*\",Failing_Kids!$F321,1)),IF(ISERROR(SEARCH(\"*Bio*\",Failing_Kids!$F321,1)),IF(ISERROR(SEARCH(\"*Chem*\",Failing_Kids!$F321,1)),IF(ISERROR(SEARCH(\"*Physics*\",Failing_Kids!$F321,1)),\"\",\"X\"),\"X\"),\"X\"),\"X\")","v":""},{"$f":"IF(ISERROR(SEARCH(\"*His*\",Failing_Kids!$F321,1)),IF(ISERROR(SEARCH(\"*GOV*\",Failing_Kids!$F321,1)),IF(ISERROR(SEARCH(\"*Econ*\",Failing_Kids!$F321,1)),IF(ISERROR(SEARCH(\"*Soc*\",Failing_Kids!$F321,1)),\"\",\"X\"),\"X\"),\"X\"),\"X\")","v":""},{"$f":"IF(ISERROR(SEARCH(\"*PE*\",Failing_Kids!$F321,1)),\"\",\"X\")","v":""}]
[{"$f":"Failing_Kids!C322","v":"Noble"},{"$f":"Failing_Kids!D322","v":"Candice"},{"$f":"IF(ISERROR(SEARCH(\"*English*\",Failing_Kids!F322,1)),\"\",\"X \")","v":""},{"$f":"IF(ISERROR(SEARCH(\"*Geometry*\",Failing_Kids!$F322,1)),IF(ISERROR(SEARCH(\"*Math*\",Failing_Kids!$F322,1)),IF(ISERROR(SEARCH(\"*Calc*\",Failing_Kids!$F322,1)),IF(ISERROR(SEARCH(\"*Algebra*\",Failing_Kids!$F322,1)),\"\",\"X\"),\"X\"),\"X\"),\"X\")","v":""},{"$f":"IF(ISERROR(SEARCH(\"*Science*\",Failing_Kids!$F322,1)),IF(ISERROR(SEARCH(\"*Bio*\",Failing_Kids!$F322,1)),IF(ISERROR(SEARCH(\"*Chem*\",Failing_Kids!$F322,1)),IF(ISERROR(SEARCH(\"*Physics*\",Failing_Kids!$F322,1)),\"\",\"X\"),\"X\"),\"X\"),\"X\")","v":""},{"$f":"IF(ISERROR(SEARCH(\"*His*\",Failing_Kids!$F322,1)),IF(ISERROR(SEARCH(\"*GOV*\",Failing_Kids!$F322,1)),IF(ISERROR(SEARCH(\"*Econ*\",Failing_Kids!$F322,1)),IF(ISERROR(SEARCH(\"*Soc*\",Failing_Kids!$F322,1)),\"\",\"X\"),\"X\"),\"X\"),\"X\")","v":"X"},{"$f":"IF(ISERROR(SEARCH(\"*PE*\",Failing_Kids!$F322,1)),\"\",\"X\")","v":""}]
[{"$f":"Failing_Kids!C323","v":"Nolan"},{"$f":"Failing_Kids!D323","v":"Allen"},{"$f":"IF(ISERROR(SEARCH(\"*English*\",Failing_Kids!F323,1)),\"\",\"X \")","v":""},{"$f":"IF(ISERROR(SEARCH(\"*Geometry*\",Failing_Kids!$F323,1)),IF(ISERROR(SEARCH(\"*Math*\",Failing_Kids!$F323,1)),IF(ISERROR(SEARCH(\"*Calc*\",Failing_Kids!$F323,1)),IF(ISERROR(SEARCH(\"*Algebra*\",Failing_Kids!$F323,1)),\"\",\"X\"),\"X\"),\"X\"),\"X\")","v":"X"},{"$f":"IF(ISERROR(SEARCH(\"*Science*\",Failing_Kids!$F323,1)),IF(ISERROR(SEARCH(\"*Bio*\",Failing_Kids!$F323,1)),IF(ISERROR(SEARCH(\"*Chem*\",Failing_Kids!$F323,1)),IF(ISERROR(SEARCH(\"*Physics*\",Failing_Kids!$F323,1)),\"\",\"X\"),\"X\"),\"X\"),\"X\")","v":""},{"$f":"IF(ISERROR(SEARCH(\"*His*\",Failing_Kids!$F323,1)),IF(ISERROR(SEARCH(\"*GOV*\",Failing_Kids!$F323,1)),IF(ISERROR(SEARCH(\"*Econ*\",Failing_Kids!$F323,1)),IF(ISERROR(SEARCH(\"*Soc*\",Failing_Kids!$F323,1)),\"\",\"X\"),\"X\"),\"X\"),\"X\")","v":""},{"$f":"IF(ISERROR(SEARCH(\"*PE*\",Failing_Kids!$F323,1)),\"\",\"X\")","v":""}]
[{"$f":"Failing_Kids!C324","v":"Nolan"},{"$f":"Failing_Kids!D324","v":"Allen"},{"$f":"IF(ISERROR(SEARCH(\"*English*\",Failing_Kids!F324,1)),\"\",\"X \")","v":""},{"$f":"IF(ISERROR(SEARCH(\"*Geometry*\",Failing_Kids!$F324,1)),IF(ISERROR(SEARCH(\"*Math*\",Failing_Kids!$F324,1)),IF(ISERROR(SEARCH(\"*Calc*\",Failing_Kids!$F324,1)),IF(ISERROR(SEARCH(\"*Algebra*\",Failing_Kids!$F324,1)),\"\",\"X\"),\"X\"),\"X\"),\"X\")","v":""},{"$f":"IF(ISERROR(SEARCH(\"*Science*\",Failing_Kids!$F324,1)),IF(ISERROR(SEARCH(\"*Bio*\",Failing_Kids!$F324,1)),IF(ISERROR(SEARCH(\"*Chem*\",Failing_Kids!$F324,1)),IF(ISERROR(SEARCH(\"*Physics*\",Failing_Kids!$F324,1)),\"\",\"X\"),\"X\"),\"X\"),\"X\")","v":"X"},{"$f":"IF(ISERROR(SEARCH(\"*His*\",Failing_Kids!$F324,1)),IF(ISERROR(SEARCH(\"*GOV*\",Failing_Kids!$F324,1)),IF(ISERROR(SEARCH(\"*Econ*\",Failing_Kids!$F324,1)),IF(ISERROR(SEARCH(\"*Soc*\",Failing_Kids!$F324,1)),\"\",\"X\"),\"X\"),\"X\"),\"X\")","v":""},{"$f":"IF(ISERROR(SEARCH(\"*PE*\",Failing_Kids!$F324,1)),\"\",\"X\")","v":""}]
[{"$f":"Failing_Kids!C325","v":"Obrien"},{"$f":"Failing_Kids!D325","v":"Melanie"},{"$f":"IF(ISERROR(SEARCH(\"*English*\",Failing_Kids!F325,1)),\"\",\"X \")","v":"X "},{"$f":"IF(ISERROR(SEARCH(\"*Geometry*\",Failing_Kids!$F325,1)),IF(ISERROR(SEARCH(\"*Math*\",Failing_Kids!$F325,1)),IF(ISERROR(SEARCH(\"*Calc*\",Failing_Kids!$F325,1)),IF(ISERROR(SEARCH(\"*Algebra*\",Failing_Kids!$F325,1)),\"\",\"X\"),\"X\"),\"X\"),\"X\")","v":""},{"$f":"IF(ISERROR(SEARCH(\"*Science*\",Failing_Kids!$F325,1)),IF(ISERROR(SEARCH(\"*Bio*\",Failing_Kids!$F325,1)),IF(ISERROR(SEARCH(\"*Chem*\",Failing_Kids!$F325,1)),IF(ISERROR(SEARCH(\"*Physics*\",Failing_Kids!$F325,1)),\"\",\"X\"),\"X\"),\"X\"),\"X\")","v":""},{"$f":"IF(ISERROR(SEARCH(\"*His*\",Failing_Kids!$F325,1)),IF(ISERROR(SEARCH(\"*GOV*\",Failing_Kids!$F325,1)),IF(ISERROR(SEARCH(\"*Econ*\",Failing_Kids!$F325,1)),IF(ISERROR(SEARCH(\"*Soc*\",Failing_Kids!$F325,1)),\"\",\"X\"),\"X\"),\"X\"),\"X\")","v":""},{"$f":"IF(ISERROR(SEARCH(\"*PE*\",Failing_Kids!$F325,1)),\"\",\"X\")","v":""}]
[{"$f":"Failing_Kids!C326","v":"Ochoa"},{"$f":"Failing_Kids!D326","v":"Daniel"},{"$f":"IF(ISERROR(SEARCH(\"*English*\",Failing_Kids!F326,1)),\"\",\"X \")","v":""},{"$f":"IF(ISERROR(SEARCH(\"*Geometry*\",Failing_Kids!$F326,1)),IF(ISERROR(SEARCH(\"*Math*\",Failing_Kids!$F326,1)),IF(ISERROR(SEARCH(\"*Calc*\",Failing_Kids!$F326,1)),IF(ISERROR(SEARCH(\"*Algebra*\",Failing_Kids!$F326,1)),\"\",\"X\"),\"X\"),\"X\"),\"X\")","v":"X"},{"$f":"IF(ISERROR(SEARCH(\"*Science*\",Failing_Kids!$F326,1)),IF(ISERROR(SEARCH(\"*Bio*\",Failing_Kids!$F326,1)),IF(ISERROR(SEARCH(\"*Chem*\",Failing_Kids!$F326,1)),IF(ISERROR(SEARCH(\"*Physics*\",Failing_Kids!$F326,1)),\"\",\"X\"),\"X\"),\"X\"),\"X\")","v":""},{"$f":"IF(ISERROR(SEARCH(\"*His*\",Failing_Kids!$F326,1)),IF(ISERROR(SEARCH(\"*GOV*\",Failing_Kids!$F326,1)),IF(ISERROR(SEARCH(\"*Econ*\",Failing_Kids!$F326,1)),IF(ISERROR(SEARCH(\"*Soc*\",Failing_Kids!$F326,1)),\"\",\"X\"),\"X\"),\"X\"),\"X\")","v":""},{"$f":"IF(ISERROR(SEARCH(\"*PE*\",Failing_Kids!$F326,1)),\"\",\"X\")","v":""}]
[{"$f":"Failing_Kids!C327","v":"Oliver"},{"$f":"Failing_Kids!D327","v":"Joshua"},{"$f":"IF(ISERROR(SEARCH(\"*English*\",Failing_Kids!F327,1)),\"\",\"X \")","v":"X "},{"$f":"IF(ISERROR(SEARCH(\"*Geometry*\",Failing_Kids!$F327,1)),IF(ISERROR(SEARCH(\"*Math*\",Failing_Kids!$F327,1)),IF(ISERROR(SEARCH(\"*Calc*\",Failing_Kids!$F327,1)),IF(ISERROR(SEARCH(\"*Algebra*\",Failing_Kids!$F327,1)),\"\",\"X\"),\"X\"),\"X\"),\"X\")","v":""},{"$f":"IF(ISERROR(SEARCH(\"*Science*\",Failing_Kids!$F327,1)),IF(ISERROR(SEARCH(\"*Bio*\",Failing_Kids!$F327,1)),IF(ISERROR(SEARCH(\"*Chem*\",Failing_Kids!$F327,1)),IF(ISERROR(SEARCH(\"*Physics*\",Failing_Kids!$F327,1)),\"\",\"X\"),\"X\"),\"X\"),\"X\")","v":""},{"$f":"IF(ISERROR(SEARCH(\"*His*\",Failing_Kids!$F327,1)),IF(ISERROR(SEARCH(\"*GOV*\",Failing_Kids!$F327,1)),IF(ISERROR(SEARCH(\"*Econ*\",Failing_Kids!$F327,1)),IF(ISERROR(SEARCH(\"*Soc*\",Failing_Kids!$F327,1)),\"\",\"X\"),\"X\"),\"X\"),\"X\")","v":""},{"$f":"IF(ISERROR(SEARCH(\"*PE*\",Failing_Kids!$F327,1)),\"\",\"X\")","v":""}]
[{"$f":"Failing_Kids!C328","v":"Oliver"},{"$f":"Failing_Kids!D328","v":"Lauren"},{"$f":"IF(ISERROR(SEARCH(\"*English*\",Failing_Kids!F328,1)),\"\",\"X \")","v":""},{"$f":"IF(ISERROR(SEARCH(\"*Geometry*\",Failing_Kids!$F328,1)),IF(ISERROR(SEARCH(\"*Math*\",Failing_Kids!$F328,1)),IF(ISERROR(SEARCH(\"*Calc*\",Failing_Kids!$F328,1)),IF(ISERROR(SEARCH(\"*Algebra*\",Failing_Kids!$F328,1)),\"\",\"X\"),\"X\"),\"X\"),\"X\")","v":""},{"$f":"IF(ISERROR(SEARCH(\"*Science*\",Failing_Kids!$F328,1)),IF(ISERROR(SEARCH(\"*Bio*\",Failing_Kids!$F328,1)),IF(ISERROR(SEARCH(\"*Chem*\",Failing_Kids!$F328,1)),IF(ISERROR(SEARCH(\"*Physics*\",Failing_Kids!$F328,1)),\"\",\"X\"),\"X\"),\"X\"),\"X\")","v":"X"},{"$f":"IF(ISERROR(SEARCH(\"*His*\",Failing_Kids!$F328,1)),IF(ISERROR(SEARCH(\"*GOV*\",Failing_Kids!$F328,1)),IF(ISERROR(SEARCH(\"*Econ*\",Failing_Kids!$F328,1)),IF(ISERROR(SEARCH(\"*Soc*\",Failing_Kids!$F328,1)),\"\",\"X\"),\"X\"),\"X\"),\"X\")","v":""},{"$f":"IF(ISERROR(SEARCH(\"*PE*\",Failing_Kids!$F328,1)),\"\",\"X\")","v":""}]
[{"$f":"Failing_Kids!C329","v":"Ortega"},{"$f":"Failing_Kids!D329","v":"Walter"},{"$f":"IF(ISERROR(SEARCH(\"*English*\",Failing_Kids!F329,1)),\"\",\"X \")","v":""},{"$f":"IF(ISERROR(SEARCH(\"*Geometry*\",Failing_Kids!$F329,1)),IF(ISERROR(SEARCH(\"*Math*\",Failing_Kids!$F329,1)),IF(ISERROR(SEARCH(\"*Calc*\",Failing_Kids!$F329,1)),IF(ISERROR(SEARCH(\"*Algebra*\",Failing_Kids!$F329,1)),\"\",\"X\"),\"X\"),\"X\"),\"X\")","v":""},{"$f":"IF(ISERROR(SEARCH(\"*Science*\",Failing_Kids!$F329,1)),IF(ISERROR(SEARCH(\"*Bio*\",Failing_Kids!$F329,1)),IF(ISERROR(SEARCH(\"*Chem*\",Failing_Kids!$F329,1)),IF(ISERROR(SEARCH(\"*Physics*\",Failing_Kids!$F329,1)),\"\",\"X\"),\"X\"),\"X\"),\"X\")","v":"X"},{"$f":"IF(ISERROR(SEARCH(\"*His*\",Failing_Kids!$F329,1)),IF(ISERROR(SEARCH(\"*GOV*\",Failing_Kids!$F329,1)),IF(ISERROR(SEARCH(\"*Econ*\",Failing_Kids!$F329,1)),IF(ISERROR(SEARCH(\"*Soc*\",Failing_Kids!$F329,1)),\"\",\"X\"),\"X\"),\"X\"),\"X\")","v":""},{"$f":"IF(ISERROR(SEARCH(\"*PE*\",Failing_Kids!$F329,1)),\"\",\"X\")","v":""}]
[{"$f":"Failing_Kids!C330","v":"Ortega"},{"$f":"Failing_Kids!D330","v":"Walter"},{"$f":"IF(ISERROR(SEARCH(\"*English*\",Failing_Kids!F330,1)),\"\",\"X \")","v":"X "},{"$f":"IF(ISERROR(SEARCH(\"*Geometry*\",Failing_Kids!$F330,1)),IF(ISERROR(SEARCH(\"*Math*\",Failing_Kids!$F330,1)),IF(ISERROR(SEARCH(\"*Calc*\",Failing_Kids!$F330,1)),IF(ISERROR(SEARCH(\"*Algebra*\",Failing_Kids!$F330,1)),\"\",\"X\"),\"X\"),\"X\"),\"X\")","v":""},{"$f":"IF(ISERROR(SEARCH(\"*Science*\",Failing_Kids!$F330,1)),IF(ISERROR(SEARCH(\"*Bio*\",Failing_Kids!$F330,1)),IF(ISERROR(SEARCH(\"*Chem*\",Failing_Kids!$F330,1)),IF(ISERROR(SEARCH(\"*Physics*\",Failing_Kids!$F330,1)),\"\",\"X\"),\"X\"),\"X\"),\"X\")","v":""},{"$f":"IF(ISERROR(SEARCH(\"*His*\",Failing_Kids!$F330,1)),IF(ISERROR(SEARCH(\"*GOV*\",Failing_Kids!$F330,1)),IF(ISERROR(SEARCH(\"*Econ*\",Failing_Kids!$F330,1)),IF(ISERROR(SEARCH(\"*Soc*\",Failing_Kids!$F330,1)),\"\",\"X\"),\"X\"),\"X\"),\"X\")","v":""},{"$f":"IF(ISERROR(SEARCH(\"*PE*\",Failing_Kids!$F330,1)),\"\",\"X\")","v":""}]
[{"$f":"Failing_Kids!C331","v":"Palmer"},{"$f":"Failing_Kids!D331","v":"Cecilia"},{"$f":"IF(ISERROR(SEARCH(\"*English*\",Failing_Kids!F331,1)),\"\",\"X \")","v":""},{"$f":"IF(ISERROR(SEARCH(\"*Geometry*\",Failing_Kids!$F331,1)),IF(ISERROR(SEARCH(\"*Math*\",Failing_Kids!$F331,1)),IF(ISERROR(SEARCH(\"*Calc*\",Failing_Kids!$F331,1)),IF(ISERROR(SEARCH(\"*Algebra*\",Failing_Kids!$F331,1)),\"\",\"X\"),\"X\"),\"X\"),\"X\")","v":""},{"$f":"IF(ISERROR(SEARCH(\"*Science*\",Failing_Kids!$F331,1)),IF(ISERROR(SEARCH(\"*Bio*\",Failing_Kids!$F331,1)),IF(ISERROR(SEARCH(\"*Chem*\",Failing_Kids!$F331,1)),IF(ISERROR(SEARCH(\"*Physics*\",Failing_Kids!$F331,1)),\"\",\"X\"),\"X\"),\"X\"),\"X\")","v":""},{"$f":"IF(ISERROR(SEARCH(\"*His*\",Failing_Kids!$F331,1)),IF(ISERROR(SEARCH(\"*GOV*\",Failing_Kids!$F331,1)),IF(ISERROR(SEARCH(\"*Econ*\",Failing_Kids!$F331,1)),IF(ISERROR(SEARCH(\"*Soc*\",Failing_Kids!$F331,1)),\"\",\"X\"),\"X\"),\"X\"),\"X\")","v":"X"},{"$f":"IF(ISERROR(SEARCH(\"*PE*\",Failing_Kids!$F331,1)),\"\",\"X\")","v":""}]
[{"$f":"Failing_Kids!C332","v":"Park"},{"$f":"Failing_Kids!D332","v":"Andrew"},{"$f":"IF(ISERROR(SEARCH(\"*English*\",Failing_Kids!F332,1)),\"\",\"X \")","v":""},{"$f":"IF(ISERROR(SEARCH(\"*Geometry*\",Failing_Kids!$F332,1)),IF(ISERROR(SEARCH(\"*Math*\",Failing_Kids!$F332,1)),IF(ISERROR(SEARCH(\"*Calc*\",Failing_Kids!$F332,1)),IF(ISERROR(SEARCH(\"*Algebra*\",Failing_Kids!$F332,1)),\"\",\"X\"),\"X\"),\"X\"),\"X\")","v":"X"},{"$f":"IF(ISERROR(SEARCH(\"*Science*\",Failing_Kids!$F332,1)),IF(ISERROR(SEARCH(\"*Bio*\",Failing_Kids!$F332,1)),IF(ISERROR(SEARCH(\"*Chem*\",Failing_Kids!$F332,1)),IF(ISERROR(SEARCH(\"*Physics*\",Failing_Kids!$F332,1)),\"\",\"X\"),\"X\"),\"X\"),\"X\")","v":""},{"$f":"IF(ISERROR(SEARCH(\"*His*\",Failing_Kids!$F332,1)),IF(ISERROR(SEARCH(\"*GOV*\",Failing_Kids!$F332,1)),IF(ISERROR(SEARCH(\"*Econ*\",Failing_Kids!$F332,1)),IF(ISERROR(SEARCH(\"*Soc*\",Failing_Kids!$F332,1)),\"\",\"X\"),\"X\"),\"X\"),\"X\")","v":""},{"$f":"IF(ISERROR(SEARCH(\"*PE*\",Failing_Kids!$F332,1)),\"\",\"X\")","v":""}]
[{"$f":"Failing_Kids!C333","v":"Park"},{"$f":"Failing_Kids!D333","v":"Andrew"},{"$f":"IF(ISERROR(SEARCH(\"*English*\",Failing_Kids!F333,1)),\"\",\"X \")","v":""},{"$f":"IF(ISERROR(SEARCH(\"*Geometry*\",Failing_Kids!$F333,1)),IF(ISERROR(SEARCH(\"*Math*\",Failing_Kids!$F333,1)),IF(ISERROR(SEARCH(\"*Calc*\",Failing_Kids!$F333,1)),IF(ISERROR(SEARCH(\"*Algebra*\",Failing_Kids!$F333,1)),\"\",\"X\"),\"X\"),\"X\"),\"X\")","v":""},{"$f":"IF(ISERROR(SEARCH(\"*Science*\",Failing_Kids!$F333,1)),IF(ISERROR(SEARCH(\"*Bio*\",Failing_Kids!$F333,1)),IF(ISERROR(SEARCH(\"*Chem*\",Failing_Kids!$F333,1)),IF(ISERROR(SEARCH(\"*Physics*\",Failing_Kids!$F333,1)),\"\",\"X\"),\"X\"),\"X\"),\"X\")","v":"X"},{"$f":"IF(ISERROR(SEARCH(\"*His*\",Failing_Kids!$F333,1)),IF(ISERROR(SEARCH(\"*GOV*\",Failing_Kids!$F333,1)),IF(ISERROR(SEARCH(\"*Econ*\",Failing_Kids!$F333,1)),IF(ISERROR(SEARCH(\"*Soc*\",Failing_Kids!$F333,1)),\"\",\"X\"),\"X\"),\"X\"),\"X\")","v":""},{"$f":"IF(ISERROR(SEARCH(\"*PE*\",Failing_Kids!$F333,1)),\"\",\"X\")","v":""}]
[{"$f":"Failing_Kids!C334","v":"Park"},{"$f":"Failing_Kids!D334","v":"Rita"},{"$f":"IF(ISERROR(SEARCH(\"*English*\",Failing_Kids!F334,1)),\"\",\"X \")","v":""},{"$f":"IF(ISERROR(SEARCH(\"*Geometry*\",Failing_Kids!$F334,1)),IF(ISERROR(SEARCH(\"*Math*\",Failing_Kids!$F334,1)),IF(ISERROR(SEARCH(\"*Calc*\",Failing_Kids!$F334,1)),IF(ISERROR(SEARCH(\"*Algebra*\",Failing_Kids!$F334,1)),\"\",\"X\"),\"X\"),\"X\"),\"X\")","v":"X"},{"$f":"IF(ISERROR(SEARCH(\"*Science*\",Failing_Kids!$F334,1)),IF(ISERROR(SEARCH(\"*Bio*\",Failing_Kids!$F334,1)),IF(ISERROR(SEARCH(\"*Chem*\",Failing_Kids!$F334,1)),IF(ISERROR(SEARCH(\"*Physics*\",Failing_Kids!$F334,1)),\"\",\"X\"),\"X\"),\"X\"),\"X\")","v":""},{"$f":"IF(ISERROR(SEARCH(\"*His*\",Failing_Kids!$F334,1)),IF(ISERROR(SEARCH(\"*GOV*\",Failing_Kids!$F334,1)),IF(ISERROR(SEARCH(\"*Econ*\",Failing_Kids!$F334,1)),IF(ISERROR(SEARCH(\"*Soc*\",Failing_Kids!$F334,1)),\"\",\"X\"),\"X\"),\"X\"),\"X\")","v":""},{"$f":"IF(ISERROR(SEARCH(\"*PE*\",Failing_Kids!$F334,1)),\"\",\"X\")","v":""}]
[{"$f":"Failing_Kids!C335","v":"Patel"},{"$f":"Failing_Kids!D335","v":"Glenda"},{"$f":"IF(ISERROR(SEARCH(\"*English*\",Failing_Kids!F335,1)),\"\",\"X \")","v":""},{"$f":"IF(ISERROR(SEARCH(\"*Geometry*\",Failing_Kids!$F335,1)),IF(ISERROR(SEARCH(\"*Math*\",Failing_Kids!$F335,1)),IF(ISERROR(SEARCH(\"*Calc*\",Failing_Kids!$F335,1)),IF(ISERROR(SEARCH(\"*Algebra*\",Failing_Kids!$F335,1)),\"\",\"X\"),\"X\"),\"X\"),\"X\")","v":"X"},{"$f":"IF(ISERROR(SEARCH(\"*Science*\",Failing_Kids!$F335,1)),IF(ISERROR(SEARCH(\"*Bio*\",Failing_Kids!$F335,1)),IF(ISERROR(SEARCH(\"*Chem*\",Failing_Kids!$F335,1)),IF(ISERROR(SEARCH(\"*Physics*\",Failing_Kids!$F335,1)),\"\",\"X\"),\"X\"),\"X\"),\"X\")","v":""},{"$f":"IF(ISERROR(SEARCH(\"*His*\",Failing_Kids!$F335,1)),IF(ISERROR(SEARCH(\"*GOV*\",Failing_Kids!$F335,1)),IF(ISERROR(SEARCH(\"*Econ*\",Failing_Kids!$F335,1)),IF(ISERROR(SEARCH(\"*Soc*\",Failing_Kids!$F335,1)),\"\",\"X\"),\"X\"),\"X\"),\"X\")","v":""},{"$f":"IF(ISERROR(SEARCH(\"*PE*\",Failing_Kids!$F335,1)),\"\",\"X\")","v":""}]
[{"$f":"Failing_Kids!C336","v":"Patel"},{"$f":"Failing_Kids!D336","v":"Glenda"},{"$f":"IF(ISERROR(SEARCH(\"*English*\",Failing_Kids!F336,1)),\"\",\"X \")","v":"X "},{"$f":"IF(ISERROR(SEARCH(\"*Geometry*\",Failing_Kids!$F336,1)),IF(ISERROR(SEARCH(\"*Math*\",Failing_Kids!$F336,1)),IF(ISERROR(SEARCH(\"*Calc*\",Failing_Kids!$F336,1)),IF(ISERROR(SEARCH(\"*Algebra*\",Failing_Kids!$F336,1)),\"\",\"X\"),\"X\"),\"X\"),\"X\")","v":""},{"$f":"IF(ISERROR(SEARCH(\"*Science*\",Failing_Kids!$F336,1)),IF(ISERROR(SEARCH(\"*Bio*\",Failing_Kids!$F336,1)),IF(ISERROR(SEARCH(\"*Chem*\",Failing_Kids!$F336,1)),IF(ISERROR(SEARCH(\"*Physics*\",Failing_Kids!$F336,1)),\"\",\"X\"),\"X\"),\"X\"),\"X\")","v":""},{"$f":"IF(ISERROR(SEARCH(\"*His*\",Failing_Kids!$F336,1)),IF(ISERROR(SEARCH(\"*GOV*\",Failing_Kids!$F336,1)),IF(ISERROR(SEARCH(\"*Econ*\",Failing_Kids!$F336,1)),IF(ISERROR(SEARCH(\"*Soc*\",Failing_Kids!$F336,1)),\"\",\"X\"),\"X\"),\"X\"),\"X\")","v":""},{"$f":"IF(ISERROR(SEARCH(\"*PE*\",Failing_Kids!$F336,1)),\"\",\"X\")","v":""}]
[{"$f":"Failing_Kids!C337","v":"Patel"},{"$f":"Failing_Kids!D337","v":"Glenda"},{"$f":"IF(ISERROR(SEARCH(\"*English*\",Failing_Kids!F337,1)),\"\",\"X \")","v":""},{"$f":"IF(ISERROR(SEARCH(\"*Geometry*\",Failing_Kids!$F337,1)),IF(ISERROR(SEARCH(\"*Math*\",Failing_Kids!$F337,1)),IF(ISERROR(SEARCH(\"*Calc*\",Failing_Kids!$F337,1)),IF(ISERROR(SEARCH(\"*Algebra*\",Failing_Kids!$F337,1)),\"\",\"X\"),\"X\"),\"X\"),\"X\")","v":""},{"$f":"IF(ISERROR(SEARCH(\"*Science*\",Failing_Kids!$F337,1)),IF(ISERROR(SEARCH(\"*Bio*\",Failing_Kids!$F337,1)),IF(ISERROR(SEARCH(\"*Chem*\",Failing_Kids!$F337,1)),IF(ISERROR(SEARCH(\"*Physics*\",Failing_Kids!$F337,1)),\"\",\"X\"),\"X\"),\"X\"),\"X\")","v":""},{"$f":"IF(ISERROR(SEARCH(\"*His*\",Failing_Kids!$F337,1)),IF(ISERROR(SEARCH(\"*GOV*\",Failing_Kids!$F337,1)),IF(ISERROR(SEARCH(\"*Econ*\",Failing_Kids!$F337,1)),IF(ISERROR(SEARCH(\"*Soc*\",Failing_Kids!$F337,1)),\"\",\"X\"),\"X\"),\"X\"),\"X\")","v":""},{"$f":"IF(ISERROR(SEARCH(\"*PE*\",Failing_Kids!$F337,1)),\"\",\"X\")","v":""}]
[{"$f":"Failing_Kids!C338","v":"Patterson"},{"$f":"Failing_Kids!D338","v":"Joan"},{"$f":"IF(ISERROR(SEARCH(\"*English*\",Failing_Kids!F338,1)),\"\",\"X \")","v":"X "},{"$f":"IF(ISERROR(SEARCH(\"*Geometry*\",Failing_Kids!$F338,1)),IF(ISERROR(SEARCH(\"*Math*\",Failing_Kids!$F338,1)),IF(ISERROR(SEARCH(\"*Calc*\",Failing_Kids!$F338,1)),IF(ISERROR(SEARCH(\"*Algebra*\",Failing_Kids!$F338,1)),\"\",\"X\"),\"X\"),\"X\"),\"X\")","v":""},{"$f":"IF(ISERROR(SEARCH(\"*Science*\",Failing_Kids!$F338,1)),IF(ISERROR(SEARCH(\"*Bio*\",Failing_Kids!$F338,1)),IF(ISERROR(SEARCH(\"*Chem*\",Failing_Kids!$F338,1)),IF(ISERROR(SEARCH(\"*Physics*\",Failing_Kids!$F338,1)),\"\",\"X\"),\"X\"),\"X\"),\"X\")","v":""},{"$f":"IF(ISERROR(SEARCH(\"*His*\",Failing_Kids!$F338,1)),IF(ISERROR(SEARCH(\"*GOV*\",Failing_Kids!$F338,1)),IF(ISERROR(SEARCH(\"*Econ*\",Failing_Kids!$F338,1)),IF(ISERROR(SEARCH(\"*Soc*\",Failing_Kids!$F338,1)),\"\",\"X\"),\"X\"),\"X\"),\"X\")","v":""},{"$f":"IF(ISERROR(SEARCH(\"*PE*\",Failing_Kids!$F338,1)),\"\",\"X\")","v":""}]
[{"$f":"Failing_Kids!C339","v":"Patterson"},{"$f":"Failing_Kids!D339","v":"Joan"},{"$f":"IF(ISERROR(SEARCH(\"*English*\",Failing_Kids!F339,1)),\"\",\"X \")","v":""},{"$f":"IF(ISERROR(SEARCH(\"*Geometry*\",Failing_Kids!$F339,1)),IF(ISERROR(SEARCH(\"*Math*\",Failing_Kids!$F339,1)),IF(ISERROR(SEARCH(\"*Calc*\",Failing_Kids!$F339,1)),IF(ISERROR(SEARCH(\"*Algebra*\",Failing_Kids!$F339,1)),\"\",\"X\"),\"X\"),\"X\"),\"X\")","v":""},{"$f":"IF(ISERROR(SEARCH(\"*Science*\",Failing_Kids!$F339,1)),IF(ISERROR(SEARCH(\"*Bio*\",Failing_Kids!$F339,1)),IF(ISERROR(SEARCH(\"*Chem*\",Failing_Kids!$F339,1)),IF(ISERROR(SEARCH(\"*Physics*\",Failing_Kids!$F339,1)),\"\",\"X\"),\"X\"),\"X\"),\"X\")","v":""},{"$f":"IF(ISERROR(SEARCH(\"*His*\",Failing_Kids!$F339,1)),IF(ISERROR(SEARCH(\"*GOV*\",Failing_Kids!$F339,1)),IF(ISERROR(SEARCH(\"*Econ*\",Failing_Kids!$F339,1)),IF(ISERROR(SEARCH(\"*Soc*\",Failing_Kids!$F339,1)),\"\",\"X\"),\"X\"),\"X\"),\"X\")","v":"X"},{"$f":"IF(ISERROR(SEARCH(\"*PE*\",Failing_Kids!$F339,1)),\"\",\"X\")","v":""}]
[{"$f":"Failing_Kids!C340","v":"Paul"},{"$f":"Failing_Kids!D340","v":"Esther"},{"$f":"IF(ISERROR(SEARCH(\"*English*\",Failing_Kids!F340,1)),\"\",\"X \")","v":""},{"$f":"IF(ISERROR(SEARCH(\"*Geometry*\",Failing_Kids!$F340,1)),IF(ISERROR(SEARCH(\"*Math*\",Failing_Kids!$F340,1)),IF(ISERROR(SEARCH(\"*Calc*\",Failing_Kids!$F340,1)),IF(ISERROR(SEARCH(\"*Algebra*\",Failing_Kids!$F340,1)),\"\",\"X\"),\"X\"),\"X\"),\"X\")","v":"X"},{"$f":"IF(ISERROR(SEARCH(\"*Science*\",Failing_Kids!$F340,1)),IF(ISERROR(SEARCH(\"*Bio*\",Failing_Kids!$F340,1)),IF(ISERROR(SEARCH(\"*Chem*\",Failing_Kids!$F340,1)),IF(ISERROR(SEARCH(\"*Physics*\",Failing_Kids!$F340,1)),\"\",\"X\"),\"X\"),\"X\"),\"X\")","v":""},{"$f":"IF(ISERROR(SEARCH(\"*His*\",Failing_Kids!$F340,1)),IF(ISERROR(SEARCH(\"*GOV*\",Failing_Kids!$F340,1)),IF(ISERROR(SEARCH(\"*Econ*\",Failing_Kids!$F340,1)),IF(ISERROR(SEARCH(\"*Soc*\",Failing_Kids!$F340,1)),\"\",\"X\"),\"X\"),\"X\"),\"X\")","v":""},{"$f":"IF(ISERROR(SEARCH(\"*PE*\",Failing_Kids!$F340,1)),\"\",\"X\")","v":""}]
[{"$f":"Failing_Kids!C341","v":"Paul"},{"$f":"Failing_Kids!D341","v":"Esther"},{"$f":"IF(ISERROR(SEARCH(\"*English*\",Failing_Kids!F341,1)),\"\",\"X \")","v":""},{"$f":"IF(ISERROR(SEARCH(\"*Geometry*\",Failing_Kids!$F341,1)),IF(ISERROR(SEARCH(\"*Math*\",Failing_Kids!$F341,1)),IF(ISERROR(SEARCH(\"*Calc*\",Failing_Kids!$F341,1)),IF(ISERROR(SEARCH(\"*Algebra*\",Failing_Kids!$F341,1)),\"\",\"X\"),\"X\"),\"X\"),\"X\")","v":""},{"$f":"IF(ISERROR(SEARCH(\"*Science*\",Failing_Kids!$F341,1)),IF(ISERROR(SEARCH(\"*Bio*\",Failing_Kids!$F341,1)),IF(ISERROR(SEARCH(\"*Chem*\",Failing_Kids!$F341,1)),IF(ISERROR(SEARCH(\"*Physics*\",Failing_Kids!$F341,1)),\"\",\"X\"),\"X\"),\"X\"),\"X\")","v":"X"},{"$f":"IF(ISERROR(SEARCH(\"*His*\",Failing_Kids!$F341,1)),IF(ISERROR(SEARCH(\"*GOV*\",Failing_Kids!$F341,1)),IF(ISERROR(SEARCH(\"*Econ*\",Failing_Kids!$F341,1)),IF(ISERROR(SEARCH(\"*Soc*\",Failing_Kids!$F341,1)),\"\",\"X\"),\"X\"),\"X\"),\"X\")","v":""},{"$f":"IF(ISERROR(SEARCH(\"*PE*\",Failing_Kids!$F341,1)),\"\",\"X\")","v":""}]
[{"$f":"Failing_Kids!C342","v":"Paul"},{"$f":"Failing_Kids!D342","v":"Esther"},{"$f":"IF(ISERROR(SEARCH(\"*English*\",Failing_Kids!F342,1)),\"\",\"X \")","v":""},{"$f":"IF(ISERROR(SEARCH(\"*Geometry*\",Failing_Kids!$F342,1)),IF(ISERROR(SEARCH(\"*Math*\",Failing_Kids!$F342,1)),IF(ISERROR(SEARCH(\"*Calc*\",Failing_Kids!$F342,1)),IF(ISERROR(SEARCH(\"*Algebra*\",Failing_Kids!$F342,1)),\"\",\"X\"),\"X\"),\"X\"),\"X\")","v":""},{"$f":"IF(ISERROR(SEARCH(\"*Science*\",Failing_Kids!$F342,1)),IF(ISERROR(SEARCH(\"*Bio*\",Failing_Kids!$F342,1)),IF(ISERROR(SEARCH(\"*Chem*\",Failing_Kids!$F342,1)),IF(ISERROR(SEARCH(\"*Physics*\",Failing_Kids!$F342,1)),\"\",\"X\"),\"X\"),\"X\"),\"X\")","v":""},{"$f":"IF(ISERROR(SEARCH(\"*His*\",Failing_Kids!$F342,1)),IF(ISERROR(SEARCH(\"*GOV*\",Failing_Kids!$F342,1)),IF(ISERROR(SEARCH(\"*Econ*\",Failing_Kids!$F342,1)),IF(ISERROR(SEARCH(\"*Soc*\",Failing_Kids!$F342,1)),\"\",\"X\"),\"X\"),\"X\"),\"X\")","v":"X"},{"$f":"IF(ISERROR(SEARCH(\"*PE*\",Failing_Kids!$F342,1)),\"\",\"X\")","v":""}]
[{"$f":"Failing_Kids!C343","v":"Paul"},{"$f":"Failing_Kids!D343","v":"Manuel"},{"$f":"IF(ISERROR(SEARCH(\"*English*\",Failing_Kids!F343,1)),\"\",\"X \")","v":"X "},{"$f":"IF(ISERROR(SEARCH(\"*Geometry*\",Failing_Kids!$F343,1)),IF(ISERROR(SEARCH(\"*Math*\",Failing_Kids!$F343,1)),IF(ISERROR(SEARCH(\"*Calc*\",Failing_Kids!$F343,1)),IF(ISERROR(SEARCH(\"*Algebra*\",Failing_Kids!$F343,1)),\"\",\"X\"),\"X\"),\"X\"),\"X\")","v":""},{"$f":"IF(ISERROR(SEARCH(\"*Science*\",Failing_Kids!$F343,1)),IF(ISERROR(SEARCH(\"*Bio*\",Failing_Kids!$F343,1)),IF(ISERROR(SEARCH(\"*Chem*\",Failing_Kids!$F343,1)),IF(ISERROR(SEARCH(\"*Physics*\",Failing_Kids!$F343,1)),\"\",\"X\"),\"X\"),\"X\"),\"X\")","v":""},{"$f":"IF(ISERROR(SEARCH(\"*His*\",Failing_Kids!$F343,1)),IF(ISERROR(SEARCH(\"*GOV*\",Failing_Kids!$F343,1)),IF(ISERROR(SEARCH(\"*Econ*\",Failing_Kids!$F343,1)),IF(ISERROR(SEARCH(\"*Soc*\",Failing_Kids!$F343,1)),\"\",\"X\"),\"X\"),\"X\"),\"X\")","v":""},{"$f":"IF(ISERROR(SEARCH(\"*PE*\",Failing_Kids!$F343,1)),\"\",\"X\")","v":""}]
[{"$f":"Failing_Kids!C344","v":"Paul"},{"$f":"Failing_Kids!D344","v":"Manuel"},{"$f":"IF(ISERROR(SEARCH(\"*English*\",Failing_Kids!F344,1)),\"\",\"X \")","v":""},{"$f":"IF(ISERROR(SEARCH(\"*Geometry*\",Failing_Kids!$F344,1)),IF(ISERROR(SEARCH(\"*Math*\",Failing_Kids!$F344,1)),IF(ISERROR(SEARCH(\"*Calc*\",Failing_Kids!$F344,1)),IF(ISERROR(SEARCH(\"*Algebra*\",Failing_Kids!$F344,1)),\"\",\"X\"),\"X\"),\"X\"),\"X\")","v":"X"},{"$f":"IF(ISERROR(SEARCH(\"*Science*\",Failing_Kids!$F344,1)),IF(ISERROR(SEARCH(\"*Bio*\",Failing_Kids!$F344,1)),IF(ISERROR(SEARCH(\"*Chem*\",Failing_Kids!$F344,1)),IF(ISERROR(SEARCH(\"*Physics*\",Failing_Kids!$F344,1)),\"\",\"X\"),\"X\"),\"X\"),\"X\")","v":""},{"$f":"IF(ISERROR(SEARCH(\"*His*\",Failing_Kids!$F344,1)),IF(ISERROR(SEARCH(\"*GOV*\",Failing_Kids!$F344,1)),IF(ISERROR(SEARCH(\"*Econ*\",Failing_Kids!$F344,1)),IF(ISERROR(SEARCH(\"*Soc*\",Failing_Kids!$F344,1)),\"\",\"X\"),\"X\"),\"X\"),\"X\")","v":""},{"$f":"IF(ISERROR(SEARCH(\"*PE*\",Failing_Kids!$F344,1)),\"\",\"X\")","v":""}]
[{"$f":"Failing_Kids!C345","v":"Pearson"},{"$f":"Failing_Kids!D345","v":"Charlotte"},{"$f":"IF(ISERROR(SEARCH(\"*English*\",Failing_Kids!F345,1)),\"\",\"X \")","v":""},{"$f":"IF(ISERROR(SEARCH(\"*Geometry*\",Failing_Kids!$F345,1)),IF(ISERROR(SEARCH(\"*Math*\",Failing_Kids!$F345,1)),IF(ISERROR(SEARCH(\"*Calc*\",Failing_Kids!$F345,1)),IF(ISERROR(SEARCH(\"*Algebra*\",Failing_Kids!$F345,1)),\"\",\"X\"),\"X\"),\"X\"),\"X\")","v":"X"},{"$f":"IF(ISERROR(SEARCH(\"*Science*\",Failing_Kids!$F345,1)),IF(ISERROR(SEARCH(\"*Bio*\",Failing_Kids!$F345,1)),IF(ISERROR(SEARCH(\"*Chem*\",Failing_Kids!$F345,1)),IF(ISERROR(SEARCH(\"*Physics*\",Failing_Kids!$F345,1)),\"\",\"X\"),\"X\"),\"X\"),\"X\")","v":""},{"$f":"IF(ISERROR(SEARCH(\"*His*\",Failing_Kids!$F345,1)),IF(ISERROR(SEARCH(\"*GOV*\",Failing_Kids!$F345,1)),IF(ISERROR(SEARCH(\"*Econ*\",Failing_Kids!$F345,1)),IF(ISERROR(SEARCH(\"*Soc*\",Failing_Kids!$F345,1)),\"\",\"X\"),\"X\"),\"X\"),\"X\")","v":""},{"$f":"IF(ISERROR(SEARCH(\"*PE*\",Failing_Kids!$F345,1)),\"\",\"X\")","v":""}]
[{"$f":"Failing_Kids!C346","v":"Pearson"},{"$f":"Failing_Kids!D346","v":"Charlotte"},{"$f":"IF(ISERROR(SEARCH(\"*English*\",Failing_Kids!F346,1)),\"\",\"X \")","v":""},{"$f":"IF(ISERROR(SEARCH(\"*Geometry*\",Failing_Kids!$F346,1)),IF(ISERROR(SEARCH(\"*Math*\",Failing_Kids!$F346,1)),IF(ISERROR(SEARCH(\"*Calc*\",Failing_Kids!$F346,1)),IF(ISERROR(SEARCH(\"*Algebra*\",Failing_Kids!$F346,1)),\"\",\"X\"),\"X\"),\"X\"),\"X\")","v":""},{"$f":"IF(ISERROR(SEARCH(\"*Science*\",Failing_Kids!$F346,1)),IF(ISERROR(SEARCH(\"*Bio*\",Failing_Kids!$F346,1)),IF(ISERROR(SEARCH(\"*Chem*\",Failing_Kids!$F346,1)),IF(ISERROR(SEARCH(\"*Physics*\",Failing_Kids!$F346,1)),\"\",\"X\"),\"X\"),\"X\"),\"X\")","v":""},{"$f":"IF(ISERROR(SEARCH(\"*His*\",Failing_Kids!$F346,1)),IF(ISERROR(SEARCH(\"*GOV*\",Failing_Kids!$F346,1)),IF(ISERROR(SEARCH(\"*Econ*\",Failing_Kids!$F346,1)),IF(ISERROR(SEARCH(\"*Soc*\",Failing_Kids!$F346,1)),\"\",\"X\"),\"X\"),\"X\"),\"X\")","v":""},{"$f":"IF(ISERROR(SEARCH(\"*PE*\",Failing_Kids!$F346,1)),\"\",\"X\")","v":""}]
[{"$f":"Failing_Kids!C347","v":"Pearson"},{"$f":"Failing_Kids!D347","v":"Charlotte"},{"$f":"IF(ISERROR(SEARCH(\"*English*\",Failing_Kids!F347,1)),\"\",\"X \")","v":""},{"$f":"IF(ISERROR(SEARCH(\"*Geometry*\",Failing_Kids!$F347,1)),IF(ISERROR(SEARCH(\"*Math*\",Failing_Kids!$F347,1)),IF(ISERROR(SEARCH(\"*Calc*\",Failing_Kids!$F347,1)),IF(ISERROR(SEARCH(\"*Algebra*\",Failing_Kids!$F347,1)),\"\",\"X\"),\"X\"),\"X\"),\"X\")","v":""},{"$f":"IF(ISERROR(SEARCH(\"*Science*\",Failing_Kids!$F347,1)),IF(ISERROR(SEARCH(\"*Bio*\",Failing_Kids!$F347,1)),IF(ISERROR(SEARCH(\"*Chem*\",Failing_Kids!$F347,1)),IF(ISERROR(SEARCH(\"*Physics*\",Failing_Kids!$F347,1)),\"\",\"X\"),\"X\"),\"X\"),\"X\")","v":""},{"$f":"IF(ISERROR(SEARCH(\"*His*\",Failing_Kids!$F347,1)),IF(ISERROR(SEARCH(\"*GOV*\",Failing_Kids!$F347,1)),IF(ISERROR(SEARCH(\"*Econ*\",Failing_Kids!$F347,1)),IF(ISERROR(SEARCH(\"*Soc*\",Failing_Kids!$F347,1)),\"\",\"X\"),\"X\"),\"X\"),\"X\")","v":""},{"$f":"IF(ISERROR(SEARCH(\"*PE*\",Failing_Kids!$F347,1)),\"\",\"X\")","v":""}]
[{"$f":"Failing_Kids!C348","v":"Pearson"},{"$f":"Failing_Kids!D348","v":"Marie"},{"$f":"IF(ISERROR(SEARCH(\"*English*\",Failing_Kids!F348,1)),\"\",\"X \")","v":""},{"$f":"IF(ISERROR(SEARCH(\"*Geometry*\",Failing_Kids!$F348,1)),IF(ISERROR(SEARCH(\"*Math*\",Failing_Kids!$F348,1)),IF(ISERROR(SEARCH(\"*Calc*\",Failing_Kids!$F348,1)),IF(ISERROR(SEARCH(\"*Algebra*\",Failing_Kids!$F348,1)),\"\",\"X\"),\"X\"),\"X\"),\"X\")","v":"X"},{"$f":"IF(ISERROR(SEARCH(\"*Science*\",Failing_Kids!$F348,1)),IF(ISERROR(SEARCH(\"*Bio*\",Failing_Kids!$F348,1)),IF(ISERROR(SEARCH(\"*Chem*\",Failing_Kids!$F348,1)),IF(ISERROR(SEARCH(\"*Physics*\",Failing_Kids!$F348,1)),\"\",\"X\"),\"X\"),\"X\"),\"X\")","v":""},{"$f":"IF(ISERROR(SEARCH(\"*His*\",Failing_Kids!$F348,1)),IF(ISERROR(SEARCH(\"*GOV*\",Failing_Kids!$F348,1)),IF(ISERROR(SEARCH(\"*Econ*\",Failing_Kids!$F348,1)),IF(ISERROR(SEARCH(\"*Soc*\",Failing_Kids!$F348,1)),\"\",\"X\"),\"X\"),\"X\"),\"X\")","v":""},{"$f":"IF(ISERROR(SEARCH(\"*PE*\",Failing_Kids!$F348,1)),\"\",\"X\")","v":""}]
[{"$f":"Failing_Kids!C349","v":"Pearson"},{"$f":"Failing_Kids!D349","v":"Marie"},{"$f":"IF(ISERROR(SEARCH(\"*English*\",Failing_Kids!F349,1)),\"\",\"X \")","v":""},{"$f":"IF(ISERROR(SEARCH(\"*Geometry*\",Failing_Kids!$F349,1)),IF(ISERROR(SEARCH(\"*Math*\",Failing_Kids!$F349,1)),IF(ISERROR(SEARCH(\"*Calc*\",Failing_Kids!$F349,1)),IF(ISERROR(SEARCH(\"*Algebra*\",Failing_Kids!$F349,1)),\"\",\"X\"),\"X\"),\"X\"),\"X\")","v":""},{"$f":"IF(ISERROR(SEARCH(\"*Science*\",Failing_Kids!$F349,1)),IF(ISERROR(SEARCH(\"*Bio*\",Failing_Kids!$F349,1)),IF(ISERROR(SEARCH(\"*Chem*\",Failing_Kids!$F349,1)),IF(ISERROR(SEARCH(\"*Physics*\",Failing_Kids!$F349,1)),\"\",\"X\"),\"X\"),\"X\"),\"X\")","v":""},{"$f":"IF(ISERROR(SEARCH(\"*His*\",Failing_Kids!$F349,1)),IF(ISERROR(SEARCH(\"*GOV*\",Failing_Kids!$F349,1)),IF(ISERROR(SEARCH(\"*Econ*\",Failing_Kids!$F349,1)),IF(ISERROR(SEARCH(\"*Soc*\",Failing_Kids!$F349,1)),\"\",\"X\"),\"X\"),\"X\"),\"X\")","v":"X"},{"$f":"IF(ISERROR(SEARCH(\"*PE*\",Failing_Kids!$F349,1)),\"\",\"X\")","v":""}]
[{"$f":"Failing_Kids!C350","v":"Pearson"},{"$f":"Failing_Kids!D350","v":"Stacy"},{"$f":"IF(ISERROR(SEARCH(\"*English*\",Failing_Kids!F350,1)),\"\",\"X \")","v":""},{"$f":"IF(ISERROR(SEARCH(\"*Geometry*\",Failing_Kids!$F350,1)),IF(ISERROR(SEARCH(\"*Math*\",Failing_Kids!$F350,1)),IF(ISERROR(SEARCH(\"*Calc*\",Failing_Kids!$F350,1)),IF(ISERROR(SEARCH(\"*Algebra*\",Failing_Kids!$F350,1)),\"\",\"X\"),\"X\"),\"X\"),\"X\")","v":""},{"$f":"IF(ISERROR(SEARCH(\"*Science*\",Failing_Kids!$F350,1)),IF(ISERROR(SEARCH(\"*Bio*\",Failing_Kids!$F350,1)),IF(ISERROR(SEARCH(\"*Chem*\",Failing_Kids!$F350,1)),IF(ISERROR(SEARCH(\"*Physics*\",Failing_Kids!$F350,1)),\"\",\"X\"),\"X\"),\"X\"),\"X\")","v":""},{"$f":"IF(ISERROR(SEARCH(\"*His*\",Failing_Kids!$F350,1)),IF(ISERROR(SEARCH(\"*GOV*\",Failing_Kids!$F350,1)),IF(ISERROR(SEARCH(\"*Econ*\",Failing_Kids!$F350,1)),IF(ISERROR(SEARCH(\"*Soc*\",Failing_Kids!$F350,1)),\"\",\"X\"),\"X\"),\"X\"),\"X\")","v":""},{"$f":"IF(ISERROR(SEARCH(\"*PE*\",Failing_Kids!$F350,1)),\"\",\"X\")","v":""}]
[{"$f":"Failing_Kids!C351","v":"Pearson"},{"$f":"Failing_Kids!D351","v":"Stacy"},{"$f":"IF(ISERROR(SEARCH(\"*English*\",Failing_Kids!F351,1)),\"\",\"X \")","v":""},{"$f":"IF(ISERROR(SEARCH(\"*Geometry*\",Failing_Kids!$F351,1)),IF(ISERROR(SEARCH(\"*Math*\",Failing_Kids!$F351,1)),IF(ISERROR(SEARCH(\"*Calc*\",Failing_Kids!$F351,1)),IF(ISERROR(SEARCH(\"*Algebra*\",Failing_Kids!$F351,1)),\"\",\"X\"),\"X\"),\"X\"),\"X\")","v":""},{"$f":"IF(ISERROR(SEARCH(\"*Science*\",Failing_Kids!$F351,1)),IF(ISERROR(SEARCH(\"*Bio*\",Failing_Kids!$F351,1)),IF(ISERROR(SEARCH(\"*Chem*\",Failing_Kids!$F351,1)),IF(ISERROR(SEARCH(\"*Physics*\",Failing_Kids!$F351,1)),\"\",\"X\"),\"X\"),\"X\"),\"X\")","v":""},{"$f":"IF(ISERROR(SEARCH(\"*His*\",Failing_Kids!$F351,1)),IF(ISERROR(SEARCH(\"*GOV*\",Failing_Kids!$F351,1)),IF(ISERROR(SEARCH(\"*Econ*\",Failing_Kids!$F351,1)),IF(ISERROR(SEARCH(\"*Soc*\",Failing_Kids!$F351,1)),\"\",\"X\"),\"X\"),\"X\"),\"X\")","v":""},{"$f":"IF(ISERROR(SEARCH(\"*PE*\",Failing_Kids!$F351,1)),\"\",\"X\")","v":""}]
[{"$f":"Failing_Kids!C352","v":"Perry"},{"$f":"Failing_Kids!D352","v":"Kathryn"},{"$f":"IF(ISERROR(SEARCH(\"*English*\",Failing_Kids!F352,1)),\"\",\"X \")","v":""},{"$f":"IF(ISERROR(SEARCH(\"*Geometry*\",Failing_Kids!$F352,1)),IF(ISERROR(SEARCH(\"*Math*\",Failing_Kids!$F352,1)),IF(ISERROR(SEARCH(\"*Calc*\",Failing_Kids!$F352,1)),IF(ISERROR(SEARCH(\"*Algebra*\",Failing_Kids!$F352,1)),\"\",\"X\"),\"X\"),\"X\"),\"X\")","v":"X"},{"$f":"IF(ISERROR(SEARCH(\"*Science*\",Failing_Kids!$F352,1)),IF(ISERROR(SEARCH(\"*Bio*\",Failing_Kids!$F352,1)),IF(ISERROR(SEARCH(\"*Chem*\",Failing_Kids!$F352,1)),IF(ISERROR(SEARCH(\"*Physics*\",Failing_Kids!$F352,1)),\"\",\"X\"),\"X\"),\"X\"),\"X\")","v":""},{"$f":"IF(ISERROR(SEARCH(\"*His*\",Failing_Kids!$F352,1)),IF(ISERROR(SEARCH(\"*GOV*\",Failing_Kids!$F352,1)),IF(ISERROR(SEARCH(\"*Econ*\",Failing_Kids!$F352,1)),IF(ISERROR(SEARCH(\"*Soc*\",Failing_Kids!$F352,1)),\"\",\"X\"),\"X\"),\"X\"),\"X\")","v":""},{"$f":"IF(ISERROR(SEARCH(\"*PE*\",Failing_Kids!$F352,1)),\"\",\"X\")","v":""}]
[{"$f":"Failing_Kids!C353","v":"Perry"},{"$f":"Failing_Kids!D353","v":"Kathryn"},{"$f":"IF(ISERROR(SEARCH(\"*English*\",Failing_Kids!F353,1)),\"\",\"X \")","v":"X "},{"$f":"IF(ISERROR(SEARCH(\"*Geometry*\",Failing_Kids!$F353,1)),IF(ISERROR(SEARCH(\"*Math*\",Failing_Kids!$F353,1)),IF(ISERROR(SEARCH(\"*Calc*\",Failing_Kids!$F353,1)),IF(ISERROR(SEARCH(\"*Algebra*\",Failing_Kids!$F353,1)),\"\",\"X\"),\"X\"),\"X\"),\"X\")","v":""},{"$f":"IF(ISERROR(SEARCH(\"*Science*\",Failing_Kids!$F353,1)),IF(ISERROR(SEARCH(\"*Bio*\",Failing_Kids!$F353,1)),IF(ISERROR(SEARCH(\"*Chem*\",Failing_Kids!$F353,1)),IF(ISERROR(SEARCH(\"*Physics*\",Failing_Kids!$F353,1)),\"\",\"X\"),\"X\"),\"X\"),\"X\")","v":""},{"$f":"IF(ISERROR(SEARCH(\"*His*\",Failing_Kids!$F353,1)),IF(ISERROR(SEARCH(\"*GOV*\",Failing_Kids!$F353,1)),IF(ISERROR(SEARCH(\"*Econ*\",Failing_Kids!$F353,1)),IF(ISERROR(SEARCH(\"*Soc*\",Failing_Kids!$F353,1)),\"\",\"X\"),\"X\"),\"X\"),\"X\")","v":""},{"$f":"IF(ISERROR(SEARCH(\"*PE*\",Failing_Kids!$F353,1)),\"\",\"X\")","v":""}]
[{"$f":"Failing_Kids!C354","v":"Pickett"},{"$f":"Failing_Kids!D354","v":"Marilyn"},{"$f":"IF(ISERROR(SEARCH(\"*English*\",Failing_Kids!F354,1)),\"\",\"X \")","v":""},{"$f":"IF(ISERROR(SEARCH(\"*Geometry*\",Failing_Kids!$F354,1)),IF(ISERROR(SEARCH(\"*Math*\",Failing_Kids!$F354,1)),IF(ISERROR(SEARCH(\"*Calc*\",Failing_Kids!$F354,1)),IF(ISERROR(SEARCH(\"*Algebra*\",Failing_Kids!$F354,1)),\"\",\"X\"),\"X\"),\"X\"),\"X\")","v":"X"},{"$f":"IF(ISERROR(SEARCH(\"*Science*\",Failing_Kids!$F354,1)),IF(ISERROR(SEARCH(\"*Bio*\",Failing_Kids!$F354,1)),IF(ISERROR(SEARCH(\"*Chem*\",Failing_Kids!$F354,1)),IF(ISERROR(SEARCH(\"*Physics*\",Failing_Kids!$F354,1)),\"\",\"X\"),\"X\"),\"X\"),\"X\")","v":""},{"$f":"IF(ISERROR(SEARCH(\"*His*\",Failing_Kids!$F354,1)),IF(ISERROR(SEARCH(\"*GOV*\",Failing_Kids!$F354,1)),IF(ISERROR(SEARCH(\"*Econ*\",Failing_Kids!$F354,1)),IF(ISERROR(SEARCH(\"*Soc*\",Failing_Kids!$F354,1)),\"\",\"X\"),\"X\"),\"X\"),\"X\")","v":""},{"$f":"IF(ISERROR(SEARCH(\"*PE*\",Failing_Kids!$F354,1)),\"\",\"X\")","v":""}]
[{"$f":"Failing_Kids!C355","v":"Pickett"},{"$f":"Failing_Kids!D355","v":"Marilyn"},{"$f":"IF(ISERROR(SEARCH(\"*English*\",Failing_Kids!F355,1)),\"\",\"X \")","v":"X "},{"$f":"IF(ISERROR(SEARCH(\"*Geometry*\",Failing_Kids!$F355,1)),IF(ISERROR(SEARCH(\"*Math*\",Failing_Kids!$F355,1)),IF(ISERROR(SEARCH(\"*Calc*\",Failing_Kids!$F355,1)),IF(ISERROR(SEARCH(\"*Algebra*\",Failing_Kids!$F355,1)),\"\",\"X\"),\"X\"),\"X\"),\"X\")","v":""},{"$f":"IF(ISERROR(SEARCH(\"*Science*\",Failing_Kids!$F355,1)),IF(ISERROR(SEARCH(\"*Bio*\",Failing_Kids!$F355,1)),IF(ISERROR(SEARCH(\"*Chem*\",Failing_Kids!$F355,1)),IF(ISERROR(SEARCH(\"*Physics*\",Failing_Kids!$F355,1)),\"\",\"X\"),\"X\"),\"X\"),\"X\")","v":""},{"$f":"IF(ISERROR(SEARCH(\"*His*\",Failing_Kids!$F355,1)),IF(ISERROR(SEARCH(\"*GOV*\",Failing_Kids!$F355,1)),IF(ISERROR(SEARCH(\"*Econ*\",Failing_Kids!$F355,1)),IF(ISERROR(SEARCH(\"*Soc*\",Failing_Kids!$F355,1)),\"\",\"X\"),\"X\"),\"X\"),\"X\")","v":""},{"$f":"IF(ISERROR(SEARCH(\"*PE*\",Failing_Kids!$F355,1)),\"\",\"X\")","v":""}]
[{"$f":"Failing_Kids!C356","v":"Pickett"},{"$f":"Failing_Kids!D356","v":"Marilyn"},{"$f":"IF(ISERROR(SEARCH(\"*English*\",Failing_Kids!F356,1)),\"\",\"X \")","v":""},{"$f":"IF(ISERROR(SEARCH(\"*Geometry*\",Failing_Kids!$F356,1)),IF(ISERROR(SEARCH(\"*Math*\",Failing_Kids!$F356,1)),IF(ISERROR(SEARCH(\"*Calc*\",Failing_Kids!$F356,1)),IF(ISERROR(SEARCH(\"*Algebra*\",Failing_Kids!$F356,1)),\"\",\"X\"),\"X\"),\"X\"),\"X\")","v":""},{"$f":"IF(ISERROR(SEARCH(\"*Science*\",Failing_Kids!$F356,1)),IF(ISERROR(SEARCH(\"*Bio*\",Failing_Kids!$F356,1)),IF(ISERROR(SEARCH(\"*Chem*\",Failing_Kids!$F356,1)),IF(ISERROR(SEARCH(\"*Physics*\",Failing_Kids!$F356,1)),\"\",\"X\"),\"X\"),\"X\"),\"X\")","v":""},{"$f":"IF(ISERROR(SEARCH(\"*His*\",Failing_Kids!$F356,1)),IF(ISERROR(SEARCH(\"*GOV*\",Failing_Kids!$F356,1)),IF(ISERROR(SEARCH(\"*Econ*\",Failing_Kids!$F356,1)),IF(ISERROR(SEARCH(\"*Soc*\",Failing_Kids!$F356,1)),\"\",\"X\"),\"X\"),\"X\"),\"X\")","v":"X"},{"$f":"IF(ISERROR(SEARCH(\"*PE*\",Failing_Kids!$F356,1)),\"\",\"X\")","v":""}]
[{"$f":"Failing_Kids!C357","v":"Pickett"},{"$f":"Failing_Kids!D357","v":"Robert"},{"$f":"IF(ISERROR(SEARCH(\"*English*\",Failing_Kids!F357,1)),\"\",\"X \")","v":"X "},{"$f":"IF(ISERROR(SEARCH(\"*Geometry*\",Failing_Kids!$F357,1)),IF(ISERROR(SEARCH(\"*Math*\",Failing_Kids!$F357,1)),IF(ISERROR(SEARCH(\"*Calc*\",Failing_Kids!$F357,1)),IF(ISERROR(SEARCH(\"*Algebra*\",Failing_Kids!$F357,1)),\"\",\"X\"),\"X\"),\"X\"),\"X\")","v":""},{"$f":"IF(ISERROR(SEARCH(\"*Science*\",Failing_Kids!$F357,1)),IF(ISERROR(SEARCH(\"*Bio*\",Failing_Kids!$F357,1)),IF(ISERROR(SEARCH(\"*Chem*\",Failing_Kids!$F357,1)),IF(ISERROR(SEARCH(\"*Physics*\",Failing_Kids!$F357,1)),\"\",\"X\"),\"X\"),\"X\"),\"X\")","v":""},{"$f":"IF(ISERROR(SEARCH(\"*His*\",Failing_Kids!$F357,1)),IF(ISERROR(SEARCH(\"*GOV*\",Failing_Kids!$F357,1)),IF(ISERROR(SEARCH(\"*Econ*\",Failing_Kids!$F357,1)),IF(ISERROR(SEARCH(\"*Soc*\",Failing_Kids!$F357,1)),\"\",\"X\"),\"X\"),\"X\"),\"X\")","v":""},{"$f":"IF(ISERROR(SEARCH(\"*PE*\",Failing_Kids!$F357,1)),\"\",\"X\")","v":""}]
[{"$f":"Failing_Kids!C358","v":"Pickett"},{"$f":"Failing_Kids!D358","v":"Robert"},{"$f":"IF(ISERROR(SEARCH(\"*English*\",Failing_Kids!F358,1)),\"\",\"X \")","v":""},{"$f":"IF(ISERROR(SEARCH(\"*Geometry*\",Failing_Kids!$F358,1)),IF(ISERROR(SEARCH(\"*Math*\",Failing_Kids!$F358,1)),IF(ISERROR(SEARCH(\"*Calc*\",Failing_Kids!$F358,1)),IF(ISERROR(SEARCH(\"*Algebra*\",Failing_Kids!$F358,1)),\"\",\"X\"),\"X\"),\"X\"),\"X\")","v":"X"},{"$f":"IF(ISERROR(SEARCH(\"*Science*\",Failing_Kids!$F358,1)),IF(ISERROR(SEARCH(\"*Bio*\",Failing_Kids!$F358,1)),IF(ISERROR(SEARCH(\"*Chem*\",Failing_Kids!$F358,1)),IF(ISERROR(SEARCH(\"*Physics*\",Failing_Kids!$F358,1)),\"\",\"X\"),\"X\"),\"X\"),\"X\")","v":""},{"$f":"IF(ISERROR(SEARCH(\"*His*\",Failing_Kids!$F358,1)),IF(ISERROR(SEARCH(\"*GOV*\",Failing_Kids!$F358,1)),IF(ISERROR(SEARCH(\"*Econ*\",Failing_Kids!$F358,1)),IF(ISERROR(SEARCH(\"*Soc*\",Failing_Kids!$F358,1)),\"\",\"X\"),\"X\"),\"X\"),\"X\")","v":""},{"$f":"IF(ISERROR(SEARCH(\"*PE*\",Failing_Kids!$F358,1)),\"\",\"X\")","v":""}]
[{"$f":"Failing_Kids!C359","v":"Poole"},{"$f":"Failing_Kids!D359","v":"Anthony"},{"$f":"IF(ISERROR(SEARCH(\"*English*\",Failing_Kids!F359,1)),\"\",\"X \")","v":""},{"$f":"IF(ISERROR(SEARCH(\"*Geometry*\",Failing_Kids!$F359,1)),IF(ISERROR(SEARCH(\"*Math*\",Failing_Kids!$F359,1)),IF(ISERROR(SEARCH(\"*Calc*\",Failing_Kids!$F359,1)),IF(ISERROR(SEARCH(\"*Algebra*\",Failing_Kids!$F359,1)),\"\",\"X\"),\"X\"),\"X\"),\"X\")","v":""},{"$f":"IF(ISERROR(SEARCH(\"*Science*\",Failing_Kids!$F359,1)),IF(ISERROR(SEARCH(\"*Bio*\",Failing_Kids!$F359,1)),IF(ISERROR(SEARCH(\"*Chem*\",Failing_Kids!$F359,1)),IF(ISERROR(SEARCH(\"*Physics*\",Failing_Kids!$F359,1)),\"\",\"X\"),\"X\"),\"X\"),\"X\")","v":""},{"$f":"IF(ISERROR(SEARCH(\"*His*\",Failing_Kids!$F359,1)),IF(ISERROR(SEARCH(\"*GOV*\",Failing_Kids!$F359,1)),IF(ISERROR(SEARCH(\"*Econ*\",Failing_Kids!$F359,1)),IF(ISERROR(SEARCH(\"*Soc*\",Failing_Kids!$F359,1)),\"\",\"X\"),\"X\"),\"X\"),\"X\")","v":""},{"$f":"IF(ISERROR(SEARCH(\"*PE*\",Failing_Kids!$F359,1)),\"\",\"X\")","v":""}]
[{"$f":"Failing_Kids!C360","v":"Pope"},{"$f":"Failing_Kids!D360","v":"Michele"},{"$f":"IF(ISERROR(SEARCH(\"*English*\",Failing_Kids!F360,1)),\"\",\"X \")","v":""},{"$f":"IF(ISERROR(SEARCH(\"*Geometry*\",Failing_Kids!$F360,1)),IF(ISERROR(SEARCH(\"*Math*\",Failing_Kids!$F360,1)),IF(ISERROR(SEARCH(\"*Calc*\",Failing_Kids!$F360,1)),IF(ISERROR(SEARCH(\"*Algebra*\",Failing_Kids!$F360,1)),\"\",\"X\"),\"X\"),\"X\"),\"X\")","v":"X"},{"$f":"IF(ISERROR(SEARCH(\"*Science*\",Failing_Kids!$F360,1)),IF(ISERROR(SEARCH(\"*Bio*\",Failing_Kids!$F360,1)),IF(ISERROR(SEARCH(\"*Chem*\",Failing_Kids!$F360,1)),IF(ISERROR(SEARCH(\"*Physics*\",Failing_Kids!$F360,1)),\"\",\"X\"),\"X\"),\"X\"),\"X\")","v":""},{"$f":"IF(ISERROR(SEARCH(\"*His*\",Failing_Kids!$F360,1)),IF(ISERROR(SEARCH(\"*GOV*\",Failing_Kids!$F360,1)),IF(ISERROR(SEARCH(\"*Econ*\",Failing_Kids!$F360,1)),IF(ISERROR(SEARCH(\"*Soc*\",Failing_Kids!$F360,1)),\"\",\"X\"),\"X\"),\"X\"),\"X\")","v":""},{"$f":"IF(ISERROR(SEARCH(\"*PE*\",Failing_Kids!$F360,1)),\"\",\"X\")","v":""}]
[{"$f":"Failing_Kids!C361","v":"Pope"},{"$f":"Failing_Kids!D361","v":"Natalie"},{"$f":"IF(ISERROR(SEARCH(\"*English*\",Failing_Kids!F361,1)),\"\",\"X \")","v":""},{"$f":"IF(ISERROR(SEARCH(\"*Geometry*\",Failing_Kids!$F361,1)),IF(ISERROR(SEARCH(\"*Math*\",Failing_Kids!$F361,1)),IF(ISERROR(SEARCH(\"*Calc*\",Failing_Kids!$F361,1)),IF(ISERROR(SEARCH(\"*Algebra*\",Failing_Kids!$F361,1)),\"\",\"X\"),\"X\"),\"X\"),\"X\")","v":"X"},{"$f":"IF(ISERROR(SEARCH(\"*Science*\",Failing_Kids!$F361,1)),IF(ISERROR(SEARCH(\"*Bio*\",Failing_Kids!$F361,1)),IF(ISERROR(SEARCH(\"*Chem*\",Failing_Kids!$F361,1)),IF(ISERROR(SEARCH(\"*Physics*\",Failing_Kids!$F361,1)),\"\",\"X\"),\"X\"),\"X\"),\"X\")","v":""},{"$f":"IF(ISERROR(SEARCH(\"*His*\",Failing_Kids!$F361,1)),IF(ISERROR(SEARCH(\"*GOV*\",Failing_Kids!$F361,1)),IF(ISERROR(SEARCH(\"*Econ*\",Failing_Kids!$F361,1)),IF(ISERROR(SEARCH(\"*Soc*\",Failing_Kids!$F361,1)),\"\",\"X\"),\"X\"),\"X\"),\"X\")","v":""},{"$f":"IF(ISERROR(SEARCH(\"*PE*\",Failing_Kids!$F361,1)),\"\",\"X\")","v":""}]
[{"$f":"Failing_Kids!C362","v":"Pope"},{"$f":"Failing_Kids!D362","v":"Natalie"},{"$f":"IF(ISERROR(SEARCH(\"*English*\",Failing_Kids!F362,1)),\"\",\"X \")","v":"X "},{"$f":"IF(ISERROR(SEARCH(\"*Geometry*\",Failing_Kids!$F362,1)),IF(ISERROR(SEARCH(\"*Math*\",Failing_Kids!$F362,1)),IF(ISERROR(SEARCH(\"*Calc*\",Failing_Kids!$F362,1)),IF(ISERROR(SEARCH(\"*Algebra*\",Failing_Kids!$F362,1)),\"\",\"X\"),\"X\"),\"X\"),\"X\")","v":""},{"$f":"IF(ISERROR(SEARCH(\"*Science*\",Failing_Kids!$F362,1)),IF(ISERROR(SEARCH(\"*Bio*\",Failing_Kids!$F362,1)),IF(ISERROR(SEARCH(\"*Chem*\",Failing_Kids!$F362,1)),IF(ISERROR(SEARCH(\"*Physics*\",Failing_Kids!$F362,1)),\"\",\"X\"),\"X\"),\"X\"),\"X\")","v":""},{"$f":"IF(ISERROR(SEARCH(\"*His*\",Failing_Kids!$F362,1)),IF(ISERROR(SEARCH(\"*GOV*\",Failing_Kids!$F362,1)),IF(ISERROR(SEARCH(\"*Econ*\",Failing_Kids!$F362,1)),IF(ISERROR(SEARCH(\"*Soc*\",Failing_Kids!$F362,1)),\"\",\"X\"),\"X\"),\"X\"),\"X\")","v":""},{"$f":"IF(ISERROR(SEARCH(\"*PE*\",Failing_Kids!$F362,1)),\"\",\"X\")","v":""}]
[{"$f":"Failing_Kids!C363","v":"Pope"},{"$f":"Failing_Kids!D363","v":"Natalie"},{"$f":"IF(ISERROR(SEARCH(\"*English*\",Failing_Kids!F363,1)),\"\",\"X \")","v":"X "},{"$f":"IF(ISERROR(SEARCH(\"*Geometry*\",Failing_Kids!$F363,1)),IF(ISERROR(SEARCH(\"*Math*\",Failing_Kids!$F363,1)),IF(ISERROR(SEARCH(\"*Calc*\",Failing_Kids!$F363,1)),IF(ISERROR(SEARCH(\"*Algebra*\",Failing_Kids!$F363,1)),\"\",\"X\"),\"X\"),\"X\"),\"X\")","v":""},{"$f":"IF(ISERROR(SEARCH(\"*Science*\",Failing_Kids!$F363,1)),IF(ISERROR(SEARCH(\"*Bio*\",Failing_Kids!$F363,1)),IF(ISERROR(SEARCH(\"*Chem*\",Failing_Kids!$F363,1)),IF(ISERROR(SEARCH(\"*Physics*\",Failing_Kids!$F363,1)),\"\",\"X\"),\"X\"),\"X\"),\"X\")","v":""},{"$f":"IF(ISERROR(SEARCH(\"*His*\",Failing_Kids!$F363,1)),IF(ISERROR(SEARCH(\"*GOV*\",Failing_Kids!$F363,1)),IF(ISERROR(SEARCH(\"*Econ*\",Failing_Kids!$F363,1)),IF(ISERROR(SEARCH(\"*Soc*\",Failing_Kids!$F363,1)),\"\",\"X\"),\"X\"),\"X\"),\"X\")","v":""},{"$f":"IF(ISERROR(SEARCH(\"*PE*\",Failing_Kids!$F363,1)),\"\",\"X\")","v":""}]
[{"$f":"Failing_Kids!C364","v":"Pope"},{"$f":"Failing_Kids!D364","v":"Natalie"},{"$f":"IF(ISERROR(SEARCH(\"*English*\",Failing_Kids!F364,1)),\"\",\"X \")","v":""},{"$f":"IF(ISERROR(SEARCH(\"*Geometry*\",Failing_Kids!$F364,1)),IF(ISERROR(SEARCH(\"*Math*\",Failing_Kids!$F364,1)),IF(ISERROR(SEARCH(\"*Calc*\",Failing_Kids!$F364,1)),IF(ISERROR(SEARCH(\"*Algebra*\",Failing_Kids!$F364,1)),\"\",\"X\"),\"X\"),\"X\"),\"X\")","v":""},{"$f":"IF(ISERROR(SEARCH(\"*Science*\",Failing_Kids!$F364,1)),IF(ISERROR(SEARCH(\"*Bio*\",Failing_Kids!$F364,1)),IF(ISERROR(SEARCH(\"*Chem*\",Failing_Kids!$F364,1)),IF(ISERROR(SEARCH(\"*Physics*\",Failing_Kids!$F364,1)),\"\",\"X\"),\"X\"),\"X\"),\"X\")","v":""},{"$f":"IF(ISERROR(SEARCH(\"*His*\",Failing_Kids!$F364,1)),IF(ISERROR(SEARCH(\"*GOV*\",Failing_Kids!$F364,1)),IF(ISERROR(SEARCH(\"*Econ*\",Failing_Kids!$F364,1)),IF(ISERROR(SEARCH(\"*Soc*\",Failing_Kids!$F364,1)),\"\",\"X\"),\"X\"),\"X\"),\"X\")","v":"X"},{"$f":"IF(ISERROR(SEARCH(\"*PE*\",Failing_Kids!$F364,1)),\"\",\"X\")","v":""}]
[{"$f":"Failing_Kids!C365","v":"Powers"},{"$f":"Failing_Kids!D365","v":"Sylvia"},{"$f":"IF(ISERROR(SEARCH(\"*English*\",Failing_Kids!F365,1)),\"\",\"X \")","v":""},{"$f":"IF(ISERROR(SEARCH(\"*Geometry*\",Failing_Kids!$F365,1)),IF(ISERROR(SEARCH(\"*Math*\",Failing_Kids!$F365,1)),IF(ISERROR(SEARCH(\"*Calc*\",Failing_Kids!$F365,1)),IF(ISERROR(SEARCH(\"*Algebra*\",Failing_Kids!$F365,1)),\"\",\"X\"),\"X\"),\"X\"),\"X\")","v":"X"},{"$f":"IF(ISERROR(SEARCH(\"*Science*\",Failing_Kids!$F365,1)),IF(ISERROR(SEARCH(\"*Bio*\",Failing_Kids!$F365,1)),IF(ISERROR(SEARCH(\"*Chem*\",Failing_Kids!$F365,1)),IF(ISERROR(SEARCH(\"*Physics*\",Failing_Kids!$F365,1)),\"\",\"X\"),\"X\"),\"X\"),\"X\")","v":""},{"$f":"IF(ISERROR(SEARCH(\"*His*\",Failing_Kids!$F365,1)),IF(ISERROR(SEARCH(\"*GOV*\",Failing_Kids!$F365,1)),IF(ISERROR(SEARCH(\"*Econ*\",Failing_Kids!$F365,1)),IF(ISERROR(SEARCH(\"*Soc*\",Failing_Kids!$F365,1)),\"\",\"X\"),\"X\"),\"X\"),\"X\")","v":""},{"$f":"IF(ISERROR(SEARCH(\"*PE*\",Failing_Kids!$F365,1)),\"\",\"X\")","v":""}]
[{"$f":"Failing_Kids!C366","v":"Powers"},{"$f":"Failing_Kids!D366","v":"Sylvia"},{"$f":"IF(ISERROR(SEARCH(\"*English*\",Failing_Kids!F366,1)),\"\",\"X \")","v":""},{"$f":"IF(ISERROR(SEARCH(\"*Geometry*\",Failing_Kids!$F366,1)),IF(ISERROR(SEARCH(\"*Math*\",Failing_Kids!$F366,1)),IF(ISERROR(SEARCH(\"*Calc*\",Failing_Kids!$F366,1)),IF(ISERROR(SEARCH(\"*Algebra*\",Failing_Kids!$F366,1)),\"\",\"X\"),\"X\"),\"X\"),\"X\")","v":""},{"$f":"IF(ISERROR(SEARCH(\"*Science*\",Failing_Kids!$F366,1)),IF(ISERROR(SEARCH(\"*Bio*\",Failing_Kids!$F366,1)),IF(ISERROR(SEARCH(\"*Chem*\",Failing_Kids!$F366,1)),IF(ISERROR(SEARCH(\"*Physics*\",Failing_Kids!$F366,1)),\"\",\"X\"),\"X\"),\"X\"),\"X\")","v":"X"},{"$f":"IF(ISERROR(SEARCH(\"*His*\",Failing_Kids!$F366,1)),IF(ISERROR(SEARCH(\"*GOV*\",Failing_Kids!$F366,1)),IF(ISERROR(SEARCH(\"*Econ*\",Failing_Kids!$F366,1)),IF(ISERROR(SEARCH(\"*Soc*\",Failing_Kids!$F366,1)),\"\",\"X\"),\"X\"),\"X\"),\"X\")","v":""},{"$f":"IF(ISERROR(SEARCH(\"*PE*\",Failing_Kids!$F366,1)),\"\",\"X\")","v":""}]
[{"$f":"Failing_Kids!C367","v":"Price"},{"$f":"Failing_Kids!D367","v":"Madeline"},{"$f":"IF(ISERROR(SEARCH(\"*English*\",Failing_Kids!F367,1)),\"\",\"X \")","v":""},{"$f":"IF(ISERROR(SEARCH(\"*Geometry*\",Failing_Kids!$F367,1)),IF(ISERROR(SEARCH(\"*Math*\",Failing_Kids!$F367,1)),IF(ISERROR(SEARCH(\"*Calc*\",Failing_Kids!$F367,1)),IF(ISERROR(SEARCH(\"*Algebra*\",Failing_Kids!$F367,1)),\"\",\"X\"),\"X\"),\"X\"),\"X\")","v":""},{"$f":"IF(ISERROR(SEARCH(\"*Science*\",Failing_Kids!$F367,1)),IF(ISERROR(SEARCH(\"*Bio*\",Failing_Kids!$F367,1)),IF(ISERROR(SEARCH(\"*Chem*\",Failing_Kids!$F367,1)),IF(ISERROR(SEARCH(\"*Physics*\",Failing_Kids!$F367,1)),\"\",\"X\"),\"X\"),\"X\"),\"X\")","v":""},{"$f":"IF(ISERROR(SEARCH(\"*His*\",Failing_Kids!$F367,1)),IF(ISERROR(SEARCH(\"*GOV*\",Failing_Kids!$F367,1)),IF(ISERROR(SEARCH(\"*Econ*\",Failing_Kids!$F367,1)),IF(ISERROR(SEARCH(\"*Soc*\",Failing_Kids!$F367,1)),\"\",\"X\"),\"X\"),\"X\"),\"X\")","v":""},{"$f":"IF(ISERROR(SEARCH(\"*PE*\",Failing_Kids!$F367,1)),\"\",\"X\")","v":""}]
[{"$f":"Failing_Kids!C368","v":"Quinn"},{"$f":"Failing_Kids!D368","v":"Amy"},{"$f":"IF(ISERROR(SEARCH(\"*English*\",Failing_Kids!F368,1)),\"\",\"X \")","v":"X "},{"$f":"IF(ISERROR(SEARCH(\"*Geometry*\",Failing_Kids!$F368,1)),IF(ISERROR(SEARCH(\"*Math*\",Failing_Kids!$F368,1)),IF(ISERROR(SEARCH(\"*Calc*\",Failing_Kids!$F368,1)),IF(ISERROR(SEARCH(\"*Algebra*\",Failing_Kids!$F368,1)),\"\",\"X\"),\"X\"),\"X\"),\"X\")","v":""},{"$f":"IF(ISERROR(SEARCH(\"*Science*\",Failing_Kids!$F368,1)),IF(ISERROR(SEARCH(\"*Bio*\",Failing_Kids!$F368,1)),IF(ISERROR(SEARCH(\"*Chem*\",Failing_Kids!$F368,1)),IF(ISERROR(SEARCH(\"*Physics*\",Failing_Kids!$F368,1)),\"\",\"X\"),\"X\"),\"X\"),\"X\")","v":""},{"$f":"IF(ISERROR(SEARCH(\"*His*\",Failing_Kids!$F368,1)),IF(ISERROR(SEARCH(\"*GOV*\",Failing_Kids!$F368,1)),IF(ISERROR(SEARCH(\"*Econ*\",Failing_Kids!$F368,1)),IF(ISERROR(SEARCH(\"*Soc*\",Failing_Kids!$F368,1)),\"\",\"X\"),\"X\"),\"X\"),\"X\")","v":""},{"$f":"IF(ISERROR(SEARCH(\"*PE*\",Failing_Kids!$F368,1)),\"\",\"X\")","v":""}]
[{"$f":"Failing_Kids!C369","v":"Quinn"},{"$f":"Failing_Kids!D369","v":"Amy"},{"$f":"IF(ISERROR(SEARCH(\"*English*\",Failing_Kids!F369,1)),\"\",\"X \")","v":""},{"$f":"IF(ISERROR(SEARCH(\"*Geometry*\",Failing_Kids!$F369,1)),IF(ISERROR(SEARCH(\"*Math*\",Failing_Kids!$F369,1)),IF(ISERROR(SEARCH(\"*Calc*\",Failing_Kids!$F369,1)),IF(ISERROR(SEARCH(\"*Algebra*\",Failing_Kids!$F369,1)),\"\",\"X\"),\"X\"),\"X\"),\"X\")","v":""},{"$f":"IF(ISERROR(SEARCH(\"*Science*\",Failing_Kids!$F369,1)),IF(ISERROR(SEARCH(\"*Bio*\",Failing_Kids!$F369,1)),IF(ISERROR(SEARCH(\"*Chem*\",Failing_Kids!$F369,1)),IF(ISERROR(SEARCH(\"*Physics*\",Failing_Kids!$F369,1)),\"\",\"X\"),\"X\"),\"X\"),\"X\")","v":""},{"$f":"IF(ISERROR(SEARCH(\"*His*\",Failing_Kids!$F369,1)),IF(ISERROR(SEARCH(\"*GOV*\",Failing_Kids!$F369,1)),IF(ISERROR(SEARCH(\"*Econ*\",Failing_Kids!$F369,1)),IF(ISERROR(SEARCH(\"*Soc*\",Failing_Kids!$F369,1)),\"\",\"X\"),\"X\"),\"X\"),\"X\")","v":"X"},{"$f":"IF(ISERROR(SEARCH(\"*PE*\",Failing_Kids!$F369,1)),\"\",\"X\")","v":""}]
[{"$f":"Failing_Kids!C370","v":"Quinn"},{"$f":"Failing_Kids!D370","v":"Matthew"},{"$f":"IF(ISERROR(SEARCH(\"*English*\",Failing_Kids!F370,1)),\"\",\"X \")","v":""},{"$f":"IF(ISERROR(SEARCH(\"*Geometry*\",Failing_Kids!$F370,1)),IF(ISERROR(SEARCH(\"*Math*\",Failing_Kids!$F370,1)),IF(ISERROR(SEARCH(\"*Calc*\",Failing_Kids!$F370,1)),IF(ISERROR(SEARCH(\"*Algebra*\",Failing_Kids!$F370,1)),\"\",\"X\"),\"X\"),\"X\"),\"X\")","v":"X"},{"$f":"IF(ISERROR(SEARCH(\"*Science*\",Failing_Kids!$F370,1)),IF(ISERROR(SEARCH(\"*Bio*\",Failing_Kids!$F370,1)),IF(ISERROR(SEARCH(\"*Chem*\",Failing_Kids!$F370,1)),IF(ISERROR(SEARCH(\"*Physics*\",Failing_Kids!$F370,1)),\"\",\"X\"),\"X\"),\"X\"),\"X\")","v":""},{"$f":"IF(ISERROR(SEARCH(\"*His*\",Failing_Kids!$F370,1)),IF(ISERROR(SEARCH(\"*GOV*\",Failing_Kids!$F370,1)),IF(ISERROR(SEARCH(\"*Econ*\",Failing_Kids!$F370,1)),IF(ISERROR(SEARCH(\"*Soc*\",Failing_Kids!$F370,1)),\"\",\"X\"),\"X\"),\"X\"),\"X\")","v":""},{"$f":"IF(ISERROR(SEARCH(\"*PE*\",Failing_Kids!$F370,1)),\"\",\"X\")","v":""}]
[{"$f":"Failing_Kids!C371","v":"Quinn"},{"$f":"Failing_Kids!D371","v":"Matthew"},{"$f":"IF(ISERROR(SEARCH(\"*English*\",Failing_Kids!F371,1)),\"\",\"X \")","v":""},{"$f":"IF(ISERROR(SEARCH(\"*Geometry*\",Failing_Kids!$F371,1)),IF(ISERROR(SEARCH(\"*Math*\",Failing_Kids!$F371,1)),IF(ISERROR(SEARCH(\"*Calc*\",Failing_Kids!$F371,1)),IF(ISERROR(SEARCH(\"*Algebra*\",Failing_Kids!$F371,1)),\"\",\"X\"),\"X\"),\"X\"),\"X\")","v":""},{"$f":"IF(ISERROR(SEARCH(\"*Science*\",Failing_Kids!$F371,1)),IF(ISERROR(SEARCH(\"*Bio*\",Failing_Kids!$F371,1)),IF(ISERROR(SEARCH(\"*Chem*\",Failing_Kids!$F371,1)),IF(ISERROR(SEARCH(\"*Physics*\",Failing_Kids!$F371,1)),\"\",\"X\"),\"X\"),\"X\"),\"X\")","v":""},{"$f":"IF(ISERROR(SEARCH(\"*His*\",Failing_Kids!$F371,1)),IF(ISERROR(SEARCH(\"*GOV*\",Failing_Kids!$F371,1)),IF(ISERROR(SEARCH(\"*Econ*\",Failing_Kids!$F371,1)),IF(ISERROR(SEARCH(\"*Soc*\",Failing_Kids!$F371,1)),\"\",\"X\"),\"X\"),\"X\"),\"X\")","v":"X"},{"$f":"IF(ISERROR(SEARCH(\"*PE*\",Failing_Kids!$F371,1)),\"\",\"X\")","v":""}]
[{"$f":"Failing_Kids!C372","v":"Richardson"},{"$f":"Failing_Kids!D372","v":"Christopher"},{"$f":"IF(ISERROR(SEARCH(\"*English*\",Failing_Kids!F372,1)),\"\",\"X \")","v":""},{"$f":"IF(ISERROR(SEARCH(\"*Geometry*\",Failing_Kids!$F372,1)),IF(ISERROR(SEARCH(\"*Math*\",Failing_Kids!$F372,1)),IF(ISERROR(SEARCH(\"*Calc*\",Failing_Kids!$F372,1)),IF(ISERROR(SEARCH(\"*Algebra*\",Failing_Kids!$F372,1)),\"\",\"X\"),\"X\"),\"X\"),\"X\")","v":"X"},{"$f":"IF(ISERROR(SEARCH(\"*Science*\",Failing_Kids!$F372,1)),IF(ISERROR(SEARCH(\"*Bio*\",Failing_Kids!$F372,1)),IF(ISERROR(SEARCH(\"*Chem*\",Failing_Kids!$F372,1)),IF(ISERROR(SEARCH(\"*Physics*\",Failing_Kids!$F372,1)),\"\",\"X\"),\"X\"),\"X\"),\"X\")","v":""},{"$f":"IF(ISERROR(SEARCH(\"*His*\",Failing_Kids!$F372,1)),IF(ISERROR(SEARCH(\"*GOV*\",Failing_Kids!$F372,1)),IF(ISERROR(SEARCH(\"*Econ*\",Failing_Kids!$F372,1)),IF(ISERROR(SEARCH(\"*Soc*\",Failing_Kids!$F372,1)),\"\",\"X\"),\"X\"),\"X\"),\"X\")","v":""},{"$f":"IF(ISERROR(SEARCH(\"*PE*\",Failing_Kids!$F372,1)),\"\",\"X\")","v":""}]
[{"$f":"Failing_Kids!C373","v":"Richmond"},{"$f":"Failing_Kids!D373","v":"Emma"},{"$f":"IF(ISERROR(SEARCH(\"*English*\",Failing_Kids!F373,1)),\"\",\"X \")","v":"X "},{"$f":"IF(ISERROR(SEARCH(\"*Geometry*\",Failing_Kids!$F373,1)),IF(ISERROR(SEARCH(\"*Math*\",Failing_Kids!$F373,1)),IF(ISERROR(SEARCH(\"*Calc*\",Failing_Kids!$F373,1)),IF(ISERROR(SEARCH(\"*Algebra*\",Failing_Kids!$F373,1)),\"\",\"X\"),\"X\"),\"X\"),\"X\")","v":""},{"$f":"IF(ISERROR(SEARCH(\"*Science*\",Failing_Kids!$F373,1)),IF(ISERROR(SEARCH(\"*Bio*\",Failing_Kids!$F373,1)),IF(ISERROR(SEARCH(\"*Chem*\",Failing_Kids!$F373,1)),IF(ISERROR(SEARCH(\"*Physics*\",Failing_Kids!$F373,1)),\"\",\"X\"),\"X\"),\"X\"),\"X\")","v":""},{"$f":"IF(ISERROR(SEARCH(\"*His*\",Failing_Kids!$F373,1)),IF(ISERROR(SEARCH(\"*GOV*\",Failing_Kids!$F373,1)),IF(ISERROR(SEARCH(\"*Econ*\",Failing_Kids!$F373,1)),IF(ISERROR(SEARCH(\"*Soc*\",Failing_Kids!$F373,1)),\"\",\"X\"),\"X\"),\"X\"),\"X\")","v":""},{"$f":"IF(ISERROR(SEARCH(\"*PE*\",Failing_Kids!$F373,1)),\"\",\"X\")","v":""}]
[{"$f":"Failing_Kids!C374","v":"Riggs"},{"$f":"Failing_Kids!D374","v":"Kathryn"},{"$f":"IF(ISERROR(SEARCH(\"*English*\",Failing_Kids!F374,1)),\"\",\"X \")","v":"X "},{"$f":"IF(ISERROR(SEARCH(\"*Geometry*\",Failing_Kids!$F374,1)),IF(ISERROR(SEARCH(\"*Math*\",Failing_Kids!$F374,1)),IF(ISERROR(SEARCH(\"*Calc*\",Failing_Kids!$F374,1)),IF(ISERROR(SEARCH(\"*Algebra*\",Failing_Kids!$F374,1)),\"\",\"X\"),\"X\"),\"X\"),\"X\")","v":""},{"$f":"IF(ISERROR(SEARCH(\"*Science*\",Failing_Kids!$F374,1)),IF(ISERROR(SEARCH(\"*Bio*\",Failing_Kids!$F374,1)),IF(ISERROR(SEARCH(\"*Chem*\",Failing_Kids!$F374,1)),IF(ISERROR(SEARCH(\"*Physics*\",Failing_Kids!$F374,1)),\"\",\"X\"),\"X\"),\"X\"),\"X\")","v":""},{"$f":"IF(ISERROR(SEARCH(\"*His*\",Failing_Kids!$F374,1)),IF(ISERROR(SEARCH(\"*GOV*\",Failing_Kids!$F374,1)),IF(ISERROR(SEARCH(\"*Econ*\",Failing_Kids!$F374,1)),IF(ISERROR(SEARCH(\"*Soc*\",Failing_Kids!$F374,1)),\"\",\"X\"),\"X\"),\"X\"),\"X\")","v":""},{"$f":"IF(ISERROR(SEARCH(\"*PE*\",Failing_Kids!$F374,1)),\"\",\"X\")","v":""}]
[{"$f":"Failing_Kids!C375","v":"Riggs"},{"$f":"Failing_Kids!D375","v":"Wilma"},{"$f":"IF(ISERROR(SEARCH(\"*English*\",Failing_Kids!F375,1)),\"\",\"X \")","v":""},{"$f":"IF(ISERROR(SEARCH(\"*Geometry*\",Failing_Kids!$F375,1)),IF(ISERROR(SEARCH(\"*Math*\",Failing_Kids!$F375,1)),IF(ISERROR(SEARCH(\"*Calc*\",Failing_Kids!$F375,1)),IF(ISERROR(SEARCH(\"*Algebra*\",Failing_Kids!$F375,1)),\"\",\"X\"),\"X\"),\"X\"),\"X\")","v":""},{"$f":"IF(ISERROR(SEARCH(\"*Science*\",Failing_Kids!$F375,1)),IF(ISERROR(SEARCH(\"*Bio*\",Failing_Kids!$F375,1)),IF(ISERROR(SEARCH(\"*Chem*\",Failing_Kids!$F375,1)),IF(ISERROR(SEARCH(\"*Physics*\",Failing_Kids!$F375,1)),\"\",\"X\"),\"X\"),\"X\"),\"X\")","v":""},{"$f":"IF(ISERROR(SEARCH(\"*His*\",Failing_Kids!$F375,1)),IF(ISERROR(SEARCH(\"*GOV*\",Failing_Kids!$F375,1)),IF(ISERROR(SEARCH(\"*Econ*\",Failing_Kids!$F375,1)),IF(ISERROR(SEARCH(\"*Soc*\",Failing_Kids!$F375,1)),\"\",\"X\"),\"X\"),\"X\"),\"X\")","v":""},{"$f":"IF(ISERROR(SEARCH(\"*PE*\",Failing_Kids!$F375,1)),\"\",\"X\")","v":""}]
[{"$f":"Failing_Kids!C376","v":"Riggs"},{"$f":"Failing_Kids!D376","v":"Wilma"},{"$f":"IF(ISERROR(SEARCH(\"*English*\",Failing_Kids!F376,1)),\"\",\"X \")","v":""},{"$f":"IF(ISERROR(SEARCH(\"*Geometry*\",Failing_Kids!$F376,1)),IF(ISERROR(SEARCH(\"*Math*\",Failing_Kids!$F376,1)),IF(ISERROR(SEARCH(\"*Calc*\",Failing_Kids!$F376,1)),IF(ISERROR(SEARCH(\"*Algebra*\",Failing_Kids!$F376,1)),\"\",\"X\"),\"X\"),\"X\"),\"X\")","v":""},{"$f":"IF(ISERROR(SEARCH(\"*Science*\",Failing_Kids!$F376,1)),IF(ISERROR(SEARCH(\"*Bio*\",Failing_Kids!$F376,1)),IF(ISERROR(SEARCH(\"*Chem*\",Failing_Kids!$F376,1)),IF(ISERROR(SEARCH(\"*Physics*\",Failing_Kids!$F376,1)),\"\",\"X\"),\"X\"),\"X\"),\"X\")","v":"X"},{"$f":"IF(ISERROR(SEARCH(\"*His*\",Failing_Kids!$F376,1)),IF(ISERROR(SEARCH(\"*GOV*\",Failing_Kids!$F376,1)),IF(ISERROR(SEARCH(\"*Econ*\",Failing_Kids!$F376,1)),IF(ISERROR(SEARCH(\"*Soc*\",Failing_Kids!$F376,1)),\"\",\"X\"),\"X\"),\"X\"),\"X\")","v":""},{"$f":"IF(ISERROR(SEARCH(\"*PE*\",Failing_Kids!$F376,1)),\"\",\"X\")","v":""}]
[{"$f":"Failing_Kids!C377","v":"Rivas"},{"$f":"Failing_Kids!D377","v":"Jeremy"},{"$f":"IF(ISERROR(SEARCH(\"*English*\",Failing_Kids!F377,1)),\"\",\"X \")","v":""},{"$f":"IF(ISERROR(SEARCH(\"*Geometry*\",Failing_Kids!$F377,1)),IF(ISERROR(SEARCH(\"*Math*\",Failing_Kids!$F377,1)),IF(ISERROR(SEARCH(\"*Calc*\",Failing_Kids!$F377,1)),IF(ISERROR(SEARCH(\"*Algebra*\",Failing_Kids!$F377,1)),\"\",\"X\"),\"X\"),\"X\"),\"X\")","v":""},{"$f":"IF(ISERROR(SEARCH(\"*Science*\",Failing_Kids!$F377,1)),IF(ISERROR(SEARCH(\"*Bio*\",Failing_Kids!$F377,1)),IF(ISERROR(SEARCH(\"*Chem*\",Failing_Kids!$F377,1)),IF(ISERROR(SEARCH(\"*Physics*\",Failing_Kids!$F377,1)),\"\",\"X\"),\"X\"),\"X\"),\"X\")","v":"X"},{"$f":"IF(ISERROR(SEARCH(\"*His*\",Failing_Kids!$F377,1)),IF(ISERROR(SEARCH(\"*GOV*\",Failing_Kids!$F377,1)),IF(ISERROR(SEARCH(\"*Econ*\",Failing_Kids!$F377,1)),IF(ISERROR(SEARCH(\"*Soc*\",Failing_Kids!$F377,1)),\"\",\"X\"),\"X\"),\"X\"),\"X\")","v":""},{"$f":"IF(ISERROR(SEARCH(\"*PE*\",Failing_Kids!$F377,1)),\"\",\"X\")","v":""}]
[{"$f":"Failing_Kids!C378","v":"Rocha"},{"$f":"Failing_Kids!D378","v":"Mildred"},{"$f":"IF(ISERROR(SEARCH(\"*English*\",Failing_Kids!F378,1)),\"\",\"X \")","v":"X "},{"$f":"IF(ISERROR(SEARCH(\"*Geometry*\",Failing_Kids!$F378,1)),IF(ISERROR(SEARCH(\"*Math*\",Failing_Kids!$F378,1)),IF(ISERROR(SEARCH(\"*Calc*\",Failing_Kids!$F378,1)),IF(ISERROR(SEARCH(\"*Algebra*\",Failing_Kids!$F378,1)),\"\",\"X\"),\"X\"),\"X\"),\"X\")","v":""},{"$f":"IF(ISERROR(SEARCH(\"*Science*\",Failing_Kids!$F378,1)),IF(ISERROR(SEARCH(\"*Bio*\",Failing_Kids!$F378,1)),IF(ISERROR(SEARCH(\"*Chem*\",Failing_Kids!$F378,1)),IF(ISERROR(SEARCH(\"*Physics*\",Failing_Kids!$F378,1)),\"\",\"X\"),\"X\"),\"X\"),\"X\")","v":""},{"$f":"IF(ISERROR(SEARCH(\"*His*\",Failing_Kids!$F378,1)),IF(ISERROR(SEARCH(\"*GOV*\",Failing_Kids!$F378,1)),IF(ISERROR(SEARCH(\"*Econ*\",Failing_Kids!$F378,1)),IF(ISERROR(SEARCH(\"*Soc*\",Failing_Kids!$F378,1)),\"\",\"X\"),\"X\"),\"X\"),\"X\")","v":""},{"$f":"IF(ISERROR(SEARCH(\"*PE*\",Failing_Kids!$F378,1)),\"\",\"X\")","v":""}]
[{"$f":"Failing_Kids!C379","v":"Rodriquez"},{"$f":"Failing_Kids!D379","v":"Delores"},{"$f":"IF(ISERROR(SEARCH(\"*English*\",Failing_Kids!F379,1)),\"\",\"X \")","v":""},{"$f":"IF(ISERROR(SEARCH(\"*Geometry*\",Failing_Kids!$F379,1)),IF(ISERROR(SEARCH(\"*Math*\",Failing_Kids!$F379,1)),IF(ISERROR(SEARCH(\"*Calc*\",Failing_Kids!$F379,1)),IF(ISERROR(SEARCH(\"*Algebra*\",Failing_Kids!$F379,1)),\"\",\"X\"),\"X\"),\"X\"),\"X\")","v":"X"},{"$f":"IF(ISERROR(SEARCH(\"*Science*\",Failing_Kids!$F379,1)),IF(ISERROR(SEARCH(\"*Bio*\",Failing_Kids!$F379,1)),IF(ISERROR(SEARCH(\"*Chem*\",Failing_Kids!$F379,1)),IF(ISERROR(SEARCH(\"*Physics*\",Failing_Kids!$F379,1)),\"\",\"X\"),\"X\"),\"X\"),\"X\")","v":""},{"$f":"IF(ISERROR(SEARCH(\"*His*\",Failing_Kids!$F379,1)),IF(ISERROR(SEARCH(\"*GOV*\",Failing_Kids!$F379,1)),IF(ISERROR(SEARCH(\"*Econ*\",Failing_Kids!$F379,1)),IF(ISERROR(SEARCH(\"*Soc*\",Failing_Kids!$F379,1)),\"\",\"X\"),\"X\"),\"X\"),\"X\")","v":""},{"$f":"IF(ISERROR(SEARCH(\"*PE*\",Failing_Kids!$F379,1)),\"\",\"X\")","v":""}]
[{"$f":"Failing_Kids!C380","v":"Rodriquez"},{"$f":"Failing_Kids!D380","v":"Delores"},{"$f":"IF(ISERROR(SEARCH(\"*English*\",Failing_Kids!F380,1)),\"\",\"X \")","v":"X "},{"$f":"IF(ISERROR(SEARCH(\"*Geometry*\",Failing_Kids!$F380,1)),IF(ISERROR(SEARCH(\"*Math*\",Failing_Kids!$F380,1)),IF(ISERROR(SEARCH(\"*Calc*\",Failing_Kids!$F380,1)),IF(ISERROR(SEARCH(\"*Algebra*\",Failing_Kids!$F380,1)),\"\",\"X\"),\"X\"),\"X\"),\"X\")","v":""},{"$f":"IF(ISERROR(SEARCH(\"*Science*\",Failing_Kids!$F380,1)),IF(ISERROR(SEARCH(\"*Bio*\",Failing_Kids!$F380,1)),IF(ISERROR(SEARCH(\"*Chem*\",Failing_Kids!$F380,1)),IF(ISERROR(SEARCH(\"*Physics*\",Failing_Kids!$F380,1)),\"\",\"X\"),\"X\"),\"X\"),\"X\")","v":""},{"$f":"IF(ISERROR(SEARCH(\"*His*\",Failing_Kids!$F380,1)),IF(ISERROR(SEARCH(\"*GOV*\",Failing_Kids!$F380,1)),IF(ISERROR(SEARCH(\"*Econ*\",Failing_Kids!$F380,1)),IF(ISERROR(SEARCH(\"*Soc*\",Failing_Kids!$F380,1)),\"\",\"X\"),\"X\"),\"X\"),\"X\")","v":""},{"$f":"IF(ISERROR(SEARCH(\"*PE*\",Failing_Kids!$F380,1)),\"\",\"X\")","v":""}]
[{"$f":"Failing_Kids!C381","v":"Rodriquez"},{"$f":"Failing_Kids!D381","v":"Delores"},{"$f":"IF(ISERROR(SEARCH(\"*English*\",Failing_Kids!F381,1)),\"\",\"X \")","v":""},{"$f":"IF(ISERROR(SEARCH(\"*Geometry*\",Failing_Kids!$F381,1)),IF(ISERROR(SEARCH(\"*Math*\",Failing_Kids!$F381,1)),IF(ISERROR(SEARCH(\"*Calc*\",Failing_Kids!$F381,1)),IF(ISERROR(SEARCH(\"*Algebra*\",Failing_Kids!$F381,1)),\"\",\"X\"),\"X\"),\"X\"),\"X\")","v":""},{"$f":"IF(ISERROR(SEARCH(\"*Science*\",Failing_Kids!$F381,1)),IF(ISERROR(SEARCH(\"*Bio*\",Failing_Kids!$F381,1)),IF(ISERROR(SEARCH(\"*Chem*\",Failing_Kids!$F381,1)),IF(ISERROR(SEARCH(\"*Physics*\",Failing_Kids!$F381,1)),\"\",\"X\"),\"X\"),\"X\"),\"X\")","v":"X"},{"$f":"IF(ISERROR(SEARCH(\"*His*\",Failing_Kids!$F381,1)),IF(ISERROR(SEARCH(\"*GOV*\",Failing_Kids!$F381,1)),IF(ISERROR(SEARCH(\"*Econ*\",Failing_Kids!$F381,1)),IF(ISERROR(SEARCH(\"*Soc*\",Failing_Kids!$F381,1)),\"\",\"X\"),\"X\"),\"X\"),\"X\")","v":""},{"$f":"IF(ISERROR(SEARCH(\"*PE*\",Failing_Kids!$F381,1)),\"\",\"X\")","v":""}]
[{"$f":"Failing_Kids!C382","v":"Romero"},{"$f":"Failing_Kids!D382","v":"Jose"},{"$f":"IF(ISERROR(SEARCH(\"*English*\",Failing_Kids!F382,1)),\"\",\"X \")","v":""},{"$f":"IF(ISERROR(SEARCH(\"*Geometry*\",Failing_Kids!$F382,1)),IF(ISERROR(SEARCH(\"*Math*\",Failing_Kids!$F382,1)),IF(ISERROR(SEARCH(\"*Calc*\",Failing_Kids!$F382,1)),IF(ISERROR(SEARCH(\"*Algebra*\",Failing_Kids!$F382,1)),\"\",\"X\"),\"X\"),\"X\"),\"X\")","v":""},{"$f":"IF(ISERROR(SEARCH(\"*Science*\",Failing_Kids!$F382,1)),IF(ISERROR(SEARCH(\"*Bio*\",Failing_Kids!$F382,1)),IF(ISERROR(SEARCH(\"*Chem*\",Failing_Kids!$F382,1)),IF(ISERROR(SEARCH(\"*Physics*\",Failing_Kids!$F382,1)),\"\",\"X\"),\"X\"),\"X\"),\"X\")","v":"X"},{"$f":"IF(ISERROR(SEARCH(\"*His*\",Failing_Kids!$F382,1)),IF(ISERROR(SEARCH(\"*GOV*\",Failing_Kids!$F382,1)),IF(ISERROR(SEARCH(\"*Econ*\",Failing_Kids!$F382,1)),IF(ISERROR(SEARCH(\"*Soc*\",Failing_Kids!$F382,1)),\"\",\"X\"),\"X\"),\"X\"),\"X\")","v":""},{"$f":"IF(ISERROR(SEARCH(\"*PE*\",Failing_Kids!$F382,1)),\"\",\"X\")","v":""}]
[{"$f":"Failing_Kids!C383","v":"Ross"},{"$f":"Failing_Kids!D383","v":"Kristin"},{"$f":"IF(ISERROR(SEARCH(\"*English*\",Failing_Kids!F383,1)),\"\",\"X \")","v":""},{"$f":"IF(ISERROR(SEARCH(\"*Geometry*\",Failing_Kids!$F383,1)),IF(ISERROR(SEARCH(\"*Math*\",Failing_Kids!$F383,1)),IF(ISERROR(SEARCH(\"*Calc*\",Failing_Kids!$F383,1)),IF(ISERROR(SEARCH(\"*Algebra*\",Failing_Kids!$F383,1)),\"\",\"X\"),\"X\"),\"X\"),\"X\")","v":"X"},{"$f":"IF(ISERROR(SEARCH(\"*Science*\",Failing_Kids!$F383,1)),IF(ISERROR(SEARCH(\"*Bio*\",Failing_Kids!$F383,1)),IF(ISERROR(SEARCH(\"*Chem*\",Failing_Kids!$F383,1)),IF(ISERROR(SEARCH(\"*Physics*\",Failing_Kids!$F383,1)),\"\",\"X\"),\"X\"),\"X\"),\"X\")","v":""},{"$f":"IF(ISERROR(SEARCH(\"*His*\",Failing_Kids!$F383,1)),IF(ISERROR(SEARCH(\"*GOV*\",Failing_Kids!$F383,1)),IF(ISERROR(SEARCH(\"*Econ*\",Failing_Kids!$F383,1)),IF(ISERROR(SEARCH(\"*Soc*\",Failing_Kids!$F383,1)),\"\",\"X\"),\"X\"),\"X\"),\"X\")","v":""},{"$f":"IF(ISERROR(SEARCH(\"*PE*\",Failing_Kids!$F383,1)),\"\",\"X\")","v":""}]
[{"$f":"Failing_Kids!C384","v":"Ross"},{"$f":"Failing_Kids!D384","v":"Scott"},{"$f":"IF(ISERROR(SEARCH(\"*English*\",Failing_Kids!F384,1)),\"\",\"X \")","v":""},{"$f":"IF(ISERROR(SEARCH(\"*Geometry*\",Failing_Kids!$F384,1)),IF(ISERROR(SEARCH(\"*Math*\",Failing_Kids!$F384,1)),IF(ISERROR(SEARCH(\"*Calc*\",Failing_Kids!$F384,1)),IF(ISERROR(SEARCH(\"*Algebra*\",Failing_Kids!$F384,1)),\"\",\"X\"),\"X\"),\"X\"),\"X\")","v":""},{"$f":"IF(ISERROR(SEARCH(\"*Science*\",Failing_Kids!$F384,1)),IF(ISERROR(SEARCH(\"*Bio*\",Failing_Kids!$F384,1)),IF(ISERROR(SEARCH(\"*Chem*\",Failing_Kids!$F384,1)),IF(ISERROR(SEARCH(\"*Physics*\",Failing_Kids!$F384,1)),\"\",\"X\"),\"X\"),\"X\"),\"X\")","v":""},{"$f":"IF(ISERROR(SEARCH(\"*His*\",Failing_Kids!$F384,1)),IF(ISERROR(SEARCH(\"*GOV*\",Failing_Kids!$F384,1)),IF(ISERROR(SEARCH(\"*Econ*\",Failing_Kids!$F384,1)),IF(ISERROR(SEARCH(\"*Soc*\",Failing_Kids!$F384,1)),\"\",\"X\"),\"X\"),\"X\"),\"X\")","v":"X"},{"$f":"IF(ISERROR(SEARCH(\"*PE*\",Failing_Kids!$F384,1)),\"\",\"X\")","v":""}]
[{"$f":"Failing_Kids!C385","v":"Ross"},{"$f":"Failing_Kids!D385","v":"Scott"},{"$f":"IF(ISERROR(SEARCH(\"*English*\",Failing_Kids!F385,1)),\"\",\"X \")","v":""},{"$f":"IF(ISERROR(SEARCH(\"*Geometry*\",Failing_Kids!$F385,1)),IF(ISERROR(SEARCH(\"*Math*\",Failing_Kids!$F385,1)),IF(ISERROR(SEARCH(\"*Calc*\",Failing_Kids!$F385,1)),IF(ISERROR(SEARCH(\"*Algebra*\",Failing_Kids!$F385,1)),\"\",\"X\"),\"X\"),\"X\"),\"X\")","v":"X"},{"$f":"IF(ISERROR(SEARCH(\"*Science*\",Failing_Kids!$F385,1)),IF(ISERROR(SEARCH(\"*Bio*\",Failing_Kids!$F385,1)),IF(ISERROR(SEARCH(\"*Chem*\",Failing_Kids!$F385,1)),IF(ISERROR(SEARCH(\"*Physics*\",Failing_Kids!$F385,1)),\"\",\"X\"),\"X\"),\"X\"),\"X\")","v":""},{"$f":"IF(ISERROR(SEARCH(\"*His*\",Failing_Kids!$F385,1)),IF(ISERROR(SEARCH(\"*GOV*\",Failing_Kids!$F385,1)),IF(ISERROR(SEARCH(\"*Econ*\",Failing_Kids!$F385,1)),IF(ISERROR(SEARCH(\"*Soc*\",Failing_Kids!$F385,1)),\"\",\"X\"),\"X\"),\"X\"),\"X\")","v":""},{"$f":"IF(ISERROR(SEARCH(\"*PE*\",Failing_Kids!$F385,1)),\"\",\"X\")","v":""}]
[{"$f":"Failing_Kids!C386","v":"Ross"},{"$f":"Failing_Kids!D386","v":"Scott"},{"$f":"IF(ISERROR(SEARCH(\"*English*\",Failing_Kids!F386,1)),\"\",\"X \")","v":"X "},{"$f":"IF(ISERROR(SEARCH(\"*Geometry*\",Failing_Kids!$F386,1)),IF(ISERROR(SEARCH(\"*Math*\",Failing_Kids!$F386,1)),IF(ISERROR(SEARCH(\"*Calc*\",Failing_Kids!$F386,1)),IF(ISERROR(SEARCH(\"*Algebra*\",Failing_Kids!$F386,1)),\"\",\"X\"),\"X\"),\"X\"),\"X\")","v":""},{"$f":"IF(ISERROR(SEARCH(\"*Science*\",Failing_Kids!$F386,1)),IF(ISERROR(SEARCH(\"*Bio*\",Failing_Kids!$F386,1)),IF(ISERROR(SEARCH(\"*Chem*\",Failing_Kids!$F386,1)),IF(ISERROR(SEARCH(\"*Physics*\",Failing_Kids!$F386,1)),\"\",\"X\"),\"X\"),\"X\"),\"X\")","v":""},{"$f":"IF(ISERROR(SEARCH(\"*His*\",Failing_Kids!$F386,1)),IF(ISERROR(SEARCH(\"*GOV*\",Failing_Kids!$F386,1)),IF(ISERROR(SEARCH(\"*Econ*\",Failing_Kids!$F386,1)),IF(ISERROR(SEARCH(\"*Soc*\",Failing_Kids!$F386,1)),\"\",\"X\"),\"X\"),\"X\"),\"X\")","v":""},{"$f":"IF(ISERROR(SEARCH(\"*PE*\",Failing_Kids!$F386,1)),\"\",\"X\")","v":""}]
[{"$f":"Failing_Kids!C387","v":"Rowe"},{"$f":"Failing_Kids!D387","v":"Chris"},{"$f":"IF(ISERROR(SEARCH(\"*English*\",Failing_Kids!F387,1)),\"\",\"X \")","v":""},{"$f":"IF(ISERROR(SEARCH(\"*Geometry*\",Failing_Kids!$F387,1)),IF(ISERROR(SEARCH(\"*Math*\",Failing_Kids!$F387,1)),IF(ISERROR(SEARCH(\"*Calc*\",Failing_Kids!$F387,1)),IF(ISERROR(SEARCH(\"*Algebra*\",Failing_Kids!$F387,1)),\"\",\"X\"),\"X\"),\"X\"),\"X\")","v":"X"},{"$f":"IF(ISERROR(SEARCH(\"*Science*\",Failing_Kids!$F387,1)),IF(ISERROR(SEARCH(\"*Bio*\",Failing_Kids!$F387,1)),IF(ISERROR(SEARCH(\"*Chem*\",Failing_Kids!$F387,1)),IF(ISERROR(SEARCH(\"*Physics*\",Failing_Kids!$F387,1)),\"\",\"X\"),\"X\"),\"X\"),\"X\")","v":""},{"$f":"IF(ISERROR(SEARCH(\"*His*\",Failing_Kids!$F387,1)),IF(ISERROR(SEARCH(\"*GOV*\",Failing_Kids!$F387,1)),IF(ISERROR(SEARCH(\"*Econ*\",Failing_Kids!$F387,1)),IF(ISERROR(SEARCH(\"*Soc*\",Failing_Kids!$F387,1)),\"\",\"X\"),\"X\"),\"X\"),\"X\")","v":""},{"$f":"IF(ISERROR(SEARCH(\"*PE*\",Failing_Kids!$F387,1)),\"\",\"X\")","v":""}]
[{"$f":"Failing_Kids!C388","v":"Rowe"},{"$f":"Failing_Kids!D388","v":"Chris"},{"$f":"IF(ISERROR(SEARCH(\"*English*\",Failing_Kids!F388,1)),\"\",\"X \")","v":""},{"$f":"IF(ISERROR(SEARCH(\"*Geometry*\",Failing_Kids!$F388,1)),IF(ISERROR(SEARCH(\"*Math*\",Failing_Kids!$F388,1)),IF(ISERROR(SEARCH(\"*Calc*\",Failing_Kids!$F388,1)),IF(ISERROR(SEARCH(\"*Algebra*\",Failing_Kids!$F388,1)),\"\",\"X\"),\"X\"),\"X\"),\"X\")","v":""},{"$f":"IF(ISERROR(SEARCH(\"*Science*\",Failing_Kids!$F388,1)),IF(ISERROR(SEARCH(\"*Bio*\",Failing_Kids!$F388,1)),IF(ISERROR(SEARCH(\"*Chem*\",Failing_Kids!$F388,1)),IF(ISERROR(SEARCH(\"*Physics*\",Failing_Kids!$F388,1)),\"\",\"X\"),\"X\"),\"X\"),\"X\")","v":"X"},{"$f":"IF(ISERROR(SEARCH(\"*His*\",Failing_Kids!$F388,1)),IF(ISERROR(SEARCH(\"*GOV*\",Failing_Kids!$F388,1)),IF(ISERROR(SEARCH(\"*Econ*\",Failing_Kids!$F388,1)),IF(ISERROR(SEARCH(\"*Soc*\",Failing_Kids!$F388,1)),\"\",\"X\"),\"X\"),\"X\"),\"X\")","v":""},{"$f":"IF(ISERROR(SEARCH(\"*PE*\",Failing_Kids!$F388,1)),\"\",\"X\")","v":""}]
[{"$f":"Failing_Kids!C389","v":"Rowe"},{"$f":"Failing_Kids!D389","v":"Chris"},{"$f":"IF(ISERROR(SEARCH(\"*English*\",Failing_Kids!F389,1)),\"\",\"X \")","v":"X "},{"$f":"IF(ISERROR(SEARCH(\"*Geometry*\",Failing_Kids!$F389,1)),IF(ISERROR(SEARCH(\"*Math*\",Failing_Kids!$F389,1)),IF(ISERROR(SEARCH(\"*Calc*\",Failing_Kids!$F389,1)),IF(ISERROR(SEARCH(\"*Algebra*\",Failing_Kids!$F389,1)),\"\",\"X\"),\"X\"),\"X\"),\"X\")","v":""},{"$f":"IF(ISERROR(SEARCH(\"*Science*\",Failing_Kids!$F389,1)),IF(ISERROR(SEARCH(\"*Bio*\",Failing_Kids!$F389,1)),IF(ISERROR(SEARCH(\"*Chem*\",Failing_Kids!$F389,1)),IF(ISERROR(SEARCH(\"*Physics*\",Failing_Kids!$F389,1)),\"\",\"X\"),\"X\"),\"X\"),\"X\")","v":""},{"$f":"IF(ISERROR(SEARCH(\"*His*\",Failing_Kids!$F389,1)),IF(ISERROR(SEARCH(\"*GOV*\",Failing_Kids!$F389,1)),IF(ISERROR(SEARCH(\"*Econ*\",Failing_Kids!$F389,1)),IF(ISERROR(SEARCH(\"*Soc*\",Failing_Kids!$F389,1)),\"\",\"X\"),\"X\"),\"X\"),\"X\")","v":""},{"$f":"IF(ISERROR(SEARCH(\"*PE*\",Failing_Kids!$F389,1)),\"\",\"X\")","v":""}]
[{"$f":"Failing_Kids!C390","v":"Ruiz"},{"$f":"Failing_Kids!D390","v":"Diane"},{"$f":"IF(ISERROR(SEARCH(\"*English*\",Failing_Kids!F390,1)),\"\",\"X \")","v":""},{"$f":"IF(ISERROR(SEARCH(\"*Geometry*\",Failing_Kids!$F390,1)),IF(ISERROR(SEARCH(\"*Math*\",Failing_Kids!$F390,1)),IF(ISERROR(SEARCH(\"*Calc*\",Failing_Kids!$F390,1)),IF(ISERROR(SEARCH(\"*Algebra*\",Failing_Kids!$F390,1)),\"\",\"X\"),\"X\"),\"X\"),\"X\")","v":"X"},{"$f":"IF(ISERROR(SEARCH(\"*Science*\",Failing_Kids!$F390,1)),IF(ISERROR(SEARCH(\"*Bio*\",Failing_Kids!$F390,1)),IF(ISERROR(SEARCH(\"*Chem*\",Failing_Kids!$F390,1)),IF(ISERROR(SEARCH(\"*Physics*\",Failing_Kids!$F390,1)),\"\",\"X\"),\"X\"),\"X\"),\"X\")","v":""},{"$f":"IF(ISERROR(SEARCH(\"*His*\",Failing_Kids!$F390,1)),IF(ISERROR(SEARCH(\"*GOV*\",Failing_Kids!$F390,1)),IF(ISERROR(SEARCH(\"*Econ*\",Failing_Kids!$F390,1)),IF(ISERROR(SEARCH(\"*Soc*\",Failing_Kids!$F390,1)),\"\",\"X\"),\"X\"),\"X\"),\"X\")","v":""},{"$f":"IF(ISERROR(SEARCH(\"*PE*\",Failing_Kids!$F390,1)),\"\",\"X\")","v":""}]
[{"$f":"Failing_Kids!C391","v":"Ruiz"},{"$f":"Failing_Kids!D391","v":"Diane"},{"$f":"IF(ISERROR(SEARCH(\"*English*\",Failing_Kids!F391,1)),\"\",\"X \")","v":"X "},{"$f":"IF(ISERROR(SEARCH(\"*Geometry*\",Failing_Kids!$F391,1)),IF(ISERROR(SEARCH(\"*Math*\",Failing_Kids!$F391,1)),IF(ISERROR(SEARCH(\"*Calc*\",Failing_Kids!$F391,1)),IF(ISERROR(SEARCH(\"*Algebra*\",Failing_Kids!$F391,1)),\"\",\"X\"),\"X\"),\"X\"),\"X\")","v":""},{"$f":"IF(ISERROR(SEARCH(\"*Science*\",Failing_Kids!$F391,1)),IF(ISERROR(SEARCH(\"*Bio*\",Failing_Kids!$F391,1)),IF(ISERROR(SEARCH(\"*Chem*\",Failing_Kids!$F391,1)),IF(ISERROR(SEARCH(\"*Physics*\",Failing_Kids!$F391,1)),\"\",\"X\"),\"X\"),\"X\"),\"X\")","v":""},{"$f":"IF(ISERROR(SEARCH(\"*His*\",Failing_Kids!$F391,1)),IF(ISERROR(SEARCH(\"*GOV*\",Failing_Kids!$F391,1)),IF(ISERROR(SEARCH(\"*Econ*\",Failing_Kids!$F391,1)),IF(ISERROR(SEARCH(\"*Soc*\",Failing_Kids!$F391,1)),\"\",\"X\"),\"X\"),\"X\"),\"X\")","v":""},{"$f":"IF(ISERROR(SEARCH(\"*PE*\",Failing_Kids!$F391,1)),\"\",\"X\")","v":""}]
[{"$f":"Failing_Kids!C392","v":"Rush"},{"$f":"Failing_Kids!D392","v":"Terry"},{"$f":"IF(ISERROR(SEARCH(\"*English*\",Failing_Kids!F392,1)),\"\",\"X \")","v":"X "},{"$f":"IF(ISERROR(SEARCH(\"*Geometry*\",Failing_Kids!$F392,1)),IF(ISERROR(SEARCH(\"*Math*\",Failing_Kids!$F392,1)),IF(ISERROR(SEARCH(\"*Calc*\",Failing_Kids!$F392,1)),IF(ISERROR(SEARCH(\"*Algebra*\",Failing_Kids!$F392,1)),\"\",\"X\"),\"X\"),\"X\"),\"X\")","v":""},{"$f":"IF(ISERROR(SEARCH(\"*Science*\",Failing_Kids!$F392,1)),IF(ISERROR(SEARCH(\"*Bio*\",Failing_Kids!$F392,1)),IF(ISERROR(SEARCH(\"*Chem*\",Failing_Kids!$F392,1)),IF(ISERROR(SEARCH(\"*Physics*\",Failing_Kids!$F392,1)),\"\",\"X\"),\"X\"),\"X\"),\"X\")","v":""},{"$f":"IF(ISERROR(SEARCH(\"*His*\",Failing_Kids!$F392,1)),IF(ISERROR(SEARCH(\"*GOV*\",Failing_Kids!$F392,1)),IF(ISERROR(SEARCH(\"*Econ*\",Failing_Kids!$F392,1)),IF(ISERROR(SEARCH(\"*Soc*\",Failing_Kids!$F392,1)),\"\",\"X\"),\"X\"),\"X\"),\"X\")","v":""},{"$f":"IF(ISERROR(SEARCH(\"*PE*\",Failing_Kids!$F392,1)),\"\",\"X\")","v":""}]
[{"$f":"Failing_Kids!C393","v":"Salas"},{"$f":"Failing_Kids!D393","v":"Emma"},{"$f":"IF(ISERROR(SEARCH(\"*English*\",Failing_Kids!F393,1)),\"\",\"X \")","v":""},{"$f":"IF(ISERROR(SEARCH(\"*Geometry*\",Failing_Kids!$F393,1)),IF(ISERROR(SEARCH(\"*Math*\",Failing_Kids!$F393,1)),IF(ISERROR(SEARCH(\"*Calc*\",Failing_Kids!$F393,1)),IF(ISERROR(SEARCH(\"*Algebra*\",Failing_Kids!$F393,1)),\"\",\"X\"),\"X\"),\"X\"),\"X\")","v":""},{"$f":"IF(ISERROR(SEARCH(\"*Science*\",Failing_Kids!$F393,1)),IF(ISERROR(SEARCH(\"*Bio*\",Failing_Kids!$F393,1)),IF(ISERROR(SEARCH(\"*Chem*\",Failing_Kids!$F393,1)),IF(ISERROR(SEARCH(\"*Physics*\",Failing_Kids!$F393,1)),\"\",\"X\"),\"X\"),\"X\"),\"X\")","v":""},{"$f":"IF(ISERROR(SEARCH(\"*His*\",Failing_Kids!$F393,1)),IF(ISERROR(SEARCH(\"*GOV*\",Failing_Kids!$F393,1)),IF(ISERROR(SEARCH(\"*Econ*\",Failing_Kids!$F393,1)),IF(ISERROR(SEARCH(\"*Soc*\",Failing_Kids!$F393,1)),\"\",\"X\"),\"X\"),\"X\"),\"X\")","v":"X"},{"$f":"IF(ISERROR(SEARCH(\"*PE*\",Failing_Kids!$F393,1)),\"\",\"X\")","v":""}]
[{"$f":"Failing_Kids!C394","v":"Sanders"},{"$f":"Failing_Kids!D394","v":"Gerald"},{"$f":"IF(ISERROR(SEARCH(\"*English*\",Failing_Kids!F394,1)),\"\",\"X \")","v":"X "},{"$f":"IF(ISERROR(SEARCH(\"*Geometry*\",Failing_Kids!$F394,1)),IF(ISERROR(SEARCH(\"*Math*\",Failing_Kids!$F394,1)),IF(ISERROR(SEARCH(\"*Calc*\",Failing_Kids!$F394,1)),IF(ISERROR(SEARCH(\"*Algebra*\",Failing_Kids!$F394,1)),\"\",\"X\"),\"X\"),\"X\"),\"X\")","v":""},{"$f":"IF(ISERROR(SEARCH(\"*Science*\",Failing_Kids!$F394,1)),IF(ISERROR(SEARCH(\"*Bio*\",Failing_Kids!$F394,1)),IF(ISERROR(SEARCH(\"*Chem*\",Failing_Kids!$F394,1)),IF(ISERROR(SEARCH(\"*Physics*\",Failing_Kids!$F394,1)),\"\",\"X\"),\"X\"),\"X\"),\"X\")","v":""},{"$f":"IF(ISERROR(SEARCH(\"*His*\",Failing_Kids!$F394,1)),IF(ISERROR(SEARCH(\"*GOV*\",Failing_Kids!$F394,1)),IF(ISERROR(SEARCH(\"*Econ*\",Failing_Kids!$F394,1)),IF(ISERROR(SEARCH(\"*Soc*\",Failing_Kids!$F394,1)),\"\",\"X\"),\"X\"),\"X\"),\"X\")","v":""},{"$f":"IF(ISERROR(SEARCH(\"*PE*\",Failing_Kids!$F394,1)),\"\",\"X\")","v":""}]
[{"$f":"Failing_Kids!C395","v":"Sanders"},{"$f":"Failing_Kids!D395","v":"Gerald"},{"$f":"IF(ISERROR(SEARCH(\"*English*\",Failing_Kids!F395,1)),\"\",\"X \")","v":""},{"$f":"IF(ISERROR(SEARCH(\"*Geometry*\",Failing_Kids!$F395,1)),IF(ISERROR(SEARCH(\"*Math*\",Failing_Kids!$F395,1)),IF(ISERROR(SEARCH(\"*Calc*\",Failing_Kids!$F395,1)),IF(ISERROR(SEARCH(\"*Algebra*\",Failing_Kids!$F395,1)),\"\",\"X\"),\"X\"),\"X\"),\"X\")","v":""},{"$f":"IF(ISERROR(SEARCH(\"*Science*\",Failing_Kids!$F395,1)),IF(ISERROR(SEARCH(\"*Bio*\",Failing_Kids!$F395,1)),IF(ISERROR(SEARCH(\"*Chem*\",Failing_Kids!$F395,1)),IF(ISERROR(SEARCH(\"*Physics*\",Failing_Kids!$F395,1)),\"\",\"X\"),\"X\"),\"X\"),\"X\")","v":""},{"$f":"IF(ISERROR(SEARCH(\"*His*\",Failing_Kids!$F395,1)),IF(ISERROR(SEARCH(\"*GOV*\",Failing_Kids!$F395,1)),IF(ISERROR(SEARCH(\"*Econ*\",Failing_Kids!$F395,1)),IF(ISERROR(SEARCH(\"*Soc*\",Failing_Kids!$F395,1)),\"\",\"X\"),\"X\"),\"X\"),\"X\")","v":""},{"$f":"IF(ISERROR(SEARCH(\"*PE*\",Failing_Kids!$F395,1)),\"\",\"X\")","v":""}]
[{"$f":"Failing_Kids!C396","v":"Savage"},{"$f":"Failing_Kids!D396","v":"Stacy"},{"$f":"IF(ISERROR(SEARCH(\"*English*\",Failing_Kids!F396,1)),\"\",\"X \")","v":""},{"$f":"IF(ISERROR(SEARCH(\"*Geometry*\",Failing_Kids!$F396,1)),IF(ISERROR(SEARCH(\"*Math*\",Failing_Kids!$F396,1)),IF(ISERROR(SEARCH(\"*Calc*\",Failing_Kids!$F396,1)),IF(ISERROR(SEARCH(\"*Algebra*\",Failing_Kids!$F396,1)),\"\",\"X\"),\"X\"),\"X\"),\"X\")","v":""},{"$f":"IF(ISERROR(SEARCH(\"*Science*\",Failing_Kids!$F396,1)),IF(ISERROR(SEARCH(\"*Bio*\",Failing_Kids!$F396,1)),IF(ISERROR(SEARCH(\"*Chem*\",Failing_Kids!$F396,1)),IF(ISERROR(SEARCH(\"*Physics*\",Failing_Kids!$F396,1)),\"\",\"X\"),\"X\"),\"X\"),\"X\")","v":"X"},{"$f":"IF(ISERROR(SEARCH(\"*His*\",Failing_Kids!$F396,1)),IF(ISERROR(SEARCH(\"*GOV*\",Failing_Kids!$F396,1)),IF(ISERROR(SEARCH(\"*Econ*\",Failing_Kids!$F396,1)),IF(ISERROR(SEARCH(\"*Soc*\",Failing_Kids!$F396,1)),\"\",\"X\"),\"X\"),\"X\"),\"X\")","v":""},{"$f":"IF(ISERROR(SEARCH(\"*PE*\",Failing_Kids!$F396,1)),\"\",\"X\")","v":""}]
[{"$f":"Failing_Kids!C397","v":"Savage"},{"$f":"Failing_Kids!D397","v":"Tony"},{"$f":"IF(ISERROR(SEARCH(\"*English*\",Failing_Kids!F397,1)),\"\",\"X \")","v":""},{"$f":"IF(ISERROR(SEARCH(\"*Geometry*\",Failing_Kids!$F397,1)),IF(ISERROR(SEARCH(\"*Math*\",Failing_Kids!$F397,1)),IF(ISERROR(SEARCH(\"*Calc*\",Failing_Kids!$F397,1)),IF(ISERROR(SEARCH(\"*Algebra*\",Failing_Kids!$F397,1)),\"\",\"X\"),\"X\"),\"X\"),\"X\")","v":""},{"$f":"IF(ISERROR(SEARCH(\"*Science*\",Failing_Kids!$F397,1)),IF(ISERROR(SEARCH(\"*Bio*\",Failing_Kids!$F397,1)),IF(ISERROR(SEARCH(\"*Chem*\",Failing_Kids!$F397,1)),IF(ISERROR(SEARCH(\"*Physics*\",Failing_Kids!$F397,1)),\"\",\"X\"),\"X\"),\"X\"),\"X\")","v":""},{"$f":"IF(ISERROR(SEARCH(\"*His*\",Failing_Kids!$F397,1)),IF(ISERROR(SEARCH(\"*GOV*\",Failing_Kids!$F397,1)),IF(ISERROR(SEARCH(\"*Econ*\",Failing_Kids!$F397,1)),IF(ISERROR(SEARCH(\"*Soc*\",Failing_Kids!$F397,1)),\"\",\"X\"),\"X\"),\"X\"),\"X\")","v":"X"},{"$f":"IF(ISERROR(SEARCH(\"*PE*\",Failing_Kids!$F397,1)),\"\",\"X\")","v":""}]
[{"$f":"Failing_Kids!C398","v":"Schmidt"},{"$f":"Failing_Kids!D398","v":"Stacy"},{"$f":"IF(ISERROR(SEARCH(\"*English*\",Failing_Kids!F398,1)),\"\",\"X \")","v":"X "},{"$f":"IF(ISERROR(SEARCH(\"*Geometry*\",Failing_Kids!$F398,1)),IF(ISERROR(SEARCH(\"*Math*\",Failing_Kids!$F398,1)),IF(ISERROR(SEARCH(\"*Calc*\",Failing_Kids!$F398,1)),IF(ISERROR(SEARCH(\"*Algebra*\",Failing_Kids!$F398,1)),\"\",\"X\"),\"X\"),\"X\"),\"X\")","v":""},{"$f":"IF(ISERROR(SEARCH(\"*Science*\",Failing_Kids!$F398,1)),IF(ISERROR(SEARCH(\"*Bio*\",Failing_Kids!$F398,1)),IF(ISERROR(SEARCH(\"*Chem*\",Failing_Kids!$F398,1)),IF(ISERROR(SEARCH(\"*Physics*\",Failing_Kids!$F398,1)),\"\",\"X\"),\"X\"),\"X\"),\"X\")","v":""},{"$f":"IF(ISERROR(SEARCH(\"*His*\",Failing_Kids!$F398,1)),IF(ISERROR(SEARCH(\"*GOV*\",Failing_Kids!$F398,1)),IF(ISERROR(SEARCH(\"*Econ*\",Failing_Kids!$F398,1)),IF(ISERROR(SEARCH(\"*Soc*\",Failing_Kids!$F398,1)),\"\",\"X\"),\"X\"),\"X\"),\"X\")","v":""},{"$f":"IF(ISERROR(SEARCH(\"*PE*\",Failing_Kids!$F398,1)),\"\",\"X\")","v":""}]
[{"$f":"Failing_Kids!C399","v":"Sears"},{"$f":"Failing_Kids!D399","v":"Jeff"},{"$f":"IF(ISERROR(SEARCH(\"*English*\",Failing_Kids!F399,1)),\"\",\"X \")","v":""},{"$f":"IF(ISERROR(SEARCH(\"*Geometry*\",Failing_Kids!$F399,1)),IF(ISERROR(SEARCH(\"*Math*\",Failing_Kids!$F399,1)),IF(ISERROR(SEARCH(\"*Calc*\",Failing_Kids!$F399,1)),IF(ISERROR(SEARCH(\"*Algebra*\",Failing_Kids!$F399,1)),\"\",\"X\"),\"X\"),\"X\"),\"X\")","v":""},{"$f":"IF(ISERROR(SEARCH(\"*Science*\",Failing_Kids!$F399,1)),IF(ISERROR(SEARCH(\"*Bio*\",Failing_Kids!$F399,1)),IF(ISERROR(SEARCH(\"*Chem*\",Failing_Kids!$F399,1)),IF(ISERROR(SEARCH(\"*Physics*\",Failing_Kids!$F399,1)),\"\",\"X\"),\"X\"),\"X\"),\"X\")","v":""},{"$f":"IF(ISERROR(SEARCH(\"*His*\",Failing_Kids!$F399,1)),IF(ISERROR(SEARCH(\"*GOV*\",Failing_Kids!$F399,1)),IF(ISERROR(SEARCH(\"*Econ*\",Failing_Kids!$F399,1)),IF(ISERROR(SEARCH(\"*Soc*\",Failing_Kids!$F399,1)),\"\",\"X\"),\"X\"),\"X\"),\"X\")","v":"X"},{"$f":"IF(ISERROR(SEARCH(\"*PE*\",Failing_Kids!$F399,1)),\"\",\"X\")","v":""}]
[{"$f":"Failing_Kids!C400","v":"Serrano"},{"$f":"Failing_Kids!D400","v":"Johnny"},{"$f":"IF(ISERROR(SEARCH(\"*English*\",Failing_Kids!F400,1)),\"\",\"X \")","v":"X "},{"$f":"IF(ISERROR(SEARCH(\"*Geometry*\",Failing_Kids!$F400,1)),IF(ISERROR(SEARCH(\"*Math*\",Failing_Kids!$F400,1)),IF(ISERROR(SEARCH(\"*Calc*\",Failing_Kids!$F400,1)),IF(ISERROR(SEARCH(\"*Algebra*\",Failing_Kids!$F400,1)),\"\",\"X\"),\"X\"),\"X\"),\"X\")","v":""},{"$f":"IF(ISERROR(SEARCH(\"*Science*\",Failing_Kids!$F400,1)),IF(ISERROR(SEARCH(\"*Bio*\",Failing_Kids!$F400,1)),IF(ISERROR(SEARCH(\"*Chem*\",Failing_Kids!$F400,1)),IF(ISERROR(SEARCH(\"*Physics*\",Failing_Kids!$F400,1)),\"\",\"X\"),\"X\"),\"X\"),\"X\")","v":""},{"$f":"IF(ISERROR(SEARCH(\"*His*\",Failing_Kids!$F400,1)),IF(ISERROR(SEARCH(\"*GOV*\",Failing_Kids!$F400,1)),IF(ISERROR(SEARCH(\"*Econ*\",Failing_Kids!$F400,1)),IF(ISERROR(SEARCH(\"*Soc*\",Failing_Kids!$F400,1)),\"\",\"X\"),\"X\"),\"X\"),\"X\")","v":""},{"$f":"IF(ISERROR(SEARCH(\"*PE*\",Failing_Kids!$F400,1)),\"\",\"X\")","v":""}]
[{"$f":"Failing_Kids!C401","v":"Sexton"},{"$f":"Failing_Kids!D401","v":"Emma"},{"$f":"IF(ISERROR(SEARCH(\"*English*\",Failing_Kids!F401,1)),\"\",\"X \")","v":""},{"$f":"IF(ISERROR(SEARCH(\"*Geometry*\",Failing_Kids!$F401,1)),IF(ISERROR(SEARCH(\"*Math*\",Failing_Kids!$F401,1)),IF(ISERROR(SEARCH(\"*Calc*\",Failing_Kids!$F401,1)),IF(ISERROR(SEARCH(\"*Algebra*\",Failing_Kids!$F401,1)),\"\",\"X\"),\"X\"),\"X\"),\"X\")","v":"X"},{"$f":"IF(ISERROR(SEARCH(\"*Science*\",Failing_Kids!$F401,1)),IF(ISERROR(SEARCH(\"*Bio*\",Failing_Kids!$F401,1)),IF(ISERROR(SEARCH(\"*Chem*\",Failing_Kids!$F401,1)),IF(ISERROR(SEARCH(\"*Physics*\",Failing_Kids!$F401,1)),\"\",\"X\"),\"X\"),\"X\"),\"X\")","v":""},{"$f":"IF(ISERROR(SEARCH(\"*His*\",Failing_Kids!$F401,1)),IF(ISERROR(SEARCH(\"*GOV*\",Failing_Kids!$F401,1)),IF(ISERROR(SEARCH(\"*Econ*\",Failing_Kids!$F401,1)),IF(ISERROR(SEARCH(\"*Soc*\",Failing_Kids!$F401,1)),\"\",\"X\"),\"X\"),\"X\"),\"X\")","v":""},{"$f":"IF(ISERROR(SEARCH(\"*PE*\",Failing_Kids!$F401,1)),\"\",\"X\")","v":""}]
[{"$f":"Failing_Kids!C402","v":"Shaffer"},{"$f":"Failing_Kids!D402","v":"Joshua"},{"$f":"IF(ISERROR(SEARCH(\"*English*\",Failing_Kids!F402,1)),\"\",\"X \")","v":""},{"$f":"IF(ISERROR(SEARCH(\"*Geometry*\",Failing_Kids!$F402,1)),IF(ISERROR(SEARCH(\"*Math*\",Failing_Kids!$F402,1)),IF(ISERROR(SEARCH(\"*Calc*\",Failing_Kids!$F402,1)),IF(ISERROR(SEARCH(\"*Algebra*\",Failing_Kids!$F402,1)),\"\",\"X\"),\"X\"),\"X\"),\"X\")","v":""},{"$f":"IF(ISERROR(SEARCH(\"*Science*\",Failing_Kids!$F402,1)),IF(ISERROR(SEARCH(\"*Bio*\",Failing_Kids!$F402,1)),IF(ISERROR(SEARCH(\"*Chem*\",Failing_Kids!$F402,1)),IF(ISERROR(SEARCH(\"*Physics*\",Failing_Kids!$F402,1)),\"\",\"X\"),\"X\"),\"X\"),\"X\")","v":""},{"$f":"IF(ISERROR(SEARCH(\"*His*\",Failing_Kids!$F402,1)),IF(ISERROR(SEARCH(\"*GOV*\",Failing_Kids!$F402,1)),IF(ISERROR(SEARCH(\"*Econ*\",Failing_Kids!$F402,1)),IF(ISERROR(SEARCH(\"*Soc*\",Failing_Kids!$F402,1)),\"\",\"X\"),\"X\"),\"X\"),\"X\")","v":"X"},{"$f":"IF(ISERROR(SEARCH(\"*PE*\",Failing_Kids!$F402,1)),\"\",\"X\")","v":""}]
[{"$f":"Failing_Kids!C403","v":"Shaffer"},{"$f":"Failing_Kids!D403","v":"Norman"},{"$f":"IF(ISERROR(SEARCH(\"*English*\",Failing_Kids!F403,1)),\"\",\"X \")","v":""},{"$f":"IF(ISERROR(SEARCH(\"*Geometry*\",Failing_Kids!$F403,1)),IF(ISERROR(SEARCH(\"*Math*\",Failing_Kids!$F403,1)),IF(ISERROR(SEARCH(\"*Calc*\",Failing_Kids!$F403,1)),IF(ISERROR(SEARCH(\"*Algebra*\",Failing_Kids!$F403,1)),\"\",\"X\"),\"X\"),\"X\"),\"X\")","v":""},{"$f":"IF(ISERROR(SEARCH(\"*Science*\",Failing_Kids!$F403,1)),IF(ISERROR(SEARCH(\"*Bio*\",Failing_Kids!$F403,1)),IF(ISERROR(SEARCH(\"*Chem*\",Failing_Kids!$F403,1)),IF(ISERROR(SEARCH(\"*Physics*\",Failing_Kids!$F403,1)),\"\",\"X\"),\"X\"),\"X\"),\"X\")","v":""},{"$f":"IF(ISERROR(SEARCH(\"*His*\",Failing_Kids!$F403,1)),IF(ISERROR(SEARCH(\"*GOV*\",Failing_Kids!$F403,1)),IF(ISERROR(SEARCH(\"*Econ*\",Failing_Kids!$F403,1)),IF(ISERROR(SEARCH(\"*Soc*\",Failing_Kids!$F403,1)),\"\",\"X\"),\"X\"),\"X\"),\"X\")","v":"X"},{"$f":"IF(ISERROR(SEARCH(\"*PE*\",Failing_Kids!$F403,1)),\"\",\"X\")","v":""}]
[{"$f":"Failing_Kids!C404","v":"Shelton"},{"$f":"Failing_Kids!D404","v":"Justin"},{"$f":"IF(ISERROR(SEARCH(\"*English*\",Failing_Kids!F404,1)),\"\",\"X \")","v":""},{"$f":"IF(ISERROR(SEARCH(\"*Geometry*\",Failing_Kids!$F404,1)),IF(ISERROR(SEARCH(\"*Math*\",Failing_Kids!$F404,1)),IF(ISERROR(SEARCH(\"*Calc*\",Failing_Kids!$F404,1)),IF(ISERROR(SEARCH(\"*Algebra*\",Failing_Kids!$F404,1)),\"\",\"X\"),\"X\"),\"X\"),\"X\")","v":"X"},{"$f":"IF(ISERROR(SEARCH(\"*Science*\",Failing_Kids!$F404,1)),IF(ISERROR(SEARCH(\"*Bio*\",Failing_Kids!$F404,1)),IF(ISERROR(SEARCH(\"*Chem*\",Failing_Kids!$F404,1)),IF(ISERROR(SEARCH(\"*Physics*\",Failing_Kids!$F404,1)),\"\",\"X\"),\"X\"),\"X\"),\"X\")","v":""},{"$f":"IF(ISERROR(SEARCH(\"*His*\",Failing_Kids!$F404,1)),IF(ISERROR(SEARCH(\"*GOV*\",Failing_Kids!$F404,1)),IF(ISERROR(SEARCH(\"*Econ*\",Failing_Kids!$F404,1)),IF(ISERROR(SEARCH(\"*Soc*\",Failing_Kids!$F404,1)),\"\",\"X\"),\"X\"),\"X\"),\"X\")","v":""},{"$f":"IF(ISERROR(SEARCH(\"*PE*\",Failing_Kids!$F404,1)),\"\",\"X\")","v":""}]
[{"$f":"Failing_Kids!C405","v":"Shelton"},{"$f":"Failing_Kids!D405","v":"Sandra"},{"$f":"IF(ISERROR(SEARCH(\"*English*\",Failing_Kids!F405,1)),\"\",\"X \")","v":""},{"$f":"IF(ISERROR(SEARCH(\"*Geometry*\",Failing_Kids!$F405,1)),IF(ISERROR(SEARCH(\"*Math*\",Failing_Kids!$F405,1)),IF(ISERROR(SEARCH(\"*Calc*\",Failing_Kids!$F405,1)),IF(ISERROR(SEARCH(\"*Algebra*\",Failing_Kids!$F405,1)),\"\",\"X\"),\"X\"),\"X\"),\"X\")","v":"X"},{"$f":"IF(ISERROR(SEARCH(\"*Science*\",Failing_Kids!$F405,1)),IF(ISERROR(SEARCH(\"*Bio*\",Failing_Kids!$F405,1)),IF(ISERROR(SEARCH(\"*Chem*\",Failing_Kids!$F405,1)),IF(ISERROR(SEARCH(\"*Physics*\",Failing_Kids!$F405,1)),\"\",\"X\"),\"X\"),\"X\"),\"X\")","v":""},{"$f":"IF(ISERROR(SEARCH(\"*His*\",Failing_Kids!$F405,1)),IF(ISERROR(SEARCH(\"*GOV*\",Failing_Kids!$F405,1)),IF(ISERROR(SEARCH(\"*Econ*\",Failing_Kids!$F405,1)),IF(ISERROR(SEARCH(\"*Soc*\",Failing_Kids!$F405,1)),\"\",\"X\"),\"X\"),\"X\"),\"X\")","v":""},{"$f":"IF(ISERROR(SEARCH(\"*PE*\",Failing_Kids!$F405,1)),\"\",\"X\")","v":""}]
[{"$f":"Failing_Kids!C406","v":"Shepard"},{"$f":"Failing_Kids!D406","v":"Sandy"},{"$f":"IF(ISERROR(SEARCH(\"*English*\",Failing_Kids!F406,1)),\"\",\"X \")","v":"X "},{"$f":"IF(ISERROR(SEARCH(\"*Geometry*\",Failing_Kids!$F406,1)),IF(ISERROR(SEARCH(\"*Math*\",Failing_Kids!$F406,1)),IF(ISERROR(SEARCH(\"*Calc*\",Failing_Kids!$F406,1)),IF(ISERROR(SEARCH(\"*Algebra*\",Failing_Kids!$F406,1)),\"\",\"X\"),\"X\"),\"X\"),\"X\")","v":""},{"$f":"IF(ISERROR(SEARCH(\"*Science*\",Failing_Kids!$F406,1)),IF(ISERROR(SEARCH(\"*Bio*\",Failing_Kids!$F406,1)),IF(ISERROR(SEARCH(\"*Chem*\",Failing_Kids!$F406,1)),IF(ISERROR(SEARCH(\"*Physics*\",Failing_Kids!$F406,1)),\"\",\"X\"),\"X\"),\"X\"),\"X\")","v":""},{"$f":"IF(ISERROR(SEARCH(\"*His*\",Failing_Kids!$F406,1)),IF(ISERROR(SEARCH(\"*GOV*\",Failing_Kids!$F406,1)),IF(ISERROR(SEARCH(\"*Econ*\",Failing_Kids!$F406,1)),IF(ISERROR(SEARCH(\"*Soc*\",Failing_Kids!$F406,1)),\"\",\"X\"),\"X\"),\"X\"),\"X\")","v":""},{"$f":"IF(ISERROR(SEARCH(\"*PE*\",Failing_Kids!$F406,1)),\"\",\"X\")","v":""}]
[{"$f":"Failing_Kids!C407","v":"Sheppard"},{"$f":"Failing_Kids!D407","v":"Judith"},{"$f":"IF(ISERROR(SEARCH(\"*English*\",Failing_Kids!F407,1)),\"\",\"X \")","v":"X "},{"$f":"IF(ISERROR(SEARCH(\"*Geometry*\",Failing_Kids!$F407,1)),IF(ISERROR(SEARCH(\"*Math*\",Failing_Kids!$F407,1)),IF(ISERROR(SEARCH(\"*Calc*\",Failing_Kids!$F407,1)),IF(ISERROR(SEARCH(\"*Algebra*\",Failing_Kids!$F407,1)),\"\",\"X\"),\"X\"),\"X\"),\"X\")","v":""},{"$f":"IF(ISERROR(SEARCH(\"*Science*\",Failing_Kids!$F407,1)),IF(ISERROR(SEARCH(\"*Bio*\",Failing_Kids!$F407,1)),IF(ISERROR(SEARCH(\"*Chem*\",Failing_Kids!$F407,1)),IF(ISERROR(SEARCH(\"*Physics*\",Failing_Kids!$F407,1)),\"\",\"X\"),\"X\"),\"X\"),\"X\")","v":""},{"$f":"IF(ISERROR(SEARCH(\"*His*\",Failing_Kids!$F407,1)),IF(ISERROR(SEARCH(\"*GOV*\",Failing_Kids!$F407,1)),IF(ISERROR(SEARCH(\"*Econ*\",Failing_Kids!$F407,1)),IF(ISERROR(SEARCH(\"*Soc*\",Failing_Kids!$F407,1)),\"\",\"X\"),\"X\"),\"X\"),\"X\")","v":""},{"$f":"IF(ISERROR(SEARCH(\"*PE*\",Failing_Kids!$F407,1)),\"\",\"X\")","v":""}]
[{"$f":"Failing_Kids!C408","v":"Silva"},{"$f":"Failing_Kids!D408","v":"Jack"},{"$f":"IF(ISERROR(SEARCH(\"*English*\",Failing_Kids!F408,1)),\"\",\"X \")","v":""},{"$f":"IF(ISERROR(SEARCH(\"*Geometry*\",Failing_Kids!$F408,1)),IF(ISERROR(SEARCH(\"*Math*\",Failing_Kids!$F408,1)),IF(ISERROR(SEARCH(\"*Calc*\",Failing_Kids!$F408,1)),IF(ISERROR(SEARCH(\"*Algebra*\",Failing_Kids!$F408,1)),\"\",\"X\"),\"X\"),\"X\"),\"X\")","v":""},{"$f":"IF(ISERROR(SEARCH(\"*Science*\",Failing_Kids!$F408,1)),IF(ISERROR(SEARCH(\"*Bio*\",Failing_Kids!$F408,1)),IF(ISERROR(SEARCH(\"*Chem*\",Failing_Kids!$F408,1)),IF(ISERROR(SEARCH(\"*Physics*\",Failing_Kids!$F408,1)),\"\",\"X\"),\"X\"),\"X\"),\"X\")","v":""},{"$f":"IF(ISERROR(SEARCH(\"*His*\",Failing_Kids!$F408,1)),IF(ISERROR(SEARCH(\"*GOV*\",Failing_Kids!$F408,1)),IF(ISERROR(SEARCH(\"*Econ*\",Failing_Kids!$F408,1)),IF(ISERROR(SEARCH(\"*Soc*\",Failing_Kids!$F408,1)),\"\",\"X\"),\"X\"),\"X\"),\"X\")","v":"X"},{"$f":"IF(ISERROR(SEARCH(\"*PE*\",Failing_Kids!$F408,1)),\"\",\"X\")","v":""}]
[{"$f":"Failing_Kids!C409","v":"Silva"},{"$f":"Failing_Kids!D409","v":"Lawrence"},{"$f":"IF(ISERROR(SEARCH(\"*English*\",Failing_Kids!F409,1)),\"\",\"X \")","v":""},{"$f":"IF(ISERROR(SEARCH(\"*Geometry*\",Failing_Kids!$F409,1)),IF(ISERROR(SEARCH(\"*Math*\",Failing_Kids!$F409,1)),IF(ISERROR(SEARCH(\"*Calc*\",Failing_Kids!$F409,1)),IF(ISERROR(SEARCH(\"*Algebra*\",Failing_Kids!$F409,1)),\"\",\"X\"),\"X\"),\"X\"),\"X\")","v":"X"},{"$f":"IF(ISERROR(SEARCH(\"*Science*\",Failing_Kids!$F409,1)),IF(ISERROR(SEARCH(\"*Bio*\",Failing_Kids!$F409,1)),IF(ISERROR(SEARCH(\"*Chem*\",Failing_Kids!$F409,1)),IF(ISERROR(SEARCH(\"*Physics*\",Failing_Kids!$F409,1)),\"\",\"X\"),\"X\"),\"X\"),\"X\")","v":""},{"$f":"IF(ISERROR(SEARCH(\"*His*\",Failing_Kids!$F409,1)),IF(ISERROR(SEARCH(\"*GOV*\",Failing_Kids!$F409,1)),IF(ISERROR(SEARCH(\"*Econ*\",Failing_Kids!$F409,1)),IF(ISERROR(SEARCH(\"*Soc*\",Failing_Kids!$F409,1)),\"\",\"X\"),\"X\"),\"X\"),\"X\")","v":""},{"$f":"IF(ISERROR(SEARCH(\"*PE*\",Failing_Kids!$F409,1)),\"\",\"X\")","v":""}]
[{"$f":"Failing_Kids!C410","v":"Silva"},{"$f":"Failing_Kids!D410","v":"Victor"},{"$f":"IF(ISERROR(SEARCH(\"*English*\",Failing_Kids!F410,1)),\"\",\"X \")","v":""},{"$f":"IF(ISERROR(SEARCH(\"*Geometry*\",Failing_Kids!$F410,1)),IF(ISERROR(SEARCH(\"*Math*\",Failing_Kids!$F410,1)),IF(ISERROR(SEARCH(\"*Calc*\",Failing_Kids!$F410,1)),IF(ISERROR(SEARCH(\"*Algebra*\",Failing_Kids!$F410,1)),\"\",\"X\"),\"X\"),\"X\"),\"X\")","v":"X"},{"$f":"IF(ISERROR(SEARCH(\"*Science*\",Failing_Kids!$F410,1)),IF(ISERROR(SEARCH(\"*Bio*\",Failing_Kids!$F410,1)),IF(ISERROR(SEARCH(\"*Chem*\",Failing_Kids!$F410,1)),IF(ISERROR(SEARCH(\"*Physics*\",Failing_Kids!$F410,1)),\"\",\"X\"),\"X\"),\"X\"),\"X\")","v":""},{"$f":"IF(ISERROR(SEARCH(\"*His*\",Failing_Kids!$F410,1)),IF(ISERROR(SEARCH(\"*GOV*\",Failing_Kids!$F410,1)),IF(ISERROR(SEARCH(\"*Econ*\",Failing_Kids!$F410,1)),IF(ISERROR(SEARCH(\"*Soc*\",Failing_Kids!$F410,1)),\"\",\"X\"),\"X\"),\"X\"),\"X\")","v":""},{"$f":"IF(ISERROR(SEARCH(\"*PE*\",Failing_Kids!$F410,1)),\"\",\"X\")","v":""}]
[{"$f":"Failing_Kids!C411","v":"Silva"},{"$f":"Failing_Kids!D411","v":"Victor"},{"$f":"IF(ISERROR(SEARCH(\"*English*\",Failing_Kids!F411,1)),\"\",\"X \")","v":"X "},{"$f":"IF(ISERROR(SEARCH(\"*Geometry*\",Failing_Kids!$F411,1)),IF(ISERROR(SEARCH(\"*Math*\",Failing_Kids!$F411,1)),IF(ISERROR(SEARCH(\"*Calc*\",Failing_Kids!$F411,1)),IF(ISERROR(SEARCH(\"*Algebra*\",Failing_Kids!$F411,1)),\"\",\"X\"),\"X\"),\"X\"),\"X\")","v":""},{"$f":"IF(ISERROR(SEARCH(\"*Science*\",Failing_Kids!$F411,1)),IF(ISERROR(SEARCH(\"*Bio*\",Failing_Kids!$F411,1)),IF(ISERROR(SEARCH(\"*Chem*\",Failing_Kids!$F411,1)),IF(ISERROR(SEARCH(\"*Physics*\",Failing_Kids!$F411,1)),\"\",\"X\"),\"X\"),\"X\"),\"X\")","v":""},{"$f":"IF(ISERROR(SEARCH(\"*His*\",Failing_Kids!$F411,1)),IF(ISERROR(SEARCH(\"*GOV*\",Failing_Kids!$F411,1)),IF(ISERROR(SEARCH(\"*Econ*\",Failing_Kids!$F411,1)),IF(ISERROR(SEARCH(\"*Soc*\",Failing_Kids!$F411,1)),\"\",\"X\"),\"X\"),\"X\"),\"X\")","v":""},{"$f":"IF(ISERROR(SEARCH(\"*PE*\",Failing_Kids!$F411,1)),\"\",\"X\")","v":""}]
[{"$f":"Failing_Kids!C412","v":"Silva"},{"$f":"Failing_Kids!D412","v":"Victor"},{"$f":"IF(ISERROR(SEARCH(\"*English*\",Failing_Kids!F412,1)),\"\",\"X \")","v":""},{"$f":"IF(ISERROR(SEARCH(\"*Geometry*\",Failing_Kids!$F412,1)),IF(ISERROR(SEARCH(\"*Math*\",Failing_Kids!$F412,1)),IF(ISERROR(SEARCH(\"*Calc*\",Failing_Kids!$F412,1)),IF(ISERROR(SEARCH(\"*Algebra*\",Failing_Kids!$F412,1)),\"\",\"X\"),\"X\"),\"X\"),\"X\")","v":""},{"$f":"IF(ISERROR(SEARCH(\"*Science*\",Failing_Kids!$F412,1)),IF(ISERROR(SEARCH(\"*Bio*\",Failing_Kids!$F412,1)),IF(ISERROR(SEARCH(\"*Chem*\",Failing_Kids!$F412,1)),IF(ISERROR(SEARCH(\"*Physics*\",Failing_Kids!$F412,1)),\"\",\"X\"),\"X\"),\"X\"),\"X\")","v":""},{"$f":"IF(ISERROR(SEARCH(\"*His*\",Failing_Kids!$F412,1)),IF(ISERROR(SEARCH(\"*GOV*\",Failing_Kids!$F412,1)),IF(ISERROR(SEARCH(\"*Econ*\",Failing_Kids!$F412,1)),IF(ISERROR(SEARCH(\"*Soc*\",Failing_Kids!$F412,1)),\"\",\"X\"),\"X\"),\"X\"),\"X\")","v":""},{"$f":"IF(ISERROR(SEARCH(\"*PE*\",Failing_Kids!$F412,1)),\"\",\"X\")","v":""}]
[{"$f":"Failing_Kids!C413","v":"Singleton"},{"$f":"Failing_Kids!D413","v":"Grace"},{"$f":"IF(ISERROR(SEARCH(\"*English*\",Failing_Kids!F413,1)),\"\",\"X \")","v":"X "},{"$f":"IF(ISERROR(SEARCH(\"*Geometry*\",Failing_Kids!$F413,1)),IF(ISERROR(SEARCH(\"*Math*\",Failing_Kids!$F413,1)),IF(ISERROR(SEARCH(\"*Calc*\",Failing_Kids!$F413,1)),IF(ISERROR(SEARCH(\"*Algebra*\",Failing_Kids!$F413,1)),\"\",\"X\"),\"X\"),\"X\"),\"X\")","v":""},{"$f":"IF(ISERROR(SEARCH(\"*Science*\",Failing_Kids!$F413,1)),IF(ISERROR(SEARCH(\"*Bio*\",Failing_Kids!$F413,1)),IF(ISERROR(SEARCH(\"*Chem*\",Failing_Kids!$F413,1)),IF(ISERROR(SEARCH(\"*Physics*\",Failing_Kids!$F413,1)),\"\",\"X\"),\"X\"),\"X\"),\"X\")","v":""},{"$f":"IF(ISERROR(SEARCH(\"*His*\",Failing_Kids!$F413,1)),IF(ISERROR(SEARCH(\"*GOV*\",Failing_Kids!$F413,1)),IF(ISERROR(SEARCH(\"*Econ*\",Failing_Kids!$F413,1)),IF(ISERROR(SEARCH(\"*Soc*\",Failing_Kids!$F413,1)),\"\",\"X\"),\"X\"),\"X\"),\"X\")","v":""},{"$f":"IF(ISERROR(SEARCH(\"*PE*\",Failing_Kids!$F413,1)),\"\",\"X\")","v":""}]
[{"$f":"Failing_Kids!C414","v":"Sloan"},{"$f":"Failing_Kids!D414","v":"Teresa"},{"$f":"IF(ISERROR(SEARCH(\"*English*\",Failing_Kids!F414,1)),\"\",\"X \")","v":""},{"$f":"IF(ISERROR(SEARCH(\"*Geometry*\",Failing_Kids!$F414,1)),IF(ISERROR(SEARCH(\"*Math*\",Failing_Kids!$F414,1)),IF(ISERROR(SEARCH(\"*Calc*\",Failing_Kids!$F414,1)),IF(ISERROR(SEARCH(\"*Algebra*\",Failing_Kids!$F414,1)),\"\",\"X\"),\"X\"),\"X\"),\"X\")","v":""},{"$f":"IF(ISERROR(SEARCH(\"*Science*\",Failing_Kids!$F414,1)),IF(ISERROR(SEARCH(\"*Bio*\",Failing_Kids!$F414,1)),IF(ISERROR(SEARCH(\"*Chem*\",Failing_Kids!$F414,1)),IF(ISERROR(SEARCH(\"*Physics*\",Failing_Kids!$F414,1)),\"\",\"X\"),\"X\"),\"X\"),\"X\")","v":""},{"$f":"IF(ISERROR(SEARCH(\"*His*\",Failing_Kids!$F414,1)),IF(ISERROR(SEARCH(\"*GOV*\",Failing_Kids!$F414,1)),IF(ISERROR(SEARCH(\"*Econ*\",Failing_Kids!$F414,1)),IF(ISERROR(SEARCH(\"*Soc*\",Failing_Kids!$F414,1)),\"\",\"X\"),\"X\"),\"X\"),\"X\")","v":"X"},{"$f":"IF(ISERROR(SEARCH(\"*PE*\",Failing_Kids!$F414,1)),\"\",\"X\")","v":""}]
[{"$f":"Failing_Kids!C415","v":"Spencer"},{"$f":"Failing_Kids!D415","v":"Nathan"},{"$f":"IF(ISERROR(SEARCH(\"*English*\",Failing_Kids!F415,1)),\"\",\"X \")","v":""},{"$f":"IF(ISERROR(SEARCH(\"*Geometry*\",Failing_Kids!$F415,1)),IF(ISERROR(SEARCH(\"*Math*\",Failing_Kids!$F415,1)),IF(ISERROR(SEARCH(\"*Calc*\",Failing_Kids!$F415,1)),IF(ISERROR(SEARCH(\"*Algebra*\",Failing_Kids!$F415,1)),\"\",\"X\"),\"X\"),\"X\"),\"X\")","v":"X"},{"$f":"IF(ISERROR(SEARCH(\"*Science*\",Failing_Kids!$F415,1)),IF(ISERROR(SEARCH(\"*Bio*\",Failing_Kids!$F415,1)),IF(ISERROR(SEARCH(\"*Chem*\",Failing_Kids!$F415,1)),IF(ISERROR(SEARCH(\"*Physics*\",Failing_Kids!$F415,1)),\"\",\"X\"),\"X\"),\"X\"),\"X\")","v":""},{"$f":"IF(ISERROR(SEARCH(\"*His*\",Failing_Kids!$F415,1)),IF(ISERROR(SEARCH(\"*GOV*\",Failing_Kids!$F415,1)),IF(ISERROR(SEARCH(\"*Econ*\",Failing_Kids!$F415,1)),IF(ISERROR(SEARCH(\"*Soc*\",Failing_Kids!$F415,1)),\"\",\"X\"),\"X\"),\"X\"),\"X\")","v":""},{"$f":"IF(ISERROR(SEARCH(\"*PE*\",Failing_Kids!$F415,1)),\"\",\"X\")","v":""}]
[{"$f":"Failing_Kids!C416","v":"Stevens"},{"$f":"Failing_Kids!D416","v":"Brian"},{"$f":"IF(ISERROR(SEARCH(\"*English*\",Failing_Kids!F416,1)),\"\",\"X \")","v":"X "},{"$f":"IF(ISERROR(SEARCH(\"*Geometry*\",Failing_Kids!$F416,1)),IF(ISERROR(SEARCH(\"*Math*\",Failing_Kids!$F416,1)),IF(ISERROR(SEARCH(\"*Calc*\",Failing_Kids!$F416,1)),IF(ISERROR(SEARCH(\"*Algebra*\",Failing_Kids!$F416,1)),\"\",\"X\"),\"X\"),\"X\"),\"X\")","v":""},{"$f":"IF(ISERROR(SEARCH(\"*Science*\",Failing_Kids!$F416,1)),IF(ISERROR(SEARCH(\"*Bio*\",Failing_Kids!$F416,1)),IF(ISERROR(SEARCH(\"*Chem*\",Failing_Kids!$F416,1)),IF(ISERROR(SEARCH(\"*Physics*\",Failing_Kids!$F416,1)),\"\",\"X\"),\"X\"),\"X\"),\"X\")","v":""},{"$f":"IF(ISERROR(SEARCH(\"*His*\",Failing_Kids!$F416,1)),IF(ISERROR(SEARCH(\"*GOV*\",Failing_Kids!$F416,1)),IF(ISERROR(SEARCH(\"*Econ*\",Failing_Kids!$F416,1)),IF(ISERROR(SEARCH(\"*Soc*\",Failing_Kids!$F416,1)),\"\",\"X\"),\"X\"),\"X\"),\"X\")","v":""},{"$f":"IF(ISERROR(SEARCH(\"*PE*\",Failing_Kids!$F416,1)),\"\",\"X\")","v":""}]
[{"$f":"Failing_Kids!C417","v":"Stevenson"},{"$f":"Failing_Kids!D417","v":"Gloria"},{"$f":"IF(ISERROR(SEARCH(\"*English*\",Failing_Kids!F417,1)),\"\",\"X \")","v":""},{"$f":"IF(ISERROR(SEARCH(\"*Geometry*\",Failing_Kids!$F417,1)),IF(ISERROR(SEARCH(\"*Math*\",Failing_Kids!$F417,1)),IF(ISERROR(SEARCH(\"*Calc*\",Failing_Kids!$F417,1)),IF(ISERROR(SEARCH(\"*Algebra*\",Failing_Kids!$F417,1)),\"\",\"X\"),\"X\"),\"X\"),\"X\")","v":"X"},{"$f":"IF(ISERROR(SEARCH(\"*Science*\",Failing_Kids!$F417,1)),IF(ISERROR(SEARCH(\"*Bio*\",Failing_Kids!$F417,1)),IF(ISERROR(SEARCH(\"*Chem*\",Failing_Kids!$F417,1)),IF(ISERROR(SEARCH(\"*Physics*\",Failing_Kids!$F417,1)),\"\",\"X\"),\"X\"),\"X\"),\"X\")","v":""},{"$f":"IF(ISERROR(SEARCH(\"*His*\",Failing_Kids!$F417,1)),IF(ISERROR(SEARCH(\"*GOV*\",Failing_Kids!$F417,1)),IF(ISERROR(SEARCH(\"*Econ*\",Failing_Kids!$F417,1)),IF(ISERROR(SEARCH(\"*Soc*\",Failing_Kids!$F417,1)),\"\",\"X\"),\"X\"),\"X\"),\"X\")","v":""},{"$f":"IF(ISERROR(SEARCH(\"*PE*\",Failing_Kids!$F417,1)),\"\",\"X\")","v":""}]
[{"$f":"Failing_Kids!C418","v":"Stout"},{"$f":"Failing_Kids!D418","v":"Shelly"},{"$f":"IF(ISERROR(SEARCH(\"*English*\",Failing_Kids!F418,1)),\"\",\"X \")","v":""},{"$f":"IF(ISERROR(SEARCH(\"*Geometry*\",Failing_Kids!$F418,1)),IF(ISERROR(SEARCH(\"*Math*\",Failing_Kids!$F418,1)),IF(ISERROR(SEARCH(\"*Calc*\",Failing_Kids!$F418,1)),IF(ISERROR(SEARCH(\"*Algebra*\",Failing_Kids!$F418,1)),\"\",\"X\"),\"X\"),\"X\"),\"X\")","v":"X"},{"$f":"IF(ISERROR(SEARCH(\"*Science*\",Failing_Kids!$F418,1)),IF(ISERROR(SEARCH(\"*Bio*\",Failing_Kids!$F418,1)),IF(ISERROR(SEARCH(\"*Chem*\",Failing_Kids!$F418,1)),IF(ISERROR(SEARCH(\"*Physics*\",Failing_Kids!$F418,1)),\"\",\"X\"),\"X\"),\"X\"),\"X\")","v":""},{"$f":"IF(ISERROR(SEARCH(\"*His*\",Failing_Kids!$F418,1)),IF(ISERROR(SEARCH(\"*GOV*\",Failing_Kids!$F418,1)),IF(ISERROR(SEARCH(\"*Econ*\",Failing_Kids!$F418,1)),IF(ISERROR(SEARCH(\"*Soc*\",Failing_Kids!$F418,1)),\"\",\"X\"),\"X\"),\"X\"),\"X\")","v":""},{"$f":"IF(ISERROR(SEARCH(\"*PE*\",Failing_Kids!$F418,1)),\"\",\"X\")","v":""}]
[{"$f":"Failing_Kids!C419","v":"Strickland"},{"$f":"Failing_Kids!D419","v":"John"},{"$f":"IF(ISERROR(SEARCH(\"*English*\",Failing_Kids!F419,1)),\"\",\"X \")","v":""},{"$f":"IF(ISERROR(SEARCH(\"*Geometry*\",Failing_Kids!$F419,1)),IF(ISERROR(SEARCH(\"*Math*\",Failing_Kids!$F419,1)),IF(ISERROR(SEARCH(\"*Calc*\",Failing_Kids!$F419,1)),IF(ISERROR(SEARCH(\"*Algebra*\",Failing_Kids!$F419,1)),\"\",\"X\"),\"X\"),\"X\"),\"X\")","v":""},{"$f":"IF(ISERROR(SEARCH(\"*Science*\",Failing_Kids!$F419,1)),IF(ISERROR(SEARCH(\"*Bio*\",Failing_Kids!$F419,1)),IF(ISERROR(SEARCH(\"*Chem*\",Failing_Kids!$F419,1)),IF(ISERROR(SEARCH(\"*Physics*\",Failing_Kids!$F419,1)),\"\",\"X\"),\"X\"),\"X\"),\"X\")","v":""},{"$f":"IF(ISERROR(SEARCH(\"*His*\",Failing_Kids!$F419,1)),IF(ISERROR(SEARCH(\"*GOV*\",Failing_Kids!$F419,1)),IF(ISERROR(SEARCH(\"*Econ*\",Failing_Kids!$F419,1)),IF(ISERROR(SEARCH(\"*Soc*\",Failing_Kids!$F419,1)),\"\",\"X\"),\"X\"),\"X\"),\"X\")","v":""},{"$f":"IF(ISERROR(SEARCH(\"*PE*\",Failing_Kids!$F419,1)),\"\",\"X\")","v":""}]
[{"$f":"Failing_Kids!C420","v":"Stuart"},{"$f":"Failing_Kids!D420","v":"Jeremy"},{"$f":"IF(ISERROR(SEARCH(\"*English*\",Failing_Kids!F420,1)),\"\",\"X \")","v":""},{"$f":"IF(ISERROR(SEARCH(\"*Geometry*\",Failing_Kids!$F420,1)),IF(ISERROR(SEARCH(\"*Math*\",Failing_Kids!$F420,1)),IF(ISERROR(SEARCH(\"*Calc*\",Failing_Kids!$F420,1)),IF(ISERROR(SEARCH(\"*Algebra*\",Failing_Kids!$F420,1)),\"\",\"X\"),\"X\"),\"X\"),\"X\")","v":""},{"$f":"IF(ISERROR(SEARCH(\"*Science*\",Failing_Kids!$F420,1)),IF(ISERROR(SEARCH(\"*Bio*\",Failing_Kids!$F420,1)),IF(ISERROR(SEARCH(\"*Chem*\",Failing_Kids!$F420,1)),IF(ISERROR(SEARCH(\"*Physics*\",Failing_Kids!$F420,1)),\"\",\"X\"),\"X\"),\"X\"),\"X\")","v":""},{"$f":"IF(ISERROR(SEARCH(\"*His*\",Failing_Kids!$F420,1)),IF(ISERROR(SEARCH(\"*GOV*\",Failing_Kids!$F420,1)),IF(ISERROR(SEARCH(\"*Econ*\",Failing_Kids!$F420,1)),IF(ISERROR(SEARCH(\"*Soc*\",Failing_Kids!$F420,1)),\"\",\"X\"),\"X\"),\"X\"),\"X\")","v":""},{"$f":"IF(ISERROR(SEARCH(\"*PE*\",Failing_Kids!$F420,1)),\"\",\"X\")","v":""}]
[{"$f":"Failing_Kids!C421","v":"Summers"},{"$f":"Failing_Kids!D421","v":"Melissa"},{"$f":"IF(ISERROR(SEARCH(\"*English*\",Failing_Kids!F421,1)),\"\",\"X \")","v":""},{"$f":"IF(ISERROR(SEARCH(\"*Geometry*\",Failing_Kids!$F421,1)),IF(ISERROR(SEARCH(\"*Math*\",Failing_Kids!$F421,1)),IF(ISERROR(SEARCH(\"*Calc*\",Failing_Kids!$F421,1)),IF(ISERROR(SEARCH(\"*Algebra*\",Failing_Kids!$F421,1)),\"\",\"X\"),\"X\"),\"X\"),\"X\")","v":"X"},{"$f":"IF(ISERROR(SEARCH(\"*Science*\",Failing_Kids!$F421,1)),IF(ISERROR(SEARCH(\"*Bio*\",Failing_Kids!$F421,1)),IF(ISERROR(SEARCH(\"*Chem*\",Failing_Kids!$F421,1)),IF(ISERROR(SEARCH(\"*Physics*\",Failing_Kids!$F421,1)),\"\",\"X\"),\"X\"),\"X\"),\"X\")","v":""},{"$f":"IF(ISERROR(SEARCH(\"*His*\",Failing_Kids!$F421,1)),IF(ISERROR(SEARCH(\"*GOV*\",Failing_Kids!$F421,1)),IF(ISERROR(SEARCH(\"*Econ*\",Failing_Kids!$F421,1)),IF(ISERROR(SEARCH(\"*Soc*\",Failing_Kids!$F421,1)),\"\",\"X\"),\"X\"),\"X\"),\"X\")","v":""},{"$f":"IF(ISERROR(SEARCH(\"*PE*\",Failing_Kids!$F421,1)),\"\",\"X\")","v":""}]
[{"$f":"Failing_Kids!C422","v":"Swanson"},{"$f":"Failing_Kids!D422","v":"Ada"},{"$f":"IF(ISERROR(SEARCH(\"*English*\",Failing_Kids!F422,1)),\"\",\"X \")","v":"X "},{"$f":"IF(ISERROR(SEARCH(\"*Geometry*\",Failing_Kids!$F422,1)),IF(ISERROR(SEARCH(\"*Math*\",Failing_Kids!$F422,1)),IF(ISERROR(SEARCH(\"*Calc*\",Failing_Kids!$F422,1)),IF(ISERROR(SEARCH(\"*Algebra*\",Failing_Kids!$F422,1)),\"\",\"X\"),\"X\"),\"X\"),\"X\")","v":""},{"$f":"IF(ISERROR(SEARCH(\"*Science*\",Failing_Kids!$F422,1)),IF(ISERROR(SEARCH(\"*Bio*\",Failing_Kids!$F422,1)),IF(ISERROR(SEARCH(\"*Chem*\",Failing_Kids!$F422,1)),IF(ISERROR(SEARCH(\"*Physics*\",Failing_Kids!$F422,1)),\"\",\"X\"),\"X\"),\"X\"),\"X\")","v":""},{"$f":"IF(ISERROR(SEARCH(\"*His*\",Failing_Kids!$F422,1)),IF(ISERROR(SEARCH(\"*GOV*\",Failing_Kids!$F422,1)),IF(ISERROR(SEARCH(\"*Econ*\",Failing_Kids!$F422,1)),IF(ISERROR(SEARCH(\"*Soc*\",Failing_Kids!$F422,1)),\"\",\"X\"),\"X\"),\"X\"),\"X\")","v":""},{"$f":"IF(ISERROR(SEARCH(\"*PE*\",Failing_Kids!$F422,1)),\"\",\"X\")","v":""}]
[{"$f":"Failing_Kids!C423","v":"Sykes"},{"$f":"Failing_Kids!D423","v":"Kevin"},{"$f":"IF(ISERROR(SEARCH(\"*English*\",Failing_Kids!F423,1)),\"\",\"X \")","v":""},{"$f":"IF(ISERROR(SEARCH(\"*Geometry*\",Failing_Kids!$F423,1)),IF(ISERROR(SEARCH(\"*Math*\",Failing_Kids!$F423,1)),IF(ISERROR(SEARCH(\"*Calc*\",Failing_Kids!$F423,1)),IF(ISERROR(SEARCH(\"*Algebra*\",Failing_Kids!$F423,1)),\"\",\"X\"),\"X\"),\"X\"),\"X\")","v":""},{"$f":"IF(ISERROR(SEARCH(\"*Science*\",Failing_Kids!$F423,1)),IF(ISERROR(SEARCH(\"*Bio*\",Failing_Kids!$F423,1)),IF(ISERROR(SEARCH(\"*Chem*\",Failing_Kids!$F423,1)),IF(ISERROR(SEARCH(\"*Physics*\",Failing_Kids!$F423,1)),\"\",\"X\"),\"X\"),\"X\"),\"X\")","v":""},{"$f":"IF(ISERROR(SEARCH(\"*His*\",Failing_Kids!$F423,1)),IF(ISERROR(SEARCH(\"*GOV*\",Failing_Kids!$F423,1)),IF(ISERROR(SEARCH(\"*Econ*\",Failing_Kids!$F423,1)),IF(ISERROR(SEARCH(\"*Soc*\",Failing_Kids!$F423,1)),\"\",\"X\"),\"X\"),\"X\"),\"X\")","v":""},{"$f":"IF(ISERROR(SEARCH(\"*PE*\",Failing_Kids!$F423,1)),\"\",\"X\")","v":""}]
[{"$f":"Failing_Kids!C424","v":"Tanner"},{"$f":"Failing_Kids!D424","v":"Kenneth"},{"$f":"IF(ISERROR(SEARCH(\"*English*\",Failing_Kids!F424,1)),\"\",\"X \")","v":"X "},{"$f":"IF(ISERROR(SEARCH(\"*Geometry*\",Failing_Kids!$F424,1)),IF(ISERROR(SEARCH(\"*Math*\",Failing_Kids!$F424,1)),IF(ISERROR(SEARCH(\"*Calc*\",Failing_Kids!$F424,1)),IF(ISERROR(SEARCH(\"*Algebra*\",Failing_Kids!$F424,1)),\"\",\"X\"),\"X\"),\"X\"),\"X\")","v":""},{"$f":"IF(ISERROR(SEARCH(\"*Science*\",Failing_Kids!$F424,1)),IF(ISERROR(SEARCH(\"*Bio*\",Failing_Kids!$F424,1)),IF(ISERROR(SEARCH(\"*Chem*\",Failing_Kids!$F424,1)),IF(ISERROR(SEARCH(\"*Physics*\",Failing_Kids!$F424,1)),\"\",\"X\"),\"X\"),\"X\"),\"X\")","v":""},{"$f":"IF(ISERROR(SEARCH(\"*His*\",Failing_Kids!$F424,1)),IF(ISERROR(SEARCH(\"*GOV*\",Failing_Kids!$F424,1)),IF(ISERROR(SEARCH(\"*Econ*\",Failing_Kids!$F424,1)),IF(ISERROR(SEARCH(\"*Soc*\",Failing_Kids!$F424,1)),\"\",\"X\"),\"X\"),\"X\"),\"X\")","v":""},{"$f":"IF(ISERROR(SEARCH(\"*PE*\",Failing_Kids!$F424,1)),\"\",\"X\")","v":""}]
[{"$f":"Failing_Kids!C425","v":"Thompson"},{"$f":"Failing_Kids!D425","v":"Jerry"},{"$f":"IF(ISERROR(SEARCH(\"*English*\",Failing_Kids!F425,1)),\"\",\"X \")","v":""},{"$f":"IF(ISERROR(SEARCH(\"*Geometry*\",Failing_Kids!$F425,1)),IF(ISERROR(SEARCH(\"*Math*\",Failing_Kids!$F425,1)),IF(ISERROR(SEARCH(\"*Calc*\",Failing_Kids!$F425,1)),IF(ISERROR(SEARCH(\"*Algebra*\",Failing_Kids!$F425,1)),\"\",\"X\"),\"X\"),\"X\"),\"X\")","v":"X"},{"$f":"IF(ISERROR(SEARCH(\"*Science*\",Failing_Kids!$F425,1)),IF(ISERROR(SEARCH(\"*Bio*\",Failing_Kids!$F425,1)),IF(ISERROR(SEARCH(\"*Chem*\",Failing_Kids!$F425,1)),IF(ISERROR(SEARCH(\"*Physics*\",Failing_Kids!$F425,1)),\"\",\"X\"),\"X\"),\"X\"),\"X\")","v":""},{"$f":"IF(ISERROR(SEARCH(\"*His*\",Failing_Kids!$F425,1)),IF(ISERROR(SEARCH(\"*GOV*\",Failing_Kids!$F425,1)),IF(ISERROR(SEARCH(\"*Econ*\",Failing_Kids!$F425,1)),IF(ISERROR(SEARCH(\"*Soc*\",Failing_Kids!$F425,1)),\"\",\"X\"),\"X\"),\"X\"),\"X\")","v":""},{"$f":"IF(ISERROR(SEARCH(\"*PE*\",Failing_Kids!$F425,1)),\"\",\"X\")","v":""}]
[{"$f":"Failing_Kids!C426","v":"Thornton"},{"$f":"Failing_Kids!D426","v":"Rodney"},{"$f":"IF(ISERROR(SEARCH(\"*English*\",Failing_Kids!F426,1)),\"\",\"X \")","v":""},{"$f":"IF(ISERROR(SEARCH(\"*Geometry*\",Failing_Kids!$F426,1)),IF(ISERROR(SEARCH(\"*Math*\",Failing_Kids!$F426,1)),IF(ISERROR(SEARCH(\"*Calc*\",Failing_Kids!$F426,1)),IF(ISERROR(SEARCH(\"*Algebra*\",Failing_Kids!$F426,1)),\"\",\"X\"),\"X\"),\"X\"),\"X\")","v":""},{"$f":"IF(ISERROR(SEARCH(\"*Science*\",Failing_Kids!$F426,1)),IF(ISERROR(SEARCH(\"*Bio*\",Failing_Kids!$F426,1)),IF(ISERROR(SEARCH(\"*Chem*\",Failing_Kids!$F426,1)),IF(ISERROR(SEARCH(\"*Physics*\",Failing_Kids!$F426,1)),\"\",\"X\"),\"X\"),\"X\"),\"X\")","v":""},{"$f":"IF(ISERROR(SEARCH(\"*His*\",Failing_Kids!$F426,1)),IF(ISERROR(SEARCH(\"*GOV*\",Failing_Kids!$F426,1)),IF(ISERROR(SEARCH(\"*Econ*\",Failing_Kids!$F426,1)),IF(ISERROR(SEARCH(\"*Soc*\",Failing_Kids!$F426,1)),\"\",\"X\"),\"X\"),\"X\"),\"X\")","v":"X"},{"$f":"IF(ISERROR(SEARCH(\"*PE*\",Failing_Kids!$F426,1)),\"\",\"X\")","v":""}]
[{"$f":"Failing_Kids!C427","v":"Torres"},{"$f":"Failing_Kids!D427","v":"Nellie"},{"$f":"IF(ISERROR(SEARCH(\"*English*\",Failing_Kids!F427,1)),\"\",\"X \")","v":""},{"$f":"IF(ISERROR(SEARCH(\"*Geometry*\",Failing_Kids!$F427,1)),IF(ISERROR(SEARCH(\"*Math*\",Failing_Kids!$F427,1)),IF(ISERROR(SEARCH(\"*Calc*\",Failing_Kids!$F427,1)),IF(ISERROR(SEARCH(\"*Algebra*\",Failing_Kids!$F427,1)),\"\",\"X\"),\"X\"),\"X\"),\"X\")","v":""},{"$f":"IF(ISERROR(SEARCH(\"*Science*\",Failing_Kids!$F427,1)),IF(ISERROR(SEARCH(\"*Bio*\",Failing_Kids!$F427,1)),IF(ISERROR(SEARCH(\"*Chem*\",Failing_Kids!$F427,1)),IF(ISERROR(SEARCH(\"*Physics*\",Failing_Kids!$F427,1)),\"\",\"X\"),\"X\"),\"X\"),\"X\")","v":""},{"$f":"IF(ISERROR(SEARCH(\"*His*\",Failing_Kids!$F427,1)),IF(ISERROR(SEARCH(\"*GOV*\",Failing_Kids!$F427,1)),IF(ISERROR(SEARCH(\"*Econ*\",Failing_Kids!$F427,1)),IF(ISERROR(SEARCH(\"*Soc*\",Failing_Kids!$F427,1)),\"\",\"X\"),\"X\"),\"X\"),\"X\")","v":"X"},{"$f":"IF(ISERROR(SEARCH(\"*PE*\",Failing_Kids!$F427,1)),\"\",\"X\")","v":""}]
[{"$f":"Failing_Kids!C428","v":"Travis"},{"$f":"Failing_Kids!D428","v":"Nancy"},{"$f":"IF(ISERROR(SEARCH(\"*English*\",Failing_Kids!F428,1)),\"\",\"X \")","v":""},{"$f":"IF(ISERROR(SEARCH(\"*Geometry*\",Failing_Kids!$F428,1)),IF(ISERROR(SEARCH(\"*Math*\",Failing_Kids!$F428,1)),IF(ISERROR(SEARCH(\"*Calc*\",Failing_Kids!$F428,1)),IF(ISERROR(SEARCH(\"*Algebra*\",Failing_Kids!$F428,1)),\"\",\"X\"),\"X\"),\"X\"),\"X\")","v":""},{"$f":"IF(ISERROR(SEARCH(\"*Science*\",Failing_Kids!$F428,1)),IF(ISERROR(SEARCH(\"*Bio*\",Failing_Kids!$F428,1)),IF(ISERROR(SEARCH(\"*Chem*\",Failing_Kids!$F428,1)),IF(ISERROR(SEARCH(\"*Physics*\",Failing_Kids!$F428,1)),\"\",\"X\"),\"X\"),\"X\"),\"X\")","v":"X"},{"$f":"IF(ISERROR(SEARCH(\"*His*\",Failing_Kids!$F428,1)),IF(ISERROR(SEARCH(\"*GOV*\",Failing_Kids!$F428,1)),IF(ISERROR(SEARCH(\"*Econ*\",Failing_Kids!$F428,1)),IF(ISERROR(SEARCH(\"*Soc*\",Failing_Kids!$F428,1)),\"\",\"X\"),\"X\"),\"X\"),\"X\")","v":""},{"$f":"IF(ISERROR(SEARCH(\"*PE*\",Failing_Kids!$F428,1)),\"\",\"X\")","v":""}]
[{"$f":"Failing_Kids!C429","v":"Valencia"},{"$f":"Failing_Kids!D429","v":"Curtis"},{"$f":"IF(ISERROR(SEARCH(\"*English*\",Failing_Kids!F429,1)),\"\",\"X \")","v":""},{"$f":"IF(ISERROR(SEARCH(\"*Geometry*\",Failing_Kids!$F429,1)),IF(ISERROR(SEARCH(\"*Math*\",Failing_Kids!$F429,1)),IF(ISERROR(SEARCH(\"*Calc*\",Failing_Kids!$F429,1)),IF(ISERROR(SEARCH(\"*Algebra*\",Failing_Kids!$F429,1)),\"\",\"X\"),\"X\"),\"X\"),\"X\")","v":"X"},{"$f":"IF(ISERROR(SEARCH(\"*Science*\",Failing_Kids!$F429,1)),IF(ISERROR(SEARCH(\"*Bio*\",Failing_Kids!$F429,1)),IF(ISERROR(SEARCH(\"*Chem*\",Failing_Kids!$F429,1)),IF(ISERROR(SEARCH(\"*Physics*\",Failing_Kids!$F429,1)),\"\",\"X\"),\"X\"),\"X\"),\"X\")","v":""},{"$f":"IF(ISERROR(SEARCH(\"*His*\",Failing_Kids!$F429,1)),IF(ISERROR(SEARCH(\"*GOV*\",Failing_Kids!$F429,1)),IF(ISERROR(SEARCH(\"*Econ*\",Failing_Kids!$F429,1)),IF(ISERROR(SEARCH(\"*Soc*\",Failing_Kids!$F429,1)),\"\",\"X\"),\"X\"),\"X\"),\"X\")","v":""},{"$f":"IF(ISERROR(SEARCH(\"*PE*\",Failing_Kids!$F429,1)),\"\",\"X\")","v":""}]
[{"$f":"Failing_Kids!C430","v":"Vance"},{"$f":"Failing_Kids!D430","v":"Victoria"},{"$f":"IF(ISERROR(SEARCH(\"*English*\",Failing_Kids!F430,1)),\"\",\"X \")","v":""},{"$f":"IF(ISERROR(SEARCH(\"*Geometry*\",Failing_Kids!$F430,1)),IF(ISERROR(SEARCH(\"*Math*\",Failing_Kids!$F430,1)),IF(ISERROR(SEARCH(\"*Calc*\",Failing_Kids!$F430,1)),IF(ISERROR(SEARCH(\"*Algebra*\",Failing_Kids!$F430,1)),\"\",\"X\"),\"X\"),\"X\"),\"X\")","v":""},{"$f":"IF(ISERROR(SEARCH(\"*Science*\",Failing_Kids!$F430,1)),IF(ISERROR(SEARCH(\"*Bio*\",Failing_Kids!$F430,1)),IF(ISERROR(SEARCH(\"*Chem*\",Failing_Kids!$F430,1)),IF(ISERROR(SEARCH(\"*Physics*\",Failing_Kids!$F430,1)),\"\",\"X\"),\"X\"),\"X\"),\"X\")","v":""},{"$f":"IF(ISERROR(SEARCH(\"*His*\",Failing_Kids!$F430,1)),IF(ISERROR(SEARCH(\"*GOV*\",Failing_Kids!$F430,1)),IF(ISERROR(SEARCH(\"*Econ*\",Failing_Kids!$F430,1)),IF(ISERROR(SEARCH(\"*Soc*\",Failing_Kids!$F430,1)),\"\",\"X\"),\"X\"),\"X\"),\"X\")","v":"X"},{"$f":"IF(ISERROR(SEARCH(\"*PE*\",Failing_Kids!$F430,1)),\"\",\"X\")","v":""}]
[{"$f":"Failing_Kids!C431","v":"Vance"},{"$f":"Failing_Kids!D431","v":"Victoria"},{"$f":"IF(ISERROR(SEARCH(\"*English*\",Failing_Kids!F431,1)),\"\",\"X \")","v":""},{"$f":"IF(ISERROR(SEARCH(\"*Geometry*\",Failing_Kids!$F431,1)),IF(ISERROR(SEARCH(\"*Math*\",Failing_Kids!$F431,1)),IF(ISERROR(SEARCH(\"*Calc*\",Failing_Kids!$F431,1)),IF(ISERROR(SEARCH(\"*Algebra*\",Failing_Kids!$F431,1)),\"\",\"X\"),\"X\"),\"X\"),\"X\")","v":""},{"$f":"IF(ISERROR(SEARCH(\"*Science*\",Failing_Kids!$F431,1)),IF(ISERROR(SEARCH(\"*Bio*\",Failing_Kids!$F431,1)),IF(ISERROR(SEARCH(\"*Chem*\",Failing_Kids!$F431,1)),IF(ISERROR(SEARCH(\"*Physics*\",Failing_Kids!$F431,1)),\"\",\"X\"),\"X\"),\"X\"),\"X\")","v":""},{"$f":"IF(ISERROR(SEARCH(\"*His*\",Failing_Kids!$F431,1)),IF(ISERROR(SEARCH(\"*GOV*\",Failing_Kids!$F431,1)),IF(ISERROR(SEARCH(\"*Econ*\",Failing_Kids!$F431,1)),IF(ISERROR(SEARCH(\"*Soc*\",Failing_Kids!$F431,1)),\"\",\"X\"),\"X\"),\"X\"),\"X\")","v":"X"},{"$f":"IF(ISERROR(SEARCH(\"*PE*\",Failing_Kids!$F431,1)),\"\",\"X\")","v":""}]
[{"$f":"Failing_Kids!C432","v":"Vang"},{"$f":"Failing_Kids!D432","v":"Glenn"},{"$f":"IF(ISERROR(SEARCH(\"*English*\",Failing_Kids!F432,1)),\"\",\"X \")","v":""},{"$f":"IF(ISERROR(SEARCH(\"*Geometry*\",Failing_Kids!$F432,1)),IF(ISERROR(SEARCH(\"*Math*\",Failing_Kids!$F432,1)),IF(ISERROR(SEARCH(\"*Calc*\",Failing_Kids!$F432,1)),IF(ISERROR(SEARCH(\"*Algebra*\",Failing_Kids!$F432,1)),\"\",\"X\"),\"X\"),\"X\"),\"X\")","v":""},{"$f":"IF(ISERROR(SEARCH(\"*Science*\",Failing_Kids!$F432,1)),IF(ISERROR(SEARCH(\"*Bio*\",Failing_Kids!$F432,1)),IF(ISERROR(SEARCH(\"*Chem*\",Failing_Kids!$F432,1)),IF(ISERROR(SEARCH(\"*Physics*\",Failing_Kids!$F432,1)),\"\",\"X\"),\"X\"),\"X\"),\"X\")","v":""},{"$f":"IF(ISERROR(SEARCH(\"*His*\",Failing_Kids!$F432,1)),IF(ISERROR(SEARCH(\"*GOV*\",Failing_Kids!$F432,1)),IF(ISERROR(SEARCH(\"*Econ*\",Failing_Kids!$F432,1)),IF(ISERROR(SEARCH(\"*Soc*\",Failing_Kids!$F432,1)),\"\",\"X\"),\"X\"),\"X\"),\"X\")","v":"X"},{"$f":"IF(ISERROR(SEARCH(\"*PE*\",Failing_Kids!$F432,1)),\"\",\"X\")","v":""}]
[{"$f":"Failing_Kids!C433","v":"Vega"},{"$f":"Failing_Kids!D433","v":"Catherine"},{"$f":"IF(ISERROR(SEARCH(\"*English*\",Failing_Kids!F433,1)),\"\",\"X \")","v":""},{"$f":"IF(ISERROR(SEARCH(\"*Geometry*\",Failing_Kids!$F433,1)),IF(ISERROR(SEARCH(\"*Math*\",Failing_Kids!$F433,1)),IF(ISERROR(SEARCH(\"*Calc*\",Failing_Kids!$F433,1)),IF(ISERROR(SEARCH(\"*Algebra*\",Failing_Kids!$F433,1)),\"\",\"X\"),\"X\"),\"X\"),\"X\")","v":"X"},{"$f":"IF(ISERROR(SEARCH(\"*Science*\",Failing_Kids!$F433,1)),IF(ISERROR(SEARCH(\"*Bio*\",Failing_Kids!$F433,1)),IF(ISERROR(SEARCH(\"*Chem*\",Failing_Kids!$F433,1)),IF(ISERROR(SEARCH(\"*Physics*\",Failing_Kids!$F433,1)),\"\",\"X\"),\"X\"),\"X\"),\"X\")","v":""},{"$f":"IF(ISERROR(SEARCH(\"*His*\",Failing_Kids!$F433,1)),IF(ISERROR(SEARCH(\"*GOV*\",Failing_Kids!$F433,1)),IF(ISERROR(SEARCH(\"*Econ*\",Failing_Kids!$F433,1)),IF(ISERROR(SEARCH(\"*Soc*\",Failing_Kids!$F433,1)),\"\",\"X\"),\"X\"),\"X\"),\"X\")","v":""},{"$f":"IF(ISERROR(SEARCH(\"*PE*\",Failing_Kids!$F433,1)),\"\",\"X\")","v":""}]
[{"$f":"Failing_Kids!C434","v":"Vega"},{"$f":"Failing_Kids!D434","v":"Catherine"},{"$f":"IF(ISERROR(SEARCH(\"*English*\",Failing_Kids!F434,1)),\"\",\"X \")","v":""},{"$f":"IF(ISERROR(SEARCH(\"*Geometry*\",Failing_Kids!$F434,1)),IF(ISERROR(SEARCH(\"*Math*\",Failing_Kids!$F434,1)),IF(ISERROR(SEARCH(\"*Calc*\",Failing_Kids!$F434,1)),IF(ISERROR(SEARCH(\"*Algebra*\",Failing_Kids!$F434,1)),\"\",\"X\"),\"X\"),\"X\"),\"X\")","v":""},{"$f":"IF(ISERROR(SEARCH(\"*Science*\",Failing_Kids!$F434,1)),IF(ISERROR(SEARCH(\"*Bio*\",Failing_Kids!$F434,1)),IF(ISERROR(SEARCH(\"*Chem*\",Failing_Kids!$F434,1)),IF(ISERROR(SEARCH(\"*Physics*\",Failing_Kids!$F434,1)),\"\",\"X\"),\"X\"),\"X\"),\"X\")","v":""},{"$f":"IF(ISERROR(SEARCH(\"*His*\",Failing_Kids!$F434,1)),IF(ISERROR(SEARCH(\"*GOV*\",Failing_Kids!$F434,1)),IF(ISERROR(SEARCH(\"*Econ*\",Failing_Kids!$F434,1)),IF(ISERROR(SEARCH(\"*Soc*\",Failing_Kids!$F434,1)),\"\",\"X\"),\"X\"),\"X\"),\"X\")","v":"X"},{"$f":"IF(ISERROR(SEARCH(\"*PE*\",Failing_Kids!$F434,1)),\"\",\"X\")","v":""}]
[{"$f":"Failing_Kids!C435","v":"Velazquez"},{"$f":"Failing_Kids!D435","v":"Benjamin"},{"$f":"IF(ISERROR(SEARCH(\"*English*\",Failing_Kids!F435,1)),\"\",\"X \")","v":""},{"$f":"IF(ISERROR(SEARCH(\"*Geometry*\",Failing_Kids!$F435,1)),IF(ISERROR(SEARCH(\"*Math*\",Failing_Kids!$F435,1)),IF(ISERROR(SEARCH(\"*Calc*\",Failing_Kids!$F435,1)),IF(ISERROR(SEARCH(\"*Algebra*\",Failing_Kids!$F435,1)),\"\",\"X\"),\"X\"),\"X\"),\"X\")","v":""},{"$f":"IF(ISERROR(SEARCH(\"*Science*\",Failing_Kids!$F435,1)),IF(ISERROR(SEARCH(\"*Bio*\",Failing_Kids!$F435,1)),IF(ISERROR(SEARCH(\"*Chem*\",Failing_Kids!$F435,1)),IF(ISERROR(SEARCH(\"*Physics*\",Failing_Kids!$F435,1)),\"\",\"X\"),\"X\"),\"X\"),\"X\")","v":"X"},{"$f":"IF(ISERROR(SEARCH(\"*His*\",Failing_Kids!$F435,1)),IF(ISERROR(SEARCH(\"*GOV*\",Failing_Kids!$F435,1)),IF(ISERROR(SEARCH(\"*Econ*\",Failing_Kids!$F435,1)),IF(ISERROR(SEARCH(\"*Soc*\",Failing_Kids!$F435,1)),\"\",\"X\"),\"X\"),\"X\"),\"X\")","v":""},{"$f":"IF(ISERROR(SEARCH(\"*PE*\",Failing_Kids!$F435,1)),\"\",\"X\")","v":""}]
[{"$f":"Failing_Kids!C436","v":"Waller"},{"$f":"Failing_Kids!D436","v":"Ann"},{"$f":"IF(ISERROR(SEARCH(\"*English*\",Failing_Kids!F436,1)),\"\",\"X \")","v":""},{"$f":"IF(ISERROR(SEARCH(\"*Geometry*\",Failing_Kids!$F436,1)),IF(ISERROR(SEARCH(\"*Math*\",Failing_Kids!$F436,1)),IF(ISERROR(SEARCH(\"*Calc*\",Failing_Kids!$F436,1)),IF(ISERROR(SEARCH(\"*Algebra*\",Failing_Kids!$F436,1)),\"\",\"X\"),\"X\"),\"X\"),\"X\")","v":"X"},{"$f":"IF(ISERROR(SEARCH(\"*Science*\",Failing_Kids!$F436,1)),IF(ISERROR(SEARCH(\"*Bio*\",Failing_Kids!$F436,1)),IF(ISERROR(SEARCH(\"*Chem*\",Failing_Kids!$F436,1)),IF(ISERROR(SEARCH(\"*Physics*\",Failing_Kids!$F436,1)),\"\",\"X\"),\"X\"),\"X\"),\"X\")","v":""},{"$f":"IF(ISERROR(SEARCH(\"*His*\",Failing_Kids!$F436,1)),IF(ISERROR(SEARCH(\"*GOV*\",Failing_Kids!$F436,1)),IF(ISERROR(SEARCH(\"*Econ*\",Failing_Kids!$F436,1)),IF(ISERROR(SEARCH(\"*Soc*\",Failing_Kids!$F436,1)),\"\",\"X\"),\"X\"),\"X\"),\"X\")","v":""},{"$f":"IF(ISERROR(SEARCH(\"*PE*\",Failing_Kids!$F436,1)),\"\",\"X\")","v":""}]
[{"$f":"Failing_Kids!C437","v":"Waller"},{"$f":"Failing_Kids!D437","v":"Ann"},{"$f":"IF(ISERROR(SEARCH(\"*English*\",Failing_Kids!F437,1)),\"\",\"X \")","v":""},{"$f":"IF(ISERROR(SEARCH(\"*Geometry*\",Failing_Kids!$F437,1)),IF(ISERROR(SEARCH(\"*Math*\",Failing_Kids!$F437,1)),IF(ISERROR(SEARCH(\"*Calc*\",Failing_Kids!$F437,1)),IF(ISERROR(SEARCH(\"*Algebra*\",Failing_Kids!$F437,1)),\"\",\"X\"),\"X\"),\"X\"),\"X\")","v":""},{"$f":"IF(ISERROR(SEARCH(\"*Science*\",Failing_Kids!$F437,1)),IF(ISERROR(SEARCH(\"*Bio*\",Failing_Kids!$F437,1)),IF(ISERROR(SEARCH(\"*Chem*\",Failing_Kids!$F437,1)),IF(ISERROR(SEARCH(\"*Physics*\",Failing_Kids!$F437,1)),\"\",\"X\"),\"X\"),\"X\"),\"X\")","v":""},{"$f":"IF(ISERROR(SEARCH(\"*His*\",Failing_Kids!$F437,1)),IF(ISERROR(SEARCH(\"*GOV*\",Failing_Kids!$F437,1)),IF(ISERROR(SEARCH(\"*Econ*\",Failing_Kids!$F437,1)),IF(ISERROR(SEARCH(\"*Soc*\",Failing_Kids!$F437,1)),\"\",\"X\"),\"X\"),\"X\"),\"X\")","v":""},{"$f":"IF(ISERROR(SEARCH(\"*PE*\",Failing_Kids!$F437,1)),\"\",\"X\")","v":""}]
[{"$f":"Failing_Kids!C438","v":"Waller"},{"$f":"Failing_Kids!D438","v":"Ann"},{"$f":"IF(ISERROR(SEARCH(\"*English*\",Failing_Kids!F438,1)),\"\",\"X \")","v":""},{"$f":"IF(ISERROR(SEARCH(\"*Geometry*\",Failing_Kids!$F438,1)),IF(ISERROR(SEARCH(\"*Math*\",Failing_Kids!$F438,1)),IF(ISERROR(SEARCH(\"*Calc*\",Failing_Kids!$F438,1)),IF(ISERROR(SEARCH(\"*Algebra*\",Failing_Kids!$F438,1)),\"\",\"X\"),\"X\"),\"X\"),\"X\")","v":""},{"$f":"IF(ISERROR(SEARCH(\"*Science*\",Failing_Kids!$F438,1)),IF(ISERROR(SEARCH(\"*Bio*\",Failing_Kids!$F438,1)),IF(ISERROR(SEARCH(\"*Chem*\",Failing_Kids!$F438,1)),IF(ISERROR(SEARCH(\"*Physics*\",Failing_Kids!$F438,1)),\"\",\"X\"),\"X\"),\"X\"),\"X\")","v":"X"},{"$f":"IF(ISERROR(SEARCH(\"*His*\",Failing_Kids!$F438,1)),IF(ISERROR(SEARCH(\"*GOV*\",Failing_Kids!$F438,1)),IF(ISERROR(SEARCH(\"*Econ*\",Failing_Kids!$F438,1)),IF(ISERROR(SEARCH(\"*Soc*\",Failing_Kids!$F438,1)),\"\",\"X\"),\"X\"),\"X\"),\"X\")","v":""},{"$f":"IF(ISERROR(SEARCH(\"*PE*\",Failing_Kids!$F438,1)),\"\",\"X\")","v":""}]
[{"$f":"Failing_Kids!C439","v":"Waller"},{"$f":"Failing_Kids!D439","v":"Benjamin"},{"$f":"IF(ISERROR(SEARCH(\"*English*\",Failing_Kids!F439,1)),\"\",\"X \")","v":""},{"$f":"IF(ISERROR(SEARCH(\"*Geometry*\",Failing_Kids!$F439,1)),IF(ISERROR(SEARCH(\"*Math*\",Failing_Kids!$F439,1)),IF(ISERROR(SEARCH(\"*Calc*\",Failing_Kids!$F439,1)),IF(ISERROR(SEARCH(\"*Algebra*\",Failing_Kids!$F439,1)),\"\",\"X\"),\"X\"),\"X\"),\"X\")","v":""},{"$f":"IF(ISERROR(SEARCH(\"*Science*\",Failing_Kids!$F439,1)),IF(ISERROR(SEARCH(\"*Bio*\",Failing_Kids!$F439,1)),IF(ISERROR(SEARCH(\"*Chem*\",Failing_Kids!$F439,1)),IF(ISERROR(SEARCH(\"*Physics*\",Failing_Kids!$F439,1)),\"\",\"X\"),\"X\"),\"X\"),\"X\")","v":"X"},{"$f":"IF(ISERROR(SEARCH(\"*His*\",Failing_Kids!$F439,1)),IF(ISERROR(SEARCH(\"*GOV*\",Failing_Kids!$F439,1)),IF(ISERROR(SEARCH(\"*Econ*\",Failing_Kids!$F439,1)),IF(ISERROR(SEARCH(\"*Soc*\",Failing_Kids!$F439,1)),\"\",\"X\"),\"X\"),\"X\"),\"X\")","v":""},{"$f":"IF(ISERROR(SEARCH(\"*PE*\",Failing_Kids!$F439,1)),\"\",\"X\")","v":""}]
[{"$f":"Failing_Kids!C440","v":"Waller"},{"$f":"Failing_Kids!D440","v":"Benjamin"},{"$f":"IF(ISERROR(SEARCH(\"*English*\",Failing_Kids!F440,1)),\"\",\"X \")","v":"X "},{"$f":"IF(ISERROR(SEARCH(\"*Geometry*\",Failing_Kids!$F440,1)),IF(ISERROR(SEARCH(\"*Math*\",Failing_Kids!$F440,1)),IF(ISERROR(SEARCH(\"*Calc*\",Failing_Kids!$F440,1)),IF(ISERROR(SEARCH(\"*Algebra*\",Failing_Kids!$F440,1)),\"\",\"X\"),\"X\"),\"X\"),\"X\")","v":""},{"$f":"IF(ISERROR(SEARCH(\"*Science*\",Failing_Kids!$F440,1)),IF(ISERROR(SEARCH(\"*Bio*\",Failing_Kids!$F440,1)),IF(ISERROR(SEARCH(\"*Chem*\",Failing_Kids!$F440,1)),IF(ISERROR(SEARCH(\"*Physics*\",Failing_Kids!$F440,1)),\"\",\"X\"),\"X\"),\"X\"),\"X\")","v":""},{"$f":"IF(ISERROR(SEARCH(\"*His*\",Failing_Kids!$F440,1)),IF(ISERROR(SEARCH(\"*GOV*\",Failing_Kids!$F440,1)),IF(ISERROR(SEARCH(\"*Econ*\",Failing_Kids!$F440,1)),IF(ISERROR(SEARCH(\"*Soc*\",Failing_Kids!$F440,1)),\"\",\"X\"),\"X\"),\"X\"),\"X\")","v":""},{"$f":"IF(ISERROR(SEARCH(\"*PE*\",Failing_Kids!$F440,1)),\"\",\"X\")","v":""}]
[{"$f":"Failing_Kids!C441","v":"Walls"},{"$f":"Failing_Kids!D441","v":"Eugene"},{"$f":"IF(ISERROR(SEARCH(\"*English*\",Failing_Kids!F441,1)),\"\",\"X \")","v":""},{"$f":"IF(ISERROR(SEARCH(\"*Geometry*\",Failing_Kids!$F441,1)),IF(ISERROR(SEARCH(\"*Math*\",Failing_Kids!$F441,1)),IF(ISERROR(SEARCH(\"*Calc*\",Failing_Kids!$F441,1)),IF(ISERROR(SEARCH(\"*Algebra*\",Failing_Kids!$F441,1)),\"\",\"X\"),\"X\"),\"X\"),\"X\")","v":""},{"$f":"IF(ISERROR(SEARCH(\"*Science*\",Failing_Kids!$F441,1)),IF(ISERROR(SEARCH(\"*Bio*\",Failing_Kids!$F441,1)),IF(ISERROR(SEARCH(\"*Chem*\",Failing_Kids!$F441,1)),IF(ISERROR(SEARCH(\"*Physics*\",Failing_Kids!$F441,1)),\"\",\"X\"),\"X\"),\"X\"),\"X\")","v":"X"},{"$f":"IF(ISERROR(SEARCH(\"*His*\",Failing_Kids!$F441,1)),IF(ISERROR(SEARCH(\"*GOV*\",Failing_Kids!$F441,1)),IF(ISERROR(SEARCH(\"*Econ*\",Failing_Kids!$F441,1)),IF(ISERROR(SEARCH(\"*Soc*\",Failing_Kids!$F441,1)),\"\",\"X\"),\"X\"),\"X\"),\"X\")","v":""},{"$f":"IF(ISERROR(SEARCH(\"*PE*\",Failing_Kids!$F441,1)),\"\",\"X\")","v":""}]
[{"$f":"Failing_Kids!C442","v":"Walter"},{"$f":"Failing_Kids!D442","v":"Thelma"},{"$f":"IF(ISERROR(SEARCH(\"*English*\",Failing_Kids!F442,1)),\"\",\"X \")","v":""},{"$f":"IF(ISERROR(SEARCH(\"*Geometry*\",Failing_Kids!$F442,1)),IF(ISERROR(SEARCH(\"*Math*\",Failing_Kids!$F442,1)),IF(ISERROR(SEARCH(\"*Calc*\",Failing_Kids!$F442,1)),IF(ISERROR(SEARCH(\"*Algebra*\",Failing_Kids!$F442,1)),\"\",\"X\"),\"X\"),\"X\"),\"X\")","v":"X"},{"$f":"IF(ISERROR(SEARCH(\"*Science*\",Failing_Kids!$F442,1)),IF(ISERROR(SEARCH(\"*Bio*\",Failing_Kids!$F442,1)),IF(ISERROR(SEARCH(\"*Chem*\",Failing_Kids!$F442,1)),IF(ISERROR(SEARCH(\"*Physics*\",Failing_Kids!$F442,1)),\"\",\"X\"),\"X\"),\"X\"),\"X\")","v":""},{"$f":"IF(ISERROR(SEARCH(\"*His*\",Failing_Kids!$F442,1)),IF(ISERROR(SEARCH(\"*GOV*\",Failing_Kids!$F442,1)),IF(ISERROR(SEARCH(\"*Econ*\",Failing_Kids!$F442,1)),IF(ISERROR(SEARCH(\"*Soc*\",Failing_Kids!$F442,1)),\"\",\"X\"),\"X\"),\"X\"),\"X\")","v":""},{"$f":"IF(ISERROR(SEARCH(\"*PE*\",Failing_Kids!$F442,1)),\"\",\"X\")","v":""}]
[{"$f":"Failing_Kids!C443","v":"Walters"},{"$f":"Failing_Kids!D443","v":"Constance"},{"$f":"IF(ISERROR(SEARCH(\"*English*\",Failing_Kids!F443,1)),\"\",\"X \")","v":""},{"$f":"IF(ISERROR(SEARCH(\"*Geometry*\",Failing_Kids!$F443,1)),IF(ISERROR(SEARCH(\"*Math*\",Failing_Kids!$F443,1)),IF(ISERROR(SEARCH(\"*Calc*\",Failing_Kids!$F443,1)),IF(ISERROR(SEARCH(\"*Algebra*\",Failing_Kids!$F443,1)),\"\",\"X\"),\"X\"),\"X\"),\"X\")","v":"X"},{"$f":"IF(ISERROR(SEARCH(\"*Science*\",Failing_Kids!$F443,1)),IF(ISERROR(SEARCH(\"*Bio*\",Failing_Kids!$F443,1)),IF(ISERROR(SEARCH(\"*Chem*\",Failing_Kids!$F443,1)),IF(ISERROR(SEARCH(\"*Physics*\",Failing_Kids!$F443,1)),\"\",\"X\"),\"X\"),\"X\"),\"X\")","v":""},{"$f":"IF(ISERROR(SEARCH(\"*His*\",Failing_Kids!$F443,1)),IF(ISERROR(SEARCH(\"*GOV*\",Failing_Kids!$F443,1)),IF(ISERROR(SEARCH(\"*Econ*\",Failing_Kids!$F443,1)),IF(ISERROR(SEARCH(\"*Soc*\",Failing_Kids!$F443,1)),\"\",\"X\"),\"X\"),\"X\"),\"X\")","v":""},{"$f":"IF(ISERROR(SEARCH(\"*PE*\",Failing_Kids!$F443,1)),\"\",\"X\")","v":""}]
[{"$f":"Failing_Kids!C444","v":"Walters"},{"$f":"Failing_Kids!D444","v":"Constance"},{"$f":"IF(ISERROR(SEARCH(\"*English*\",Failing_Kids!F444,1)),\"\",\"X \")","v":""},{"$f":"IF(ISERROR(SEARCH(\"*Geometry*\",Failing_Kids!$F444,1)),IF(ISERROR(SEARCH(\"*Math*\",Failing_Kids!$F444,1)),IF(ISERROR(SEARCH(\"*Calc*\",Failing_Kids!$F444,1)),IF(ISERROR(SEARCH(\"*Algebra*\",Failing_Kids!$F444,1)),\"\",\"X\"),\"X\"),\"X\"),\"X\")","v":""},{"$f":"IF(ISERROR(SEARCH(\"*Science*\",Failing_Kids!$F444,1)),IF(ISERROR(SEARCH(\"*Bio*\",Failing_Kids!$F444,1)),IF(ISERROR(SEARCH(\"*Chem*\",Failing_Kids!$F444,1)),IF(ISERROR(SEARCH(\"*Physics*\",Failing_Kids!$F444,1)),\"\",\"X\"),\"X\"),\"X\"),\"X\")","v":""},{"$f":"IF(ISERROR(SEARCH(\"*His*\",Failing_Kids!$F444,1)),IF(ISERROR(SEARCH(\"*GOV*\",Failing_Kids!$F444,1)),IF(ISERROR(SEARCH(\"*Econ*\",Failing_Kids!$F444,1)),IF(ISERROR(SEARCH(\"*Soc*\",Failing_Kids!$F444,1)),\"\",\"X\"),\"X\"),\"X\"),\"X\")","v":"X"},{"$f":"IF(ISERROR(SEARCH(\"*PE*\",Failing_Kids!$F444,1)),\"\",\"X\")","v":""}]
[{"$f":"Failing_Kids!C445","v":"Washington"},{"$f":"Failing_Kids!D445","v":"Jo"},{"$f":"IF(ISERROR(SEARCH(\"*English*\",Failing_Kids!F445,1)),\"\",\"X \")","v":""},{"$f":"IF(ISERROR(SEARCH(\"*Geometry*\",Failing_Kids!$F445,1)),IF(ISERROR(SEARCH(\"*Math*\",Failing_Kids!$F445,1)),IF(ISERROR(SEARCH(\"*Calc*\",Failing_Kids!$F445,1)),IF(ISERROR(SEARCH(\"*Algebra*\",Failing_Kids!$F445,1)),\"\",\"X\"),\"X\"),\"X\"),\"X\")","v":"X"},{"$f":"IF(ISERROR(SEARCH(\"*Science*\",Failing_Kids!$F445,1)),IF(ISERROR(SEARCH(\"*Bio*\",Failing_Kids!$F445,1)),IF(ISERROR(SEARCH(\"*Chem*\",Failing_Kids!$F445,1)),IF(ISERROR(SEARCH(\"*Physics*\",Failing_Kids!$F445,1)),\"\",\"X\"),\"X\"),\"X\"),\"X\")","v":""},{"$f":"IF(ISERROR(SEARCH(\"*His*\",Failing_Kids!$F445,1)),IF(ISERROR(SEARCH(\"*GOV*\",Failing_Kids!$F445,1)),IF(ISERROR(SEARCH(\"*Econ*\",Failing_Kids!$F445,1)),IF(ISERROR(SEARCH(\"*Soc*\",Failing_Kids!$F445,1)),\"\",\"X\"),\"X\"),\"X\"),\"X\")","v":""},{"$f":"IF(ISERROR(SEARCH(\"*PE*\",Failing_Kids!$F445,1)),\"\",\"X\")","v":""}]
[{"$f":"Failing_Kids!C446","v":"Welch"},{"$f":"Failing_Kids!D446","v":"Alfred"},{"$f":"IF(ISERROR(SEARCH(\"*English*\",Failing_Kids!F446,1)),\"\",\"X \")","v":""},{"$f":"IF(ISERROR(SEARCH(\"*Geometry*\",Failing_Kids!$F446,1)),IF(ISERROR(SEARCH(\"*Math*\",Failing_Kids!$F446,1)),IF(ISERROR(SEARCH(\"*Calc*\",Failing_Kids!$F446,1)),IF(ISERROR(SEARCH(\"*Algebra*\",Failing_Kids!$F446,1)),\"\",\"X\"),\"X\"),\"X\"),\"X\")","v":"X"},{"$f":"IF(ISERROR(SEARCH(\"*Science*\",Failing_Kids!$F446,1)),IF(ISERROR(SEARCH(\"*Bio*\",Failing_Kids!$F446,1)),IF(ISERROR(SEARCH(\"*Chem*\",Failing_Kids!$F446,1)),IF(ISERROR(SEARCH(\"*Physics*\",Failing_Kids!$F446,1)),\"\",\"X\"),\"X\"),\"X\"),\"X\")","v":""},{"$f":"IF(ISERROR(SEARCH(\"*His*\",Failing_Kids!$F446,1)),IF(ISERROR(SEARCH(\"*GOV*\",Failing_Kids!$F446,1)),IF(ISERROR(SEARCH(\"*Econ*\",Failing_Kids!$F446,1)),IF(ISERROR(SEARCH(\"*Soc*\",Failing_Kids!$F446,1)),\"\",\"X\"),\"X\"),\"X\"),\"X\")","v":""},{"$f":"IF(ISERROR(SEARCH(\"*PE*\",Failing_Kids!$F446,1)),\"\",\"X\")","v":""}]
[{"$f":"Failing_Kids!C447","v":"Wheeler"},{"$f":"Failing_Kids!D447","v":"James"},{"$f":"IF(ISERROR(SEARCH(\"*English*\",Failing_Kids!F447,1)),\"\",\"X \")","v":"X "},{"$f":"IF(ISERROR(SEARCH(\"*Geometry*\",Failing_Kids!$F447,1)),IF(ISERROR(SEARCH(\"*Math*\",Failing_Kids!$F447,1)),IF(ISERROR(SEARCH(\"*Calc*\",Failing_Kids!$F447,1)),IF(ISERROR(SEARCH(\"*Algebra*\",Failing_Kids!$F447,1)),\"\",\"X\"),\"X\"),\"X\"),\"X\")","v":""},{"$f":"IF(ISERROR(SEARCH(\"*Science*\",Failing_Kids!$F447,1)),IF(ISERROR(SEARCH(\"*Bio*\",Failing_Kids!$F447,1)),IF(ISERROR(SEARCH(\"*Chem*\",Failing_Kids!$F447,1)),IF(ISERROR(SEARCH(\"*Physics*\",Failing_Kids!$F447,1)),\"\",\"X\"),\"X\"),\"X\"),\"X\")","v":""},{"$f":"IF(ISERROR(SEARCH(\"*His*\",Failing_Kids!$F447,1)),IF(ISERROR(SEARCH(\"*GOV*\",Failing_Kids!$F447,1)),IF(ISERROR(SEARCH(\"*Econ*\",Failing_Kids!$F447,1)),IF(ISERROR(SEARCH(\"*Soc*\",Failing_Kids!$F447,1)),\"\",\"X\"),\"X\"),\"X\"),\"X\")","v":""},{"$f":"IF(ISERROR(SEARCH(\"*PE*\",Failing_Kids!$F447,1)),\"\",\"X\")","v":""}]
[{"$f":"Failing_Kids!C448","v":"Whitaker"},{"$f":"Failing_Kids!D448","v":"Steven"},{"$f":"IF(ISERROR(SEARCH(\"*English*\",Failing_Kids!F448,1)),\"\",\"X \")","v":"X "},{"$f":"IF(ISERROR(SEARCH(\"*Geometry*\",Failing_Kids!$F448,1)),IF(ISERROR(SEARCH(\"*Math*\",Failing_Kids!$F448,1)),IF(ISERROR(SEARCH(\"*Calc*\",Failing_Kids!$F448,1)),IF(ISERROR(SEARCH(\"*Algebra*\",Failing_Kids!$F448,1)),\"\",\"X\"),\"X\"),\"X\"),\"X\")","v":""},{"$f":"IF(ISERROR(SEARCH(\"*Science*\",Failing_Kids!$F448,1)),IF(ISERROR(SEARCH(\"*Bio*\",Failing_Kids!$F448,1)),IF(ISERROR(SEARCH(\"*Chem*\",Failing_Kids!$F448,1)),IF(ISERROR(SEARCH(\"*Physics*\",Failing_Kids!$F448,1)),\"\",\"X\"),\"X\"),\"X\"),\"X\")","v":""},{"$f":"IF(ISERROR(SEARCH(\"*His*\",Failing_Kids!$F448,1)),IF(ISERROR(SEARCH(\"*GOV*\",Failing_Kids!$F448,1)),IF(ISERROR(SEARCH(\"*Econ*\",Failing_Kids!$F448,1)),IF(ISERROR(SEARCH(\"*Soc*\",Failing_Kids!$F448,1)),\"\",\"X\"),\"X\"),\"X\"),\"X\")","v":""},{"$f":"IF(ISERROR(SEARCH(\"*PE*\",Failing_Kids!$F448,1)),\"\",\"X\")","v":""}]
[{"$f":"Failing_Kids!C449","v":"Whitfield"},{"$f":"Failing_Kids!D449","v":"Tracey"},{"$f":"IF(ISERROR(SEARCH(\"*English*\",Failing_Kids!F449,1)),\"\",\"X \")","v":""},{"$f":"IF(ISERROR(SEARCH(\"*Geometry*\",Failing_Kids!$F449,1)),IF(ISERROR(SEARCH(\"*Math*\",Failing_Kids!$F449,1)),IF(ISERROR(SEARCH(\"*Calc*\",Failing_Kids!$F449,1)),IF(ISERROR(SEARCH(\"*Algebra*\",Failing_Kids!$F449,1)),\"\",\"X\"),\"X\"),\"X\"),\"X\")","v":""},{"$f":"IF(ISERROR(SEARCH(\"*Science*\",Failing_Kids!$F449,1)),IF(ISERROR(SEARCH(\"*Bio*\",Failing_Kids!$F449,1)),IF(ISERROR(SEARCH(\"*Chem*\",Failing_Kids!$F449,1)),IF(ISERROR(SEARCH(\"*Physics*\",Failing_Kids!$F449,1)),\"\",\"X\"),\"X\"),\"X\"),\"X\")","v":""},{"$f":"IF(ISERROR(SEARCH(\"*His*\",Failing_Kids!$F449,1)),IF(ISERROR(SEARCH(\"*GOV*\",Failing_Kids!$F449,1)),IF(ISERROR(SEARCH(\"*Econ*\",Failing_Kids!$F449,1)),IF(ISERROR(SEARCH(\"*Soc*\",Failing_Kids!$F449,1)),\"\",\"X\"),\"X\"),\"X\"),\"X\")","v":"X"},{"$f":"IF(ISERROR(SEARCH(\"*PE*\",Failing_Kids!$F449,1)),\"\",\"X\")","v":""}]
[{"$f":"Failing_Kids!C450","v":"Whitley"},{"$f":"Failing_Kids!D450","v":"April"},{"$f":"IF(ISERROR(SEARCH(\"*English*\",Failing_Kids!F450,1)),\"\",\"X \")","v":""},{"$f":"IF(ISERROR(SEARCH(\"*Geometry*\",Failing_Kids!$F450,1)),IF(ISERROR(SEARCH(\"*Math*\",Failing_Kids!$F450,1)),IF(ISERROR(SEARCH(\"*Calc*\",Failing_Kids!$F450,1)),IF(ISERROR(SEARCH(\"*Algebra*\",Failing_Kids!$F450,1)),\"\",\"X\"),\"X\"),\"X\"),\"X\")","v":"X"},{"$f":"IF(ISERROR(SEARCH(\"*Science*\",Failing_Kids!$F450,1)),IF(ISERROR(SEARCH(\"*Bio*\",Failing_Kids!$F450,1)),IF(ISERROR(SEARCH(\"*Chem*\",Failing_Kids!$F450,1)),IF(ISERROR(SEARCH(\"*Physics*\",Failing_Kids!$F450,1)),\"\",\"X\"),\"X\"),\"X\"),\"X\")","v":""},{"$f":"IF(ISERROR(SEARCH(\"*His*\",Failing_Kids!$F450,1)),IF(ISERROR(SEARCH(\"*GOV*\",Failing_Kids!$F450,1)),IF(ISERROR(SEARCH(\"*Econ*\",Failing_Kids!$F450,1)),IF(ISERROR(SEARCH(\"*Soc*\",Failing_Kids!$F450,1)),\"\",\"X\"),\"X\"),\"X\"),\"X\")","v":""},{"$f":"IF(ISERROR(SEARCH(\"*PE*\",Failing_Kids!$F450,1)),\"\",\"X\")","v":""}]
[{"$f":"Failing_Kids!C451","v":"Whitney"},{"$f":"Failing_Kids!D451","v":"Victor"},{"$f":"IF(ISERROR(SEARCH(\"*English*\",Failing_Kids!F451,1)),\"\",\"X \")","v":"X "},{"$f":"IF(ISERROR(SEARCH(\"*Geometry*\",Failing_Kids!$F451,1)),IF(ISERROR(SEARCH(\"*Math*\",Failing_Kids!$F451,1)),IF(ISERROR(SEARCH(\"*Calc*\",Failing_Kids!$F451,1)),IF(ISERROR(SEARCH(\"*Algebra*\",Failing_Kids!$F451,1)),\"\",\"X\"),\"X\"),\"X\"),\"X\")","v":""},{"$f":"IF(ISERROR(SEARCH(\"*Science*\",Failing_Kids!$F451,1)),IF(ISERROR(SEARCH(\"*Bio*\",Failing_Kids!$F451,1)),IF(ISERROR(SEARCH(\"*Chem*\",Failing_Kids!$F451,1)),IF(ISERROR(SEARCH(\"*Physics*\",Failing_Kids!$F451,1)),\"\",\"X\"),\"X\"),\"X\"),\"X\")","v":""},{"$f":"IF(ISERROR(SEARCH(\"*His*\",Failing_Kids!$F451,1)),IF(ISERROR(SEARCH(\"*GOV*\",Failing_Kids!$F451,1)),IF(ISERROR(SEARCH(\"*Econ*\",Failing_Kids!$F451,1)),IF(ISERROR(SEARCH(\"*Soc*\",Failing_Kids!$F451,1)),\"\",\"X\"),\"X\"),\"X\"),\"X\")","v":""},{"$f":"IF(ISERROR(SEARCH(\"*PE*\",Failing_Kids!$F451,1)),\"\",\"X\")","v":""}]
[{"$f":"Failing_Kids!C452","v":"Whitney"},{"$f":"Failing_Kids!D452","v":"Victor"},{"$f":"IF(ISERROR(SEARCH(\"*English*\",Failing_Kids!F452,1)),\"\",\"X \")","v":"X "},{"$f":"IF(ISERROR(SEARCH(\"*Geometry*\",Failing_Kids!$F452,1)),IF(ISERROR(SEARCH(\"*Math*\",Failing_Kids!$F452,1)),IF(ISERROR(SEARCH(\"*Calc*\",Failing_Kids!$F452,1)),IF(ISERROR(SEARCH(\"*Algebra*\",Failing_Kids!$F452,1)),\"\",\"X\"),\"X\"),\"X\"),\"X\")","v":""},{"$f":"IF(ISERROR(SEARCH(\"*Science*\",Failing_Kids!$F452,1)),IF(ISERROR(SEARCH(\"*Bio*\",Failing_Kids!$F452,1)),IF(ISERROR(SEARCH(\"*Chem*\",Failing_Kids!$F452,1)),IF(ISERROR(SEARCH(\"*Physics*\",Failing_Kids!$F452,1)),\"\",\"X\"),\"X\"),\"X\"),\"X\")","v":""},{"$f":"IF(ISERROR(SEARCH(\"*His*\",Failing_Kids!$F452,1)),IF(ISERROR(SEARCH(\"*GOV*\",Failing_Kids!$F452,1)),IF(ISERROR(SEARCH(\"*Econ*\",Failing_Kids!$F452,1)),IF(ISERROR(SEARCH(\"*Soc*\",Failing_Kids!$F452,1)),\"\",\"X\"),\"X\"),\"X\"),\"X\")","v":""},{"$f":"IF(ISERROR(SEARCH(\"*PE*\",Failing_Kids!$F452,1)),\"\",\"X\")","v":""}]
[{"$f":"Failing_Kids!C453","v":"Whitney"},{"$f":"Failing_Kids!D453","v":"Victor"},{"$f":"IF(ISERROR(SEARCH(\"*English*\",Failing_Kids!F453,1)),\"\",\"X \")","v":""},{"$f":"IF(ISERROR(SEARCH(\"*Geometry*\",Failing_Kids!$F453,1)),IF(ISERROR(SEARCH(\"*Math*\",Failing_Kids!$F453,1)),IF(ISERROR(SEARCH(\"*Calc*\",Failing_Kids!$F453,1)),IF(ISERROR(SEARCH(\"*Algebra*\",Failing_Kids!$F453,1)),\"\",\"X\"),\"X\"),\"X\"),\"X\")","v":""},{"$f":"IF(ISERROR(SEARCH(\"*Science*\",Failing_Kids!$F453,1)),IF(ISERROR(SEARCH(\"*Bio*\",Failing_Kids!$F453,1)),IF(ISERROR(SEARCH(\"*Chem*\",Failing_Kids!$F453,1)),IF(ISERROR(SEARCH(\"*Physics*\",Failing_Kids!$F453,1)),\"\",\"X\"),\"X\"),\"X\"),\"X\")","v":""},{"$f":"IF(ISERROR(SEARCH(\"*His*\",Failing_Kids!$F453,1)),IF(ISERROR(SEARCH(\"*GOV*\",Failing_Kids!$F453,1)),IF(ISERROR(SEARCH(\"*Econ*\",Failing_Kids!$F453,1)),IF(ISERROR(SEARCH(\"*Soc*\",Failing_Kids!$F453,1)),\"\",\"X\"),\"X\"),\"X\"),\"X\")","v":"X"},{"$f":"IF(ISERROR(SEARCH(\"*PE*\",Failing_Kids!$F453,1)),\"\",\"X\")","v":""}]
[{"$f":"Failing_Kids!C454","v":"Wilcox"},{"$f":"Failing_Kids!D454","v":"Veronica"},{"$f":"IF(ISERROR(SEARCH(\"*English*\",Failing_Kids!F454,1)),\"\",\"X \")","v":""},{"$f":"IF(ISERROR(SEARCH(\"*Geometry*\",Failing_Kids!$F454,1)),IF(ISERROR(SEARCH(\"*Math*\",Failing_Kids!$F454,1)),IF(ISERROR(SEARCH(\"*Calc*\",Failing_Kids!$F454,1)),IF(ISERROR(SEARCH(\"*Algebra*\",Failing_Kids!$F454,1)),\"\",\"X\"),\"X\"),\"X\"),\"X\")","v":""},{"$f":"IF(ISERROR(SEARCH(\"*Science*\",Failing_Kids!$F454,1)),IF(ISERROR(SEARCH(\"*Bio*\",Failing_Kids!$F454,1)),IF(ISERROR(SEARCH(\"*Chem*\",Failing_Kids!$F454,1)),IF(ISERROR(SEARCH(\"*Physics*\",Failing_Kids!$F454,1)),\"\",\"X\"),\"X\"),\"X\"),\"X\")","v":""},{"$f":"IF(ISERROR(SEARCH(\"*His*\",Failing_Kids!$F454,1)),IF(ISERROR(SEARCH(\"*GOV*\",Failing_Kids!$F454,1)),IF(ISERROR(SEARCH(\"*Econ*\",Failing_Kids!$F454,1)),IF(ISERROR(SEARCH(\"*Soc*\",Failing_Kids!$F454,1)),\"\",\"X\"),\"X\"),\"X\"),\"X\")","v":"X"},{"$f":"IF(ISERROR(SEARCH(\"*PE*\",Failing_Kids!$F454,1)),\"\",\"X\")","v":""}]
[{"$f":"Failing_Kids!C455","v":"Wilkins"},{"$f":"Failing_Kids!D455","v":"Ramona"},{"$f":"IF(ISERROR(SEARCH(\"*English*\",Failing_Kids!F455,1)),\"\",\"X \")","v":""},{"$f":"IF(ISERROR(SEARCH(\"*Geometry*\",Failing_Kids!$F455,1)),IF(ISERROR(SEARCH(\"*Math*\",Failing_Kids!$F455,1)),IF(ISERROR(SEARCH(\"*Calc*\",Failing_Kids!$F455,1)),IF(ISERROR(SEARCH(\"*Algebra*\",Failing_Kids!$F455,1)),\"\",\"X\"),\"X\"),\"X\"),\"X\")","v":"X"},{"$f":"IF(ISERROR(SEARCH(\"*Science*\",Failing_Kids!$F455,1)),IF(ISERROR(SEARCH(\"*Bio*\",Failing_Kids!$F455,1)),IF(ISERROR(SEARCH(\"*Chem*\",Failing_Kids!$F455,1)),IF(ISERROR(SEARCH(\"*Physics*\",Failing_Kids!$F455,1)),\"\",\"X\"),\"X\"),\"X\"),\"X\")","v":""},{"$f":"IF(ISERROR(SEARCH(\"*His*\",Failing_Kids!$F455,1)),IF(ISERROR(SEARCH(\"*GOV*\",Failing_Kids!$F455,1)),IF(ISERROR(SEARCH(\"*Econ*\",Failing_Kids!$F455,1)),IF(ISERROR(SEARCH(\"*Soc*\",Failing_Kids!$F455,1)),\"\",\"X\"),\"X\"),\"X\"),\"X\")","v":""},{"$f":"IF(ISERROR(SEARCH(\"*PE*\",Failing_Kids!$F455,1)),\"\",\"X\")","v":""}]
[{"$f":"Failing_Kids!C456","v":"Wilkinson"},{"$f":"Failing_Kids!D456","v":"Melanie"},{"$f":"IF(ISERROR(SEARCH(\"*English*\",Failing_Kids!F456,1)),\"\",\"X \")","v":"X "},{"$f":"IF(ISERROR(SEARCH(\"*Geometry*\",Failing_Kids!$F456,1)),IF(ISERROR(SEARCH(\"*Math*\",Failing_Kids!$F456,1)),IF(ISERROR(SEARCH(\"*Calc*\",Failing_Kids!$F456,1)),IF(ISERROR(SEARCH(\"*Algebra*\",Failing_Kids!$F456,1)),\"\",\"X\"),\"X\"),\"X\"),\"X\")","v":""},{"$f":"IF(ISERROR(SEARCH(\"*Science*\",Failing_Kids!$F456,1)),IF(ISERROR(SEARCH(\"*Bio*\",Failing_Kids!$F456,1)),IF(ISERROR(SEARCH(\"*Chem*\",Failing_Kids!$F456,1)),IF(ISERROR(SEARCH(\"*Physics*\",Failing_Kids!$F456,1)),\"\",\"X\"),\"X\"),\"X\"),\"X\")","v":""},{"$f":"IF(ISERROR(SEARCH(\"*His*\",Failing_Kids!$F456,1)),IF(ISERROR(SEARCH(\"*GOV*\",Failing_Kids!$F456,1)),IF(ISERROR(SEARCH(\"*Econ*\",Failing_Kids!$F456,1)),IF(ISERROR(SEARCH(\"*Soc*\",Failing_Kids!$F456,1)),\"\",\"X\"),\"X\"),\"X\"),\"X\")","v":""},{"$f":"IF(ISERROR(SEARCH(\"*PE*\",Failing_Kids!$F456,1)),\"\",\"X\")","v":""}]
[{"$f":"Failing_Kids!C457","v":"Wilkinson"},{"$f":"Failing_Kids!D457","v":"Melanie"},{"$f":"IF(ISERROR(SEARCH(\"*English*\",Failing_Kids!F457,1)),\"\",\"X \")","v":""},{"$f":"IF(ISERROR(SEARCH(\"*Geometry*\",Failing_Kids!$F457,1)),IF(ISERROR(SEARCH(\"*Math*\",Failing_Kids!$F457,1)),IF(ISERROR(SEARCH(\"*Calc*\",Failing_Kids!$F457,1)),IF(ISERROR(SEARCH(\"*Algebra*\",Failing_Kids!$F457,1)),\"\",\"X\"),\"X\"),\"X\"),\"X\")","v":""},{"$f":"IF(ISERROR(SEARCH(\"*Science*\",Failing_Kids!$F457,1)),IF(ISERROR(SEARCH(\"*Bio*\",Failing_Kids!$F457,1)),IF(ISERROR(SEARCH(\"*Chem*\",Failing_Kids!$F457,1)),IF(ISERROR(SEARCH(\"*Physics*\",Failing_Kids!$F457,1)),\"\",\"X\"),\"X\"),\"X\"),\"X\")","v":""},{"$f":"IF(ISERROR(SEARCH(\"*His*\",Failing_Kids!$F457,1)),IF(ISERROR(SEARCH(\"*GOV*\",Failing_Kids!$F457,1)),IF(ISERROR(SEARCH(\"*Econ*\",Failing_Kids!$F457,1)),IF(ISERROR(SEARCH(\"*Soc*\",Failing_Kids!$F457,1)),\"\",\"X\"),\"X\"),\"X\"),\"X\")","v":"X"},{"$f":"IF(ISERROR(SEARCH(\"*PE*\",Failing_Kids!$F457,1)),\"\",\"X\")","v":""}]
[{"$f":"Failing_Kids!C458","v":"Wilson"},{"$f":"Failing_Kids!D458","v":"Gary"},{"$f":"IF(ISERROR(SEARCH(\"*English*\",Failing_Kids!F458,1)),\"\",\"X \")","v":""},{"$f":"IF(ISERROR(SEARCH(\"*Geometry*\",Failing_Kids!$F458,1)),IF(ISERROR(SEARCH(\"*Math*\",Failing_Kids!$F458,1)),IF(ISERROR(SEARCH(\"*Calc*\",Failing_Kids!$F458,1)),IF(ISERROR(SEARCH(\"*Algebra*\",Failing_Kids!$F458,1)),\"\",\"X\"),\"X\"),\"X\"),\"X\")","v":""},{"$f":"IF(ISERROR(SEARCH(\"*Science*\",Failing_Kids!$F458,1)),IF(ISERROR(SEARCH(\"*Bio*\",Failing_Kids!$F458,1)),IF(ISERROR(SEARCH(\"*Chem*\",Failing_Kids!$F458,1)),IF(ISERROR(SEARCH(\"*Physics*\",Failing_Kids!$F458,1)),\"\",\"X\"),\"X\"),\"X\"),\"X\")","v":""},{"$f":"IF(ISERROR(SEARCH(\"*His*\",Failing_Kids!$F458,1)),IF(ISERROR(SEARCH(\"*GOV*\",Failing_Kids!$F458,1)),IF(ISERROR(SEARCH(\"*Econ*\",Failing_Kids!$F458,1)),IF(ISERROR(SEARCH(\"*Soc*\",Failing_Kids!$F458,1)),\"\",\"X\"),\"X\"),\"X\"),\"X\")","v":"X"},{"$f":"IF(ISERROR(SEARCH(\"*PE*\",Failing_Kids!$F458,1)),\"\",\"X\")","v":""}]
[{"$f":"Failing_Kids!C459","v":"Wilson"},{"$f":"Failing_Kids!D459","v":"Sean"},{"$f":"IF(ISERROR(SEARCH(\"*English*\",Failing_Kids!F459,1)),\"\",\"X \")","v":""},{"$f":"IF(ISERROR(SEARCH(\"*Geometry*\",Failing_Kids!$F459,1)),IF(ISERROR(SEARCH(\"*Math*\",Failing_Kids!$F459,1)),IF(ISERROR(SEARCH(\"*Calc*\",Failing_Kids!$F459,1)),IF(ISERROR(SEARCH(\"*Algebra*\",Failing_Kids!$F459,1)),\"\",\"X\"),\"X\"),\"X\"),\"X\")","v":"X"},{"$f":"IF(ISERROR(SEARCH(\"*Science*\",Failing_Kids!$F459,1)),IF(ISERROR(SEARCH(\"*Bio*\",Failing_Kids!$F459,1)),IF(ISERROR(SEARCH(\"*Chem*\",Failing_Kids!$F459,1)),IF(ISERROR(SEARCH(\"*Physics*\",Failing_Kids!$F459,1)),\"\",\"X\"),\"X\"),\"X\"),\"X\")","v":""},{"$f":"IF(ISERROR(SEARCH(\"*His*\",Failing_Kids!$F459,1)),IF(ISERROR(SEARCH(\"*GOV*\",Failing_Kids!$F459,1)),IF(ISERROR(SEARCH(\"*Econ*\",Failing_Kids!$F459,1)),IF(ISERROR(SEARCH(\"*Soc*\",Failing_Kids!$F459,1)),\"\",\"X\"),\"X\"),\"X\"),\"X\")","v":""},{"$f":"IF(ISERROR(SEARCH(\"*PE*\",Failing_Kids!$F459,1)),\"\",\"X\")","v":""}]
[{"$f":"Failing_Kids!C460","v":"Wilson"},{"$f":"Failing_Kids!D460","v":"Sean"},{"$f":"IF(ISERROR(SEARCH(\"*English*\",Failing_Kids!F460,1)),\"\",\"X \")","v":""},{"$f":"IF(ISERROR(SEARCH(\"*Geometry*\",Failing_Kids!$F460,1)),IF(ISERROR(SEARCH(\"*Math*\",Failing_Kids!$F460,1)),IF(ISERROR(SEARCH(\"*Calc*\",Failing_Kids!$F460,1)),IF(ISERROR(SEARCH(\"*Algebra*\",Failing_Kids!$F460,1)),\"\",\"X\"),\"X\"),\"X\"),\"X\")","v":""},{"$f":"IF(ISERROR(SEARCH(\"*Science*\",Failing_Kids!$F460,1)),IF(ISERROR(SEARCH(\"*Bio*\",Failing_Kids!$F460,1)),IF(ISERROR(SEARCH(\"*Chem*\",Failing_Kids!$F460,1)),IF(ISERROR(SEARCH(\"*Physics*\",Failing_Kids!$F460,1)),\"\",\"X\"),\"X\"),\"X\"),\"X\")","v":""},{"$f":"IF(ISERROR(SEARCH(\"*His*\",Failing_Kids!$F460,1)),IF(ISERROR(SEARCH(\"*GOV*\",Failing_Kids!$F460,1)),IF(ISERROR(SEARCH(\"*Econ*\",Failing_Kids!$F460,1)),IF(ISERROR(SEARCH(\"*Soc*\",Failing_Kids!$F460,1)),\"\",\"X\"),\"X\"),\"X\"),\"X\")","v":"X"},{"$f":"IF(ISERROR(SEARCH(\"*PE*\",Failing_Kids!$F460,1)),\"\",\"X\")","v":""}]
[{"$f":"Failing_Kids!C461","v":"Wood"},{"$f":"Failing_Kids!D461","v":"Todd"},{"$f":"IF(ISERROR(SEARCH(\"*English*\",Failing_Kids!F461,1)),\"\",\"X \")","v":""},{"$f":"IF(ISERROR(SEARCH(\"*Geometry*\",Failing_Kids!$F461,1)),IF(ISERROR(SEARCH(\"*Math*\",Failing_Kids!$F461,1)),IF(ISERROR(SEARCH(\"*Calc*\",Failing_Kids!$F461,1)),IF(ISERROR(SEARCH(\"*Algebra*\",Failing_Kids!$F461,1)),\"\",\"X\"),\"X\"),\"X\"),\"X\")","v":"X"},{"$f":"IF(ISERROR(SEARCH(\"*Science*\",Failing_Kids!$F461,1)),IF(ISERROR(SEARCH(\"*Bio*\",Failing_Kids!$F461,1)),IF(ISERROR(SEARCH(\"*Chem*\",Failing_Kids!$F461,1)),IF(ISERROR(SEARCH(\"*Physics*\",Failing_Kids!$F461,1)),\"\",\"X\"),\"X\"),\"X\"),\"X\")","v":""},{"$f":"IF(ISERROR(SEARCH(\"*His*\",Failing_Kids!$F461,1)),IF(ISERROR(SEARCH(\"*GOV*\",Failing_Kids!$F461,1)),IF(ISERROR(SEARCH(\"*Econ*\",Failing_Kids!$F461,1)),IF(ISERROR(SEARCH(\"*Soc*\",Failing_Kids!$F461,1)),\"\",\"X\"),\"X\"),\"X\"),\"X\")","v":""},{"$f":"IF(ISERROR(SEARCH(\"*PE*\",Failing_Kids!$F461,1)),\"\",\"X\")","v":""}]
[{"$f":"Failing_Kids!C462","v":"Woodard"},{"$f":"Failing_Kids!D462","v":"Jeffrey"},{"$f":"IF(ISERROR(SEARCH(\"*English*\",Failing_Kids!F462,1)),\"\",\"X \")","v":""},{"$f":"IF(ISERROR(SEARCH(\"*Geometry*\",Failing_Kids!$F462,1)),IF(ISERROR(SEARCH(\"*Math*\",Failing_Kids!$F462,1)),IF(ISERROR(SEARCH(\"*Calc*\",Failing_Kids!$F462,1)),IF(ISERROR(SEARCH(\"*Algebra*\",Failing_Kids!$F462,1)),\"\",\"X\"),\"X\"),\"X\"),\"X\")","v":""},{"$f":"IF(ISERROR(SEARCH(\"*Science*\",Failing_Kids!$F462,1)),IF(ISERROR(SEARCH(\"*Bio*\",Failing_Kids!$F462,1)),IF(ISERROR(SEARCH(\"*Chem*\",Failing_Kids!$F462,1)),IF(ISERROR(SEARCH(\"*Physics*\",Failing_Kids!$F462,1)),\"\",\"X\"),\"X\"),\"X\"),\"X\")","v":""},{"$f":"IF(ISERROR(SEARCH(\"*His*\",Failing_Kids!$F462,1)),IF(ISERROR(SEARCH(\"*GOV*\",Failing_Kids!$F462,1)),IF(ISERROR(SEARCH(\"*Econ*\",Failing_Kids!$F462,1)),IF(ISERROR(SEARCH(\"*Soc*\",Failing_Kids!$F462,1)),\"\",\"X\"),\"X\"),\"X\"),\"X\")","v":"X"},{"$f":"IF(ISERROR(SEARCH(\"*PE*\",Failing_Kids!$F462,1)),\"\",\"X\")","v":""}]
[{"$f":"Failing_Kids!C463","v":"Wyatt"},{"$f":"Failing_Kids!D463","v":"Elsie"},{"$f":"IF(ISERROR(SEARCH(\"*English*\",Failing_Kids!F463,1)),\"\",\"X \")","v":""},{"$f":"IF(ISERROR(SEARCH(\"*Geometry*\",Failing_Kids!$F463,1)),IF(ISERROR(SEARCH(\"*Math*\",Failing_Kids!$F463,1)),IF(ISERROR(SEARCH(\"*Calc*\",Failing_Kids!$F463,1)),IF(ISERROR(SEARCH(\"*Algebra*\",Failing_Kids!$F463,1)),\"\",\"X\"),\"X\"),\"X\"),\"X\")","v":"X"},{"$f":"IF(ISERROR(SEARCH(\"*Science*\",Failing_Kids!$F463,1)),IF(ISERROR(SEARCH(\"*Bio*\",Failing_Kids!$F463,1)),IF(ISERROR(SEARCH(\"*Chem*\",Failing_Kids!$F463,1)),IF(ISERROR(SEARCH(\"*Physics*\",Failing_Kids!$F463,1)),\"\",\"X\"),\"X\"),\"X\"),\"X\")","v":""},{"$f":"IF(ISERROR(SEARCH(\"*His*\",Failing_Kids!$F463,1)),IF(ISERROR(SEARCH(\"*GOV*\",Failing_Kids!$F463,1)),IF(ISERROR(SEARCH(\"*Econ*\",Failing_Kids!$F463,1)),IF(ISERROR(SEARCH(\"*Soc*\",Failing_Kids!$F463,1)),\"\",\"X\"),\"X\"),\"X\"),\"X\")","v":""},{"$f":"IF(ISERROR(SEARCH(\"*PE*\",Failing_Kids!$F463,1)),\"\",\"X\")","v":""}]
[{"$f":"Failing_Kids!C464","v":"Wynn"},{"$f":"Failing_Kids!D464","v":"Ada"},{"$f":"IF(ISERROR(SEARCH(\"*English*\",Failing_Kids!F464,1)),\"\",\"X \")","v":""},{"$f":"IF(ISERROR(SEARCH(\"*Geometry*\",Failing_Kids!$F464,1)),IF(ISERROR(SEARCH(\"*Math*\",Failing_Kids!$F464,1)),IF(ISERROR(SEARCH(\"*Calc*\",Failing_Kids!$F464,1)),IF(ISERROR(SEARCH(\"*Algebra*\",Failing_Kids!$F464,1)),\"\",\"X\"),\"X\"),\"X\"),\"X\")","v":""},{"$f":"IF(ISERROR(SEARCH(\"*Science*\",Failing_Kids!$F464,1)),IF(ISERROR(SEARCH(\"*Bio*\",Failing_Kids!$F464,1)),IF(ISERROR(SEARCH(\"*Chem*\",Failing_Kids!$F464,1)),IF(ISERROR(SEARCH(\"*Physics*\",Failing_Kids!$F464,1)),\"\",\"X\"),\"X\"),\"X\"),\"X\")","v":""},{"$f":"IF(ISERROR(SEARCH(\"*His*\",Failing_Kids!$F464,1)),IF(ISERROR(SEARCH(\"*GOV*\",Failing_Kids!$F464,1)),IF(ISERROR(SEARCH(\"*Econ*\",Failing_Kids!$F464,1)),IF(ISERROR(SEARCH(\"*Soc*\",Failing_Kids!$F464,1)),\"\",\"X\"),\"X\"),\"X\"),\"X\")","v":"X"},{"$f":"IF(ISERROR(SEARCH(\"*PE*\",Failing_Kids!$F464,1)),\"\",\"X\")","v":""}]
[{"$f":"Failing_Kids!C465","v":0}]
[{"$f":"Failing_Kids!C466","v":0}]
[{"$f":"Failing_Kids!C467","v":0}]
[{"$f":"Failing_Kids!C468","v":0}]
[{"$f":"Failing_Kids!C469","v":0}]
[{"$f":"Failing_Kids!C470","v":0}]
[{"$f":"Failing_Kids!C471","v":0}]
[{"$f":"Failing_Kids!C472","v":0}]
[{"$f":"Failing_Kids!C473","v":0}]
[{"$f":"Failing_Kids!C474","v":0}]
[{"$f":"Failing_Kids!C475","v":0}]
[{"$f":"Failing_Kids!C476","v":0}]
[{"$f":"Failing_Kids!C477","v":0}]
[{"$f":"Failing_Kids!C478","v":0}]
[{"$f":"Failing_Kids!C479","v":0}]
[{"$f":"Failing_Kids!C480","v":0}]
[{"$f":"Failing_Kids!C481","v":0}]
[{"$f":"Failing_Kids!C482","v":0}]
[{"$f":"Failing_Kids!C483","v":0}]
[{"$f":"Failing_Kids!C484","v":0}]
[{"$f":"Failing_Kids!C485","v":0}]
[{"$f":"Failing_Kids!C486","v":0}]
[{"$f":"Failing_Kids!C487","v":0}]
[{"$f":"Failing_Kids!C488","v":0}]
[{"$f":"Failing_Kids!C489","v":0}]
[{"$f":"Failing_Kids!C490","v":0}]
[{"$f":"Failing_Kids!C491","v":0}]
[{"$f":"Failing_Kids!C492","v":0}]
[{"$f":"Failing_Kids!C493","v":0}]
[{"$f":"Failing_Kids!C494","v":0}]
[{"$f":"Failing_Kids!C495","v":0}]
[{"$f":"Failing_Kids!C496","v":0}]
[{"$f":"Failing_Kids!C497","v":0}]
[{"$f":"Failing_Kids!C498","v":0}]

{"sheet":"ClassCategories","index":3,"n_rows":42,"n_cols":2,"rows_kept":42,"cut":false,"hidden":false,"merged":[]}
["Course","MapsTo"]
["3-D DESIGN 3","Elective"]
["ACCOUNT 1","Elective"]
["Algebra 1 Sem 1","Math"]
["Algebra 1 Sem 1/Lab","Math"]
["Algebra 1 Sem 2","Math"]
["Algebra 2 Sem 1","Math"]
["AP BIO 1","Science"]
["AP US/AZ HIS","Social Studies"]
["ARCH DRAFT","Elective"]
["BEGIN GUITAR","Elective"]
["BIOLOGY 1","Science"]
["Business Technology 1","Elective"]
["CHEMISTRY 1","Science"]
["Culinary Arts 1","Elective"]
["ENGLISH 1","English"]
["ENGLISH 3","English"]
["ENGLISH 5","English"]
["English Fundamentals 5","English"]
["Geometry Sem 1","Math"]
["Geometry Sem 2","Math"]
["GERMAN 3","Elective"]
["Hon Algebra 2 Sem 1","Math"]
["Honors Biology 1","Science"]
["Honors English 1","English"]
["Honors English 3","English"]
["Honors English 5","English"]
["Honors Pre Calculus","Science"]
["Honors W History/Geography","Social Studies"]
["JAPANESE 1","Elective"]
["JAPANESE 3","Elective"]
["Math Intervention Lab","Math"]
["PHOTO 1","Elective"]
["PHYS ED 1G","Phys Ed"]
["PSYCHOLOGY","Social Studies"]
["SOCIOLOGY","Social Studies"]
["SPANISH 1","Elective"]
["SPANISH 3","Elective"]
["Stage Craft 1","Elective"]
["T SCIENCE 1","Science"]
["US/AZ HIS 1","Social Studies"]
["W HIS/AZ G1","Social Studies"]