{"text_format":"1","workbook":"xlsx","n_sheets":13,"sheets":["Topics","10 Tips","Tables","Conditional Formatting","Filter (1)","Filter (2)","SUMIFS more","PTsol","PT","Sparklines","Paste Special","Print","Rank"],"not_rendered":{"charts":0,"images":2,"macros":0,"external_links":0,"defined_names":6,"comments":0,"pivot_tables":1},"unopened":[],"bounds":{"document_bytes":16777216,"sheet_cells":100000,"rows_first":2000,"rows_last":500,"rows_between":2000,"halvings":0,"cell_chars":16384,"cell_head_chars":4096},"cells_cut":0,"cells_raw":0,"read":"whole","date_system":"1900"}

{"sheet":"Topics","index":0,"n_rows":13,"n_cols":2,"rows_kept":13,"cut":false,"hidden":false,"merged":[]}
["Many New Excel 2007 / 2010 Tricks For Making Your Job Easier. Learn how you can manage and manipulate data with great efficiency and fun!"]
[]
[0,"12 Tips To Start With"]
[1,"2007 Table Feature: Dynamic Ranges"]
[2,"2007 Conditional Formatting"]
[3,"2007 Filter Feature"]
[4,"2007 COUNTIFS, SUMIFS Functions"]
[5,"2007 PivotTable interface"]
[6,"2010 PivotTable Slicers"]
[7,"2010 Sparklines: Cell Charts"]
[8,"2010 Paste Special icons"]
[9,"2010 Print Options and Print Preview"]
[10,"2010 RANK function"]

{"sheet":"10 Tips","index":1,"n_rows":91,"n_cols":11,"rows_kept":91,"cut":false,"hidden":false,"merged":[]}
[1,4.4999999999999998E-2,null,"If you use % icon, be sure to increase decimals too"]
[2,{"$f":"2/3","v":0.66666666666666663},null,"if you want the number 2/3 in a cell, use formula =2/3,"]
[null,null,null,"otherwise you will see a date"]
[3,1.55,null,"If you get data from a download or from someone else, be"]
[null,1.5,null,"sure to check the \"Number Formatting\", because 2 = 2 <> 3"]
[4,{"$f":"SUM(B4:B5)","v":3.05},null,"Keyboard shortcut for SUM function ==>> Alt + ="]
[]
[5,"End Date","2011-10-19","If you want to figure out the number of days between two",null,null,null,null,null,null,"Dates have a Date Number Format, but underneath is a the"]
[null,"Begin Date","2011-10-11","dates, use the formula: End Date - Begin Date.",null,null,null,null,null," ==>> More","number of days (whole numbers) since Dec 13, 1899, where"]
[null,"Days between",{"$f":"C8-C9","v":8},"Note: This is good for \"# Days for a Project\", or \"Days Invoice",null,null,null,null,null,null,"1/1/1900 is 1, 1/2/1900 is 2 and 10/11/2011 is 40827."]
[null,null,null,"Past Due\", or \"# Days Assignment Late\""]
[]
[6,"End Time","14:00:00","If you want the number of hours between two times, use the",null,null,null,null,null,null,"Times Have a Time Number Format, but underneath is a"]
[null,"Begin Time","08:00:00","formula: (End Time - Begin Time)*24",null,null,null,null,null," ==>> More","number between 1 and 0 that represents the proportion of one"]
[null,"Time Worked",{"$f":"(C13-C14)*24","v":6.0000000000000018},null,null,null,null,null,null,null,"24 hour day. Ex: 6/24 = 0.25"]
[]
["Notice that many of the common mistakes made in Excel come from \"Number Formatting\""]
[]
[7,4.4999999999999998E-2,null,"When in Doubt apply \"General\" (Default) Number Formatting"]
[null,1.55,null,"to wipe away all Number Formatting"]
[null,1.5,null,"Keyboard = Ctrl + Shift + ~"]
[null,40827]
[null,{"$f":"TODAY()","v":40828}]
[null,0.33333333333333331]
[null,0.58333333333333337]
[]
[8,2,2,null,"If you want to enter data in more than one column,"]
[null,2,5,null,"highlight range first and just use the Enter key"]
[null,5,5]
[null,6,6]
[]
[9,"Tax Rate",9.5000000000000001E-2,null,"Don't hard code numbers into formulas if they have"]
[null,"Sales",100,null,"the potential to change"]
[null,"Tax Rate",{"$f":"C33*C32","v":9.5},"Not = C33*0.095"]
[]
[10,"Student","Total","% Grade",null,"When copying a formula, if you want to"]
[null,"Max Score",500,{"$f":"C37/$C$37","v":1},null,"lock the Cell Reference, use the F4 key to"]
[null,"Marcie Deere",478,{"$f":"C38/$C$37","v":0.95599999999999996},null,"put in the $ signs"]
[null,"Lilia Hanover",406,{"$f":"C39/$C$37","v":0.81200000000000006}]
[null,"Hugh Winders",302,0.60399999999999998]
[null,"Jamie Stegman",260,0.52]
[null,"Fernando Manfredi",131,0.26200000000000001]
[null,"Max Hoos",463,0.92600000000000005]
[null,"Margery Rana",309,0.61799999999999999]
[null,"Lorrie Maheu",459,0.91800000000000004]
[null,"Kelly Magda",130,0.26]
[null," Emilia Karpinski",183,{"$f":"C47/$C$37","v":0.36599999999999999}]
[]
[11,"%","Decimal",null,"When sorting a table, click in one cell in the column you want to sort, then"]
[null,0.91,3.6,null,"sort (A to Z or Z to A) and whole table will be sorted (Table should have filed"]
[null,0.92,3.7,null,"names (column headers) at top and records in rows)."]
[null,0.93,3.8]
[null,0.94,3.9]
[null,0.95,4]
[]
[12,"Student","Total","% Grade","Decimal Grade",null,"%","Decimal",null,"VLOOKUP function does a vertical lookup"]
[null,"Max Score",500,{"$f":"C57/$C$37","v":1},null,null,0,0,null,"(table with values is orientated vertically."]
[null,"Lilia Hanover",406,{"$f":"C58/$C$57","v":0.81200000000000006},{"$f":"VLOOKUP(D58,$G$57:$H$91,2)","v":2.6},null,0.62,0.7,null,"It takes a value to lookup, lookups it up"]
[null,"Hugh Winders",302,0.60399999999999998,{"$f":"VLOOKUP(D59,$G$57:$H$91,2)","v":0},null,0.63,0.8,null,"in the first column in the lookup table,"]
[null,"Marcie Deere",478,{"$f":"C60/$C$57","v":0.95599999999999996},4,null,0.64,0.9,null,"when it bumps into a value bigger than"]
[null,"Jamie Stegman",260,0.52,0,null,0.65,1,null,"it, it jumps back one row, then jumps"]
[null,"Fernando Manfredi",131,0.26200000000000001,0,null,0.66,1.1000000000000001,null,"over to the 2nd column to get the"]
[null,"Max Hoos",463,0.92600000000000005,3.7,null,0.67,1.2,null,"decimal grade and then delivers that"]
[null,"Margery Rana",309,0.61799999999999999,0,null,0.68,1.3,null,"decimal back to the cell that houses the"]
[null,"Lorrie Maheu",459,0.91800000000000004,3.6,null,0.69,1.4,null,"VLOOKUP function."]
[null,"Kelly Magda",130,0.26,0,null,0.7,1.5,null,"Use Approximate Match (the default)"]
[null," Emilia Karpinski",183,0.36599999999999999,{"$f":"VLOOKUP(D67,$G$57:$H$91,2)","v":0},null,0.71,1.6,null,"when you have gaps between the values"]
[null,null,null,null,null,null,0.72,1.7,null,"in the first column of the lookup table."]
[null,null,null,null,null,null,0.73,1.8,null,"First column of lookup table must be"]
[null,null,null,null,null,null,0.74,1.9,null,"sorted in ascending order."]
[null,null,null,null,null,null,0.75,2]
[null,null,null,null,null,null,0.76,2.1]
[null,null,null,null,null,null,0.77,2.2000000000000002]
[null,null,null,null,null,null,0.78,2.2999999999999998]
[null,null,null,null,null,null,0.79,2.4]
[null,null,null,null,null,null,0.8,2.5]
[null,null,null,null,null,null,0.81,2.6]
[null,null,null,null,null,null,0.82,2.7]
[null,null,null,null,null,null,0.83,2.8]
[null,null,null,null,null,null,0.84,2.9]
[null,null,null,null,null,null,0.85,3]
[null,null,null,null,null,null,0.86,3.1]
[null,null,null,null,null,null,0.87,3.2]
[null,null,null,null,null,null,0.88,3.3]
[null,null,null,null,null,null,0.89,3.4]
[null,null,null,null,null,null,0.9,3.5]
[null,null,null,null,null,null,0.91,3.6]
[null,null,null,null,null,null,0.92,3.7]
[null,null,null,null,null,null,0.93,3.8]
[null,null,null,null,null,null,0.94,3.9]
[null,null,null,null,null,null,0.95,4]

{"sheet":"Tables","index":2,"n_rows":11,"n_cols":6,"rows_kept":11,"cut":false,"hidden":false,"merged":[]}
["Tables in 2007/2010 have dynamic ranges."]
["Data must have field names (column headers) at top and data in rows"]
["Keyboard to convert data to a \"Table\" => Ctrl + T"]
[]
["Day","Calls Per Day",null,"Total",null,"Chart"]
["2011-10-11",25,null,{"$f":"SUM(B6:B11)","v":191}]
["2011-10-12",38,null,{"$f":"SUM(Table1[Calls Per Day])","v":191}]
["2011-10-13",29]
["2011-10-14",43]
["2011-10-15",55]
["2011-10-16",1]

{"sheet":"Conditional Formatting","index":3,"n_rows":17,"n_cols":8,"rows_kept":17,"cut":false,"hidden":false,"merged":[]}
["Highlight range, go to Styles Group in Home Ribbon Tab"]
[]
[]
["Day","Calls Per Day",null,"Day","Calls Per Day",null,"Day","Calls Per Day"]
["2011-10-11",104,null,"2011-10-11",104,null,"2011-10-11",104]
["2011-10-12",66,null,"2011-10-12",66,null,"2011-10-12",66]
["2011-10-13",66,null,"2011-10-13",66,null,"2011-10-13",66]
["2011-10-14",1,null,"2011-10-14",84,null,"2011-10-14",84]
["2011-10-17",71,null,"2011-10-17",71,null,"2011-10-17",71]
["2011-10-18",106,null,"2011-10-18",1,null,"2011-10-18",1]
["2011-10-19",81,null,"2011-10-19",81,null,"2011-10-19",81]
["2011-10-20",19,null,"2011-10-20",19,null,"2011-10-20",{"$f":"H14","v":19}]
["2011-10-21",72,null,"2011-10-21",72,null,"2011-10-21",72]
["2011-10-24",92,null,"2011-10-24",92,null,"2011-10-20",19]
["2011-10-25",51,null,"2011-10-25",51,null,"2011-10-21",72]
["2011-10-26",70,null,"2011-10-26",70,null,"2011-10-22",70]
["2011-10-27",21,null,"2011-10-27",21,null,"2011-10-23",21]

{"sheet":"Filter (1)","index":4,"n_rows":30,"n_cols":4,"rows_kept":30,"cut":false,"hidden":false,"merged":[]}
["To Turn Filter on, click in one cell in table (field names in first row and"]
["records in rows), then in Filter Sort group in Data Ribbon tab, click Filter"]
["button."]
["Do not have data to right of data set because Filter hides rows."]
[]
[null,null,null,"Filter Hides"]
["Names","Sales"]
["Sioux",17]
["Tom",17]
["Chin",20]
["Chin",16]
["Chin",11]
["Sioux",11]
["Tom",20]
[]
["Names","Sales",null,"Sort moves and groups together, but does not hide"]
["Tom",17]
["Tom",20]
["Sioux",17]
["Sioux",11]
["Chin",20]
["Chin",16]
["Chin",11]
[]
["Sioux",17]
["Sioux",11]
[]
["Names","Sales"]
["Sioux",17]
["Sioux",11]

{"sheet":"Filter (2)","index":5,"n_rows":31,"n_cols":2,"rows_kept":31,"cut":false,"hidden":false,"merged":[]}
["To Turn Filter on, click in one cell in table (field names in first row and"]
["records in rows), then in Filter Sort group in Data Ribbon tab, click Filter"]
["button."]
["Do not have data to right of data set because Filter hides rows."]
[]
["Day","Calls Per Day"]
["2011-10-11",104]
["2011-10-12",66]
["2011-10-13",66]
["2011-10-14",84]
["2011-10-17",71]
["2011-10-18",106]
["2011-10-19",81]
["2011-10-20",19]
["2011-10-21",72]
["2011-10-24",92]
["2011-10-25",51]
["2011-10-26",70]
["2011-10-27",21]
[]
[]
[]
[]
[]
[]
[]
["Day","Calls Per Day"]
["2011-10-11",104]
["2011-10-14",84]
["2011-10-18",106]
["2011-10-24",92]

{"sheet":"SUMIFS more","index":6,"n_rows":20,"n_cols":6,"rows_kept":20,"cut":false,"hidden":false,"merged":[]}
["Employee","Calls Per Day",null,"Employee","Sum 1 criteria"]
["Sioux",21,null,"Sioux",{"$f":"SUMIFS($B$2:$B$16,$A$2:$A$16,D2)","v":106}]
["Jo",106,null,"Jo",{"$f":"SUMIFS($B$2:$B$16,$A$2:$A$16,D3)","v":261}]
["Chin",84,null,"Chin",189]
["Chin",72,null,"Seliadawn",258]
["Seliadawn",71,null,"Joe",217]
["Jo",51]
["Seliadawn",92,null,"Employee","Sum 2 criteria","Hurdle"]
["Jo",104,null,"Sioux",{"$f":"SUMIFS($B$2:$B$16,$A$2:$A$16,D9,$B$2:$B$16,$F$9)","v":0},">80"]
["Joe",70,null,"Jo",{"$f":"SUMIFS($B$2:$B$16,$A$2:$A$16,D10,$B$2:$B$16,$F$9)","v":210}]
["Sioux",66,null,"Chin",84]
["Chin",33,null,"Seliadawn",187]
["Joe",66,null,"Joe",81]
["Sioux",19]
["Joe",81,null,"Employee","Count 2 criteria","Hurdle"]
["Seliadawn",95,null,"Sioux",{"$f":"COUNTIFS($A$2:$A$16,D16,$B$2:$B$16,$F$16)","v":0},">80"]
[null,null,null,"Jo",{"$f":"COUNTIFS($A$2:$A$16,D17,$B$2:$B$16,$F$16)","v":2}]
[null,null,null,"Chin",1]
[null,null,null,"Seliadawn",2]
[null,null,null,"Joe",1]

{"sheet":"PTsol","index":7,"n_rows":7,"n_cols":2,"rows_kept":7,"cut":false,"hidden":false,"merged":[]}
[]
[]
["Highschool","Average of Grade"]
["Auburn",2.7]
["Kent",2.8775000000000004]
["Seattle",2.7189189189189191]
["Grand Total",2.7896551724137932]

{"sheet":"PT","index":8,"n_rows":718,"n_cols":24,"rows_kept":718,"cut":false,"hidden":false,"merged":[]}
["Names","Gender","Highschool","Major","Grade",null,null,null,null,null,null,null,null,null,null,null,null,null,null,null,"HS","Major",null,{"$f":"VLOOKUP($A2,$T$2:$V$31,COLUMNS($C2:C2)+1,0)","v":{"$error":"#N/A"}}]
["Debroah Meara","W","Kent","Acc",3.4,null,null,"Column Labels",null,null,null,null,null,null,null,null,null,null,"W","Shanice Dettore","Auburn","Acc",null,{"$f":"CHOOSE(RANDBETWEEN(1,4),RANDBETWEEN(10,40)/10,RANDBETWEEN(15,35)/10,RANDBETWEEN(20,40)/10,RANDBETWEEN(20,30)/10)","v":3.5}]
["Lauren Czernik","W","Highline","Nurse",1.8,null,null,null,null,null,null,null,null,null,null,null,null,null,"W","Lynwood Mongiovi","Auburn","Nurse"]
["Devona Eberting","W","Seattle","ComSc",2.7,null,null,null,null,null,null,null,null,null,null,null,null,null,"M","Kali Keoghan","Auburn","ComSc"]
["Rolf Monrow","M","Auburn","Busn",1.8,null,null,"Acc","Busn","Chem","ComSc","English","Math","Nurse","Physics",null,null,null,"W","Trinity Mackstutis","Auburn","Busn"]
["Eldridge Mccalpin","M","Kent","Physics",1.3,null,"Seattle",{"$f":"IFERROR(AVERAGEIFS($E$2:$E$718,$C$2:$C$718,$G6,$D$2:$D$718,H$5),\"\")","v":2.7189189189189191},{"$f":"IFERROR(AVERAGEIFS($E$2:$E$718,$C$2:$C$718,$G6,$D$2:$D$718,I$5),\"\")","v":2.4099999999999997},{"$f":"IFERROR(AVERAGEIFS($E$2:$E$718,$C$2:$C$718,$G6,$D$2:$D$718,J$5),\"\")","v":2.6758620689655173},{"$f":"IFERROR(AVERAGEIFS($E$2:$E$718,$C$2:$C$718,$G6,$D$2:$D$718,K$5),\"\")","v":2.5696969696969703},{"$f":"IFERROR(AVERAGEIFS($E$2:$E$718,$C$2:$C$718,$G6,$D$2:$D$718,L$5),\"\")","v":""},{"$f":"IFERROR(AVERAGEIFS($E$2:$E$718,$C$2:$C$718,$G6,$D$2:$D$718,M$5),\"\")","v":2.7500000000000004},{"$f":"IFERROR(AVERAGEIFS($E$2:$E$718,$C$2:$C$718,$G6,$D$2:$D$718,N$5),\"\")","v":""},{"$f":"IFERROR(AVERAGEIFS($E$2:$E$718,$C$2:$C$718,$G6,$D$2:$D$718,O$5),\"\")","v":2.6325581395348845},null,null,null,"M","Fausto Hanafin","Auburn","Physics"]
["Jewel Lingner","W","Highline","Chem",2.6,null,"Kent",{"$f":"IFERROR(AVERAGEIFS($E$2:$E$718,$C$2:$C$718,$G7,$D$2:$D$718,H$5),\"\")","v":2.9415384615384608},{"$f":"IFERROR(AVERAGEIFS($E$2:$E$718,$C$2:$C$718,$G7,$D$2:$D$718,I$5),\"\")","v":2.8864864864864863},{"$f":"IFERROR(AVERAGEIFS($E$2:$E$718,$C$2:$C$718,$G7,$D$2:$D$718,J$5),\"\")","v":""},{"$f":"IFERROR(AVERAGEIFS($E$2:$E$718,$C$2:$C$718,$G7,$D$2:$D$718,K$5),\"\")","v":3.07},{"$f":"IFERROR(AVERAGEIFS($E$2:$E$718,$C$2:$C$718,$G7,$D$2:$D$718,L$5),\"\")","v":2.5402985074626869},{"$f":"IFERROR(AVERAGEIFS($E$2:$E$718,$C$2:$C$718,$G7,$D$2:$D$718,M$5),\"\")","v":2.7833333333333332},{"$f":"IFERROR(AVERAGEIFS($E$2:$E$718,$C$2:$C$718,$G7,$D$2:$D$718,N$5),\"\")","v":""},{"$f":"IFERROR(AVERAGEIFS($E$2:$E$718,$C$2:$C$718,$G7,$D$2:$D$718,O$5),\"\")","v":2.8651162790697677},null,null,null,"W","Sherrell Bucchin","Auburn","Chem"]
["Edmundo Froiland","M","Seattle","Chem",2.8,null,"Highline",{"$f":"IFERROR(AVERAGEIFS($E$2:$E$718,$C$2:$C$718,$G8,$D$2:$D$718,H$5),\"\")","v":2.97},{"$f":"IFERROR(AVERAGEIFS($E$2:$E$718,$C$2:$C$718,$G8,$D$2:$D$718,I$5),\"\")","v":2.48},{"$f":"IFERROR(AVERAGEIFS($E$2:$E$718,$C$2:$C$718,$G8,$D$2:$D$718,J$5),\"\")","v":3.0393939393939391},{"$f":"IFERROR(AVERAGEIFS($E$2:$E$718,$C$2:$C$718,$G8,$D$2:$D$718,K$5),\"\")","v":2.6500000000000004},{"$f":"IFERROR(AVERAGEIFS($E$2:$E$718,$C$2:$C$718,$G8,$D$2:$D$718,L$5),\"\")","v":2.4699999999999998},{"$f":"IFERROR(AVERAGEIFS($E$2:$E$718,$C$2:$C$718,$G8,$D$2:$D$718,M$5),\"\")","v":""},{"$f":"IFERROR(AVERAGEIFS($E$2:$E$718,$C$2:$C$718,$G8,$D$2:$D$718,N$5),\"\")","v":2.7333333333333329},{"$f":"IFERROR(AVERAGEIFS($E$2:$E$718,$C$2:$C$718,$G8,$D$2:$D$718,O$5),\"\")","v":2.6799999999999997},null,null,null,"W","Heide Alexakis","Highline","Chem"]
["Angelika Bringantino","W","Auburn","ComSc",3.5,null,"Auburn",{"$f":"IFERROR(AVERAGEIFS($E$2:$E$718,$C$2:$C$718,$G9,$D$2:$D$718,H$5),\"\")","v":3.1399999999999997},{"$f":"IFERROR(AVERAGEIFS($E$2:$E$718,$C$2:$C$718,$G9,$D$2:$D$718,I$5),\"\")","v":2.5292307692307694},{"$f":"IFERROR(AVERAGEIFS($E$2:$E$718,$C$2:$C$718,$G9,$D$2:$D$718,J$5),\"\")","v":2.8},{"$f":"IFERROR(AVERAGEIFS($E$2:$E$718,$C$2:$C$718,$G9,$D$2:$D$718,K$5),\"\")","v":2.4304347826086956},{"$f":"IFERROR(AVERAGEIFS($E$2:$E$718,$C$2:$C$718,$G9,$D$2:$D$718,L$5),\"\")","v":""},{"$f":"IFERROR(AVERAGEIFS($E$2:$E$718,$C$2:$C$718,$G9,$D$2:$D$718,M$5),\"\")","v":2.7},{"$f":"IFERROR(AVERAGEIFS($E$2:$E$718,$C$2:$C$718,$G9,$D$2:$D$718,N$5),\"\")","v":2.6100000000000003},{"$f":"IFERROR(AVERAGEIFS($E$2:$E$718,$C$2:$C$718,$G9,$D$2:$D$718,O$5),\"\")","v":2.98},null,null,null,"W","Birgit Angelozzi","Highline","ComSc"]
["Gracia Dreps","W","Kent","Acc",3.7,null,null,null,null,null,null,null,null,null,null,null,null,null,"W","Delinda Pasto","Highline","Acc"]
["Glinda Meinershagen","W","Highline","Nurse",3.8,null,null,null,null,null,null,null,null,null,null,null,null,null,"M","Gaylord Apthorpe","Highline","Nurse"]
["Leana Dutschmann","W","Seattle","Chem",3.9,null,"Row Labels",null,"Values Area",null,null,null,null,null,null,null,null,null,"M","Hilma Laroe","Highline","Chem"]
["Arnetta Cova","M","Auburn","Busn",0.1,null,null,null,"Where average calculation is made",null,null,null,null,null,null,null,null,null,"M","Kiley Bradon","Highline","Busn"]
["Vivan Osvaldo","W","Auburn","Busn",2.7,null,null,null,"PivotTables are great for making calculations with two or more criteria",null,null,null,null,null,null,null,null,null,"M","Magaly Feyler","Kent","Busn"]
["Patience Oeler","M","Auburn","Busn",3.3,null,null,null,"Average of all grades that were in ComSc Major AND Kent High School District",null,null,null,null,null,null,null,null,null,"M","Chin Olgvin","Kent","Busn"]
["Delta Lasagna","M","Auburn","Math",3.1,null,null,null,null,null,null,null,null,null,null,null,null,null,"W","Serina Measeck","Kent","Math"]
["Francesco Caryk","M","Kent","Acc",2.6,null,"Notes when creating PivotTable:",null,null,null,null,null,null,null,null,null,null,null,"M","Long Boid","Kent","Acc"]
["Malcom Esannason","M","Seattle","Acc",4,null,"Table must have field names (column headers) and records in rows",null,null,null,null,null,null,null,null,null,null,null,"W","Britt Declark","Kent","Acc"]
["Del Orttenburger","W","Kent","English",2,null,"Click in one cell and use PivotTable button in Insert Ribbon tab",null,null,null,null,null,null,null,null,null,null,null,"W","Laila Fosburgh","Kent","English"]
["Alethia Macnevin","W","Highline","English",2.4,null,"PivotTable Tools Design Ribbon, Change Report Layout to \"Tabular\"",null,null,null,null,null,null,null,null,null,null,null,"M","Jeromy Afshar","Kent","English"]
["Hosea Breines","W","Kent","English",3.6,null,"Change Number Formatting: Right Click in PivotTable",null,null,null,null,null,null,null,null,null,null,null,"M","Waylon Patik","Kent","English"]
["Rebbecca Paponetti","W","Seattle","Math",0.8,null,"Change calculation to Average: Right Click in PivotTable",null,null,null,null,null,null,null,null,null,null,null,"M","Douglass Nesland","Kent","Math"]
["Suellen Faix","W","Seattle","Busn",2.7,null,"PivotTable Slicer: Filters the whole PivotTable: PivotTable Tools Options Ribbon Tab, \"Insert Slicer\" button",null,null,null,null,null,null,null,null,null,null,null,"M","Palmer Bartch","Kent","Busn"]
["Wally Hiens","M","Seattle","Acc",2.7,null,null,null,null,null,null,null,null,null,null,null,null,null,"M","Dayle Kuiz","Seattle","Acc"]
["Wes Gittere","M","Seattle","ComSc",3.7,null,null,null,null,null,null,null,null,null,null,null,null,null,"W","Loni Gootz","Seattle","ComSc"]
["Winford Garnet","M","Kent","ComSc",2.8,null,null,null,null,null,null,null,null,null,null,null,null,null,"W","Elayne Mcward","Seattle","ComSc"]
["Antione Cabeza","W","Highline","ComSc",1.6,null,null,null,null,null,null,null,null,null,null,null,null,null,"M","Cristopher Alias","Seattle","ComSc"]
["Britany Leavigne","W","Kent","Physics",2.5,null,null,null,null,null,null,null,null,null,null,null,null,null,"M","Andreas Mccarr","Seattle","Physics"]
["Macie Droski","W","Highline","Physics",3.5,null,null,null,null,null,null,null,null,null,null,null,null,null,"M","Lonny Auslam","Seattle","Physics"]
["Lien Mulzer","W","Kent","Physics",3.3,null,null,null,null,null,null,null,null,null,null,null,null,null,"M","Johnson Degado","Seattle","Physics"]
["Frederica Angiolelli","W","Kent","Physics",3.2,null,null,null,null,null,null,null,null,null,null,null,null,null,"W","Leigh Affronti","Seattle","Physics"]
["Debroah Meara","W","Kent","Acc",2.4,null,null,null,null,null,null,null,null,null,null,null,null,null,"W","Debroah Meara"]
["Lauren Czernik","W","Highline","Nurse",0.8,null,null,null,null,null,null,null,null,null,null,null,null,null,"W","Lauren Czernik"]
["Devona Eberting","W","Seattle","ComSc",3.3,null,null,null,null,null,null,null,null,null,null,null,null,null,"W","Devona Eberting"]
["Rolf Monrow","M","Auburn","Busn",3.6,null,null,null,null,null,null,null,null,null,null,null,null,null,"M","Rolf Monrow"]
["Eldridge Mccalpin","M","Kent","Physics",2.9,null,null,null,null,null,null,null,null,null,null,null,null,null,"M","Eldridge Mccalpin"]
["Jewel Lingner","W","Highline","Chem",4,null,null,null,null,null,null,null,null,null,null,null,null,null,"W","Jewel Lingner"]
["Edmundo Froiland","M","Seattle","Chem",0.5,null,null,null,null,null,null,null,null,null,null,null,null,null,"M","Edmundo Froiland"]
["Angelika Bringantino","W","Auburn","ComSc",0.9,null,null,null,null,null,null,null,null,null,null,null,null,null,"W","Angelika Bringantino"]
["Gracia Dreps","W","Kent","Acc",3.2,null,null,null,null,null,null,null,null,null,null,null,null,null,"W","Gracia Dreps"]
["Glinda Meinershagen","W","Highline","Nurse",2.2000000000000002,null,null,null,null,null,null,null,null,null,null,null,null,null,"W","Glinda Meinershagen"]
["Leana Dutschmann","W","Seattle","Chem",2.2999999999999998,null,null,null,null,null,null,null,null,null,null,null,null,null,"W","Leana Dutschmann"]
["Arnetta Cova","M","Auburn","Busn",2.9,null,null,null,null,null,null,null,null,null,null,null,null,null,"M","Arnetta Cova"]
["Vivan Osvaldo","W","Auburn","Busn",2.2000000000000002,null,null,null,null,null,null,null,null,null,null,null,null,null,"W","Vivan Osvaldo"]
["Patience Oeler","M","Auburn","Busn",2,null,null,null,null,null,null,null,null,null,null,null,null,null,"M","Patience Oeler"]
["Delta Lasagna","M","Auburn","Math",3.3,null,null,null,null,null,null,null,null,null,null,null,null,null,"M","Delta Lasagna"]
["Francesco Caryk","M","Kent","Acc",3.1,null,null,null,null,null,null,null,null,null,null,null,null,null,"M","Francesco Caryk"]
["Malcom Esannason","M","Seattle","Acc",1.9,null,null,null,null,null,null,null,null,null,null,null,null,null,"M","Malcom Esannason"]
["Del Orttenburger","W","Kent","English",3.3,null,null,null,null,null,null,null,null,null,null,null,null,null,"W","Del Orttenburger"]
["Alethia Macnevin","W","Highline","English",2.2000000000000002,null,null,null,null,null,null,null,null,null,null,null,null,null,"W","Alethia Macnevin"]
["Hosea Breines","W","Kent","English",3.8,null,null,null,null,null,null,null,null,null,null,null,null,null,"W","Hosea Breines"]
["Rebbecca Paponetti","W","Seattle","Math",1.6,null,null,null,null,null,null,null,null,null,null,null,null,null,"W","Rebbecca Paponetti"]
["Suellen Faix","W","Seattle","Busn",3,null,null,null,null,null,null,null,null,null,null,null,null,null,"W","Suellen Faix"]
["Wally Hiens","M","Seattle","Acc",4,null,null,null,null,null,null,null,null,null,null,null,null,null,"M","Wally Hiens"]
["Wes Gittere","M","Seattle","ComSc",2.2000000000000002,null,null,null,null,null,null,null,null,null,null,null,null,null,"M","Wes Gittere"]
["Winford Garnet","M","Kent","ComSc",3.1,null,null,null,null,null,null,null,null,null,null,null,null,null,"M","Winford Garnet"]
["Antione Cabeza","W","Highline","ComSc",3.7,null,null,null,null,null,null,null,null,null,null,null,null,null,"W","Antione Cabeza"]
["Britany Leavigne","W","Kent","Physics",0.1,null,null,null,null,null,null,null,null,null,null,null,null,null,"W","Britany Leavigne"]
["Macie Droski","W","Highline","Physics",2.2000000000000002,null,null,null,null,null,null,null,null,null,null,null,null,null,"W","Macie Droski"]
["Lien Mulzer","W","Kent","Physics",3.3,null,null,null,null,null,null,null,null,null,null,null,null,null,"W","Lien Mulzer"]
["Frederica Angiolelli","W","Kent","Physics",2.2999999999999998,null,null,null,null,null,null,null,null,null,null,null,null,null,"W","Frederica Angiolelli"]
["Debroah Meara","W","Kent","Acc",3]
["Lauren Czernik","W","Highline","Nurse",0.5]
["Devona Eberting","W","Seattle","ComSc",1.1000000000000001]
["Rolf Monrow","M","Auburn","Busn",2.7]
["Eldridge Mccalpin","M","Kent","Physics",2.5]
["Jewel Lingner","W","Highline","Chem",2.2000000000000002]
["Edmundo Froiland","M","Seattle","Chem",3.3]
["Angelika Bringantino","W","Auburn","ComSc",2.5]
["Gracia Dreps","W","Kent","Acc",2.8]
["Glinda Meinershagen","W","Highline","Nurse",3.9]
["Leana Dutschmann","W","Seattle","Chem",2.9]
["Arnetta Cova","M","Auburn","Busn",3.4]
["Vivan Osvaldo","W","Auburn","Busn",3]
["Patience Oeler","M","Auburn","Busn",3.8]
["Delta Lasagna","M","Auburn","Math",2.5]
["Francesco Caryk","M","Kent","Acc",3.9]
["Malcom Esannason","M","Seattle","Acc",3.2]
["Del Orttenburger","W","Kent","English",3.3]
["Alethia Macnevin","W","Highline","English",3.6]
["Hosea Breines","W","Kent","English",3.3]
["Rebbecca Paponetti","W","Seattle","Math",3.3]
["Suellen Faix","W","Seattle","Busn",0.2]
["Wally Hiens","M","Seattle","Acc",3.4]
["Wes Gittere","M","Seattle","ComSc",3.9]
["Winford Garnet","M","Kent","ComSc",2.9]
["Antione Cabeza","W","Highline","ComSc",0.5]
["Britany Leavigne","W","Kent","Physics",2.6]
["Macie Droski","W","Highline","Physics",1.5]
["Lien Mulzer","W","Kent","Physics",3.7]
["Frederica Angiolelli","W","Kent","Physics",3.2]
["Debroah Meara","W","Kent","Acc",3.7]
["Lauren Czernik","W","Highline","Nurse",2.9]
["Devona Eberting","W","Seattle","ComSc",0.8]
["Rolf Monrow","M","Auburn","Busn",3.9]
["Eldridge Mccalpin","M","Kent","Physics",2.2000000000000002]
["Jewel Lingner","W","Highline","Chem",3.7]
["Edmundo Froiland","M","Seattle","Chem",2.6]
["Angelika Bringantino","W","Auburn","ComSc",1.7]
["Gracia Dreps","W","Kent","Acc",2.7]
["Glinda Meinershagen","W","Highline","Nurse",2.9]
["Leana Dutschmann","W","Seattle","Chem",1.6]
["Arnetta Cova","M","Auburn","Busn",3.3]
["Vivan Osvaldo","W","Auburn","Busn",2.2999999999999998]
["Patience Oeler","M","Auburn","Busn",4]
["Delta Lasagna","M","Auburn","Math",3.3]
["Francesco Caryk","M","Kent","Acc",3.4]
["Malcom Esannason","M","Seattle","Acc",3.9]
["Del Orttenburger","W","Kent","English",0.2]
["Alethia Macnevin","W","Highline","English",3.7]
["Hosea Breines","W","Kent","English",2.8]
["Rebbecca Paponetti","W","Seattle","Math",2.1]
["Suellen Faix","W","Seattle","Busn",0.5]
["Wally Hiens","M","Seattle","Acc",2.7]
["Wes Gittere","M","Seattle","ComSc",1.6]
["Winford Garnet","M","Kent","ComSc",3.7]
["Antione Cabeza","W","Highline","ComSc",4]
["Britany Leavigne","W","Kent","Physics",3.8]
["Macie Droski","W","Highline","Physics",3.4]
["Lien Mulzer","W","Kent","Physics",2.6]
["Frederica Angiolelli","W","Kent","Physics",3]
["Debroah Meara","W","Kent","Acc",3]
["Lauren Czernik","W","Highline","Nurse",3.4]
["Devona Eberting","W","Seattle","ComSc",2]
["Rolf Monrow","M","Auburn","Busn",3.8]
["Eldridge Mccalpin","M","Kent","Physics",3.8]
["Jewel Lingner","W","Highline","Chem",3.8]
["Edmundo Froiland","M","Seattle","Chem",2]
["Angelika Bringantino","W","Auburn","ComSc",2.5]
["Gracia Dreps","W","Kent","Acc",2.8]
["Glinda Meinershagen","W","Highline","Nurse",3.5]
["Leana Dutschmann","W","Seattle","Chem",3.1]
["Arnetta Cova","M","Auburn","Busn",2.9]
["Vivan Osvaldo","W","Auburn","Busn",2.1]
["Patience Oeler","M","Auburn","Busn",2.9]
["Delta Lasagna","M","Auburn","Math",2.4]
["Francesco Caryk","M","Kent","Acc",3.7]
["Malcom Esannason","M","Seattle","Acc",0.4]
["Del Orttenburger","W","Kent","English",3.4]
["Alethia Macnevin","W","Highline","English",2.1]
["Hosea Breines","W","Kent","English",2.2000000000000002]
["Rebbecca Paponetti","W","Seattle","Math",3.7]
["Suellen Faix","W","Seattle","Busn",2.2999999999999998]
["Wally Hiens","M","Seattle","Acc",1.2]
["Wes Gittere","M","Seattle","ComSc",1.8]
["Winford Garnet","M","Kent","ComSc",3.1]
["Antione Cabeza","W","Highline","ComSc",0]
["Britany Leavigne","W","Kent","Physics",2.1]
["Macie Droski","W","Highline","Physics",2.2999999999999998]
["Lien Mulzer","W","Kent","Physics",2.9]
["Frederica Angiolelli","W","Kent","Physics",3.9]
["Debroah Meara","W","Kent","Acc",3.5]
["Lauren Czernik","W","Highline","Nurse",3.8]
["Devona Eberting","W","Seattle","ComSc",1.5]
["Rolf Monrow","M","Auburn","Busn",2.7]
["Eldridge Mccalpin","M","Kent","Physics",2.7]
["Jewel Lingner","W","Highline","Chem",2.1]
["Edmundo Froiland","M","Seattle","Chem",2.2999999999999998]
["Angelika Bringantino","W","Auburn","ComSc",0.9]
["Gracia Dreps","W","Kent","Acc",2.2000000000000002]
["Glinda Meinershagen","W","Highline","Nurse",4]
["Leana Dutschmann","W","Seattle","Chem",3.2]
["Arnetta Cova","M","Auburn","Busn",0.8]
["Vivan Osvaldo","W","Auburn","Busn",2.5]
["Patience Oeler","M","Auburn","Busn",2]
["Delta Lasagna","M","Auburn","Math",2.6]
["Francesco Caryk","M","Kent","Acc",2]
["Malcom Esannason","M","Seattle","Acc",3.8]
["Del Orttenburger","W","Kent","English",0.7]
["Alethia Macnevin","W","Highline","English",2.2999999999999998]
["Hosea Breines","W","Kent","English",3.1]
["Rebbecca Paponetti","W","Seattle","Math",3.3]
["Suellen Faix","W","Seattle","Busn",3.4]
["Wally Hiens","M","Seattle","Acc",1.8]
["Wes Gittere","M","Seattle","ComSc",3]
["Winford Garnet","M","Kent","ComSc",3.1]
["Antione Cabeza","W","Highline","ComSc",3.3]
["Britany Leavigne","W","Kent","Physics",2.6]
["Macie Droski","W","Highline","Physics",3.7]
["Lien Mulzer","W","Kent","Physics",1]
["Frederica Angiolelli","W","Kent","Physics",3.3]
["Debroah Meara","W","Kent","Acc",2.2999999999999998]
["Lauren Czernik","W","Highline","Nurse",3.6]
["Devona Eberting","W","Seattle","ComSc",0.3]
["Rolf Monrow","M","Auburn","Busn",2.5]
["Eldridge Mccalpin","M","Kent","Physics",3.4]
["Jewel Lingner","W","Highline","Chem",3.8]
["Edmundo Froiland","M","Seattle","Chem",1.6]
["Angelika Bringantino","W","Auburn","ComSc",1.4]
["Gracia Dreps","W","Kent","Acc",3.9]
["Glinda Meinershagen","W","Highline","Nurse",3.2]
["Leana Dutschmann","W","Seattle","Chem",2.8]
["Arnetta Cova","M","Auburn","Busn",3.8]
["Vivan Osvaldo","W","Auburn","Busn",0.4]
["Patience Oeler","M","Auburn","Busn",2.8]
["Delta Lasagna","M","Auburn","Math",2.5]
["Francesco Caryk","M","Kent","Acc",3.8]
["Malcom Esannason","M","Seattle","Acc",1.3]
["Del Orttenburger","W","Kent","English",0.7]
["Alethia Macnevin","W","Highline","English",0.3]
["Hosea Breines","W","Kent","English",3.5]
["Rebbecca Paponetti","W","Seattle","Math",2.1]
["Suellen Faix","W","Seattle","Busn",1.8]
["Wally Hiens","M","Seattle","Acc",2.1]
["Wes Gittere","M","Seattle","ComSc",3.1]
["Winford Garnet","M","Kent","ComSc",3.1]
["Antione Cabeza","W","Highline","ComSc",2.7]
["Britany Leavigne","W","Kent","Physics",2.7]
["Macie Droski","W","Highline","Physics",3.5]
["Lien Mulzer","W","Kent","Physics",2.2000000000000002]
["Frederica Angiolelli","W","Kent","Physics",3]
["Debroah Meara","W","Kent","Acc",2.7]
["Lauren Czernik","W","Highline","Nurse",2.8]
["Devona Eberting","W","Seattle","ComSc",3.9]
["Rolf Monrow","M","Auburn","Busn",0]
["Eldridge Mccalpin","M","Kent","Physics",3.6]
["Jewel Lingner","W","Highline","Chem",3.9]
["Edmundo Froiland","M","Seattle","Chem",2.6]
["Angelika Bringantino","W","Auburn","ComSc",3.1]
["Gracia Dreps","W","Kent","Acc",2.7]
["Glinda Meinershagen","W","Highline","Nurse",2]
["Leana Dutschmann","W","Seattle","Chem",3.7]
["Arnetta Cova","M","Auburn","Busn",2.6]
["Vivan Osvaldo","W","Auburn","Busn",2.4]
["Patience Oeler","M","Auburn","Busn",2.4]
["Delta Lasagna","M","Auburn","Math",2.2999999999999998]
["Francesco Caryk","M","Kent","Acc",0.4]
["Malcom Esannason","M","Seattle","Acc",2.4]
["Del Orttenburger","W","Kent","English",3.7]
["Alethia Macnevin","W","Highline","English",2.6]
["Hosea Breines","W","Kent","English",1.6]
["Rebbecca Paponetti","W","Seattle","Math",3.4]
["Suellen Faix","W","Seattle","Busn",3.5]
["Wally Hiens","M","Seattle","Acc",2.7]
["Wes Gittere","M","Seattle","ComSc",3.7]
["Winford Garnet","M","Kent","ComSc",3]
["Antione Cabeza","W","Highline","ComSc",3.6]
["Britany Leavigne","W","Kent","Physics",3.7]
["Macie Droski","W","Highline","Physics",1.5]
["Lien Mulzer","W","Kent","Physics",1.9]
["Frederica Angiolelli","W","Kent","Physics",3.3]
["Debroah Meara","W","Kent","Acc",2]
["Lauren Czernik","W","Highline","Nurse",3.5]
["Devona Eberting","W","Seattle","ComSc",2.2999999999999998]
["Rolf Monrow","M","Auburn","Busn",3.4]
["Eldridge Mccalpin","M","Kent","Physics",2.6]
["Jewel Lingner","W","Highline","Chem",3.4]
["Edmundo Froiland","M","Seattle","Chem",1.9]
["Angelika Bringantino","W","Auburn","ComSc",2.2999999999999998]
["Gracia Dreps","W","Kent","Acc",3.4]
["Glinda Meinershagen","W","Highline","Nurse",3.9]
["Leana Dutschmann","W","Seattle","Chem",2.9]
["Arnetta Cova","M","Auburn","Busn",3]
["Vivan Osvaldo","W","Auburn","Busn",1]
["Patience Oeler","M","Auburn","Busn",2.7]
["Delta Lasagna","M","Auburn","Math",3.4]
["Francesco Caryk","M","Kent","Acc",4]
["Malcom Esannason","M","Seattle","Acc",3.5]
["Del Orttenburger","W","Kent","English",2.5]
["Alethia Macnevin","W","Highline","English",3.1]
["Hosea Breines","W","Kent","English",3.3]
["Rebbecca Paponetti","W","Seattle","Math",3.6]
["Suellen Faix","W","Seattle","Busn",2.7]
["Wally Hiens","M","Seattle","Acc",2.5]
["Wes Gittere","M","Seattle","ComSc",2.8]
["Winford Garnet","M","Kent","ComSc",3.9]
["Antione Cabeza","W","Highline","ComSc",2.6]
["Britany Leavigne","W","Kent","Physics",3.9]
["Macie Droski","W","Highline","Physics",4]
["Lien Mulzer","W","Kent","Physics",1.6]
["Frederica Angiolelli","W","Kent","Physics",3.7]
["Debroah Meara","W","Kent","Acc",2.8]
["Lauren Czernik","W","Highline","Nurse",2.9]
["Devona Eberting","W","Seattle","ComSc",3.6]
["Rolf Monrow","M","Auburn","Busn",3.8]
["Eldridge Mccalpin","M","Kent","Physics",3.5]
["Jewel Lingner","W","Highline","Chem",2.7]
["Edmundo Froiland","M","Seattle","Chem",3]
["Angelika Bringantino","W","Auburn","ComSc",1]
["Gracia Dreps","W","Kent","Acc",0.1]
["Glinda Meinershagen","W","Highline","Nurse",3.8]
["Leana Dutschmann","W","Seattle","Chem",1.6]
["Arnetta Cova","M","Auburn","Busn",2.6]
["Vivan Osvaldo","W","Auburn","Busn",3.9]
["Patience Oeler","M","Auburn","Busn",2.7]
["Delta Lasagna","M","Auburn","Math",1.6]
["Francesco Caryk","M","Kent","Acc",2.1]
["Malcom Esannason","M","Seattle","Acc",1.8]
["Del Orttenburger","W","Kent","English",2.8]
["Alethia Macnevin","W","Highline","English",2.4]
["Hosea Breines","W","Kent","English",3.3]
["Rebbecca Paponetti","W","Seattle","Math",3.6]
["Suellen Faix","W","Seattle","Busn",4]
["Wally Hiens","M","Seattle","Acc",3.7]
["Wes Gittere","M","Seattle","ComSc",3.5]
["Winford Garnet","M","Kent","ComSc",2]
["Antione Cabeza","W","Highline","ComSc",3.1]
["Britany Leavigne","W","Kent","Physics",2.9]
["Macie Droski","W","Highline","Physics",1.2]
["Lien Mulzer","W","Kent","Physics",4]
["Frederica Angiolelli","W","Kent","Physics",3.9]
["Debroah Meara","W","Kent","Acc",3.5]
["Lauren Czernik","W","Highline","Nurse",2.7]
["Devona Eberting","W","Seattle","ComSc",2.4]
["Rolf Monrow","M","Auburn","Busn",2.8]
["Eldridge Mccalpin","M","Kent","Physics",2.1]
["Jewel Lingner","W","Highline","Chem",3]
["Edmundo Froiland","M","Seattle","Chem",3.6]
["Angelika Bringantino","W","Auburn","ComSc",3.5]
["Gracia Dreps","W","Kent","Acc",2.7]
["Glinda Meinershagen","W","Highline","Nurse",3.8]
["Leana Dutschmann","W","Seattle","Chem",2]
["Arnetta Cova","M","Auburn","Busn",0.5]
["Vivan Osvaldo","W","Auburn","Busn",2.1]
["Debroah Meara","W","Kent","Acc",2.4]
["Lauren Czernik","W","Highline","Nurse",3.1]
["Devona Eberting","W","Seattle","ComSc",3.3]
["Rolf Monrow","M","Auburn","Busn",1.2]
["Eldridge Mccalpin","M","Kent","Physics",3.2]
["Jewel Lingner","W","Highline","Chem",3.3]
["Edmundo Froiland","M","Seattle","Chem",3.7]
["Angelika Bringantino","W","Auburn","ComSc",3.2]
["Gracia Dreps","W","Kent","Acc",3.8]
["Glinda Meinershagen","W","Highline","Nurse",3.2]
["Leana Dutschmann","W","Seattle","Chem",2.9]
["Arnetta Cova","M","Auburn","Busn",2.7]
["Vivan Osvaldo","W","Auburn","Busn",0.8]
["Debroah Meara","W","Kent","Acc",3.6]
["Lauren Czernik","W","Highline","Nurse",1]
["Devona Eberting","W","Seattle","ComSc",4]
["Rolf Monrow","M","Auburn","Busn",3.6]
["Eldridge Mccalpin","M","Kent","Physics",3.2]
["Jewel Lingner","W","Highline","Chem",1.4]
["Edmundo Froiland","M","Seattle","Chem",3.2]
["Angelika Bringantino","W","Auburn","ComSc",3.3]
["Gracia Dreps","W","Kent","Acc",3.6]
["Glinda Meinershagen","W","Highline","Nurse",3.5]
["Leana Dutschmann","W","Seattle","Chem",1.6]
["Arnetta Cova","M","Auburn","Busn",1.8]
["Vivan Osvaldo","W","Auburn","Busn",3.1]
["Gracia Dreps","W","Kent","Acc",2]
["Glinda Meinershagen","W","Highline","Nurse",3.7]
["Leana Dutschmann","W","Seattle","Chem",3.5]
["Arnetta Cova","M","Auburn","Busn",3.1]
["Vivan Osvaldo","W","Auburn","Busn",0.9]
["Gracia Dreps","W","Kent","Acc",3.8]
["Glinda Meinershagen","W","Highline","Nurse",2.2999999999999998]
["Leana Dutschmann","W","Seattle","Chem",3.8]
["Arnetta Cova","M","Auburn","Busn",3.2]
["Vivan Osvaldo","W","Auburn","Busn",3]
["Gracia Dreps","W","Kent","Acc",2.1]
["Glinda Meinershagen","W","Highline","Nurse",3.6]
["Leana Dutschmann","W","Seattle","Chem",2.7]
["Arnetta Cova","M","Auburn","Busn",2.5]
["Vivan Osvaldo","W","Auburn","Busn",3.5]
["Shanice Dettore","W",{"$f":"VLOOKUP($A356,$T$2:$V$31,COLUMNS($C356:C356)+1,0)","v":"Auburn"},{"$f":"VLOOKUP($A356,$T$2:$V$31,COLUMNS($C356:D356)+1,0)","v":"Acc"},4]
["Lynwood Mongiovi","W",{"$f":"VLOOKUP($A357,$T$2:$V$31,COLUMNS($C357:C357)+1,0)","v":"Auburn"},{"$f":"VLOOKUP($A357,$T$2:$V$31,COLUMNS($C357:D357)+1,0)","v":"Nurse"},2.7]
["Kali Keoghan","M",{"$f":"VLOOKUP($A358,$T$2:$V$31,COLUMNS($C358:C358)+1,0)","v":"Auburn"},{"$f":"VLOOKUP($A358,$T$2:$V$31,COLUMNS($C358:D358)+1,0)","v":"ComSc"},2.5]
["Trinity Mackstutis","W",{"$f":"VLOOKUP($A359,$T$2:$V$31,COLUMNS($C359:C359)+1,0)","v":"Auburn"},{"$f":"VLOOKUP($A359,$T$2:$V$31,COLUMNS($C359:D359)+1,0)","v":"Busn"},3.1]
["Fausto Hanafin","M",{"$f":"VLOOKUP($A360,$T$2:$V$31,COLUMNS($C360:C360)+1,0)","v":"Auburn"},{"$f":"VLOOKUP($A360,$T$2:$V$31,COLUMNS($C360:D360)+1,0)","v":"Physics"},3.4]
["Sherrell Bucchin","W",{"$f":"VLOOKUP($A361,$T$2:$V$31,COLUMNS($C361:C361)+1,0)","v":"Auburn"},{"$f":"VLOOKUP($A361,$T$2:$V$31,COLUMNS($C361:D361)+1,0)","v":"Chem"},1.5]
["Heide Alexakis","W",{"$f":"VLOOKUP($A362,$T$2:$V$31,COLUMNS($C362:C362)+1,0)","v":"Highline"},{"$f":"VLOOKUP($A362,$T$2:$V$31,COLUMNS($C362:D362)+1,0)","v":"Chem"},2.8]
["Birgit Angelozzi","W",{"$f":"VLOOKUP($A363,$T$2:$V$31,COLUMNS($C363:C363)+1,0)","v":"Highline"},{"$f":"VLOOKUP($A363,$T$2:$V$31,COLUMNS($C363:D363)+1,0)","v":"ComSc"},3.7]
["Delinda Pasto","W",{"$f":"VLOOKUP($A364,$T$2:$V$31,COLUMNS($C364:C364)+1,0)","v":"Highline"},{"$f":"VLOOKUP($A364,$T$2:$V$31,COLUMNS($C364:D364)+1,0)","v":"Acc"},2.5]
["Gaylord Apthorpe","M",{"$f":"VLOOKUP($A365,$T$2:$V$31,COLUMNS($C365:C365)+1,0)","v":"Highline"},{"$f":"VLOOKUP($A365,$T$2:$V$31,COLUMNS($C365:D365)+1,0)","v":"Nurse"},1.4]
["Hilma Laroe","M",{"$f":"VLOOKUP($A366,$T$2:$V$31,COLUMNS($C366:C366)+1,0)","v":"Highline"},{"$f":"VLOOKUP($A366,$T$2:$V$31,COLUMNS($C366:D366)+1,0)","v":"Chem"},3.8]
["Kiley Bradon","M",{"$f":"VLOOKUP($A367,$T$2:$V$31,COLUMNS($C367:C367)+1,0)","v":"Highline"},{"$f":"VLOOKUP($A367,$T$2:$V$31,COLUMNS($C367:D367)+1,0)","v":"Busn"},3.6]
["Magaly Feyler","M",{"$f":"VLOOKUP($A368,$T$2:$V$31,COLUMNS($C368:C368)+1,0)","v":"Kent"},{"$f":"VLOOKUP($A368,$T$2:$V$31,COLUMNS($C368:D368)+1,0)","v":"Busn"},2.8]
["Chin Olgvin","M",{"$f":"VLOOKUP($A369,$T$2:$V$31,COLUMNS($C369:C369)+1,0)","v":"Kent"},{"$f":"VLOOKUP($A369,$T$2:$V$31,COLUMNS($C369:D369)+1,0)","v":"Busn"},3.6]
["Serina Measeck","W",{"$f":"VLOOKUP($A370,$T$2:$V$31,COLUMNS($C370:C370)+1,0)","v":"Kent"},{"$f":"VLOOKUP($A370,$T$2:$V$31,COLUMNS($C370:D370)+1,0)","v":"Math"},3.2]
["Long Boid","M",{"$f":"VLOOKUP($A371,$T$2:$V$31,COLUMNS($C371:C371)+1,0)","v":"Kent"},{"$f":"VLOOKUP($A371,$T$2:$V$31,COLUMNS($C371:D371)+1,0)","v":"Acc"},3.6]
["Britt Declark","W",{"$f":"VLOOKUP($A372,$T$2:$V$31,COLUMNS($C372:C372)+1,0)","v":"Kent"},{"$f":"VLOOKUP($A372,$T$2:$V$31,COLUMNS($C372:D372)+1,0)","v":"Acc"},2.7]
["Laila Fosburgh","W",{"$f":"VLOOKUP($A373,$T$2:$V$31,COLUMNS($C373:C373)+1,0)","v":"Kent"},{"$f":"VLOOKUP($A373,$T$2:$V$31,COLUMNS($C373:D373)+1,0)","v":"English"},2.4]
["Jeromy Afshar","M",{"$f":"VLOOKUP($A374,$T$2:$V$31,COLUMNS($C374:C374)+1,0)","v":"Kent"},{"$f":"VLOOKUP($A374,$T$2:$V$31,COLUMNS($C374:D374)+1,0)","v":"English"},3]
["Waylon Patik","M",{"$f":"VLOOKUP($A375,$T$2:$V$31,COLUMNS($C375:C375)+1,0)","v":"Kent"},{"$f":"VLOOKUP($A375,$T$2:$V$31,COLUMNS($C375:D375)+1,0)","v":"English"},1.8]
["Douglass Nesland","M",{"$f":"VLOOKUP($A376,$T$2:$V$31,COLUMNS($C376:C376)+1,0)","v":"Kent"},{"$f":"VLOOKUP($A376,$T$2:$V$31,COLUMNS($C376:D376)+1,0)","v":"Math"},2.7]
["Palmer Bartch","M",{"$f":"VLOOKUP($A377,$T$2:$V$31,COLUMNS($C377:C377)+1,0)","v":"Kent"},{"$f":"VLOOKUP($A377,$T$2:$V$31,COLUMNS($C377:D377)+1,0)","v":"Busn"},3.9]
["Dayle Kuiz","M",{"$f":"VLOOKUP($A378,$T$2:$V$31,COLUMNS($C378:C378)+1,0)","v":"Seattle"},{"$f":"VLOOKUP($A378,$T$2:$V$31,COLUMNS($C378:D378)+1,0)","v":"Acc"},3.8]
["Loni Gootz","W",{"$f":"VLOOKUP($A379,$T$2:$V$31,COLUMNS($C379:C379)+1,0)","v":"Seattle"},{"$f":"VLOOKUP($A379,$T$2:$V$31,COLUMNS($C379:D379)+1,0)","v":"ComSc"},3.5]
["Elayne Mcward","W",{"$f":"VLOOKUP($A380,$T$2:$V$31,COLUMNS($C380:C380)+1,0)","v":"Seattle"},{"$f":"VLOOKUP($A380,$T$2:$V$31,COLUMNS($C380:D380)+1,0)","v":"ComSc"},2.4]
["Cristopher Alias","M",{"$f":"VLOOKUP($A381,$T$2:$V$31,COLUMNS($C381:C381)+1,0)","v":"Seattle"},{"$f":"VLOOKUP($A381,$T$2:$V$31,COLUMNS($C381:D381)+1,0)","v":"ComSc"},1.4]
["Andreas Mccarr","M",{"$f":"VLOOKUP($A382,$T$2:$V$31,COLUMNS($C382:C382)+1,0)","v":"Seattle"},{"$f":"VLOOKUP($A382,$T$2:$V$31,COLUMNS($C382:D382)+1,0)","v":"Physics"},3]
["Lonny Auslam","M",{"$f":"VLOOKUP($A383,$T$2:$V$31,COLUMNS($C383:C383)+1,0)","v":"Seattle"},{"$f":"VLOOKUP($A383,$T$2:$V$31,COLUMNS($C383:D383)+1,0)","v":"Physics"},3.6]
["Johnson Degado","M",{"$f":"VLOOKUP($A384,$T$2:$V$31,COLUMNS($C384:C384)+1,0)","v":"Seattle"},{"$f":"VLOOKUP($A384,$T$2:$V$31,COLUMNS($C384:D384)+1,0)","v":"Physics"},3.6]
["Leigh Affronti","W",{"$f":"VLOOKUP($A385,$T$2:$V$31,COLUMNS($C385:C385)+1,0)","v":"Seattle"},{"$f":"VLOOKUP($A385,$T$2:$V$31,COLUMNS($C385:D385)+1,0)","v":"Physics"},2.1]
["Shanice Dettore","W",{"$f":"VLOOKUP($A386,$T$2:$V$31,COLUMNS($C386:C386)+1,0)","v":"Auburn"},{"$f":"VLOOKUP($A386,$T$2:$V$31,COLUMNS($C386:D386)+1,0)","v":"Acc"},1.7]
["Lynwood Mongiovi","W",{"$f":"VLOOKUP($A387,$T$2:$V$31,COLUMNS($C387:C387)+1,0)","v":"Auburn"},{"$f":"VLOOKUP($A387,$T$2:$V$31,COLUMNS($C387:D387)+1,0)","v":"Nurse"},0.1]
["Kali Keoghan","M",{"$f":"VLOOKUP($A388,$T$2:$V$31,COLUMNS($C388:C388)+1,0)","v":"Auburn"},{"$f":"VLOOKUP($A388,$T$2:$V$31,COLUMNS($C388:D388)+1,0)","v":"ComSc"},3.3]
["Trinity Mackstutis","W",{"$f":"VLOOKUP($A389,$T$2:$V$31,COLUMNS($C389:C389)+1,0)","v":"Auburn"},{"$f":"VLOOKUP($A389,$T$2:$V$31,COLUMNS($C389:D389)+1,0)","v":"Busn"},0.5]
["Fausto Hanafin","M",{"$f":"VLOOKUP($A390,$T$2:$V$31,COLUMNS($C390:C390)+1,0)","v":"Auburn"},{"$f":"VLOOKUP($A390,$T$2:$V$31,COLUMNS($C390:D390)+1,0)","v":"Physics"},3.2]
["Sherrell Bucchin","W",{"$f":"VLOOKUP($A391,$T$2:$V$31,COLUMNS($C391:C391)+1,0)","v":"Auburn"},{"$f":"VLOOKUP($A391,$T$2:$V$31,COLUMNS($C391:D391)+1,0)","v":"Chem"},3.9]
["Heide Alexakis","W",{"$f":"VLOOKUP($A392,$T$2:$V$31,COLUMNS($C392:C392)+1,0)","v":"Highline"},{"$f":"VLOOKUP($A392,$T$2:$V$31,COLUMNS($C392:D392)+1,0)","v":"Chem"},3.6]
["Birgit Angelozzi","W",{"$f":"VLOOKUP($A393,$T$2:$V$31,COLUMNS($C393:C393)+1,0)","v":"Highline"},{"$f":"VLOOKUP($A393,$T$2:$V$31,COLUMNS($C393:D393)+1,0)","v":"ComSc"},1.9]
["Delinda Pasto","W",{"$f":"VLOOKUP($A394,$T$2:$V$31,COLUMNS($C394:C394)+1,0)","v":"Highline"},{"$f":"VLOOKUP($A394,$T$2:$V$31,COLUMNS($C394:D394)+1,0)","v":"Acc"},3]
["Gaylord Apthorpe","M",{"$f":"VLOOKUP($A395,$T$2:$V$31,COLUMNS($C395:C395)+1,0)","v":"Highline"},{"$f":"VLOOKUP($A395,$T$2:$V$31,COLUMNS($C395:D395)+1,0)","v":"Nurse"},2.8]
["Hilma Laroe","M",{"$f":"VLOOKUP($A396,$T$2:$V$31,COLUMNS($C396:C396)+1,0)","v":"Highline"},{"$f":"VLOOKUP($A396,$T$2:$V$31,COLUMNS($C396:D396)+1,0)","v":"Chem"},3]
["Kiley Bradon","M",{"$f":"VLOOKUP($A397,$T$2:$V$31,COLUMNS($C397:C397)+1,0)","v":"Highline"},{"$f":"VLOOKUP($A397,$T$2:$V$31,COLUMNS($C397:D397)+1,0)","v":"Busn"},2.2999999999999998]
["Magaly Feyler","M",{"$f":"VLOOKUP($A398,$T$2:$V$31,COLUMNS($C398:C398)+1,0)","v":"Kent"},{"$f":"VLOOKUP($A398,$T$2:$V$31,COLUMNS($C398:D398)+1,0)","v":"Busn"},3.4]
["Chin Olgvin","M",{"$f":"VLOOKUP($A399,$T$2:$V$31,COLUMNS($C399:C399)+1,0)","v":"Kent"},{"$f":"VLOOKUP($A399,$T$2:$V$31,COLUMNS($C399:D399)+1,0)","v":"Busn"},0.6]
["Serina Measeck","W",{"$f":"VLOOKUP($A400,$T$2:$V$31,COLUMNS($C400:C400)+1,0)","v":"Kent"},{"$f":"VLOOKUP($A400,$T$2:$V$31,COLUMNS($C400:D400)+1,0)","v":"Math"},3.9]
["Long Boid","M",{"$f":"VLOOKUP($A401,$T$2:$V$31,COLUMNS($C401:C401)+1,0)","v":"Kent"},{"$f":"VLOOKUP($A401,$T$2:$V$31,COLUMNS($C401:D401)+1,0)","v":"Acc"},2.5]
["Britt Declark","W",{"$f":"VLOOKUP($A402,$T$2:$V$31,COLUMNS($C402:C402)+1,0)","v":"Kent"},{"$f":"VLOOKUP($A402,$T$2:$V$31,COLUMNS($C402:D402)+1,0)","v":"Acc"},3.4]
["Laila Fosburgh","W",{"$f":"VLOOKUP($A403,$T$2:$V$31,COLUMNS($C403:C403)+1,0)","v":"Kent"},{"$f":"VLOOKUP($A403,$T$2:$V$31,COLUMNS($C403:D403)+1,0)","v":"English"},3.2]
["Jeromy Afshar","M",{"$f":"VLOOKUP($A404,$T$2:$V$31,COLUMNS($C404:C404)+1,0)","v":"Kent"},{"$f":"VLOOKUP($A404,$T$2:$V$31,COLUMNS($C404:D404)+1,0)","v":"English"},2]
["Waylon Patik","M",{"$f":"VLOOKUP($A405,$T$2:$V$31,COLUMNS($C405:C405)+1,0)","v":"Kent"},{"$f":"VLOOKUP($A405,$T$2:$V$31,COLUMNS($C405:D405)+1,0)","v":"English"},0.3]
["Douglass Nesland","M",{"$f":"VLOOKUP($A406,$T$2:$V$31,COLUMNS($C406:C406)+1,0)","v":"Kent"},{"$f":"VLOOKUP($A406,$T$2:$V$31,COLUMNS($C406:D406)+1,0)","v":"Math"},2.6]
["Palmer Bartch","M",{"$f":"VLOOKUP($A407,$T$2:$V$31,COLUMNS($C407:C407)+1,0)","v":"Kent"},{"$f":"VLOOKUP($A407,$T$2:$V$31,COLUMNS($C407:D407)+1,0)","v":"Busn"},2]
["Dayle Kuiz","M",{"$f":"VLOOKUP($A408,$T$2:$V$31,COLUMNS($C408:C408)+1,0)","v":"Seattle"},{"$f":"VLOOKUP($A408,$T$2:$V$31,COLUMNS($C408:D408)+1,0)","v":"Acc"},1.6]
["Loni Gootz","W",{"$f":"VLOOKUP($A409,$T$2:$V$31,COLUMNS($C409:C409)+1,0)","v":"Seattle"},{"$f":"VLOOKUP($A409,$T$2:$V$31,COLUMNS($C409:D409)+1,0)","v":"ComSc"},2.1]
["Elayne Mcward","W",{"$f":"VLOOKUP($A410,$T$2:$V$31,COLUMNS($C410:C410)+1,0)","v":"Seattle"},{"$f":"VLOOKUP($A410,$T$2:$V$31,COLUMNS($C410:D410)+1,0)","v":"ComSc"},3.7]
["Cristopher Alias","M",{"$f":"VLOOKUP($A411,$T$2:$V$31,COLUMNS($C411:C411)+1,0)","v":"Seattle"},{"$f":"VLOOKUP($A411,$T$2:$V$31,COLUMNS($C411:D411)+1,0)","v":"ComSc"},2.9]
["Andreas Mccarr","M",{"$f":"VLOOKUP($A412,$T$2:$V$31,COLUMNS($C412:C412)+1,0)","v":"Seattle"},{"$f":"VLOOKUP($A412,$T$2:$V$31,COLUMNS($C412:D412)+1,0)","v":"Physics"},3.4]
["Lonny Auslam","M",{"$f":"VLOOKUP($A413,$T$2:$V$31,COLUMNS($C413:C413)+1,0)","v":"Seattle"},{"$f":"VLOOKUP($A413,$T$2:$V$31,COLUMNS($C413:D413)+1,0)","v":"Physics"},2.5]
["Johnson Degado","M",{"$f":"VLOOKUP($A414,$T$2:$V$31,COLUMNS($C414:C414)+1,0)","v":"Seattle"},{"$f":"VLOOKUP($A414,$T$2:$V$31,COLUMNS($C414:D414)+1,0)","v":"Physics"},2.2999999999999998]
["Leigh Affronti","W",{"$f":"VLOOKUP($A415,$T$2:$V$31,COLUMNS($C415:C415)+1,0)","v":"Seattle"},{"$f":"VLOOKUP($A415,$T$2:$V$31,COLUMNS($C415:D415)+1,0)","v":"Physics"},4]
["Shanice Dettore","W",{"$f":"VLOOKUP($A416,$T$2:$V$31,COLUMNS($C416:C416)+1,0)","v":"Auburn"},{"$f":"VLOOKUP($A416,$T$2:$V$31,COLUMNS($C416:D416)+1,0)","v":"Acc"},2.7]
["Lynwood Mongiovi","W",{"$f":"VLOOKUP($A417,$T$2:$V$31,COLUMNS($C417:C417)+1,0)","v":"Auburn"},{"$f":"VLOOKUP($A417,$T$2:$V$31,COLUMNS($C417:D417)+1,0)","v":"Nurse"},3.9]
["Kali Keoghan","M",{"$f":"VLOOKUP($A418,$T$2:$V$31,COLUMNS($C418:C418)+1,0)","v":"Auburn"},{"$f":"VLOOKUP($A418,$T$2:$V$31,COLUMNS($C418:D418)+1,0)","v":"ComSc"},3.1]
["Trinity Mackstutis","W",{"$f":"VLOOKUP($A419,$T$2:$V$31,COLUMNS($C419:C419)+1,0)","v":"Auburn"},{"$f":"VLOOKUP($A419,$T$2:$V$31,COLUMNS($C419:D419)+1,0)","v":"Busn"},3.3]
["Fausto Hanafin","M",{"$f":"VLOOKUP($A420,$T$2:$V$31,COLUMNS($C420:C420)+1,0)","v":"Auburn"},{"$f":"VLOOKUP($A420,$T$2:$V$31,COLUMNS($C420:D420)+1,0)","v":"Physics"},3]
["Sherrell Bucchin","W",{"$f":"VLOOKUP($A421,$T$2:$V$31,COLUMNS($C421:C421)+1,0)","v":"Auburn"},{"$f":"VLOOKUP($A421,$T$2:$V$31,COLUMNS($C421:D421)+1,0)","v":"Chem"},3.5]
["Heide Alexakis","W",{"$f":"VLOOKUP($A422,$T$2:$V$31,COLUMNS($C422:C422)+1,0)","v":"Highline"},{"$f":"VLOOKUP($A422,$T$2:$V$31,COLUMNS($C422:D422)+1,0)","v":"Chem"},3.4]
["Birgit Angelozzi","W",{"$f":"VLOOKUP($A423,$T$2:$V$31,COLUMNS($C423:C423)+1,0)","v":"Highline"},{"$f":"VLOOKUP($A423,$T$2:$V$31,COLUMNS($C423:D423)+1,0)","v":"ComSc"},2.7]
["Delinda Pasto","W",{"$f":"VLOOKUP($A424,$T$2:$V$31,COLUMNS($C424:C424)+1,0)","v":"Highline"},{"$f":"VLOOKUP($A424,$T$2:$V$31,COLUMNS($C424:D424)+1,0)","v":"Acc"},2.6]
["Gaylord Apthorpe","M",{"$f":"VLOOKUP($A425,$T$2:$V$31,COLUMNS($C425:C425)+1,0)","v":"Highline"},{"$f":"VLOOKUP($A425,$T$2:$V$31,COLUMNS($C425:D425)+1,0)","v":"Nurse"},3.7]
["Hilma Laroe","M",{"$f":"VLOOKUP($A426,$T$2:$V$31,COLUMNS($C426:C426)+1,0)","v":"Highline"},{"$f":"VLOOKUP($A426,$T$2:$V$31,COLUMNS($C426:D426)+1,0)","v":"Chem"},3.9]
["Kiley Bradon","M",{"$f":"VLOOKUP($A427,$T$2:$V$31,COLUMNS($C427:C427)+1,0)","v":"Highline"},{"$f":"VLOOKUP($A427,$T$2:$V$31,COLUMNS($C427:D427)+1,0)","v":"Busn"},2.5]
["Magaly Feyler","M",{"$f":"VLOOKUP($A428,$T$2:$V$31,COLUMNS($C428:C428)+1,0)","v":"Kent"},{"$f":"VLOOKUP($A428,$T$2:$V$31,COLUMNS($C428:D428)+1,0)","v":"Busn"},3.3]
["Chin Olgvin","M",{"$f":"VLOOKUP($A429,$T$2:$V$31,COLUMNS($C429:C429)+1,0)","v":"Kent"},{"$f":"VLOOKUP($A429,$T$2:$V$31,COLUMNS($C429:D429)+1,0)","v":"Busn"},2.1]
["Serina Measeck","W",{"$f":"VLOOKUP($A430,$T$2:$V$31,COLUMNS($C430:C430)+1,0)","v":"Kent"},{"$f":"VLOOKUP($A430,$T$2:$V$31,COLUMNS($C430:D430)+1,0)","v":"Math"},3.7]
["Long Boid","M",{"$f":"VLOOKUP($A431,$T$2:$V$31,COLUMNS($C431:C431)+1,0)","v":"Kent"},{"$f":"VLOOKUP($A431,$T$2:$V$31,COLUMNS($C431:D431)+1,0)","v":"Acc"},2.1]
["Britt Declark","W",{"$f":"VLOOKUP($A432,$T$2:$V$31,COLUMNS($C432:C432)+1,0)","v":"Kent"},{"$f":"VLOOKUP($A432,$T$2:$V$31,COLUMNS($C432:D432)+1,0)","v":"Acc"},2]
["Laila Fosburgh","W",{"$f":"VLOOKUP($A433,$T$2:$V$31,COLUMNS($C433:C433)+1,0)","v":"Kent"},{"$f":"VLOOKUP($A433,$T$2:$V$31,COLUMNS($C433:D433)+1,0)","v":"English"},3.4]
["Jeromy Afshar","M",{"$f":"VLOOKUP($A434,$T$2:$V$31,COLUMNS($C434:C434)+1,0)","v":"Kent"},{"$f":"VLOOKUP($A434,$T$2:$V$31,COLUMNS($C434:D434)+1,0)","v":"English"},0.4]
["Waylon Patik","M",{"$f":"VLOOKUP($A435,$T$2:$V$31,COLUMNS($C435:C435)+1,0)","v":"Kent"},{"$f":"VLOOKUP($A435,$T$2:$V$31,COLUMNS($C435:D435)+1,0)","v":"English"},3.7]
["Douglass Nesland","M",{"$f":"VLOOKUP($A436,$T$2:$V$31,COLUMNS($C436:C436)+1,0)","v":"Kent"},{"$f":"VLOOKUP($A436,$T$2:$V$31,COLUMNS($C436:D436)+1,0)","v":"Math"},3.2]
["Palmer Bartch","M",{"$f":"VLOOKUP($A437,$T$2:$V$31,COLUMNS($C437:C437)+1,0)","v":"Kent"},{"$f":"VLOOKUP($A437,$T$2:$V$31,COLUMNS($C437:D437)+1,0)","v":"Busn"},2.5]
["Dayle Kuiz","M",{"$f":"VLOOKUP($A438,$T$2:$V$31,COLUMNS($C438:C438)+1,0)","v":"Seattle"},{"$f":"VLOOKUP($A438,$T$2:$V$31,COLUMNS($C438:D438)+1,0)","v":"Acc"},2.4]
["Loni Gootz","W",{"$f":"VLOOKUP($A439,$T$2:$V$31,COLUMNS($C439:C439)+1,0)","v":"Seattle"},{"$f":"VLOOKUP($A439,$T$2:$V$31,COLUMNS($C439:D439)+1,0)","v":"ComSc"},0.5]
["Elayne Mcward","W",{"$f":"VLOOKUP($A440,$T$2:$V$31,COLUMNS($C440:C440)+1,0)","v":"Seattle"},{"$f":"VLOOKUP($A440,$T$2:$V$31,COLUMNS($C440:D440)+1,0)","v":"ComSc"},2.7]
["Cristopher Alias","M",{"$f":"VLOOKUP($A441,$T$2:$V$31,COLUMNS($C441:C441)+1,0)","v":"Seattle"},{"$f":"VLOOKUP($A441,$T$2:$V$31,COLUMNS($C441:D441)+1,0)","v":"ComSc"},2.2999999999999998]
["Andreas Mccarr","M",{"$f":"VLOOKUP($A442,$T$2:$V$31,COLUMNS($C442:C442)+1,0)","v":"Seattle"},{"$f":"VLOOKUP($A442,$T$2:$V$31,COLUMNS($C442:D442)+1,0)","v":"Physics"},3.5]
["Lonny Auslam","M",{"$f":"VLOOKUP($A443,$T$2:$V$31,COLUMNS($C443:C443)+1,0)","v":"Seattle"},{"$f":"VLOOKUP($A443,$T$2:$V$31,COLUMNS($C443:D443)+1,0)","v":"Physics"},3.2]
["Johnson Degado","M",{"$f":"VLOOKUP($A444,$T$2:$V$31,COLUMNS($C444:C444)+1,0)","v":"Seattle"},{"$f":"VLOOKUP($A444,$T$2:$V$31,COLUMNS($C444:D444)+1,0)","v":"Physics"},1.8]
["Leigh Affronti","W",{"$f":"VLOOKUP($A445,$T$2:$V$31,COLUMNS($C445:C445)+1,0)","v":"Seattle"},{"$f":"VLOOKUP($A445,$T$2:$V$31,COLUMNS($C445:D445)+1,0)","v":"Physics"},3.8]
["Shanice Dettore","W",{"$f":"VLOOKUP($A446,$T$2:$V$31,COLUMNS($C446:C446)+1,0)","v":"Auburn"},{"$f":"VLOOKUP($A446,$T$2:$V$31,COLUMNS($C446:D446)+1,0)","v":"Acc"},3.3]
["Lynwood Mongiovi","W",{"$f":"VLOOKUP($A447,$T$2:$V$31,COLUMNS($C447:C447)+1,0)","v":"Auburn"},{"$f":"VLOOKUP($A447,$T$2:$V$31,COLUMNS($C447:D447)+1,0)","v":"Nurse"},3.7]
["Kali Keoghan","M",{"$f":"VLOOKUP($A448,$T$2:$V$31,COLUMNS($C448:C448)+1,0)","v":"Auburn"},{"$f":"VLOOKUP($A448,$T$2:$V$31,COLUMNS($C448:D448)+1,0)","v":"ComSc"},2.5]
["Trinity Mackstutis","W",{"$f":"VLOOKUP($A449,$T$2:$V$31,COLUMNS($C449:C449)+1,0)","v":"Auburn"},{"$f":"VLOOKUP($A449,$T$2:$V$31,COLUMNS($C449:D449)+1,0)","v":"Busn"},2.2999999999999998]
["Fausto Hanafin","M",{"$f":"VLOOKUP($A450,$T$2:$V$31,COLUMNS($C450:C450)+1,0)","v":"Auburn"},{"$f":"VLOOKUP($A450,$T$2:$V$31,COLUMNS($C450:D450)+1,0)","v":"Physics"},3.9]
["Sherrell Bucchin","W",{"$f":"VLOOKUP($A451,$T$2:$V$31,COLUMNS($C451:C451)+1,0)","v":"Auburn"},{"$f":"VLOOKUP($A451,$T$2:$V$31,COLUMNS($C451:D451)+1,0)","v":"Chem"},3.3]
["Heide Alexakis","W",{"$f":"VLOOKUP($A452,$T$2:$V$31,COLUMNS($C452:C452)+1,0)","v":"Highline"},{"$f":"VLOOKUP($A452,$T$2:$V$31,COLUMNS($C452:D452)+1,0)","v":"Chem"},3.3]
["Birgit Angelozzi","W",{"$f":"VLOOKUP($A453,$T$2:$V$31,COLUMNS($C453:C453)+1,0)","v":"Highline"},{"$f":"VLOOKUP($A453,$T$2:$V$31,COLUMNS($C453:D453)+1,0)","v":"ComSc"},2.8]
["Delinda Pasto","W",{"$f":"VLOOKUP($A454,$T$2:$V$31,COLUMNS($C454:C454)+1,0)","v":"Highline"},{"$f":"VLOOKUP($A454,$T$2:$V$31,COLUMNS($C454:D454)+1,0)","v":"Acc"},4]
["Gaylord Apthorpe","M",{"$f":"VLOOKUP($A455,$T$2:$V$31,COLUMNS($C455:C455)+1,0)","v":"Highline"},{"$f":"VLOOKUP($A455,$T$2:$V$31,COLUMNS($C455:D455)+1,0)","v":"Nurse"},0.3]
["Hilma Laroe","M",{"$f":"VLOOKUP($A456,$T$2:$V$31,COLUMNS($C456:C456)+1,0)","v":"Highline"},{"$f":"VLOOKUP($A456,$T$2:$V$31,COLUMNS($C456:D456)+1,0)","v":"Chem"},1.9]
["Kiley Bradon","M",{"$f":"VLOOKUP($A457,$T$2:$V$31,COLUMNS($C457:C457)+1,0)","v":"Highline"},{"$f":"VLOOKUP($A457,$T$2:$V$31,COLUMNS($C457:D457)+1,0)","v":"Busn"},1.1000000000000001]
["Magaly Feyler","M",{"$f":"VLOOKUP($A458,$T$2:$V$31,COLUMNS($C458:C458)+1,0)","v":"Kent"},{"$f":"VLOOKUP($A458,$T$2:$V$31,COLUMNS($C458:D458)+1,0)","v":"Busn"},2.4]
["Chin Olgvin","M",{"$f":"VLOOKUP($A459,$T$2:$V$31,COLUMNS($C459:C459)+1,0)","v":"Kent"},{"$f":"VLOOKUP($A459,$T$2:$V$31,COLUMNS($C459:D459)+1,0)","v":"Busn"},3.5]
["Serina Measeck","W",{"$f":"VLOOKUP($A460,$T$2:$V$31,COLUMNS($C460:C460)+1,0)","v":"Kent"},{"$f":"VLOOKUP($A460,$T$2:$V$31,COLUMNS($C460:D460)+1,0)","v":"Math"},2.2000000000000002]
["Long Boid","M",{"$f":"VLOOKUP($A461,$T$2:$V$31,COLUMNS($C461:C461)+1,0)","v":"Kent"},{"$f":"VLOOKUP($A461,$T$2:$V$31,COLUMNS($C461:D461)+1,0)","v":"Acc"},3.9]
["Britt Declark","W",{"$f":"VLOOKUP($A462,$T$2:$V$31,COLUMNS($C462:C462)+1,0)","v":"Kent"},{"$f":"VLOOKUP($A462,$T$2:$V$31,COLUMNS($C462:D462)+1,0)","v":"Acc"},3]
["Laila Fosburgh","W",{"$f":"VLOOKUP($A463,$T$2:$V$31,COLUMNS($C463:C463)+1,0)","v":"Kent"},{"$f":"VLOOKUP($A463,$T$2:$V$31,COLUMNS($C463:D463)+1,0)","v":"English"},4]
["Jeromy Afshar","M",{"$f":"VLOOKUP($A464,$T$2:$V$31,COLUMNS($C464:C464)+1,0)","v":"Kent"},{"$f":"VLOOKUP($A464,$T$2:$V$31,COLUMNS($C464:D464)+1,0)","v":"English"},3.7]
["Waylon Patik","M",{"$f":"VLOOKUP($A465,$T$2:$V$31,COLUMNS($C465:C465)+1,0)","v":"Kent"},{"$f":"VLOOKUP($A465,$T$2:$V$31,COLUMNS($C465:D465)+1,0)","v":"English"},1.6]
["Douglass Nesland","M",{"$f":"VLOOKUP($A466,$T$2:$V$31,COLUMNS($C466:C466)+1,0)","v":"Kent"},{"$f":"VLOOKUP($A466,$T$2:$V$31,COLUMNS($C466:D466)+1,0)","v":"Math"},3.5]
["Palmer Bartch","M",{"$f":"VLOOKUP($A467,$T$2:$V$31,COLUMNS($C467:C467)+1,0)","v":"Kent"},{"$f":"VLOOKUP($A467,$T$2:$V$31,COLUMNS($C467:D467)+1,0)","v":"Busn"},3]
["Dayle Kuiz","M",{"$f":"VLOOKUP($A468,$T$2:$V$31,COLUMNS($C468:C468)+1,0)","v":"Seattle"},{"$f":"VLOOKUP($A468,$T$2:$V$31,COLUMNS($C468:D468)+1,0)","v":"Acc"},1.6]
["Loni Gootz","W",{"$f":"VLOOKUP($A469,$T$2:$V$31,COLUMNS($C469:C469)+1,0)","v":"Seattle"},{"$f":"VLOOKUP($A469,$T$2:$V$31,COLUMNS($C469:D469)+1,0)","v":"ComSc"},2]
["Elayne Mcward","W",{"$f":"VLOOKUP($A470,$T$2:$V$31,COLUMNS($C470:C470)+1,0)","v":"Seattle"},{"$f":"VLOOKUP($A470,$T$2:$V$31,COLUMNS($C470:D470)+1,0)","v":"ComSc"},3.6]
["Cristopher Alias","M",{"$f":"VLOOKUP($A471,$T$2:$V$31,COLUMNS($C471:C471)+1,0)","v":"Seattle"},{"$f":"VLOOKUP($A471,$T$2:$V$31,COLUMNS($C471:D471)+1,0)","v":"ComSc"},3.9]
["Andreas Mccarr","M",{"$f":"VLOOKUP($A472,$T$2:$V$31,COLUMNS($C472:C472)+1,0)","v":"Seattle"},{"$f":"VLOOKUP($A472,$T$2:$V$31,COLUMNS($C472:D472)+1,0)","v":"Physics"},2.7]
["Lonny Auslam","M",{"$f":"VLOOKUP($A473,$T$2:$V$31,COLUMNS($C473:C473)+1,0)","v":"Seattle"},{"$f":"VLOOKUP($A473,$T$2:$V$31,COLUMNS($C473:D473)+1,0)","v":"Physics"},3.7]
["Johnson Degado","M",{"$f":"VLOOKUP($A474,$T$2:$V$31,COLUMNS($C474:C474)+1,0)","v":"Seattle"},{"$f":"VLOOKUP($A474,$T$2:$V$31,COLUMNS($C474:D474)+1,0)","v":"Physics"},3.9]
["Leigh Affronti","W",{"$f":"VLOOKUP($A475,$T$2:$V$31,COLUMNS($C475:C475)+1,0)","v":"Seattle"},{"$f":"VLOOKUP($A475,$T$2:$V$31,COLUMNS($C475:D475)+1,0)","v":"Physics"},2.4]
["Shanice Dettore","W",{"$f":"VLOOKUP($A476,$T$2:$V$31,COLUMNS($C476:C476)+1,0)","v":"Auburn"},{"$f":"VLOOKUP($A476,$T$2:$V$31,COLUMNS($C476:D476)+1,0)","v":"Acc"},3.3]
["Lynwood Mongiovi","W",{"$f":"VLOOKUP($A477,$T$2:$V$31,COLUMNS($C477:C477)+1,0)","v":"Auburn"},{"$f":"VLOOKUP($A477,$T$2:$V$31,COLUMNS($C477:D477)+1,0)","v":"Nurse"},2]
["Kali Keoghan","M",{"$f":"VLOOKUP($A478,$T$2:$V$31,COLUMNS($C478:C478)+1,0)","v":"Auburn"},{"$f":"VLOOKUP($A478,$T$2:$V$31,COLUMNS($C478:D478)+1,0)","v":"ComSc"},2.7]
["Trinity Mackstutis","W",{"$f":"VLOOKUP($A479,$T$2:$V$31,COLUMNS($C479:C479)+1,0)","v":"Auburn"},{"$f":"VLOOKUP($A479,$T$2:$V$31,COLUMNS($C479:D479)+1,0)","v":"Busn"},3.5]
["Fausto Hanafin","M",{"$f":"VLOOKUP($A480,$T$2:$V$31,COLUMNS($C480:C480)+1,0)","v":"Auburn"},{"$f":"VLOOKUP($A480,$T$2:$V$31,COLUMNS($C480:D480)+1,0)","v":"Physics"},2]
["Sherrell Bucchin","W",{"$f":"VLOOKUP($A481,$T$2:$V$31,COLUMNS($C481:C481)+1,0)","v":"Auburn"},{"$f":"VLOOKUP($A481,$T$2:$V$31,COLUMNS($C481:D481)+1,0)","v":"Chem"},1.6]
["Heide Alexakis","W",{"$f":"VLOOKUP($A482,$T$2:$V$31,COLUMNS($C482:C482)+1,0)","v":"Highline"},{"$f":"VLOOKUP($A482,$T$2:$V$31,COLUMNS($C482:D482)+1,0)","v":"Chem"},2.2999999999999998]
["Birgit Angelozzi","W",{"$f":"VLOOKUP($A483,$T$2:$V$31,COLUMNS($C483:C483)+1,0)","v":"Highline"},{"$f":"VLOOKUP($A483,$T$2:$V$31,COLUMNS($C483:D483)+1,0)","v":"ComSc"},4]
["Delinda Pasto","W",{"$f":"VLOOKUP($A484,$T$2:$V$31,COLUMNS($C484:C484)+1,0)","v":"Highline"},{"$f":"VLOOKUP($A484,$T$2:$V$31,COLUMNS($C484:D484)+1,0)","v":"Acc"},4]
["Gaylord Apthorpe","M",{"$f":"VLOOKUP($A485,$T$2:$V$31,COLUMNS($C485:C485)+1,0)","v":"Highline"},{"$f":"VLOOKUP($A485,$T$2:$V$31,COLUMNS($C485:D485)+1,0)","v":"Nurse"},1.6]
["Hilma Laroe","M",{"$f":"VLOOKUP($A486,$T$2:$V$31,COLUMNS($C486:C486)+1,0)","v":"Highline"},{"$f":"VLOOKUP($A486,$T$2:$V$31,COLUMNS($C486:D486)+1,0)","v":"Chem"},3.5]
["Kiley Bradon","M",{"$f":"VLOOKUP($A487,$T$2:$V$31,COLUMNS($C487:C487)+1,0)","v":"Highline"},{"$f":"VLOOKUP($A487,$T$2:$V$31,COLUMNS($C487:D487)+1,0)","v":"Busn"},1.7]
["Magaly Feyler","M",{"$f":"VLOOKUP($A488,$T$2:$V$31,COLUMNS($C488:C488)+1,0)","v":"Kent"},{"$f":"VLOOKUP($A488,$T$2:$V$31,COLUMNS($C488:D488)+1,0)","v":"Busn"},3.1]
["Chin Olgvin","M",{"$f":"VLOOKUP($A489,$T$2:$V$31,COLUMNS($C489:C489)+1,0)","v":"Kent"},{"$f":"VLOOKUP($A489,$T$2:$V$31,COLUMNS($C489:D489)+1,0)","v":"Busn"},3.1]
["Serina Measeck","W",{"$f":"VLOOKUP($A490,$T$2:$V$31,COLUMNS($C490:C490)+1,0)","v":"Kent"},{"$f":"VLOOKUP($A490,$T$2:$V$31,COLUMNS($C490:D490)+1,0)","v":"Math"},2]
["Long Boid","M",{"$f":"VLOOKUP($A491,$T$2:$V$31,COLUMNS($C491:C491)+1,0)","v":"Kent"},{"$f":"VLOOKUP($A491,$T$2:$V$31,COLUMNS($C491:D491)+1,0)","v":"Acc"},2.5]
["Britt Declark","W",{"$f":"VLOOKUP($A492,$T$2:$V$31,COLUMNS($C492:C492)+1,0)","v":"Kent"},{"$f":"VLOOKUP($A492,$T$2:$V$31,COLUMNS($C492:D492)+1,0)","v":"Acc"},3.3]
["Laila Fosburgh","W",{"$f":"VLOOKUP($A493,$T$2:$V$31,COLUMNS($C493:C493)+1,0)","v":"Kent"},{"$f":"VLOOKUP($A493,$T$2:$V$31,COLUMNS($C493:D493)+1,0)","v":"English"},1.6]
["Jeromy Afshar","M",{"$f":"VLOOKUP($A494,$T$2:$V$31,COLUMNS($C494:C494)+1,0)","v":"Kent"},{"$f":"VLOOKUP($A494,$T$2:$V$31,COLUMNS($C494:D494)+1,0)","v":"English"},0.9]
["Waylon Patik","M",{"$f":"VLOOKUP($A495,$T$2:$V$31,COLUMNS($C495:C495)+1,0)","v":"Kent"},{"$f":"VLOOKUP($A495,$T$2:$V$31,COLUMNS($C495:D495)+1,0)","v":"English"},2]
["Douglass Nesland","M",{"$f":"VLOOKUP($A496,$T$2:$V$31,COLUMNS($C496:C496)+1,0)","v":"Kent"},{"$f":"VLOOKUP($A496,$T$2:$V$31,COLUMNS($C496:D496)+1,0)","v":"Math"},2]
["Palmer Bartch","M",{"$f":"VLOOKUP($A497,$T$2:$V$31,COLUMNS($C497:C497)+1,0)","v":"Kent"},{"$f":"VLOOKUP($A497,$T$2:$V$31,COLUMNS($C497:D497)+1,0)","v":"Busn"},3.6]
["Dayle Kuiz","M",{"$f":"VLOOKUP($A498,$T$2:$V$31,COLUMNS($C498:C498)+1,0)","v":"Seattle"},{"$f":"VLOOKUP($A498,$T$2:$V$31,COLUMNS($C498:D498)+1,0)","v":"Acc"},3.4]
["Loni Gootz","W",{"$f":"VLOOKUP($A499,$T$2:$V$31,COLUMNS($C499:C499)+1,0)","v":"Seattle"},{"$f":"VLOOKUP($A499,$T$2:$V$31,COLUMNS($C499:D499)+1,0)","v":"ComSc"},4]
["Elayne Mcward","W",{"$f":"VLOOKUP($A500,$T$2:$V$31,COLUMNS($C500:C500)+1,0)","v":"Seattle"},{"$f":"VLOOKUP($A500,$T$2:$V$31,COLUMNS($C500:D500)+1,0)","v":"ComSc"},2.1]
["Cristopher Alias","M",{"$f":"VLOOKUP($A501,$T$2:$V$31,COLUMNS($C501:C501)+1,0)","v":"Seattle"},{"$f":"VLOOKUP($A501,$T$2:$V$31,COLUMNS($C501:D501)+1,0)","v":"ComSc"},3.2]
["Andreas Mccarr","M",{"$f":"VLOOKUP($A502,$T$2:$V$31,COLUMNS($C502:C502)+1,0)","v":"Seattle"},{"$f":"VLOOKUP($A502,$T$2:$V$31,COLUMNS($C502:D502)+1,0)","v":"Physics"},1.6]
["Lonny Auslam","M",{"$f":"VLOOKUP($A503,$T$2:$V$31,COLUMNS($C503:C503)+1,0)","v":"Seattle"},{"$f":"VLOOKUP($A503,$T$2:$V$31,COLUMNS($C503:D503)+1,0)","v":"Physics"},3.2]
["Johnson Degado","M",{"$f":"VLOOKUP($A504,$T$2:$V$31,COLUMNS($C504:C504)+1,0)","v":"Seattle"},{"$f":"VLOOKUP($A504,$T$2:$V$31,COLUMNS($C504:D504)+1,0)","v":"Physics"},3.6]
["Leigh Affronti","W",{"$f":"VLOOKUP($A505,$T$2:$V$31,COLUMNS($C505:C505)+1,0)","v":"Seattle"},{"$f":"VLOOKUP($A505,$T$2:$V$31,COLUMNS($C505:D505)+1,0)","v":"Physics"},2.8]
["Shanice Dettore","W",{"$f":"VLOOKUP($A506,$T$2:$V$31,COLUMNS($C506:C506)+1,0)","v":"Auburn"},{"$f":"VLOOKUP($A506,$T$2:$V$31,COLUMNS($C506:D506)+1,0)","v":"Acc"},2.9]
["Lynwood Mongiovi","W",{"$f":"VLOOKUP($A507,$T$2:$V$31,COLUMNS($C507:C507)+1,0)","v":"Auburn"},{"$f":"VLOOKUP($A507,$T$2:$V$31,COLUMNS($C507:D507)+1,0)","v":"Nurse"},2.5]
["Kali Keoghan","M",{"$f":"VLOOKUP($A508,$T$2:$V$31,COLUMNS($C508:C508)+1,0)","v":"Auburn"},{"$f":"VLOOKUP($A508,$T$2:$V$31,COLUMNS($C508:D508)+1,0)","v":"ComSc"},2.6]
["Trinity Mackstutis","W",{"$f":"VLOOKUP($A509,$T$2:$V$31,COLUMNS($C509:C509)+1,0)","v":"Auburn"},{"$f":"VLOOKUP($A509,$T$2:$V$31,COLUMNS($C509:D509)+1,0)","v":"Busn"},2]
["Fausto Hanafin","M",{"$f":"VLOOKUP($A510,$T$2:$V$31,COLUMNS($C510:C510)+1,0)","v":"Auburn"},{"$f":"VLOOKUP($A510,$T$2:$V$31,COLUMNS($C510:D510)+1,0)","v":"Physics"},3.6]
["Sherrell Bucchin","W",{"$f":"VLOOKUP($A511,$T$2:$V$31,COLUMNS($C511:C511)+1,0)","v":"Auburn"},{"$f":"VLOOKUP($A511,$T$2:$V$31,COLUMNS($C511:D511)+1,0)","v":"Chem"},2.1]
["Heide Alexakis","W",{"$f":"VLOOKUP($A512,$T$2:$V$31,COLUMNS($C512:C512)+1,0)","v":"Highline"},{"$f":"VLOOKUP($A512,$T$2:$V$31,COLUMNS($C512:D512)+1,0)","v":"Chem"},2.4]
["Birgit Angelozzi","W",{"$f":"VLOOKUP($A513,$T$2:$V$31,COLUMNS($C513:C513)+1,0)","v":"Highline"},{"$f":"VLOOKUP($A513,$T$2:$V$31,COLUMNS($C513:D513)+1,0)","v":"ComSc"},3.2]
["Delinda Pasto","W",{"$f":"VLOOKUP($A514,$T$2:$V$31,COLUMNS($C514:C514)+1,0)","v":"Highline"},{"$f":"VLOOKUP($A514,$T$2:$V$31,COLUMNS($C514:D514)+1,0)","v":"Acc"},2.5]
["Gaylord Apthorpe","M",{"$f":"VLOOKUP($A515,$T$2:$V$31,COLUMNS($C515:C515)+1,0)","v":"Highline"},{"$f":"VLOOKUP($A515,$T$2:$V$31,COLUMNS($C515:D515)+1,0)","v":"Nurse"},2.5]
["Hilma Laroe","M",{"$f":"VLOOKUP($A516,$T$2:$V$31,COLUMNS($C516:C516)+1,0)","v":"Highline"},{"$f":"VLOOKUP($A516,$T$2:$V$31,COLUMNS($C516:D516)+1,0)","v":"Chem"},3.7]
["Kiley Bradon","M",{"$f":"VLOOKUP($A517,$T$2:$V$31,COLUMNS($C517:C517)+1,0)","v":"Highline"},{"$f":"VLOOKUP($A517,$T$2:$V$31,COLUMNS($C517:D517)+1,0)","v":"Busn"},2.8]
["Magaly Feyler","M",{"$f":"VLOOKUP($A518,$T$2:$V$31,COLUMNS($C518:C518)+1,0)","v":"Kent"},{"$f":"VLOOKUP($A518,$T$2:$V$31,COLUMNS($C518:D518)+1,0)","v":"Busn"},3.4]
["Chin Olgvin","M",{"$f":"VLOOKUP($A519,$T$2:$V$31,COLUMNS($C519:C519)+1,0)","v":"Kent"},{"$f":"VLOOKUP($A519,$T$2:$V$31,COLUMNS($C519:D519)+1,0)","v":"Busn"},3.9]
["Serina Measeck","W",{"$f":"VLOOKUP($A520,$T$2:$V$31,COLUMNS($C520:C520)+1,0)","v":"Kent"},{"$f":"VLOOKUP($A520,$T$2:$V$31,COLUMNS($C520:D520)+1,0)","v":"Math"},2.9]
["Long Boid","M",{"$f":"VLOOKUP($A521,$T$2:$V$31,COLUMNS($C521:C521)+1,0)","v":"Kent"},{"$f":"VLOOKUP($A521,$T$2:$V$31,COLUMNS($C521:D521)+1,0)","v":"Acc"},2.7]
["Britt Declark","W",{"$f":"VLOOKUP($A522,$T$2:$V$31,COLUMNS($C522:C522)+1,0)","v":"Kent"},{"$f":"VLOOKUP($A522,$T$2:$V$31,COLUMNS($C522:D522)+1,0)","v":"Acc"},2.8]
["Laila Fosburgh","W",{"$f":"VLOOKUP($A523,$T$2:$V$31,COLUMNS($C523:C523)+1,0)","v":"Kent"},{"$f":"VLOOKUP($A523,$T$2:$V$31,COLUMNS($C523:D523)+1,0)","v":"English"},1.2]
["Jeromy Afshar","M",{"$f":"VLOOKUP($A524,$T$2:$V$31,COLUMNS($C524:C524)+1,0)","v":"Kent"},{"$f":"VLOOKUP($A524,$T$2:$V$31,COLUMNS($C524:D524)+1,0)","v":"English"},3.9]
["Waylon Patik","M",{"$f":"VLOOKUP($A525,$T$2:$V$31,COLUMNS($C525:C525)+1,0)","v":"Kent"},{"$f":"VLOOKUP($A525,$T$2:$V$31,COLUMNS($C525:D525)+1,0)","v":"English"},2.9]
["Douglass Nesland","M",{"$f":"VLOOKUP($A526,$T$2:$V$31,COLUMNS($C526:C526)+1,0)","v":"Kent"},{"$f":"VLOOKUP($A526,$T$2:$V$31,COLUMNS($C526:D526)+1,0)","v":"Math"},1.4]
["Palmer Bartch","M",{"$f":"VLOOKUP($A527,$T$2:$V$31,COLUMNS($C527:C527)+1,0)","v":"Kent"},{"$f":"VLOOKUP($A527,$T$2:$V$31,COLUMNS($C527:D527)+1,0)","v":"Busn"},3.5]
["Dayle Kuiz","M",{"$f":"VLOOKUP($A528,$T$2:$V$31,COLUMNS($C528:C528)+1,0)","v":"Seattle"},{"$f":"VLOOKUP($A528,$T$2:$V$31,COLUMNS($C528:D528)+1,0)","v":"Acc"},1.9]
["Loni Gootz","W",{"$f":"VLOOKUP($A529,$T$2:$V$31,COLUMNS($C529:C529)+1,0)","v":"Seattle"},{"$f":"VLOOKUP($A529,$T$2:$V$31,COLUMNS($C529:D529)+1,0)","v":"ComSc"},2.9]
["Elayne Mcward","W",{"$f":"VLOOKUP($A530,$T$2:$V$31,COLUMNS($C530:C530)+1,0)","v":"Seattle"},{"$f":"VLOOKUP($A530,$T$2:$V$31,COLUMNS($C530:D530)+1,0)","v":"ComSc"},0.2]
["Cristopher Alias","M",{"$f":"VLOOKUP($A531,$T$2:$V$31,COLUMNS($C531:C531)+1,0)","v":"Seattle"},{"$f":"VLOOKUP($A531,$T$2:$V$31,COLUMNS($C531:D531)+1,0)","v":"ComSc"},4]
["Andreas Mccarr","M",{"$f":"VLOOKUP($A532,$T$2:$V$31,COLUMNS($C532:C532)+1,0)","v":"Seattle"},{"$f":"VLOOKUP($A532,$T$2:$V$31,COLUMNS($C532:D532)+1,0)","v":"Physics"},3]
["Lonny Auslam","M",{"$f":"VLOOKUP($A533,$T$2:$V$31,COLUMNS($C533:C533)+1,0)","v":"Seattle"},{"$f":"VLOOKUP($A533,$T$2:$V$31,COLUMNS($C533:D533)+1,0)","v":"Physics"},3.9]
["Johnson Degado","M",{"$f":"VLOOKUP($A534,$T$2:$V$31,COLUMNS($C534:C534)+1,0)","v":"Seattle"},{"$f":"VLOOKUP($A534,$T$2:$V$31,COLUMNS($C534:D534)+1,0)","v":"Physics"},0.8]
["Leigh Affronti","W",{"$f":"VLOOKUP($A535,$T$2:$V$31,COLUMNS($C535:C535)+1,0)","v":"Seattle"},{"$f":"VLOOKUP($A535,$T$2:$V$31,COLUMNS($C535:D535)+1,0)","v":"Physics"},1.4]
["Shanice Dettore","W",{"$f":"VLOOKUP($A536,$T$2:$V$31,COLUMNS($C536:C536)+1,0)","v":"Auburn"},{"$f":"VLOOKUP($A536,$T$2:$V$31,COLUMNS($C536:D536)+1,0)","v":"Acc"},4]
["Lynwood Mongiovi","W",{"$f":"VLOOKUP($A537,$T$2:$V$31,COLUMNS($C537:C537)+1,0)","v":"Auburn"},{"$f":"VLOOKUP($A537,$T$2:$V$31,COLUMNS($C537:D537)+1,0)","v":"Nurse"},2.2000000000000002]
["Kali Keoghan","M",{"$f":"VLOOKUP($A538,$T$2:$V$31,COLUMNS($C538:C538)+1,0)","v":"Auburn"},{"$f":"VLOOKUP($A538,$T$2:$V$31,COLUMNS($C538:D538)+1,0)","v":"ComSc"},3]
["Trinity Mackstutis","W",{"$f":"VLOOKUP($A539,$T$2:$V$31,COLUMNS($C539:C539)+1,0)","v":"Auburn"},{"$f":"VLOOKUP($A539,$T$2:$V$31,COLUMNS($C539:D539)+1,0)","v":"Busn"},2.5]
["Fausto Hanafin","M",{"$f":"VLOOKUP($A540,$T$2:$V$31,COLUMNS($C540:C540)+1,0)","v":"Auburn"},{"$f":"VLOOKUP($A540,$T$2:$V$31,COLUMNS($C540:D540)+1,0)","v":"Physics"},2.8]
["Sherrell Bucchin","W",{"$f":"VLOOKUP($A541,$T$2:$V$31,COLUMNS($C541:C541)+1,0)","v":"Auburn"},{"$f":"VLOOKUP($A541,$T$2:$V$31,COLUMNS($C541:D541)+1,0)","v":"Chem"},2.7]
["Heide Alexakis","W",{"$f":"VLOOKUP($A542,$T$2:$V$31,COLUMNS($C542:C542)+1,0)","v":"Highline"},{"$f":"VLOOKUP($A542,$T$2:$V$31,COLUMNS($C542:D542)+1,0)","v":"Chem"},3.2]
["Birgit Angelozzi","W",{"$f":"VLOOKUP($A543,$T$2:$V$31,COLUMNS($C543:C543)+1,0)","v":"Highline"},{"$f":"VLOOKUP($A543,$T$2:$V$31,COLUMNS($C543:D543)+1,0)","v":"ComSc"},2.5]
["Delinda Pasto","W",{"$f":"VLOOKUP($A544,$T$2:$V$31,COLUMNS($C544:C544)+1,0)","v":"Highline"},{"$f":"VLOOKUP($A544,$T$2:$V$31,COLUMNS($C544:D544)+1,0)","v":"Acc"},2.8]
["Gaylord Apthorpe","M",{"$f":"VLOOKUP($A545,$T$2:$V$31,COLUMNS($C545:C545)+1,0)","v":"Highline"},{"$f":"VLOOKUP($A545,$T$2:$V$31,COLUMNS($C545:D545)+1,0)","v":"Nurse"},3.8]
["Hilma Laroe","M",{"$f":"VLOOKUP($A546,$T$2:$V$31,COLUMNS($C546:C546)+1,0)","v":"Highline"},{"$f":"VLOOKUP($A546,$T$2:$V$31,COLUMNS($C546:D546)+1,0)","v":"Chem"},3.1]
["Kiley Bradon","M",{"$f":"VLOOKUP($A547,$T$2:$V$31,COLUMNS($C547:C547)+1,0)","v":"Highline"},{"$f":"VLOOKUP($A547,$T$2:$V$31,COLUMNS($C547:D547)+1,0)","v":"Busn"},2.4]
["Magaly Feyler","M",{"$f":"VLOOKUP($A548,$T$2:$V$31,COLUMNS($C548:C548)+1,0)","v":"Kent"},{"$f":"VLOOKUP($A548,$T$2:$V$31,COLUMNS($C548:D548)+1,0)","v":"Busn"},3.3]
["Chin Olgvin","M",{"$f":"VLOOKUP($A549,$T$2:$V$31,COLUMNS($C549:C549)+1,0)","v":"Kent"},{"$f":"VLOOKUP($A549,$T$2:$V$31,COLUMNS($C549:D549)+1,0)","v":"Busn"},2.5]
["Serina Measeck","W",{"$f":"VLOOKUP($A550,$T$2:$V$31,COLUMNS($C550:C550)+1,0)","v":"Kent"},{"$f":"VLOOKUP($A550,$T$2:$V$31,COLUMNS($C550:D550)+1,0)","v":"Math"},3.3]
["Long Boid","M",{"$f":"VLOOKUP($A551,$T$2:$V$31,COLUMNS($C551:C551)+1,0)","v":"Kent"},{"$f":"VLOOKUP($A551,$T$2:$V$31,COLUMNS($C551:D551)+1,0)","v":"Acc"},4]
["Britt Declark","W",{"$f":"VLOOKUP($A552,$T$2:$V$31,COLUMNS($C552:C552)+1,0)","v":"Kent"},{"$f":"VLOOKUP($A552,$T$2:$V$31,COLUMNS($C552:D552)+1,0)","v":"Acc"},3.5]
["Laila Fosburgh","W",{"$f":"VLOOKUP($A553,$T$2:$V$31,COLUMNS($C553:C553)+1,0)","v":"Kent"},{"$f":"VLOOKUP($A553,$T$2:$V$31,COLUMNS($C553:D553)+1,0)","v":"English"},2.9]
["Jeromy Afshar","M",{"$f":"VLOOKUP($A554,$T$2:$V$31,COLUMNS($C554:C554)+1,0)","v":"Kent"},{"$f":"VLOOKUP($A554,$T$2:$V$31,COLUMNS($C554:D554)+1,0)","v":"English"},1.5]
["Waylon Patik","M",{"$f":"VLOOKUP($A555,$T$2:$V$31,COLUMNS($C555:C555)+1,0)","v":"Kent"},{"$f":"VLOOKUP($A555,$T$2:$V$31,COLUMNS($C555:D555)+1,0)","v":"English"},1.6]
["Douglass Nesland","M",{"$f":"VLOOKUP($A556,$T$2:$V$31,COLUMNS($C556:C556)+1,0)","v":"Kent"},{"$f":"VLOOKUP($A556,$T$2:$V$31,COLUMNS($C556:D556)+1,0)","v":"Math"},2.1]
["Palmer Bartch","M",{"$f":"VLOOKUP($A557,$T$2:$V$31,COLUMNS($C557:C557)+1,0)","v":"Kent"},{"$f":"VLOOKUP($A557,$T$2:$V$31,COLUMNS($C557:D557)+1,0)","v":"Busn"},2.5]
["Dayle Kuiz","M",{"$f":"VLOOKUP($A558,$T$2:$V$31,COLUMNS($C558:C558)+1,0)","v":"Seattle"},{"$f":"VLOOKUP($A558,$T$2:$V$31,COLUMNS($C558:D558)+1,0)","v":"Acc"},0.9]
["Loni Gootz","W",{"$f":"VLOOKUP($A559,$T$2:$V$31,COLUMNS($C559:C559)+1,0)","v":"Seattle"},{"$f":"VLOOKUP($A559,$T$2:$V$31,COLUMNS($C559:D559)+1,0)","v":"ComSc"},2.2999999999999998]
["Elayne Mcward","W",{"$f":"VLOOKUP($A560,$T$2:$V$31,COLUMNS($C560:C560)+1,0)","v":"Seattle"},{"$f":"VLOOKUP($A560,$T$2:$V$31,COLUMNS($C560:D560)+1,0)","v":"ComSc"},3.9]
["Cristopher Alias","M",{"$f":"VLOOKUP($A561,$T$2:$V$31,COLUMNS($C561:C561)+1,0)","v":"Seattle"},{"$f":"VLOOKUP($A561,$T$2:$V$31,COLUMNS($C561:D561)+1,0)","v":"ComSc"},3.1]
["Andreas Mccarr","M",{"$f":"VLOOKUP($A562,$T$2:$V$31,COLUMNS($C562:C562)+1,0)","v":"Seattle"},{"$f":"VLOOKUP($A562,$T$2:$V$31,COLUMNS($C562:D562)+1,0)","v":"Physics"},0.1]
["Lonny Auslam","M",{"$f":"VLOOKUP($A563,$T$2:$V$31,COLUMNS($C563:C563)+1,0)","v":"Seattle"},{"$f":"VLOOKUP($A563,$T$2:$V$31,COLUMNS($C563:D563)+1,0)","v":"Physics"},1.7]
["Johnson Degado","M",{"$f":"VLOOKUP($A564,$T$2:$V$31,COLUMNS($C564:C564)+1,0)","v":"Seattle"},{"$f":"VLOOKUP($A564,$T$2:$V$31,COLUMNS($C564:D564)+1,0)","v":"Physics"},1.7]
["Leigh Affronti","W",{"$f":"VLOOKUP($A565,$T$2:$V$31,COLUMNS($C565:C565)+1,0)","v":"Seattle"},{"$f":"VLOOKUP($A565,$T$2:$V$31,COLUMNS($C565:D565)+1,0)","v":"Physics"},3.2]
["Shanice Dettore","W",{"$f":"VLOOKUP($A566,$T$2:$V$31,COLUMNS($C566:C566)+1,0)","v":"Auburn"},{"$f":"VLOOKUP($A566,$T$2:$V$31,COLUMNS($C566:D566)+1,0)","v":"Acc"},3.6]
["Lynwood Mongiovi","W",{"$f":"VLOOKUP($A567,$T$2:$V$31,COLUMNS($C567:C567)+1,0)","v":"Auburn"},{"$f":"VLOOKUP($A567,$T$2:$V$31,COLUMNS($C567:D567)+1,0)","v":"Nurse"},2.5]
["Kali Keoghan","M",{"$f":"VLOOKUP($A568,$T$2:$V$31,COLUMNS($C568:C568)+1,0)","v":"Auburn"},{"$f":"VLOOKUP($A568,$T$2:$V$31,COLUMNS($C568:D568)+1,0)","v":"ComSc"},3]
["Trinity Mackstutis","W",{"$f":"VLOOKUP($A569,$T$2:$V$31,COLUMNS($C569:C569)+1,0)","v":"Auburn"},{"$f":"VLOOKUP($A569,$T$2:$V$31,COLUMNS($C569:D569)+1,0)","v":"Busn"},3.4]
["Fausto Hanafin","M",{"$f":"VLOOKUP($A570,$T$2:$V$31,COLUMNS($C570:C570)+1,0)","v":"Auburn"},{"$f":"VLOOKUP($A570,$T$2:$V$31,COLUMNS($C570:D570)+1,0)","v":"Physics"},3.3]
["Sherrell Bucchin","W",{"$f":"VLOOKUP($A571,$T$2:$V$31,COLUMNS($C571:C571)+1,0)","v":"Auburn"},{"$f":"VLOOKUP($A571,$T$2:$V$31,COLUMNS($C571:D571)+1,0)","v":"Chem"},2.9]
["Heide Alexakis","W",{"$f":"VLOOKUP($A572,$T$2:$V$31,COLUMNS($C572:C572)+1,0)","v":"Highline"},{"$f":"VLOOKUP($A572,$T$2:$V$31,COLUMNS($C572:D572)+1,0)","v":"Chem"},1.5]
["Birgit Angelozzi","W",{"$f":"VLOOKUP($A573,$T$2:$V$31,COLUMNS($C573:C573)+1,0)","v":"Highline"},{"$f":"VLOOKUP($A573,$T$2:$V$31,COLUMNS($C573:D573)+1,0)","v":"ComSc"},0.6]
["Delinda Pasto","W",{"$f":"VLOOKUP($A574,$T$2:$V$31,COLUMNS($C574:C574)+1,0)","v":"Highline"},{"$f":"VLOOKUP($A574,$T$2:$V$31,COLUMNS($C574:D574)+1,0)","v":"Acc"},3.7]
["Gaylord Apthorpe","M",{"$f":"VLOOKUP($A575,$T$2:$V$31,COLUMNS($C575:C575)+1,0)","v":"Highline"},{"$f":"VLOOKUP($A575,$T$2:$V$31,COLUMNS($C575:D575)+1,0)","v":"Nurse"},2.8]
["Hilma Laroe","M",{"$f":"VLOOKUP($A576,$T$2:$V$31,COLUMNS($C576:C576)+1,0)","v":"Highline"},{"$f":"VLOOKUP($A576,$T$2:$V$31,COLUMNS($C576:D576)+1,0)","v":"Chem"},1.8]
["Kiley Bradon","M",{"$f":"VLOOKUP($A577,$T$2:$V$31,COLUMNS($C577:C577)+1,0)","v":"Highline"},{"$f":"VLOOKUP($A577,$T$2:$V$31,COLUMNS($C577:D577)+1,0)","v":"Busn"},1.3]
["Magaly Feyler","M",{"$f":"VLOOKUP($A578,$T$2:$V$31,COLUMNS($C578:C578)+1,0)","v":"Kent"},{"$f":"VLOOKUP($A578,$T$2:$V$31,COLUMNS($C578:D578)+1,0)","v":"Busn"},3.7]
["Chin Olgvin","M",{"$f":"VLOOKUP($A579,$T$2:$V$31,COLUMNS($C579:C579)+1,0)","v":"Kent"},{"$f":"VLOOKUP($A579,$T$2:$V$31,COLUMNS($C579:D579)+1,0)","v":"Busn"},3]
["Serina Measeck","W",{"$f":"VLOOKUP($A580,$T$2:$V$31,COLUMNS($C580:C580)+1,0)","v":"Kent"},{"$f":"VLOOKUP($A580,$T$2:$V$31,COLUMNS($C580:D580)+1,0)","v":"Math"},2.9]
["Long Boid","M",{"$f":"VLOOKUP($A581,$T$2:$V$31,COLUMNS($C581:C581)+1,0)","v":"Kent"},{"$f":"VLOOKUP($A581,$T$2:$V$31,COLUMNS($C581:D581)+1,0)","v":"Acc"},2.5]
["Britt Declark","W",{"$f":"VLOOKUP($A582,$T$2:$V$31,COLUMNS($C582:C582)+1,0)","v":"Kent"},{"$f":"VLOOKUP($A582,$T$2:$V$31,COLUMNS($C582:D582)+1,0)","v":"Acc"},3.4]
["Laila Fosburgh","W",{"$f":"VLOOKUP($A583,$T$2:$V$31,COLUMNS($C583:C583)+1,0)","v":"Kent"},{"$f":"VLOOKUP($A583,$T$2:$V$31,COLUMNS($C583:D583)+1,0)","v":"English"},2.5]
["Jeromy Afshar","M",{"$f":"VLOOKUP($A584,$T$2:$V$31,COLUMNS($C584:C584)+1,0)","v":"Kent"},{"$f":"VLOOKUP($A584,$T$2:$V$31,COLUMNS($C584:D584)+1,0)","v":"English"},0.2]
["Waylon Patik","M",{"$f":"VLOOKUP($A585,$T$2:$V$31,COLUMNS($C585:C585)+1,0)","v":"Kent"},{"$f":"VLOOKUP($A585,$T$2:$V$31,COLUMNS($C585:D585)+1,0)","v":"English"},1.6]
["Douglass Nesland","M",{"$f":"VLOOKUP($A586,$T$2:$V$31,COLUMNS($C586:C586)+1,0)","v":"Kent"},{"$f":"VLOOKUP($A586,$T$2:$V$31,COLUMNS($C586:D586)+1,0)","v":"Math"},4]
["Palmer Bartch","M",{"$f":"VLOOKUP($A587,$T$2:$V$31,COLUMNS($C587:C587)+1,0)","v":"Kent"},{"$f":"VLOOKUP($A587,$T$2:$V$31,COLUMNS($C587:D587)+1,0)","v":"Busn"},1.5]
["Dayle Kuiz","M",{"$f":"VLOOKUP($A588,$T$2:$V$31,COLUMNS($C588:C588)+1,0)","v":"Seattle"},{"$f":"VLOOKUP($A588,$T$2:$V$31,COLUMNS($C588:D588)+1,0)","v":"Acc"},3.8]
["Loni Gootz","W",{"$f":"VLOOKUP($A589,$T$2:$V$31,COLUMNS($C589:C589)+1,0)","v":"Seattle"},{"$f":"VLOOKUP($A589,$T$2:$V$31,COLUMNS($C589:D589)+1,0)","v":"ComSc"},2.6]
["Elayne Mcward","W",{"$f":"VLOOKUP($A590,$T$2:$V$31,COLUMNS($C590:C590)+1,0)","v":"Seattle"},{"$f":"VLOOKUP($A590,$T$2:$V$31,COLUMNS($C590:D590)+1,0)","v":"ComSc"},0.3]
["Cristopher Alias","M",{"$f":"VLOOKUP($A591,$T$2:$V$31,COLUMNS($C591:C591)+1,0)","v":"Seattle"},{"$f":"VLOOKUP($A591,$T$2:$V$31,COLUMNS($C591:D591)+1,0)","v":"ComSc"},3.2]
["Andreas Mccarr","M",{"$f":"VLOOKUP($A592,$T$2:$V$31,COLUMNS($C592:C592)+1,0)","v":"Seattle"},{"$f":"VLOOKUP($A592,$T$2:$V$31,COLUMNS($C592:D592)+1,0)","v":"Physics"},3.4]
["Lonny Auslam","M",{"$f":"VLOOKUP($A593,$T$2:$V$31,COLUMNS($C593:C593)+1,0)","v":"Seattle"},{"$f":"VLOOKUP($A593,$T$2:$V$31,COLUMNS($C593:D593)+1,0)","v":"Physics"},2.9]
["Johnson Degado","M",{"$f":"VLOOKUP($A594,$T$2:$V$31,COLUMNS($C594:C594)+1,0)","v":"Seattle"},{"$f":"VLOOKUP($A594,$T$2:$V$31,COLUMNS($C594:D594)+1,0)","v":"Physics"},0.5]
["Leigh Affronti","W",{"$f":"VLOOKUP($A595,$T$2:$V$31,COLUMNS($C595:C595)+1,0)","v":"Seattle"},{"$f":"VLOOKUP($A595,$T$2:$V$31,COLUMNS($C595:D595)+1,0)","v":"Physics"},2.2999999999999998]
["Shanice Dettore","W",{"$f":"VLOOKUP($A596,$T$2:$V$31,COLUMNS($C596:C596)+1,0)","v":"Auburn"},{"$f":"VLOOKUP($A596,$T$2:$V$31,COLUMNS($C596:D596)+1,0)","v":"Acc"},3]
["Lynwood Mongiovi","W",{"$f":"VLOOKUP($A597,$T$2:$V$31,COLUMNS($C597:C597)+1,0)","v":"Auburn"},{"$f":"VLOOKUP($A597,$T$2:$V$31,COLUMNS($C597:D597)+1,0)","v":"Nurse"},3.4]
["Kali Keoghan","M",{"$f":"VLOOKUP($A598,$T$2:$V$31,COLUMNS($C598:C598)+1,0)","v":"Auburn"},{"$f":"VLOOKUP($A598,$T$2:$V$31,COLUMNS($C598:D598)+1,0)","v":"ComSc"},1.5]
["Trinity Mackstutis","W",{"$f":"VLOOKUP($A599,$T$2:$V$31,COLUMNS($C599:C599)+1,0)","v":"Auburn"},{"$f":"VLOOKUP($A599,$T$2:$V$31,COLUMNS($C599:D599)+1,0)","v":"Busn"},2.2999999999999998]
["Fausto Hanafin","M",{"$f":"VLOOKUP($A600,$T$2:$V$31,COLUMNS($C600:C600)+1,0)","v":"Auburn"},{"$f":"VLOOKUP($A600,$T$2:$V$31,COLUMNS($C600:D600)+1,0)","v":"Physics"},2.9]
["Sherrell Bucchin","W",{"$f":"VLOOKUP($A601,$T$2:$V$31,COLUMNS($C601:C601)+1,0)","v":"Auburn"},{"$f":"VLOOKUP($A601,$T$2:$V$31,COLUMNS($C601:D601)+1,0)","v":"Chem"},2.8]
["Heide Alexakis","W",{"$f":"VLOOKUP($A602,$T$2:$V$31,COLUMNS($C602:C602)+1,0)","v":"Highline"},{"$f":"VLOOKUP($A602,$T$2:$V$31,COLUMNS($C602:D602)+1,0)","v":"Chem"},2.5]
["Birgit Angelozzi","W",{"$f":"VLOOKUP($A603,$T$2:$V$31,COLUMNS($C603:C603)+1,0)","v":"Highline"},{"$f":"VLOOKUP($A603,$T$2:$V$31,COLUMNS($C603:D603)+1,0)","v":"ComSc"},3.5]
["Delinda Pasto","W",{"$f":"VLOOKUP($A604,$T$2:$V$31,COLUMNS($C604:C604)+1,0)","v":"Highline"},{"$f":"VLOOKUP($A604,$T$2:$V$31,COLUMNS($C604:D604)+1,0)","v":"Acc"},1.8]
["Gaylord Apthorpe","M",{"$f":"VLOOKUP($A605,$T$2:$V$31,COLUMNS($C605:C605)+1,0)","v":"Highline"},{"$f":"VLOOKUP($A605,$T$2:$V$31,COLUMNS($C605:D605)+1,0)","v":"Nurse"},1.5]
["Hilma Laroe","M",{"$f":"VLOOKUP($A606,$T$2:$V$31,COLUMNS($C606:C606)+1,0)","v":"Highline"},{"$f":"VLOOKUP($A606,$T$2:$V$31,COLUMNS($C606:D606)+1,0)","v":"Chem"},3.5]
["Kiley Bradon","M",{"$f":"VLOOKUP($A607,$T$2:$V$31,COLUMNS($C607:C607)+1,0)","v":"Highline"},{"$f":"VLOOKUP($A607,$T$2:$V$31,COLUMNS($C607:D607)+1,0)","v":"Busn"},3.6]
["Magaly Feyler","M",{"$f":"VLOOKUP($A608,$T$2:$V$31,COLUMNS($C608:C608)+1,0)","v":"Kent"},{"$f":"VLOOKUP($A608,$T$2:$V$31,COLUMNS($C608:D608)+1,0)","v":"Busn"},3.5]
["Chin Olgvin","M",{"$f":"VLOOKUP($A609,$T$2:$V$31,COLUMNS($C609:C609)+1,0)","v":"Kent"},{"$f":"VLOOKUP($A609,$T$2:$V$31,COLUMNS($C609:D609)+1,0)","v":"Busn"},2.9]
["Serina Measeck","W",{"$f":"VLOOKUP($A610,$T$2:$V$31,COLUMNS($C610:C610)+1,0)","v":"Kent"},{"$f":"VLOOKUP($A610,$T$2:$V$31,COLUMNS($C610:D610)+1,0)","v":"Math"},3.3]
["Long Boid","M",{"$f":"VLOOKUP($A611,$T$2:$V$31,COLUMNS($C611:C611)+1,0)","v":"Kent"},{"$f":"VLOOKUP($A611,$T$2:$V$31,COLUMNS($C611:D611)+1,0)","v":"Acc"},2.4]
["Britt Declark","W",{"$f":"VLOOKUP($A612,$T$2:$V$31,COLUMNS($C612:C612)+1,0)","v":"Kent"},{"$f":"VLOOKUP($A612,$T$2:$V$31,COLUMNS($C612:D612)+1,0)","v":"Acc"},2.6]
["Laila Fosburgh","W",{"$f":"VLOOKUP($A613,$T$2:$V$31,COLUMNS($C613:C613)+1,0)","v":"Kent"},{"$f":"VLOOKUP($A613,$T$2:$V$31,COLUMNS($C613:D613)+1,0)","v":"English"},3.8]
["Jeromy Afshar","M",{"$f":"VLOOKUP($A614,$T$2:$V$31,COLUMNS($C614:C614)+1,0)","v":"Kent"},{"$f":"VLOOKUP($A614,$T$2:$V$31,COLUMNS($C614:D614)+1,0)","v":"English"},3.5]
["Waylon Patik","M",{"$f":"VLOOKUP($A615,$T$2:$V$31,COLUMNS($C615:C615)+1,0)","v":"Kent"},{"$f":"VLOOKUP($A615,$T$2:$V$31,COLUMNS($C615:D615)+1,0)","v":"English"},2.2999999999999998]
["Douglass Nesland","M",{"$f":"VLOOKUP($A616,$T$2:$V$31,COLUMNS($C616:C616)+1,0)","v":"Kent"},{"$f":"VLOOKUP($A616,$T$2:$V$31,COLUMNS($C616:D616)+1,0)","v":"Math"},3.2]
["Palmer Bartch","M",{"$f":"VLOOKUP($A617,$T$2:$V$31,COLUMNS($C617:C617)+1,0)","v":"Kent"},{"$f":"VLOOKUP($A617,$T$2:$V$31,COLUMNS($C617:D617)+1,0)","v":"Busn"},3.2]
["Dayle Kuiz","M",{"$f":"VLOOKUP($A618,$T$2:$V$31,COLUMNS($C618:C618)+1,0)","v":"Seattle"},{"$f":"VLOOKUP($A618,$T$2:$V$31,COLUMNS($C618:D618)+1,0)","v":"Acc"},3.9]
["Loni Gootz","W",{"$f":"VLOOKUP($A619,$T$2:$V$31,COLUMNS($C619:C619)+1,0)","v":"Seattle"},{"$f":"VLOOKUP($A619,$T$2:$V$31,COLUMNS($C619:D619)+1,0)","v":"ComSc"},3.1]
["Elayne Mcward","W",{"$f":"VLOOKUP($A620,$T$2:$V$31,COLUMNS($C620:C620)+1,0)","v":"Seattle"},{"$f":"VLOOKUP($A620,$T$2:$V$31,COLUMNS($C620:D620)+1,0)","v":"ComSc"},3.4]
["Cristopher Alias","M",{"$f":"VLOOKUP($A621,$T$2:$V$31,COLUMNS($C621:C621)+1,0)","v":"Seattle"},{"$f":"VLOOKUP($A621,$T$2:$V$31,COLUMNS($C621:D621)+1,0)","v":"ComSc"},2.8]
["Andreas Mccarr","M",{"$f":"VLOOKUP($A622,$T$2:$V$31,COLUMNS($C622:C622)+1,0)","v":"Seattle"},{"$f":"VLOOKUP($A622,$T$2:$V$31,COLUMNS($C622:D622)+1,0)","v":"Physics"},2.7]
["Lonny Auslam","M",{"$f":"VLOOKUP($A623,$T$2:$V$31,COLUMNS($C623:C623)+1,0)","v":"Seattle"},{"$f":"VLOOKUP($A623,$T$2:$V$31,COLUMNS($C623:D623)+1,0)","v":"Physics"},2.7]
["Johnson Degado","M",{"$f":"VLOOKUP($A624,$T$2:$V$31,COLUMNS($C624:C624)+1,0)","v":"Seattle"},{"$f":"VLOOKUP($A624,$T$2:$V$31,COLUMNS($C624:D624)+1,0)","v":"Physics"},3.4]
["Leigh Affronti","W",{"$f":"VLOOKUP($A625,$T$2:$V$31,COLUMNS($C625:C625)+1,0)","v":"Seattle"},{"$f":"VLOOKUP($A625,$T$2:$V$31,COLUMNS($C625:D625)+1,0)","v":"Physics"},1.8]
["Shanice Dettore","W",{"$f":"VLOOKUP($A626,$T$2:$V$31,COLUMNS($C626:C626)+1,0)","v":"Auburn"},{"$f":"VLOOKUP($A626,$T$2:$V$31,COLUMNS($C626:D626)+1,0)","v":"Acc"},2.9]
["Lynwood Mongiovi","W",{"$f":"VLOOKUP($A627,$T$2:$V$31,COLUMNS($C627:C627)+1,0)","v":"Auburn"},{"$f":"VLOOKUP($A627,$T$2:$V$31,COLUMNS($C627:D627)+1,0)","v":"Nurse"},3.1]
["Kali Keoghan","M",{"$f":"VLOOKUP($A628,$T$2:$V$31,COLUMNS($C628:C628)+1,0)","v":"Auburn"},{"$f":"VLOOKUP($A628,$T$2:$V$31,COLUMNS($C628:D628)+1,0)","v":"ComSc"},1.9]
["Trinity Mackstutis","W",{"$f":"VLOOKUP($A629,$T$2:$V$31,COLUMNS($C629:C629)+1,0)","v":"Auburn"},{"$f":"VLOOKUP($A629,$T$2:$V$31,COLUMNS($C629:D629)+1,0)","v":"Busn"},2]
["Fausto Hanafin","M",{"$f":"VLOOKUP($A630,$T$2:$V$31,COLUMNS($C630:C630)+1,0)","v":"Auburn"},{"$f":"VLOOKUP($A630,$T$2:$V$31,COLUMNS($C630:D630)+1,0)","v":"Physics"},1.7]
["Sherrell Bucchin","W",{"$f":"VLOOKUP($A631,$T$2:$V$31,COLUMNS($C631:C631)+1,0)","v":"Auburn"},{"$f":"VLOOKUP($A631,$T$2:$V$31,COLUMNS($C631:D631)+1,0)","v":"Chem"},3.7]
["Heide Alexakis","W",{"$f":"VLOOKUP($A632,$T$2:$V$31,COLUMNS($C632:C632)+1,0)","v":"Highline"},{"$f":"VLOOKUP($A632,$T$2:$V$31,COLUMNS($C632:D632)+1,0)","v":"Chem"},3.5]
["Birgit Angelozzi","W",{"$f":"VLOOKUP($A633,$T$2:$V$31,COLUMNS($C633:C633)+1,0)","v":"Highline"},{"$f":"VLOOKUP($A633,$T$2:$V$31,COLUMNS($C633:D633)+1,0)","v":"ComSc"},3]
["Delinda Pasto","W",{"$f":"VLOOKUP($A634,$T$2:$V$31,COLUMNS($C634:C634)+1,0)","v":"Highline"},{"$f":"VLOOKUP($A634,$T$2:$V$31,COLUMNS($C634:D634)+1,0)","v":"Acc"},2.8]
["Gaylord Apthorpe","M",{"$f":"VLOOKUP($A635,$T$2:$V$31,COLUMNS($C635:C635)+1,0)","v":"Highline"},{"$f":"VLOOKUP($A635,$T$2:$V$31,COLUMNS($C635:D635)+1,0)","v":"Nurse"},0.1]
["Hilma Laroe","M",{"$f":"VLOOKUP($A636,$T$2:$V$31,COLUMNS($C636:C636)+1,0)","v":"Highline"},{"$f":"VLOOKUP($A636,$T$2:$V$31,COLUMNS($C636:D636)+1,0)","v":"Chem"},3.7]
["Kiley Bradon","M",{"$f":"VLOOKUP($A637,$T$2:$V$31,COLUMNS($C637:C637)+1,0)","v":"Highline"},{"$f":"VLOOKUP($A637,$T$2:$V$31,COLUMNS($C637:D637)+1,0)","v":"Busn"},3.5]
["Magaly Feyler","M",{"$f":"VLOOKUP($A638,$T$2:$V$31,COLUMNS($C638:C638)+1,0)","v":"Kent"},{"$f":"VLOOKUP($A638,$T$2:$V$31,COLUMNS($C638:D638)+1,0)","v":"Busn"},2.1]
["Chin Olgvin","M",{"$f":"VLOOKUP($A639,$T$2:$V$31,COLUMNS($C639:C639)+1,0)","v":"Kent"},{"$f":"VLOOKUP($A639,$T$2:$V$31,COLUMNS($C639:D639)+1,0)","v":"Busn"},2.7]
["Serina Measeck","W",{"$f":"VLOOKUP($A640,$T$2:$V$31,COLUMNS($C640:C640)+1,0)","v":"Kent"},{"$f":"VLOOKUP($A640,$T$2:$V$31,COLUMNS($C640:D640)+1,0)","v":"Math"},2.9]
["Long Boid","M",{"$f":"VLOOKUP($A641,$T$2:$V$31,COLUMNS($C641:C641)+1,0)","v":"Kent"},{"$f":"VLOOKUP($A641,$T$2:$V$31,COLUMNS($C641:D641)+1,0)","v":"Acc"},3.6]
["Britt Declark","W",{"$f":"VLOOKUP($A642,$T$2:$V$31,COLUMNS($C642:C642)+1,0)","v":"Kent"},{"$f":"VLOOKUP($A642,$T$2:$V$31,COLUMNS($C642:D642)+1,0)","v":"Acc"},2.9]
["Laila Fosburgh","W",{"$f":"VLOOKUP($A643,$T$2:$V$31,COLUMNS($C643:C643)+1,0)","v":"Kent"},{"$f":"VLOOKUP($A643,$T$2:$V$31,COLUMNS($C643:D643)+1,0)","v":"English"},3.6]
["Jeromy Afshar","M",{"$f":"VLOOKUP($A644,$T$2:$V$31,COLUMNS($C644:C644)+1,0)","v":"Kent"},{"$f":"VLOOKUP($A644,$T$2:$V$31,COLUMNS($C644:D644)+1,0)","v":"English"},2.4]
["Waylon Patik","M",{"$f":"VLOOKUP($A645,$T$2:$V$31,COLUMNS($C645:C645)+1,0)","v":"Kent"},{"$f":"VLOOKUP($A645,$T$2:$V$31,COLUMNS($C645:D645)+1,0)","v":"English"},3.4]
["Douglass Nesland","M",{"$f":"VLOOKUP($A646,$T$2:$V$31,COLUMNS($C646:C646)+1,0)","v":"Kent"},{"$f":"VLOOKUP($A646,$T$2:$V$31,COLUMNS($C646:D646)+1,0)","v":"Math"},1.9]
["Palmer Bartch","M",{"$f":"VLOOKUP($A647,$T$2:$V$31,COLUMNS($C647:C647)+1,0)","v":"Kent"},{"$f":"VLOOKUP($A647,$T$2:$V$31,COLUMNS($C647:D647)+1,0)","v":"Busn"},2.8]
["Dayle Kuiz","M",{"$f":"VLOOKUP($A648,$T$2:$V$31,COLUMNS($C648:C648)+1,0)","v":"Seattle"},{"$f":"VLOOKUP($A648,$T$2:$V$31,COLUMNS($C648:D648)+1,0)","v":"Acc"},3.9]
["Loni Gootz","W",{"$f":"VLOOKUP($A649,$T$2:$V$31,COLUMNS($C649:C649)+1,0)","v":"Seattle"},{"$f":"VLOOKUP($A649,$T$2:$V$31,COLUMNS($C649:D649)+1,0)","v":"ComSc"},3.9]
["Elayne Mcward","W",{"$f":"VLOOKUP($A650,$T$2:$V$31,COLUMNS($C650:C650)+1,0)","v":"Seattle"},{"$f":"VLOOKUP($A650,$T$2:$V$31,COLUMNS($C650:D650)+1,0)","v":"ComSc"},2.1]
["Cristopher Alias","M",{"$f":"VLOOKUP($A651,$T$2:$V$31,COLUMNS($C651:C651)+1,0)","v":"Seattle"},{"$f":"VLOOKUP($A651,$T$2:$V$31,COLUMNS($C651:D651)+1,0)","v":"ComSc"},1.3]
["Andreas Mccarr","M",{"$f":"VLOOKUP($A652,$T$2:$V$31,COLUMNS($C652:C652)+1,0)","v":"Seattle"},{"$f":"VLOOKUP($A652,$T$2:$V$31,COLUMNS($C652:D652)+1,0)","v":"Physics"},2.5]
["Lonny Auslam","M",{"$f":"VLOOKUP($A653,$T$2:$V$31,COLUMNS($C653:C653)+1,0)","v":"Seattle"},{"$f":"VLOOKUP($A653,$T$2:$V$31,COLUMNS($C653:D653)+1,0)","v":"Physics"},2.1]
["Johnson Degado","M",{"$f":"VLOOKUP($A654,$T$2:$V$31,COLUMNS($C654:C654)+1,0)","v":"Seattle"},{"$f":"VLOOKUP($A654,$T$2:$V$31,COLUMNS($C654:D654)+1,0)","v":"Physics"},2.2000000000000002]
["Leigh Affronti","W",{"$f":"VLOOKUP($A655,$T$2:$V$31,COLUMNS($C655:C655)+1,0)","v":"Seattle"},{"$f":"VLOOKUP($A655,$T$2:$V$31,COLUMNS($C655:D655)+1,0)","v":"Physics"},3.5]
["Serina Measeck","W",{"$f":"VLOOKUP($A656,$T$2:$V$31,COLUMNS($C656:C656)+1,0)","v":"Kent"},{"$f":"VLOOKUP($A656,$T$2:$V$31,COLUMNS($C656:D656)+1,0)","v":"Math"},0.6]
["Long Boid","M",{"$f":"VLOOKUP($A657,$T$2:$V$31,COLUMNS($C657:C657)+1,0)","v":"Kent"},{"$f":"VLOOKUP($A657,$T$2:$V$31,COLUMNS($C657:D657)+1,0)","v":"Acc"},3.4]
["Britt Declark","W",{"$f":"VLOOKUP($A658,$T$2:$V$31,COLUMNS($C658:C658)+1,0)","v":"Kent"},{"$f":"VLOOKUP($A658,$T$2:$V$31,COLUMNS($C658:D658)+1,0)","v":"Acc"},2.7]
["Laila Fosburgh","W",{"$f":"VLOOKUP($A659,$T$2:$V$31,COLUMNS($C659:C659)+1,0)","v":"Kent"},{"$f":"VLOOKUP($A659,$T$2:$V$31,COLUMNS($C659:D659)+1,0)","v":"English"},2.5]
["Jeromy Afshar","M",{"$f":"VLOOKUP($A660,$T$2:$V$31,COLUMNS($C660:C660)+1,0)","v":"Kent"},{"$f":"VLOOKUP($A660,$T$2:$V$31,COLUMNS($C660:D660)+1,0)","v":"English"},2.2000000000000002]
["Waylon Patik","M",{"$f":"VLOOKUP($A661,$T$2:$V$31,COLUMNS($C661:C661)+1,0)","v":"Kent"},{"$f":"VLOOKUP($A661,$T$2:$V$31,COLUMNS($C661:D661)+1,0)","v":"English"},2.4]
["Douglass Nesland","M",{"$f":"VLOOKUP($A662,$T$2:$V$31,COLUMNS($C662:C662)+1,0)","v":"Kent"},{"$f":"VLOOKUP($A662,$T$2:$V$31,COLUMNS($C662:D662)+1,0)","v":"Math"},3.8]
["Palmer Bartch","M",{"$f":"VLOOKUP($A663,$T$2:$V$31,COLUMNS($C663:C663)+1,0)","v":"Kent"},{"$f":"VLOOKUP($A663,$T$2:$V$31,COLUMNS($C663:D663)+1,0)","v":"Busn"},3.2]
["Dayle Kuiz","M",{"$f":"VLOOKUP($A664,$T$2:$V$31,COLUMNS($C664:C664)+1,0)","v":"Seattle"},{"$f":"VLOOKUP($A664,$T$2:$V$31,COLUMNS($C664:D664)+1,0)","v":"Acc"},0.8]
["Loni Gootz","W",{"$f":"VLOOKUP($A665,$T$2:$V$31,COLUMNS($C665:C665)+1,0)","v":"Seattle"},{"$f":"VLOOKUP($A665,$T$2:$V$31,COLUMNS($C665:D665)+1,0)","v":"ComSc"},2.5]
["Elayne Mcward","W",{"$f":"VLOOKUP($A666,$T$2:$V$31,COLUMNS($C666:C666)+1,0)","v":"Seattle"},{"$f":"VLOOKUP($A666,$T$2:$V$31,COLUMNS($C666:D666)+1,0)","v":"ComSc"},0.9]
["Cristopher Alias","M",{"$f":"VLOOKUP($A667,$T$2:$V$31,COLUMNS($C667:C667)+1,0)","v":"Seattle"},{"$f":"VLOOKUP($A667,$T$2:$V$31,COLUMNS($C667:D667)+1,0)","v":"ComSc"},1.2]
["Andreas Mccarr","M",{"$f":"VLOOKUP($A668,$T$2:$V$31,COLUMNS($C668:C668)+1,0)","v":"Seattle"},{"$f":"VLOOKUP($A668,$T$2:$V$31,COLUMNS($C668:D668)+1,0)","v":"Physics"},2.2000000000000002]
["Serina Measeck","W",{"$f":"VLOOKUP($A669,$T$2:$V$31,COLUMNS($C669:C669)+1,0)","v":"Kent"},{"$f":"VLOOKUP($A669,$T$2:$V$31,COLUMNS($C669:D669)+1,0)","v":"Math"},2.9]
["Long Boid","M",{"$f":"VLOOKUP($A670,$T$2:$V$31,COLUMNS($C670:C670)+1,0)","v":"Kent"},{"$f":"VLOOKUP($A670,$T$2:$V$31,COLUMNS($C670:D670)+1,0)","v":"Acc"},4]
["Britt Declark","W",{"$f":"VLOOKUP($A671,$T$2:$V$31,COLUMNS($C671:C671)+1,0)","v":"Kent"},{"$f":"VLOOKUP($A671,$T$2:$V$31,COLUMNS($C671:D671)+1,0)","v":"Acc"},3.2]
["Laila Fosburgh","W",{"$f":"VLOOKUP($A672,$T$2:$V$31,COLUMNS($C672:C672)+1,0)","v":"Kent"},{"$f":"VLOOKUP($A672,$T$2:$V$31,COLUMNS($C672:D672)+1,0)","v":"English"},1.1000000000000001]
["Jeromy Afshar","M",{"$f":"VLOOKUP($A673,$T$2:$V$31,COLUMNS($C673:C673)+1,0)","v":"Kent"},{"$f":"VLOOKUP($A673,$T$2:$V$31,COLUMNS($C673:D673)+1,0)","v":"English"},0.1]
["Waylon Patik","M",{"$f":"VLOOKUP($A674,$T$2:$V$31,COLUMNS($C674:C674)+1,0)","v":"Kent"},{"$f":"VLOOKUP($A674,$T$2:$V$31,COLUMNS($C674:D674)+1,0)","v":"English"},3]
["Douglass Nesland","M",{"$f":"VLOOKUP($A675,$T$2:$V$31,COLUMNS($C675:C675)+1,0)","v":"Kent"},{"$f":"VLOOKUP($A675,$T$2:$V$31,COLUMNS($C675:D675)+1,0)","v":"Math"},2.2000000000000002]
["Palmer Bartch","M",{"$f":"VLOOKUP($A676,$T$2:$V$31,COLUMNS($C676:C676)+1,0)","v":"Kent"},{"$f":"VLOOKUP($A676,$T$2:$V$31,COLUMNS($C676:D676)+1,0)","v":"Busn"},2.2999999999999998]
["Dayle Kuiz","M",{"$f":"VLOOKUP($A677,$T$2:$V$31,COLUMNS($C677:C677)+1,0)","v":"Seattle"},{"$f":"VLOOKUP($A677,$T$2:$V$31,COLUMNS($C677:D677)+1,0)","v":"Acc"},3.6]
["Loni Gootz","W",{"$f":"VLOOKUP($A678,$T$2:$V$31,COLUMNS($C678:C678)+1,0)","v":"Seattle"},{"$f":"VLOOKUP($A678,$T$2:$V$31,COLUMNS($C678:D678)+1,0)","v":"ComSc"},2.8]
["Elayne Mcward","W",{"$f":"VLOOKUP($A679,$T$2:$V$31,COLUMNS($C679:C679)+1,0)","v":"Seattle"},{"$f":"VLOOKUP($A679,$T$2:$V$31,COLUMNS($C679:D679)+1,0)","v":"ComSc"},3.2]
["Cristopher Alias","M",{"$f":"VLOOKUP($A680,$T$2:$V$31,COLUMNS($C680:C680)+1,0)","v":"Seattle"},{"$f":"VLOOKUP($A680,$T$2:$V$31,COLUMNS($C680:D680)+1,0)","v":"ComSc"},2.4]
["Andreas Mccarr","M",{"$f":"VLOOKUP($A681,$T$2:$V$31,COLUMNS($C681:C681)+1,0)","v":"Seattle"},{"$f":"VLOOKUP($A681,$T$2:$V$31,COLUMNS($C681:D681)+1,0)","v":"Physics"},0.5]
["Serina Measeck","W",{"$f":"VLOOKUP($A682,$T$2:$V$31,COLUMNS($C682:C682)+1,0)","v":"Kent"},{"$f":"VLOOKUP($A682,$T$2:$V$31,COLUMNS($C682:D682)+1,0)","v":"Math"},4]
["Long Boid","M",{"$f":"VLOOKUP($A683,$T$2:$V$31,COLUMNS($C683:C683)+1,0)","v":"Kent"},{"$f":"VLOOKUP($A683,$T$2:$V$31,COLUMNS($C683:D683)+1,0)","v":"Acc"},3.2]
["Britt Declark","W",{"$f":"VLOOKUP($A684,$T$2:$V$31,COLUMNS($C684:C684)+1,0)","v":"Kent"},{"$f":"VLOOKUP($A684,$T$2:$V$31,COLUMNS($C684:D684)+1,0)","v":"Acc"},2.5]
["Laila Fosburgh","W",{"$f":"VLOOKUP($A685,$T$2:$V$31,COLUMNS($C685:C685)+1,0)","v":"Kent"},{"$f":"VLOOKUP($A685,$T$2:$V$31,COLUMNS($C685:D685)+1,0)","v":"English"},3.9]
["Jeromy Afshar","M",{"$f":"VLOOKUP($A686,$T$2:$V$31,COLUMNS($C686:C686)+1,0)","v":"Kent"},{"$f":"VLOOKUP($A686,$T$2:$V$31,COLUMNS($C686:D686)+1,0)","v":"English"},3.8]
["Waylon Patik","M",{"$f":"VLOOKUP($A687,$T$2:$V$31,COLUMNS($C687:C687)+1,0)","v":"Kent"},{"$f":"VLOOKUP($A687,$T$2:$V$31,COLUMNS($C687:D687)+1,0)","v":"English"},2.8]
["Douglass Nesland","M",{"$f":"VLOOKUP($A688,$T$2:$V$31,COLUMNS($C688:C688)+1,0)","v":"Kent"},{"$f":"VLOOKUP($A688,$T$2:$V$31,COLUMNS($C688:D688)+1,0)","v":"Math"},2.8]
["Palmer Bartch","M",{"$f":"VLOOKUP($A689,$T$2:$V$31,COLUMNS($C689:C689)+1,0)","v":"Kent"},{"$f":"VLOOKUP($A689,$T$2:$V$31,COLUMNS($C689:D689)+1,0)","v":"Busn"},2.1]
["Dayle Kuiz","M",{"$f":"VLOOKUP($A690,$T$2:$V$31,COLUMNS($C690:C690)+1,0)","v":"Seattle"},{"$f":"VLOOKUP($A690,$T$2:$V$31,COLUMNS($C690:D690)+1,0)","v":"Acc"},2.6]
["Loni Gootz","W",{"$f":"VLOOKUP($A691,$T$2:$V$31,COLUMNS($C691:C691)+1,0)","v":"Seattle"},{"$f":"VLOOKUP($A691,$T$2:$V$31,COLUMNS($C691:D691)+1,0)","v":"ComSc"},3.5]
["Elayne Mcward","W",{"$f":"VLOOKUP($A692,$T$2:$V$31,COLUMNS($C692:C692)+1,0)","v":"Seattle"},{"$f":"VLOOKUP($A692,$T$2:$V$31,COLUMNS($C692:D692)+1,0)","v":"ComSc"},2.5]
["Cristopher Alias","M",{"$f":"VLOOKUP($A693,$T$2:$V$31,COLUMNS($C693:C693)+1,0)","v":"Seattle"},{"$f":"VLOOKUP($A693,$T$2:$V$31,COLUMNS($C693:D693)+1,0)","v":"ComSc"},1.9]
["Andreas Mccarr","M",{"$f":"VLOOKUP($A694,$T$2:$V$31,COLUMNS($C694:C694)+1,0)","v":"Seattle"},{"$f":"VLOOKUP($A694,$T$2:$V$31,COLUMNS($C694:D694)+1,0)","v":"Physics"},4]
["Jeromy Afshar","M",{"$f":"VLOOKUP($A695,$T$2:$V$31,COLUMNS($C695:C695)+1,0)","v":"Kent"},{"$f":"VLOOKUP($A695,$T$2:$V$31,COLUMNS($C695:D695)+1,0)","v":"English"},2.7]
["Waylon Patik","M",{"$f":"VLOOKUP($A696,$T$2:$V$31,COLUMNS($C696:C696)+1,0)","v":"Kent"},{"$f":"VLOOKUP($A696,$T$2:$V$31,COLUMNS($C696:D696)+1,0)","v":"English"},2.2000000000000002]
["Douglass Nesland","M",{"$f":"VLOOKUP($A697,$T$2:$V$31,COLUMNS($C697:C697)+1,0)","v":"Kent"},{"$f":"VLOOKUP($A697,$T$2:$V$31,COLUMNS($C697:D697)+1,0)","v":"Math"},3.2]
["Palmer Bartch","M",{"$f":"VLOOKUP($A698,$T$2:$V$31,COLUMNS($C698:C698)+1,0)","v":"Kent"},{"$f":"VLOOKUP($A698,$T$2:$V$31,COLUMNS($C698:D698)+1,0)","v":"Busn"},3.3]
["Dayle Kuiz","M",{"$f":"VLOOKUP($A699,$T$2:$V$31,COLUMNS($C699:C699)+1,0)","v":"Seattle"},{"$f":"VLOOKUP($A699,$T$2:$V$31,COLUMNS($C699:D699)+1,0)","v":"Acc"},4]
["Loni Gootz","W",{"$f":"VLOOKUP($A700,$T$2:$V$31,COLUMNS($C700:C700)+1,0)","v":"Seattle"},{"$f":"VLOOKUP($A700,$T$2:$V$31,COLUMNS($C700:D700)+1,0)","v":"ComSc"},3.3]
["Jeromy Afshar","M",{"$f":"VLOOKUP($A701,$T$2:$V$31,COLUMNS($C701:C701)+1,0)","v":"Kent"},{"$f":"VLOOKUP($A701,$T$2:$V$31,COLUMNS($C701:D701)+1,0)","v":"English"},3.2]
["Waylon Patik","M",{"$f":"VLOOKUP($A702,$T$2:$V$31,COLUMNS($C702:C702)+1,0)","v":"Kent"},{"$f":"VLOOKUP($A702,$T$2:$V$31,COLUMNS($C702:D702)+1,0)","v":"English"},2.9]
["Douglass Nesland","M",{"$f":"VLOOKUP($A703,$T$2:$V$31,COLUMNS($C703:C703)+1,0)","v":"Kent"},{"$f":"VLOOKUP($A703,$T$2:$V$31,COLUMNS($C703:D703)+1,0)","v":"Math"},3.4]
["Palmer Bartch","M",{"$f":"VLOOKUP($A704,$T$2:$V$31,COLUMNS($C704:C704)+1,0)","v":"Kent"},{"$f":"VLOOKUP($A704,$T$2:$V$31,COLUMNS($C704:D704)+1,0)","v":"Busn"},2.2000000000000002]
["Dayle Kuiz","M",{"$f":"VLOOKUP($A705,$T$2:$V$31,COLUMNS($C705:C705)+1,0)","v":"Seattle"},{"$f":"VLOOKUP($A705,$T$2:$V$31,COLUMNS($C705:D705)+1,0)","v":"Acc"},3]
["Loni Gootz","W",{"$f":"VLOOKUP($A706,$T$2:$V$31,COLUMNS($C706:C706)+1,0)","v":"Seattle"},{"$f":"VLOOKUP($A706,$T$2:$V$31,COLUMNS($C706:D706)+1,0)","v":"ComSc"},0]
["Jeromy Afshar","M",{"$f":"VLOOKUP($A707,$T$2:$V$31,COLUMNS($C707:C707)+1,0)","v":"Kent"},{"$f":"VLOOKUP($A707,$T$2:$V$31,COLUMNS($C707:D707)+1,0)","v":"English"},2.7]
["Waylon Patik","M",{"$f":"VLOOKUP($A708,$T$2:$V$31,COLUMNS($C708:C708)+1,0)","v":"Kent"},{"$f":"VLOOKUP($A708,$T$2:$V$31,COLUMNS($C708:D708)+1,0)","v":"English"},3.3]
["Douglass Nesland","M",{"$f":"VLOOKUP($A709,$T$2:$V$31,COLUMNS($C709:C709)+1,0)","v":"Kent"},{"$f":"VLOOKUP($A709,$T$2:$V$31,COLUMNS($C709:D709)+1,0)","v":"Math"},1.4]
["Palmer Bartch","M",{"$f":"VLOOKUP($A710,$T$2:$V$31,COLUMNS($C710:C710)+1,0)","v":"Kent"},{"$f":"VLOOKUP($A710,$T$2:$V$31,COLUMNS($C710:D710)+1,0)","v":"Busn"},3.5]
["Dayle Kuiz","M",{"$f":"VLOOKUP($A711,$T$2:$V$31,COLUMNS($C711:C711)+1,0)","v":"Seattle"},{"$f":"VLOOKUP($A711,$T$2:$V$31,COLUMNS($C711:D711)+1,0)","v":"Acc"},3.2]
["Loni Gootz","W",{"$f":"VLOOKUP($A712,$T$2:$V$31,COLUMNS($C712:C712)+1,0)","v":"Seattle"},{"$f":"VLOOKUP($A712,$T$2:$V$31,COLUMNS($C712:D712)+1,0)","v":"ComSc"},2.9]
["Jeromy Afshar","M",{"$f":"VLOOKUP($A713,$T$2:$V$31,COLUMNS($C713:C713)+1,0)","v":"Kent"},{"$f":"VLOOKUP($A713,$T$2:$V$31,COLUMNS($C713:D713)+1,0)","v":"English"},3.2]
["Waylon Patik","M",{"$f":"VLOOKUP($A714,$T$2:$V$31,COLUMNS($C714:C714)+1,0)","v":"Kent"},{"$f":"VLOOKUP($A714,$T$2:$V$31,COLUMNS($C714:D714)+1,0)","v":"English"},3.8]
["Douglass Nesland","M",{"$f":"VLOOKUP($A715,$T$2:$V$31,COLUMNS($C715:C715)+1,0)","v":"Kent"},{"$f":"VLOOKUP($A715,$T$2:$V$31,COLUMNS($C715:D715)+1,0)","v":"Math"},2.2999999999999998]
["Palmer Bartch","M",{"$f":"VLOOKUP($A716,$T$2:$V$31,COLUMNS($C716:C716)+1,0)","v":"Kent"},{"$f":"VLOOKUP($A716,$T$2:$V$31,COLUMNS($C716:D716)+1,0)","v":"Busn"},2.8]
["Dayle Kuiz","M",{"$f":"VLOOKUP($A717,$T$2:$V$31,COLUMNS($C717:C717)+1,0)","v":"Seattle"},{"$f":"VLOOKUP($A717,$T$2:$V$31,COLUMNS($C717:D717)+1,0)","v":"Acc"},3.2]
["Loni Gootz","W",{"$f":"VLOOKUP($A718,$T$2:$V$31,COLUMNS($C718:C718)+1,0)","v":"Seattle"},{"$f":"VLOOKUP($A718,$T$2:$V$31,COLUMNS($C718:D718)+1,0)","v":"ComSc"},2.6]

{"sheet":"Sparklines","index":9,"n_rows":69,"n_cols":15,"rows_kept":69,"cut":false,"hidden":false,"merged":[]}
["Trend:",null,null,null,null,0,5,10,1,5,10,8,12,0,15]
["Ave Quiz1",8.454545454545455,null,null,null,20,20,15,20,20,20,20,20,20,20]
["Ave Quiz2",12.204545454545455,null,null,null,"Quiz1","Quiz2","Quiz3","Quiz4","Quiz5","Quiz6","Quiz7","Quiz8","Quiz9","Quiz10"]
["Ave Quiz3",12.681818181818182,null,null,null,{"$f":"RANDBETWEEN(F$1,F$2)","v":12},9,15,13,7,17,13,16,5,17]
["Ave Quiz4",11.363636363636363,null,null,null,20,18,12,8,15,18,13,20,8,15]
["Ave Quiz5",11.704545454545455,null,null,null,20,6,13,15,20,12,15,18,2,17]
["Ave Quiz6",14.659090909090908,null,null,null,14,6,12,1,20,16,18,16,6,17]
["Ave Quiz7",13.795454545454545,null,null,null,18,16,14,8,10,16,15,15,15,16]
["Ave Quiz8",16.431818181818183,null,null,null,15,5,10,5,18,16,9,12,9,20]
["Ave Quiz9",8.8863636363636367,null,null,null,8,13,10,13,18,12,15,20,0,16]
["Ave Quiz10",17.204545454545453,null,null,null,14,20,14,11,12,18,8,16,12,19]
[null,null,null,null,null,14,10,10,12,6,15,18,14,15,18]
["Trend:",null,null,null,null,4,20,11,12,15,12,14,18,2,15]
["Ave Quiz1",{"$f":"B2","v":8.454545454545455},null,null,null,{"$f":"RANDBETWEEN(F$1,F$2)","v":11},8,14,3,7,16,15,17,1,16]
["Ave Quiz2",12.204545454545455,null,null,null,19,19,11,12,17,15,18,14,13,17]
["Ave Quiz3",12.681818181818182,null,null,null,0,10,12,12,13,12,17,19,7,17]
["Ave Quiz4",11.363636363636363,null,null,null,5,13,13,8,13,15,8,12,13,17]
["Ave Quiz5",11.704545454545455,null,null,null,10,6,15,9,8,17,11,12,19,20]
["Ave Quiz6",14.659090909090908,null,null,null,20,19,13,16,19,17,12,18,2,20]
["Ave Quiz7",13.795454545454545,null,null,null,5,20,13,6,19,10,15,12,11,15]
["Ave Quiz8",16.431818181818183,null,null,null,14,14,11,16,10,18,12,17,6,18]
["Ave Quiz9",8.8863636363636367,null,null,null,6,5,13,16,18,17,9,20,20,19]
["Ave Quiz10",17.204545454545453,null,null,null,11,16,14,19,5,18,10,13,18,15]
[null,null,null,null,null,{"$f":"RANDBETWEEN(F$1,F$2)","v":15},13,11,16,15,14,11,13,4,16]
["Distribution of Grades:",null,null,null,null,0,12,13,1,20,20,15,16,10,19]
["Categories","Frequency",null,null,null,6,15,12,19,10,13,9,12,9,16]
["0 - 2.5",{"$f":"FREQUENCY($F$4:$O$47,{2.5;5;7.5;10;12.5;15;17.5;20})","v":16},null,null,null,20,7,12,15,16,11,17,14,10,17]
["2.5 - 5",15,null,null,null,0,8,12,14,20,15,18,19,17,15]
["5 - 7.5",23,null,null,null,18,20,14,19,15,14,20,16,9,17]
["7.5 - 10",63,null,null,null,19,17,12,19,9,19,12,19,9,16]
["10 - 12.5",65,null,null,null,3,20,15,11,9,12,20,18,2,19]
["12.5 - 15",94,null,null,null,3,19,13,20,12,20,12,15,7,18]
["15 - 17.5",62,null,null,null,15,9,10,17,16,18,15,14,10,17]
["17.5 - 20",102,null,null,null,{"$f":"RANDBETWEEN(F$1,F$2)","v":8},7,14,14,19,10,8,16,3,18]
[null,null,null,null,null,13,7,14,16,8,15,13,20,7,20]
[null,null,null,null,null,20,10,10,2,19,14,10,18,0,18]
[null,null,null,null,null,7,9,11,12,11,16,11,20,0,17]
[null,null,null,null,null,0,6,15,19,20,15,10,16,12,18]
[null,null,null,null,null,11,13,12,11,7,11,19,16,13,17]
[null,null,null,null,null,9,11,12,12,20,20,9,16,13,16]
[null,null,null,null,null,14,19,10,15,10,20,18,16,10,19]
[null,null,null,null,null,18,20,10,6,10,14,18,12,5,17]
[null,null,null,null,null,14,12,12,16,12,19,13,16,7,19]
[null,null,null,null,null,11,11,11,18,13,19,9,17,13,19]
[null,null,null,null,null,19,10,11,7,8,10,9,19,0,18]
[null,null,null,null,null,18,9,13,11,9,10,16,15,13,20]
[null,null,null,null,null,5,8,12,16,16,12,18,18,8,16]
[]
[]
[null,null,null,null,null,null,"Categories","Frequency"]
[null,null,null,null,null,null,"0 - 2.5",{"$f":"FREQUENCY($F$4:$O$47,{2.5;5;7.5;10;12.5;15;17.5;20})","v":16}]
[null,null,null,null,null,null,"2.5 - 5",15]
[null,null,null,null,null,null,"5 - 7.5",23]
[null,null,null,null,null,null,"7.5 - 10",63]
[null,null,null,null,null,null,"10 - 12.5",65]
[null,null,null,null,null,null,"12.5 - 15",94]
[null,null,null,null,null,null,"15 - 17.5",62]
[null,null,null,null,null,null,"17.5 - 20",102]
[]
[null,null,null,null,null,null,"Quiz1",{"$f":"AVERAGE(INDEX($F$4:$O$47,0,MATCH(A2,$F$3:$O$3,0)))","v":{"$error":"#N/A"}}]
[null,null,null,null,null,null,"Quiz2",{"$error":"#N/A"}]
[null,null,null,null,null,null,"Quiz3",{"$error":"#N/A"}]
[null,null,null,null,null,null,"Quiz4",{"$error":"#N/A"}]
[null,null,null,null,null,null,"Quiz5",{"$error":"#N/A"}]
[null,null,null,null,null,null,"Quiz6",{"$error":"#N/A"}]
[null,null,null,null,null,null,"Quiz7",{"$error":"#N/A"}]
[null,null,null,null,null,null,"Quiz8",{"$error":"#N/A"}]
[null,null,null,null,null,null,"Quiz9",{"$error":"#N/A"}]
[null,null,null,null,null,null,"Quiz10",{"$error":"#N/A"}]

{"sheet":"Paste Special","index":10,"n_rows":32,"n_cols":13,"rows_kept":32,"cut":false,"hidden":false,"merged":[]}
[null,"Acc","Busn","Chem","ComSc","English","Math","Nurse","Physics",null,"Grades"]
["Auburn",2,2.5299999999999998,2.8,2.4300000000000002,"",2.7,2.61,2.98,null,20,null,18.636363636363637]
["Highline",2.97,2.48,3.04,2.65,2.4700000000000002,"",2.73,2.68,null,26]
["Kent",2.94,2.89,"",3.07,2.54,2.78,"",2.87,null,15,null,18.636363636363637]
["Seattle",2.72,2.41,2.68,2.57,"",2.75,"",2.63,null,26]
[null,null,null,null,null,null,null,null,null,null,11,null,18.636363636363637]
[null,"Auburn","Highline","Kent","Seattle",null,null,null,null,null,18]
["Acc",3.14,2.97,2.94,2.72,null,null,null,null,null,18]
["Busn",2.5299999999999998,2.48,2.89,2.41,null,null,null,null,null,20]
["Chem",2.8,3.04,"",2.68,null,null,null,null,null,18]
["ComSc",2.4300000000000002,2.65,3.07,2.57,null,null,null,null,null,11]
["English","",2.4700000000000002,2.54,"",null,null,null,null,null,22]
["Math",2.7,"",2.78,2.75,null,null,null,null,null,{"$f":"AVERAGE(K2:K12)","v":18.636363636363637}]
["Nurse",2.61,2.73,"",""]
["Physics",2.98,2.68,2.87,2.63]
[]
[]
[]
[]
[]
[]
[]
[]
[null,"Auburn","Highline","Kent","Seattle"]
["Acc",2,2.97,2.94,2.72]
["Busn",2.5299999999999998,2.48,2.89,2.41]
["Chem",2.8,3.04,"",2.68]
["ComSc",2.4300000000000002,2.65,3.07,2.57]
["English","",2.4700000000000002,2.54,""]
["Math",2.7,"",2.78,2.75]
["Nurse",2.61,2.73,"",""]
["Physics",2.98,2.68,2.87,2.63]

{"sheet":"Print","index":11,"n_rows":5,"n_cols":12,"rows_kept":5,"cut":false,"hidden":false,"merged":[]}
[null,"Acc","Busn","Chem","ComSc","English","Math","Nurse","Physics","Biology","Art","History"]
["Auburn",3.14,2.5299999999999998,2.8,2.4300000000000002,"",2.7,2.61,2.98,2.88,3.61,3.43]
["Highline",2.97,2.48,3.04,2.65,2.4700000000000002,"",2.73,2.68,3.26,2.8,2.6]
["Kent",2.94,2.89,"",3.07,2.54,2.78,"",2.87,3.83,1.46,2.27]
["Seattle",2.72,2.41,2.68,2.57,"",2.75,"",2.63,3.64,3.5,3.61]

{"sheet":"Rank","index":12,"n_rows":15,"n_cols":5,"rows_kept":15,"cut":false,"hidden":false,"merged":[]}
["Quiz Scores","Student","RANK","RANK.AVE"]
[23,"student 1",{"$f":"RANK(A2,$A$2:$A$15,0)","v":11},{"$f":"_xlfn.RANK.AVG(A2,$A$2:$A$15,0)","v":11},{"$f":"_xlfn.RANK.EQ(A2,$A$2:$A$15,0)","v":11}]
[78,"student 2",{"$f":"RANK(A3,$A$2:$A$15,0)","v":3},{"$f":"_xlfn.RANK.AVG(A3,$A$2:$A$15,0)","v":3.5},{"$f":"_xlfn.RANK.EQ(A3,$A$2:$A$15,0)","v":3}]
[43,"student 3",9,9,9]
[57,"student 4",6,6.5,6]
[98,"student 5",1,1,1]
[86,"student 6",2,2,2]
[13,"student 7",13,13,13]
[10,"student 8",14,14,14]
[15,"student 9",12,12,12]
[46,"student 10",8,8,8]
[78,"student 11",3,3.5,3]
[59,"student 12",5,5,5]
[24,"student 13",10,10,10]
[57,"student 14",6,6.5,6]