{"text_format":"1","workbook":"xlsx","n_sheets":13,"sheets":["(989x)","(989xan)","(989)","(989an)","(990)","(990an)","(991)","(991an)","(992)","(992an)","(992large)","(993)","(993an)"],"not_rendered":{"charts":0,"images":0,"macros":0,"external_links":0,"defined_names":0,"comments":0,"pivot_tables":0},"unopened":[],"bounds":{"document_bytes":16777216,"sheet_cells":100000,"rows_first":2000,"rows_last":500,"rows_between":2000,"halvings":0,"cell_chars":16384,"cell_head_chars":4096},"cells_cut":0,"cells_raw":0,"read":"whole","date_system":"1900"}

{"sheet":"(989x)","index":0,"n_rows":27,"n_cols":35,"rows_kept":27,"cut":false,"hidden":true,"merged":[[15,1,15,10],[4,1,4,10],[4,12,4,21],[15,12,15,21]]}
["Learn Excel 2013 - \"100% Visualization in Excel\": Podcast #1652"]
["Bill Mr Excel Jelen"]
["Microsoft Excel Master: Sam Radakovitz",null,null,null,null,null,null,null,null,null,null,null,null,null,null,null,null,null,null,null,null,null,null,null,null,{"$f":"ROWS(B6:B$15)*10-COLUMNS(B6:$K6)+1","v":91},{"$f":"ROWS(C6:C$15)*10-COLUMNS(C6:$K6)+1","v":92},{"$f":"ROWS(D6:D$15)*10-COLUMNS(D6:$K6)+1","v":93},{"$f":"ROWS(E6:E$15)*10-COLUMNS(E6:$K6)+1","v":94},{"$f":"ROWS(F6:F$15)*10-COLUMNS(F6:$K6)+1","v":95},{"$f":"ROWS(G6:G$15)*10-COLUMNS(G6:$K6)+1","v":96},{"$f":"ROWS(H6:H$15)*10-COLUMNS(H6:$K6)+1","v":97},{"$f":"ROWS(I6:I$15)*10-COLUMNS(I6:$K6)+1","v":98},{"$f":"ROWS(J6:J$15)*10-COLUMNS(J6:$K6)+1","v":99},{"$f":"ROWS(K6:K$15)*10-COLUMNS(K6:$K6)+1","v":100}]
[null,null,null,null,null,null,null,null,null,null,null,null,null,null,null,null,null,null,null,null,null,null,null,null,null,{"$f":"ROWS(B7:B$15)*10-COLUMNS(B7:$K7)+1","v":81},{"$f":"ROWS(C7:C$15)*10-COLUMNS(C7:$K7)+1","v":82},{"$f":"ROWS(D7:D$15)*10-COLUMNS(D7:$K7)+1","v":83},{"$f":"ROWS(E7:E$15)*10-COLUMNS(E7:$K7)+1","v":84},{"$f":"ROWS(F7:F$15)*10-COLUMNS(F7:$K7)+1","v":85},{"$f":"ROWS(G7:G$15)*10-COLUMNS(G7:$K7)+1","v":86},{"$f":"ROWS(H7:H$15)*10-COLUMNS(H7:$K7)+1","v":87},{"$f":"ROWS(I7:I$15)*10-COLUMNS(I7:$K7)+1","v":88},{"$f":"ROWS(J7:J$15)*10-COLUMNS(J7:$K7)+1","v":89},{"$f":"ROWS(K7:K$15)*10-COLUMNS(K7:$K7)+1","v":90}]
[null,"Project 43",null,null,null,null,null,null,null,null,null,null,"Project 44",null,null,null,null,null,null,null,null,null,null,"List:",null,{"$f":"ROWS(B8:B$15)*10-COLUMNS(B8:$K8)+1","v":71},{"$f":"ROWS(C8:C$15)*10-COLUMNS(C8:$K8)+1","v":72},{"$f":"ROWS(D8:D$15)*10-COLUMNS(D8:$K8)+1","v":73},{"$f":"ROWS(E8:E$15)*10-COLUMNS(E8:$K8)+1","v":74},{"$f":"ROWS(F8:F$15)*10-COLUMNS(F8:$K8)+1","v":75},{"$f":"ROWS(G8:G$15)*10-COLUMNS(G8:$K8)+1","v":76},{"$f":"ROWS(H8:H$15)*10-COLUMNS(H8:$K8)+1","v":77},{"$f":"ROWS(I8:I$15)*10-COLUMNS(I8:$K8)+1","v":78},{"$f":"ROWS(J8:J$15)*10-COLUMNS(J8:$K8)+1","v":79},{"$f":"ROWS(K8:K$15)*10-COLUMNS(K8:$K8)+1","v":80}]
[null,null,null,null,null,null,null,null,null,null,null,null,null,null,null,null,null,null,null,null,null,null,null,"M 1",null,{"$f":"ROWS(B9:B$15)*10-COLUMNS(B9:$K9)+1","v":61},{"$f":"ROWS(C9:C$15)*10-COLUMNS(C9:$K9)+1","v":62},{"$f":"ROWS(D9:D$15)*10-COLUMNS(D9:$K9)+1","v":63},{"$f":"ROWS(E9:E$15)*10-COLUMNS(E9:$K9)+1","v":64},{"$f":"ROWS(F9:F$15)*10-COLUMNS(F9:$K9)+1","v":65},{"$f":"ROWS(G9:G$15)*10-COLUMNS(G9:$K9)+1","v":66},{"$f":"ROWS(H9:H$15)*10-COLUMNS(H9:$K9)+1","v":67},{"$f":"ROWS(I9:I$15)*10-COLUMNS(I9:$K9)+1","v":68},{"$f":"ROWS(J9:J$15)*10-COLUMNS(J9:$K9)+1","v":69},{"$f":"ROWS(K9:K$15)*10-COLUMNS(K9:$K9)+1","v":70}]
[null,null,null,null,null,null,null,null,null,null,null,null,null,null,null,null,null,null,null,null,null,null,null,"N2",null,{"$f":"ROWS(B10:B$15)*10-COLUMNS(B10:$K10)+1","v":51},{"$f":"ROWS(C10:C$15)*10-COLUMNS(C10:$K10)+1","v":52},{"$f":"ROWS(D10:D$15)*10-COLUMNS(D10:$K10)+1","v":53},{"$f":"ROWS(E10:E$15)*10-COLUMNS(E10:$K10)+1","v":54},{"$f":"ROWS(F10:F$15)*10-COLUMNS(F10:$K10)+1","v":55},{"$f":"ROWS(G10:G$15)*10-COLUMNS(G10:$K10)+1","v":56},{"$f":"ROWS(H10:H$15)*10-COLUMNS(H10:$K10)+1","v":57},{"$f":"ROWS(I10:I$15)*10-COLUMNS(I10:$K10)+1","v":58},{"$f":"ROWS(J10:J$15)*10-COLUMNS(J10:$K10)+1","v":59},{"$f":"ROWS(K10:K$15)*10-COLUMNS(K10:$K10)+1","v":60}]
[null,null,null,null,null,null,null,null,null,null,null,null,null,null,null,null,null,null,null,null,null,null,null,null,null,{"$f":"ROWS(B11:B$15)*10-COLUMNS(B11:$K11)+1","v":41},{"$f":"ROWS(C11:C$15)*10-COLUMNS(C11:$K11)+1","v":42},{"$f":"ROWS(D11:D$15)*10-COLUMNS(D11:$K11)+1","v":43},{"$f":"ROWS(E11:E$15)*10-COLUMNS(E11:$K11)+1","v":44},{"$f":"ROWS(F11:F$15)*10-COLUMNS(F11:$K11)+1","v":45},{"$f":"ROWS(G11:G$15)*10-COLUMNS(G11:$K11)+1","v":46},{"$f":"ROWS(H11:H$15)*10-COLUMNS(H11:$K11)+1","v":47},{"$f":"ROWS(I11:I$15)*10-COLUMNS(I11:$K11)+1","v":48},{"$f":"ROWS(J11:J$15)*10-COLUMNS(J11:$K11)+1","v":49},{"$f":"ROWS(K11:K$15)*10-COLUMNS(K11:$K11)+1","v":50}]
[null,null,null,null,null,null,null,null,null,null,null,null,null,null,null,null,null,null,null,null,null,null,null,null,null,{"$f":"ROWS(B12:B$15)*10-COLUMNS(B12:$K12)+1","v":31},{"$f":"ROWS(C12:C$15)*10-COLUMNS(C12:$K12)+1","v":32},{"$f":"ROWS(D12:D$15)*10-COLUMNS(D12:$K12)+1","v":33},{"$f":"ROWS(E12:E$15)*10-COLUMNS(E12:$K12)+1","v":34},{"$f":"ROWS(F12:F$15)*10-COLUMNS(F12:$K12)+1","v":35},{"$f":"ROWS(G12:G$15)*10-COLUMNS(G12:$K12)+1","v":36},{"$f":"ROWS(H12:H$15)*10-COLUMNS(H12:$K12)+1","v":37},{"$f":"ROWS(I12:I$15)*10-COLUMNS(I12:$K12)+1","v":38},{"$f":"ROWS(J12:J$15)*10-COLUMNS(J12:$K12)+1","v":39},{"$f":"ROWS(K12:K$15)*10-COLUMNS(K12:$K12)+1","v":40}]
[null,null,null,null,null,null,null,null,null,null,null,null,null,null,null,null,null,null,null,null,null,null,null,null,null,{"$f":"ROWS(B13:B$15)*10-COLUMNS(B13:$K13)+1","v":21},{"$f":"ROWS(C13:C$15)*10-COLUMNS(C13:$K13)+1","v":22},{"$f":"ROWS(D13:D$15)*10-COLUMNS(D13:$K13)+1","v":23},{"$f":"ROWS(E13:E$15)*10-COLUMNS(E13:$K13)+1","v":24},{"$f":"ROWS(F13:F$15)*10-COLUMNS(F13:$K13)+1","v":25},{"$f":"ROWS(G13:G$15)*10-COLUMNS(G13:$K13)+1","v":26},{"$f":"ROWS(H13:H$15)*10-COLUMNS(H13:$K13)+1","v":27},{"$f":"ROWS(I13:I$15)*10-COLUMNS(I13:$K13)+1","v":28},{"$f":"ROWS(J13:J$15)*10-COLUMNS(J13:$K13)+1","v":29},{"$f":"ROWS(K13:K$15)*10-COLUMNS(K13:$K13)+1","v":30}]
[null,null,null,null,null,null,null,null,null,null,null,null,null,null,null,null,null,null,null,null,null,null,null,null,null,{"$f":"ROWS(B14:B$15)*10-COLUMNS(B14:$K14)+1","v":11},{"$f":"ROWS(C14:C$15)*10-COLUMNS(C14:$K14)+1","v":12},{"$f":"ROWS(D14:D$15)*10-COLUMNS(D14:$K14)+1","v":13},{"$f":"ROWS(E14:E$15)*10-COLUMNS(E14:$K14)+1","v":14},{"$f":"ROWS(F14:F$15)*10-COLUMNS(F14:$K14)+1","v":15},{"$f":"ROWS(G14:G$15)*10-COLUMNS(G14:$K14)+1","v":16},{"$f":"ROWS(H14:H$15)*10-COLUMNS(H14:$K14)+1","v":17},{"$f":"ROWS(I14:I$15)*10-COLUMNS(I14:$K14)+1","v":18},{"$f":"ROWS(J14:J$15)*10-COLUMNS(J14:$K14)+1","v":19},{"$f":"ROWS(K14:K$15)*10-COLUMNS(K14:$K14)+1","v":20}]
[null,null,null,null,null,null,null,null,null,null,null,null,null,null,null,null,null,null,null,null,null,null,null,null,null,{"$f":"ROWS(B15:B$15)*10-COLUMNS(B15:$K15)+1","v":1},{"$f":"ROWS(C15:C$15)*10-COLUMNS(C15:$K15)+1","v":2},{"$f":"ROWS(D15:D$15)*10-COLUMNS(D15:$K15)+1","v":3},{"$f":"ROWS(E15:E$15)*10-COLUMNS(E15:$K15)+1","v":4},{"$f":"ROWS(F15:F$15)*10-COLUMNS(F15:$K15)+1","v":5},{"$f":"ROWS(G15:G$15)*10-COLUMNS(G15:$K15)+1","v":6},{"$f":"ROWS(H15:H$15)*10-COLUMNS(H15:$K15)+1","v":7},{"$f":"ROWS(I15:I$15)*10-COLUMNS(I15:$K15)+1","v":8},{"$f":"ROWS(J15:J$15)*10-COLUMNS(J15:$K15)+1","v":9},{"$f":"ROWS(K15:K$15)*10-COLUMNS(K15:$K15)+1","v":10}]
[]
[null,null,null,null,null,null,null,null,null,null,null,null,null,null,null,null,null,null,null,null,null,null,null,null,null,{"$f":"(ROWS(B6:B$15)*10-COLUMNS(B6:$K6)+1)/100","v":0.91},{"$f":"(ROWS(C6:C$15)*10-COLUMNS(C6:$K6)+1)/100","v":0.92},{"$f":"(ROWS(D6:D$15)*10-COLUMNS(D6:$K6)+1)/100","v":0.93},{"$f":"(ROWS(E6:E$15)*10-COLUMNS(E6:$K6)+1)/100","v":0.94},{"$f":"(ROWS(F6:F$15)*10-COLUMNS(F6:$K6)+1)/100","v":0.95},{"$f":"(ROWS(G6:G$15)*10-COLUMNS(G6:$K6)+1)/100","v":0.96},{"$f":"(ROWS(H6:H$15)*10-COLUMNS(H6:$K6)+1)/100","v":0.97},{"$f":"(ROWS(I6:I$15)*10-COLUMNS(I6:$K6)+1)/100","v":0.98},{"$f":"(ROWS(J6:J$15)*10-COLUMNS(J6:$K6)+1)/100","v":0.99},{"$f":"(ROWS(K6:K$15)*10-COLUMNS(K6:$K6)+1)/100","v":1}]
[null,null,null,null,null,null,null,null,null,null,null,null,null,null,null,null,null,null,null,null,null,null,null,null,null,{"$f":"(ROWS(B7:B$15)*10-COLUMNS(B7:$K7)+1)/100","v":0.81},{"$f":"(ROWS(C7:C$15)*10-COLUMNS(C7:$K7)+1)/100","v":0.82},{"$f":"(ROWS(D7:D$15)*10-COLUMNS(D7:$K7)+1)/100","v":0.83},{"$f":"(ROWS(E7:E$15)*10-COLUMNS(E7:$K7)+1)/100","v":0.84},{"$f":"(ROWS(F7:F$15)*10-COLUMNS(F7:$K7)+1)/100","v":0.85},{"$f":"(ROWS(G7:G$15)*10-COLUMNS(G7:$K7)+1)/100","v":0.86},{"$f":"(ROWS(H7:H$15)*10-COLUMNS(H7:$K7)+1)/100","v":0.87},{"$f":"(ROWS(I7:I$15)*10-COLUMNS(I7:$K7)+1)/100","v":0.88},{"$f":"(ROWS(J7:J$15)*10-COLUMNS(J7:$K7)+1)/100","v":0.89},{"$f":"(ROWS(K7:K$15)*10-COLUMNS(K7:$K7)+1)/100","v":0.9}]
[null,{"$f":"RANDBETWEEN(1,100)/100","v":0.3},null,null,null,null,null,null,null,null,null,null,{"$f":"COUNTA(X6:X37)/ROWS(X6:X37)","v":6.25E-2},null,null,null,null,null,null,null,null,null,null,null,null,{"$f":"(ROWS(B8:B$15)*10-COLUMNS(B8:$K8)+1)/100","v":0.71},{"$f":"(ROWS(C8:C$15)*10-COLUMNS(C8:$K8)+1)/100","v":0.72},{"$f":"(ROWS(D8:D$15)*10-COLUMNS(D8:$K8)+1)/100","v":0.73},{"$f":"(ROWS(E8:E$15)*10-COLUMNS(E8:$K8)+1)/100","v":0.74},{"$f":"(ROWS(F8:F$15)*10-COLUMNS(F8:$K8)+1)/100","v":0.75},{"$f":"(ROWS(G8:G$15)*10-COLUMNS(G8:$K8)+1)/100","v":0.76},{"$f":"(ROWS(H8:H$15)*10-COLUMNS(H8:$K8)+1)/100","v":0.77},{"$f":"(ROWS(I8:I$15)*10-COLUMNS(I8:$K8)+1)/100","v":0.78},{"$f":"(ROWS(J8:J$15)*10-COLUMNS(J8:$K8)+1)/100","v":0.79},{"$f":"(ROWS(K8:K$15)*10-COLUMNS(K8:$K8)+1)/100","v":0.8}]
[null,null,null,null,null,null,null,null,null,null,null,null,null,null,null,null,null,null,null,null,null,null,null,null,null,{"$f":"(ROWS(B9:B$15)*10-COLUMNS(B9:$K9)+1)/100","v":0.61},{"$f":"(ROWS(C9:C$15)*10-COLUMNS(C9:$K9)+1)/100","v":0.62},{"$f":"(ROWS(D9:D$15)*10-COLUMNS(D9:$K9)+1)/100","v":0.63},{"$f":"(ROWS(E9:E$15)*10-COLUMNS(E9:$K9)+1)/100","v":0.64},{"$f":"(ROWS(F9:F$15)*10-COLUMNS(F9:$K9)+1)/100","v":0.65},{"$f":"(ROWS(G9:G$15)*10-COLUMNS(G9:$K9)+1)/100","v":0.66},{"$f":"(ROWS(H9:H$15)*10-COLUMNS(H9:$K9)+1)/100","v":0.67},{"$f":"(ROWS(I9:I$15)*10-COLUMNS(I9:$K9)+1)/100","v":0.68},{"$f":"(ROWS(J9:J$15)*10-COLUMNS(J9:$K9)+1)/100","v":0.69},{"$f":"(ROWS(K9:K$15)*10-COLUMNS(K9:$K9)+1)/100","v":0.7}]
[null,{"$f":"ROWS(B6:B$15)*10","v":100},{"$f":"ROWS(C6:C$15)*10","v":100},{"$f":"ROWS(D6:D$15)*10","v":100},{"$f":"ROWS(E6:E$15)*10","v":100},{"$f":"ROWS(F6:F$15)*10","v":100},{"$f":"ROWS(G6:G$15)*10","v":100},{"$f":"ROWS(H6:H$15)*10","v":100},{"$f":"ROWS(I6:I$15)*10","v":100},{"$f":"ROWS(J6:J$15)*10","v":100},{"$f":"ROWS(K6:K$15)*10","v":100},null,null,null,null,null,null,null,null,null,null,null,null,null,null,{"$f":"(ROWS(B10:B$15)*10-COLUMNS(B10:$K10)+1)/100","v":0.51},{"$f":"(ROWS(C10:C$15)*10-COLUMNS(C10:$K10)+1)/100","v":0.52},{"$f":"(ROWS(D10:D$15)*10-COLUMNS(D10:$K10)+1)/100","v":0.53},{"$f":"(ROWS(E10:E$15)*10-COLUMNS(E10:$K10)+1)/100","v":0.54},{"$f":"(ROWS(F10:F$15)*10-COLUMNS(F10:$K10)+1)/100","v":0.55000000000000004},{"$f":"(ROWS(G10:G$15)*10-COLUMNS(G10:$K10)+1)/100","v":0.56000000000000005},{"$f":"(ROWS(H10:H$15)*10-COLUMNS(H10:$K10)+1)/100","v":0.56999999999999995},{"$f":"(ROWS(I10:I$15)*10-COLUMNS(I10:$K10)+1)/100","v":0.57999999999999996},{"$f":"(ROWS(J10:J$15)*10-COLUMNS(J10:$K10)+1)/100","v":0.59},{"$f":"(ROWS(K10:K$15)*10-COLUMNS(K10:$K10)+1)/100","v":0.6}]
[null,{"$f":"ROWS(B7:B$15)*10","v":90},{"$f":"ROWS(C7:C$15)*10","v":90},{"$f":"ROWS(D7:D$15)*10","v":90},{"$f":"ROWS(E7:E$15)*10","v":90},{"$f":"ROWS(F7:F$15)*10","v":90},{"$f":"ROWS(G7:G$15)*10","v":90},{"$f":"ROWS(H7:H$15)*10","v":90},{"$f":"ROWS(I7:I$15)*10","v":90},{"$f":"ROWS(J7:J$15)*10","v":90},{"$f":"ROWS(K7:K$15)*10","v":90},null,null,null,null,null,null,null,null,null,null,null,null,null,null,{"$f":"(ROWS(B11:B$15)*10-COLUMNS(B11:$K11)+1)/100","v":0.41},{"$f":"(ROWS(C11:C$15)*10-COLUMNS(C11:$K11)+1)/100","v":0.42},{"$f":"(ROWS(D11:D$15)*10-COLUMNS(D11:$K11)+1)/100","v":0.43},{"$f":"(ROWS(E11:E$15)*10-COLUMNS(E11:$K11)+1)/100","v":0.44},{"$f":"(ROWS(F11:F$15)*10-COLUMNS(F11:$K11)+1)/100","v":0.45},{"$f":"(ROWS(G11:G$15)*10-COLUMNS(G11:$K11)+1)/100","v":0.46},{"$f":"(ROWS(H11:H$15)*10-COLUMNS(H11:$K11)+1)/100","v":0.47},{"$f":"(ROWS(I11:I$15)*10-COLUMNS(I11:$K11)+1)/100","v":0.48},{"$f":"(ROWS(J11:J$15)*10-COLUMNS(J11:$K11)+1)/100","v":0.49},{"$f":"(ROWS(K11:K$15)*10-COLUMNS(K11:$K11)+1)/100","v":0.5}]
[null,{"$f":"ROWS(B8:B$15)*10","v":80},{"$f":"ROWS(C8:C$15)*10","v":80},{"$f":"ROWS(D8:D$15)*10","v":80},{"$f":"ROWS(E8:E$15)*10","v":80},{"$f":"ROWS(F8:F$15)*10","v":80},{"$f":"ROWS(G8:G$15)*10","v":80},{"$f":"ROWS(H8:H$15)*10","v":80},{"$f":"ROWS(I8:I$15)*10","v":80},{"$f":"ROWS(J8:J$15)*10","v":80},{"$f":"ROWS(K8:K$15)*10","v":80},null,null,null,null,null,null,null,null,null,null,null,null,null,null,{"$f":"(ROWS(B12:B$15)*10-COLUMNS(B12:$K12)+1)/100","v":0.31},{"$f":"(ROWS(C12:C$15)*10-COLUMNS(C12:$K12)+1)/100","v":0.32},{"$f":"(ROWS(D12:D$15)*10-COLUMNS(D12:$K12)+1)/100","v":0.33},{"$f":"(ROWS(E12:E$15)*10-COLUMNS(E12:$K12)+1)/100","v":0.34},{"$f":"(ROWS(F12:F$15)*10-COLUMNS(F12:$K12)+1)/100","v":0.35},{"$f":"(ROWS(G12:G$15)*10-COLUMNS(G12:$K12)+1)/100","v":0.36},{"$f":"(ROWS(H12:H$15)*10-COLUMNS(H12:$K12)+1)/100","v":0.37},{"$f":"(ROWS(I12:I$15)*10-COLUMNS(I12:$K12)+1)/100","v":0.38},{"$f":"(ROWS(J12:J$15)*10-COLUMNS(J12:$K12)+1)/100","v":0.39},{"$f":"(ROWS(K12:K$15)*10-COLUMNS(K12:$K12)+1)/100","v":0.4}]
[null,{"$f":"ROWS(B9:B$15)*10","v":70},{"$f":"ROWS(C9:C$15)*10","v":70},{"$f":"ROWS(D9:D$15)*10","v":70},{"$f":"ROWS(E9:E$15)*10","v":70},{"$f":"ROWS(F9:F$15)*10","v":70},{"$f":"ROWS(G9:G$15)*10","v":70},{"$f":"ROWS(H9:H$15)*10","v":70},{"$f":"ROWS(I9:I$15)*10","v":70},{"$f":"ROWS(J9:J$15)*10","v":70},{"$f":"ROWS(K9:K$15)*10","v":70},null,null,null,null,null,null,null,null,null,null,null,null,null,null,{"$f":"(ROWS(B13:B$15)*10-COLUMNS(B13:$K13)+1)/100","v":0.21},{"$f":"(ROWS(C13:C$15)*10-COLUMNS(C13:$K13)+1)/100","v":0.22},{"$f":"(ROWS(D13:D$15)*10-COLUMNS(D13:$K13)+1)/100","v":0.23},{"$f":"(ROWS(E13:E$15)*10-COLUMNS(E13:$K13)+1)/100","v":0.24},{"$f":"(ROWS(F13:F$15)*10-COLUMNS(F13:$K13)+1)/100","v":0.25},{"$f":"(ROWS(G13:G$15)*10-COLUMNS(G13:$K13)+1)/100","v":0.26},{"$f":"(ROWS(H13:H$15)*10-COLUMNS(H13:$K13)+1)/100","v":0.27},{"$f":"(ROWS(I13:I$15)*10-COLUMNS(I13:$K13)+1)/100","v":0.28000000000000003},{"$f":"(ROWS(J13:J$15)*10-COLUMNS(J13:$K13)+1)/100","v":0.28999999999999998},{"$f":"(ROWS(K13:K$15)*10-COLUMNS(K13:$K13)+1)/100","v":0.3}]
[null,{"$f":"ROWS(B10:B$15)*10","v":60},{"$f":"ROWS(C10:C$15)*10","v":60},{"$f":"ROWS(D10:D$15)*10","v":60},{"$f":"ROWS(E10:E$15)*10","v":60},{"$f":"ROWS(F10:F$15)*10","v":60},{"$f":"ROWS(G10:G$15)*10","v":60},{"$f":"ROWS(H10:H$15)*10","v":60},{"$f":"ROWS(I10:I$15)*10","v":60},{"$f":"ROWS(J10:J$15)*10","v":60},{"$f":"ROWS(K10:K$15)*10","v":60},null,null,null,null,null,null,null,null,null,null,null,null,null,null,{"$f":"(ROWS(B14:B$15)*10-COLUMNS(B14:$K14)+1)/100","v":0.11},{"$f":"(ROWS(C14:C$15)*10-COLUMNS(C14:$K14)+1)/100","v":0.12},{"$f":"(ROWS(D14:D$15)*10-COLUMNS(D14:$K14)+1)/100","v":0.13},{"$f":"(ROWS(E14:E$15)*10-COLUMNS(E14:$K14)+1)/100","v":0.14000000000000001},{"$f":"(ROWS(F14:F$15)*10-COLUMNS(F14:$K14)+1)/100","v":0.15},{"$f":"(ROWS(G14:G$15)*10-COLUMNS(G14:$K14)+1)/100","v":0.16},{"$f":"(ROWS(H14:H$15)*10-COLUMNS(H14:$K14)+1)/100","v":0.17},{"$f":"(ROWS(I14:I$15)*10-COLUMNS(I14:$K14)+1)/100","v":0.18},{"$f":"(ROWS(J14:J$15)*10-COLUMNS(J14:$K14)+1)/100","v":0.19},{"$f":"(ROWS(K14:K$15)*10-COLUMNS(K14:$K14)+1)/100","v":0.2}]
[null,{"$f":"ROWS(B11:B$15)*10","v":50},{"$f":"ROWS(C11:C$15)*10","v":50},{"$f":"ROWS(D11:D$15)*10","v":50},{"$f":"ROWS(E11:E$15)*10","v":50},{"$f":"ROWS(F11:F$15)*10","v":50},{"$f":"ROWS(G11:G$15)*10","v":50},{"$f":"ROWS(H11:H$15)*10","v":50},{"$f":"ROWS(I11:I$15)*10","v":50},{"$f":"ROWS(J11:J$15)*10","v":50},{"$f":"ROWS(K11:K$15)*10","v":50},null,null,null,null,null,null,null,null,null,null,null,null,null,null,{"$f":"(ROWS(B15:B$15)*10-COLUMNS(B15:$K15)+1)/100","v":0.01},{"$f":"(ROWS(C15:C$15)*10-COLUMNS(C15:$K15)+1)/100","v":0.02},{"$f":"(ROWS(D15:D$15)*10-COLUMNS(D15:$K15)+1)/100","v":0.03},{"$f":"(ROWS(E15:E$15)*10-COLUMNS(E15:$K15)+1)/100","v":0.04},{"$f":"(ROWS(F15:F$15)*10-COLUMNS(F15:$K15)+1)/100","v":0.05},{"$f":"(ROWS(G15:G$15)*10-COLUMNS(G15:$K15)+1)/100","v":0.06},{"$f":"(ROWS(H15:H$15)*10-COLUMNS(H15:$K15)+1)/100","v":7.0000000000000007E-2},{"$f":"(ROWS(I15:I$15)*10-COLUMNS(I15:$K15)+1)/100","v":0.08},{"$f":"(ROWS(J15:J$15)*10-COLUMNS(J15:$K15)+1)/100","v":0.09},{"$f":"(ROWS(K15:K$15)*10-COLUMNS(K15:$K15)+1)/100","v":0.1}]
[null,{"$f":"ROWS(B12:B$15)*10","v":40},{"$f":"ROWS(C12:C$15)*10","v":40},{"$f":"ROWS(D12:D$15)*10","v":40},{"$f":"ROWS(E12:E$15)*10","v":40},{"$f":"ROWS(F12:F$15)*10","v":40},{"$f":"ROWS(G12:G$15)*10","v":40},{"$f":"ROWS(H12:H$15)*10","v":40},{"$f":"ROWS(I12:I$15)*10","v":40},{"$f":"ROWS(J12:J$15)*10","v":40},{"$f":"ROWS(K12:K$15)*10","v":40}]
[null,{"$f":"ROWS(B13:B$15)*10","v":30},{"$f":"ROWS(C13:C$15)*10","v":30},{"$f":"ROWS(D13:D$15)*10","v":30},{"$f":"ROWS(E13:E$15)*10","v":30},{"$f":"ROWS(F13:F$15)*10","v":30},{"$f":"ROWS(G13:G$15)*10","v":30},{"$f":"ROWS(H13:H$15)*10","v":30},{"$f":"ROWS(I13:I$15)*10","v":30},{"$f":"ROWS(J13:J$15)*10","v":30},{"$f":"ROWS(K13:K$15)*10","v":30}]
[null,{"$f":"ROWS(B14:B$15)*10","v":20},{"$f":"ROWS(C14:C$15)*10","v":20},{"$f":"ROWS(D14:D$15)*10","v":20},{"$f":"ROWS(E14:E$15)*10","v":20},{"$f":"ROWS(F14:F$15)*10","v":20},{"$f":"ROWS(G14:G$15)*10","v":20},{"$f":"ROWS(H14:H$15)*10","v":20},{"$f":"ROWS(I14:I$15)*10","v":20},{"$f":"ROWS(J14:J$15)*10","v":20},{"$f":"ROWS(K14:K$15)*10","v":20}]
[null,{"$f":"ROWS(B15:B$15)*10","v":10},{"$f":"ROWS(C15:C$15)*10","v":10},{"$f":"ROWS(D15:D$15)*10","v":10},{"$f":"ROWS(E15:E$15)*10","v":10},{"$f":"ROWS(F15:F$15)*10","v":10},{"$f":"ROWS(G15:G$15)*10","v":10},{"$f":"ROWS(H15:H$15)*10","v":10},{"$f":"ROWS(I15:I$15)*10","v":10},{"$f":"ROWS(J15:J$15)*10","v":10},{"$f":"ROWS(K15:K$15)*10","v":10}]

{"sheet":"(989xan)","index":1,"n_rows":16,"n_cols":24,"rows_kept":16,"cut":false,"hidden":true,"merged":[[4,1,4,10],[15,1,15,10],[4,12,4,21],[15,12,15,21]]}
["Learn Excel 2013 - \"100% Visualization in Excel\": Podcast #1652"]
["Bill Mr Excel Jelen"]
["Microsoft Excel Master: Sam Radakovitz"]
[]
[null,"Project 43",null,null,null,null,null,null,null,null,null,null,"Project 44",null,null,null,null,null,null,null,null,null,null,"List:"]
[null,null,null,null,null,null,null,null,null,null,null,null,null,null,null,null,null,null,null,null,null,null,null,"M 1"]
[null,null,null,null,null,null,null,null,null,null,null,null,null,null,null,null,null,null,null,null,null,null,null,"N2"]
[null,null,null,null,null,null,null,null,null,null,null,null,null,null,null,null,null,null,null,null,null,null,null,"sdasda"]
[null,null,null,null,null,null,null,null,null,null,null,null,null,null,null,null,null,null,null,null,null,null,null,"asdsad"]
[null,null,null,null,null,null,null,null,null,null,null,null,null,null,null,null,null,null,null,null,null,null,null,"asdas"]
[null,null,null,null,null,null,null,null,null,null,null,null,null,null,null,null,null,null,null,null,null,null,null,"asdasd"]
[null,null,null,null,null,null,null,null,null,null,null,null,null,null,null,null,null,null,null,null,null,null,null,"sddfsad"]
[null,null,null,null,null,null,null,null,null,null,null,null,null,null,null,null,null,null,null,null,null,null,null,"sdf"]
[]
[]
[null,{"$f":"RANDBETWEEN(1,100)/100","v":0.49},null,null,null,null,null,null,null,null,null,null,{"$f":"COUNTA(X6:X37)/ROWS(X6:X37)","v":0.25}]

{"sheet":"(989)","index":2,"n_rows":18,"n_cols":7,"rows_kept":18,"cut":false,"hidden":false,"merged":[]}
["Jan","Feb","Mar","Apr","May","Jun","Jul"]
[21,192,70,69,119,102,153]
[100,162,163,64,183,105,25]
[188,167,9,119,168,87,99]
[178,179,91,154,177,12,83]
[119,151,58,161,68,111,59]
[37,64,199,107,99,191,174]
[111,101,146,120,61,172,61]
[37,144,71,149,81,130,163]
[59,97,128,14,199,1,119]
[105,162,196,115,157,125,109]
[190,20,53,79,128,133,146]
[169,51,17,65,97,3,169]
[]
["Goal: Highlight Numbers above 90 percentile mark."]
["Videos about Percentile and percentile rank:"]
["Excel 2010 Statistics #26: Location: Mean, Median, Mode, Percentile, Quartile, PercentileRank "]
["Excel 2010 Statistics #27: Excel 2010 Functions for Percentile, Quartile and Rank "]

{"sheet":"(989an)","index":3,"n_rows":18,"n_cols":15,"rows_kept":18,"cut":false,"hidden":false,"merged":[]}
["Jan","Feb","Mar","Apr","May","Jun","Jul"]
[21,192,70,69,119,102,153,null,{"$f":"_xlfn.PERCENTRANK.INC($A$2:$G$13,A2)>0.9","v":false},true,false,false,false,false,false]
[100,162,163,64,183,105,25,null,{"$f":"_xlfn.PERCENTRANK.INC($A$2:$G$13,A3)>0.9","v":false},false,false,false,true,false,false]
[188,167,9,119,168,87,99,null,true,false,false,false,false,false,false]
[178,179,91,154,177,12,83,null,false,true,false,false,false,false,false]
[119,151,58,161,68,111,59,null,false,false,false,false,false,false,false]
[37,64,199,107,99,191,174,null,false,false,true,false,false,true,false]
[111,101,146,120,61,172,61,null,false,false,false,false,false,false,false]
[37,144,71,149,81,130,163,null,false,false,false,false,false,false,false]
[59,97,128,14,199,1,119,null,false,false,false,false,true,false,false]
[105,162,196,115,157,125,109,null,false,false,true,false,false,false,false]
[190,20,53,79,128,133,146,null,true,false,false,false,false,false,false]
[169,51,17,65,97,3,169,null,false,false,false,false,false,false,false]
[]
["Goal: Highlight Numbers above 90 percentile mark."]
["Videos about Percentile and percentile rank:"]
["Excel 2010 Statistics #26: Location: Mean, Median, Mode, Percentile, Quartile, PercentileRank "]
["Excel 2010 Statistics #27: Excel 2010 Functions for Percentile, Quartile and Rank "]

{"sheet":"(990)","index":4,"n_rows":29,"n_cols":15,"rows_kept":29,"cut":false,"hidden":false,"merged":[]}
["Product","ID",null,"Products","Gel Boom ID?","2003 or before",null,null,null,null,null,null,null,null,"ID"]
["Bellen","Be_RW-V23-7543",null,"Deuce",null,null,null,null,null,null,null,null,null,null,{"$f":"LEFT(N2,2)&\"_\"&CHAR(RANDBETWEEN(65,65+25))&CHAR(RANDBETWEEN(65,65+25))&\"-\"&CHAR(RANDBETWEEN(65,65+25))&RANDBETWEEN(10,99)&\"-\"&RANDBETWEEN(100,9999)","v":"_RN-Y45-1801"}]
["Deuce","De_OS-L70-4558",null,"Doublers"]
["Doublers",null,null,"Yanaki"]
["FastCatch",null,null,"Tri Fly"]
["Flattop","Fl_RH-A91-9922",null,"Bellen"]
["GelFast","Ge_ZX-C97-2074",null,"Icarus"]
["Icarus"]
["Majestic Beaut","Ma_VE-D11-4946"]
["Quad","Qu_VN-C46-8816"]
["Sunbell","Su_UT-P60-1350"]
["Sunset","Su_KD-Q95-4147"]
["Sunshine","Su_BR-W98-4402"]
["Sunspot"]
[]
["Product","ID",null,"Products","Gel Boom ID?","2003 or before"]
["Bellen","Be_RW-V23-7543",null,"Deuce"]
["Deuce","De_OS-L70-4558",null,"Doublers"]
["Doublers","No ID",null,"Yanaki"]
["FastCatch","No ID",null,"Tri Fly"]
["Flattop","Fl_RH-A91-9922",null,"Bellen"]
["GelFast","Ge_ZX-C97-2074",null,"Icarus"]
["Icarus","No ID"]
["Majestic Beaut","Ma_VE-D11-4946",null,"F5 = Go To, Special, Blanks"]
["Quad","Qu_VN-C46-8816",null,"Type, Ctrl + Enter"]
["Sunbell","Su_UT-P60-1350"]
["Sunset","Su_KD-Q95-4147"]
["Sunshine","Su_BR-W98-4402"]
["Sunspot","No ID"]

{"sheet":"(990an)","index":5,"n_rows":29,"n_cols":15,"rows_kept":29,"cut":false,"hidden":false,"merged":[]}
["Product","ID",null,"Products","Gel Boom ID?","2003 or before",null,null,null,null,null,null,null,null,"ID"]
["Bellen","Be_RW-V23-7543",null,"Deuce",{"$f":"IFERROR(IF(VLOOKUP(D2,$A$2:$B$14,2,0)=0,\"No ID\",VLOOKUP(D2,$A$2:$B$14,2,0)),\"Not In List\")","v":"De_OS-L70-4558"},{"$f":"IF(ISNA(VLOOKUP(D2,$A$2:$B$14,2,0)),\"Not In List\",IF(VLOOKUP(D2,$A$2:$B$14,2,0)=0,\"No ID\",VLOOKUP(D2,$A$2:$B$14,2,0)))","v":"De_OS-L70-4558"},null,null,null,null,null,null,null,null,{"$f":"LEFT(N2,2)&\"_\"&CHAR(RANDBETWEEN(65,65+25))&CHAR(RANDBETWEEN(65,65+25))&\"-\"&CHAR(RANDBETWEEN(65,65+25))&RANDBETWEEN(10,99)&\"-\"&RANDBETWEEN(100,9999)","v":"_QA-S18-5676"}]
["Deuce","De_OS-L70-4558",null,"Doublers",{"$f":"IFERROR(IF(VLOOKUP(D3,$A$2:$B$14,2,0)=0,\"No ID\",VLOOKUP(D3,$A$2:$B$14,2,0)),\"Not In List\")","v":"No ID"},{"$f":"IF(ISNA(VLOOKUP(D3,$A$2:$B$14,2,0)),\"Not In List\",IF(VLOOKUP(D3,$A$2:$B$14,2,0)=0,\"No ID\",VLOOKUP(D3,$A$2:$B$14,2,0)))","v":"No ID"}]
["Doublers",null,null,"Yanaki","Not In List","Not In List"]
["FastCatch",null,null,"Tri Fly","Not In List","Not In List"]
["Flattop","Fl_RH-A91-9922",null,"Bellen","Be_RW-V23-7543","Be_RW-V23-7543"]
["GelFast","Ge_ZX-C97-2074",null,"Icarus","No ID","No ID"]
["Icarus"]
["Majestic Beaut","Ma_VE-D11-4946"]
["Quad","Qu_VN-C46-8816"]
["Sunbell","Su_UT-P60-1350"]
["Sunset","Su_KD-Q95-4147"]
["Sunshine","Su_BR-W98-4402"]
["Sunspot"]
[]
["Product","ID",null,"Products","Gel Boom ID?","2003 or before"]
["Bellen","Be_RW-V23-7543",null,"Deuce",{"$f":"IFERROR(VLOOKUP(D17,$A$17:$B$29,2,0),\"Not In List\")","v":"De_OS-L70-4558"},{"$f":"IF(ISNA(VLOOKUP(D17,$A$17:$B$29,2,0)),\"Not In List\",VLOOKUP(D17,$A$17:$B$29,2,0))","v":"De_OS-L70-4558"}]
["Deuce","De_OS-L70-4558",null,"Doublers","No ID",{"$f":"IF(ISNA(VLOOKUP(D18,$A$17:$B$29,2,0)),\"Not In List\",VLOOKUP(D18,$A$17:$B$29,2,0))","v":"No ID"}]
["Doublers","No ID",null,"Yanaki","Not In List","Not In List"]
["FastCatch","No ID",null,"Tri Fly","Not In List","Not In List"]
["Flattop","Fl_RH-A91-9922",null,"Bellen","Be_RW-V23-7543","Be_RW-V23-7543"]
["GelFast","Ge_ZX-C97-2074",null,"Icarus","No ID","No ID"]
["Icarus","No ID"]
["Majestic Beaut","Ma_VE-D11-4946",null,"F5 = Go To, Special, Blanks"]
["Quad","Qu_VN-C46-8816",null,"Type, Ctrl + Enter"]
["Sunbell","Su_UT-P60-1350"]
["Sunset","Su_KD-Q95-4147"]
["Sunshine","Su_BR-W98-4402"]
["Sunspot","No ID"]

{"sheet":"(991)","index":6,"n_rows":20,"n_cols":7,"rows_kept":20,"cut":false,"hidden":false,"merged":[]}
[null,null,"Same number",null,"Cycle through"]
[null,null,"repeated, then repeat",null,"sequence then repeat,"]
[null,null,"next in sequence, use",null,"use MOD to get"]
[null,null,"Division & CEILING.",null,"remainder. "]
[null,null," Like: 1,1,1,1,2,2,2,2",null,"Like: 1,2,3,4,1,2,3,4"]
[null,"Goal:","CEILING","Goal:","MOD","Goal:","All together"]
[null,1,null,1,null,1.1000000000000001]
[null,1,null,2,null,1.2]
[null,1,null,3,null,1.3]
[null,1,null,4,null,1.4]
[null,1,null,5,null,1.5]
[null,2,null,1,null,2.1]
[null,2,null,2,null,2.2000000000000002]
[null,2,null,3,null,2.2999999999999998]
[null,2,null,4,null,2.4]
[null,2,null,5,null,2.5]
[]
["Other videos about Incrementing Numbers or creating Sequential Numbers:"]
["Excel Incrementing (Sequential) Numbers In Formulas"]
["http://www.youtube.com/course?list=ECrRPvpgDmw0matjr9DLpc14DJn2OqNgYj"]

{"sheet":"(991an)","index":7,"n_rows":61,"n_cols":8,"rows_kept":61,"cut":false,"hidden":false,"merged":[]}
[null,null,"Same number",null,"Cycle through"]
[null,null,"repeated, then repeat",null,"sequence then repeat,"]
[null,null,"next in sequence, use",null,"use MOD to get"]
[null,null,"Division & CEILING.",null,"remainder. "]
[null,null," Like: 1,1,1,1,2,2,2,2",null,"Like: 1,2,3,4,1,2,3,4"]
[null,"Goal:","CEILING","Goal:","MOD","Goal:","All together"]
[null,1,{"$f":"CEILING(ROWS(C$7:C7)/5,1)","v":1},1,{"$f":"MOD(ROWS(E$7:E7)-1,5)+1","v":1},1.1000000000000001,{"$f":"CEILING(ROWS(G$7:G7)/5,1)&\".\"&MOD(ROWS(G$7:G7)-1,5)+1","v":"1.1"},{"$f":"(CEILING(ROWS(H$7:H7)/5,1)&\".\"&MOD(ROWS(H$7:H7)-1,5)+1)+0","v":1.1000000000000001}]
[null,1,{"$f":"CEILING(ROWS(C$7:C8)/5,1)","v":1},2,{"$f":"MOD(ROWS(E$7:E8)-1,5)+1","v":2},1.2,{"$f":"CEILING(ROWS(G$7:G8)/5,1)&\".\"&MOD(ROWS(G$7:G8)-1,5)+1","v":"1.2"},{"$f":"(CEILING(ROWS(H$7:H8)/5,1)&\".\"&MOD(ROWS(H$7:H8)-1,5)+1)+0","v":1.2}]
[null,1,{"$f":"CEILING(ROWS(C$7:C9)/5,1)","v":1},3,{"$f":"MOD(ROWS(E$7:E9)-1,5)+1","v":3},1.3,{"$f":"CEILING(ROWS(G$7:G9)/5,1)&\".\"&MOD(ROWS(G$7:G9)-1,5)+1","v":"1.3"},{"$f":"(CEILING(ROWS(H$7:H9)/5,1)&\".\"&MOD(ROWS(H$7:H9)-1,5)+1)+0","v":1.3}]
[null,1,{"$f":"CEILING(ROWS(C$7:C10)/5,1)","v":1},4,{"$f":"MOD(ROWS(E$7:E10)-1,5)+1","v":4},1.4,{"$f":"CEILING(ROWS(G$7:G10)/5,1)&\".\"&MOD(ROWS(G$7:G10)-1,5)+1","v":"1.4"},{"$f":"(CEILING(ROWS(H$7:H10)/5,1)&\".\"&MOD(ROWS(H$7:H10)-1,5)+1)+0","v":1.4}]
[null,1,{"$f":"CEILING(ROWS(C$7:C11)/5,1)","v":1},5,{"$f":"MOD(ROWS(E$7:E11)-1,5)+1","v":5},1.5,{"$f":"CEILING(ROWS(G$7:G11)/5,1)&\".\"&MOD(ROWS(G$7:G11)-1,5)+1","v":"1.5"},{"$f":"(CEILING(ROWS(H$7:H11)/5,1)&\".\"&MOD(ROWS(H$7:H11)-1,5)+1)+0","v":1.5}]
[null,2,{"$f":"CEILING(ROWS(C$7:C12)/5,1)","v":2},1,{"$f":"MOD(ROWS(E$7:E12)-1,5)+1","v":1},2.1,{"$f":"CEILING(ROWS(G$7:G12)/5,1)&\".\"&MOD(ROWS(G$7:G12)-1,5)+1","v":"2.1"},{"$f":"(CEILING(ROWS(H$7:H12)/5,1)&\".\"&MOD(ROWS(H$7:H12)-1,5)+1)+0","v":2.1}]
[null,2,{"$f":"CEILING(ROWS(C$7:C13)/5,1)","v":2},2,{"$f":"MOD(ROWS(E$7:E13)-1,5)+1","v":2},2.2000000000000002,{"$f":"CEILING(ROWS(G$7:G13)/5,1)&\".\"&MOD(ROWS(G$7:G13)-1,5)+1","v":"2.2"},{"$f":"(CEILING(ROWS(H$7:H13)/5,1)&\".\"&MOD(ROWS(H$7:H13)-1,5)+1)+0","v":2.2000000000000002}]
[null,2,{"$f":"CEILING(ROWS(C$7:C14)/5,1)","v":2},3,{"$f":"MOD(ROWS(E$7:E14)-1,5)+1","v":3},2.2999999999999998,{"$f":"CEILING(ROWS(G$7:G14)/5,1)&\".\"&MOD(ROWS(G$7:G14)-1,5)+1","v":"2.3"},{"$f":"(CEILING(ROWS(H$7:H14)/5,1)&\".\"&MOD(ROWS(H$7:H14)-1,5)+1)+0","v":2.2999999999999998}]
[null,2,{"$f":"CEILING(ROWS(C$7:C15)/5,1)","v":2},4,{"$f":"MOD(ROWS(E$7:E15)-1,5)+1","v":4},2.4,{"$f":"CEILING(ROWS(G$7:G15)/5,1)&\".\"&MOD(ROWS(G$7:G15)-1,5)+1","v":"2.4"},{"$f":"(CEILING(ROWS(H$7:H15)/5,1)&\".\"&MOD(ROWS(H$7:H15)-1,5)+1)+0","v":2.4}]
[null,2,{"$f":"CEILING(ROWS(C$7:C16)/5,1)","v":2},5,{"$f":"MOD(ROWS(E$7:E16)-1,5)+1","v":5},2.5,{"$f":"CEILING(ROWS(G$7:G16)/5,1)&\".\"&MOD(ROWS(G$7:G16)-1,5)+1","v":"2.5"},{"$f":"(CEILING(ROWS(H$7:H16)/5,1)&\".\"&MOD(ROWS(H$7:H16)-1,5)+1)+0","v":2.5}]
[null,null,null,null,null,null,{"$f":"CEILING(ROWS(G$7:G17)/5,1)&\".\"&MOD(ROWS(G$7:G17)-1,5)+1","v":"3.1"},{"$f":"(CEILING(ROWS(H$7:H17)/5,1)&\".\"&MOD(ROWS(H$7:H17)-1,5)+1)+0","v":3.1}]
["Other videos about Incrementing Numbers or creating Sequential Numbers:",null,null,null,null,null,{"$f":"CEILING(ROWS(G$7:G18)/5,1)&\".\"&MOD(ROWS(G$7:G18)-1,5)+1","v":"3.2"},{"$f":"(CEILING(ROWS(H$7:H18)/5,1)&\".\"&MOD(ROWS(H$7:H18)-1,5)+1)+0","v":3.2}]
["Excel Incrementing (Sequential) Numbers In Formulas",null,null,null,null,null,{"$f":"CEILING(ROWS(G$7:G19)/5,1)&\".\"&MOD(ROWS(G$7:G19)-1,5)+1","v":"3.3"},{"$f":"(CEILING(ROWS(H$7:H19)/5,1)&\".\"&MOD(ROWS(H$7:H19)-1,5)+1)+0","v":3.3}]
["http://www.youtube.com/course?list=ECrRPvpgDmw0matjr9DLpc14DJn2OqNgYj",null,null,null,null,null,{"$f":"CEILING(ROWS(G$7:G20)/5,1)&\".\"&MOD(ROWS(G$7:G20)-1,5)+1","v":"3.4"},{"$f":"(CEILING(ROWS(H$7:H20)/5,1)&\".\"&MOD(ROWS(H$7:H20)-1,5)+1)+0","v":3.4}]
[null,null,null,null,null,null,{"$f":"CEILING(ROWS(G$7:G21)/5,1)&\".\"&MOD(ROWS(G$7:G21)-1,5)+1","v":"3.5"},{"$f":"(CEILING(ROWS(H$7:H21)/5,1)&\".\"&MOD(ROWS(H$7:H21)-1,5)+1)+0","v":3.5}]
[null,null,null,null,null,null,{"$f":"CEILING(ROWS(G$7:G22)/5,1)&\".\"&MOD(ROWS(G$7:G22)-1,5)+1","v":"4.1"},{"$f":"(CEILING(ROWS(H$7:H22)/5,1)&\".\"&MOD(ROWS(H$7:H22)-1,5)+1)+0","v":4.0999999999999996}]
[null,null,null,null,null,null,{"$f":"CEILING(ROWS(G$7:G23)/5,1)&\".\"&MOD(ROWS(G$7:G23)-1,5)+1","v":"4.2"},{"$f":"(CEILING(ROWS(H$7:H23)/5,1)&\".\"&MOD(ROWS(H$7:H23)-1,5)+1)+0","v":4.2}]
[null,null,null,null,null,null,{"$f":"CEILING(ROWS(G$7:G24)/5,1)&\".\"&MOD(ROWS(G$7:G24)-1,5)+1","v":"4.3"},{"$f":"(CEILING(ROWS(H$7:H24)/5,1)&\".\"&MOD(ROWS(H$7:H24)-1,5)+1)+0","v":4.3}]
[null,null,null,null,null,null,{"$f":"CEILING(ROWS(G$7:G25)/5,1)&\".\"&MOD(ROWS(G$7:G25)-1,5)+1","v":"4.4"},{"$f":"(CEILING(ROWS(H$7:H25)/5,1)&\".\"&MOD(ROWS(H$7:H25)-1,5)+1)+0","v":4.4000000000000004}]
[null,null,null,null,null,null,{"$f":"CEILING(ROWS(G$7:G26)/5,1)&\".\"&MOD(ROWS(G$7:G26)-1,5)+1","v":"4.5"},{"$f":"(CEILING(ROWS(H$7:H26)/5,1)&\".\"&MOD(ROWS(H$7:H26)-1,5)+1)+0","v":4.5}]
[null,null,null,null,null,null,{"$f":"CEILING(ROWS(G$7:G27)/5,1)&\".\"&MOD(ROWS(G$7:G27)-1,5)+1","v":"5.1"},{"$f":"(CEILING(ROWS(H$7:H27)/5,1)&\".\"&MOD(ROWS(H$7:H27)-1,5)+1)+0","v":5.0999999999999996}]
[null,null,null,null,null,null,{"$f":"CEILING(ROWS(G$7:G28)/5,1)&\".\"&MOD(ROWS(G$7:G28)-1,5)+1","v":"5.2"},{"$f":"(CEILING(ROWS(H$7:H28)/5,1)&\".\"&MOD(ROWS(H$7:H28)-1,5)+1)+0","v":5.2}]
[null,null,null,null,null,null,{"$f":"CEILING(ROWS(G$7:G29)/5,1)&\".\"&MOD(ROWS(G$7:G29)-1,5)+1","v":"5.3"},{"$f":"(CEILING(ROWS(H$7:H29)/5,1)&\".\"&MOD(ROWS(H$7:H29)-1,5)+1)+0","v":5.3}]
[null,null,null,null,null,null,{"$f":"CEILING(ROWS(G$7:G30)/5,1)&\".\"&MOD(ROWS(G$7:G30)-1,5)+1","v":"5.4"},{"$f":"(CEILING(ROWS(H$7:H30)/5,1)&\".\"&MOD(ROWS(H$7:H30)-1,5)+1)+0","v":5.4}]
[null,null,null,null,null,null,{"$f":"CEILING(ROWS(G$7:G31)/5,1)&\".\"&MOD(ROWS(G$7:G31)-1,5)+1","v":"5.5"},{"$f":"(CEILING(ROWS(H$7:H31)/5,1)&\".\"&MOD(ROWS(H$7:H31)-1,5)+1)+0","v":5.5}]
[null,null,null,null,null,null,{"$f":"CEILING(ROWS(G$7:G32)/5,1)&\".\"&MOD(ROWS(G$7:G32)-1,5)+1","v":"6.1"},{"$f":"(CEILING(ROWS(H$7:H32)/5,1)&\".\"&MOD(ROWS(H$7:H32)-1,5)+1)+0","v":6.1}]
[null,null,null,null,null,null,{"$f":"CEILING(ROWS(G$7:G33)/5,1)&\".\"&MOD(ROWS(G$7:G33)-1,5)+1","v":"6.2"},{"$f":"(CEILING(ROWS(H$7:H33)/5,1)&\".\"&MOD(ROWS(H$7:H33)-1,5)+1)+0","v":6.2}]
[null,null,null,null,null,null,{"$f":"CEILING(ROWS(G$7:G34)/5,1)&\".\"&MOD(ROWS(G$7:G34)-1,5)+1","v":"6.3"},{"$f":"(CEILING(ROWS(H$7:H34)/5,1)&\".\"&MOD(ROWS(H$7:H34)-1,5)+1)+0","v":6.3}]
[null,null,null,null,null,null,{"$f":"CEILING(ROWS(G$7:G35)/5,1)&\".\"&MOD(ROWS(G$7:G35)-1,5)+1","v":"6.4"},{"$f":"(CEILING(ROWS(H$7:H35)/5,1)&\".\"&MOD(ROWS(H$7:H35)-1,5)+1)+0","v":6.4}]
[null,null,null,null,null,null,{"$f":"CEILING(ROWS(G$7:G36)/5,1)&\".\"&MOD(ROWS(G$7:G36)-1,5)+1","v":"6.5"},{"$f":"(CEILING(ROWS(H$7:H36)/5,1)&\".\"&MOD(ROWS(H$7:H36)-1,5)+1)+0","v":6.5}]
[null,null,null,null,null,null,{"$f":"CEILING(ROWS(G$7:G37)/5,1)&\".\"&MOD(ROWS(G$7:G37)-1,5)+1","v":"7.1"},{"$f":"(CEILING(ROWS(H$7:H37)/5,1)&\".\"&MOD(ROWS(H$7:H37)-1,5)+1)+0","v":7.1}]
[null,null,null,null,null,null,{"$f":"CEILING(ROWS(G$7:G38)/5,1)&\".\"&MOD(ROWS(G$7:G38)-1,5)+1","v":"7.2"},{"$f":"(CEILING(ROWS(H$7:H38)/5,1)&\".\"&MOD(ROWS(H$7:H38)-1,5)+1)+0","v":7.2}]
[null,null,null,null,null,null,{"$f":"CEILING(ROWS(G$7:G39)/5,1)&\".\"&MOD(ROWS(G$7:G39)-1,5)+1","v":"7.3"},{"$f":"(CEILING(ROWS(H$7:H39)/5,1)&\".\"&MOD(ROWS(H$7:H39)-1,5)+1)+0","v":7.3}]
[null,null,null,null,null,null,{"$f":"CEILING(ROWS(G$7:G40)/5,1)&\".\"&MOD(ROWS(G$7:G40)-1,5)+1","v":"7.4"},{"$f":"(CEILING(ROWS(H$7:H40)/5,1)&\".\"&MOD(ROWS(H$7:H40)-1,5)+1)+0","v":7.4}]
[null,null,null,null,null,null,{"$f":"CEILING(ROWS(G$7:G41)/5,1)&\".\"&MOD(ROWS(G$7:G41)-1,5)+1","v":"7.5"},{"$f":"(CEILING(ROWS(H$7:H41)/5,1)&\".\"&MOD(ROWS(H$7:H41)-1,5)+1)+0","v":7.5}]
[null,null,null,null,null,null,{"$f":"CEILING(ROWS(G$7:G42)/5,1)&\".\"&MOD(ROWS(G$7:G42)-1,5)+1","v":"8.1"},{"$f":"(CEILING(ROWS(H$7:H42)/5,1)&\".\"&MOD(ROWS(H$7:H42)-1,5)+1)+0","v":8.1}]
[null,null,null,null,null,null,{"$f":"CEILING(ROWS(G$7:G43)/5,1)&\".\"&MOD(ROWS(G$7:G43)-1,5)+1","v":"8.2"},{"$f":"(CEILING(ROWS(H$7:H43)/5,1)&\".\"&MOD(ROWS(H$7:H43)-1,5)+1)+0","v":8.1999999999999993}]
[null,null,null,null,null,null,{"$f":"CEILING(ROWS(G$7:G44)/5,1)&\".\"&MOD(ROWS(G$7:G44)-1,5)+1","v":"8.3"},{"$f":"(CEILING(ROWS(H$7:H44)/5,1)&\".\"&MOD(ROWS(H$7:H44)-1,5)+1)+0","v":8.3000000000000007}]
[null,null,null,null,null,null,{"$f":"CEILING(ROWS(G$7:G45)/5,1)&\".\"&MOD(ROWS(G$7:G45)-1,5)+1","v":"8.4"},{"$f":"(CEILING(ROWS(H$7:H45)/5,1)&\".\"&MOD(ROWS(H$7:H45)-1,5)+1)+0","v":8.4}]
[null,null,null,null,null,null,{"$f":"CEILING(ROWS(G$7:G46)/5,1)&\".\"&MOD(ROWS(G$7:G46)-1,5)+1","v":"8.5"},{"$f":"(CEILING(ROWS(H$7:H46)/5,1)&\".\"&MOD(ROWS(H$7:H46)-1,5)+1)+0","v":8.5}]
[null,null,null,null,null,null,{"$f":"CEILING(ROWS(G$7:G47)/5,1)&\".\"&MOD(ROWS(G$7:G47)-1,5)+1","v":"9.1"},{"$f":"(CEILING(ROWS(H$7:H47)/5,1)&\".\"&MOD(ROWS(H$7:H47)-1,5)+1)+0","v":9.1}]
[null,null,null,null,null,null,{"$f":"CEILING(ROWS(G$7:G48)/5,1)&\".\"&MOD(ROWS(G$7:G48)-1,5)+1","v":"9.2"},{"$f":"(CEILING(ROWS(H$7:H48)/5,1)&\".\"&MOD(ROWS(H$7:H48)-1,5)+1)+0","v":9.1999999999999993}]
[null,null,null,null,null,null,{"$f":"CEILING(ROWS(G$7:G49)/5,1)&\".\"&MOD(ROWS(G$7:G49)-1,5)+1","v":"9.3"},{"$f":"(CEILING(ROWS(H$7:H49)/5,1)&\".\"&MOD(ROWS(H$7:H49)-1,5)+1)+0","v":9.3000000000000007}]
[null,null,null,null,null,null,{"$f":"CEILING(ROWS(G$7:G50)/5,1)&\".\"&MOD(ROWS(G$7:G50)-1,5)+1","v":"9.4"},{"$f":"(CEILING(ROWS(H$7:H50)/5,1)&\".\"&MOD(ROWS(H$7:H50)-1,5)+1)+0","v":9.4}]
[null,null,null,null,null,null,{"$f":"CEILING(ROWS(G$7:G51)/5,1)&\".\"&MOD(ROWS(G$7:G51)-1,5)+1","v":"9.5"},{"$f":"(CEILING(ROWS(H$7:H51)/5,1)&\".\"&MOD(ROWS(H$7:H51)-1,5)+1)+0","v":9.5}]
[null,null,null,null,null,null,{"$f":"CEILING(ROWS(G$7:G52)/5,1)&\".\"&MOD(ROWS(G$7:G52)-1,5)+1","v":"10.1"},{"$f":"(CEILING(ROWS(H$7:H52)/5,1)&\".\"&MOD(ROWS(H$7:H52)-1,5)+1)+0","v":10.1}]
[null,null,null,null,null,null,{"$f":"CEILING(ROWS(G$7:G53)/5,1)&\".\"&MOD(ROWS(G$7:G53)-1,5)+1","v":"10.2"},{"$f":"(CEILING(ROWS(H$7:H53)/5,1)&\".\"&MOD(ROWS(H$7:H53)-1,5)+1)+0","v":10.199999999999999}]
[null,null,null,null,null,null,{"$f":"CEILING(ROWS(G$7:G54)/5,1)&\".\"&MOD(ROWS(G$7:G54)-1,5)+1","v":"10.3"},{"$f":"(CEILING(ROWS(H$7:H54)/5,1)&\".\"&MOD(ROWS(H$7:H54)-1,5)+1)+0","v":10.3}]
[null,null,null,null,null,null,{"$f":"CEILING(ROWS(G$7:G55)/5,1)&\".\"&MOD(ROWS(G$7:G55)-1,5)+1","v":"10.4"},{"$f":"(CEILING(ROWS(H$7:H55)/5,1)&\".\"&MOD(ROWS(H$7:H55)-1,5)+1)+0","v":10.4}]
[null,null,null,null,null,null,{"$f":"CEILING(ROWS(G$7:G56)/5,1)&\".\"&MOD(ROWS(G$7:G56)-1,5)+1","v":"10.5"},{"$f":"(CEILING(ROWS(H$7:H56)/5,1)&\".\"&MOD(ROWS(H$7:H56)-1,5)+1)+0","v":10.5}]
[null,null,null,null,null,null,{"$f":"CEILING(ROWS(G$7:G57)/5,1)&\".\"&MOD(ROWS(G$7:G57)-1,5)+1","v":"11.1"},{"$f":"(CEILING(ROWS(H$7:H57)/5,1)&\".\"&MOD(ROWS(H$7:H57)-1,5)+1)+0","v":11.1}]
[null,null,null,null,null,null,{"$f":"CEILING(ROWS(G$7:G58)/5,1)&\".\"&MOD(ROWS(G$7:G58)-1,5)+1","v":"11.2"},{"$f":"(CEILING(ROWS(H$7:H58)/5,1)&\".\"&MOD(ROWS(H$7:H58)-1,5)+1)+0","v":11.2}]
[null,null,null,null,null,null,{"$f":"CEILING(ROWS(G$7:G59)/5,1)&\".\"&MOD(ROWS(G$7:G59)-1,5)+1","v":"11.3"},{"$f":"(CEILING(ROWS(H$7:H59)/5,1)&\".\"&MOD(ROWS(H$7:H59)-1,5)+1)+0","v":11.3}]
[null,null,null,null,null,null,{"$f":"CEILING(ROWS(G$7:G60)/5,1)&\".\"&MOD(ROWS(G$7:G60)-1,5)+1","v":"11.4"},{"$f":"(CEILING(ROWS(H$7:H60)/5,1)&\".\"&MOD(ROWS(H$7:H60)-1,5)+1)+0","v":11.4}]
[null,null,null,null,null,null,{"$f":"CEILING(ROWS(G$7:G61)/5,1)&\".\"&MOD(ROWS(G$7:G61)-1,5)+1","v":"11.5"},{"$f":"(CEILING(ROWS(H$7:H61)/5,1)&\".\"&MOD(ROWS(H$7:H61)-1,5)+1)+0","v":11.5}]

{"sheet":"(992)","index":8,"n_rows":10,"n_cols":5,"rows_kept":10,"cut":false,"hidden":false,"merged":[]}
["Amount","ID",null,"Criteria","Total"]
[907,82759123,null,123,{"$f":"SUMIF(B2:B10,\"*\"&D2,A2:A10)","v":0}]
[432,13521963]
[846,56951123]
[499,59153726]
[932,81952689]
[864,71021693]
[851,51018451]
[860,11238995]
[123,35452123]

{"sheet":"(992an)","index":9,"n_rows":10,"n_cols":5,"rows_kept":10,"cut":false,"hidden":false,"merged":[]}
["Amount","ID",null,"Criteria","Total"]
[907,82759123,null,123,{"$f":"SUMIF(B2:B10,\"*\"&D2,A2:A10)","v":0}]
[432,13521963,null,null,{"$f":"SUMPRODUCT(--(RIGHT(B2:B10,3)=D2&\"\"),A2:A10)","v":1876}]
[846,56951123]
[499,59153726]
[932,81952689]
[864,71021693]
[851,51018451]
[860,11238995]
[123,35452123]

{"sheet":"(992large)","index":10,"n_rows":10643,"n_cols":5,"rows_kept":10643,"cut":false,"hidden":false,"merged":[]}
["Amount","ID",null,"Criteria","Total"]
[930,46631106,null,123,{"$f":"SUMIF(B2:B10,\"*\"&D2,A2:A10)","v":0}]
[717,37673101,null,null,{"$f":"SUMPRODUCT(--(RIGHT(B2:B10643,3)=D2&\"\"),A2:A10643)","v":170283}]
[377,69638127]
[909,97697128]
[103,26848108]
[358,28725108]
[583,92650108]
[736,11979117]
[289,86225121]
[422,73184119]
[37,45828111]
[222,38941128]
[814,58894114]
[682,14761127]
[37,40406115]
[480,73480126]
[401,13925105]
[497,77856113]
[355,83938100]
[527,21895128]
[761,55179125]
[506,47079121]
[147,49472102]
[422,78988119]
[392,63742125]
[389,20376122]
[953,72908107]
[118,25579106]
[281,74839105]
[96,13945110]
[162,85305125]
[816,19493109]
[445,74486118]
[41,15215123]
[684,19943126]
[874,90116127]
[406,37208104]
[609,52060115]
[818,63274106]
[761,47466121]
[50,28921130]
[515,73743115]
[717,78783115]
[738,73411106]
[189,34515106]
[148,68946103]
[873,32724119]
[8,69167122]
[83,91368121]
[289,70270115]
[157,16660105]
[479,49253129]
[125,70417114]
[155,30677114]
[732,81703127]
[274,81309108]
[229,34876104]
[197,92064125]
[742,95554100]
[910,53263130]
[425,36254101]
[599,86328127]
[277,34509123]
[151,35179123]
[240,16521118]
[500,69232126]
[968,61272117]
[277,57873102]
[802,80296116]
[895,99846110]
[664,55048113]
[592,12621129]
[561,64450115]
[934,18325103]
[841,31474116]
[215,64363104]
[701,63644123]
[801,99332123]
[428,35626116]
[930,20773110]
[783,14476129]
[965,95592113]
[233,56104125]
[390,75660114]
[219,49350108]
[701,64860103]
[241,43879100]
[513,12420119]
[471,15597112]
[628,88251122]
[76,50250118]
[441,85281117]
[373,29209123]
[939,32793110]
[476,67076106]
[567,26510121]
[958,10117129]
[499,17370107]
[910,15834102]
[924,85513120]
[83,63058122]
[568,60312117]
[217,60526126]
[389,74062112]
[638,76420109]
[852,83332119]
[735,62779121]
[529,75079100]
[743,10340104]
[822,18085127]
[711,88907103]
[436,52992111]
[658,50210107]
[770,44105126]
[936,27820115]
[523,23904115]
[178,24098112]
[760,26933108]
[126,40458104]
[793,57183119]
[717,81661116]
[813,34625110]
[354,90070115]
[831,77391110]
[637,86860103]
[640,15741126]
[601,64533113]
[193,94203123]
[374,82991126]
[424,55926116]
[323,29895118]
[167,58934106]
[975,58942116]
[521,36490115]
[706,35524104]
[78,21400108]
[212,53467124]
[511,73567113]
[486,55246126]
[624,23437128]
[345,44237120]
[334,82228126]
[949,85620122]
[46,30939100]
[785,53762111]
[780,45746114]
[152,14429101]
[649,28793111]
[905,53470127]
[777,78151105]
[754,13534130]
[954,59738129]
[168,61082111]
[727,83642104]
[121,71617129]
[971,66675112]
[406,74878113]
[667,78382110]
[36,40668108]
[135,83611107]
[896,94878107]
[552,97657104]
[248,99082112]
[703,29227119]
[630,32547106]
[197,68055111]
[874,23352120]
[652,31800129]
[842,41893120]
[697,88205108]
[112,53967110]
[32,38904119]
[499,78220104]
[343,54483121]
[421,24035120]
[14,61844100]
[649,79092111]
[215,50651122]
[755,94981121]
[494,98654116]
[738,48707105]
[148,60317117]
[800,11028124]
[52,86430127]
[809,36404100]
[903,83087117]
[168,70564105]
[130,50739104]
[965,90271113]
[612,90257125]
[26,28965130]
[609,58300123]
[642,75083116]
[314,99946127]
[343,92448126]
[795,59238117]
[417,91030116]
[706,34666124]
[7,84517129]
[466,81548101]
[141,49548118]
[418,12313123]
[353,94191130]
[385,79583106]
[520,86949123]
[911,28866116]
[548,48378108]
[171,96364118]
[483,72477122]
[989,18184119]
[850,73963130]
[702,41081128]
[307,11595130]
[374,17550119]
[729,76224115]
[122,93074120]
[582,69302110]
[7,67597113]
[573,40966109]
[321,46084121]
[688,44764105]
[675,86752114]
[794,22568130]
[215,95040100]
[665,22838117]
[74,98886103]
[44,42521129]
[912,47542124]
[963,80869119]
[771,62671119]
[633,39516110]
[986,12918125]
[463,12359122]
[531,80889126]
[612,60325104]
[236,84261113]
[899,11049117]
[620,76630122]
[122,76218123]
[261,69082109]
[218,70100106]
[427,72567127]
[254,86654126]
[655,31884125]
[614,14851106]
[380,11920112]
[147,81367110]
[860,23440127]
[976,31199118]
[230,57450100]
[661,52295105]
[363,40618118]
[892,69073124]
[904,32448113]
[131,28737112]
[758,84516124]
[65,24893110]
[511,21338109]
[855,85759115]
[201,97516104]
[523,20542121]
[890,69467121]
[959,75440111]
[648,87049116]
[33,21207117]
[758,80223108]
[949,21748121]
[815,82462106]
[319,64684125]
[39,67580125]
[69,58346110]
[818,44079126]
[901,25797120]
[254,80781104]
[35,90663101]
[196,54056115]
[593,69269128]
[618,97242130]
[125,53492104]
[614,86451128]
[933,24837107]
[872,75619116]
[631,11013113]
[347,13774120]
[145,81826123]
[194,13003126]
[940,46494127]
[991,51986113]
[153,48432127]
[386,37861126]
[693,59704115]
[349,13412105]
[820,53720122]
[662,60441122]
[428,32901114]
[938,71020121]
[787,83904116]
[610,59917124]
[44,69680117]
[982,15222116]
[87,34659116]
[594,35628103]
[635,94853130]
[479,52781129]
[222,77812104]
[334,48194106]
[873,65414127]
[248,71747126]
[568,35345108]
[957,47543109]
[431,64317105]
[534,27879120]
[89,99364109]
[382,73567113]
[249,85810116]
[972,19921106]
[20,80518116]
[514,18116102]
[629,62611100]
[386,56891106]
[394,97614125]
[293,63668109]
[831,63546113]
[957,45412114]
[812,54907129]
[634,82115104]
[204,95760104]
[69,84095105]
[408,89975112]
[65,72429119]
[139,69933108]
[518,48700111]
[641,57718113]
[125,66258129]
[323,38376100]
[719,11972117]
[106,47434116]
[30,85642108]
[848,96887109]
[455,23494114]
[362,83641113]
[564,46128104]
[167,42637121]
[550,35608108]
[987,11551130]
[335,39021125]
[73,37382103]
[220,91988107]
[367,38843113]
[574,74358124]
[610,16732115]
[591,45827126]
[900,93314119]
[257,30906107]
[558,18129104]
[498,98653118]
[702,87841130]
[944,29623122]
[335,77601110]
[352,19435116]
[663,80053104]
[767,16918114]
[345,73529127]
[812,89931130]
[318,72755121]
[879,79362128]
[320,91142113]
[359,15345106]
[129,54256105]
[246,88734108]
[789,59960105]
[763,54239100]
[966,75626122]
[386,14717130]
[410,86725110]
[443,26702128]
[137,72401121]
[105,92200120]
[652,18894127]
[170,29243112]
[392,48221107]
[158,98833115]
[172,42885111]
[101,65707121]
[974,36894102]
[814,12137123]
[349,33609122]
[672,59350128]
[790,80682107]
[622,18786115]
[464,60730113]
[371,82284103]
[780,92544112]
[156,45179112]
[534,52705115]
[747,56955106]
[149,32962122]
[100,84982127]
[127,13628114]
[357,37323128]
[106,20821108]
[108,54439108]
[241,73571105]
[536,33463115]
[217,29399107]
[250,59065102]
[20,30487117]
[0,75796111]
[384,16442115]
[649,89185119]
[784,11812104]
[530,51168125]
[605,36488106]
[648,74207120]
[565,68653121]
[666,85568128]
[935,29682128]
[369,79178109]
[206,59619101]
[583,18738127]
[324,11610119]
[673,71840115]
[116,20171112]
[640,15363130]
[678,70732125]
[434,17299129]
[187,63333121]
[696,94702119]
[899,84798114]
[878,22841127]
[635,76580121]
[66,23017114]
[76,97212109]
[683,61969111]
[485,75444125]
[373,15401124]
[375,57205122]
[919,38869110]
[965,81147108]
[236,22103106]
[272,43671104]
[442,83094115]
[665,96468100]
[838,55702102]
[240,24338122]
[717,24802104]
[661,16148126]
[872,88569109]
[865,25625116]
[389,49291118]
[610,18744120]
[233,65454110]
[307,54961119]
[909,38859100]
[606,98297106]
[310,66273129]
[461,66964127]
[371,49529105]
[882,18393129]
[966,51845117]
[686,15233130]
[711,69334109]
[806,18818100]
[343,55578107]
[323,45560103]
[888,19534129]
[871,61495121]
[992,36049127]
[975,90133117]
[514,78916107]
[119,13716111]
[482,96090105]
[713,71371119]
[765,70103108]
[314,47216103]
[602,95596101]
[879,81790117]
[68,85941123]
[970,63797102]
[363,57780118]
[39,76713104]
[979,24334105]
[142,10456114]
[79,28219126]
[407,70285111]
[257,98646119]
[791,36261105]
[64,23736103]
[350,90556105]
[725,18112112]
[439,59189122]
[717,49080110]
[538,17153109]
[27,43588130]
[816,93142106]
[410,12640119]
[651,47734111]
[237,77178108]
[183,18334114]
[855,32299122]
[978,69660104]
[687,35861117]
[149,32171126]
[327,62366123]
[530,60125101]
[511,29963126]
[828,25073106]
[801,43771119]
[139,82080121]
[687,96542124]
[594,93215109]
[941,96757119]
[345,17597130]
[693,78888105]
[804,21314111]
[780,98420111]
[322,38366121]
[98,13821117]
[764,40843122]
[200,71884128]
[351,61511109]
[719,36267105]
[105,31355117]
[510,54129120]
[239,80193104]
[498,16284102]
[274,14501115]
[248,66572116]
[722,54346117]
[952,60075120]
[993,72392108]
[627,78117102]
[961,40961122]
[247,45787126]
[449,37652104]
[91,59375118]
[426,70977100]
[909,70535115]
[335,70397110]
[593,46706109]
[929,49251121]
[613,91652108]
[699,64412120]
[911,56371116]
[370,60311129]
[453,20854101]
[989,29423107]
[396,77244120]
[617,30717123]
[18,73182100]
[667,57500115]
[142,24866105]
[393,54079112]
[595,69855102]
[319,45762128]
[547,78350109]
[458,84888125]
[267,36481114]
[762,39271123]
[29,28609111]
[487,41486108]
[814,38283117]
[816,62220125]
[899,52353114]
[685,17493113]
[585,48397111]
[641,18653112]
[670,58648122]
[199,87081112]
[853,53880125]
[372,84426106]
[967,98298123]
[676,30426102]
[465,87342106]
[490,43412129]
[405,11576106]
[88,76748111]
[818,39191115]
[907,11915101]
[521,57640106]
[44,10146110]
[396,52234128]
[712,87534110]
[238,49133120]
[674,15037119]
[51,65884102]
[60,66093118]
[83,88042116]
[446,39025113]
[62,49123106]
[20,83250117]
[96,44117103]
[485,80080128]
[837,77387100]
[337,59784129]
[86,49195128]
[289,16699112]
[954,10988125]
[939,64798126]
[437,42010117]
[506,37543130]
[312,96190105]
[675,73143108]
[93,64321110]
[207,25252122]
[99,85251125]
[606,73303113]
[736,25176127]
[438,95678118]
[283,37151100]
[493,91408112]
[924,89231107]
[164,70867114]
[129,32719119]
[739,28989101]
[546,14240106]
[848,96075129]
[692,21438128]
[364,47142122]
[508,47342115]
[22,50939102]
[752,52205113]
[348,39939105]
[901,38924103]
[466,79446109]
[705,65310110]
[523,19911111]
[774,65772130]
[705,68592107]
[553,11481100]
[11,47870116]
[990,95090112]
[343,90696129]
[408,23139105]
[337,28809117]
[408,78047123]
[220,54630111]
[76,42916110]
[222,67987129]
[427,63725104]
[626,21520125]
[757,64416104]
[707,77253122]
[246,96046125]
[711,17901130]
[103,56612128]
[242,62915120]
[323,93320114]
[294,35048104]
[149,65419125]
[457,23786119]
[840,54674109]
[775,91158116]
[569,72814107]
[538,51081106]
[309,65291122]
[226,35320112]
[366,56799103]
[683,42134109]
[543,55637125]
[266,21892108]
[65,43062120]
[403,58466113]
[792,19271112]
[310,13547123]
[576,12560105]
[564,92052111]
[318,18267115]
[110,69233107]
[603,95631121]
[937,17358124]
[66,36437109]
[604,89345121]
[13,25042108]
[272,44395111]
[721,45296108]
[738,41384127]
[451,81343127]
[120,77407128]
[202,11747105]
[655,88173115]
[697,50994117]
[45,76606128]
[851,46572126]
[816,63057115]
[516,18224100]
[194,55140119]
[620,43320107]
[840,97074114]
[792,73633102]
[228,80726105]
[354,34551113]
[896,88100127]
[973,51427124]
[712,49157108]
[425,54710118]
[77,21635121]
[808,12531106]
[232,96981110]
[400,56568129]
[793,12026113]
[615,63848107]
[742,58052105]
[456,81826110]
[913,12440104]
[56,29626104]
[94,38816124]
[600,92186125]
[984,69701128]
[752,60079126]
[166,87184110]
[112,25263102]
[383,30467119]
[317,93727119]
[172,55464114]
[557,70390114]
[476,80430124]
[19,66114100]
[994,94762130]
[175,38510122]
[225,52271107]
[155,49496112]
[483,68711111]
[537,55365100]
[472,71688101]
[356,50002100]
[393,17360128]
[396,57376126]
[431,14643114]
[733,12858120]
[851,78176121]
[418,59015107]
[142,14823110]
[333,92564118]
[120,64763125]
[194,85669107]
[719,74472127]
[766,56097104]
[974,70639123]
[937,46469101]
[340,38099129]
[721,40666105]
[537,77376124]
[166,24362110]
[999,43683100]
[897,88198105]
[126,84756122]
[177,90719115]
[240,45804111]
[178,55359120]
[40,96718106]
[941,97125119]
[11,59958124]
[595,29405130]
[961,13790125]
[669,41069110]
[368,85260126]
[476,70131119]
[941,27630120]
[721,59039120]
[626,44253123]
[828,96665114]
[770,77387112]
[87,21615121]
[322,48952117]
[655,34685103]
[313,50840111]
[747,80944114]
[58,86430107]
[864,97936108]
[451,40605113]
[241,71254113]
[715,99875103]
[210,42325120]
[24,97280121]
[273,54222123]
[328,69735113]
[813,28117105]
[36,78975112]
[885,43041126]
[63,29653104]
[304,96040104]
[485,91440130]
[808,38276101]
[482,34365116]
[136,47711122]
[767,12992109]
[247,87375107]
[513,76494127]
[820,62740127]
[158,22835123]
[891,72371121]
[727,48226101]
[227,80156101]
[207,75076113]
[214,92463122]
[550,98334106]
[659,89282126]
[20,53805112]
[292,16902103]
[350,61979109]
[446,59017123]
[793,12344130]
[9,56188115]
[53,89625102]
[600,82335107]
[856,59257112]
[18,54838121]
[499,90203130]
[655,68762117]
[373,62000120]
[245,32990126]
[909,60349114]
[61,73699119]
[657,77131114]
[589,53074105]
[109,98239129]
[436,84905120]
[724,80806129]
[777,98867125]
[617,14959109]
[928,76383123]
[486,35867106]
[409,24840130]
[835,19574110]
[831,89017114]
[412,33943121]
[120,61007115]
[443,34524126]
[471,63553109]
[397,47883114]
[486,86039110]
[377,83805130]
[447,78547117]
[34,28186115]
[174,73867111]
[418,94296126]
[255,71541101]
[464,62689125]
[652,75710109]
[31,77834102]
[30,85509112]
[18,83313129]
[385,36794116]
[27,60904109]
[883,54397107]
[521,23438103]
[10,30518108]
[122,77139110]
[864,79023115]
[149,25933121]
[857,81490126]
[266,72019110]
[101,32433114]
[696,54293101]
[574,77585113]
[857,58341120]
[72,10031114]
[916,53950109]
[369,67716128]
[414,23077109]
[411,94021127]
[268,84261116]
[909,69161119]
[567,79242128]
[640,63876117]
[883,64146104]
[461,94505122]
[737,32074110]
[166,29173123]
[917,63941109]
[461,77804118]
[634,13183129]
[420,38181129]
[853,10799112]
[481,48911112]
[126,93499114]
[89,73793122]
[873,96766111]
[781,34562128]
[130,95587115]
[852,85279121]
[787,36043109]
[850,56982113]
[427,54596130]
[485,58116121]
[891,18565107]
[759,50604124]
[378,92728107]
[363,79368117]
[472,13025128]
[462,58118105]
[963,32570120]
[258,86681112]
[21,91571117]
[643,10331123]
[464,84709126]
[282,67470121]
[261,80091128]
[347,87087114]
[633,35725118]
[79,52397126]
[364,76468122]
[147,97768120]
[643,14624108]
[524,96795111]
[993,96955115]
[935,45716114]
[365,77795128]
[288,82875114]
[976,56110104]
[424,11652121]
[61,54841105]
[214,38990114]
[964,25604123]
[120,68044122]
[952,18573101]
[952,10429103]
[112,52510114]
[843,81321106]
[691,51633124]
[41,62709106]
[800,35153100]
[366,35973130]
[372,14170124]
[350,71223124]
[781,93223117]
[753,79541115]
[860,70199126]
[599,30543122]
[237,74506110]
[145,64534109]
[783,45688105]
[711,76642116]
[311,19130108]
[103,11961101]
[981,79489123]
[211,73226128]
[799,96518105]
[830,16609104]
[232,26633110]
[37,39897107]
[406,77593114]
[39,96316129]
[736,90917117]
[436,33286114]
[340,93334120]
[598,70793114]
[455,48534104]
[112,34511110]
[464,51452123]
[367,50650112]
[911,47275126]
[722,42984103]
[859,94540119]
[999,64108129]
[347,96077104]
[821,41016105]
[975,86392116]
[335,92025105]
[126,35247103]
[708,14865116]
[519,32965112]
[755,67592107]
[130,97567130]
[530,92762111]
[28,65787127]
[538,83285105]
[607,10260107]
[878,92205100]
[823,58030122]
[337,61244129]
[947,78254118]
[845,93875112]
[741,28827129]
[19,75542108]
[475,26332110]
[553,20988114]
[394,83128127]
[490,55893122]
[847,88588103]
[201,80367128]
[874,90961125]
[878,45922126]
[820,65537109]
[622,35605117]
[723,30339108]
[779,10890107]
[993,83801121]
[308,52052115]
[242,51288128]
[968,84008113]
[673,68072117]
[990,29778108]
[766,50513104]
[265,58360114]
[871,84384121]
[347,61783122]
[123,58845118]
[25,60067114]
[836,74745102]
[61,23286106]
[601,34963115]
[50,73475125]
[111,12566130]
[368,97075115]
[978,35056129]
[81,35837127]
[769,14133118]
[160,63084124]
[241,91391119]
[474,91695100]
[126,98067129]
[178,51046109]
[165,27580108]
[473,15680129]
[853,55345115]
[984,44289119]
[651,24275122]
[415,65341108]
[984,43968116]
[154,56691113]
[641,66121116]
[932,40307116]
[385,30497129]
[777,77677102]
[533,63683102]
[115,96197116]
[304,50474121]
[913,19456130]
[789,10108123]
[11,12110106]
[320,98268112]
[496,11611112]
[705,34406116]
[491,28289107]
[370,30309112]
[836,34654105]
[73,38565130]
[996,90665113]
[570,80209113]
[540,67893114]
[235,23037110]
[505,99511102]
[105,94959128]
[967,37475112]
[914,12195115]
[405,75973116]
[73,96904127]
[896,86757116]
[73,67985105]
[434,35168105]
[282,70156113]
[211,33151107]
[190,62133111]
[836,41578118]
[189,57764104]
[607,27817125]
[597,39623121]
[879,41561108]
[772,25709122]
[677,73731129]
[747,56664103]
[480,69549104]
[704,20538117]
[662,47251100]
[341,74456124]
[324,86046120]
[435,76643100]
[926,23322112]
[365,70878130]
[166,48193103]
[405,39883124]
[739,28954118]
[498,54319115]
[5,21761113]
[965,49289107]
[467,94767125]
[712,10128121]
[678,62292105]
[711,96919116]
[948,34834127]
[791,76107123]
[302,14361121]
[337,90525109]
[894,41698108]
[69,36945106]
[322,40412101]
[926,72682109]
[360,31967119]
[392,37463121]
[322,43024116]
[604,75607109]
[672,28244104]
[43,60393100]
[532,85487102]
[115,38341110]
[1,34770107]
[747,38120124]
[909,58437117]
[185,18407115]
[66,22067100]
[456,97594118]
[775,20921112]
[563,74035124]
[352,61541118]
[275,83989129]
[759,85327108]
[477,85430127]
[687,77533111]
[358,90721107]
[468,19651128]
[512,94145115]
[435,78088112]
[562,74108128]
[28,63398108]
[294,32504124]
[921,30234118]
[311,88051125]
[289,50829114]
[470,49643104]
[326,28969101]
[133,51266114]
[391,61849130]
[410,40242121]
[549,45622130]
[554,23417103]
[396,31719105]
[818,83144105]
[884,37582124]
[226,68864110]
[771,27781105]
[123,47462107]
[592,61660115]
[508,49956130]
[64,72178102]
[307,24740128]
[849,21936113]
[201,23581120]
[529,87061113]
[260,53741104]
[974,78610118]
[895,13209108]
[415,35957107]
[976,36685107]
[187,75276123]
[799,30113127]
[936,62439100]
[364,51312106]
[847,30932126]
[295,61022112]
[690,57766127]
[700,16787120]
[867,84027130]
[219,68718106]
[760,13823112]
[201,23202128]
[384,46620103]
[247,40956106]
[774,90207102]
[245,58661122]
[506,17325102]
[95,81796104]
[921,44953117]
[10,81140113]
[68,76542121]
[426,97741100]
[907,55542118]
[920,31259123]
[174,41116126]
[165,95472120]
[101,73557121]
[419,54625104]
[946,45947121]
[865,80504124]
[491,46388129]
[813,46703108]
[931,18617127]
[684,99076127]
[848,48806112]
[709,10909130]
[191,11050112]
[177,68022106]
[632,82389112]
[81,82910101]
[122,80979111]
[724,98670123]
[104,70808115]
[172,65905110]
[256,35642104]
[186,36939118]
[260,70266102]
[222,16843128]
[432,89160116]
[326,34338101]
[199,86388111]
[956,79042100]
[944,72530118]
[795,16714108]
[259,69193118]
[104,82180102]
[868,54166125]
[391,89064121]
[525,80958126]
[446,81615127]
[747,99612104]
[981,33877115]
[659,15573127]
[708,34080120]
[792,67175109]
[538,52682101]
[719,81280111]
[185,31149119]
[19,98232117]
[812,12249108]
[481,60197119]
[531,63001129]
[694,41555130]
[756,99999100]
[789,31526100]
[776,56531110]
[751,22870126]
[860,92776113]
[91,14519107]
[498,78487105]
[991,60131126]
[11,80950124]
[162,94899116]
[662,46957130]
[64,78028117]
[781,10770117]
[432,84901118]
[212,11690126]
[708,50190104]
[398,64208120]
[458,33790115]
[152,80270118]
[117,41069114]
[371,39272124]
[225,94739107]
[338,72986128]
[588,21454130]
[399,41696117]
[49,19372102]
[32,24202112]
[447,45779115]
[15,41532115]
[41,45494100]
[450,71919115]
[45,31890112]
[287,18459125]
[309,32932100]
[207,83258113]
[626,97355117]
[929,72593118]
[359,88749114]
[833,59580119]
[990,88152108]
[67,40325101]
[889,53235109]
[31,74326111]
[643,31099127]
[23,82999104]
[794,27760116]
[365,58542109]
[333,55935102]
[488,74081108]
[807,39012100]
[413,53769103]
[115,34862102]
[448,70845112]
[777,78913122]
[732,91245124]
[670,64551112]
[819,18932129]
[598,99967123]
[992,98816118]
[44,29421121]
[922,29370126]
[694,50725125]
[155,96254129]
[699,39460108]
[613,40942106]
[171,59176127]
[701,69240121]
[232,14767120]
[632,11655113]
[801,47501105]
[848,53838115]
[223,15834122]
[110,20650118]
[219,93032113]
[802,40551111]
[452,57516114]
[913,63836120]
[41,64132123]
[658,17266118]
[732,22821101]
[899,80748109]
[511,31771122]
[800,20202118]
[840,99753107]
[947,51239126]
[631,73843121]
[423,49958125]
[449,54523111]
[672,27445123]
[545,16260105]
[874,53407113]
[291,73590116]
[36,57642102]
[938,45196100]
[718,80620126]
[860,41292105]
[943,53279121]
[918,42089111]
[425,18689106]
[800,34556114]
[533,62881107]
[567,87684106]
[759,22949117]
[396,87478126]
[998,89280118]
[422,97875124]
[686,33972110]
[432,99458119]
[948,21984112]
[377,46462108]
[81,33848113]
[876,78007114]
[881,83765110]
[904,42682102]
[531,23055107]
[250,64846111]
[926,17859129]
[386,58614129]
[908,27553123]
[965,37250113]
[181,59735112]
[52,54772121]
[630,91161112]
[535,63890109]
[417,57787128]
[885,10042128]
[481,35883111]
[204,73392123]
[351,64588121]
[128,25241107]
[713,96289102]
[422,96701121]
[412,69380112]
[551,37429130]
[696,83701126]
[775,85308130]
[530,73581119]
[316,28908129]
[666,93527119]
[715,43521101]
[578,94326101]
[290,16480104]
[55,13878120]
[561,62390102]
[721,23910123]
[33,50667101]
[896,66393126]
[949,68241102]
[788,50508115]
[211,70304111]
[890,57541116]
[727,60775128]
[962,29270116]
[357,85825105]
[430,46426126]
[895,65448105]
[29,49200107]
[371,97011128]
[524,81394118]
[535,49451125]
[290,61451102]
[715,36757124]
[804,57483116]
[565,88057117]
[925,45046104]
[35,54729129]
[523,74894116]
[558,42372122]
[254,70569101]
[25,68532130]
[970,56313118]
[463,24473109]
[438,66944127]
[162,74259123]
[343,10105100]
[637,18646117]
[175,41758105]
[195,59712120]
[793,24272101]
[119,13843130]
[483,20357109]
[911,48777124]
[399,58030115]
[977,84610121]
[754,51559117]
[601,44296105]
[312,88375109]
[746,73862128]
[657,46631101]
[294,94459105]
[702,42652115]
[705,75245127]
[641,90370111]
[883,11671117]
[524,48722122]
[925,97811103]
[595,96992125]
[274,66918105]
[244,55119107]
[775,25391113]
[959,67076110]
[173,14951110]
[825,35755117]
[757,88601119]
[767,19792103]
[404,13892126]
[896,68798130]
[561,51381120]
[942,57979118]
[366,52214104]
[327,20552118]
[581,85492125]
[484,66085122]
[857,35998111]
[522,82725101]
[670,82861108]
[309,64165113]
[285,84813126]
[798,92329123]
[782,11666105]
[124,93930119]
[437,92556121]
[482,34828117]
[669,63959128]
[199,43296126]
[734,78362128]
[763,24097106]
[612,22143118]
[798,50853114]
[113,25530106]
[554,34299104]
[206,71822127]
[130,47761112]
[985,14235112]
[926,76209128]
[340,29882107]
[665,76802120]
[195,52374117]
[635,36367112]
[716,25532123]
[126,34555110]
[77,20959103]
[537,93205127]
[645,60347118]
[116,91089102]
[771,35238114]
[354,91691116]
[30,76447125]
[387,93258102]
[624,50041119]
[172,67971127]
[71,97492101]
[584,48967119]
[565,71386101]
[520,17629108]
[418,11257112]
[708,56329123]
[848,62739121]
[992,31234125]
[898,88161111]
[324,27270126]
[669,85912111]
[771,75467106]
[4,54516112]
[857,85248117]
[234,69463101]
[724,86546107]
[81,24535122]
[805,49782100]
[109,66973117]
[771,26238126]
[450,35555121]
[264,11322109]
[547,24335119]
[584,38683127]
[298,27027107]
[818,63966116]
[591,35524109]
[981,68363124]
[829,60078112]
[537,99047129]
[248,50807100]
[28,87734119]
[14,63628105]
[450,73739115]
[687,54951104]
[556,73588127]
[316,30706104]
[927,59719117]
[659,46481111]
[678,23568112]
[67,60080110]
[422,30723106]
[907,28571103]
[22,91004112]
[243,16909118]
[261,21454106]
[459,19767115]
[663,71100120]
[25,18598108]
[843,87847107]
[633,37148121]
[600,85756115]
[516,13119120]
[156,74429122]
[602,47793120]
[425,54842130]
[297,17294112]
[616,30155103]
[946,49388117]
[819,58600129]
[986,87349111]
[834,65291113]
[699,38019118]
[334,54814112]
[495,65324101]
[215,26642127]
[869,24013101]
[959,52611101]
[626,26350127]
[532,13127105]
[944,55216117]
[815,62221107]
[169,23159125]
[703,15814122]
[823,84411127]
[787,85988111]
[288,31228127]
[610,28692118]
[912,64917103]
[112,65409104]
[930,25230101]
[150,17987128]
[800,64335103]
[237,87600109]
[676,21766111]
[783,78843113]
[576,79115114]
[568,86701102]
[295,53623116]
[72,10125128]
[282,33007130]
[737,46734129]
[924,47362106]
[287,54326122]
[695,16424122]
[142,24418125]
[788,95598112]
[821,85719125]
[710,12790123]
[239,66701123]
[227,68091123]
[516,37943116]
[313,45076108]
[802,74199120]
[149,89568103]
[370,18423111]
[866,80946103]
[316,45335123]
[69,36382110]
[564,47809112]
[578,19226113]
[411,85757116]
[638,86520129]
[868,48573101]
[514,67444112]
[825,89357128]
[259,39977112]
[589,79869101]
[128,80835114]
[427,97670113]
[971,91937114]
[324,50366107]
[193,56696108]
[320,23053110]
[39,85339102]
[185,82826115]
[47,23765127]
[639,57365104]
[541,88269102]
[239,58336118]
[355,33047108]
[924,79647127]
[636,10158118]
[797,16394110]
[929,55660116]
[288,39713116]
[661,75865103]
[453,57031117]
[581,91715127]
[840,92580104]
[731,92492104]
[542,54760110]
[969,90575120]
[231,38325129]
[286,47639129]
[428,99026101]
[586,11995118]
[944,44197123]
[266,70730105]
[809,92088117]
[918,28439123]
[602,88035111]
[559,75188127]
[492,18239114]
[526,74709119]
[303,31243127]
[751,18102118]
[668,74709112]
[324,25510110]
[404,63936123]
[127,67449118]
[413,26720118]
[863,68078104]
[232,45181122]
[476,60705109]
[595,37242116]
[675,34897122]
[138,68701104]
[726,56458125]
[704,98765115]
[292,64699104]
[951,29000130]
[649,22999129]
[654,78203100]
[437,27753108]
[293,64230121]
[722,60975128]
[552,61108107]
[488,75508130]
[377,64558125]
[350,93333122]
[614,93888126]
[622,18823106]
[6,49496101]
[8,63860120]
[294,36305124]
[786,36085123]
[502,66560102]
[442,18555116]
[26,49049113]
[135,36825111]
[428,39680119]
[787,22961114]
[87,13977119]
[177,98795102]
[963,66898118]
[529,97397111]
[943,54626112]
[505,56566129]
[612,68351122]
[561,49399126]
[730,65216107]
[18,46519108]
[132,40840115]
[354,56196116]
[386,58916105]
[790,92868108]
[319,99849108]
[299,93961121]
[553,77915107]
[440,35062130]
[912,53938115]
[959,25794105]
[547,31440116]
[966,11746130]
[408,10447114]
[183,76777100]
[348,95013124]
[858,97154123]
[814,17049122]
[246,95220108]
[220,27379102]
[801,47120129]
[302,56211125]
[755,28713114]
[54,92213127]
[256,25151116]
[621,84307107]
[779,36149118]
[380,64827130]
[349,29336128]
[277,44245104]
[949,43473123]
[921,96703129]
[679,10310112]
[277,76038110]
[248,83604111]
[995,24456124]
[970,75230103]
[529,67131114]
[907,73566120]
[302,93548103]
[556,66821111]
[682,53499116]
[416,74743128]
[794,71482116]
[904,58789122]
[839,70037130]
[111,58734123]
[995,96140111]
[859,28125116]
[383,25275108]
[777,51886101]
[822,51706108]
[695,16599128]
[71,81212121]
[802,29477120]
[549,49150100]
[530,64061109]
[820,93558120]
[422,36603118]
[333,13913118]
[557,83013115]
[927,43683122]
[489,16646116]
[812,24356119]
[274,48412125]
[432,56471118]
[635,89696112]
[119,74336102]
[328,36294124]
[433,29998124]
[101,21302119]
[106,78725118]
[160,76292128]
[146,49449113]
[223,66287105]
[801,23258112]
[965,48438120]
[866,18148115]
[911,71255102]
[337,82880108]
[210,90377102]
[616,23542102]
[185,54959120]
[113,76518105]
[661,51346125]
[335,79209112]
[707,28531109]
[239,94614130]
[405,71865128]
[553,34362123]
[154,22719100]
[516,41913124]
[661,50935116]
[283,33549109]
[348,58231107]
[735,43908128]
[502,42474122]
[136,61499116]
[797,23461102]
[337,88585113]
[453,71394102]
[984,26581105]
[474,19728104]
[688,17899128]
[388,13132102]
[862,47679129]
[238,27311125]
[614,44441130]
[739,74354119]
[518,24312129]
[69,89297108]
[925,39455121]
[502,27753105]
[699,10836101]
[616,80340108]
[905,51889102]
[232,11216127]
[675,98611125]
[148,63029114]
[673,24244103]
[977,11109128]
[312,23235129]
[405,63505107]
[402,64540110]
[181,35157115]
[387,48018113]
[568,58002114]
[918,72736105]
[57,24482120]
[977,84915107]
[553,52778117]
[904,49733108]
[231,60517125]
[421,55303104]
[144,61035117]
[737,96647127]
[310,45972103]
[581,45596119]
[242,88448120]
[851,33364119]
[0,56205105]
[359,60014124]
[272,73590118]
[335,23505129]
[218,94430103]
[742,22731124]
[600,54459113]
[64,51484111]
[952,19469104]
[352,39258122]
[989,48968100]
[244,56195122]
[312,65190118]
[343,32390117]
[428,24621114]
[52,58753128]
[322,69187126]
[914,78646103]
[433,81923102]
[373,49255119]
[434,88373113]
[384,49358122]
[940,74420103]
[268,20430119]
[604,27245110]
[385,93678104]
[158,94362114]
[266,70935102]
[162,63905127]
[644,73234102]
[832,71706100]
[774,51184127]
[816,71370108]
[93,11079117]
[461,70416109]
[766,81590109]
[994,76378118]
[752,99510108]
[703,72199128]
[525,35014106]
[687,12442127]
[548,73287106]
[813,13730100]
[694,98827123]
[958,21355129]
[752,97008116]
[528,45356101]
[326,79976105]
[852,74256114]
[927,20318115]
[103,58132130]
[45,93481102]
[775,62243119]
[960,42157120]
[802,67093129]
[628,51374121]
[337,23252110]
[593,96871109]
[867,73256118]
[321,26146102]
[367,86224122]
[84,94861116]
[610,87438120]
[711,95499108]
[956,46339117]
[744,10091109]
[612,61694115]
[827,91063113]
[258,95401116]
[473,80503116]
[459,94549100]
[291,71117123]
[996,64400116]
[384,10596118]
[898,86156109]
[450,68747101]
[551,27375120]
[879,73548125]
[754,23368118]
[34,54412101]
[742,68894120]
[107,66384124]
[636,28220128]
[120,75654108]
[596,36682130]
[201,39777112]
[191,22507121]
[870,17479108]
[255,18375120]
[86,78225119]
[933,70439122]
[143,72424109]
[420,98924130]
[222,79565111]
[412,64142103]
[427,42077120]
[767,96586129]
[63,71523105]
[496,41199120]
[949,64524107]
[373,25232119]
[70,18375111]
[709,10613120]
[87,85658122]
[69,98516101]
[730,35563104]
[829,30676102]
[690,22773114]
[445,38078106]
[662,63264126]
[125,51383112]
[701,68638100]
[139,89572114]
[892,64611109]
[184,87793114]
[141,10965122]
[372,24986112]
[369,16529129]
[829,99563116]
[713,77459130]
[737,61570124]
[463,52016130]
[589,95216124]
[876,39397115]
[24,91578130]
[382,37514122]
[102,13369104]
[820,70447115]
[584,12556129]
[953,16286111]
[328,50558117]
[452,95539100]
[240,63249129]
[977,17807124]
[672,17386104]
[164,10951130]
[645,21869127]
[206,99572110]
[641,13528101]
[957,27334108]
[173,28514123]
[679,73009100]
[80,61676106]
[946,19265130]
[318,80867115]
[240,27773117]
[108,48377105]
[77,46739116]
[515,41634107]
[57,45765127]
[85,48808130]
[772,40967116]
[616,38230118]
[907,98562101]
[173,69477127]
[613,56467107]
[217,67539100]
[478,73519127]
[136,40285116]
[983,44171125]
[844,28984104]
[470,69436123]
[494,68408107]
[912,61234107]
[605,37576118]
[379,85710103]
[552,44940117]
[624,57841130]
[468,73016114]
[902,80756127]
[323,85243101]
[810,24476123]
[591,85647113]
[241,70059119]
[258,96713107]
[926,10209117]
[866,25245125]
[345,13271122]
[227,39031125]
[730,66328125]
[185,53748115]
[103,81051114]
[651,43233116]
[173,27199123]
[622,70572114]
[384,59917125]
[832,51971123]
[751,28201124]
[289,21225114]
[846,31580120]
[3,92144127]
[647,44717115]
[514,61783130]
[774,43877108]
[550,77248104]
[805,82548112]
[784,69035112]
[847,85928112]
[686,68446129]
[145,90413120]
[557,72954115]
[253,43687126]
[346,37058126]
[453,47184119]
[842,31410120]
[955,91381120]
[614,51026125]
[623,99475104]
[283,95105105]
[717,97720127]
[710,40537130]
[66,33360104]
[903,49587107]
[612,79680105]
[763,19181120]
[635,72722123]
[560,92168111]
[852,19967113]
[940,87546124]
[718,25224103]
[315,37750127]
[652,30600130]
[332,82274117]
[212,79954110]
[21,92766112]
[367,59451103]
[192,88357128]
[784,55207119]
[461,60376120]
[198,49685110]
[488,77428125]
[260,11772127]
[15,86446119]
[802,78238117]
[768,41509112]
[169,35480120]
[322,72315115]
[108,25607105]
[302,58900103]
[599,22224100]
[119,95876106]
[381,38316112]
[586,36636124]
[128,29663114]
[349,14423126]
[692,83816114]
[202,41487106]
[907,96325119]
[345,31261116]
[50,76895111]
[254,66646127]
[182,53231104]
[944,16917117]
[616,84914100]
[639,19783100]
[288,37542121]
[839,24143112]
[861,52591100]
[537,77083113]
[340,64617116]
[552,17048118]
[898,33183109]
[533,52793106]
[513,33513114]
[751,99925113]
[849,72322111]
[560,18194112]
[146,79308114]
[441,27297111]
[433,24830126]
[949,89683108]
[493,30975121]
[615,19494100]
[309,44199122]
[153,24426119]
[265,58883117]
[88,20879126]
[704,35543120]
[94,17305108]
[311,17479125]
[176,54453100]
[123,59508104]
[385,12199111]
[408,36549117]
[416,22218120]
[37,76636123]
[464,83182113]
[576,87924109]
[29,82334120]
[437,87061115]
[53,88785100]
[509,52320113]
[497,65602122]
[884,54036100]
[124,24426126]
[221,62232113]
[87,36140106]
[252,34261107]
[772,17766124]
[334,36404117]
[749,25962120]
[668,39767116]
[574,59219106]
[73,14449123]
[580,79394110]
[998,20980118]
[656,73473119]
[280,92450122]
[555,11007101]
[142,26092114]
[100,89067125]
[233,12110116]
[587,75638123]
[536,64986110]
[509,56298114]
[232,88684116]
[556,51986110]
[345,92689128]
[100,83976127]
[706,63415116]
[498,53368110]
[828,19831109]
[592,90184129]
[465,43341111]
[302,89426116]
[50,34538116]
[362,89314129]
[748,98201129]
[388,29021129]
[871,78519106]
[78,92651127]
[645,38932123]
[487,15312100]
[870,34811127]
[719,64383114]
[555,11263112]
[797,82217107]
[541,53912125]
[877,18581126]
[613,19998102]
[882,92770112]
[222,91094118]
[386,66413105]
[530,75229130]
[762,29559127]
[114,82471116]
[469,52667111]
[529,30559125]
[922,78450126]
[719,82943121]
[38,80770120]
[624,38457109]
[755,39795128]
[360,69643121]
[14,68284114]
[877,17806103]
[755,39592117]
[814,29868127]
[641,48870113]
[155,20174118]
[578,57050127]
[141,40625129]
[842,47397125]
[853,39341114]
[998,33942126]
[142,26828113]
[833,97412117]
[240,71899103]
[785,36205120]
[929,93792106]
[389,67365104]
[484,37180117]
[233,11749106]
[313,75012125]
[411,34217116]
[332,99857107]
[828,10111106]
[3,55575116]
[119,40629117]
[783,23510108]
[648,60442122]
[336,57431119]
[740,67474108]
[744,56079101]
[851,33189127]
[977,47426120]
[971,91520105]
[281,20755117]
[22,64522117]
[922,74115101]
[407,30001113]
[635,78025101]
[179,17562119]
[604,53885127]
[820,52064115]
[375,95331105]
[853,65704128]
[800,42357114]
[629,41882113]
[113,69961110]
[124,23170120]
[739,83285108]
[989,30645127]
[647,91420104]
[130,52156117]
[738,86153100]
[425,91431109]
[149,95805106]
[551,80901113]
[180,99050107]
[500,26021101]
[223,33955106]
[143,60079104]
[535,46770107]
[315,90968100]
[395,37068120]
[726,76562121]
[25,83602104]
[496,71703107]
[919,65361109]
[248,61496115]
[883,33203129]
[586,75769126]
[142,15960120]
[138,52754129]
[674,11718115]
[56,37562123]
[445,86028115]
[307,25252101]
[498,40148128]
[691,66213104]
[122,35803119]
[395,23080102]
[646,60662103]
[263,50339106]
[728,49650118]
[835,89554104]
[680,99574126]
[615,95925108]
[458,64334118]
[174,40215127]
[339,27891126]
[878,96467118]
[432,75895128]
[379,84277130]
[631,17483102]
[162,39435117]
[712,66600129]
[127,38716100]
[16,39044130]
[744,69808128]
[603,69749125]
[998,50665123]
[204,76406128]
[705,13310110]
[832,48615107]
[961,71488122]
[890,30966110]
[122,66667118]
[914,21508115]
[482,19869109]
[989,17942100]
[903,67993104]
[656,45542120]
[809,26267104]
[875,32580119]
[4,70103119]
[824,57687126]
[493,95238122]
[119,27691111]
[540,60968128]
[575,63898101]
[831,34248125]
[825,82384128]
[295,61347115]
[833,46865108]
[791,97873113]
[396,96439121]
[104,59020110]
[433,66366107]
[451,78444109]
[657,96065106]
[291,13618120]
[320,56300120]
[147,65225118]
[782,41440114]
[290,86570100]
[963,46861129]
[510,85778103]
[229,77298110]
[41,50825130]
[241,51819110]
[284,61336127]
[677,13125101]
[370,42875118]
[780,82168103]
[166,92708112]
[852,20375117]
[709,77152129]
[385,45923112]
[785,52708126]
[653,70029114]
[951,50557126]
[854,93069130]
[882,45250128]
[331,43995117]
[247,45843111]
[298,33957113]
[851,22433129]
[329,54414113]
[245,86385130]
[22,51088125]
[115,50847122]
[833,44193107]
[238,14862116]
[539,33174130]
[645,42255125]
[374,12698107]
[781,53334125]
[124,81784129]
[157,39658119]
[707,37136110]
[90,80048122]
[779,74209109]
[758,26150118]
[369,90841128]
[540,65047108]
[346,45613109]
[763,38832129]
[4,14182113]
[660,78855128]
[277,75548106]
[502,15195120]
[268,22511119]
[158,49517110]
[856,13048128]
[57,13973111]
[433,99855124]
[99,82146125]
[236,33626107]
[423,13112119]
[833,68774100]
[691,23729121]
[884,27122129]
[720,84794101]
[464,98828107]
[831,54847130]
[426,85278114]
[751,64824104]
[225,55317112]
[976,44914126]
[691,82233116]
[942,79724129]
[247,89090105]
[896,49838115]
[704,67902124]
[839,29672121]
[546,76184112]
[319,17904102]
[381,65983124]
[339,81426126]
[453,54825120]
[139,22338115]
[343,55227126]
[372,58036104]
[406,54164105]
[127,81529112]
[275,84874124]
[454,45353101]
[335,53502113]
[867,46466128]
[592,74401122]
[177,39826129]
[399,71358120]
[466,44754128]
[717,59548122]
[696,66770123]
[827,46928126]
[6,15999111]
[437,86138101]
[83,55612115]
[967,43075125]
[148,60664102]
[744,59406111]
[296,47430102]
[557,18497111]
[663,14747107]
[893,17522117]
[796,90940124]
[637,21307112]
[719,71323102]
[1,84731111]
[608,64618119]
[717,76302105]
[54,96378113]
[361,95444120]
[372,36610117]
[317,73558120]
[714,81045128]
[370,71217119]
[367,65730123]
[696,22943119]
[136,45368110]
[454,82155115]
[680,85951101]
[816,32137115]
[663,92080105]
[76,70359108]
[191,85279118]
[697,35159122]
[272,26808116]
[158,55769123]
[340,37875108]
[927,18220104]
[675,21415122]
[545,55798126]
[957,78900104]
[863,60329116]
[103,11151130]
[875,38281120]
[293,63615109]
[487,56630117]
[18,31227121]
[617,72106107]
[610,68909105]
[98,89562125]
[565,49638106]
[602,47589118]
[775,33805122]
[360,51073111]
[523,71652127]
[466,57000109]
[723,57324128]
[268,59940101]
[504,77452105]
[31,40379116]
[981,56902109]
[90,11172107]
[41,55618125]
[828,90530107]
[456,83504115]
[802,73268103]
[860,67991108]
[163,64233109]
[786,61651106]
[633,68180107]
[800,56404105]
[474,71408100]
[92,77335130]
[499,47947107]
[999,73876103]
[810,53733102]
[874,91180126]
[659,87375109]
[45,14482104]
[639,67616123]
[905,32976110]
[369,55694111]
[622,48290118]
[261,89730119]
[524,30489108]
[961,91817126]
[528,37434106]
[224,65455107]
[136,73765106]
[701,29472130]
[166,81863111]
[678,64574120]
[83,81736109]
[186,84870129]
[257,27316103]
[848,68805128]
[896,50050117]
[272,10370108]
[265,59275120]
[349,81043119]
[744,85527108]
[990,87792110]
[386,66194105]
[810,19550128]
[67,25437122]
[439,47290129]
[290,22563116]
[815,19047109]
[574,24424119]
[947,74384105]
[516,34089120]
[823,62951109]
[538,40006125]
[322,36945108]
[262,64138108]
[149,49655107]
[758,82690129]
[480,97211126]
[920,22676121]
[626,75749104]
[889,27292110]
[243,45330110]
[818,27151106]
[823,55789127]
[686,53326117]
[320,30745125]
[699,13149127]
[439,98648118]
[491,59927106]
[166,90017109]
[255,64215108]
[901,50719125]
[679,66606130]
[698,49647129]
[6,55032103]
[635,41050113]
[362,17918114]
[595,22960113]
[198,69089119]
[166,19971115]
[0,99623109]
[744,13443112]
[447,68726104]
[33,98002101]
[931,84013124]
[896,73183120]
[716,44921100]
[372,92551124]
[243,21861110]
[607,38171100]
[166,50357106]
[862,16387122]
[24,34982100]
[586,64482117]
[613,90825126]
[205,66457129]
[819,58522114]
[505,80174121]
[638,44213111]
[589,44393130]
[979,54139119]
[21,21067104]
[87,68599113]
[82,58164125]
[581,37235129]
[7,96773127]
[503,49075123]
[852,64277108]
[879,41306116]
[196,44069107]
[856,64524114]
[32,54317119]
[475,17937114]
[7,99703104]
[447,87683112]
[688,26403129]
[439,85216116]
[540,41008122]
[497,75050116]
[145,94154105]
[175,89845125]
[326,18020104]
[868,73526113]
[492,84122116]
[537,14739124]
[335,64078110]
[701,32911114]
[620,76424130]
[567,58792124]
[852,77784103]
[605,68941115]
[143,25886117]
[633,73037111]
[361,95262125]
[721,63894128]
[315,86295107]
[511,30176111]
[392,88194130]
[875,89068106]
[44,59960108]
[233,24455111]
[4,84456115]
[974,10203110]
[943,81841111]
[608,31415108]
[422,11602123]
[368,47992118]
[23,81324107]
[311,54455124]
[997,42315103]
[419,49402112]
[252,23524100]
[615,48341109]
[873,46018101]
[950,63391126]
[796,45767112]
[358,67871104]
[406,62371125]
[456,22156109]
[443,79191109]
[220,52088125]
[833,56973107]
[243,58714120]
[444,57732120]
[53,74950101]
[815,56812112]
[316,29228104]
[933,39150129]
[91,39169116]
[488,10056113]
[157,76260114]
[423,16565117]
[26,22475105]
[273,51685121]
[936,52193122]
[727,71575112]
[630,11178110]
[461,25596114]
[682,97739124]
[387,43030130]
[533,19973110]
[153,75140102]
[734,37266126]
[33,30641120]
[93,88333120]
[296,85206105]
[511,22521122]
[646,25677126]
[101,59479126]
[994,98249102]
[243,73558111]
[252,10015109]
[16,67798121]
[417,50470110]
[184,37566116]
[88,42521100]
[768,96296126]
[392,22401112]
[984,32448127]
[417,33411110]
[302,18008119]
[631,33641119]
[0,41041123]
[512,14086107]
[27,16951108]
[436,27193106]
[620,49491130]
[484,75014127]
[672,92441130]
[350,75540116]
[563,93080101]
[242,91608105]
[704,30420125]
[384,20107101]
[88,83678102]
[212,94357126]
[352,87359106]
[243,69051108]
[579,86172100]
[51,33853112]
[817,89753102]
[690,46339121]
[100,99260123]
[325,83245101]
[350,94135109]
[81,69823122]
[625,65605113]
[846,65199128]
[411,90679124]
[212,95183104]
[629,91396130]
[886,88056108]
[266,45445114]
[956,40803125]
[867,22112106]
[92,39397106]
[766,69073107]
[716,88352120]
[646,25490117]
[902,89213100]
[849,37724122]
[120,29182113]
[518,66981108]
[378,86494112]
[19,53497113]
[565,50920106]
[424,29228127]
[171,18550111]
[379,24342123]
[991,34702106]
[498,42384130]
[165,95573115]
[296,93824125]
[134,90794107]
[876,92276106]
[446,11979115]
[374,69409128]
[96,99488111]
[778,54323116]
[308,65494113]
[684,68071101]
[671,84661124]
[301,22525104]
[873,12382105]
[733,72356114]
[769,89168119]
[238,26697104]
[708,18227100]
[262,45124108]
[252,27656105]
[425,30377128]
[834,13557117]
[934,81697110]
[751,89560114]
[233,37971128]
[240,41496126]
[470,57248121]
[781,39099128]
[330,46725120]
[626,32752118]
[62,22555107]
[515,26314110]
[943,57518128]
[740,12533129]
[681,85212106]
[146,53239130]
[96,44433122]
[40,76776110]
[431,43666125]
[850,11085100]
[613,80316107]
[276,98315119]
[881,72390105]
[784,26812107]
[522,35763101]
[610,23200104]
[572,75002113]
[549,30311106]
[857,47465123]
[465,54949102]
[548,67169126]
[23,74229122]
[334,54347122]
[333,89522101]
[652,24350129]
[276,37738127]
[373,58018130]
[74,97815124]
[484,83788117]
[511,81566106]
[697,24469104]
[913,48749118]
[429,64770110]
[198,15126118]
[718,18043109]
[865,15489120]
[463,72195114]
[274,61043101]
[73,29513107]
[90,72442102]
[109,34202125]
[247,90563111]
[167,12259100]
[821,62290102]
[928,59026106]
[506,73995127]
[5,79017112]
[834,93439110]
[897,13742122]
[735,59156101]
[979,20142122]
[977,81462128]
[278,77097110]
[575,80889129]
[857,31695129]
[754,34473121]
[384,54888121]
[654,90988126]
[983,72792105]
[519,37119104]
[68,17504106]
[271,33444108]
[389,37582107]
[772,78095107]
[496,21838108]
[15,70441112]
[128,65989102]
[79,75709111]
[953,36099128]
[570,47247114]
[312,45821119]
[293,58690118]
[908,90644102]
[535,91249111]
[872,72488123]
[666,80166113]
[310,14117117]
[153,56141124]
[897,53465102]
[521,17164124]
[887,80374128]
[603,81858115]
[993,51215112]
[920,35898103]
[508,13940102]
[937,46961101]
[773,30205129]
[768,95060122]
[546,72664115]
[117,67171114]
[902,26484121]
[917,47477116]
[729,34444114]
[843,26723104]
[206,47219129]
[361,30925111]
[983,48408119]
[539,77180120]
[91,72888107]
[879,17195103]
[935,15295114]
[760,27490128]
[216,20935107]
[712,26943121]
[714,57697116]
[761,54942128]
[270,63134104]
[335,59072115]
[850,43519119]
[494,75466114]
[940,31587100]
[179,55813105]
[903,84346100]
[282,44537106]
[708,59480109]
[102,67798114]
[949,92950115]
[844,88671108]
[879,39442121]
[474,10236115]
[332,14825123]
[25,48355129]
[539,74489127]
[319,20241116]
[254,58751108]
[810,38958126]
[889,62617103]
[758,27687121]
[435,57235128]
[988,28774121]
[702,91447101]
[409,76148113]
[253,55196110]
[731,22742108]
[887,33127114]
[338,71856123]
[913,33785130]
[468,48570109]
[505,32430107]
[959,73872120]
[607,56907126]
[944,64707120]
[32,30429107]
[48,72397118]
[632,40975103]
[397,96448121]
[8,18078115]
[515,13075112]
[616,38143123]
[949,57112127]
[314,64748121]
[260,32096110]
[527,48788113]
[554,21973122]
[67,37660103]
[686,13941101]
[384,61243111]
[384,40228101]
[295,91931103]
[269,94213106]
[429,81097110]
[543,44289111]
[492,80025113]
[340,20037115]
[54,62733110]
[430,59963128]
[636,62509121]
[158,73579102]
[790,61241113]
[161,82880101]
[601,28282126]
[69,11415129]
[103,78019111]
[792,45735114]
[373,55468114]
[363,45244106]
[844,43102121]
[643,23329104]
[220,60959121]
[305,49469116]
[596,66584112]
[540,22933107]
[457,58028110]
[768,17744108]
[356,23189119]
[839,24498114]
[225,10838105]
[551,77712114]
[90,42350119]
[797,65504129]
[420,97936117]
[842,52743106]
[926,42604120]
[956,40141119]
[473,39285123]
[515,20228116]
[898,64453126]
[996,36675122]
[51,74748112]
[535,29550120]
[115,81919114]
[819,59269104]
[653,42770103]
[229,18841126]
[603,18103122]
[55,48206111]
[261,64773114]
[977,76054116]
[963,37894122]
[953,34908113]
[143,91571112]
[188,42776110]
[416,47166124]
[969,49708106]
[574,73840104]
[944,80241115]
[53,87174113]
[681,39856106]
[930,10617106]
[514,69918125]
[451,97863127]
[230,32423100]
[575,75257109]
[5,43675124]
[805,99837121]
[991,58619130]
[188,98639111]
[120,82833125]
[917,25368102]
[95,92813124]
[23,33789105]
[877,48569110]
[959,57675127]
[639,82309112]
[476,84692103]
[533,51905107]
[342,73974109]
[891,86229104]
[25,67551109]
[166,85455130]
[938,69505101]
[203,20538128]
[654,54415122]
[79,57068129]
[150,94486122]
[136,27242101]
[722,73458111]
[870,75466130]
[289,82075118]
[827,26621128]
[527,93224115]
[795,14932106]
[857,57114111]
[463,19214127]
[514,41380102]
[559,20650118]
[334,41455103]
[208,92129119]
[917,28211110]
[487,37555104]
[750,44691111]
[323,22245124]
[476,11637109]
[137,52121106]
[9,25879127]
[866,31133104]
[334,40069116]
[346,54345114]
[381,50372108]
[116,51550101]
[911,24664104]
[881,64570119]
[262,29020100]
[591,48325112]
[370,93426100]
[113,54195123]
[970,41766124]
[529,16655110]
[24,36821122]
[356,41459124]
[681,99776120]
[411,23158119]
[257,87420130]
[618,58362104]
[807,72509116]
[405,53696113]
[329,86050129]
[670,29058108]
[117,35478110]
[478,85017108]
[435,99136119]
[130,62641104]
[857,57414109]
[879,43022119]
[650,24239128]
[24,79474102]
[993,15562129]
[807,13701101]
[388,64182126]
[442,65788118]
[332,80465100]
[262,22993100]
[368,48607113]
[679,47588119]
[188,99983129]
[725,53594128]
[431,34741129]
[235,97083129]
[941,12336120]
[889,31557125]
[264,80075113]
[925,69614127]
[876,58278117]
[141,10990129]
[681,81567125]
[601,59402117]
[175,40084129]
[131,10640116]
[173,68713119]
[608,75255107]
[93,53105123]
[477,50952106]
[533,90078121]
[172,92057110]
[110,70535118]
[638,47130124]
[363,36664111]
[425,78627123]
[248,46456108]
[451,72519121]
[289,41564123]
[529,97809119]
[818,21491114]
[856,37543129]
[815,71312113]
[635,82754106]
[619,22030110]
[585,74583121]
[949,38182109]
[362,94648128]
[380,77824126]
[255,21312101]
[266,46895103]
[934,55819107]
[453,63780122]
[768,88082128]
[188,29173108]
[874,89759108]
[193,71833121]
[527,10060117]
[151,62733116]
[739,66149130]
[277,33779121]
[79,97857124]
[600,15030120]
[66,98085108]
[388,13503101]
[712,37785120]
[313,28365114]
[237,79369130]
[94,29408129]
[483,23378130]
[962,53170128]
[631,39260119]
[0,86776107]
[589,74953100]
[528,64306126]
[296,62975127]
[167,65818127]
[843,63279123]
[744,54202117]
[999,41598108]
[289,99871116]
[737,91012129]
[610,96753103]
[958,79779128]
[370,10413105]
[495,75203127]
[636,73670100]
[351,99883100]
[100,79930128]
[867,91578108]
[939,48548114]
[446,23835103]
[879,69893124]
[466,46015104]
[310,17948116]
[853,74316116]
[601,71831105]
[684,23225112]
[19,89135106]
[797,81296118]
[491,81045123]
[504,37565125]
[724,25331101]
[506,18775124]
[511,73857106]
[927,24851105]
[985,67839112]
[62,36471122]
[273,43403124]
[504,35253130]
[344,97837127]
[913,80881114]
[213,64670111]
[28,53001114]
[17,18372110]
[449,45547108]
[418,97101104]
[200,97367126]
[570,54602117]
[851,97307120]
[895,90269103]
[551,20984119]
[75,72124115]
[347,19924119]
[179,23924130]
[516,34545128]
[480,26320118]
[284,63750118]
[862,43159124]
[55,59768114]
[856,87933104]
[208,23830102]
[978,29205100]
[797,42221128]
[921,50351130]
[189,77746126]
[835,16489103]
[241,51927120]
[712,73429129]
[871,42765115]
[20,27424104]
[553,40903116]
[86,89331114]
[86,84763103]
[739,54270119]
[503,27611112]
[945,78601118]
[354,19516109]
[140,75640114]
[150,24125115]
[181,54512118]
[196,43640125]
[702,54743114]
[486,29434107]
[403,76935129]
[319,51525129]
[372,64070120]
[912,94655101]
[135,64371110]
[315,46166130]
[435,25904106]
[888,49746127]
[860,33185105]
[3,69069109]
[625,74698120]
[324,74229118]
[85,47530105]
[161,95913112]
[105,87019104]
[266,93599119]
[788,83246127]
[601,71512113]
[730,59328104]
[30,15198120]
[472,41463115]
[397,32994130]
[823,78484130]
[479,40237126]
[719,66619118]
[806,27450102]
[801,78579119]
[398,76844106]
[616,29444106]
[546,26082129]
[295,88977124]
[44,83612116]
[14,67602130]
[220,92134101]
[844,79009112]
[862,83726125]
[665,50752117]
[577,87182102]
[739,95738112]
[606,14729128]
[810,31003118]
[600,89819123]
[682,52206124]
[641,84457126]
[219,86541104]
[577,76805127]
[133,42276127]
[942,98458113]
[698,45669129]
[66,81513104]
[619,30671110]
[317,16359110]
[316,71381102]
[526,49230108]
[704,32944128]
[571,63189130]
[931,21805125]
[296,80034108]
[167,22306126]
[996,32529102]
[168,58120120]
[858,16819115]
[193,94923116]
[889,33845124]
[418,55084115]
[331,33950116]
[9,15132118]
[659,47703127]
[462,90267123]
[521,71765105]
[249,62638123]
[649,45354129]
[915,83105116]
[72,25811111]
[736,53698114]
[885,65532116]
[301,59422105]
[306,35650124]
[889,62014104]
[482,67136128]
[330,64768101]
[316,97870120]
[404,92120109]
[947,96600111]
[194,96738128]
[414,23140107]
[202,87135130]
[605,18616126]
[720,49443113]
[131,92587123]
[81,86782106]
[623,11221102]
[258,65874106]
[759,67943126]
[941,45757122]
[898,76542105]
[535,87093122]
[336,39772101]
[385,96202130]
[20,67859115]
[522,12115124]
[977,33235106]
[920,73248103]
[126,63178121]
[718,68160122]
[865,72536130]
[846,92394122]
[698,23095126]
[163,11220105]
[245,43658122]
[284,26295108]
[739,77383107]
[300,79782124]
[970,93762100]
[796,63721105]
[508,31482120]
[850,23271102]
[454,43209129]
[136,77318123]
[277,55289117]
[630,32512108]
[494,99702110]
[850,52507122]
[462,18327101]
[74,92182130]
[358,76765113]
[686,92857100]
[219,88704118]
[20,66868125]
[305,82443119]
[626,10644121]
[136,21161126]
[271,55262125]
[964,13654112]
[688,68533102]
[419,46113101]
[816,25718126]
[334,97102116]
[341,76702103]
[653,48206125]
[949,85674102]
[223,14254107]
[663,64254107]
[503,32910104]
[290,79768100]
[258,69105123]
[474,93088119]
[668,50708125]
[102,47919121]
[636,25627118]
[9,51936127]
[227,93415129]
[918,98729112]
[16,54848127]
[602,95407117]
[39,73741102]
[629,99909115]
[877,22268105]
[719,43910101]
[306,35080110]
[850,30900107]
[924,67829101]
[252,42944130]
[825,73834117]
[556,90850129]
[629,72470128]
[798,10348120]
[1,48065118]
[610,82190103]
[922,22910119]
[50,75243119]
[9,50619102]
[630,33444118]
[262,44980109]
[54,36932124]
[547,81158124]
[463,16975116]
[32,83901126]
[59,72267109]
[12,17096129]
[490,41125106]
[974,59195110]
[392,44222119]
[693,48406105]
[630,17972113]
[687,68387107]
[536,81875100]
[933,79842117]
[923,41978104]
[583,90885100]
[44,18768113]
[76,35740123]
[853,86349103]
[403,98615124]
[115,18844122]
[309,50444128]
[485,80873128]
[558,81200116]
[955,52486126]
[351,39681125]
[50,70380127]
[922,49678109]
[632,56250127]
[222,81907104]
[712,36913127]
[503,76269101]
[717,69514109]
[626,94558106]
[9,20061100]
[66,44582108]
[589,81451119]
[918,94119128]
[555,76496111]
[183,35042118]
[91,63139125]
[873,17543109]
[393,32217129]
[321,56427128]
[516,37314109]
[389,25993122]
[234,32345103]
[351,15599104]
[951,16004107]
[93,83807110]
[438,63322120]
[530,55759110]
[706,47398125]
[2,75677128]
[467,73465124]
[715,32911113]
[901,33197115]
[974,39705126]
[377,62817126]
[373,74081116]
[38,23872114]
[775,53698125]
[673,93766121]
[935,65134118]
[454,94434121]
[767,94014128]
[876,48046104]
[216,48727101]
[219,28018114]
[400,95427125]
[382,23888122]
[82,53097111]
[892,72841111]
[795,93586116]
[292,65854116]
[577,60915121]
[85,87553122]
[896,54375112]
[226,90188123]
[262,47416119]
[95,33090118]
[537,72953130]
[605,99435105]
[218,13028110]
[55,50334109]
[845,91526126]
[778,94504109]
[368,24124108]
[549,42433116]
[307,70036120]
[346,12755114]
[346,80607126]
[656,41069119]
[160,71121123]
[646,27546103]
[818,30362104]
[19,96883117]
[745,83945111]
[498,25990101]
[341,42276103]
[368,83661107]
[928,48667128]
[89,77913127]
[125,13188119]
[679,44194113]
[648,71785110]
[907,14496100]
[780,18594117]
[792,12013125]
[734,18877109]
[541,16451122]
[289,92121110]
[732,35328121]
[172,33854111]
[923,79285106]
[102,86075115]
[257,91980112]
[762,12785107]
[580,16693111]
[281,26137127]
[0,55467127]
[530,31317126]
[235,86529110]
[349,82833100]
[593,58184112]
[760,30037121]
[298,68004118]
[341,27789126]
[768,84766102]
[337,39167130]
[711,20238128]
[4,30997103]
[499,87517104]
[338,35057130]
[842,16064100]
[234,61049118]
[216,76874111]
[678,49310121]
[716,42613118]
[322,49034113]
[825,92211108]
[771,81284128]
[668,53283126]
[601,31979102]
[999,10958112]
[976,33898122]
[680,61380112]
[264,68528120]
[303,41428109]
[338,23501120]
[471,88713113]
[188,79715126]
[558,90723106]
[868,98403105]
[316,68549122]
[315,61055112]
[285,88116120]
[329,76999111]
[183,15251110]
[924,96102128]
[521,41957108]
[909,82131110]
[997,69636112]
[957,95572115]
[514,83472104]
[45,75237116]
[341,42426110]
[784,42515114]
[569,58570116]
[647,43179101]
[999,66744125]
[455,30335118]
[737,36163104]
[358,72448125]
[112,40450119]
[188,67359106]
[787,67042114]
[28,77516118]
[752,20507104]
[382,82684105]
[341,60726114]
[685,68276103]
[555,21837102]
[731,10571112]
[452,13071120]
[184,77607101]
[445,42306116]
[673,97089118]
[89,92750107]
[601,63344105]
[881,80224103]
[238,68324113]
[646,35162106]
[625,12291129]
[343,90621114]
[956,36835104]
[634,85243103]
[194,94476115]
[808,89981106]
[893,65030109]
[119,37530115]
[636,54649115]
[197,70958118]
[577,20992109]
[419,30627122]
[953,50204109]
[708,94953127]
[620,73949129]
[0,71756111]
[195,69578119]
[845,59480121]
[887,52428114]
[313,26045110]
[416,31421126]
[625,58243115]
[863,65392104]
[860,18764128]
[819,97252101]
[568,90059107]
[241,45667123]
[120,95182121]
[526,55277125]
[463,22005120]
[646,39754102]
[503,78837129]
[952,23568121]
[288,19576128]
[632,86023130]
[656,16137105]
[703,53401125]
[804,30267112]
[128,56730102]
[621,43650114]
[850,79274116]
[796,86261115]
[738,51772116]
[77,39313116]
[519,11659126]
[11,93847124]
[692,33449104]
[383,77421110]
[350,11192124]
[175,27128101]
[899,37442125]
[234,17752111]
[102,19541117]
[992,24750106]
[24,77586113]
[942,46125104]
[684,19446126]
[128,71970112]
[660,23412107]
[932,54101130]
[365,14945114]
[47,33163115]
[284,44033115]
[513,45759120]
[861,94093126]
[594,60976116]
[981,96191116]
[687,27880129]
[446,23156102]
[281,23386125]
[259,23150130]
[77,51556130]
[379,47894128]
[215,94984121]
[568,86249117]
[165,77954112]
[108,88858128]
[931,37508101]
[372,63297130]
[826,16431121]
[958,23467129]
[38,45347102]
[939,84077123]
[34,95386108]
[8,82571107]
[884,53812122]
[12,68834110]
[260,64472113]
[304,23373122]
[49,17969124]
[251,56764128]
[806,35838115]
[845,92322112]
[565,16967107]
[581,66920120]
[824,41201126]
[615,55158122]
[274,68233110]
[854,41833102]
[428,37269120]
[442,39396126]
[72,20972113]
[758,24327119]
[162,86588109]
[691,91984104]
[469,27264106]
[434,45630126]
[225,25786130]
[367,13296129]
[206,24545101]
[312,49858108]
[499,51764117]
[717,22292127]
[555,56929118]
[214,49682100]
[871,39379116]
[962,89184102]
[326,14807103]
[822,42052116]
[970,59496104]
[248,69933102]
[211,50382121]
[904,52093122]
[661,38795106]
[148,26447112]
[171,51823113]
[389,38389113]
[38,48806106]
[689,94401128]
[547,94038103]
[809,65273127]
[71,38217103]
[378,52634102]
[534,95162120]
[718,88182112]
[477,22369129]
[133,75478111]
[473,40536103]
[186,51521114]
[823,60182107]
[75,16937102]
[674,14154108]
[706,53762103]
[463,78350118]
[539,83661106]
[252,19461104]
[128,34662120]
[136,60391118]
[582,12698123]
[152,62762101]
[750,15920119]
[755,90558115]
[684,90298125]
[288,89141126]
[289,97497105]
[646,11488108]
[979,29019105]
[690,18126122]
[325,80009108]
[115,75715107]
[915,42933118]
[521,95102126]
[388,18133101]
[848,63216124]
[454,59063123]
[480,61333110]
[713,57679106]
[327,60941105]
[224,39159127]
[808,24399127]
[403,89301106]
[858,76692128]
[343,77691121]
[333,65135125]
[679,81761122]
[832,86843128]
[404,90491109]
[613,91885104]
[183,39887123]
[198,31823124]
[298,44474125]
[549,61848117]
[372,47418114]
[355,37087119]
[961,33239103]
[190,60162111]
[547,24342116]
[91,19162117]
[425,23263105]
[340,35263130]
[587,52196104]
[219,49108109]
[767,40676121]
[629,10044108]
[81,64298119]
[726,90860104]
[778,87015121]
[225,62175117]
[848,53981109]
[28,29601111]
[673,40827128]
[976,85588112]
[414,84598119]
[243,16634103]
[130,21402104]
[775,80734113]
[203,81198114]
[269,49946106]
[351,81247111]
[276,12247103]
[110,40051105]
[216,17976117]
[120,87663106]
[931,36356121]
[657,11936105]
[867,53877107]
[762,52397117]
[481,57287110]
[390,60202102]
[956,53924123]
[759,15468117]
[258,59681128]
[708,65109101]
[814,49860116]
[725,38642118]
[81,42273108]
[762,17938101]
[538,37636103]
[582,18705122]
[705,58972112]
[787,58364118]
[149,97755100]
[728,51568113]
[693,32709127]
[124,87845104]
[563,14240104]
[184,36348121]
[238,25053124]
[976,65602116]
[378,31925106]
[248,21143129]
[553,94948101]
[380,48140116]
[302,41419128]
[954,83053127]
[879,49601106]
[584,58632123]
[96,57978122]
[122,68449125]
[476,17667125]
[146,34204101]
[472,77074104]
[44,58682108]
[184,96284120]
[957,78481121]
[345,28273112]
[712,98611123]
[121,99938113]
[288,45246103]
[852,18405115]
[380,61506119]
[574,96710104]
[910,24961125]
[126,34865119]
[405,34026130]
[93,92129101]
[361,90086114]
[1,90974104]
[44,24632120]
[920,19885123]
[329,44823113]
[230,52097114]
[50,33377111]
[797,30036125]
[478,44620112]
[293,19042114]
[243,90745110]
[434,56831116]
[574,82300105]
[954,58499101]
[546,77452115]
[975,87348121]
[170,83112129]
[716,36172101]
[990,55801121]
[784,42095124]
[379,56362127]
[34,14769113]
[10,61622124]
[209,63885130]
[313,29986123]
[338,45845106]
[803,94073112]
[95,83894129]
[326,49063115]
[680,78591114]
[647,34173129]
[976,19956113]
[173,63127118]
[685,91722106]
[461,34070116]
[676,10365128]
[988,78959112]
[818,50281112]
[266,90830125]
[942,24451111]
[504,49957110]
[583,34765130]
[113,34489112]
[980,90153107]
[531,96092105]
[237,10908130]
[130,66344107]
[400,34400116]
[644,10415121]
[244,42149120]
[904,49351110]
[73,52606119]
[521,60078110]
[114,22602105]
[285,46233125]
[362,66563108]
[787,61873113]
[93,13452109]
[635,88935106]
[56,21882120]
[153,38850110]
[163,78445105]
[891,44645129]
[662,35304105]
[53,10697118]
[739,36231104]
[425,90127102]
[478,83280122]
[547,95503112]
[752,60265122]
[7,86102124]
[276,75446108]
[612,21086126]
[667,64474127]
[825,85385121]
[438,56147114]
[483,60577124]
[533,21828112]
[597,63947115]
[557,20422125]
[7,44432117]
[903,57755123]
[118,24028108]
[856,82524105]
[78,77677125]
[496,10525115]
[170,75036126]
[764,97526114]
[6,44899104]
[473,49897129]
[481,87186118]
[105,15575108]
[937,42262130]
[689,74841129]
[765,55118110]
[561,86928111]
[107,76288123]
[178,41985123]
[691,77016115]
[341,83707103]
[1,32656117]
[19,49112126]
[199,74509120]
[277,67945120]
[117,77572105]
[814,62425110]
[650,43022116]
[468,26381114]
[385,55833128]
[233,19131123]
[993,82994104]
[623,28437111]
[335,59328130]
[940,57790106]
[665,91121114]
[307,84696109]
[266,67457128]
[533,98448119]
[652,83169129]
[510,71588108]
[370,16111127]
[219,39187117]
[175,35229110]
[555,94414130]
[34,31820129]
[84,55262125]
[465,78059119]
[65,26674129]
[240,38555115]
[219,83386115]
[453,51930125]
[291,46467110]
[109,97299109]
[32,40023127]
[704,37635113]
[885,86130116]
[336,49543103]
[744,94690118]
[407,28762102]
[295,24140114]
[655,99963112]
[13,65299104]
[442,80888121]
[893,72563130]
[969,99781100]
[533,16482124]
[228,62404125]
[59,76211121]
[528,40186104]
[799,12985103]
[483,53999100]
[254,20508122]
[300,27395116]
[793,74661113]
[263,49310110]
[969,77967109]
[638,31334110]
[534,27716108]
[394,71605106]
[451,58570106]
[116,60225109]
[277,41656114]
[717,40793106]
[544,34674107]
[130,77315105]
[976,88039114]
[861,89148104]
[368,20479124]
[63,47518126]
[859,28816122]
[819,74003123]
[672,95126127]
[629,76778103]
[143,32146125]
[239,42284105]
[358,97291118]
[832,92338102]
[732,54088102]
[474,90027120]
[570,10921117]
[123,90983125]
[260,86454108]
[131,70286119]
[233,93709110]
[476,40910123]
[25,15011127]
[326,24025100]
[57,86094100]
[729,46880128]
[838,86240128]
[720,44337129]
[459,28225107]
[704,48710117]
[41,21689130]
[452,68815117]
[558,98322109]
[119,48926112]
[161,67452116]
[929,95589101]
[922,57124108]
[261,36142118]
[579,90868120]
[736,51649120]
[962,95205101]
[710,79585114]
[439,28542104]
[357,33648126]
[363,91042109]
[800,10588120]
[58,39869111]
[318,24268104]
[173,79841107]
[455,49035125]
[396,52628128]
[765,53743110]
[890,97863126]
[764,52231119]
[266,10303104]
[346,45543100]
[64,17333100]
[515,71766114]
[534,84518112]
[896,56414124]
[359,41450127]
[665,83503119]
[457,17525123]
[849,39738117]
[929,50640115]
[489,49265117]
[548,58542109]
[662,90882112]
[592,45319125]
[696,10708123]
[547,48455116]
[112,68289125]
[368,60362113]
[552,99316100]
[857,17807121]
[209,28590127]
[934,47153102]
[51,19500109]
[719,72096124]
[797,81575107]
[616,59394117]
[644,84892123]
[71,52664130]
[150,11338125]
[370,35599123]
[411,62325107]
[987,35122116]
[476,18491121]
[315,84329101]
[509,15863106]
[583,61991116]
[233,62121115]
[718,20888129]
[474,11744122]
[143,12253100]
[103,98976119]
[733,12541129]
[564,78943110]
[498,79195116]
[527,81468126]
[587,84432114]
[612,92025126]
[330,90526107]
[556,85764127]
[417,56534127]
[645,53894100]
[179,30836107]
[428,24901106]
[986,42109112]
[91,84342124]
[538,58067118]
[688,23255124]
[676,68969123]
[74,73208111]
[102,24006118]
[431,91295105]
[456,49823110]
[886,37698130]
[278,28611105]
[366,56314116]
[537,33962122]
[210,57894125]
[734,42293103]
[257,60948101]
[868,98427117]
[97,61106120]
[569,77769125]
[839,90357122]
[94,34787129]
[418,54627129]
[383,46079111]
[46,39879122]
[828,19015129]
[585,78687105]
[962,85476110]
[334,56565115]
[811,52417108]
[208,60741123]
[269,58043114]
[24,35249107]
[892,46188104]
[14,90990112]
[687,68600103]
[456,80247124]
[838,63908106]
[768,15384123]
[828,77263111]
[136,41580126]
[944,15878107]
[244,55270106]
[364,31872101]
[898,31322101]
[167,11920125]
[792,45676101]
[487,47311103]
[825,99297103]
[290,95662117]
[822,40882108]
[131,51603124]
[769,15959107]
[359,46703126]
[688,68170100]
[943,89206117]
[613,71432102]
[142,76339117]
[947,29517124]
[60,69853113]
[925,73520112]
[514,22494125]
[560,66972113]
[344,83985106]
[19,95647129]
[91,60102115]
[58,53517103]
[462,83295115]
[196,10608115]
[591,64621103]
[982,63477114]
[554,10025121]
[164,73290111]
[847,35064107]
[434,61961120]
[12,98157124]
[290,11272108]
[768,65292112]
[251,77906108]
[346,77321118]
[406,38451111]
[663,33764116]
[660,58815101]
[838,56903112]
[553,89131109]
[65,76577110]
[883,21778116]
[499,84972112]
[205,39381112]
[910,84740124]
[737,13584100]
[0,80764111]
[971,22759125]
[235,73950122]
[817,86133112]
[340,95212105]
[5,77169125]
[714,95707123]
[23,72816122]
[791,63991114]
[995,98047105]
[826,13696101]
[610,47097128]
[789,54582103]
[501,27797126]
[310,29676122]
[335,52845120]
[157,43002113]
[874,19400123]
[815,84775104]
[371,97431123]
[751,11498128]
[775,92142113]
[173,22091108]
[3,98237110]
[238,10337117]
[16,80815107]
[954,21225116]
[188,19220106]
[548,80324124]
[721,14432126]
[706,66449110]
[30,39498104]
[1,46097130]
[168,79909109]
[933,25617102]
[628,44371104]
[1,51795111]
[92,72188121]
[825,86061128]
[650,48522105]
[128,11389115]
[628,18504104]
[110,69576103]
[979,48989130]
[817,22674124]
[585,86511107]
[506,63700107]
[418,18833129]
[184,35825118]
[566,77313117]
[784,65999127]
[279,83364123]
[550,98270114]
[439,77407102]
[52,58276106]
[569,32671128]
[193,47500121]
[400,33344118]
[380,50767113]
[925,59211117]
[294,42681106]
[199,85519107]
[69,30603123]
[306,26051124]
[166,86216123]
[708,23340123]
[59,78109111]
[193,20580103]
[274,59994128]
[332,55903119]
[92,36696107]
[562,65999107]
[437,22259122]
[98,85006116]
[663,16500110]
[193,86086101]
[548,30557110]
[38,65488115]
[16,39294114]
[308,38151107]
[835,37463123]
[790,20983103]
[785,98250124]
[700,11325111]
[736,17201120]
[19,60696130]
[662,31771106]
[306,50321108]
[922,37882108]
[11,65652125]
[866,30311107]
[544,88924110]
[342,20560130]
[378,16256119]
[272,16551113]
[31,41210108]
[467,21623114]
[954,23025117]
[912,96990101]
[232,93980125]
[204,11873117]
[889,39018101]
[684,70558114]
[929,76595117]
[632,70235121]
[252,68908100]
[562,81064121]
[517,60117108]
[949,17806115]
[995,28894110]
[591,81570117]
[873,43165130]
[172,92452108]
[462,84546124]
[766,19228118]
[272,76050127]
[195,22782101]
[600,12535112]
[440,46714125]
[334,11434121]
[396,84185117]
[703,48348116]
[499,11484127]
[150,99624121]
[329,12370106]
[467,84379101]
[33,67561123]
[840,77801103]
[324,53155105]
[209,41519110]
[50,26626106]
[833,61068128]
[152,88422113]
[220,37319121]
[773,76348123]
[661,78355112]
[961,69772112]
[349,48751105]
[508,91791130]
[264,22164120]
[47,82287110]
[66,71083125]
[638,87797110]
[263,36441130]
[398,14978111]
[930,44820105]
[963,21178102]
[373,89519130]
[513,94787120]
[764,35044123]
[386,45173114]
[803,72641122]
[751,71058128]
[677,88258105]
[251,55947120]
[428,31959128]
[777,83302105]
[931,82079129]
[420,29787100]
[464,56603120]
[907,64705110]
[356,52425102]
[706,76374112]
[956,78844120]
[85,78956115]
[276,86067115]
[490,79318114]
[768,64109105]
[640,25792120]
[648,92026116]
[190,38008127]
[661,33685129]
[521,57960117]
[390,13776106]
[98,17941105]
[579,65610130]
[759,94279116]
[942,24943117]
[676,35043126]
[840,11232129]
[503,99112116]
[642,69847101]
[877,93581121]
[278,42618120]
[622,43814110]
[432,39671106]
[452,77432118]
[997,80143105]
[709,76365130]
[986,68389125]
[850,42912118]
[119,50311111]
[396,48218119]
[256,60213118]
[790,80135117]
[790,36655130]
[764,34226128]
[610,39432121]
[637,12034102]
[108,70563106]
[424,17309117]
[156,48275115]
[911,33657130]
[312,15627111]
[841,99811102]
[67,55984108]
[98,94299130]
[906,94004118]
[70,57342127]
[70,34353122]
[116,56542111]
[76,94241125]
[294,21202103]
[882,97626126]
[892,77375128]
[534,74628128]
[170,83376129]
[590,98857104]
[119,12389127]
[121,91689116]
[821,68274126]
[147,60226107]
[162,70685116]
[226,92985120]
[227,97538129]
[688,22419128]
[689,27282119]
[745,98919124]
[549,50501127]
[203,80771102]
[931,73361117]
[278,46515108]
[50,15138113]
[433,69537103]
[420,17663106]
[823,90353107]
[366,31801103]
[338,98991112]
[451,97039118]
[812,97014100]
[832,26256106]
[360,11755115]
[197,89104115]
[160,82210102]
[35,44068117]
[379,93100129]
[5,26228103]
[77,35077103]
[406,88934110]
[839,66105109]
[976,90118102]
[558,54577100]
[867,79998113]
[842,45645128]
[179,61272116]
[440,22308111]
[228,21330124]
[140,44104125]
[414,31959129]
[88,46516119]
[737,97700109]
[837,60459108]
[239,33773103]
[310,28349120]
[716,18925102]
[814,19631116]
[124,81143106]
[569,10795112]
[341,44273127]
[271,41921104]
[364,82854102]
[800,69550116]
[512,26637115]
[508,25151113]
[126,32298100]
[914,54043123]
[520,78221101]
[697,48445119]
[234,51363124]
[919,65192129]
[418,12835120]
[758,84501130]
[941,89715119]
[470,22987122]
[258,85802116]
[264,47000119]
[879,32018118]
[498,45746114]
[539,66732115]
[171,23203128]
[898,52395111]
[640,75966103]
[428,14463126]
[305,73224109]
[622,14602129]
[799,71571129]
[229,20328114]
[799,54674116]
[329,44399106]
[727,12723128]
[9,79383121]
[719,40257104]
[690,82004103]
[877,42278130]
[640,68218129]
[849,23959115]
[944,74507103]
[63,12871127]
[663,90199121]
[140,38951115]
[282,95328128]
[679,63913117]
[441,53181126]
[605,85911108]
[179,69259127]
[779,95577115]
[530,70409111]
[191,88529100]
[128,58793100]
[902,22416103]
[234,79188108]
[55,70789122]
[668,74027113]
[880,62520106]
[723,31552117]
[875,61786115]
[256,25586119]
[939,14164122]
[894,50337120]
[986,81246130]
[135,63452107]
[346,98615117]
[827,24028119]
[103,68771109]
[888,18677105]
[86,67461116]
[231,69803103]
[940,77406117]
[167,23854122]
[418,30698127]
[816,88418128]
[750,29220104]
[663,74960127]
[981,58851108]
[557,75639112]
[46,29779101]
[251,69089113]
[954,32106102]
[16,59487113]
[394,60286125]
[853,39235117]
[744,53695121]
[806,74124112]
[69,31507107]
[73,79570104]
[483,99323107]
[247,54311113]
[523,47624112]
[743,14289119]
[531,19244118]
[243,27050121]
[782,97862109]
[677,76805121]
[121,86213100]
[21,79547101]
[225,79115129]
[383,91606126]
[542,48865122]
[59,49023113]
[779,58640112]
[99,25934102]
[632,13931130]
[621,16486104]
[561,32786129]
[850,37759124]
[4,17014109]
[586,43669102]
[452,48922116]
[563,82966115]
[482,70068129]
[50,97313116]
[741,85422101]
[944,29973101]
[783,20144129]
[512,69096108]
[458,56151111]
[479,83087126]
[245,31238112]
[472,82416127]
[14,22092126]
[434,11524106]
[231,13375113]
[317,55622104]
[217,61536122]
[240,60302105]
[932,85502129]
[390,67613117]
[796,29077108]
[864,53358102]
[108,56153107]
[447,28064109]
[339,31554128]
[205,16990127]
[471,84614122]
[996,39824124]
[636,46606110]
[863,10424107]
[9,75070126]
[788,23459108]
[395,81449118]
[942,42707122]
[556,78708127]
[246,90913109]
[393,19506127]
[771,89050116]
[697,26601119]
[859,92949103]
[165,54756122]
[590,71847104]
[12,79940107]
[698,17916113]
[674,15853125]
[34,12272108]
[102,86567100]
[136,71522124]
[93,88692123]
[470,17834109]
[119,14530106]
[548,84667129]
[501,98188124]
[733,26498106]
[843,93863121]
[531,74462129]
[101,82942112]
[916,12583105]
[609,93069115]
[104,44955127]
[986,51730124]
[816,32728109]
[670,76054121]
[608,32050125]
[631,50500100]
[80,97835111]
[552,43527117]
[566,23890100]
[614,38262118]
[483,95702121]
[791,89035109]
[371,13284114]
[79,83412122]
[77,97063117]
[414,76949128]
[956,79295121]
[567,79892104]
[49,30680125]
[345,89231112]
[286,59579105]
[140,34480122]
[783,40181109]
[947,34332127]
[450,99094114]
[58,37670118]
[127,89895123]
[706,51654125]
[85,91853121]
[95,36314115]
[26,56061113]
[80,53504126]
[601,44460101]
[938,94834109]
[573,55253103]
[485,59889130]
[35,76997102]
[619,71867108]
[606,15872128]
[155,82150123]
[399,16869117]
[83,68428127]
[220,84096101]
[723,32357117]
[823,14659112]
[705,90929123]
[817,96096121]
[781,89585118]
[695,13704110]
[153,12065118]
[410,73171107]
[250,37245111]
[862,55617121]
[157,60296101]
[30,87571106]
[537,51669108]
[341,42436122]
[166,98099104]
[527,76297102]
[98,79664112]
[34,13434121]
[139,99954100]
[849,20663104]
[753,68401111]
[0,34303129]
[686,29184111]
[221,61421129]
[288,47403107]
[48,48309105]
[202,37824108]
[502,10545100]
[997,34638116]
[405,32539129]
[80,76888122]
[557,63239111]
[269,35089101]
[5,92868100]
[426,20271100]
[493,82502130]
[581,58854110]
[262,14107125]
[217,62812123]
[647,16064109]
[45,10625102]
[936,15737109]
[247,22265125]
[45,72821114]
[813,27092122]
[999,23950107]
[316,39942120]
[428,61003123]
[314,39449110]
[25,54742100]
[172,90598123]
[876,78966107]
[207,31177128]
[315,23549109]
[170,84581103]
[271,14725128]
[951,63717106]
[487,47580124]
[402,75752108]
[251,72721103]
[952,98255110]
[432,86182127]
[442,73966105]
[77,61179106]
[314,93001101]
[4,38566105]
[848,47378114]
[968,50781114]
[903,63652125]
[520,41395125]
[988,49675121]
[725,62758118]
[432,97028126]
[852,49509130]
[479,96246119]
[245,88415126]
[655,61876124]
[260,23952108]
[124,78688105]
[267,37703125]
[373,65444102]
[553,42754105]
[424,36481126]
[304,69926117]
[45,18094103]
[738,79708104]
[202,49110115]
[688,72601107]
[840,49718110]
[261,55140122]
[819,90838100]
[711,72651110]
[837,76396113]
[50,89721116]
[965,16055114]
[297,38529119]
[576,54665124]
[614,42550112]
[386,43413100]
[729,54330115]
[834,74098108]
[909,11600107]
[956,27337112]
[374,80334128]
[778,65248115]
[868,67127119]
[873,21565129]
[805,35760115]
[189,35584126]
[910,21503102]
[59,27696115]
[597,23353129]
[378,70054119]
[585,60696126]
[828,20855130]
[510,49199103]
[855,87793130]
[127,74494106]
[582,40833109]
[442,42133128]
[373,99592127]
[703,21166104]
[286,44946109]
[262,58876129]
[789,37789130]
[77,41952124]
[633,61979110]
[528,57872109]
[656,92805112]
[147,91656109]
[69,45954120]
[790,68952124]
[287,37996114]
[713,49187108]
[919,11894107]
[814,28770124]
[183,53506104]
[809,80284104]
[204,29230110]
[378,88812122]
[473,46925121]
[82,91827103]
[241,27160113]
[55,65158103]
[895,45915103]
[776,53093111]
[61,90027104]
[194,20311103]
[178,83876128]
[870,79050123]
[2,65548103]
[68,97966129]
[961,70413128]
[265,63987112]
[312,19728119]
[702,98355102]
[97,58843113]
[415,85896107]
[14,52431106]
[476,96297105]
[265,19087106]
[688,18681129]
[597,40840120]
[184,34148128]
[916,85103100]
[244,35065111]
[22,71550120]
[548,90293124]
[935,26217115]
[69,30355125]
[101,49798130]
[299,63612105]
[88,61576109]
[622,35294113]
[986,45394113]
[534,59940115]
[112,52877102]
[523,16455103]
[265,91860104]
[389,10485129]
[451,55233121]
[610,50895100]
[155,43335127]
[848,34546112]
[804,31369121]
[712,88755109]
[239,13630106]
[124,47504107]
[721,23231111]
[526,70046113]
[467,83838123]
[685,50804128]
[670,59972109]
[488,87879108]
[317,44021115]
[767,64645122]
[109,24088106]
[481,57964129]
[147,37746100]
[443,55459106]
[566,35735108]
[611,81240124]
[895,79049123]
[401,65590105]
[860,38940107]
[12,49878123]
[390,56023109]
[588,78287120]
[491,85567105]
[366,83674115]
[443,86008100]
[456,19262127]
[350,57180103]
[645,90158121]
[591,76976102]
[61,14261130]
[743,32650117]
[119,89616120]
[873,41059128]
[991,54108105]
[34,11158100]
[901,53705113]
[268,12101123]
[106,36293101]
[271,75750106]
[654,87658115]
[375,51084126]
[441,80490127]
[363,28552114]
[808,37931121]
[855,17698115]
[371,46129120]
[888,23401106]
[187,81609110]
[268,76652102]
[68,63919104]
[752,15521109]
[445,25154124]
[554,29230126]
[355,37427126]
[132,13512118]
[256,67981128]
[529,76646122]
[401,17661102]
[337,87627120]
[717,56964112]
[461,25064108]
[840,94362129]
[984,66659119]
[409,45865112]
[513,76462120]
[185,95123114]
[533,81907125]
[946,58968113]
[765,51335120]
[385,85875118]
[664,77173128]
[955,45890100]
[578,79853118]
[774,17441128]
[367,79518129]
[139,38517118]
[0,12755118]
[253,94910106]
[127,63601112]
[543,83545120]
[829,28363100]
[940,54777101]
[669,34400114]
[89,27084108]
[581,41594104]
[948,37349108]
[736,92167122]
[184,16988119]
[161,43097125]
[549,45476114]
[566,49700112]
[249,97176123]
[424,43477113]
[83,59283108]
[355,30067112]
[25,82000129]
[659,22469121]
[491,97787119]
[143,35809115]
[115,70295101]
[762,64913102]
[482,21698103]
[376,59376130]
[269,75208125]
[348,30215118]
[572,88270100]
[366,95416112]
[647,98073130]
[874,15989115]
[443,69509100]
[770,22374103]
[35,43930103]
[654,14193130]
[554,24062125]
[623,24403125]
[537,71640112]
[504,14121102]
[449,75534121]
[712,18345129]
[658,70885125]
[603,75145129]
[790,30842107]
[518,91061112]
[18,79777130]
[687,57448108]
[721,18788105]
[716,32348127]
[138,90287125]
[915,59319109]
[924,59590103]
[912,99950107]
[744,76853126]
[458,48637114]
[500,78420124]
[590,20827113]
[883,61078118]
[14,83438111]
[462,14301101]
[788,92601111]
[562,20848114]
[146,50578107]
[330,30719128]
[343,77257106]
[362,67610127]
[97,86837110]
[144,10355105]
[350,26526130]
[876,46133100]
[883,68066126]
[118,45397113]
[822,60618120]
[687,62395129]
[680,60342116]
[496,82120122]
[738,75860102]
[16,33326102]
[238,66360121]
[930,42780108]
[429,98809100]
[275,39337116]
[114,40601121]
[602,10291126]
[425,97793116]
[668,27235112]
[313,99064122]
[871,96223114]
[51,83087109]
[725,56609128]
[124,97846120]
[982,79862130]
[924,35118113]
[6,20716101]
[127,64462112]
[864,50937115]
[916,61031130]
[186,27391105]
[242,47929126]
[535,22709117]
[714,65413127]
[321,92577111]
[901,44907130]
[655,65654110]
[676,75236126]
[119,58104113]
[518,91879107]
[635,61936111]
[263,18385122]
[119,62638105]
[734,40909113]
[407,58529105]
[398,31240122]
[824,90402101]
[63,95608107]
[64,53356130]
[671,31879106]
[860,62326119]
[989,57615122]
[317,21673125]
[592,36028130]
[993,24078108]
[218,65405115]
[995,49215100]
[951,36369128]
[301,94799119]
[855,35542107]
[241,29773107]
[47,47744127]
[70,78063103]
[12,34169122]
[53,93608101]
[467,84065108]
[240,36122112]
[606,37434102]
[938,38051126]
[148,11846123]
[678,64037114]
[517,36384100]
[373,62066106]
[737,74629113]
[716,38415111]
[961,44666112]
[549,16681128]
[301,83156121]
[307,36364111]
[208,94849121]
[939,94448113]
[255,72601108]
[702,33377122]
[629,58574123]
[972,13436120]
[520,40940110]
[205,38886124]
[709,30606106]
[931,83243115]
[984,64452109]
[640,50789128]
[302,77344108]
[639,15465106]
[56,23803121]
[789,48858103]
[145,71202124]
[853,38144100]
[512,87602109]
[279,72609105]
[391,90315129]
[668,77384129]
[101,39718126]
[836,13118104]
[570,37149118]
[232,23170101]
[152,61284119]
[26,60362104]
[711,41006122]
[949,64011102]
[326,88064101]
[838,94363122]
[531,47376123]
[283,26577120]
[314,14104127]
[376,34039100]
[901,74159107]
[102,12330107]
[516,86537120]
[331,24976107]
[919,18589108]
[135,99038106]
[34,40238111]
[11,75124109]
[796,71950109]
[953,78906115]
[501,59945115]
[676,93545112]
[696,92157113]
[365,24631123]
[16,29800114]
[13,74267118]
[538,10607111]
[750,34803115]
[310,31939120]
[98,19827122]
[819,54162126]
[937,29458121]
[890,34990124]
[63,10844123]
[889,41685111]
[53,80057119]
[364,36440116]
[430,74748106]
[716,34393126]
[285,78239102]
[68,33743111]
[671,98130120]
[25,25137103]
[876,29316116]
[315,49945115]
[152,48714118]
[796,44091117]
[435,94269111]
[106,80910115]
[246,44573103]
[864,18980107]
[567,71759124]
[937,94113112]
[946,91161113]
[770,66339115]
[199,17676100]
[940,69550104]
[655,99903126]
[69,66204126]
[971,56491114]
[607,10012116]
[398,66340115]
[298,20972114]
[163,61385124]
[398,47369127]
[248,95880104]
[168,42969114]
[608,95400115]
[114,76930104]
[400,63681127]
[580,29965126]
[939,48981102]
[297,86858128]
[96,70512103]
[813,70863120]
[838,93048129]
[842,73100107]
[518,71639112]
[356,82325113]
[900,46647110]
[558,95729117]
[917,73161118]
[820,65655113]
[739,50725102]
[892,34667104]
[327,14722109]
[983,48794117]
[249,11667108]
[775,83152107]
[658,41089126]
[473,93979115]
[280,93837112]
[660,76949106]
[903,69002103]
[817,70428114]
[518,61565116]
[504,88479114]
[64,20349105]
[662,70961100]
[827,42666113]
[468,33325106]
[244,55787128]
[235,58812126]
[646,64522107]
[223,95248126]
[588,42098115]
[740,27567130]
[115,50413112]
[410,28244118]
[8,81655120]
[343,42201105]
[400,99978120]
[175,20414105]
[767,26242109]
[144,39424104]
[775,50265120]
[787,53987106]
[242,43642103]
[980,86968130]
[706,94830122]
[598,12783118]
[951,45114119]
[280,23096101]
[328,39679123]
[773,64697127]
[112,42017125]
[542,75810105]
[938,68050117]
[94,70429105]
[944,89858104]
[675,56364101]
[372,66758115]
[622,23152106]
[487,90661105]
[337,73784129]
[763,53419128]
[388,39872115]
[581,99894112]
[348,47211122]
[200,68827104]
[589,51622103]
[834,59097102]
[947,33327121]
[981,94127105]
[472,69458119]
[250,85617104]
[940,87043103]
[148,38948128]
[506,45603108]
[676,61222103]
[267,50217129]
[929,12081104]
[937,46679123]
[343,52662113]
[772,55031125]
[288,29255118]
[245,75094122]
[975,93685108]
[810,40143122]
[302,85539109]
[503,92690109]
[246,59127105]
[356,84847120]
[801,68380118]
[712,94325122]
[789,85915100]
[639,31430117]
[753,49854117]
[100,81507112]
[883,76007111]
[43,86938125]
[755,66670118]
[385,68740117]
[727,52313112]
[987,69021129]
[21,23039104]
[54,76155117]
[721,78088130]
[619,48601102]
[125,76595120]
[27,66542125]
[440,50474104]
[560,67341107]
[459,62899105]
[522,65053112]
[270,73615112]
[497,15157118]
[181,12660130]
[317,61064115]
[458,39911109]
[362,52595101]
[981,63118112]
[572,54398111]
[168,35974120]
[674,94958117]
[616,95853109]
[594,96645104]
[511,76032130]
[397,98557105]
[803,75208123]
[818,66857110]
[85,17848110]
[696,73127126]
[483,35183116]
[593,25351104]
[941,27252123]
[289,70371108]
[214,80956110]
[863,49605125]
[747,50396110]
[175,70610112]
[68,95100115]
[1,10607106]
[12,13020125]
[804,97276103]
[370,54074110]
[458,91736128]
[978,23654126]
[537,32076128]
[166,86099114]
[147,65898107]
[283,85429129]
[978,37146122]
[183,94001110]
[120,78355107]
[989,10634123]
[48,49659108]
[734,97360114]
[524,90858125]
[30,20732104]
[511,60329105]
[133,59124100]
[928,74747118]
[34,78244110]
[278,98035116]
[150,76707120]
[963,60411126]
[542,85147106]
[25,56441127]
[195,64240122]
[784,35844107]
[311,78457101]
[754,79644104]
[435,67509118]
[268,30652112]
[652,18124115]
[308,28350126]
[338,58092130]
[722,44132108]
[415,72097117]
[304,82767123]
[861,73427105]
[186,17949130]
[468,90133112]
[944,34721105]
[419,46796114]
[348,49960111]
[347,18712107]
[401,88925115]
[202,53659122]
[841,32662126]
[414,34581109]
[678,91748121]
[724,20117104]
[991,77454107]
[93,92173101]
[412,10601117]
[527,37011116]
[729,30565102]
[961,39024101]
[175,26593107]
[970,54642121]
[555,60137130]
[15,88291125]
[999,92535124]
[270,83176130]
[486,66970116]
[742,82504116]
[817,62718130]
[245,46705123]
[689,48336122]
[935,54749106]
[510,79390116]
[730,68268119]
[838,19747105]
[51,31394127]
[277,49347118]
[10,42161104]
[235,26246104]
[921,62306123]
[670,19536119]
[247,74270117]
[362,87564102]
[997,22591122]
[534,45330106]
[20,17667121]
[48,78684129]
[37,98169124]
[521,46907124]
[688,43300104]
[571,75261101]
[905,41040122]
[45,42767120]
[644,27390118]
[81,78154119]
[532,59238119]
[603,34000118]
[846,51784128]
[859,94087101]
[805,38077108]
[117,34185126]
[795,89131114]
[179,25343115]
[737,44775119]
[419,76438123]
[137,28410111]
[154,26562102]
[6,10475105]
[780,22802116]
[396,53443107]
[635,73407124]
[63,92760129]
[242,30081121]
[661,59315116]
[117,62934111]
[937,86702125]
[117,67260100]
[774,56906126]
[910,32272120]
[701,64112127]
[101,84585129]
[38,26590109]
[717,83033118]
[152,66423121]
[786,46849111]
[877,85257123]
[575,12093106]
[859,97407104]
[199,33007111]
[297,50249114]
[301,69131117]
[133,62381108]
[932,72038107]
[91,21812121]
[965,82943110]
[909,73464118]
[661,81626112]
[293,81108129]
[567,28874100]
[110,51881129]
[876,88785118]
[376,44714110]
[715,35043110]
[655,73529128]
[396,54694104]
[130,13364110]
[902,52571110]
[283,26885100]
[791,92876107]
[27,83919100]
[403,85123106]
[417,77978101]
[863,50100125]
[299,63541102]
[888,31352110]
[241,40742126]
[70,38230126]
[680,77921105]
[135,93658125]
[547,41046119]
[290,51565127]
[9,37589101]
[552,67470124]
[393,23832123]
[58,64595116]
[205,41389114]
[905,76416120]
[961,39883102]
[167,80071125]
[217,37516120]
[589,93171115]
[792,12030102]
[924,32637120]
[131,78813106]
[287,47241109]
[668,23588112]
[789,62751113]
[679,53255121]
[915,51361108]
[449,19762125]
[992,61940123]
[195,60382121]
[486,10616103]
[188,10830112]
[509,60062117]
[386,45342103]
[186,74793123]
[88,85958106]
[703,47097124]
[11,24274113]
[879,45718128]
[375,36760118]
[96,99208102]
[525,76815120]
[189,74523130]
[860,97267110]
[396,77242122]
[628,67687115]
[82,95967128]
[708,86484128]
[436,86786106]
[76,49155126]
[897,98566126]
[599,84585118]
[361,23137117]
[914,25705114]
[357,84833105]
[885,50248105]
[168,54283114]
[553,18211122]
[959,67996106]
[508,86987119]
[208,53363103]
[459,31979124]
[565,15990113]
[191,90622116]
[655,40015106]
[316,88763106]
[908,93081104]
[858,39700101]
[375,81391121]
[938,90325126]
[995,77392106]
[857,86020118]
[464,79342106]
[412,50361128]
[403,29604126]
[288,66477107]
[635,83992115]
[196,71350105]
[891,74004115]
[110,85235121]
[841,91584114]
[131,25013112]
[867,76412106]
[284,35495104]
[976,12246127]
[960,69007103]
[972,38870110]
[42,57730118]
[262,96114117]
[775,38546119]
[537,71217127]
[588,59484109]
[772,41334113]
[538,36607111]
[795,17334119]
[553,11287110]
[743,45718123]
[740,44658105]
[313,55469115]
[95,96408124]
[839,84359121]
[892,92047130]
[599,99263107]
[398,38559104]
[880,27101113]
[894,57351106]
[967,96623126]
[516,79074126]
[581,95343122]
[28,65850122]
[850,99160119]
[915,57065115]
[463,15634102]
[692,12661125]
[334,95475117]
[344,45203122]
[400,61592103]
[833,18940106]
[696,74986117]
[503,28552122]
[599,91963101]
[864,97868119]
[190,69656101]
[10,74879121]
[703,24195127]
[134,93787101]
[804,70616127]
[215,75032114]
[281,83550118]
[604,85322128]
[84,50133100]
[573,42674129]
[197,16440125]
[161,13326122]
[709,22382105]
[56,54888116]
[543,24528130]
[543,10668106]
[583,41273123]
[456,50973121]
[668,36888125]
[380,97854105]
[736,80443127]
[348,24957119]
[360,74225124]
[480,31127127]
[46,39607102]
[474,64131109]
[195,57998123]
[998,48224116]
[115,18587106]
[749,44769121]
[497,13029121]
[713,14834121]
[749,44054119]
[181,67772125]
[934,55294107]
[209,80149124]
[459,37298120]
[733,26933126]
[174,99196108]
[553,86614123]
[213,12539105]
[771,32727123]
[740,21245113]
[133,62952121]
[416,20916122]
[628,67420123]
[246,46272122]
[226,38727127]
[159,36082101]
[184,45374128]
[883,88712121]
[171,99620117]
[203,20417107]
[724,60299121]
[702,57956104]
[508,61408120]
[275,68853124]
[351,85589130]
[474,39650129]
[247,98469124]
[177,26194115]
[919,98430130]
[588,57497102]
[903,62639126]
[794,45551117]
[218,41815114]
[919,22373113]
[155,67610118]
[451,72666125]
[938,35118121]
[904,29415128]
[459,33856104]
[333,92686100]
[149,91658107]
[825,58150114]
[346,43540105]
[569,28109101]
[53,79043120]
[767,77322107]
[606,12780130]
[28,70505108]
[829,37151116]
[307,90210127]
[469,18152127]
[182,53981125]
[957,54579120]
[920,43037120]
[593,35341106]
[925,89855126]
[937,66841116]
[631,41552104]
[370,82783128]
[514,90477109]
[869,38986126]
[486,27715101]
[448,57128117]
[815,74993129]
[481,89209111]
[942,33377103]
[368,80558122]
[777,85744113]
[416,31736118]
[789,70505107]
[628,75460101]
[585,46008104]
[179,19278120]
[266,23630122]
[106,59724130]
[695,27202105]
[218,31941128]
[358,58224113]
[125,80917105]
[556,90199130]
[842,52671101]
[602,94679111]
[524,21037102]
[243,22958111]
[737,30761114]
[476,16792125]
[25,30218109]
[652,90006114]
[203,42531107]
[538,88032101]
[720,38993100]
[135,32032128]
[405,25215112]
[332,48755114]
[736,98225119]
[657,67529122]
[919,49988114]
[912,30175118]
[571,71451126]
[138,30222125]
[533,60807125]
[849,60804102]
[652,77001127]
[892,63498106]
[956,44806105]
[245,56310125]
[275,86972129]
[265,92799122]
[103,24097114]
[546,74767119]
[443,73833119]
[820,41403124]
[657,68989102]
[558,33243109]
[363,95458124]
[238,96355125]
[126,27792119]
[312,18359115]
[901,27673104]
[860,61865110]
[812,20664124]
[572,55920130]
[349,39060121]
[193,34253100]
[558,56943126]
[22,99427128]
[542,14733121]
[921,63357125]
[873,99293101]
[890,91606110]
[141,20712125]
[974,48927128]
[668,52258105]
[615,49649122]
[902,63030114]
[898,29817108]
[494,16783130]
[645,44234116]
[916,95007112]
[772,85962115]
[934,15997114]
[245,40655110]
[712,28350113]
[436,87564105]
[243,53620102]
[33,60092101]
[2,57899101]
[933,63102116]
[305,21351120]
[675,93343105]
[156,99348128]
[892,52095129]
[13,14566104]
[189,67811104]
[66,24603106]
[746,22345108]
[269,48214129]
[754,62467103]
[345,83644125]
[300,90922125]
[67,41493103]
[606,62986103]
[428,30192129]
[114,47009129]
[594,19273115]
[851,76318100]
[264,35453116]
[870,26392123]
[244,38487112]
[53,40729119]
[707,58800113]
[131,45962112]
[275,58307100]
[809,57810106]
[215,78034117]
[103,12270123]
[203,18469128]
[479,50744114]
[333,54930113]
[13,42987129]
[409,65633103]
[554,25158129]
[975,74999123]
[626,75057103]
[256,82126114]
[53,75867107]
[506,80541116]
[633,97514120]
[679,35568125]
[512,79706123]
[692,59026106]
[178,59679107]
[928,63917118]
[783,12067122]
[498,40158118]
[401,91721126]
[428,49400113]
[566,66103127]
[385,93514120]
[483,31327123]
[589,41569107]
[522,56354130]
[734,51876127]
[174,14293125]
[99,45114122]
[931,16770119]
[993,72612101]
[206,23067101]
[104,43432104]
[179,91826120]
[17,18672110]
[189,88143127]
[75,14789129]
[523,34562103]
[909,97161108]
[70,78216104]
[814,26895110]
[594,72398126]
[700,48784127]
[715,33105113]
[640,35052120]
[66,72728108]
[811,54010118]
[74,41700127]
[29,93824113]
[95,27481108]
[570,29498123]
[961,19077106]
[542,81631107]
[944,48325107]
[244,23744117]
[449,69111110]
[578,45179114]
[198,71467115]
[832,95548126]
[492,28056129]
[264,77603130]
[601,90328112]
[556,64078127]
[557,73862107]
[170,56414121]
[175,46421100]
[518,31098115]
[67,62619128]
[798,16659125]
[278,54827118]
[430,34191126]
[282,28761106]
[300,19340123]
[226,26844130]
[121,68569129]
[662,16706129]
[178,87567124]
[740,74429116]
[589,92323100]
[334,31414111]
[214,27802107]
[405,94146115]
[154,28284130]
[148,24834109]
[441,37789130]
[636,61579111]
[448,96691103]
[698,87505120]
[335,54538110]
[99,88546121]
[834,31344120]
[393,13171107]
[599,92853127]
[751,87874116]
[152,10019102]
[5,33512107]
[13,88939130]
[104,85945100]
[480,67453117]
[991,96595104]
[592,55520116]
[397,27700116]
[983,63532121]
[821,25231121]
[888,68900107]
[818,94790125]
[577,63039127]
[55,53869119]
[482,56683109]
[623,44588128]
[231,20666130]
[420,77101104]
[847,60735115]
[452,89298129]
[492,32421123]
[606,52568125]
[765,56895101]
[719,21033116]
[508,73685102]
[516,12328117]
[793,88576111]
[656,19263120]
[381,97240111]
[991,86046127]
[814,28601109]
[468,88050100]
[961,40342112]
[994,29776111]
[784,12270120]
[996,90811105]
[661,81990128]
[696,82384112]
[178,23168120]
[430,99483112]
[751,72877113]
[616,81382113]
[201,21988109]
[120,15272104]
[526,12864111]
[934,53020129]
[215,94116125]
[686,86511115]
[888,21761110]
[976,89350127]
[411,20018110]
[60,96957121]
[757,36450111]
[919,48923120]
[293,18592128]
[229,12667123]
[503,24451105]
[750,49274101]
[480,14299114]
[845,19132115]
[553,23253124]
[435,65568101]
[40,28098115]
[713,94881124]
[21,60362111]
[728,28019126]
[420,27326110]
[339,33597130]
[686,50941122]
[169,84363130]
[523,49822121]
[546,32432117]
[585,10155105]
[253,78543105]
[890,99726122]
[146,29717112]
[607,51045129]
[144,31493107]
[401,63657107]
[783,99138103]
[367,47876129]
[2,66914119]
[3,56236124]
[214,93890111]
[52,55692101]
[466,68951100]
[386,82680106]
[704,57435124]
[161,53892118]
[261,81041106]
[347,88954121]
[206,71722115]
[961,75306107]
[62,46189125]
[252,23760110]
[31,36095114]
[516,86400107]
[260,62841126]
[253,99921108]
[128,45863104]
[53,98247123]
[821,63431129]
[290,62409102]
[568,76409107]
[452,46517103]
[331,99370105]
[662,72514114]
[282,75860128]
[350,91249126]
[3,35628122]
[51,34599109]
[413,83482112]
[727,92661104]
[52,96136109]
[888,15943103]
[154,75282126]
[218,27699100]
[852,16861116]
[37,63523112]
[299,50293122]
[936,45245129]
[691,60154123]
[292,67615117]
[302,46563112]
[340,87007100]
[255,80864116]
[705,39407107]
[479,96838129]
[20,41311130]
[847,28273118]
[803,50240122]
[492,20407118]
[294,61367109]
[470,78268120]
[280,88190124]
[97,45586100]
[257,63686117]
[573,32803110]
[713,53091101]
[272,67366119]
[714,37508122]
[639,59253118]
[792,64940118]
[94,86128101]
[656,33454124]
[753,76835116]
[346,54606100]
[939,40928113]
[126,43092130]
[191,73893122]
[172,95528100]
[845,53060114]
[394,37313118]
[871,96405123]
[904,73502121]
[171,20515102]
[903,67221120]
[884,53367126]
[366,78397114]
[251,33272125]
[382,60532116]
[926,44861122]
[339,53658126]
[762,63420123]
[691,80547111]
[70,58896102]
[344,69147127]
[980,87907121]
[261,83563126]
[720,42214117]
[449,73493120]
[53,11525124]
[265,45326109]
[368,87415123]
[393,12461100]
[284,77652120]
[422,49756122]
[448,61480113]
[917,38601124]
[356,98862121]
[573,30653125]
[912,45607130]
[221,93810103]
[835,90502127]
[370,95153120]
[741,28003123]
[984,49975108]
[63,40039104]
[833,64100100]
[481,39395121]
[912,75770118]
[468,63702105]
[55,18114106]
[68,46835121]
[722,74271130]
[365,50392126]
[458,49312122]
[983,90302117]
[435,63668115]
[960,54618118]
[623,83403116]
[941,12984124]
[16,75687106]
[945,75968112]
[833,26682126]
[25,95555129]
[474,99125109]
[284,53327129]
[926,71138115]
[508,65889123]
[131,90157110]
[187,40092127]
[503,25887126]
[773,47412108]
[668,49644123]
[590,72244118]
[517,72124121]
[406,39202127]
[734,69788130]
[189,58012121]
[811,18167118]
[152,34917130]
[909,76601107]
[813,18061122]
[215,52940130]
[307,52241107]
[599,60108123]
[534,92233103]
[100,90657120]
[465,56840114]
[851,72296120]
[436,93320124]
[463,76233100]
[738,22808109]
[912,30750116]
[687,88204101]
[26,14131114]
[186,46676119]
[707,40031108]
[960,36344118]
[715,59734124]
[433,45431121]
[179,72807124]
[218,50458106]
[59,19534110]
[558,70510112]
[889,34504113]
[461,75225104]
[860,35372114]
[675,80958123]
[977,68465103]
[630,21390117]
[458,94406105]
[323,70373103]
[752,18948106]
[54,75706110]
[763,32323104]
[868,26474105]
[602,24059128]
[792,37036112]
[761,75362130]
[347,27419127]
[969,75772127]
[774,66932124]
[102,55538123]
[585,69709105]
[264,33550100]
[866,98194107]
[844,37224111]
[597,91724115]
[797,26658121]
[136,44795117]
[560,88444114]
[538,59171126]
[888,39466122]
[27,63982105]
[209,43083117]
[187,17368123]
[44,59616126]
[24,49472109]
[801,74217124]
[225,50173118]
[331,88290117]
[883,23568129]
[837,21295115]
[321,10142113]
[441,17051125]
[114,84169123]
[441,54783120]
[282,41222121]
[838,29082110]
[92,62869121]
[972,79367117]
[157,68801102]
[987,33915110]
[925,63604109]
[747,36852107]
[94,15722114]
[123,67311105]
[768,97144123]
[533,59725102]
[171,88399129]
[814,62490114]
[397,27992114]
[714,13994102]
[18,72552104]
[906,94292120]
[595,75335123]
[684,43884124]
[481,74520105]
[658,78844102]
[870,15418101]
[491,16247121]
[265,88615129]
[787,36329128]
[190,48475113]
[282,56769117]
[566,65127104]
[920,31692120]
[827,98322111]
[943,29114101]
[687,25698119]
[93,84839104]
[942,17543119]
[310,23655114]
[175,59866107]
[992,20520115]
[462,50594127]
[928,53591128]
[889,17369112]
[60,92584118]
[212,26012100]
[439,67852125]
[617,92410106]
[102,97428121]
[776,90273102]
[373,11186130]
[148,43436114]
[191,13170120]
[561,98305111]
[736,81077105]
[777,89718130]
[462,91324101]
[430,41902119]
[354,62331130]
[803,65241112]
[113,28113123]
[844,76653101]
[957,21690109]
[717,11351100]
[532,11763113]
[304,64490128]
[225,40447102]
[983,69672129]
[199,31062127]
[604,62009105]
[391,53869116]
[294,73935104]
[365,71277107]
[959,83689104]
[51,79343112]
[277,34985117]
[123,97797116]
[361,85036119]
[675,36233105]
[814,16581111]
[429,45102126]
[37,81654112]
[19,48190122]
[80,14749124]
[441,56444100]
[19,23447119]
[16,62653120]
[618,84980118]
[249,50287107]
[770,10885102]
[871,75834112]
[24,72078120]
[764,39040119]
[919,30133108]
[543,33242108]
[479,90048127]
[399,57633112]
[431,16731104]
[387,14466110]
[342,34128119]
[661,61813102]
[176,21226100]
[26,50736108]
[490,32816120]
[672,87932111]
[523,87647106]
[16,44515128]
[176,30107117]
[155,56259112]
[331,37040112]
[368,34541101]
[793,56629129]
[845,11294103]
[555,84443100]
[259,79991122]
[999,12332107]
[80,59232117]
[477,86660118]
[244,58803102]
[603,33742125]
[55,62629104]
[791,85912118]
[911,95273103]
[451,39335114]
[617,83264111]
[568,33071110]
[788,47799111]
[217,50973128]
[657,69622111]
[775,36784121]
[32,15021105]
[188,63713110]
[209,67240116]
[857,32407126]
[165,49740128]
[827,51337114]
[124,12430109]
[237,87022108]
[422,31011129]
[17,72443129]
[328,18086101]
[651,36289108]
[602,89085114]
[655,84560102]
[116,89367113]
[33,78120115]
[596,62346123]
[962,78424125]
[89,53734122]
[149,17460119]
[26,93413107]
[198,71335109]
[818,70420128]
[611,86074112]
[543,73073101]
[836,77599125]
[63,26838128]
[766,98696126]
[165,74425122]
[185,32139122]
[191,61303118]
[872,74319128]
[878,34491100]
[212,40875122]
[194,49501108]
[125,48491115]
[628,11189116]
[697,62265100]
[968,67439101]
[987,54192113]
[442,92139118]
[732,45782126]
[443,52022109]
[304,50620126]
[796,59914120]
[161,11565126]
[903,58393118]
[377,52088117]
[900,74930120]
[434,58412100]
[592,34381107]
[120,78946120]
[726,55723105]
[711,46565103]
[577,99662128]
[95,22259128]
[843,24933100]
[519,93090122]
[441,36578124]
[587,38767122]
[415,50528124]
[702,48602102]
[235,36582128]
[181,97311110]
[766,55340106]
[784,58326101]
[517,86596118]
[609,70824128]
[33,31687105]
[652,18564120]
[29,16572117]
[217,62455111]
[894,89605117]
[184,64739102]
[764,58093128]
[352,27058108]
[451,43074120]
[940,23061122]
[203,52463108]
[186,70788127]
[297,10022108]
[94,56181106]
[566,77996104]
[931,59134100]
[308,20135118]
[555,90979125]
[693,53115126]
[776,34021101]
[168,14328103]
[862,58191124]
[697,38666124]
[838,62042123]
[445,89550112]
[868,19668100]
[427,83809102]
[570,73470111]
[763,36822120]
[770,20277125]
[652,30702121]
[511,37469122]
[884,97042106]
[204,12574109]
[570,50395125]
[690,68927106]
[416,29402122]
[715,91128127]
[451,94584124]
[105,57453125]
[316,15080101]
[604,55513109]
[680,48128116]
[790,69326126]
[25,40172117]
[210,58485108]
[254,74580105]
[731,23016129]
[934,14787128]
[151,15454103]
[897,99291113]
[839,70454102]
[706,40854100]
[264,11569118]
[557,48476129]
[299,44428120]
[823,91340106]
[809,57420129]
[51,39797130]
[255,73917108]
[580,51060118]
[35,47581112]
[118,35605127]
[542,64949110]
[75,68252101]
[570,28358109]
[887,94765101]
[974,63704107]
[26,67775119]
[605,98959122]
[28,10036129]
[216,75062123]
[277,42994115]
[228,23187104]
[247,15635124]
[166,95797127]
[275,46521120]
[303,69885130]
[149,19016123]
[35,55845116]
[58,76513113]
[791,56973128]
[616,55453106]
[793,65597107]
[755,64812104]
[731,63939108]
[452,64923101]
[587,28464125]
[634,55767108]
[622,11058102]
[547,40076110]
[961,99019113]
[532,81990118]
[354,82097127]
[423,57019120]
[88,24551106]
[61,14489130]
[938,58548128]
[516,81099101]
[707,46828112]
[701,10699108]
[4,67067102]
[625,33738115]
[746,21173128]
[370,99127123]
[120,94571104]
[177,50545115]
[718,11165111]
[669,85395123]
[687,20928114]
[66,59611104]
[415,23485101]
[64,30563109]
[973,80129127]
[390,68254119]
[698,80979100]
[405,18705123]
[620,61836109]
[463,14672120]
[734,98811130]
[337,69076112]
[557,46525114]
[499,98690103]
[222,55931128]
[402,38509102]
[899,67316122]
[523,17679107]
[360,69671105]
[795,35656127]
[610,34746113]
[412,46977104]
[407,23596120]
[813,94578127]
[184,92272114]
[632,73575113]
[448,57312126]
[914,80934105]
[85,59401129]
[351,56222101]
[496,64077115]
[639,20803114]
[513,77621123]
[36,22324127]
[339,74476110]
[660,63547115]
[360,19021122]
[749,37768111]
[45,74732113]
[317,73760117]
[912,36718102]
[103,54758127]
[721,73007114]
[353,55191115]
[0,79413123]
[67,44356110]
[406,91412108]
[886,24438113]
[71,15958104]
[340,99984121]
[83,18087111]
[975,44359126]
[601,83747122]
[169,56784116]
[54,61112119]
[455,69348127]
[714,43577106]
[638,17266123]
[612,78611115]
[694,89073130]
[758,94165125]
[149,31834101]
[443,30794100]
[485,40251110]
[561,47050108]
[857,37994104]
[519,29112122]
[78,62885127]
[647,61815122]
[68,87775123]
[826,90427115]
[545,49005123]
[115,20468107]
[330,55638107]
[508,48907126]
[282,33143105]
[581,88938109]
[908,45359116]
[371,43088121]
[683,84430123]
[950,69425129]
[153,46020123]
[419,51309109]
[476,75372125]
[499,26207114]
[948,83297103]
[445,31570127]
[712,51533109]
[522,82173119]
[831,26004128]
[117,81893111]
[459,99943103]
[951,28862117]
[581,89171102]
[856,22819125]
[694,76152121]
[313,98492125]
[414,33871125]
[411,36211105]
[897,97710128]
[88,64916107]
[918,30299100]
[793,11132110]
[106,38259117]
[451,38881121]
[544,68783101]
[717,87893129]
[275,83043126]
[613,11050119]
[779,96568119]
[165,35110125]
[949,69604114]
[552,12432101]
[111,44109100]
[250,72653103]
[373,31298117]
[844,27323123]
[17,69875109]
[436,34351115]
[712,26647130]
[140,21422129]
[562,96972120]
[569,81302127]
[552,69311126]
[631,71971105]
[471,70806102]
[540,70596127]
[614,98785119]
[35,54000100]
[890,49595122]
[973,14643120]
[418,94436116]
[530,62159119]
[732,32509126]
[134,75203103]
[766,31787113]
[765,57239123]
[953,30433114]
[832,73867122]
[757,52215122]
[373,24601116]
[388,42229107]
[694,10502128]
[812,89477111]
[724,62186109]
[516,66933104]
[52,79510114]
[361,64754105]
[657,13488105]
[529,16888104]
[505,99632102]
[65,45586122]
[876,39184115]
[433,72032118]
[76,30529112]
[86,85471108]
[985,47532105]
[419,44106108]
[435,77230117]
[632,70101113]
[164,57522122]
[757,36597126]
[971,13003127]
[294,47019128]
[94,60930107]
[224,91308101]
[505,30498102]
[796,48312105]
[713,25942109]
[433,26501118]
[163,12953118]
[645,48762123]
[160,99417101]
[345,85180118]
[715,97891113]
[280,31816105]
[839,13544113]
[89,12869102]
[78,67720129]
[156,88369101]
[782,47723125]
[874,68116130]
[325,54364119]
[107,62576118]
[106,62349124]
[78,30064123]
[655,78832125]
[698,64367104]
[957,49480108]
[856,16424130]
[425,66845118]
[717,71550103]
[878,23602103]
[971,27366101]
[505,73668130]
[756,89673112]
[826,76611113]
[320,10055114]
[380,42908108]
[845,53858122]
[871,54930128]
[120,73193111]
[706,73437116]
[202,72400107]
[310,42304105]
[550,15541128]
[530,78224129]
[811,86667102]
[286,33740115]
[818,42975106]
[622,50612118]
[311,96791114]
[908,64816108]
[475,87542129]
[713,42586128]
[374,56772117]
[43,90121107]
[8,92923129]
[748,83023119]
[296,93191115]
[19,96687124]
[819,14621108]
[981,41996107]
[296,52091119]
[145,55189115]
[261,84398104]
[15,98282103]
[253,65290113]
[534,99310101]
[48,23897117]
[411,11053113]
[86,65714127]
[197,58334104]
[448,35391102]
[872,16984114]
[484,78586118]
[762,94855129]
[756,81232130]
[960,69534123]
[797,31927101]
[636,97698122]
[186,56291125]
[486,29417125]
[227,63903112]
[701,28615109]
[137,16334125]
[28,12801125]
[342,64132106]
[225,11300110]
[676,38513126]
[776,11717122]
[563,22287117]
[143,47765112]
[156,55400111]
[375,76548130]
[688,79764122]
[758,28996110]
[814,56175117]
[523,69305125]
[308,39276103]
[437,33874128]
[146,27381119]
[156,56630100]
[120,27362105]
[540,98073116]
[951,94764122]
[837,18236114]
[614,68541108]
[364,93290117]
[417,62717129]
[996,47398101]
[201,70033101]
[414,46234125]
[67,84406130]
[625,93045101]
[129,74820119]
[444,91142116]
[97,51845128]
[301,84567121]
[95,70062121]
[466,19511127]
[734,59059123]
[95,69166102]
[929,11070115]
[930,11385127]
[281,10530122]
[799,12217118]
[814,29280124]
[551,12543124]
[615,95164126]
[644,33240115]
[632,70022102]
[828,68746106]
[681,58915112]
[508,19338105]
[223,82470130]
[373,47263130]
[244,37925102]
[582,39802129]
[472,27509121]
[272,11905100]
[77,14914118]
[667,78934103]
[329,20813118]
[524,28797109]
[959,88383125]
[771,13753120]
[920,82128116]
[643,11295104]
[783,69165118]
[765,49775103]
[800,21552129]
[626,78314129]
[405,57421114]
[917,38289103]
[247,41613113]
[257,57640121]
[149,14855113]
[483,92265101]
[446,88445101]
[314,25871124]
[476,62893115]
[448,47752117]
[437,86035109]
[804,64293119]
[914,15422114]
[305,48752125]
[683,36839101]
[476,35086100]
[192,76221111]
[203,65350124]
[393,61614111]
[835,94413100]
[901,47811126]
[825,34445105]
[938,31569124]
[452,85036104]
[436,63977127]
[990,59555123]
[606,68809129]
[721,11100107]
[461,30856114]
[2,72828111]
[174,81762125]
[287,46861104]
[98,65939110]
[234,13799120]
[474,81236119]
[191,13384126]
[571,77522119]
[241,65460120]
[785,57072128]
[498,78554118]
[103,88616123]
[694,38604107]
[941,87283126]
[280,10180111]
[800,26301105]
[372,52712109]
[35,35236123]
[858,78483105]
[82,84562130]
[632,66565116]
[443,25422129]
[745,57212118]
[649,30117130]
[729,98654118]
[789,53600112]
[38,24290114]
[884,99274115]
[652,47206130]
[794,92563115]
[485,95426103]
[545,32938127]
[27,53116129]
[493,83417115]
[183,53786123]
[873,65957125]
[158,41418101]
[539,87719120]
[949,30748106]
[731,25750100]
[351,20356121]
[241,64773114]
[339,22540122]
[845,85174106]
[641,73752105]
[578,59977113]
[940,94070109]
[705,21103116]
[910,84335117]
[693,70693110]
[374,38084116]
[434,78500118]
[141,40145123]
[849,11559121]
[838,32137120]
[997,64576127]
[775,90525100]
[329,37300113]
[716,24673130]
[28,39639107]
[549,94891109]
[510,22934105]
[85,20276116]
[470,73984103]
[525,75431101]
[68,14588114]
[386,93730126]
[109,24806101]
[576,72203126]
[825,92619121]
[211,79723109]
[250,28421100]
[995,56638110]
[958,32715105]
[280,73741126]
[239,26963113]
[168,32521119]
[735,98721104]
[61,95253116]
[761,93131123]
[945,83253128]
[95,95639112]
[928,74926130]
[892,87686126]
[423,11804102]
[534,76295106]
[740,12959128]
[236,59137117]
[379,31203128]
[314,97540121]
[200,73804125]
[325,25250129]
[466,88549109]
[727,17147108]
[511,57302115]
[780,26842102]
[803,61862110]
[159,46240121]
[798,19673109]
[901,76252128]
[626,47362105]
[814,61074110]
[921,93838109]
[448,43756117]
[517,45608120]
[727,94194115]
[733,32113115]
[399,58230121]
[395,40772125]
[234,45523107]
[675,77081118]
[761,21811121]
[121,22096130]
[652,69856118]
[300,22855129]
[48,54973104]
[367,63614117]
[841,84221112]
[748,67458130]
[428,81023101]
[723,38285114]
[414,55047119]
[159,64131115]
[930,50791121]
[589,58803129]
[154,13967121]
[24,62319120]
[37,80458117]
[725,22094120]
[215,12802106]
[72,38790111]
[593,74607127]
[705,99686109]
[753,94715113]
[891,14996122]
[857,93977124]
[16,63255105]
[0,81579100]
[475,56837129]
[274,89746125]
[383,82326114]
[371,81994117]
[115,80848109]
[65,71493117]
[855,96623127]
[510,38933112]
[397,20103129]
[833,34123110]
[316,35117129]
[221,55734102]
[671,96654120]
[968,95198122]
[121,89825109]
[700,55314107]
[143,14994114]
[85,61655121]
[917,90397111]
[543,37719126]
[623,48287103]
[89,40663118]
[301,70874119]
[107,29054127]
[181,80620104]
[741,58205110]
[760,13128127]
[305,37022125]
[688,68458108]
[597,74389105]
[954,21062111]
[616,21033104]
[187,97154111]
[588,61475100]
[53,16167112]
[480,91570122]
[374,68029112]
[444,38386121]
[479,54570109]
[653,79913129]
[193,50123103]
[738,47814123]
[388,54495118]
[975,11634117]
[617,49291115]
[604,43135114]
[834,12567113]
[154,71854119]
[537,64325110]
[664,80297117]
[266,64208117]
[200,56219105]
[880,88096128]
[664,43338102]
[457,91099109]
[870,30150125]
[245,76628122]
[780,74740103]
[911,19151121]
[811,91134124]
[974,46581127]
[681,60261117]
[869,43625112]
[534,30319107]
[86,63040117]
[461,83830121]
[259,35134129]
[980,36422100]
[419,23543119]
[787,51527124]
[319,70136129]
[351,91705111]
[186,33131129]
[286,50715114]
[333,25810106]
[419,44614118]
[219,73868108]
[918,61501115]
[764,85873119]
[568,24110121]
[236,67832115]
[564,91817124]
[162,42255115]
[488,88062120]
[848,70664130]
[795,90082126]
[828,32630101]
[834,55635126]
[910,49519122]
[4,42596130]
[516,18593101]
[618,31110101]
[596,85792119]
[528,37692120]
[140,39410110]
[213,51932129]
[794,75686112]
[359,29726124]
[317,58735117]
[252,99650105]
[566,88465125]
[406,79275110]
[882,55229113]
[506,57637125]
[1,17131103]
[277,39414117]
[343,69014124]
[836,51696113]
[51,30640126]
[421,50319122]
[414,91588116]
[502,22947104]
[3,35178104]
[826,98771112]
[567,71155103]
[88,61248123]
[441,68863122]
[978,86345122]
[510,30628112]
[967,90045114]
[686,31096130]
[481,65647111]
[400,88661129]
[124,68373122]
[435,66825108]
[526,84729120]
[454,32581113]
[677,89430125]
[795,55774114]
[498,85844106]
[413,31560108]
[101,89821103]
[111,43894118]
[819,20935110]
[21,27813105]
[847,98987110]
[15,83417120]
[448,48243111]
[97,41153130]
[570,36189119]
[962,11002100]
[261,52530130]
[956,33479108]
[397,74354123]
[425,82551116]
[359,51507105]
[164,73805112]
[654,70449109]
[465,88396116]
[994,87201127]
[613,56705105]
[867,44574110]
[807,39097102]
[947,54965123]
[966,91636118]
[903,32391106]
[32,66138127]
[500,86222111]
[143,34067125]
[177,68364125]
[937,39216113]
[582,43679118]
[746,72802107]
[230,10592111]
[942,57947129]
[240,76511123]
[516,26719103]
[130,36335119]
[323,69042105]
[418,72567122]
[491,82068103]
[389,41786130]
[764,81369129]
[20,86090115]
[372,50225115]
[625,12121109]
[933,82929129]
[709,49807120]
[869,24183123]
[902,47312126]
[866,50610107]
[631,97859106]
[405,17135116]
[947,24061128]
[956,25957111]
[12,39338118]
[739,53554106]
[111,21041126]
[770,94153105]
[151,49914114]
[79,63357128]
[17,62432103]
[237,96392114]
[817,54269120]
[384,89358117]
[869,84617128]
[462,42297100]
[984,36261127]
[205,79559128]
[222,23581112]
[701,22331105]
[942,54270112]
[605,31877117]
[529,65225124]
[395,68771125]
[501,72400108]
[749,47039118]
[329,76365118]
[512,43010123]
[251,94148106]
[325,60021100]
[820,78349110]
[773,32207124]
[64,36124114]
[420,45623116]
[417,10211128]
[397,14018123]
[597,96590113]
[142,92563130]
[347,55989124]
[521,78996122]
[682,78472127]
[718,59486103]
[960,34117107]
[951,22257104]
[244,34312116]
[267,56853105]
[681,74033124]
[160,39025108]
[90,58508101]
[147,26925112]
[504,18499123]
[716,64741117]
[118,79985109]
[201,72478126]
[321,86238109]
[213,36680115]
[324,64439128]
[995,74362128]
[379,36516113]
[632,77779100]
[65,16485127]
[828,62364114]
[38,66931118]
[373,90982109]
[444,13333106]
[474,91361127]
[759,24646124]
[235,93015121]
[605,10566105]
[485,60427101]
[637,30585111]
[41,25931119]
[738,81153123]
[387,85171113]
[497,48160110]
[144,16188111]
[463,30906109]
[781,98046117]
[461,22070113]
[69,59306118]
[707,80034100]
[674,16132107]
[440,70308125]
[754,13731121]
[875,23698108]
[597,33586123]
[533,91148107]
[261,57164111]
[727,13859116]
[190,47555126]
[22,29804104]
[991,54631111]
[99,37450113]
[281,16921112]
[495,10653106]
[193,11313121]
[579,39392109]
[140,15874115]
[554,88969109]
[769,64761110]
[471,12908100]
[955,18745114]
[414,72202108]
[885,69927110]
[602,38990101]
[135,93808125]
[737,82195100]
[862,92825124]
[204,33561124]
[64,34300117]
[565,47224120]
[59,72340120]
[430,27066112]
[748,41769128]
[149,39753130]
[384,59050107]
[587,35142100]
[402,15219112]
[759,92750128]
[558,37482112]
[549,21637103]
[908,63606117]
[702,34596127]
[184,68064106]
[949,74108102]
[699,69924100]
[923,48740120]
[342,16605102]
[975,74560112]
[942,88577114]
[913,46847122]
[583,52611121]
[472,99277107]
[775,65611121]
[665,90330126]
[198,74611114]
[126,45869104]
[304,16634111]
[109,84460101]
[762,55490128]
[702,25880130]
[620,53936125]
[755,16637127]
[305,43048105]
[270,11741125]
[579,16421118]
[823,68974121]
[481,91076126]
[44,39278104]
[832,10401109]
[311,59633102]
[944,62560128]
[54,13801100]
[368,80448108]
[230,36986106]
[997,87496114]
[787,95137123]
[293,49898107]
[11,19222105]
[226,60965114]
[817,70223105]
[172,45105100]
[810,50283108]
[34,98450126]
[128,80306104]
[677,73720127]
[39,55619125]
[779,87995109]
[456,11608112]
[415,45710106]
[447,84290125]
[432,13423117]
[167,52234104]
[807,81923106]
[182,14037104]
[282,94073104]
[917,57104100]
[568,63770100]
[396,51218113]
[401,23999115]
[857,33287129]
[502,46744106]
[56,58725128]
[685,95728121]
[67,58603113]
[229,31540124]
[188,22187101]
[197,47164130]
[228,55484111]
[491,26269112]
[294,53930107]
[779,42234113]
[800,79256130]
[886,13308110]
[333,95966109]
[196,37832100]
[256,33347119]
[865,44452123]
[240,86535119]
[660,70229103]
[462,88909113]
[291,50177123]
[453,18715129]
[665,92564128]
[209,44700123]
[265,58392104]
[769,63839107]
[282,60402129]
[937,17520122]
[442,99926102]
[558,52658101]
[587,72226109]
[654,19337120]
[116,69344123]
[837,52148108]
[818,57501121]
[367,49406109]
[82,77950103]
[6,79767121]
[15,72748126]
[204,83167126]
[773,47699104]
[321,53926122]
[933,79892113]
[136,79665109]
[706,51964118]
[504,43911119]
[62,86233102]
[984,20770125]
[325,87087116]
[247,79508128]
[854,33269122]
[840,43228107]
[439,46194115]
[426,25963109]
[852,83821111]
[124,84922101]
[518,35477113]
[629,41206124]
[529,33980111]
[424,92838101]
[905,62433101]
[171,63990125]
[56,43471121]
[172,69584101]
[819,60009117]
[509,55886111]
[718,50145122]
[203,82443128]
[510,82845115]
[722,80073119]
[848,84434129]
[307,57114123]
[823,18087114]
[90,74730124]
[347,90214117]
[17,28291121]
[312,31656120]
[502,87737115]
[686,53325110]
[33,18177116]
[540,39295106]
[681,79858103]
[893,60849105]
[654,90973104]
[198,61399111]
[568,41718119]
[883,85466119]
[200,91149117]
[764,32022100]
[182,25874124]
[929,67014113]
[185,60135108]
[246,82108128]
[22,24852119]
[766,22650111]
[638,74151117]
[596,92642107]
[290,66904110]
[807,16714110]
[372,43678117]
[885,50911123]
[855,87534124]
[806,24673130]
[620,44855122]
[765,19150112]
[825,66385112]
[294,13136110]
[203,14636104]
[476,39845128]
[510,24184115]
[155,14125120]
[498,99508103]
[132,79082112]
[59,16166112]
[22,83252116]
[359,75057108]
[806,65612112]
[82,21188113]
[231,27690130]
[562,21221112]
[492,89643110]
[375,13507126]
[464,39812115]
[283,66775109]
[766,72717110]
[717,74755102]
[555,12907114]
[724,13280110]
[45,23741101]
[468,85859128]
[198,94637112]
[208,28790122]
[857,84897104]
[76,59612123]
[113,97116114]
[531,97508120]
[285,98055123]
[508,87927122]
[390,43514120]
[152,42284130]
[833,22666129]
[51,80774128]
[667,84535120]
[787,45010113]
[938,89240112]
[523,23779111]
[951,20276110]
[924,59819116]
[17,40128126]
[891,44370121]
[736,58634118]
[95,71570129]
[36,50100116]
[539,55955117]
[795,14288126]
[851,47441119]
[162,36491100]
[907,67023106]
[966,78831120]
[999,47726102]
[364,94367127]
[334,37761113]
[780,11385127]
[800,61255118]
[709,11939112]
[174,93908101]
[448,37367105]
[595,30244104]
[461,54556117]
[670,79456109]
[325,95345108]
[414,50232128]
[702,53032111]
[327,34491119]
[350,97715121]
[289,67972112]
[847,12935123]
[118,19079109]
[163,80561102]
[545,31211109]
[38,86352117]
[944,14816100]
[439,23470119]
[719,40878102]
[145,15687118]
[375,97526106]
[325,36843125]
[278,61318103]
[454,95959103]
[948,39551116]
[373,31805108]
[879,82068125]
[219,15034126]
[151,61880128]
[175,17765119]
[826,57497127]
[875,74867110]
[95,36199101]
[576,95237121]
[895,56971127]
[202,78247101]
[96,29833113]
[927,90134119]
[64,74805111]
[603,64212118]
[160,52064104]
[433,46006112]
[752,19955112]
[341,58824125]
[307,94154127]
[634,10638119]
[884,48323111]
[920,49327120]
[413,86634124]
[640,46797103]
[482,20175112]
[216,94973120]
[947,73139110]
[966,15128113]
[488,20104115]
[344,80357107]
[442,15634113]
[371,93589109]
[139,14611120]
[653,46873130]
[927,49640125]
[636,63074104]
[912,66923116]
[217,14800100]
[162,91400128]
[526,64470105]
[428,55234125]
[56,56737116]
[910,49031126]
[67,98485102]
[661,38394116]
[641,34706125]
[340,54028119]
[479,22990117]
[14,44106106]
[722,21029114]
[424,14249109]
[124,56036120]
[890,41976129]
[732,33493106]
[12,10571118]
[690,65067125]
[301,50220105]
[479,35191109]
[704,82561122]
[750,99809103]
[672,39809117]
[276,80853111]
[282,82418113]
[344,72756102]
[165,79496111]
[919,58153111]
[452,78355101]
[758,28240114]
[124,60179112]
[126,94191104]
[723,66210104]
[713,98511107]
[73,98172102]
[13,36811125]
[358,28604124]
[382,47762102]
[566,87237106]
[608,30337102]
[649,13411130]
[758,49765126]
[223,53396130]
[38,50186113]
[739,94356117]
[614,92003124]
[986,30403112]
[81,41905104]
[904,75265110]
[140,63139111]
[867,22640112]
[305,38837104]
[77,15770104]
[300,89537112]
[259,43192104]
[600,46530124]
[348,85391100]
[125,21473101]
[387,97773108]
[433,39661116]
[145,85652120]
[703,27820110]
[283,87079120]
[759,18251119]
[846,30689128]
[929,87772125]
[566,23069110]
[348,67003120]
[579,21922121]
[181,19105116]
[725,32883114]
[494,64799112]
[894,24418107]
[360,48472121]
[289,66236120]
[714,29696125]
[397,16967122]
[600,66440124]
[579,29247130]
[99,84583120]
[427,28269119]
[291,72529112]
[898,41750111]
[171,74873122]
[171,42796124]
[824,49619105]
[820,54514129]
[154,90896103]
[515,25973108]
[299,34301129]
[249,21270119]
[666,11761104]
[396,25779128]
[301,47390116]
[756,15411110]
[727,28373123]
[244,41816114]
[217,90283124]
[994,18903113]
[625,37753107]
[605,69225101]
[599,14407121]
[865,41372105]
[16,25519103]
[251,17271113]
[415,99729122]
[218,66750109]
[276,85149101]
[58,79784109]
[744,23537101]
[840,47483125]
[459,93401111]
[320,86435127]
[337,79577129]
[509,13532112]
[775,79544105]
[847,13928123]
[729,44002128]
[696,41131124]
[22,42377113]
[574,79661125]
[36,84725104]
[117,38998102]
[273,96531112]
[594,91072119]
[673,99313121]
[826,78226120]
[993,53654120]
[296,37426130]
[671,80030112]
[138,41474106]
[767,13830128]
[494,11751110]
[851,99293109]
[987,40693103]
[531,11297126]
[628,51107128]
[325,23548107]
[489,64393110]
[610,41481107]
[485,68328111]
[890,54571126]
[440,78970124]
[804,69537102]
[56,10277124]
[458,88695120]
[644,50917103]
[720,22767116]
[605,54735108]
[430,51928129]
[238,77149106]
[673,81330106]
[14,92528105]
[58,78446106]
[628,67421104]
[180,76539119]
[653,38355102]
[224,51211100]
[279,35996101]
[247,24835114]
[778,69511104]
[385,45661101]
[204,27259130]
[294,25870116]
[583,86354111]
[219,78767121]
[142,35663115]
[755,53554105]
[343,52081111]
[519,95335128]
[364,97893125]
[351,66837124]
[602,85372106]
[436,47044105]
[183,83517107]
[210,91386111]
[185,62858119]
[799,86570110]
[902,76444111]
[258,72706115]
[703,13108103]
[258,91589105]
[730,51188107]
[160,82474122]
[384,71340100]
[999,90296108]
[301,49643114]
[617,33220101]
[843,76424123]
[326,21576117]
[718,27566128]
[858,92286115]
[455,41726106]
[279,86935111]
[563,22273110]
[609,70051127]
[921,71248126]
[128,38394113]
[414,18757115]
[93,13610113]
[666,44419129]
[803,71517125]
[882,52187103]
[137,35394117]
[267,31392129]
[647,83969113]
[966,89903107]
[728,87008126]
[10,52658106]
[647,94053110]
[337,81580130]
[335,82818112]
[153,88733118]
[252,91161115]
[790,62086100]
[272,92842114]
[495,69718129]
[921,97155116]
[891,10262115]
[86,72154116]
[85,42925127]
[946,20749115]
[707,74033104]
[488,77690122]
[162,65198103]
[749,86435124]
[327,50169114]
[37,19511101]
[258,18423110]
[512,77825113]
[9,61124117]
[378,43924107]
[459,43729121]
[63,58440118]
[224,36207106]
[171,25863119]
[874,52255120]
[711,23211111]
[726,75162122]
[672,57913100]
[214,79086125]
[203,80209101]
[420,32008121]
[145,99879113]
[305,50365102]
[704,47600120]
[380,83482116]
[64,37823119]
[543,83339128]
[89,33271107]
[316,70086111]
[160,53563101]
[883,79735125]
[694,89120125]
[16,30876119]
[689,49161125]
[525,60740102]
[111,87078124]
[71,15437110]
[178,43370120]
[867,85235110]
[734,26113103]
[952,53207105]
[511,22211110]
[671,45817111]
[403,29962126]
[653,77536130]
[364,61360114]
[354,73687118]
[272,67766115]
[341,40770103]
[561,89116118]
[263,60908127]
[792,36896130]
[268,44822104]
[966,84572108]
[477,89907117]
[198,20394116]
[382,47671114]
[834,15091103]
[502,79760122]
[250,49687127]
[443,83520109]
[456,75979120]
[83,24978105]
[242,23173114]
[343,69417125]
[941,67516126]
[740,95401101]
[64,67883114]
[458,74591106]
[646,61620118]
[743,72928120]
[740,21651109]
[799,96078105]
[490,86929129]
[408,77232130]
[367,68772114]
[376,37464117]
[185,81609119]
[516,24672101]
[430,88440119]
[820,54180120]
[991,92843104]
[908,71906124]
[509,23754110]
[279,45297106]
[634,13965121]
[414,15318101]
[700,66315105]
[703,11905106]
[454,45737122]
[153,34748109]
[779,80518123]
[346,92175115]
[244,61413130]
[686,48081119]
[566,15857119]
[989,93330128]
[514,40518123]
[577,88437106]
[438,84488128]
[415,32981110]
[10,97252112]
[378,93815114]
[350,70960128]
[297,81385101]
[246,79184115]
[101,47725102]
[855,40995117]
[289,29097100]
[857,69022124]
[99,84676107]
[490,65500123]
[47,14909107]
[792,82792107]
[983,70348125]
[854,38411130]
[31,61515130]
[566,26406112]
[414,18079128]
[149,60480111]
[759,10351130]
[330,14610109]
[778,80904119]
[285,15175107]
[709,14542116]
[149,99147100]
[659,37438128]
[815,98547117]
[21,42547125]
[984,50857113]
[263,79760106]
[138,47459102]
[305,49055114]
[822,32598110]
[481,95216121]
[547,86594117]
[902,80868113]
[115,50284122]
[474,38211129]
[780,29360109]
[788,71530103]
[207,43258104]
[477,20418106]
[760,16785126]
[29,40209119]
[131,77491104]
[0,12052116]
[485,24825129]
[398,59174103]
[408,36979128]
[549,24558105]
[729,52352114]
[872,21738115]
[323,36393116]
[559,61850109]
[308,51002107]
[178,92681110]
[441,21894120]
[909,53864108]
[202,46459130]
[123,21023130]
[184,91483129]
[854,37418102]
[133,73850110]
[756,79035118]
[543,42242101]
[873,50749117]
[343,20642130]
[272,87936125]
[915,51467121]
[666,65386126]
[322,94849110]
[204,95561120]
[252,88777112]
[831,26377126]
[744,87333120]
[275,38884126]
[872,94403117]
[121,14469108]
[76,97512125]
[676,41883110]
[760,30297107]
[851,69773102]
[797,25954103]
[89,55308130]
[495,78596129]
[250,70557117]
[188,65519118]
[277,18929110]
[195,18640121]
[154,59048118]
[972,62762105]
[12,44539129]
[255,90566114]
[99,66460101]
[682,26648127]
[87,18754111]
[21,76476102]
[558,12593128]
[380,23783110]
[465,94161108]
[317,77387108]
[411,59068101]
[325,12417110]
[925,38373103]
[475,48358120]
[402,77491115]
[378,18504102]
[216,57311110]
[597,91343113]
[372,27154124]
[798,72766110]
[661,51322119]
[540,25476112]
[351,89154100]
[817,47268105]
[516,30639112]
[218,99736126]
[89,48417117]
[640,61389111]
[372,39593122]
[396,89488119]
[127,89622120]
[262,47401116]
[981,90482119]
[385,60684107]
[771,40929110]
[130,43249115]
[908,89493124]
[760,63748115]
[610,84157121]
[613,16994100]
[774,96042107]
[608,98769130]
[841,31773124]
[510,34177101]
[313,47913110]
[383,46521100]
[762,54261125]
[3,52212126]
[138,97343119]
[422,88311127]
[490,18967106]
[815,67857107]
[990,69949127]
[790,67555121]
[117,72061105]
[911,69214102]
[365,35959124]
[788,59665114]
[919,79909108]
[729,70283101]
[886,39086128]
[723,34267107]
[17,94309114]
[504,66412102]
[612,38140110]
[471,87304128]
[539,53260128]
[232,16705102]
[488,90843109]
[537,75053116]
[971,94789118]
[893,45063103]
[838,37529103]
[951,54323111]
[725,49224129]
[389,89118108]
[339,86080102]
[134,70925111]
[599,63910111]
[912,60512106]
[232,96197106]
[973,77287115]
[371,40586120]
[196,12716114]
[747,81996112]
[899,48208118]
[850,13091123]
[93,93379122]
[196,49847107]
[158,16321121]
[349,30157127]
[552,39008106]
[476,30624115]
[720,47308117]
[840,16420108]
[610,74342119]
[874,16095124]
[688,38821107]
[679,79384116]
[32,20092101]
[193,35680115]
[869,29986124]
[807,21565111]
[900,39604102]
[896,21903109]
[840,88289117]
[72,25780112]
[544,14875117]
[915,14965124]
[76,50072108]
[924,20040111]
[824,31114106]
[577,78928126]
[502,81008111]
[357,69349128]
[806,61992126]
[498,66789110]
[220,98704128]
[457,75285115]
[258,85913124]
[839,25621127]
[892,59447128]
[296,25813114]
[231,98010123]
[799,21617110]
[12,34632104]
[78,79010106]
[644,57970130]
[302,27003106]
[824,69069105]
[16,63391118]
[134,27894115]
[981,70975118]
[520,79868123]
[925,28882108]
[627,53687109]
[492,23719110]
[743,19966104]
[328,98653129]
[683,76786116]
[112,85889102]
[561,60518102]
[947,13398118]
[398,25775129]
[877,58636120]
[337,46027126]
[670,28393107]
[813,55964104]
[105,65747101]
[507,69297110]
[7,15195128]
[14,58261118]
[847,44226130]
[686,64383116]
[598,44388101]
[293,92197107]
[546,18996101]
[234,95464104]
[412,96273125]
[103,42188122]
[414,68086120]
[120,91232119]
[692,90530113]
[377,29670114]
[348,23639120]
[437,36937105]
[769,53657110]
[280,75157114]
[31,61779108]
[625,53846100]
[249,54607106]
[61,50545125]
[81,23594116]
[661,40917113]
[169,62150116]
[902,44682106]
[324,80006130]
[219,64265102]
[782,89032110]
[191,11345111]
[548,65257113]
[603,11595123]
[546,32078110]
[511,38180114]
[575,84579108]
[359,55327113]
[162,34824116]
[909,73016112]
[633,49921120]
[937,99482102]
[695,40764109]
[262,58727124]
[368,59642108]
[199,79079117]
[331,29564127]
[323,39376128]
[548,99228125]
[214,67151125]
[364,34071122]
[609,34063100]
[713,60209118]
[300,44012104]
[389,47945102]
[233,24293120]
[538,10385107]
[432,12870103]
[743,93097109]
[682,54598130]
[121,35506118]
[613,67934100]
[409,49678119]
[450,70177129]
[381,88147116]
[170,96296107]
[900,84858117]
[668,34879100]
[430,94231119]
[319,43451101]
[901,48179124]
[567,73007113]
[239,58218129]
[792,95456113]
[527,46065105]
[981,56520105]
[886,72276128]
[275,98693105]
[377,95946118]
[642,80717107]
[157,76248103]
[73,86926128]
[799,14782122]
[327,45074130]
[656,41675127]
[390,52476114]
[682,26231124]
[362,24685114]
[965,27289120]
[51,75110126]
[309,94266125]
[451,84481102]
[333,50949129]
[236,53082126]
[229,19922116]
[106,85847108]
[735,65306120]
[272,26552126]
[685,54919124]
[280,56611129]
[878,97776102]
[693,19543111]
[640,96649126]
[106,77597122]
[262,73050119]
[992,95843102]
[217,86866125]
[678,30309129]
[738,74327129]
[970,76570112]
[0,41394108]
[959,38837100]
[51,54557127]
[472,46776125]
[182,82932125]
[485,41431109]
[715,90175113]
[346,21346126]
[504,42683104]
[384,18800125]
[60,79845121]
[374,33067111]
[871,20138120]
[442,68170129]
[886,47789105]
[506,43879115]
[717,86559107]
[83,32359107]
[755,96259116]
[614,44249127]
[829,59433130]
[711,24583119]
[314,69782122]
[335,10635109]
[137,32904129]
[71,68082108]
[829,92535100]
[649,28331111]
[439,13478115]
[921,53951128]
[302,82212104]
[601,94678101]
[405,60217102]
[897,32776102]
[576,36895101]
[25,50287100]
[230,41445129]
[5,96807125]
[368,90791100]
[675,68393122]
[367,85373113]
[775,65041106]
[275,55548101]
[727,35564119]
[889,11287123]
[163,94334113]
[723,89100115]
[906,47703123]
[58,81645118]
[116,56568110]
[19,65041104]
[325,48407111]
[358,14570120]
[72,68875121]
[933,47346119]
[60,12949111]
[657,91379115]
[220,69473126]
[417,52907107]
[78,55306114]
[695,62286125]
[220,31706115]
[938,94225126]
[714,24280100]
[900,86216115]
[422,70864114]
[358,91040115]
[35,91061117]
[265,48570106]
[229,83776111]
[712,52277121]
[591,46983120]
[752,45186108]
[506,38324106]
[482,37032124]
[772,61596126]
[950,60486116]
[838,84852110]
[209,29671119]
[810,16742124]
[896,39958115]
[210,30994102]
[71,44806108]
[735,49418115]
[841,80176113]
[601,33698113]
[578,75862128]
[464,76155130]
[307,37451129]
[135,94974122]
[596,82901123]
[435,74492125]
[432,75011102]
[61,37412122]
[663,42202118]
[162,65135110]
[613,35169116]
[719,91593122]
[353,82501116]
[574,39019119]
[667,79657124]
[197,42508129]
[796,40983118]
[583,23346130]
[918,59349109]
[312,65357121]
[591,65270126]
[221,42655122]
[940,54652108]
[781,63169107]
[75,18605118]
[985,71593106]
[945,67550100]
[708,13932105]
[312,34872115]
[704,20115121]
[9,84320108]
[605,57081110]
[501,89274128]
[670,84969116]
[985,94000124]
[315,41407121]
[795,80707128]
[125,70670106]
[824,46553115]
[27,54388104]
[769,12100109]
[48,74460114]
[716,43806108]
[177,39047109]
[436,62341103]
[882,87099105]
[981,65771108]
[737,26035122]
[446,73239102]
[532,40512130]
[665,48794121]
[49,24298112]
[533,38644129]
[981,39483128]
[600,32799124]
[714,34651121]
[701,34604119]
[880,66262115]
[35,23501100]
[688,84887115]
[554,94458107]
[159,43194109]
[780,71216104]
[417,15819109]
[655,37490127]
[350,89483116]
[591,10618109]
[161,59039115]
[165,68318113]
[524,60372114]
[919,27188117]
[227,27106115]
[779,13491115]
[471,76998126]
[502,36295115]
[781,28149110]
[95,97648106]
[837,63081128]
[227,84376109]
[240,67118103]
[332,17003101]
[312,87252126]
[198,65786108]
[275,82868114]
[625,91580124]
[346,36743128]
[428,23231114]
[677,18782111]
[345,36568126]
[137,66683118]
[299,23261124]
[703,70610104]
[839,36340118]
[58,89642117]
[705,38595130]
[24,16996122]
[383,45923107]
[586,64974117]
[255,24839105]
[322,46479130]
[260,87343129]
[450,28743123]
[882,61265127]
[992,22097101]
[440,31183110]
[446,29734120]
[898,82892106]
[650,72752112]
[115,23747117]
[983,49381106]
[380,33116121]
[67,18999109]
[692,32077103]
[398,48139129]
[664,17733114]
[212,97481127]
[343,97768121]
[227,28443101]
[747,96990124]
[54,67239126]
[635,74854110]
[166,81643103]
[842,98397122]
[644,63719118]
[36,77198129]
[450,77302117]
[112,71574125]
[702,18319113]
[355,56343122]
[377,16418107]
[32,98886130]
[87,62301108]
[442,86532104]
[946,17121128]
[995,19536105]
[453,26305115]
[277,16153129]
[389,75976106]
[579,89775111]
[89,68004104]
[718,58203109]
[953,85229117]
[113,64273123]
[514,51814102]
[386,58827126]
[528,36007104]
[174,93289112]
[283,51022121]
[944,33591118]
[290,65656122]
[833,11469120]
[242,11711122]
[617,16791114]
[727,77902125]
[603,67136120]
[119,18414104]
[638,98022112]
[706,97296127]
[68,61983100]
[987,86814111]
[902,94017101]
[807,10280101]
[560,50383115]
[449,65839114]
[603,84508129]
[319,34444102]
[660,10758125]
[635,46083111]
[576,25099106]
[431,91941121]
[243,50339122]
[537,76512119]
[843,85459112]
[140,86678127]
[217,85219116]
[496,19986114]
[155,12526118]
[123,84271113]
[670,24777108]
[524,41539106]
[857,82535127]
[747,59005113]
[529,15516117]
[984,54503106]
[535,93913130]
[418,82128103]
[500,26958103]
[653,22120127]
[691,81998107]
[465,82962129]
[689,84815115]
[472,90053120]
[833,10793114]
[765,28950106]
[863,61388121]
[5,95494102]
[741,87878108]
[607,97166116]
[458,76475113]
[558,45208104]
[535,21178109]
[423,96254108]
[571,52242130]
[411,34395104]
[553,73011128]
[368,60872123]
[666,72762120]
[521,83337129]
[45,99633124]
[820,16527127]
[610,51148102]
[358,16374110]
[997,19488124]
[303,51713127]
[230,92546126]
[774,44320117]
[955,72133116]
[36,88307128]
[360,99080113]
[948,29528125]
[22,10825129]
[191,97509118]
[936,55408118]
[441,14075117]
[425,43054120]
[478,26941102]
[370,92888100]
[837,88233113]
[544,91331101]
[778,81118106]
[115,42054126]
[522,96548119]
[86,52413100]
[969,71637105]
[9,13077127]
[385,85207115]
[88,24756101]
[999,44147128]
[516,74442105]
[833,52479118]
[121,78640107]
[348,78316107]
[672,56474111]
[960,13427103]
[53,34209104]
[285,21032128]
[676,83718129]
[754,34536112]
[137,32586100]
[241,63931107]
[272,21658111]
[287,81210109]
[816,69378125]
[851,59150120]
[212,72646123]
[232,29106122]
[307,23069123]
[995,51913129]
[390,87763101]
[581,12654102]
[816,21025109]
[241,16330109]
[188,62351117]
[861,66017113]
[235,40322116]
[965,89900115]
[695,79110129]
[457,68306125]
[431,51803104]
[14,52251127]
[392,23547114]
[465,82768124]
[936,76578105]
[641,78140100]
[245,84857116]
[778,96269126]
[749,31279124]
[86,16120117]
[432,22317130]
[133,34311123]
[865,25423111]
[761,96611111]
[559,59127108]
[358,22562104]
[248,99315116]
[577,74437111]
[679,50032126]
[0,52885125]
[340,25802110]
[858,57495109]
[366,17092125]
[55,16972112]
[803,52560123]
[279,84483120]
[483,54489129]
[957,15395123]
[301,90685128]
[611,34317124]
[842,13338111]
[317,22944108]
[455,87284101]
[818,77992105]
[641,84770121]
[803,16133107]
[8,79578104]
[640,48027115]
[446,73802115]
[187,98230125]
[672,39155118]
[108,68724129]
[358,45966121]
[151,85951109]
[827,93054117]
[849,99711108]
[12,40026105]
[280,56342100]
[344,97057130]
[793,78294112]
[988,82106111]
[782,21505101]
[129,53140125]
[906,10850106]
[808,72108120]
[84,97700114]
[650,58719121]
[797,67973108]
[481,32906130]
[469,85864121]
[19,75023110]
[100,48035120]
[937,64777109]
[344,58664112]
[235,64702104]
[905,74943122]
[419,49713104]
[638,35037122]
[79,68211115]
[377,77441108]
[285,84410129]
[712,68095102]
[10,73760115]
[649,64351113]
[224,81085122]
[134,54198105]
[327,61837121]
[754,59695112]
[41,12378130]
[983,29072128]
[484,54527119]
[178,23800106]
[542,52625116]
[457,49908101]
[604,88441105]
[446,49606100]
[785,32085117]
[223,17261129]
[732,81613124]
[228,77303115]
[209,76149126]
[570,43269101]
[706,42523128]
[11,29832103]
[106,17901106]
[107,74704127]
[667,40340123]
[880,12296116]
[180,47262115]
[56,20431106]
[603,94383119]
[820,64139123]
[246,38062125]
[463,13808128]
[813,96173108]
[341,99651107]
[908,20830118]
[5,13577118]
[928,29347103]
[872,83922113]
[31,37861125]
[70,16931108]
[570,23380116]
[778,67642123]
[397,76519111]
[599,43455101]
[486,28936129]
[879,84638111]
[567,99467111]
[110,25497128]
[713,79076111]
[692,18725110]
[783,33568103]
[623,52952118]
[15,12479107]
[835,98262121]
[581,83596108]
[890,13640124]
[131,31241109]
[217,30830101]
[255,97980113]
[573,94140107]
[587,19255121]
[654,35901108]
[243,51565119]
[142,53628122]
[893,45973102]
[695,51250109]
[682,11622121]
[662,68529128]
[117,87308101]
[21,84335130]
[111,59151105]
[300,43532121]
[870,75057112]
[433,91108126]
[711,85036100]
[648,77597114]
[482,37874107]
[425,97973113]
[882,16821106]
[623,33927105]
[173,26064101]
[514,52591100]
[986,61269130]
[969,96553128]
[502,85047126]
[20,12901113]
[880,24037113]
[544,73606120]
[957,59227101]
[536,44158115]
[57,28665108]
[512,26543108]
[295,13294119]
[102,98582117]
[756,86454126]
[601,51921130]
[888,45977120]
[985,74038116]
[210,70947120]
[35,64289117]
[734,34155104]
[341,52222105]
[416,63710124]
[263,90370120]
[459,32763121]
[889,23041121]
[452,17923130]
[865,65822110]
[112,90767127]
[887,20765124]
[402,75911114]
[769,84351114]
[86,69928120]
[998,87452112]
[959,26741116]
[280,17667121]
[133,30264109]
[420,99096117]
[179,16900103]
[454,15888113]
[383,65797102]
[97,78518120]
[125,61830110]
[873,49392122]
[470,19405103]
[864,68343109]
[264,58748129]
[505,19094121]
[765,71427120]
[619,32763113]
[688,64344102]
[963,89592108]
[435,60697103]
[88,44234104]
[648,15476106]
[358,14767123]
[88,68181116]
[45,26050103]
[61,64835103]
[742,54138126]
[432,89916123]
[200,64736108]
[550,67821121]
[95,66231107]
[8,87563103]
[394,73196108]
[229,60954129]
[268,52739128]
[293,56370124]
[219,23417129]
[564,93061111]
[131,57421118]
[723,86362124]
[25,56141118]
[2,92814126]
[401,40177118]
[434,89243110]
[632,58147100]
[376,93886114]
[263,60235129]
[194,33492123]
[836,55086127]
[826,58338104]
[904,17744124]
[44,32364125]
[158,17971102]
[194,96237130]
[46,18134130]
[506,47119112]
[117,83084116]
[439,20769127]
[507,60476101]
[713,71704112]
[458,37171119]
[759,64462112]
[328,42533102]
[841,96883105]
[689,35731126]
[200,48944111]
[672,72177118]
[423,53713116]
[353,46142120]
[754,84654108]
[9,96935107]
[981,76896128]
[986,97400106]
[124,54916117]
[985,47380119]
[1,28434110]
[216,96547117]
[816,38851124]
[89,15363106]
[719,31894117]
[825,22643122]
[393,99772108]
[336,95669127]
[988,17595100]
[945,25212109]
[199,81272130]
[890,88099115]
[437,84164128]
[377,26460108]
[702,23194107]
[167,60176115]
[734,80733100]
[654,75278119]
[487,33111114]
[40,46827128]
[839,10921101]
[798,33864122]
[65,86147126]
[534,90765104]
[690,49388106]
[841,44203124]
[568,67574122]
[356,70880105]
[469,62271125]
[85,20978125]
[557,63458118]
[716,27998105]
[63,17724123]
[621,47984119]
[716,85951104]
[713,52187110]
[63,22486119]
[859,38782129]
[990,64007104]
[536,82339107]
[151,79499117]
[897,90840126]
[969,39298122]
[251,76084105]
[431,66739123]
[172,69524129]
[536,94164123]
[931,44733126]
[780,72581115]
[130,63241128]
[185,54625108]
[282,97620121]
[991,87728102]
[887,28750121]
[935,74089126]
[68,29152110]
[960,52093113]
[43,63816110]
[703,15025114]
[360,52328105]
[734,93169116]
[308,54208126]
[689,97389126]
[965,55426127]
[488,66823122]
[46,88841101]
[971,17511108]
[752,69640100]
[914,81597126]
[956,85591108]
[739,38250130]
[822,16139130]
[129,10546116]
[965,80837102]
[572,87368105]
[430,24092128]
[812,77635108]
[125,16911111]
[626,98581112]
[642,71699122]
[915,43767129]
[874,18041105]
[238,73821123]
[735,77411102]
[14,30032121]
[964,70102124]
[80,68506105]
[924,45565104]
[898,39092126]
[876,38424117]
[302,74809127]
[816,36074119]
[461,61866122]
[307,18052112]
[178,57533113]
[517,59059117]
[22,32262110]
[853,69899123]
[42,47694103]
[836,52667129]
[597,32650122]
[781,58118121]
[625,57598105]
[971,38181111]
[151,26052109]
[241,19239126]
[395,76816100]
[857,97970111]
[16,28759103]
[287,32312128]
[60,44402114]
[413,49565106]
[426,75050128]
[162,88808106]
[875,37969108]
[496,74534126]
[372,47766100]
[713,65059109]
[701,40645117]
[875,85239121]
[235,84818111]
[703,84883118]
[795,36170101]
[171,17342121]
[90,81894113]
[442,22487123]
[513,43950104]
[190,21950120]
[240,67702124]
[750,25804113]
[90,61588101]
[553,61626111]
[238,65169118]
[582,89978120]
[659,69229124]
[765,87258127]
[128,13046113]
[869,59680126]
[362,20661128]
[674,45880127]
[304,14517111]
[856,73478129]
[135,55636110]
[788,22824126]
[7,55815104]
[545,70685106]
[554,32765106]
[190,21807101]
[524,91812109]
[4,79348130]
[129,86604114]
[186,74159127]
[976,63843128]
[906,83679115]
[268,57944102]
[160,85037122]
[663,34061106]
[955,34214108]
[425,19930104]
[531,54152100]
[896,24578117]
[388,80200105]
[583,49609115]
[933,29903108]
[933,73037113]
[751,48954100]
[279,17615119]
[534,36178110]
[482,66639110]
[206,89426105]
[603,23842102]
[805,50720117]
[980,11604115]
[303,30204104]
[333,77348114]
[849,84916114]
[545,42189109]
[911,83595129]
[429,25635117]
[900,23778111]
[773,98975129]
[64,38044121]
[779,20564107]
[415,73139118]
[93,54556127]
[628,13885126]
[347,29571117]
[631,15735109]
[435,65463126]
[509,28063129]
[242,87278124]
[348,61538114]
[779,62889100]
[124,41923124]
[365,43022104]
[427,99902107]
[409,24590101]
[46,92224117]
[506,12434110]
[453,21365103]
[945,29829106]
[42,79465118]
[600,50945121]
[748,55433128]
[789,37393109]
[196,39752124]
[89,98136106]
[869,17525103]
[968,78835123]
[343,74583101]
[424,93027109]
[870,51457130]
[63,43889126]
[40,49130100]
[747,52953124]
[7,37259104]
[917,75901101]
[771,66258120]
[638,97127123]
[991,59087125]
[773,13770128]
[541,33676108]
[609,27881122]
[178,66724118]
[630,51701104]
[660,25783102]
[710,82512112]
[636,78100112]
[90,35112100]
[499,24460113]
[244,13293100]
[849,44992105]
[104,93268128]
[63,43534121]
[131,68377119]
[448,89792116]
[320,71727103]
[979,57677117]
[894,33643107]
[840,93937119]
[164,89115128]
[991,42379102]
[497,96865121]
[20,23079128]
[385,87145130]
[751,97101110]
[479,97258123]
[651,56607124]
[803,59542128]
[817,55489119]
[49,20303103]
[944,58113117]
[759,73781123]
[575,29400127]
[8,99983106]
[144,43244121]
[539,48372121]
[555,36270103]
[554,50443101]
[56,49764117]
[795,23399128]
[333,12880116]
[704,17143101]
[683,38833122]
[856,25224106]
[118,97017107]
[402,10229105]
[713,77613128]
[116,95060129]
[93,42442126]
[704,13771112]
[70,91151114]
[619,94702123]
[457,60692128]
[180,10912123]
[238,83460100]
[507,30439125]
[381,98281124]
[106,80773123]
[61,81235108]
[42,19978120]
[441,72105118]
[12,85773114]
[879,48046119]
[880,30786130]
[990,88904126]
[447,83473114]
[67,16293116]
[818,37233100]
[236,34078124]
[849,64849112]
[630,45979125]
[334,63551119]
[185,46291105]
[27,64110121]
[679,40170102]
[994,20424112]
[345,42979129]
[378,54519118]
[421,75590109]
[676,97982112]
[721,73296107]
[858,66634102]
[963,16134112]
[204,86886109]
[16,47516106]
[791,80473103]
[332,37322119]
[956,43197113]
[913,95532108]
[923,33419125]
[96,93343104]
[289,92785113]
[59,15843100]
[632,13481126]
[621,42166130]
[3,63149116]
[989,65759126]
[12,73789112]
[831,17974123]
[328,61752106]
[682,29930124]
[286,64858113]
[622,76768111]
[469,41175105]
[432,79213122]
[256,12694109]
[169,75188109]
[104,96753121]
[289,86474114]
[548,75011118]
[20,15429101]
[257,68676125]
[559,74713122]
[228,58994108]
[768,96215109]
[159,96953117]
[224,89881110]
[133,20701100]
[399,90144121]
[96,78188105]
[888,85668110]
[15,17695106]
[406,69299114]
[280,77939129]
[913,93898128]
[441,70461120]
[247,18464113]
[857,60062123]
[602,74218120]
[891,74025114]
[237,71396104]
[365,78935111]
[913,11868130]
[356,57574110]
[401,38279121]
[164,62177121]
[833,17207115]
[75,39654130]
[252,43059117]
[460,16452100]
[977,24099116]
[680,93607127]
[155,14567128]
[175,16704126]
[423,54361110]
[430,18378117]
[8,12420119]
[364,89748111]
[95,19518123]
[696,68396127]
[876,23238124]
[956,23397124]
[33,64150100]
[79,22361116]
[397,60520108]
[956,32269127]
[243,41525128]
[914,42921122]
[800,93530111]
[221,20738125]
[919,90322119]
[335,58516115]
[320,85853108]
[206,78268130]
[486,36739104]
[844,25262110]
[655,18697119]
[499,30562112]
[354,78189118]
[41,97079130]
[305,51785105]
[435,34304107]
[201,77539127]
[782,88010108]
[821,68107115]
[18,79956102]
[250,68377128]
[840,83185117]
[820,29275118]
[478,67769101]
[209,49958105]
[851,17407121]
[479,47673102]
[509,64181129]
[715,77295115]
[984,42217117]
[755,43580116]
[38,32751122]
[474,53451120]
[842,80444115]
[546,67875124]
[420,98180122]
[329,81016127]
[986,95012124]
[361,57207109]
[377,28635124]
[203,61620104]
[316,17646104]
[94,31821103]
[532,60208116]
[309,75073124]
[127,40930123]
[903,34073115]
[224,94958100]
[727,31245111]
[160,19849102]
[890,56638120]
[444,84436116]
[480,37389130]
[666,66674119]
[180,38407118]
[609,19527122]
[827,26481122]
[460,29605105]
[824,77858119]
[708,48601118]
[211,55035122]
[382,50417123]
[866,82437118]
[27,14028116]
[789,27253118]
[232,14971104]
[313,77967130]
[565,55734113]
[739,84390106]
[562,54678117]
[953,64152113]
[563,75854107]
[212,92572117]
[161,93785116]
[61,64668116]
[65,69485101]
[118,16944125]
[19,67615107]
[608,19512110]
[647,76607125]
[239,81193126]
[981,98475103]
[376,41869106]
[63,22240112]
[549,64407130]
[197,79651120]
[719,12305105]
[956,67621129]
[687,21758118]
[47,92124118]
[921,90756107]
[318,53788113]
[381,59118127]
[330,24120111]
[957,88246108]
[718,61158123]
[734,83044130]
[487,73613128]
[712,66731128]
[762,10639119]
[536,22407100]
[548,81709106]
[116,31855108]
[701,46807110]
[767,25731121]
[970,56672128]
[32,82435127]
[45,55300123]
[97,26548117]
[972,74122119]
[109,36989126]
[521,12800105]
[839,57581110]
[787,21185101]
[203,78113107]
[949,92295113]
[165,94261116]
[540,56028117]
[55,35696107]
[19,20633126]
[106,65924125]
[729,32493121]
[623,52013120]
[503,57781122]
[953,41123116]
[542,55152117]
[231,58461121]
[695,60910113]
[331,54981127]
[894,23357113]
[811,45681108]
[183,75964121]
[166,34774121]
[867,63270104]
[190,94782119]
[948,90068130]
[418,82838100]
[675,54770124]
[727,24009112]
[130,33546118]
[931,72549104]
[173,57223105]
[640,89596116]
[506,29781107]
[314,21470111]
[91,96271109]
[781,41159108]
[632,69291126]
[177,49249116]
[221,91043121]
[425,63262127]
[799,58680130]
[327,83778105]
[525,14778100]
[35,38775124]
[181,46569103]
[970,66952107]
[380,41958127]
[643,60336123]
[654,75189124]
[953,47109126]
[559,77022113]
[13,54462126]
[57,56099105]
[981,18211114]
[858,98535106]
[651,25676123]
[541,98329108]
[903,82323105]
[264,74084109]
[287,25483127]
[439,36935114]
[633,56910112]
[184,40244105]
[696,19810116]
[767,68823117]
[535,28205126]
[736,15677116]
[276,67035104]
[41,66235122]
[862,86734109]
[932,72784102]
[479,75917127]
[221,48523122]
[231,16953103]
[875,37260118]
[54,86145124]
[593,40639120]
[219,74255101]
[400,14582124]
[91,83305123]
[292,41450128]
[606,82226126]
[496,54036120]
[830,72477128]
[153,25720118]
[413,47773115]
[594,29960109]
[676,59417128]
[223,99466129]
[774,29112119]
[375,71039103]
[823,63121100]
[20,86110114]
[77,46236119]
[91,64911103]
[949,93516111]
[449,70440120]
[142,12889122]
[712,89940118]
[602,72864127]
[601,76202103]
[664,11710113]
[312,18545118]
[233,42663109]
[522,71520120]
[192,32304119]
[891,64178125]
[965,40630111]
[690,45886110]
[584,21414110]
[647,52576112]
[602,28460105]
[284,98450122]
[693,84754126]
[190,80445102]
[558,58651119]
[247,84461115]
[805,52432121]
[669,56601111]
[738,46806114]
[401,82658129]
[18,50982126]
[257,81198105]
[348,25936124]
[126,26280115]
[459,20812126]
[570,38886105]
[267,48876123]
[487,38541125]
[283,44033108]
[307,12646127]
[301,60437110]
[999,29076117]
[201,84950109]
[591,25001129]
[283,11103110]
[134,71013114]
[916,17215112]
[673,46934128]
[37,56365100]
[654,51313114]
[397,95288122]
[91,45394114]
[791,57373113]
[557,63980121]
[116,17918110]
[345,98496107]
[749,14005119]
[55,82201117]
[16,57098128]
[391,57199128]
[302,57756111]
[26,74008103]
[301,39991124]
[704,35067113]
[403,84057112]
[900,70340115]
[519,92071100]
[735,42755128]
[41,66582101]
[640,87824126]
[450,66377113]
[42,98528123]
[774,19620125]
[314,22724116]
[194,61216130]
[345,27405112]
[125,47491130]
[836,68771120]
[272,65514108]
[251,33619108]
[398,26902125]
[64,43453118]
[753,44663129]
[134,43244120]
[719,54399118]
[951,29625121]
[86,76755110]
[125,78094100]
[663,66699103]
[118,16319112]
[760,48189111]
[17,88128107]
[186,89425102]
[641,39478100]
[563,62243127]
[354,56589106]
[641,65604101]
[244,71911125]
[662,67083103]
[800,20245104]
[399,33349108]
[90,80249128]
[580,57991100]
[204,55333119]
[408,80123116]
[423,60951100]
[26,81606103]
[176,65367106]
[972,27795123]
[396,98314123]
[586,47025111]
[870,15209105]
[366,37145111]
[457,47347119]
[593,53202102]
[747,35097129]
[568,23384115]
[217,71061115]
[513,74560103]
[161,70424108]
[149,74615130]
[784,59210113]
[465,81875119]
[146,77576128]
[16,53561115]
[531,94925107]
[120,52852114]
[191,31765123]
[178,11083104]
[653,29761114]
[422,23408106]
[634,58420120]
[640,49188121]
[228,28479126]
[796,21021128]
[753,75667127]
[630,10698118]
[947,87288110]
[866,33690125]
[473,55265101]
[534,53009100]
[955,23163123]
[864,94774111]
[597,39443110]
[20,65388106]
[435,70355130]
[823,46096120]
[243,20551108]
[201,29689113]
[138,22425110]
[818,64753112]
[827,76920130]
[361,13173108]
[450,92344115]
[280,32530108]
[883,64810102]
[893,21497101]
[528,35218100]
[684,57190108]
[278,98897114]
[921,82970128]
[309,47295104]
[117,28938122]
[457,94244129]
[955,92318130]
[689,89638112]
[174,59422125]
[812,21922121]
[806,27909119]
[243,47925100]
[509,59177125]
[568,40954118]
[800,90370106]
[535,12603101]
[104,27778116]
[409,97496128]
[199,76142126]
[517,81881114]
[907,27810118]
[156,22722109]
[362,54224106]
[460,75798107]
[882,57744106]
[796,93221121]
[497,81235128]
[625,86130100]
[83,66390100]
[695,39643124]
[859,12508102]
[98,55525112]
[725,70997124]
[517,49878114]
[516,73540127]
[519,46504111]
[979,82827103]
[533,15957103]
[707,74315122]
[623,23635127]
[535,77198127]
[711,81491103]
[288,66028124]
[608,52119130]
[633,42423120]
[617,45445110]
[26,86724123]
[617,19072122]
[935,74417104]
[914,66452130]
[592,49687101]
[495,25115128]
[350,14069110]
[690,71451117]
[307,82264110]
[394,69942112]
[743,40628104]
[442,83325102]
[924,19528104]
[650,43931108]
[139,86077127]
[322,55856126]
[42,62929126]
[738,92981124]
[994,89121128]
[719,67783106]
[434,34502108]
[718,50119123]
[915,31143109]
[830,16041119]
[463,66679103]
[822,74305123]
[21,19120127]
[217,80639117]
[542,87708130]
[607,60795110]
[14,14318109]
[22,73978116]
[493,76264101]
[843,30938101]
[49,57007110]
[17,84328123]
[984,28728116]
[672,94511116]
[506,55313116]
[430,13074120]
[896,18703128]
[525,93372113]
[66,26040107]
[60,91750128]
[302,81493103]
[887,34290111]
[28,72805103]
[293,55217105]
[277,81457116]
[746,85901125]
[272,36265123]
[181,19161109]
[176,25667100]
[851,66037116]
[573,47188119]
[146,87772124]
[376,62593130]
[687,40395109]
[389,27265120]
[651,71649126]
[489,33188110]
[799,99960120]
[901,74441107]
[885,70085117]
[658,47997109]
[155,59625122]
[462,83591100]
[183,69177116]
[851,33931115]
[165,99261119]
[28,76356124]
[486,19482121]
[410,32175125]
[3,71842121]
[939,48993125]
[481,65968103]
[163,75550120]
[798,31646127]
[681,38293125]
[198,14735127]
[696,36184108]
[476,22168109]
[630,14123103]
[692,41185114]
[984,33699128]
[660,51630129]
[726,26500120]
[514,67836110]
[747,56515116]
[571,32754116]
[814,38378130]
[223,95906114]
[233,90701112]
[875,75074108]
[457,81560125]
[515,72435126]
[368,36136111]
[930,60137120]
[259,97372130]
[95,10929107]
[230,95949124]
[540,99090112]
[957,71161129]
[239,89114117]
[730,37322123]
[219,72471124]
[587,40889118]
[829,63949102]
[882,68818118]
[557,59167103]
[830,70138109]
[204,34774110]
[619,10489125]
[631,33992117]
[409,77295125]
[586,87183127]
[245,28879122]
[714,14784125]
[45,78847129]
[854,41562109]
[112,35650127]
[396,77307100]
[836,53207110]
[143,41964113]
[2,43604107]
[930,73954116]
[137,49311113]
[270,50452119]
[812,33090124]
[590,36914113]
[755,79580109]
[693,32755127]
[662,78238111]
[67,50656111]
[428,15657124]
[766,47769130]
[710,37451115]
[632,49243116]
[134,70958119]
[918,85226104]
[599,81190126]
[395,13851100]
[592,83053129]
[745,21852106]
[872,68994100]
[141,59718116]
[66,20070129]
[333,57066124]
[450,39333120]
[427,93072116]
[719,19001107]
[457,83779115]
[535,97638112]
[873,77962102]
[370,10460122]
[442,46851125]
[355,55798124]
[703,27892109]
[983,98500130]
[603,93017110]
[630,47177100]
[561,10185107]
[490,75687126]
[102,49750117]
[741,32942105]
[820,70219116]
[751,37721127]
[897,31940122]
[882,65527102]
[645,95766123]
[29,89222120]
[781,36981110]
[654,65600127]
[322,83364117]
[67,91542112]
[409,23152117]
[259,56809109]
[690,94927104]
[417,72498105]
[29,12826129]
[129,38440124]
[1,10261108]
[90,84284119]
[657,35508126]
[896,46269120]
[37,91871109]
[800,60172105]
[979,76638105]
[503,56780115]
[948,91726120]
[83,40751111]
[997,49142108]
[920,12179114]
[84,17185130]
[532,27526119]
[992,38402111]
[506,42969120]
[233,19854119]
[465,44605120]
[860,42879123]
[133,43211127]
[542,86892117]
[172,95144105]
[152,56678130]
[824,23536125]
[70,97314127]
[288,62811110]
[934,81910102]
[873,50630124]
[276,52040102]
[503,85022110]
[898,82928117]
[598,96694127]
[703,12432111]
[11,66701120]
[726,99191116]
[309,66386118]
[459,41873109]
[401,84070105]
[942,18460119]
[33,33596118]
[454,70483116]
[407,52018102]
[977,47722117]
[6,16228107]
[496,10717103]
[90,52577120]
[90,51125100]
[504,49461109]
[75,47521111]
[464,81882121]
[826,91154122]
[352,14321108]
[688,59544115]
[824,43927104]
[642,83346119]
[96,73744124]
[433,64889108]
[929,37262100]
[665,40178126]
[707,64929115]
[114,40317108]
[937,23828108]
[220,14080112]
[167,16151119]
[751,70898100]
[222,81985103]
[261,72679118]
[172,51010128]
[538,95477111]
[548,20958104]
[398,23637113]
[729,38688109]
[495,20054121]
[147,64262118]
[952,68519118]
[282,83624107]
[229,41702126]
[437,33617121]
[490,21170126]
[103,27728101]
[845,47976125]
[893,70794115]
[441,27910106]
[232,10785105]
[793,39979107]
[176,48786110]
[361,32376125]
[878,46745107]
[185,70563113]
[60,40790111]
[572,74235116]
[196,29123125]
[571,46927117]
[428,37909110]
[85,80425123]
[915,25467117]
[372,97654103]
[572,96946126]
[553,40508106]
[983,20258106]
[515,72418119]
[132,55058110]
[906,66211123]
[288,70609109]
[130,26822119]
[233,87543113]
[294,77345116]
[166,30522108]
[743,59280114]
[945,81282122]
[158,91183123]
[734,69165102]
[707,15981114]
[565,54826125]
[847,41171102]
[458,18692100]
[34,18025119]
[252,52975108]
[850,19821130]
[112,43058130]
[260,85811125]
[841,63489106]
[687,29600104]
[98,18026120]
[98,76902115]
[939,27772110]
[915,88475113]
[631,50455129]
[453,71415105]
[205,41038129]
[594,11233113]
[709,84266108]
[25,27872117]
[28,26130113]
[123,67962120]
[60,52132108]
[32,87187112]
[968,48008111]
[197,83192121]
[511,17487103]
[945,68170128]
[84,26520115]
[923,44707128]
[499,50906113]
[894,75492122]
[988,22909110]
[563,26795112]
[844,36497109]
[243,17934128]
[479,74695106]
[689,66013112]
[646,71810120]
[964,14738122]
[280,25947106]
[296,17450126]
[50,15173101]
[471,70173127]
[128,86201124]
[833,80081111]
[626,84563101]
[242,83614100]
[501,30450120]
[484,26824117]
[428,25450109]
[588,60770130]
[307,78347117]
[615,81194111]
[910,56116101]
[428,32394104]
[321,55603123]
[626,82362112]
[909,41509107]
[33,99249118]
[78,72092105]
[869,98873119]
[181,42643105]
[885,95825119]
[51,61108104]
[549,85091108]
[920,79188116]
[283,54261103]
[290,80541107]
[840,26349125]
[270,10685102]
[798,97198110]
[835,38791120]
[841,94416112]
[222,71104128]
[566,36521125]
[220,18482102]
[817,21567126]
[987,54753121]
[514,41187107]
[136,10095127]
[914,45769104]
[589,37042120]
[546,46659109]
[977,17190126]
[237,84050115]
[655,80452126]
[10,95951101]
[525,35804107]
[968,18016114]
[867,70071125]
[203,52179115]
[35,57001108]
[841,19412102]
[621,73889100]
[10,75037124]
[525,60894111]
[247,52180116]
[579,72552105]
[972,98114114]
[957,65443106]
[33,86617130]
[856,50949117]
[381,37940116]
[877,78795106]
[946,63223120]
[717,97588126]
[477,47421112]
[842,61117102]
[699,17418118]
[475,66675123]
[723,94406125]
[554,13078122]
[161,29872102]
[645,16526126]
[850,54212115]
[791,27986123]
[261,79293113]
[70,51980110]
[886,91164115]
[63,32601124]
[890,44394120]
[365,20780106]
[571,91718130]
[119,83766120]
[21,25644108]
[678,91475112]
[981,85040114]
[504,35645130]
[59,53381104]
[696,14377119]
[681,25960118]
[889,25021120]
[505,31089112]
[194,94057126]
[963,90267105]
[452,82257123]
[786,95532104]
[568,69859119]
[517,37959121]
[914,86895122]
[86,99185124]
[859,65442114]
[317,28877119]
[992,83039106]
[272,92213120]
[582,67313124]
[679,62214118]
[830,31481122]
[555,48545129]
[774,14164130]
[96,79407110]
[381,26685124]
[901,32065105]
[37,94976123]
[712,57720124]
[608,43945110]
[759,13635106]
[102,69593112]
[264,49383127]
[685,33493125]
[466,12449109]
[928,88900128]
[96,10140121]
[511,42816122]
[740,51816108]
[739,79485115]
[93,90708121]
[946,15282122]
[118,36914128]
[764,60356103]
[953,31846112]
[149,35705127]
[138,72403105]
[337,41206121]
[769,89987123]
[702,38387107]
[648,92795112]
[898,42526107]
[236,55895127]
[521,43481123]
[310,37235125]
[670,15883103]
[41,51349127]
[737,36228108]
[742,80108108]
[421,74476122]
[894,63185123]
[405,97000119]
[473,86724126]
[92,25901105]
[175,25262127]
[475,51789114]
[993,26421106]
[955,92205100]
[371,28483104]
[267,71575116]
[50,13243111]
[834,33306129]
[107,61082101]
[782,99454108]
[186,34253110]
[727,27292103]
[233,62249101]
[110,29723101]
[316,35518124]
[44,54152119]
[506,11653130]
[243,93284116]
[446,69216114]
[243,88914123]
[882,45881107]
[269,36933104]
[993,92510104]
[648,94787113]
[935,96018108]
[764,86641112]
[75,42918105]
[688,22398112]
[841,23965121]
[94,11548108]
[758,24004113]
[741,46045124]
[695,46610110]
[455,85884108]
[92,47901129]
[137,50648123]
[441,14850114]
[970,32435114]
[823,23139128]
[765,79175113]
[942,73588106]
[91,50313116]
[373,29583117]
[369,32698116]
[906,28786108]
[532,83702117]
[840,52889118]
[563,44055119]
[365,69585111]
[445,17468101]
[781,47964123]
[114,50289110]
[221,68079109]
[336,11324100]
[905,55986123]
[373,71444122]
[124,39313121]
[67,48681129]
[454,33977105]
[543,58082121]
[927,90607129]
[112,73745123]
[186,11417119]
[438,23176118]
[550,34406104]
[500,71962104]
[787,33752109]
[897,48622113]
[384,98284111]
[55,89958127]
[864,20106130]
[172,16067127]
[329,10105117]
[749,26660117]
[666,20826104]
[932,18867108]
[21,30251125]
[715,43290112]
[260,75056127]
[143,76927120]
[683,63493127]
[169,56406112]
[797,72622120]
[621,60512121]
[56,57402101]
[282,17346130]
[948,30778111]
[560,17810119]
[888,85353101]
[934,58405105]
[734,83246120]
[109,71915112]
[635,89894113]
[907,78233106]
[985,95047124]
[142,11180114]
[939,25124103]
[469,17271115]
[136,35566100]
[606,69310126]
[852,61778124]
[375,37183123]
[313,39398123]
[729,67233121]
[379,96816121]
[954,48099119]
[518,36818100]
[152,51280108]
[82,46807102]
[985,95218108]
[762,49442106]
[281,27522103]
[762,48514119]
[284,10321100]
[738,58021108]
[241,84916110]
[460,81698104]
[859,98097106]
[362,74865130]
[104,89416122]
[116,20993114]
[981,58978112]
[98,38145127]
[405,23105120]
[610,87254114]
[676,45994102]
[933,53371115]
[985,85177125]
[194,21801113]
[544,81976112]
[647,96138119]
[352,76069108]
[34,44252130]
[857,34894121]
[267,63053100]
[74,70160101]
[77,95514119]
[38,66586117]
[219,61298105]
[240,88973103]
[239,72854101]
[525,37952113]
[772,39909129]
[765,18633117]
[187,60144106]
[78,47632129]
[102,45422121]
[683,54883129]
[346,48169113]
[547,55029110]
[70,42110111]
[541,54854111]
[241,80679112]
[100,27353115]
[651,24329130]
[377,44148113]
[164,32707110]
[520,22597126]
[445,60252125]
[229,77298126]
[77,13463107]
[267,48345130]
[180,73136130]
[868,63925100]
[613,53745103]
[614,37301116]
[346,52875105]
[131,67380114]
[147,85602107]
[993,48571102]
[665,12491104]
[592,67357123]
[511,73959106]
[503,98083130]
[561,63509121]
[126,81597118]
[519,18893110]
[481,15149103]
[975,97820126]
[400,29080128]
[615,33676109]
[827,21703108]
[854,30466106]
[86,68402116]
[909,83263122]
[624,87014106]
[168,24610111]
[848,30771130]
[664,34651126]
[877,25857101]
[34,10011127]
[598,88778106]
[194,94906102]
[335,43833104]
[786,22821102]
[471,75874105]
[727,83841128]
[448,22730125]
[770,63024121]
[262,89378113]
[832,83942119]
[12,29238122]
[762,45547128]
[430,68845112]
[963,29805122]
[936,21815117]
[359,86129123]
[345,62110127]
[154,93534129]
[915,52775105]
[241,33147104]
[751,46684124]
[773,14202114]
[482,42642119]
[941,81892124]
[927,22521104]
[907,92941102]
[41,85024115]
[473,82887130]
[108,22903120]
[624,33733110]
[75,63828112]
[358,90793114]
[378,41016123]
[743,54674121]
[813,29014126]
[400,60962103]
[444,69049105]
[709,74843117]
[928,72964109]
[214,42737123]
[61,50732114]
[642,99523129]
[638,29943115]
[88,66717114]
[844,14147111]
[357,51429111]
[828,11892116]
[876,43158119]
[287,21504110]
[846,50813126]
[79,20166108]
[753,56336112]
[109,84791109]
[313,77880107]
[153,58485128]
[81,14948102]
[551,11245102]
[215,71015125]
[614,92032127]
[477,17635114]
[478,80928119]
[672,42748126]
[366,26772108]
[251,85615125]
[680,26612103]
[676,15774122]
[209,88475127]
[863,54033126]
[645,14749115]
[109,73797130]
[498,32537121]
[656,79733124]
[665,37966100]
[783,77675119]
[960,98073104]
[639,84338111]
[355,50211124]
[83,85213114]
[155,86450112]
[636,29108110]
[435,46653116]
[394,14779113]
[617,75374117]
[218,77766115]
[885,47050130]
[831,61070118]
[374,33450107]
[566,87956101]
[289,56844108]
[468,95233100]
[3,12773105]
[90,61819100]
[874,98334120]
[47,65365106]
[179,29504105]
[405,36048129]
[812,47958105]
[314,73874120]
[543,62547120]
[288,78868126]
[916,77894129]
[446,51869106]
[261,76163119]
[594,67883100]
[426,13655130]
[774,88495121]
[884,47492116]
[65,63242116]
[777,79230129]
[455,87521121]
[755,81729107]
[855,59477128]
[63,13674126]
[112,87775128]
[148,96936115]
[279,44035100]
[994,58194107]
[809,15187126]
[873,57700111]
[209,22394105]
[81,25651130]
[654,11754104]
[823,15577106]
[710,98842119]
[163,30469104]
[999,23448108]
[250,84514117]
[968,54651101]
[456,24177115]
[17,75236101]
[939,28692119]
[597,41045112]
[867,74551111]
[967,79232124]
[990,34615119]
[830,97709110]
[415,71407116]
[762,87043128]
[147,60534104]
[580,42260102]
[446,61439113]
[845,74160128]
[928,44009107]
[392,98456103]
[466,67808101]
[885,36436101]
[811,36150105]
[443,52295116]
[200,43135125]
[583,82799112]
[454,83324106]
[122,40531123]
[564,35214124]
[250,82585130]
[108,80873125]
[6,89706101]
[625,47160117]
[332,87559120]
[948,22100114]
[954,41031109]
[787,45862100]
[533,37776106]
[868,67087106]
[885,57499130]
[35,12246123]
[726,58668115]
[417,46727121]
[91,71392128]
[698,39018108]
[881,38231122]
[926,40815123]
[29,96207106]
[434,30470100]
[705,76693104]
[633,57357105]
[108,55179122]
[230,29844115]
[506,87749112]
[150,42587113]
[539,30930100]
[634,38246118]
[891,69360121]
[237,48866101]
[117,51731116]
[212,34306118]
[694,14532127]
[768,92844127]
[910,91211130]
[627,88581105]
[749,38594119]
[370,95113104]
[566,96882109]
[900,42574120]
[298,62521130]
[842,71992122]
[865,30243115]
[468,93740120]
[61,15212125]
[573,16641107]
[50,91902100]
[693,81267126]
[902,74969116]
[0,51170102]
[103,57579117]
[241,65832108]
[627,66544121]
[362,89632106]
[14,22722112]
[77,53216118]
[954,23355121]
[324,79362122]
[331,12430119]
[977,41366110]
[538,36870114]
[23,80290107]
[749,62762123]
[533,77967106]
[152,18899125]
[440,10468123]
[420,21191109]
[941,62625106]
[566,82378116]
[93,33460102]
[463,92181126]
[230,67269125]
[378,72709127]
[66,17383104]
[461,62379129]
[556,49672102]
[695,33820121]
[470,95962125]
[395,66808130]
[153,38365123]
[511,31419115]
[491,99416122]
[366,84223123]
[766,63085124]
[555,81667114]
[505,29877103]
[100,32294109]
[673,59146121]
[258,48061101]
[759,94483113]
[387,68753129]
[590,12402124]
[833,69126128]
[775,36432101]
[638,55213110]
[251,77162130]
[903,55788123]
[353,45125111]
[893,95606127]
[967,86148112]
[560,23827108]
[645,90471103]
[5,26708110]
[82,37642127]
[268,62494125]
[366,28994101]
[43,73873110]
[56,63101109]
[466,92106128]
[280,44653115]
[932,81491124]
[760,16294124]
[139,48392102]
[432,59979107]
[796,81326121]
[896,59936130]
[908,38169123]
[72,42751118]
[726,74466118]
[277,26949121]
[440,36861100]
[389,26097115]
[31,32650115]
[203,45335124]
[116,10957130]
[64,26017117]
[88,17408127]
[391,46249110]
[46,26019113]
[676,63982127]
[447,51006124]
[670,68791127]
[139,71792121]
[39,56337100]
[366,40667115]
[296,76615100]
[274,68739112]
[177,83761128]
[659,99707103]
[792,73809120]
[901,32691121]
[476,28629119]
[964,25373122]
[452,10157114]
[301,43658118]
[253,56594104]
[610,15824101]
[59,42580100]
[163,96381103]
[697,21622101]
[483,81273113]
[773,67991100]
[167,55836100]
[332,67988115]
[461,37558126]
[540,91833119]
[41,34937110]
[349,77041108]
[896,39323111]
[169,79712119]
[802,62530114]
[518,69420101]
[428,47077121]
[130,64528105]
[543,90885112]
[195,98897106]
[946,42871125]
[411,40745129]
[488,64865114]
[357,17334101]
[157,37410106]
[185,89198100]
[248,63898130]
[419,79855123]
[594,81178107]
[226,22475124]
[321,34365104]
[496,25754105]
[330,49885105]
[605,19882127]
[940,74752113]
[102,51890122]
[319,39604117]
[489,16080130]
[371,45826103]
[427,55777111]
[669,13035101]
[923,51696125]
[648,50000111]
[525,81470126]
[836,99231111]
[533,15717123]
[920,56439127]
[236,86696123]
[971,31110119]
[839,11188118]
[698,70464121]
[512,58167114]
[397,51783123]
[916,88616120]
[465,79936110]
[335,69535107]
[256,65782105]
[963,69140129]
[32,48585101]
[312,52379116]
[611,27388129]
[495,86627130]
[945,49059109]
[483,50006109]
[754,48638101]

{"sheet":"(993)","index":11,"n_rows":10,"n_cols":5,"rows_kept":10,"cut":false,"hidden":false,"merged":[]}
["Amount","ID",null,"Criteria","Total"]
[907,82759123,null,123,{"$f":"SUMPRODUCT(--(RIGHT(B2:B10,3)=D2&\"\"),A2:A10)","v":1876}]
[432,13521963]
[846,56951123]
[499,59153726]
[932,81952689]
[864,71021693]
[851,51018451]
[860,11238995]
[123,35452123]

{"sheet":"(993an)","index":12,"n_rows":10,"n_cols":8,"rows_kept":10,"cut":false,"hidden":false,"merged":[]}
["Amount","ID",null,"Criteria","Total"]
[907,82759123,null,123,{"$f":"SUMPRODUCT(--(RIGHT(B2:B10,3)=D2&\"\"),A2:A10)","v":1876},null,{"$f":"RIGHT($B2,3)=$D$2&\"\"","v":true},true]
[432,13521963,null,null,null,null,false,false]
[846,56951123,null,null,null,null,true,true]
[499,59153726,null,null,null,null,false,false]
[932,81952689,null,null,null,null,false,false]
[864,71021693,null,null,null,null,false,false]
[851,51018451,null,null,null,null,false,false]
[860,11238995,null,null,null,null,false,false]
[123,35452123,null,null,null,null,true,true]