{"text_format":"1","workbook":"xlsx","n_sheets":8,"sheets":["Data(1)","Data(2)","Data(3)","Data(1an)","Data(2an)","Data(3an)","Sheet2","Sheet3"],"not_rendered":{"charts":0,"images":0,"macros":0,"external_links":0,"defined_names":0,"comments":0,"pivot_tables":0},"unopened":[],"bounds":{"document_bytes":16777216,"sheet_cells":100000,"rows_first":2000,"rows_last":500,"rows_between":2000,"halvings":0,"cell_chars":16384,"cell_head_chars":4096},"cells_cut":0,"cells_raw":0,"read":"whole","date_system":"1900"}

{"sheet":"Data(1)","index":0,"n_rows":27,"n_cols":3,"rows_kept":27,"cut":false,"hidden":false,"merged":[]}
["Criteria","Toy"]
[]
[]
["Date","Product","Sales"]
["2011-12-07",{"$f":"INDEX({\"Toy\";\"Boom\";\"Kite\"},RANDBETWEEN(1,3))","v":"Toy"},{"$f":"RANDBETWEEN(10,500)","v":99}]
["2011-12-08",{"$f":"INDEX({\"Toy\";\"Boom\";\"Kite\"},RANDBETWEEN(1,3))","v":"Kite"},52]
["2011-12-09",{"$f":"INDEX({\"Toy\";\"Boom\";\"Kite\"},RANDBETWEEN(1,3))","v":"Boom"},443]
["2011-12-10",{"$f":"INDEX({\"Toy\";\"Boom\";\"Kite\"},RANDBETWEEN(1,3))","v":"Kite"},35]
["2011-12-11",{"$f":"INDEX({\"Toy\";\"Boom\";\"Kite\"},RANDBETWEEN(1,3))","v":"Kite"},244]
["2011-12-12",{"$f":"INDEX({\"Toy\";\"Boom\";\"Kite\"},RANDBETWEEN(1,3))","v":"Toy"},122]
["2011-12-13",{"$f":"INDEX({\"Toy\";\"Boom\";\"Kite\"},RANDBETWEEN(1,3))","v":"Kite"},358]
["2011-12-14",{"$f":"INDEX({\"Toy\";\"Boom\";\"Kite\"},RANDBETWEEN(1,3))","v":"Kite"},111]
["2011-12-15",{"$f":"INDEX({\"Toy\";\"Boom\";\"Kite\"},RANDBETWEEN(1,3))","v":"Toy"},246]
["2011-12-16",{"$f":"INDEX({\"Toy\";\"Boom\";\"Kite\"},RANDBETWEEN(1,3))","v":"Toy"},83]
["2011-12-17",{"$f":"INDEX({\"Toy\";\"Boom\";\"Kite\"},RANDBETWEEN(1,3))","v":"Boom"},165]
[]
[]
[]
[]
[]
[]
[]
[]
["Product"]
["Toy"]
["Boom"]
["Kite"]

{"sheet":"Data(2)","index":1,"n_rows":27,"n_cols":3,"rows_kept":27,"cut":false,"hidden":false,"merged":[]}
["Criteria","Kite"]
[]
[]
["Date","Product","Sales"]
["2011-12-07",{"$f":"INDEX({\"Toy\";\"Boom\";\"Kite\"},RANDBETWEEN(1,3))","v":"Toy"},{"$f":"RANDBETWEEN(10,500)","v":46}]
["2011-12-08",{"$f":"INDEX({\"Toy\";\"Boom\";\"Kite\"},RANDBETWEEN(1,3))","v":"Boom"},141]
["2011-12-09",{"$f":"INDEX({\"Toy\";\"Boom\";\"Kite\"},RANDBETWEEN(1,3))","v":"Toy"},377]
["2011-12-10",{"$f":"INDEX({\"Toy\";\"Boom\";\"Kite\"},RANDBETWEEN(1,3))","v":"Toy"},40]
["2011-12-11",{"$f":"INDEX({\"Toy\";\"Boom\";\"Kite\"},RANDBETWEEN(1,3))","v":"Boom"},28]
["2011-12-12",{"$f":"INDEX({\"Toy\";\"Boom\";\"Kite\"},RANDBETWEEN(1,3))","v":"Boom"},82]
["2011-12-13",{"$f":"INDEX({\"Toy\";\"Boom\";\"Kite\"},RANDBETWEEN(1,3))","v":"Boom"},173]
["2011-12-14",{"$f":"INDEX({\"Toy\";\"Boom\";\"Kite\"},RANDBETWEEN(1,3))","v":"Kite"},150]
["2011-12-15",{"$f":"INDEX({\"Toy\";\"Boom\";\"Kite\"},RANDBETWEEN(1,3))","v":"Kite"},114]
["2011-12-16",{"$f":"INDEX({\"Toy\";\"Boom\";\"Kite\"},RANDBETWEEN(1,3))","v":"Kite"},395]
["2011-12-17",{"$f":"INDEX({\"Toy\";\"Boom\";\"Kite\"},RANDBETWEEN(1,3))","v":"Kite"},50]
[]
[]
[]
[]
[]
[]
[]
[]
["Product"]
["Toy"]
["Boom"]
["Kite"]

{"sheet":"Data(3)","index":2,"n_rows":27,"n_cols":3,"rows_kept":27,"cut":false,"hidden":false,"merged":[]}
["Criteria","Boom"]
[]
[]
["Date","Product","Sales"]
["2011-12-07",{"$f":"INDEX({\"Toy\";\"Boom\";\"Kite\"},RANDBETWEEN(1,3))","v":"Toy"},{"$f":"RANDBETWEEN(10,500)","v":122}]
["2011-12-08",{"$f":"INDEX({\"Toy\";\"Boom\";\"Kite\"},RANDBETWEEN(1,3))","v":"Boom"},313]
["2011-12-09",{"$f":"INDEX({\"Toy\";\"Boom\";\"Kite\"},RANDBETWEEN(1,3))","v":"Kite"},76]
["2011-12-10",{"$f":"INDEX({\"Toy\";\"Boom\";\"Kite\"},RANDBETWEEN(1,3))","v":"Toy"},329]
["2011-12-11",{"$f":"INDEX({\"Toy\";\"Boom\";\"Kite\"},RANDBETWEEN(1,3))","v":"Toy"},38]
["2011-12-12",{"$f":"INDEX({\"Toy\";\"Boom\";\"Kite\"},RANDBETWEEN(1,3))","v":"Kite"},345]
["2011-12-13",{"$f":"INDEX({\"Toy\";\"Boom\";\"Kite\"},RANDBETWEEN(1,3))","v":"Kite"},332]
["2011-12-14",{"$f":"INDEX({\"Toy\";\"Boom\";\"Kite\"},RANDBETWEEN(1,3))","v":"Kite"},342]
["2011-12-15",{"$f":"INDEX({\"Toy\";\"Boom\";\"Kite\"},RANDBETWEEN(1,3))","v":"Toy"},121]
["2011-12-16",{"$f":"INDEX({\"Toy\";\"Boom\";\"Kite\"},RANDBETWEEN(1,3))","v":"Toy"},287]
["2011-12-17",{"$f":"INDEX({\"Toy\";\"Boom\";\"Kite\"},RANDBETWEEN(1,3))","v":"Kite"},358]
[]
[]
[]
[]
[]
[]
[]
[]
["Product"]
["Toy"]
["Boom"]
["Kite"]

{"sheet":"Data(1an)","index":3,"n_rows":27,"n_cols":7,"rows_kept":27,"cut":false,"hidden":false,"merged":[]}
["Criteria","Toy"]
[null,null,null,"rad"]
[]
["Date","Product","Sales"]
["2011-12-07",{"$f":"INDEX({\"Toy\";\"Boom\";\"Kite\"},RANDBETWEEN(1,3))","v":"Kite"},{"$f":"RANDBETWEEN(10,500)","v":462},null,{"$f":"$B5=$B$1","v":false},{"$f":"$B5=$B$1","v":false},false]
["2011-12-08",{"$f":"INDEX({\"Toy\";\"Boom\";\"Kite\"},RANDBETWEEN(1,3))","v":"Toy"},54,null,{"$f":"$B6=$B$1","v":true},true,true]
["2011-12-09",{"$f":"INDEX({\"Toy\";\"Boom\";\"Kite\"},RANDBETWEEN(1,3))","v":"Kite"},327,null,false,false,false]
["2011-12-10",{"$f":"INDEX({\"Toy\";\"Boom\";\"Kite\"},RANDBETWEEN(1,3))","v":"Toy"},240,null,true,true,true]
["2011-12-11",{"$f":"INDEX({\"Toy\";\"Boom\";\"Kite\"},RANDBETWEEN(1,3))","v":"Kite"},92,null,false,false,false]
["2011-12-12",{"$f":"INDEX({\"Toy\";\"Boom\";\"Kite\"},RANDBETWEEN(1,3))","v":"Toy"},479,null,true,true,true]
["2011-12-13",{"$f":"INDEX({\"Toy\";\"Boom\";\"Kite\"},RANDBETWEEN(1,3))","v":"Kite"},352,null,false,false,false]
["2011-12-14",{"$f":"INDEX({\"Toy\";\"Boom\";\"Kite\"},RANDBETWEEN(1,3))","v":"Boom"},440,null,false,false,false]
["2011-12-15",{"$f":"INDEX({\"Toy\";\"Boom\";\"Kite\"},RANDBETWEEN(1,3))","v":"Kite"},380,null,false,false,false]
["2011-12-16",{"$f":"INDEX({\"Toy\";\"Boom\";\"Kite\"},RANDBETWEEN(1,3))","v":"Boom"},437,null,false,false,false]
["2011-12-17",{"$f":"INDEX({\"Toy\";\"Boom\";\"Kite\"},RANDBETWEEN(1,3))","v":"Toy"},359,null,true,true,true]
[]
[]
[]
[]
[]
[]
[]
[]
["Product"]
["Toy"]
["Boom"]
["Kite"]

{"sheet":"Data(2an)","index":4,"n_rows":27,"n_cols":4,"rows_kept":27,"cut":false,"hidden":false,"merged":[]}
["Criteria","Kite"]
[null,null,null,"rad"]
[]
["Date","Product","Sales"]
["2011-12-07",{"$f":"INDEX({\"Toy\";\"Boom\";\"Kite\"},RANDBETWEEN(1,3))","v":"Kite"},{"$f":"RANDBETWEEN(10,500)","v":130}]
["2011-12-08",{"$f":"INDEX({\"Toy\";\"Boom\";\"Kite\"},RANDBETWEEN(1,3))","v":"Boom"},383]
["2011-12-09",{"$f":"INDEX({\"Toy\";\"Boom\";\"Kite\"},RANDBETWEEN(1,3))","v":"Kite"},305]
["2011-12-10",{"$f":"INDEX({\"Toy\";\"Boom\";\"Kite\"},RANDBETWEEN(1,3))","v":"Toy"},44]
["2011-12-11",{"$f":"INDEX({\"Toy\";\"Boom\";\"Kite\"},RANDBETWEEN(1,3))","v":"Boom"},74]
["2011-12-12",{"$f":"INDEX({\"Toy\";\"Boom\";\"Kite\"},RANDBETWEEN(1,3))","v":"Kite"},234]
["2011-12-13",{"$f":"INDEX({\"Toy\";\"Boom\";\"Kite\"},RANDBETWEEN(1,3))","v":"Boom"},454]
["2011-12-14",{"$f":"INDEX({\"Toy\";\"Boom\";\"Kite\"},RANDBETWEEN(1,3))","v":"Kite"},253]
["2011-12-15",{"$f":"INDEX({\"Toy\";\"Boom\";\"Kite\"},RANDBETWEEN(1,3))","v":"Boom"},448]
["2011-12-16",{"$f":"INDEX({\"Toy\";\"Boom\";\"Kite\"},RANDBETWEEN(1,3))","v":"Toy"},436]
["2011-12-17",{"$f":"INDEX({\"Toy\";\"Boom\";\"Kite\"},RANDBETWEEN(1,3))","v":"Kite"},234]
[]
[]
[]
[]
[]
[]
[]
[]
["Product"]
["Toy"]
["Boom"]
["Kite"]

{"sheet":"Data(3an)","index":5,"n_rows":27,"n_cols":4,"rows_kept":27,"cut":false,"hidden":false,"merged":[]}
["Criteria","Boom"]
[null,null,null,"rad"]
[]
["Date","Product","Sales"]
["2011-12-07",{"$f":"INDEX({\"Toy\";\"Boom\";\"Kite\"},RANDBETWEEN(1,3))","v":"Toy"},{"$f":"RANDBETWEEN(10,500)","v":141}]
["2011-12-08",{"$f":"INDEX({\"Toy\";\"Boom\";\"Kite\"},RANDBETWEEN(1,3))","v":"Kite"},183]
["2011-12-09",{"$f":"INDEX({\"Toy\";\"Boom\";\"Kite\"},RANDBETWEEN(1,3))","v":"Kite"},401]
["2011-12-10",{"$f":"INDEX({\"Toy\";\"Boom\";\"Kite\"},RANDBETWEEN(1,3))","v":"Boom"},463]
["2011-12-11",{"$f":"INDEX({\"Toy\";\"Boom\";\"Kite\"},RANDBETWEEN(1,3))","v":"Kite"},327]
["2011-12-12",{"$f":"INDEX({\"Toy\";\"Boom\";\"Kite\"},RANDBETWEEN(1,3))","v":"Kite"},394]
["2011-12-13",{"$f":"INDEX({\"Toy\";\"Boom\";\"Kite\"},RANDBETWEEN(1,3))","v":"Toy"},370]
["2011-12-14",{"$f":"INDEX({\"Toy\";\"Boom\";\"Kite\"},RANDBETWEEN(1,3))","v":"Toy"},188]
["2011-12-15",{"$f":"INDEX({\"Toy\";\"Boom\";\"Kite\"},RANDBETWEEN(1,3))","v":"Toy"},141]
["2011-12-16",{"$f":"INDEX({\"Toy\";\"Boom\";\"Kite\"},RANDBETWEEN(1,3))","v":"Boom"},269]
["2011-12-17",{"$f":"INDEX({\"Toy\";\"Boom\";\"Kite\"},RANDBETWEEN(1,3))","v":"Toy"},21]
[]
[]
[]
[]
[]
[]
[]
[]
["Product"]
["Toy"]
["Boom"]
["Kite"]

{"sheet":"Sheet2","index":6,"n_rows":0,"n_cols":0,"rows_kept":0,"cut":false,"hidden":false,"merged":[]}

{"sheet":"Sheet3","index":7,"n_rows":0,"n_cols":0,"rows_kept":0,"cut":false,"hidden":false,"merged":[]}