{"text_format":"1","workbook":"xlsx","n_sheets":23,"sheets":["779","779an","780","Jan","Feb","Mar","780an","Jan (2)","Feb (2)","Mar (2)","781","781an","782","782an","783","783an","784","784an","785","785an","MrExcelExcelisfun78","786","786(an)"],"not_rendered":{"charts":1,"images":0,"macros":0,"external_links":0,"defined_names":3,"comments":1,"pivot_tables":0},"unopened":[],"bounds":{"document_bytes":16777216,"sheet_cells":100000,"rows_first":2000,"rows_last":500,"rows_between":2000,"halvings":0,"cell_chars":16384,"cell_head_chars":4096},"cells_cut":0,"cells_raw":0,"read":"whole","date_system":"1900"}

{"sheet":"779","index":0,"n_rows":768,"n_cols":12,"rows_kept":768,"cut":false,"hidden":false,"merged":[]}
["Date","SalesRep","Sales","Product",null,"SUMIFS (Faster Calculating)",null,"Product"]
["2010-03-26","Cynthia",153,"Bellen",null,"Criteria for Adding Sales",null,"Bellen","Sunshine","Carlota","Sunset","Majestic Beaut"]
["2010-03-26","Dawn",178,"Bellen",null,"Apr",2010]
["2010-03-26","Yishak",189,"Sunset",null,"May",2010]
["2010-03-27","Marsha",143,"Majestic Beaut",null,"Apr",2011]
["2010-03-28","Dawn",135,"Sunset",null,"May",2011]
["2010-03-29","Shegaw",147,"Carlota"]
["2010-03-29","Monique",190,"Carlota",null,"SUMPRODUCT",null,"Product"]
["2010-03-29","Cynthia",122,"Majestic Beaut",null,"Criteria for Adding Sales",null,"Bellen","Sunshine","Carlota","Sunset","Majestic Beaut"]
["2010-03-29","Christine",151,"Majestic Beaut",null,"Apr",2010,{"$f":"SUMPRODUCT((--(TEXT($A$2:$A$768,\"mmmyyy\")=$F10&$G10)),--($D$2:$D$768=H$9),$C$2:$C$768)","v":1476},1097,1363,1061,765]
["2010-03-29","Marsha",178,"Sunset",null,"May",2010,981,1366,1774,1225,1321]
["2010-03-30","Maurice",190,"Bellen",null,"Apr",2011,1084,1153,807,1843,1280]
["2010-03-30","Alamzeb",167,"Sunset",null,"May",2011,1474,1152,2091,1851,960]
["2010-03-30","Yishak",133,"Sunset"]
["2010-03-31","Wendy",173,"Bellen",null,"COUNTIFS (Faster Calculating)",null,"Product"]
["2010-04-01","Zemmia",114,"Carlota",null,"Criteria for Counting Sales",null,"Bellen","Sunshine","Carlota","Sunset","Majestic Beaut"]
["2010-04-01","Sreysros",111,"Majestic Beaut",null,"Apr",2010]
["2010-04-03","Julie",122,"Bellen",null,"May",2010]
["2010-04-03","Amburg",158,"Sunshine",null,"Apr",2011]
["2010-04-04","Shirley",139,"Sunset",null,"May",2011]
["2010-04-05","Maurice",191,"Bellen"]
["2010-04-05","Amburg",114,"Sunset"]
["2010-04-06","Jean",146,"Sunshine"]
["2010-04-07","Zemmia",150,"Carlota"]
["2010-04-08","Cynthia",105,"Sunset"]
["2010-04-08","Monique",183,"Sunshine"]
["2010-04-09","Yishak",102,"Bellen"]
["2010-04-10","Zemmia",104,"Bellen"]
["2010-04-10","Zemmia",172,"Bellen"]
["2010-04-10","Christine",172,"Carlota"]
["2010-04-10","Donna",175,"Sunset"]
["2010-04-10","Donna",145,"Sunshine"]
["2010-04-14","Amburg",152,"Majestic Beaut"]
["2010-04-15","Maurice",132,"Sunshine"]
["2010-04-16","Yishak",175,"Carlota"]
["2010-04-16","Jean",170,"Majestic Beaut"]
["2010-04-16","Shirley",144,"Sunset"]
["2010-04-17","Mykola",198,"Bellen"]
["2010-04-17","Amburg",190,"Majestic Beaut"]
["2010-04-18","Sarah",152,"Bellen"]
["2010-04-19","Christine",120,"Sunshine"]
["2010-04-20","Mykola",142,"Majestic Beaut"]
["2010-04-21","Cynthia",125,"Bellen"]
["2010-04-22","Amburg",133,"Sunset"]
["2010-04-23","Amburg",117,"Sunset"]
["2010-04-24","Yishak",134,"Sunset"]
["2010-04-25","Jean",101,"Sunshine"]
["2010-04-26","Sarah",112,"Sunshine"]
["2010-04-27","Christine",176,"Carlota"]
["2010-04-28","Shirley",164,"Bellen"]
["2010-04-28","Cynthia",194,"Carlota"]
["2010-04-30","Jean",146,"Bellen"]
["2010-04-30","Mykola",110,"Carlota"]
["2010-04-30","Jessica",137,"Carlota"]
["2010-04-30","Maurice",135,"Carlota"]
["2010-05-01","Sarah",165,"Carlota"]
["2010-05-01","Mykola",141,"Sunset"]
["2010-05-01","Shegaw",199,"Sunshine"]
["2010-05-02","Sreysros",200,"Sunset"]
["2010-05-03","Sarah",146,"Carlota"]
["2010-05-04","Shegaw",112,"Sunset"]
["2010-05-05","Maurice",124,"Bellen"]
["2010-05-05","Mykola",168,"Bellen"]
["2010-05-05","Mykola",163,"Carlota"]
["2010-05-05","Sreysros",168,"Majestic Beaut"]
["2010-05-06","Marsha",109,"Majestic Beaut"]
["2010-05-06","Alamzeb",163,"Sunset"]
["2010-05-07","Amburg",115,"Sunset"]
["2010-05-08","Mykola",133,"Majestic Beaut"]
["2010-05-09","Julie",164,"Majestic Beaut"]
["2010-05-10","Sreysros",176,"Bellen"]
["2010-05-10","Monique",129,"Carlota"]
["2010-05-10","Maurice",115,"Sunset"]
["2010-05-11","Amburg",156,"Sunshine"]
["2010-05-12","Jean",104,"Bellen"]
["2010-05-12","Julie",167,"Majestic Beaut"]
["2010-05-12","Cynthia",152,"Sunshine"]
["2010-05-13","Maurice",183,"Carlota"]
["2010-05-13","Maurice",117,"Sunshine"]
["2010-05-14","Sarah",112,"Majestic Beaut"]
["2010-05-15","Maurice",121,"Majestic Beaut"]
["2010-05-17","Yishak",158,"Carlota"]
["2010-05-17","Maurice",196,"Sunset"]
["2010-05-18","Jean",145,"Carlota"]
["2010-05-18","Mykola",172,"Sunshine"]
["2010-05-19","Marsha",114,"Sunshine"]
["2010-05-21","Mykola",135,"Sunshine"]
["2010-05-22","Wendy",146,"Carlota"]
["2010-05-22","Sreysros",104,"Carlota"]
["2010-05-23","Jean",111,"Majestic Beaut"]
["2010-05-24","Shegaw",130,"Majestic Beaut"]
["2010-05-25","Mykola",111,"Bellen"]
["2010-05-25","Shirley",163,"Carlota"]
["2010-05-26","Zemmia",120,"Carlota"]
["2010-05-26","Zemmia",152,"Carlota"]
["2010-05-26","Donna",122,"Sunshine"]
["2010-05-28","Alamzeb",106,"Majestic Beaut"]
["2010-05-29","Alamzeb",132,"Bellen"]
["2010-05-29","Maurice",183,"Sunset"]
["2010-05-31","Yishak",166,"Bellen"]
["2010-05-31","Tawnya",199,"Sunshine"]
["2010-06-01","Maurice",148,"Bellen"]
["2010-06-01","Jessica",125,"Sunset"]
["2010-06-01","Amburg",180,"Sunshine"]
["2010-06-02","Sreysros",170,"Majestic Beaut"]
["2010-06-02","Sarah",168,"Majestic Beaut"]
["2010-06-04","Donna",107,"Majestic Beaut"]
["2010-06-04","Zemmia",161,"Sunshine"]
["2010-06-04","Mykola",178,"Sunshine"]
["2010-06-06","Tawnya",123,"Bellen"]
["2010-06-06","Sarah",155,"Carlota"]
["2010-06-06","Sreysros",134,"Sunset"]
["2010-06-07","Mykola",179,"Bellen"]
["2010-06-07","Zemmia",126,"Carlota"]
["2010-06-07","Zemmia",194,"Majestic Beaut"]
["2010-06-08","Wendy",196,"Bellen"]
["2010-06-08","Mykola",199,"Sunshine"]
["2010-06-09","Dawn",116,"Sunset"]
["2010-06-10","Maurice",102,"Carlota"]
["2010-06-10","Julie",146,"Majestic Beaut"]
["2010-06-10","Amburg",125,"Sunshine"]
["2010-06-11","Shegaw",196,"Bellen"]
["2010-06-11","Shirley",109,"Carlota"]
["2010-06-11","Maurice",114,"Sunset"]
["2010-06-12","Tawnya",156,"Bellen"]
["2010-06-12","Cynthia",176,"Bellen"]
["2010-06-12","Shirley",195,"Carlota"]
["2010-06-12","Sreysros",108,"Sunshine"]
["2010-06-14","Julie",193,"Carlota"]
["2010-06-14","Mykola",178,"Sunshine"]
["2010-06-14","Jessica",185,"Sunshine"]
["2010-06-15","Wendy",129,"Carlota"]
["2010-06-15","Sreysros",180,"Majestic Beaut"]
["2010-06-15","Maurice",186,"Sunshine"]
["2010-06-16","Christine",146,"Bellen"]
["2010-06-16","Tawnya",159,"Carlota"]
["2010-06-16","Tawnya",151,"Sunshine"]
["2010-06-17","Shegaw",154,"Sunset"]
["2010-06-18","Cynthia",117,"Bellen"]
["2010-06-18","Dawn",191,"Majestic Beaut"]
["2010-06-18","Monique",142,"Sunset"]
["2010-06-19","Monique",169,"Majestic Beaut"]
["2010-06-20","Wendy",178,"Majestic Beaut"]
["2010-06-20","Jessica",155,"Sunshine"]
["2010-06-22","Julie",129,"Bellen"]
["2010-06-22","Donna",112,"Sunset"]
["2010-06-22","Christine",138,"Sunset"]
["2010-06-23","Mykola",102,"Bellen"]
["2010-06-24","Marsha",164,"Sunset"]
["2010-06-24","Jessica",149,"Sunset"]
["2010-06-25","Jean",153,"Sunset"]
["2010-06-26","Monique",142,"Majestic Beaut"]
["2010-06-26","Mykola",182,"Sunshine"]
["2010-06-28","Jean",154,"Sunset"]
["2010-06-28","Julie",178,"Sunshine"]
["2010-06-29","Cynthia",149,"Majestic Beaut"]
["2010-06-29","Monique",132,"Sunset"]
["2010-06-30","Shirley",157,"Bellen"]
["2010-06-30","Jean",148,"Carlota"]
["2010-07-02","Christine",194,"Sunset"]
["2010-07-04","Monique",170,"Carlota"]
["2010-07-04","Shegaw",144,"Majestic Beaut"]
["2010-07-04","Donna",168,"Majestic Beaut"]
["2010-07-05","Cynthia",137,"Sunset"]
["2010-07-06","Maurice",126,"Carlota"]
["2010-07-07","Wendy",114,"Sunset"]
["2010-07-08","Yishak",192,"Carlota"]
["2010-07-09","Maurice",108,"Bellen"]
["2010-07-09","Sarah",198,"Majestic Beaut"]
["2010-07-09","Shirley",192,"Sunset"]
["2010-07-10","Christine",187,"Majestic Beaut"]
["2010-07-10","Shegaw",136,"Majestic Beaut"]
["2010-07-10","Jean",160,"Sunset"]
["2010-07-10","Marsha",134,"Sunshine"]
["2010-07-13","Mykola",184,"Bellen"]
["2010-07-15","Amburg",142,"Sunshine"]
["2010-07-15","Monique",144,"Sunshine"]
["2010-07-16","Tawnya",148,"Carlota"]
["2010-07-16","Shegaw",195,"Majestic Beaut"]
["2010-07-16","Jean",107,"Majestic Beaut"]
["2010-07-16","Monique",193,"Sunset"]
["2010-07-17","Cynthia",172,"Majestic Beaut"]
["2010-07-18","Marsha",167,"Bellen"]
["2010-07-18","Amburg",138,"Carlota"]
["2010-07-20","Donna",191,"Carlota"]
["2010-07-22","Julie",139,"Carlota"]
["2010-07-22","Jessica",103,"Sunset"]
["2010-07-22","Jessica",122,"Sunshine"]
["2010-07-23","Christine",138,"Majestic Beaut"]
["2010-07-23","Wendy",185,"Sunshine"]
["2010-07-24","Tawnya",158,"Sunset"]
["2010-07-24","Christine",119,"Sunshine"]
["2010-07-25","Alamzeb",161,"Majestic Beaut"]
["2010-07-25","Amburg",193,"Sunshine"]
["2010-07-28","Marsha",179,"Carlota"]
["2010-07-29","Zemmia",139,"Carlota"]
["2010-07-29","Christine",111,"Carlota"]
["2010-07-30","Mykola",145,"Sunshine"]
["2010-07-31","Zemmia",150,"Carlota"]
["2010-07-31","Monique",117,"Carlota"]
["2010-07-31","Wendy",160,"Sunset"]
["2010-08-01","Tawnya",138,"Bellen"]
["2010-08-01","Mykola",174,"Carlota"]
["2010-08-01","Sreysros",160,"Sunset"]
["2010-08-02","Cynthia",190,"Bellen"]
["2010-08-02","Jessica",187,"Bellen"]
["2010-08-03","Dawn",102,"Carlota"]
["2010-08-03","Sarah",163,"Sunshine"]
["2010-08-04","Alamzeb",162,"Bellen"]
["2010-08-04","Shegaw",155,"Sunshine"]
["2010-08-04","Shirley",105,"Sunshine"]
["2010-08-05","Shirley",117,"Sunshine"]
["2010-08-06","Julie",163,"Carlota"]
["2010-08-06","Zemmia",161,"Sunshine"]
["2010-08-08","Mykola",160,"Majestic Beaut"]
["2010-08-09","Shirley",130,"Sunset"]
["2010-08-11","Mykola",195,"Majestic Beaut"]
["2010-08-11","Sarah",129,"Sunshine"]
["2010-08-12","Amburg",137,"Carlota"]
["2010-08-12","Jessica",101,"Sunset"]
["2010-08-12","Jessica",117,"Sunshine"]
["2010-08-13","Dawn",111,"Sunshine"]
["2010-08-14","Donna",144,"Bellen"]
["2010-08-15","Monique",124,"Carlota"]
["2010-08-15","Maurice",117,"Sunshine"]
["2010-08-16","Sreysros",106,"Carlota"]
["2010-08-17","Jessica",152,"Sunset"]
["2010-08-19","Yishak",114,"Sunset"]
["2010-08-19","Monique",184,"Sunshine"]
["2010-08-20","Donna",105,"Bellen"]
["2010-08-20","Dawn",101,"Majestic Beaut"]
["2010-08-20","Jessica",114,"Sunshine"]
["2010-08-21","Alamzeb",131,"Bellen"]
["2010-08-21","Sarah",131,"Carlota"]
["2010-08-21","Marsha",143,"Sunset"]
["2010-08-21","Cynthia",134,"Sunshine"]
["2010-08-23","Julie",126,"Sunshine"]
["2010-08-24","Alamzeb",157,"Sunset"]
["2010-08-24","Julie",137,"Sunshine"]
["2010-08-25","Christine",135,"Majestic Beaut"]
["2010-08-26","Jean",184,"Majestic Beaut"]
["2010-08-27","Marsha",147,"Sunshine"]
["2010-08-28","Amburg",130,"Majestic Beaut"]
["2010-08-29","Sarah",195,"Carlota"]
["2010-08-29","Sarah",189,"Sunshine"]
["2010-08-30","Sarah",184,"Carlota"]
["2010-08-30","Christine",124,"Majestic Beaut"]
["2010-08-30","Jean",183,"Majestic Beaut"]
["2010-08-30","Jean",127,"Sunshine"]
["2010-08-31","Amburg",154,"Carlota"]
["2010-09-01","Yishak",160,"Sunshine"]
["2010-09-02","Jean",148,"Carlota"]
["2010-09-02","Amburg",186,"Sunshine"]
["2010-09-03","Shegaw",128,"Carlota"]
["2010-09-04","Donna",168,"Majestic Beaut"]
["2010-09-04","Marsha",177,"Sunset"]
["2010-09-06","Maurice",164,"Bellen"]
["2010-09-08","Jessica",143,"Sunset"]
["2010-09-09","Jean",181,"Bellen"]
["2010-09-10","Marsha",140,"Bellen"]
["2010-09-10","Yishak",158,"Carlota"]
["2010-09-10","Sreysros",182,"Sunset"]
["2010-09-11","Shirley",181,"Carlota"]
["2010-09-12","Julie",134,"Sunshine"]
["2010-09-15","Zemmia",159,"Carlota"]
["2010-09-16","Jean",112,"Sunshine"]
["2010-09-18","Christine",147,"Sunset"]
["2010-09-19","Yishak",182,"Carlota"]
["2010-09-20","Shirley",104,"Sunset"]
["2010-09-21","Mykola",109,"Bellen"]
["2010-09-21","Sarah",174,"Majestic Beaut"]
["2010-09-22","Tawnya",158,"Bellen"]
["2010-09-22","Yishak",172,"Carlota"]
["2010-09-22","Yishak",152,"Carlota"]
["2010-09-22","Jessica",119,"Sunshine"]
["2010-09-23","Shegaw",162,"Sunset"]
["2010-09-23","Cynthia",161,"Sunshine"]
["2010-09-24","Zemmia",111,"Bellen"]
["2010-09-24","Amburg",116,"Majestic Beaut"]
["2010-09-24","Amburg",113,"Majestic Beaut"]
["2010-09-25","Julie",135,"Carlota"]
["2010-09-25","Christine",152,"Sunshine"]
["2010-09-27","Maurice",165,"Carlota"]
["2010-09-27","Yishak",155,"Majestic Beaut"]
["2010-09-27","Wendy",165,"Majestic Beaut"]
["2010-09-28","Dawn",110,"Carlota"]
["2010-09-28","Yishak",139,"Sunshine"]
["2010-09-29","Dawn",196,"Sunset"]
["2010-09-30","Maurice",105,"Bellen"]
["2010-09-30","Monique",192,"Carlota"]
["2010-10-01","Mykola",125,"Sunshine"]
["2010-10-02","Mykola",136,"Majestic Beaut"]
["2010-10-02","Wendy",178,"Sunset"]
["2010-10-03","Shirley",122,"Carlota"]
["2010-10-04","Jean",109,"Sunset"]
["2010-10-05","Zemmia",184,"Bellen"]
["2010-10-05","Dawn",159,"Carlota"]
["2010-10-05","Amburg",113,"Carlota"]
["2010-10-06","Sreysros",182,"Bellen"]
["2010-10-06","Tawnya",197,"Majestic Beaut"]
["2010-10-08","Sarah",143,"Bellen"]
["2010-10-08","Shegaw",185,"Sunset"]
["2010-10-08","Shirley",121,"Sunset"]
["2010-10-09","Shegaw",101,"Bellen"]
["2010-10-09","Alamzeb",110,"Sunset"]
["2010-10-09","Yishak",172,"Sunshine"]
["2010-10-10","Marsha",107,"Bellen"]
["2010-10-14","Jessica",107,"Bellen"]
["2010-10-15","Wendy",148,"Carlota"]
["2010-10-15","Maurice",191,"Majestic Beaut"]
["2010-10-16","Jean",134,"Carlota"]
["2010-10-17","Shegaw",138,"Sunset"]
["2010-10-18","Amburg",158,"Sunshine"]
["2010-10-18","Yishak",151,"Sunshine"]
["2010-10-18","Christine",131,"Sunshine"]
["2010-10-19","Tawnya",167,"Carlota"]
["2010-10-19","Maurice",107,"Carlota"]
["2010-10-19","Julie",132,"Majestic Beaut"]
["2010-10-19","Dawn",185,"Sunset"]
["2010-10-19","Sarah",186,"Sunshine"]
["2010-10-19","Jessica",137,"Sunshine"]
["2010-10-20","Wendy",165,"Bellen"]
["2010-10-20","Mykola",168,"Sunset"]
["2010-10-20","Donna",128,"Sunshine"]
["2010-10-21","Sarah",106,"Bellen"]
["2010-10-21","Yishak",133,"Carlota"]
["2010-10-21","Shegaw",198,"Sunshine"]
["2010-10-22","Mykola",128,"Sunset"]
["2010-10-22","Mykola",150,"Sunshine"]
["2010-10-23","Maurice",119,"Carlota"]
["2010-10-23","Amburg",172,"Majestic Beaut"]
["2010-10-23","Shirley",165,"Sunshine"]
["2010-10-25","Yishak",174,"Carlota"]
["2010-10-25","Marsha",116,"Carlota"]
["2010-10-25","Amburg",187,"Sunshine"]
["2010-10-27","Shirley",139,"Carlota"]
["2010-10-27","Wendy",167,"Carlota"]
["2010-10-27","Mykola",167,"Majestic Beaut"]
["2010-10-28","Wendy",142,"Majestic Beaut"]
["2010-10-29","Dawn",174,"Majestic Beaut"]
["2010-10-30","Yishak",185,"Carlota"]
["2010-10-30","Sreysros",190,"Carlota"]
["2010-10-30","Marsha",127,"Sunset"]
["2010-10-30","Shirley",143,"Sunset"]
["2010-11-01","Shegaw",186,"Sunshine"]
["2010-11-02","Marsha",160,"Carlota"]
["2010-11-02","Shegaw",108,"Sunset"]
["2010-11-03","Cynthia",193,"Bellen"]
["2010-11-03","Christine",144,"Bellen"]
["2010-11-03","Mykola",154,"Sunset"]
["2010-11-03","Jessica",144,"Sunset"]
["2010-11-03","Julie",161,"Sunset"]
["2010-11-04","Wendy",111,"Bellen"]
["2010-11-04","Maurice",170,"Bellen"]
["2010-11-05","Wendy",160,"Carlota"]
["2010-11-05","Maurice",101,"Sunshine"]
["2010-11-06","Tawnya",186,"Majestic Beaut"]
["2010-11-07","Jean",119,"Majestic Beaut"]
["2010-11-08","Shirley",160,"Sunshine"]
["2010-11-08","Sarah",147,"Sunshine"]
["2010-11-10","Julie",154,"Majestic Beaut"]
["2010-11-12","Tawnya",148,"Carlota"]
["2010-11-12","Marsha",116,"Carlota"]
["2010-11-12","Shegaw",185,"Sunshine"]
["2010-11-14","Maurice",116,"Majestic Beaut"]
["2010-11-15","Shegaw",127,"Sunset"]
["2010-11-17","Jean",129,"Carlota"]
["2010-11-17","Christine",125,"Sunset"]
["2010-11-18","Jessica",108,"Bellen"]
["2010-11-18","Jessica",166,"Carlota"]
["2010-11-18","Zemmia",120,"Sunshine"]
["2010-11-19","Wendy",152,"Carlota"]
["2010-11-19","Mykola",174,"Sunset"]
["2010-11-19","Jessica",104,"Sunshine"]
["2010-11-20","Alamzeb",191,"Majestic Beaut"]
["2010-11-20","Maurice",104,"Sunset"]
["2010-11-20","Zemmia",130,"Sunshine"]
["2010-11-21","Wendy",194,"Majestic Beaut"]
["2010-11-21","Julie",152,"Sunshine"]
["2010-11-22","Jean",121,"Bellen"]
["2010-11-22","Sreysros",189,"Carlota"]
["2010-11-22","Wendy",148,"Sunset"]
["2010-11-22","Marsha",118,"Sunshine"]
["2010-11-25","Julie",142,"Sunset"]
["2010-11-26","Julie",166,"Sunshine"]
["2010-11-26","Wendy",103,"Sunshine"]
["2010-11-27","Monique",188,"Carlota"]
["2010-11-27","Shegaw",137,"Majestic Beaut"]
["2010-11-27","Alamzeb",142,"Sunshine"]
["2010-11-30","Yishak",153,"Bellen"]
["2010-11-30","Jean",172,"Bellen"]
["2010-11-30","Zemmia",118,"Carlota"]
["2010-12-01","Shegaw",128,"Bellen"]
["2010-12-01","Sarah",174,"Carlota"]
["2010-12-01","Donna",131,"Carlota"]
["2010-12-01","Amburg",179,"Carlota"]
["2010-12-01","Tawnya",173,"Majestic Beaut"]
["2010-12-02","Monique",188,"Carlota"]
["2010-12-02","Tawnya",193,"Sunshine"]
["2010-12-04","Sreysros",143,"Carlota"]
["2010-12-04","Tawnya",187,"Sunset"]
["2010-12-04","Sarah",123,"Sunshine"]
["2010-12-05","Cynthia",157,"Bellen"]
["2010-12-05","Jessica",127,"Carlota"]
["2010-12-05","Wendy",144,"Majestic Beaut"]
["2010-12-06","Amburg",143,"Carlota"]
["2010-12-06","Christine",164,"Sunshine"]
["2010-12-07","Tawnya",131,"Majestic Beaut"]
["2010-12-07","Yishak",196,"Sunset"]
["2010-12-08","Zemmia",130,"Carlota"]
["2010-12-09","Cynthia",168,"Bellen"]
["2010-12-09","Monique",106,"Sunshine"]
["2010-12-10","Donna",161,"Majestic Beaut"]
["2010-12-10","Amburg",109,"Majestic Beaut"]
["2010-12-11","Monique",146,"Carlota"]
["2010-12-11","Sreysros",123,"Sunset"]
["2010-12-11","Zemmia",184,"Sunshine"]
["2010-12-11","Wendy",109,"Sunshine"]
["2010-12-11","Donna",167,"Sunshine"]
["2010-12-13","Tawnya",158,"Carlota"]
["2010-12-13","Dawn",187,"Carlota"]
["2010-12-13","Donna",119,"Majestic Beaut"]
["2010-12-14","Jessica",107,"Bellen"]
["2010-12-14","Dawn",144,"Carlota"]
["2010-12-14","Shegaw",173,"Carlota"]
["2010-12-15","Dawn",181,"Majestic Beaut"]
["2010-12-15","Julie",122,"Sunshine"]
["2010-12-17","Amburg",199,"Sunset"]
["2010-12-17","Jessica",156,"Sunshine"]
["2010-12-18","Julie",113,"Majestic Beaut"]
["2010-12-18","Shegaw",194,"Sunset"]
["2010-12-20","Shegaw",194,"Carlota"]
["2010-12-21","Mykola",109,"Bellen"]
["2010-12-21","Cynthia",151,"Majestic Beaut"]
["2010-12-21","Shegaw",153,"Majestic Beaut"]
["2010-12-22","Julie",123,"Sunshine"]
["2010-12-23","Zemmia",169,"Carlota"]
["2010-12-23","Zemmia",163,"Sunset"]
["2010-12-24","Marsha",107,"Carlota"]
["2010-12-24","Wendy",168,"Majestic Beaut"]
["2010-12-24","Sreysros",186,"Sunset"]
["2010-12-25","Dawn",145,"Majestic Beaut"]
["2010-12-25","Maurice",159,"Sunshine"]
["2010-12-26","Shegaw",141,"Bellen"]
["2010-12-26","Maurice",185,"Carlota"]
["2010-12-27","Mykola",177,"Sunshine"]
["2010-12-27","Yishak",177,"Sunshine"]
["2010-12-28","Amburg",199,"Sunshine"]
["2010-12-29","Dawn",175,"Bellen"]
["2010-12-29","Tawnya",149,"Sunset"]
["2010-12-30","Marsha",115,"Bellen"]
["2010-12-30","Shegaw",194,"Sunset"]
["2010-12-30","Wendy",172,"Sunshine"]
["2010-12-31","Shegaw",155,"Sunset"]
["2011-01-01","Amburg",157,"Bellen"]
["2011-01-01","Zemmia",153,"Sunset"]
["2011-01-02","Jessica",173,"Majestic Beaut"]
["2011-01-02","Jean",184,"Sunshine"]
["2011-01-03","Amburg",116,"Bellen"]
["2011-01-08","Maurice",168,"Sunshine"]
["2011-01-09","Cynthia",191,"Sunset"]
["2011-01-10","Marsha",114,"Carlota"]
["2011-01-11","Donna",114,"Carlota"]
["2011-01-11","Maurice",121,"Carlota"]
["2011-01-11","Sarah",149,"Majestic Beaut"]
["2011-01-12","Tawnya",152,"Sunset"]
["2011-01-12","Cynthia",121,"Sunset"]
["2011-01-12","Jean",109,"Sunset"]
["2011-01-13","Sarah",134,"Carlota"]
["2011-01-13","Mykola",114,"Sunset"]
["2011-01-13","Dawn",186,"Sunshine"]
["2011-01-14","Mykola",120,"Bellen"]
["2011-01-14","Maurice",139,"Carlota"]
["2011-01-14","Monique",104,"Sunset"]
["2011-01-15","Wendy",122,"Sunshine"]
["2011-01-18","Maurice",183,"Majestic Beaut"]
["2011-01-19","Dawn",199,"Carlota"]
["2011-01-19","Sreysros",199,"Sunshine"]
["2011-01-20","Jean",103,"Sunshine"]
["2011-01-21","Sarah",122,"Carlota"]
["2011-01-21","Dawn",156,"Majestic Beaut"]
["2011-01-22","Zemmia",132,"Bellen"]
["2011-01-22","Marsha",140,"Carlota"]
["2011-01-23","Shirley",189,"Sunset"]
["2011-01-24","Christine",162,"Carlota"]
["2011-01-25","Monique",121,"Sunshine"]
["2011-01-26","Julie",107,"Carlota"]
["2011-01-26","Marsha",177,"Sunshine"]
["2011-01-26","Donna",167,"Sunshine"]
["2011-01-27","Zemmia",162,"Majestic Beaut"]
["2011-01-28","Amburg",172,"Bellen"]
["2011-01-28","Marsha",177,"Carlota"]
["2011-01-28","Monique",199,"Carlota"]
["2011-01-28","Sreysros",182,"Carlota"]
["2011-01-28","Mykola",183,"Sunshine"]
["2011-01-29","Tawnya",146,"Sunset"]
["2011-01-30","Shegaw",179,"Carlota"]
["2011-01-31","Sarah",115,"Bellen"]
["2011-01-31","Alamzeb",199,"Carlota"]
["2011-01-31","Shegaw",117,"Sunset"]
["2011-01-31","Sarah",196,"Sunshine"]
["2011-01-31","Jessica",127,"Sunshine"]
["2011-02-01","Julie",110,"Carlota"]
["2011-02-01","Marsha",131,"Carlota"]
["2011-02-03","Julie",174,"Bellen"]
["2011-02-05","Dawn",146,"Bellen"]
["2011-02-05","Amburg",112,"Bellen"]
["2011-02-05","Christine",113,"Carlota"]
["2011-02-05","Christine",135,"Majestic Beaut"]
["2011-02-06","Dawn",111,"Bellen"]
["2011-02-06","Jessica",146,"Bellen"]
["2011-02-06","Amburg",194,"Carlota"]
["2011-02-07","Maurice",113,"Sunshine"]
["2011-02-09","Amburg",116,"Bellen"]
["2011-02-09","Wendy",138,"Sunshine"]
["2011-02-09","Monique",117,"Sunshine"]
["2011-02-11","Jessica",128,"Bellen"]
["2011-02-11","Monique",147,"Majestic Beaut"]
["2011-02-12","Christine",189,"Bellen"]
["2011-02-12","Yishak",186,"Majestic Beaut"]
["2011-02-12","Marsha",179,"Majestic Beaut"]
["2011-02-12","Christine",105,"Sunset"]
["2011-02-13","Donna",187,"Majestic Beaut"]
["2011-02-13","Dawn",186,"Sunshine"]
["2011-02-14","Maurice",154,"Bellen"]
["2011-02-14","Maurice",181,"Majestic Beaut"]
["2011-02-16","Wendy",154,"Sunset"]
["2011-02-17","Amburg",159,"Sunshine"]
["2011-02-18","Mykola",196,"Bellen"]
["2011-02-19","Jessica",103,"Sunshine"]
["2011-02-21","Dawn",136,"Sunset"]
["2011-02-21","Jean",102,"Sunshine"]
["2011-02-22","Wendy",197,"Carlota"]
["2011-02-24","Shegaw",158,"Carlota"]
["2011-02-26","Monique",151,"Majestic Beaut"]
["2011-03-02","Cynthia",162,"Bellen"]
["2011-03-02","Mykola",166,"Carlota"]
["2011-03-03","Dawn",120,"Bellen"]
["2011-03-03","Donna",143,"Sunset"]
["2011-03-03","Donna",141,"Sunshine"]
["2011-03-04","Yishak",199,"Bellen"]
["2011-03-04","Maurice",114,"Bellen"]
["2011-03-07","Dawn",144,"Carlota"]
["2011-03-09","Maurice",134,"Carlota"]
["2011-03-10","Shegaw",193,"Carlota"]
["2011-03-10","Shirley",168,"Majestic Beaut"]
["2011-03-10","Dawn",133,"Sunset"]
["2011-03-10","Mykola",187,"Sunshine"]
["2011-03-11","Donna",175,"Bellen"]
["2011-03-11","Monique",152,"Bellen"]
["2011-03-11","Zemmia",181,"Sunset"]
["2011-03-11","Shegaw",123,"Sunset"]
["2011-03-11","Monique",191,"Sunshine"]
["2011-03-12","Marsha",132,"Sunshine"]
["2011-03-12","Alamzeb",158,"Sunshine"]
["2011-03-13","Marsha",143,"Bellen"]
["2011-03-14","Maurice",182,"Bellen"]
["2011-03-14","Tawnya",145,"Bellen"]
["2011-03-14","Maurice",193,"Majestic Beaut"]
["2011-03-15","Amburg",137,"Sunshine"]
["2011-03-17","Shirley",186,"Bellen"]
["2011-03-17","Maurice",161,"Sunset"]
["2011-03-19","Marsha",109,"Majestic Beaut"]
["2011-03-20","Wendy",131,"Majestic Beaut"]
["2011-03-21","Shirley",133,"Bellen"]
["2011-03-24","Jessica",118,"Majestic Beaut"]
["2011-03-25","Tawnya",186,"Bellen"]
["2011-03-26","Cynthia",108,"Carlota"]
["2011-03-26","Shirley",109,"Majestic Beaut"]
["2011-03-26","Zemmia",184,"Majestic Beaut"]
["2011-03-27","Jessica",152,"Bellen"]
["2011-03-27","Sarah",181,"Majestic Beaut"]
["2011-03-27","Wendy",152,"Sunshine"]
["2011-03-28","Sreysros",175,"Majestic Beaut"]
["2011-03-29","Amburg",131,"Majestic Beaut"]
["2011-03-29","Marsha",112,"Sunset"]
["2011-03-29","Sarah",192,"Sunset"]
["2011-03-31","Jessica",111,"Bellen"]
["2011-03-31","Sreysros",104,"Carlota"]
["2011-03-31","Sarah",192,"Majestic Beaut"]
["2011-04-01","Amburg",189,"Bellen"]
["2011-04-02","Mykola",124,"Sunset"]
["2011-04-04","Sreysros",117,"Majestic Beaut"]
["2011-04-05","Shirley",104,"Bellen"]
["2011-04-05","Sarah",112,"Carlota"]
["2011-04-05","Monique",168,"Majestic Beaut"]
["2011-04-05","Cynthia",147,"Sunshine"]
["2011-04-07","Zemmia",170,"Sunset"]
["2011-04-07","Sarah",154,"Sunset"]
["2011-04-08","Jean",191,"Bellen"]
["2011-04-08","Tawnya",181,"Sunset"]
["2011-04-08","Jean",115,"Sunshine"]
["2011-04-13","Jessica",119,"Majestic Beaut"]
["2011-04-14","Shegaw",136,"Carlota"]
["2011-04-14","Alamzeb",145,"Sunset"]
["2011-04-16","Jean",143,"Bellen"]
["2011-04-16","Donna",153,"Sunshine"]
["2011-04-17","Mykola",152,"Bellen"]
["2011-04-17","Monique",133,"Bellen"]
["2011-04-17","Yishak",190,"Majestic Beaut"]
["2011-04-17","Marsha",152,"Sunshine"]
["2011-04-18","Monique",110,"Majestic Beaut"]
["2011-04-18","Maurice",177,"Sunset"]
["2011-04-19","Tawnya",123,"Majestic Beaut"]
["2011-04-19","Christine",129,"Sunset"]
["2011-04-19","Mykola",169,"Sunshine"]
["2011-04-20","Dawn",174,"Sunset"]
["2011-04-21","Maurice",129,"Sunset"]
["2011-04-22","Mykola",132,"Sunshine"]
["2011-04-23","Marsha",148,"Majestic Beaut"]
["2011-04-23","Donna",165,"Sunset"]
["2011-04-25","Shegaw",178,"Carlota"]
["2011-04-25","Zemmia",155,"Sunshine"]
["2011-04-26","Cynthia",172,"Bellen"]
["2011-04-26","Julie",112,"Carlota"]
["2011-04-26","Sreysros",180,"Sunset"]
["2011-04-26","Wendy",115,"Sunset"]
["2011-04-27","Maurice",190,"Majestic Beaut"]
["2011-04-28","Maurice",163,"Carlota"]
["2011-04-28","Jessica",106,"Carlota"]
["2011-04-28","Zemmia",115,"Majestic Beaut"]
["2011-04-28","Shirley",130,"Sunshine"]
["2011-05-01","Jean",139,"Carlota"]
["2011-05-01","Maurice",111,"Carlota"]
["2011-05-01","Alamzeb",157,"Sunshine"]
["2011-05-03","Shegaw",118,"Carlota"]
["2011-05-04","Mykola",118,"Carlota"]
["2011-05-04","Monique",126,"Sunset"]
["2011-05-04","Maurice",110,"Sunshine"]
["2011-05-04","Tawnya",173,"Sunshine"]
["2011-05-05","Tawnya",101,"Majestic Beaut"]
["2011-05-06","Cynthia",156,"Sunshine"]
["2011-05-07","Sarah",164,"Bellen"]
["2011-05-08","Jessica",160,"Carlota"]
["2011-05-09","Amburg",142,"Carlota"]
["2011-05-10","Sarah",144,"Bellen"]
["2011-05-10","Monique",145,"Sunshine"]
["2011-05-11","Zemmia",195,"Bellen"]
["2011-05-11","Dawn",166,"Carlota"]
["2011-05-11","Maurice",104,"Carlota"]
["2011-05-11","Jean",101,"Majestic Beaut"]
["2011-05-12","Jessica",182,"Majestic Beaut"]
["2011-05-12","Shirley",133,"Sunset"]
["2011-05-13","Jean",132,"Bellen"]
["2011-05-13","Marsha",158,"Majestic Beaut"]
["2011-05-14","Alamzeb",164,"Sunset"]
["2011-05-14","Zemmia",200,"Sunset"]
["2011-05-16","Jessica",113,"Carlota"]
["2011-05-16","Cynthia",106,"Sunshine"]
["2011-05-18","Alamzeb",175,"Bellen"]
["2011-05-18","Jean",115,"Carlota"]
["2011-05-19","Julie",144,"Bellen"]
["2011-05-20","Julie",175,"Majestic Beaut"]
["2011-05-22","Jessica",131,"Bellen"]
["2011-05-23","Mykola",152,"Carlota"]
["2011-05-24","Cynthia",110,"Carlota"]
["2011-05-24","Sarah",110,"Sunset"]
["2011-05-25","Alamzeb",178,"Sunset"]
["2011-05-26","Donna",103,"Majestic Beaut"]
["2011-05-26","Tawnya",113,"Sunset"]
["2011-05-26","Monique",181,"Sunset"]
["2011-05-26","Mykola",168,"Sunshine"]
["2011-05-26","Shirley",137,"Sunshine"]
["2011-05-27","Sarah",148,"Bellen"]
["2011-05-28","Sarah",200,"Carlota"]
["2011-05-28","Tawnya",140,"Majestic Beaut"]
["2011-05-29","Sreysros",113,"Bellen"]
["2011-05-29","Alamzeb",152,"Carlota"]
["2011-05-29","Donna",170,"Sunset"]
["2011-05-29","Tawnya",125,"Sunset"]
["2011-05-29","Monique",194,"Sunset"]
["2011-05-30","Shegaw",128,"Bellen"]
["2011-05-30","Maurice",191,"Carlota"]
["2011-05-31","Jean",157,"Sunset"]
["2011-06-02","Mykola",179,"Carlota"]
["2011-06-03","Mykola",197,"Bellen"]
["2011-06-03","Alamzeb",198,"Bellen"]
["2011-06-03","Tawnya",176,"Carlota"]
["2011-06-03","Shirley",199,"Sunshine"]
["2011-06-04","Jean",107,"Carlota"]
["2011-06-04","Monique",132,"Sunset"]
["2011-06-04","Julie",134,"Sunset"]
["2011-06-04","Mykola",191,"Sunshine"]
["2011-06-07","Wendy",119,"Sunshine"]
["2011-06-08","Jessica",147,"Sunshine"]
["2011-06-10","Maurice",166,"Majestic Beaut"]
["2011-06-10","Dawn",115,"Sunshine"]
["2011-06-12","Christine",132,"Bellen"]
["2011-06-12","Monique",148,"Bellen"]
["2011-06-12","Wendy",140,"Sunset"]
["2011-06-12","Yishak",114,"Sunset"]
["2011-06-12","Jessica",168,"Sunshine"]
["2011-06-13","Jessica",200,"Bellen"]
["2011-06-13","Sreysros",109,"Majestic Beaut"]
["2011-06-13","Maurice",102,"Sunset"]
["2011-06-14","Yishak",151,"Bellen"]
["2011-06-14","Marsha",160,"Majestic Beaut"]
["2011-06-14","Shirley",132,"Majestic Beaut"]
["2011-06-15","Christine",143,"Sunshine"]
["2011-06-16","Zemmia",114,"Carlota"]
["2011-06-18","Yishak",131,"Sunset"]
["2011-06-18","Amburg",197,"Sunshine"]
["2011-06-19","Shegaw",139,"Majestic Beaut"]
["2011-06-19","Wendy",124,"Sunshine"]
["2011-06-20","Dawn",174,"Bellen"]
["2011-06-20","Jean",196,"Sunshine"]
["2011-06-21","Julie",196,"Sunshine"]
["2011-06-21","Tawnya",175,"Sunshine"]
["2011-06-22","Monique",195,"Sunset"]
["2011-06-23","Maurice",108,"Carlota"]
["2011-06-24","Marsha",192,"Sunshine"]
["2011-06-25","Wendy",111,"Carlota"]
["2011-06-25","Shegaw",115,"Majestic Beaut"]
["2011-06-25","Tawnya",120,"Sunset"]
["2011-06-25","Jessica",175,"Sunshine"]
["2011-06-26","Yishak",104,"Carlota"]
["2011-06-27","Shirley",152,"Carlota"]
["2011-06-28","Alamzeb",131,"Carlota"]
["2011-06-28","Mykola",131,"Majestic Beaut"]
["2011-06-28","Jessica",133,"Sunshine"]
["2011-06-29","Jean",187,"Majestic Beaut"]
["2011-06-30","Cynthia",121,"Bellen"]
["2011-06-30","Shirley",200,"Sunshine"]
["2011-07-02","Zemmia",150,"Majestic Beaut"]
["2011-07-02","Mykola",152,"Sunset"]
["2011-07-03","Donna",128,"Bellen"]
["2011-07-03","Dawn",141,"Carlota"]
["2011-07-04","Zemmia",149,"Carlota"]
["2011-07-04","Tawnya",160,"Majestic Beaut"]
["2011-07-04","Jean",136,"Sunset"]
["2011-07-04","Dawn",112,"Sunshine"]
["2011-07-05","Donna",200,"Bellen"]
["2011-07-05","Tawnya",112,"Sunshine"]
["2011-07-06","Amburg",180,"Bellen"]
["2011-07-06","Dawn",140,"Carlota"]
["2011-07-07","Alamzeb",171,"Carlota"]
["2011-07-07","Tawnya",145,"Carlota"]
["2011-07-07","Donna",123,"Sunset"]
["2011-07-09","Mykola",193,"Majestic Beaut"]
["2011-07-10","Tawnya",113,"Bellen"]
["2011-07-10","Dawn",165,"Carlota"]
["2011-07-10","Marsha",178,"Majestic Beaut"]
["2011-07-10","Cynthia",142,"Majestic Beaut"]
["2011-07-10","Yishak",141,"Sunset"]
["2011-07-10","Shirley",154,"Sunset"]
["2011-07-11","Zemmia",140,"Majestic Beaut"]
["2011-07-11","Maurice",180,"Sunset"]
["2011-07-12","Shegaw",191,"Bellen"]
["2011-07-12","Alamzeb",141,"Sunshine"]
["2011-07-13","Jessica",145,"Majestic Beaut"]
["2011-07-13","Dawn",140,"Sunshine"]
["2011-07-13","Dawn",151,"Sunshine"]
["2011-07-14","Cynthia",144,"Carlota"]
["2011-07-15","Christine",185,"Sunset"]
["2011-07-16","Donna",152,"Bellen"]
["2011-07-16","Donna",182,"Majestic Beaut"]
["2011-07-16","Julie",152,"Majestic Beaut"]
["2011-07-16","Cynthia",127,"Sunset"]
["2011-07-16","Jean",183,"Sunshine"]
["2011-07-17","Dawn",149,"Carlota"]
["2011-07-18","Dawn",149,"Sunset"]
["2011-07-19","Mykola",197,"Carlota"]
["2011-07-21","Julie",110,"Sunshine"]
["2011-07-21","Sarah",112,"Sunshine"]
["2011-07-22","Mykola",114,"Carlota"]
["2011-07-22","Cynthia",193,"Sunset"]
["2011-07-24","Wendy",167,"Bellen"]
["2011-07-24","Christine",174,"Bellen"]

{"sheet":"779an","index":1,"n_rows":768,"n_cols":12,"rows_kept":768,"cut":false,"hidden":false,"merged":[]}
["Date","SalesRep","Sales","Product",null,"SUMIFS (Faster Calculating)",null,"Product"]
["2010-03-26","Cynthia",153,"Bellen",null,"Criteria for Adding Sales",null,"Bellen","Sunshine","Carlota","Sunset","Majestic Beaut"]
["2010-03-26","Dawn",178,"Bellen",null,"Apr",2010,{"$f":"SUMIFS($C$2:$C$768,$D$2:$D$768,H$2,$A$2:$A$768,\">=1\"&$F3&$G3,$A$2:$A$768,\"<=\"&EOMONTH(\"1\"&$F3&$G3,0))","v":1476},{"$f":"SUMIFS($C$2:$C$768,$D$2:$D$768,I$2,$A$2:$A$768,\">=1\"&$F3&$G3,$A$2:$A$768,\"<=\"&EOMONTH(\"1\"&$F3&$G3,0))","v":1097},1363,1061,765]
["2010-03-26","Yishak",189,"Sunset",null,"May",2010,{"$f":"SUMIFS($C$2:$C$768,$D$2:$D$768,H$2,$A$2:$A$768,\">=1\"&$F4&$G4,$A$2:$A$768,\"<=\"&EOMONTH(\"1\"&$F4&$G4,0))","v":981},1366,1774,1225,1321]
["2010-03-27","Marsha",143,"Majestic Beaut",null,"Apr",2011,1084,1153,807,1843,1280]
["2010-03-28","Dawn",135,"Sunset",null,"May",2011,1474,1152,2091,1851,960]
["2010-03-29","Shegaw",147,"Carlota"]
["2010-03-29","Monique",190,"Carlota",null,"SUMPRODUCT",null,"Product"]
["2010-03-29","Cynthia",122,"Majestic Beaut",null,"Criteria for Adding Sales",null,"Bellen","Sunshine","Carlota","Sunset","Majestic Beaut"]
["2010-03-29","Christine",151,"Majestic Beaut",null,"Apr",2010,{"$f":"SUMPRODUCT((--(TEXT($A$2:$A$768,\"mmmyyy\")=$F10&$G10)),--($D$2:$D$768=H$9),$C$2:$C$768)","v":1476},1097,1363,1061,765]
["2010-03-29","Marsha",178,"Sunset",null,"May",2010,981,1366,1774,1225,1321]
["2010-03-30","Maurice",190,"Bellen",null,"Apr",2011,1084,1153,807,1843,1280]
["2010-03-30","Alamzeb",167,"Sunset",null,"May",2011,1474,1152,2091,1851,960]
["2010-03-30","Yishak",133,"Sunset"]
["2010-03-31","Wendy",173,"Bellen",null,"COUNTIFS (Faster Calculating)",null,"Product"]
["2010-04-01","Zemmia",114,"Carlota",null,"Criteria for Counting Sales",null,"Bellen","Sunshine","Carlota","Sunset","Majestic Beaut"]
["2010-04-01","Sreysros",111,"Majestic Beaut",null,"Apr",2010,{"$f":"COUNTIFS($A$2:$A$768,\">=1\"&$F17&$G17,$A$2:$A$768,\"<=\"&EOMONTH(\"1\"&$F17&$G17,0),$D$2:$D$768,H$16)","v":10},{"$f":"COUNTIFS($A$2:$A$768,\">=1\"&$F17&$G17,$A$2:$A$768,\"<=\"&EOMONTH(\"1\"&$F17&$G17,0),$D$2:$D$768,I$16)","v":8},9,8,5]
["2010-04-03","Julie",122,"Bellen",null,"May",2010,{"$f":"COUNTIFS($A$2:$A$768,\">=1\"&$F18&$G18,$A$2:$A$768,\"<=\"&EOMONTH(\"1\"&$F18&$G18,0),$D$2:$D$768,H$16)","v":7},9,12,8,10]
["2010-04-03","Amburg",158,"Sunshine",null,"Apr",2011,7,8,6,12,9]
["2010-04-04","Shirley",139,"Sunset",null,"May",2011,10,8,15,12,7]
["2010-04-05","Maurice",191,"Bellen"]
["2010-04-05","Amburg",114,"Sunset"]
["2010-04-06","Jean",146,"Sunshine"]
["2010-04-07","Zemmia",150,"Carlota"]
["2010-04-08","Cynthia",105,"Sunset"]
["2010-04-08","Monique",183,"Sunshine"]
["2010-04-09","Yishak",102,"Bellen"]
["2010-04-10","Zemmia",104,"Bellen"]
["2010-04-10","Zemmia",172,"Bellen"]
["2010-04-10","Christine",172,"Carlota"]
["2010-04-10","Donna",175,"Sunset"]
["2010-04-10","Donna",145,"Sunshine"]
["2010-04-14","Amburg",152,"Majestic Beaut"]
["2010-04-15","Maurice",132,"Sunshine"]
["2010-04-16","Yishak",175,"Carlota"]
["2010-04-16","Jean",170,"Majestic Beaut"]
["2010-04-16","Shirley",144,"Sunset"]
["2010-04-17","Mykola",198,"Bellen"]
["2010-04-17","Amburg",190,"Majestic Beaut"]
["2010-04-18","Sarah",152,"Bellen"]
["2010-04-19","Christine",120,"Sunshine"]
["2010-04-20","Mykola",142,"Majestic Beaut"]
["2010-04-21","Cynthia",125,"Bellen"]
["2010-04-22","Amburg",133,"Sunset"]
["2010-04-23","Amburg",117,"Sunset"]
["2010-04-24","Yishak",134,"Sunset"]
["2010-04-25","Jean",101,"Sunshine"]
["2010-04-26","Sarah",112,"Sunshine"]
["2010-04-27","Christine",176,"Carlota"]
["2010-04-28","Shirley",164,"Bellen"]
["2010-04-28","Cynthia",194,"Carlota"]
["2010-04-30","Jean",146,"Bellen"]
["2010-04-30","Mykola",110,"Carlota"]
["2010-04-30","Jessica",137,"Carlota"]
["2010-04-30","Maurice",135,"Carlota"]
["2010-05-01","Sarah",165,"Carlota"]
["2010-05-01","Mykola",141,"Sunset"]
["2010-05-01","Shegaw",199,"Sunshine"]
["2010-05-02","Sreysros",200,"Sunset"]
["2010-05-03","Sarah",146,"Carlota"]
["2010-05-04","Shegaw",112,"Sunset"]
["2010-05-05","Maurice",124,"Bellen"]
["2010-05-05","Mykola",168,"Bellen"]
["2010-05-05","Mykola",163,"Carlota"]
["2010-05-05","Sreysros",168,"Majestic Beaut"]
["2010-05-06","Marsha",109,"Majestic Beaut"]
["2010-05-06","Alamzeb",163,"Sunset"]
["2010-05-07","Amburg",115,"Sunset"]
["2010-05-08","Mykola",133,"Majestic Beaut"]
["2010-05-09","Julie",164,"Majestic Beaut"]
["2010-05-10","Sreysros",176,"Bellen"]
["2010-05-10","Monique",129,"Carlota"]
["2010-05-10","Maurice",115,"Sunset"]
["2010-05-11","Amburg",156,"Sunshine"]
["2010-05-12","Jean",104,"Bellen"]
["2010-05-12","Julie",167,"Majestic Beaut"]
["2010-05-12","Cynthia",152,"Sunshine"]
["2010-05-13","Maurice",183,"Carlota"]
["2010-05-13","Maurice",117,"Sunshine"]
["2010-05-14","Sarah",112,"Majestic Beaut"]
["2010-05-15","Maurice",121,"Majestic Beaut"]
["2010-05-17","Yishak",158,"Carlota"]
["2010-05-17","Maurice",196,"Sunset"]
["2010-05-18","Jean",145,"Carlota"]
["2010-05-18","Mykola",172,"Sunshine"]
["2010-05-19","Marsha",114,"Sunshine"]
["2010-05-21","Mykola",135,"Sunshine"]
["2010-05-22","Wendy",146,"Carlota"]
["2010-05-22","Sreysros",104,"Carlota"]
["2010-05-23","Jean",111,"Majestic Beaut"]
["2010-05-24","Shegaw",130,"Majestic Beaut"]
["2010-05-25","Mykola",111,"Bellen"]
["2010-05-25","Shirley",163,"Carlota"]
["2010-05-26","Zemmia",120,"Carlota"]
["2010-05-26","Zemmia",152,"Carlota"]
["2010-05-26","Donna",122,"Sunshine"]
["2010-05-28","Alamzeb",106,"Majestic Beaut"]
["2010-05-29","Alamzeb",132,"Bellen"]
["2010-05-29","Maurice",183,"Sunset"]
["2010-05-31","Yishak",166,"Bellen"]
["2010-05-31","Tawnya",199,"Sunshine"]
["2010-06-01","Maurice",148,"Bellen"]
["2010-06-01","Jessica",125,"Sunset"]
["2010-06-01","Amburg",180,"Sunshine"]
["2010-06-02","Sreysros",170,"Majestic Beaut"]
["2010-06-02","Sarah",168,"Majestic Beaut"]
["2010-06-04","Donna",107,"Majestic Beaut"]
["2010-06-04","Zemmia",161,"Sunshine"]
["2010-06-04","Mykola",178,"Sunshine"]
["2010-06-06","Tawnya",123,"Bellen"]
["2010-06-06","Sarah",155,"Carlota"]
["2010-06-06","Sreysros",134,"Sunset"]
["2010-06-07","Mykola",179,"Bellen"]
["2010-06-07","Zemmia",126,"Carlota"]
["2010-06-07","Zemmia",194,"Majestic Beaut"]
["2010-06-08","Wendy",196,"Bellen"]
["2010-06-08","Mykola",199,"Sunshine"]
["2010-06-09","Dawn",116,"Sunset"]
["2010-06-10","Maurice",102,"Carlota"]
["2010-06-10","Julie",146,"Majestic Beaut"]
["2010-06-10","Amburg",125,"Sunshine"]
["2010-06-11","Shegaw",196,"Bellen"]
["2010-06-11","Shirley",109,"Carlota"]
["2010-06-11","Maurice",114,"Sunset"]
["2010-06-12","Tawnya",156,"Bellen"]
["2010-06-12","Cynthia",176,"Bellen"]
["2010-06-12","Shirley",195,"Carlota"]
["2010-06-12","Sreysros",108,"Sunshine"]
["2010-06-14","Julie",193,"Carlota"]
["2010-06-14","Mykola",178,"Sunshine"]
["2010-06-14","Jessica",185,"Sunshine"]
["2010-06-15","Wendy",129,"Carlota"]
["2010-06-15","Sreysros",180,"Majestic Beaut"]
["2010-06-15","Maurice",186,"Sunshine"]
["2010-06-16","Christine",146,"Bellen"]
["2010-06-16","Tawnya",159,"Carlota"]
["2010-06-16","Tawnya",151,"Sunshine"]
["2010-06-17","Shegaw",154,"Sunset"]
["2010-06-18","Cynthia",117,"Bellen"]
["2010-06-18","Dawn",191,"Majestic Beaut"]
["2010-06-18","Monique",142,"Sunset"]
["2010-06-19","Monique",169,"Majestic Beaut"]
["2010-06-20","Wendy",178,"Majestic Beaut"]
["2010-06-20","Jessica",155,"Sunshine"]
["2010-06-22","Julie",129,"Bellen"]
["2010-06-22","Donna",112,"Sunset"]
["2010-06-22","Christine",138,"Sunset"]
["2010-06-23","Mykola",102,"Bellen"]
["2010-06-24","Marsha",164,"Sunset"]
["2010-06-24","Jessica",149,"Sunset"]
["2010-06-25","Jean",153,"Sunset"]
["2010-06-26","Monique",142,"Majestic Beaut"]
["2010-06-26","Mykola",182,"Sunshine"]
["2010-06-28","Jean",154,"Sunset"]
["2010-06-28","Julie",178,"Sunshine"]
["2010-06-29","Cynthia",149,"Majestic Beaut"]
["2010-06-29","Monique",132,"Sunset"]
["2010-06-30","Shirley",157,"Bellen"]
["2010-06-30","Jean",148,"Carlota"]
["2010-07-02","Christine",194,"Sunset"]
["2010-07-04","Monique",170,"Carlota"]
["2010-07-04","Shegaw",144,"Majestic Beaut"]
["2010-07-04","Donna",168,"Majestic Beaut"]
["2010-07-05","Cynthia",137,"Sunset"]
["2010-07-06","Maurice",126,"Carlota"]
["2010-07-07","Wendy",114,"Sunset"]
["2010-07-08","Yishak",192,"Carlota"]
["2010-07-09","Maurice",108,"Bellen"]
["2010-07-09","Sarah",198,"Majestic Beaut"]
["2010-07-09","Shirley",192,"Sunset"]
["2010-07-10","Christine",187,"Majestic Beaut"]
["2010-07-10","Shegaw",136,"Majestic Beaut"]
["2010-07-10","Jean",160,"Sunset"]
["2010-07-10","Marsha",134,"Sunshine"]
["2010-07-13","Mykola",184,"Bellen"]
["2010-07-15","Amburg",142,"Sunshine"]
["2010-07-15","Monique",144,"Sunshine"]
["2010-07-16","Tawnya",148,"Carlota"]
["2010-07-16","Shegaw",195,"Majestic Beaut"]
["2010-07-16","Jean",107,"Majestic Beaut"]
["2010-07-16","Monique",193,"Sunset"]
["2010-07-17","Cynthia",172,"Majestic Beaut"]
["2010-07-18","Marsha",167,"Bellen"]
["2010-07-18","Amburg",138,"Carlota"]
["2010-07-20","Donna",191,"Carlota"]
["2010-07-22","Julie",139,"Carlota"]
["2010-07-22","Jessica",103,"Sunset"]
["2010-07-22","Jessica",122,"Sunshine"]
["2010-07-23","Christine",138,"Majestic Beaut"]
["2010-07-23","Wendy",185,"Sunshine"]
["2010-07-24","Tawnya",158,"Sunset"]
["2010-07-24","Christine",119,"Sunshine"]
["2010-07-25","Alamzeb",161,"Majestic Beaut"]
["2010-07-25","Amburg",193,"Sunshine"]
["2010-07-28","Marsha",179,"Carlota"]
["2010-07-29","Zemmia",139,"Carlota"]
["2010-07-29","Christine",111,"Carlota"]
["2010-07-30","Mykola",145,"Sunshine"]
["2010-07-31","Zemmia",150,"Carlota"]
["2010-07-31","Monique",117,"Carlota"]
["2010-07-31","Wendy",160,"Sunset"]
["2010-08-01","Tawnya",138,"Bellen"]
["2010-08-01","Mykola",174,"Carlota"]
["2010-08-01","Sreysros",160,"Sunset"]
["2010-08-02","Cynthia",190,"Bellen"]
["2010-08-02","Jessica",187,"Bellen"]
["2010-08-03","Dawn",102,"Carlota"]
["2010-08-03","Sarah",163,"Sunshine"]
["2010-08-04","Alamzeb",162,"Bellen"]
["2010-08-04","Shegaw",155,"Sunshine"]
["2010-08-04","Shirley",105,"Sunshine"]
["2010-08-05","Shirley",117,"Sunshine"]
["2010-08-06","Julie",163,"Carlota"]
["2010-08-06","Zemmia",161,"Sunshine"]
["2010-08-08","Mykola",160,"Majestic Beaut"]
["2010-08-09","Shirley",130,"Sunset"]
["2010-08-11","Mykola",195,"Majestic Beaut"]
["2010-08-11","Sarah",129,"Sunshine"]
["2010-08-12","Amburg",137,"Carlota"]
["2010-08-12","Jessica",101,"Sunset"]
["2010-08-12","Jessica",117,"Sunshine"]
["2010-08-13","Dawn",111,"Sunshine"]
["2010-08-14","Donna",144,"Bellen"]
["2010-08-15","Monique",124,"Carlota"]
["2010-08-15","Maurice",117,"Sunshine"]
["2010-08-16","Sreysros",106,"Carlota"]
["2010-08-17","Jessica",152,"Sunset"]
["2010-08-19","Yishak",114,"Sunset"]
["2010-08-19","Monique",184,"Sunshine"]
["2010-08-20","Donna",105,"Bellen"]
["2010-08-20","Dawn",101,"Majestic Beaut"]
["2010-08-20","Jessica",114,"Sunshine"]
["2010-08-21","Alamzeb",131,"Bellen"]
["2010-08-21","Sarah",131,"Carlota"]
["2010-08-21","Marsha",143,"Sunset"]
["2010-08-21","Cynthia",134,"Sunshine"]
["2010-08-23","Julie",126,"Sunshine"]
["2010-08-24","Alamzeb",157,"Sunset"]
["2010-08-24","Julie",137,"Sunshine"]
["2010-08-25","Christine",135,"Majestic Beaut"]
["2010-08-26","Jean",184,"Majestic Beaut"]
["2010-08-27","Marsha",147,"Sunshine"]
["2010-08-28","Amburg",130,"Majestic Beaut"]
["2010-08-29","Sarah",195,"Carlota"]
["2010-08-29","Sarah",189,"Sunshine"]
["2010-08-30","Sarah",184,"Carlota"]
["2010-08-30","Christine",124,"Majestic Beaut"]
["2010-08-30","Jean",183,"Majestic Beaut"]
["2010-08-30","Jean",127,"Sunshine"]
["2010-08-31","Amburg",154,"Carlota"]
["2010-09-01","Yishak",160,"Sunshine"]
["2010-09-02","Jean",148,"Carlota"]
["2010-09-02","Amburg",186,"Sunshine"]
["2010-09-03","Shegaw",128,"Carlota"]
["2010-09-04","Donna",168,"Majestic Beaut"]
["2010-09-04","Marsha",177,"Sunset"]
["2010-09-06","Maurice",164,"Bellen"]
["2010-09-08","Jessica",143,"Sunset"]
["2010-09-09","Jean",181,"Bellen"]
["2010-09-10","Marsha",140,"Bellen"]
["2010-09-10","Yishak",158,"Carlota"]
["2010-09-10","Sreysros",182,"Sunset"]
["2010-09-11","Shirley",181,"Carlota"]
["2010-09-12","Julie",134,"Sunshine"]
["2010-09-15","Zemmia",159,"Carlota"]
["2010-09-16","Jean",112,"Sunshine"]
["2010-09-18","Christine",147,"Sunset"]
["2010-09-19","Yishak",182,"Carlota"]
["2010-09-20","Shirley",104,"Sunset"]
["2010-09-21","Mykola",109,"Bellen"]
["2010-09-21","Sarah",174,"Majestic Beaut"]
["2010-09-22","Tawnya",158,"Bellen"]
["2010-09-22","Yishak",172,"Carlota"]
["2010-09-22","Yishak",152,"Carlota"]
["2010-09-22","Jessica",119,"Sunshine"]
["2010-09-23","Shegaw",162,"Sunset"]
["2010-09-23","Cynthia",161,"Sunshine"]
["2010-09-24","Zemmia",111,"Bellen"]
["2010-09-24","Amburg",116,"Majestic Beaut"]
["2010-09-24","Amburg",113,"Majestic Beaut"]
["2010-09-25","Julie",135,"Carlota"]
["2010-09-25","Christine",152,"Sunshine"]
["2010-09-27","Maurice",165,"Carlota"]
["2010-09-27","Yishak",155,"Majestic Beaut"]
["2010-09-27","Wendy",165,"Majestic Beaut"]
["2010-09-28","Dawn",110,"Carlota"]
["2010-09-28","Yishak",139,"Sunshine"]
["2010-09-29","Dawn",196,"Sunset"]
["2010-09-30","Maurice",105,"Bellen"]
["2010-09-30","Monique",192,"Carlota"]
["2010-10-01","Mykola",125,"Sunshine"]
["2010-10-02","Mykola",136,"Majestic Beaut"]
["2010-10-02","Wendy",178,"Sunset"]
["2010-10-03","Shirley",122,"Carlota"]
["2010-10-04","Jean",109,"Sunset"]
["2010-10-05","Zemmia",184,"Bellen"]
["2010-10-05","Dawn",159,"Carlota"]
["2010-10-05","Amburg",113,"Carlota"]
["2010-10-06","Sreysros",182,"Bellen"]
["2010-10-06","Tawnya",197,"Majestic Beaut"]
["2010-10-08","Sarah",143,"Bellen"]
["2010-10-08","Shegaw",185,"Sunset"]
["2010-10-08","Shirley",121,"Sunset"]
["2010-10-09","Shegaw",101,"Bellen"]
["2010-10-09","Alamzeb",110,"Sunset"]
["2010-10-09","Yishak",172,"Sunshine"]
["2010-10-10","Marsha",107,"Bellen"]
["2010-10-14","Jessica",107,"Bellen"]
["2010-10-15","Wendy",148,"Carlota"]
["2010-10-15","Maurice",191,"Majestic Beaut"]
["2010-10-16","Jean",134,"Carlota"]
["2010-10-17","Shegaw",138,"Sunset"]
["2010-10-18","Amburg",158,"Sunshine"]
["2010-10-18","Yishak",151,"Sunshine"]
["2010-10-18","Christine",131,"Sunshine"]
["2010-10-19","Tawnya",167,"Carlota"]
["2010-10-19","Maurice",107,"Carlota"]
["2010-10-19","Julie",132,"Majestic Beaut"]
["2010-10-19","Dawn",185,"Sunset"]
["2010-10-19","Sarah",186,"Sunshine"]
["2010-10-19","Jessica",137,"Sunshine"]
["2010-10-20","Wendy",165,"Bellen"]
["2010-10-20","Mykola",168,"Sunset"]
["2010-10-20","Donna",128,"Sunshine"]
["2010-10-21","Sarah",106,"Bellen"]
["2010-10-21","Yishak",133,"Carlota"]
["2010-10-21","Shegaw",198,"Sunshine"]
["2010-10-22","Mykola",128,"Sunset"]
["2010-10-22","Mykola",150,"Sunshine"]
["2010-10-23","Maurice",119,"Carlota"]
["2010-10-23","Amburg",172,"Majestic Beaut"]
["2010-10-23","Shirley",165,"Sunshine"]
["2010-10-25","Yishak",174,"Carlota"]
["2010-10-25","Marsha",116,"Carlota"]
["2010-10-25","Amburg",187,"Sunshine"]
["2010-10-27","Shirley",139,"Carlota"]
["2010-10-27","Wendy",167,"Carlota"]
["2010-10-27","Mykola",167,"Majestic Beaut"]
["2010-10-28","Wendy",142,"Majestic Beaut"]
["2010-10-29","Dawn",174,"Majestic Beaut"]
["2010-10-30","Yishak",185,"Carlota"]
["2010-10-30","Sreysros",190,"Carlota"]
["2010-10-30","Marsha",127,"Sunset"]
["2010-10-30","Shirley",143,"Sunset"]
["2010-11-01","Shegaw",186,"Sunshine"]
["2010-11-02","Marsha",160,"Carlota"]
["2010-11-02","Shegaw",108,"Sunset"]
["2010-11-03","Cynthia",193,"Bellen"]
["2010-11-03","Christine",144,"Bellen"]
["2010-11-03","Mykola",154,"Sunset"]
["2010-11-03","Jessica",144,"Sunset"]
["2010-11-03","Julie",161,"Sunset"]
["2010-11-04","Wendy",111,"Bellen"]
["2010-11-04","Maurice",170,"Bellen"]
["2010-11-05","Wendy",160,"Carlota"]
["2010-11-05","Maurice",101,"Sunshine"]
["2010-11-06","Tawnya",186,"Majestic Beaut"]
["2010-11-07","Jean",119,"Majestic Beaut"]
["2010-11-08","Shirley",160,"Sunshine"]
["2010-11-08","Sarah",147,"Sunshine"]
["2010-11-10","Julie",154,"Majestic Beaut"]
["2010-11-12","Tawnya",148,"Carlota"]
["2010-11-12","Marsha",116,"Carlota"]
["2010-11-12","Shegaw",185,"Sunshine"]
["2010-11-14","Maurice",116,"Majestic Beaut"]
["2010-11-15","Shegaw",127,"Sunset"]
["2010-11-17","Jean",129,"Carlota"]
["2010-11-17","Christine",125,"Sunset"]
["2010-11-18","Jessica",108,"Bellen"]
["2010-11-18","Jessica",166,"Carlota"]
["2010-11-18","Zemmia",120,"Sunshine"]
["2010-11-19","Wendy",152,"Carlota"]
["2010-11-19","Mykola",174,"Sunset"]
["2010-11-19","Jessica",104,"Sunshine"]
["2010-11-20","Alamzeb",191,"Majestic Beaut"]
["2010-11-20","Maurice",104,"Sunset"]
["2010-11-20","Zemmia",130,"Sunshine"]
["2010-11-21","Wendy",194,"Majestic Beaut"]
["2010-11-21","Julie",152,"Sunshine"]
["2010-11-22","Jean",121,"Bellen"]
["2010-11-22","Sreysros",189,"Carlota"]
["2010-11-22","Wendy",148,"Sunset"]
["2010-11-22","Marsha",118,"Sunshine"]
["2010-11-25","Julie",142,"Sunset"]
["2010-11-26","Julie",166,"Sunshine"]
["2010-11-26","Wendy",103,"Sunshine"]
["2010-11-27","Monique",188,"Carlota"]
["2010-11-27","Shegaw",137,"Majestic Beaut"]
["2010-11-27","Alamzeb",142,"Sunshine"]
["2010-11-30","Yishak",153,"Bellen"]
["2010-11-30","Jean",172,"Bellen"]
["2010-11-30","Zemmia",118,"Carlota"]
["2010-12-01","Shegaw",128,"Bellen"]
["2010-12-01","Sarah",174,"Carlota"]
["2010-12-01","Donna",131,"Carlota"]
["2010-12-01","Amburg",179,"Carlota"]
["2010-12-01","Tawnya",173,"Majestic Beaut"]
["2010-12-02","Monique",188,"Carlota"]
["2010-12-02","Tawnya",193,"Sunshine"]
["2010-12-04","Sreysros",143,"Carlota"]
["2010-12-04","Tawnya",187,"Sunset"]
["2010-12-04","Sarah",123,"Sunshine"]
["2010-12-05","Cynthia",157,"Bellen"]
["2010-12-05","Jessica",127,"Carlota"]
["2010-12-05","Wendy",144,"Majestic Beaut"]
["2010-12-06","Amburg",143,"Carlota"]
["2010-12-06","Christine",164,"Sunshine"]
["2010-12-07","Tawnya",131,"Majestic Beaut"]
["2010-12-07","Yishak",196,"Sunset"]
["2010-12-08","Zemmia",130,"Carlota"]
["2010-12-09","Cynthia",168,"Bellen"]
["2010-12-09","Monique",106,"Sunshine"]
["2010-12-10","Donna",161,"Majestic Beaut"]
["2010-12-10","Amburg",109,"Majestic Beaut"]
["2010-12-11","Monique",146,"Carlota"]
["2010-12-11","Sreysros",123,"Sunset"]
["2010-12-11","Zemmia",184,"Sunshine"]
["2010-12-11","Wendy",109,"Sunshine"]
["2010-12-11","Donna",167,"Sunshine"]
["2010-12-13","Tawnya",158,"Carlota"]
["2010-12-13","Dawn",187,"Carlota"]
["2010-12-13","Donna",119,"Majestic Beaut"]
["2010-12-14","Jessica",107,"Bellen"]
["2010-12-14","Dawn",144,"Carlota"]
["2010-12-14","Shegaw",173,"Carlota"]
["2010-12-15","Dawn",181,"Majestic Beaut"]
["2010-12-15","Julie",122,"Sunshine"]
["2010-12-17","Amburg",199,"Sunset"]
["2010-12-17","Jessica",156,"Sunshine"]
["2010-12-18","Julie",113,"Majestic Beaut"]
["2010-12-18","Shegaw",194,"Sunset"]
["2010-12-20","Shegaw",194,"Carlota"]
["2010-12-21","Mykola",109,"Bellen"]
["2010-12-21","Cynthia",151,"Majestic Beaut"]
["2010-12-21","Shegaw",153,"Majestic Beaut"]
["2010-12-22","Julie",123,"Sunshine"]
["2010-12-23","Zemmia",169,"Carlota"]
["2010-12-23","Zemmia",163,"Sunset"]
["2010-12-24","Marsha",107,"Carlota"]
["2010-12-24","Wendy",168,"Majestic Beaut"]
["2010-12-24","Sreysros",186,"Sunset"]
["2010-12-25","Dawn",145,"Majestic Beaut"]
["2010-12-25","Maurice",159,"Sunshine"]
["2010-12-26","Shegaw",141,"Bellen"]
["2010-12-26","Maurice",185,"Carlota"]
["2010-12-27","Mykola",177,"Sunshine"]
["2010-12-27","Yishak",177,"Sunshine"]
["2010-12-28","Amburg",199,"Sunshine"]
["2010-12-29","Dawn",175,"Bellen"]
["2010-12-29","Tawnya",149,"Sunset"]
["2010-12-30","Marsha",115,"Bellen"]
["2010-12-30","Shegaw",194,"Sunset"]
["2010-12-30","Wendy",172,"Sunshine"]
["2010-12-31","Shegaw",155,"Sunset"]
["2011-01-01","Amburg",157,"Bellen"]
["2011-01-01","Zemmia",153,"Sunset"]
["2011-01-02","Jessica",173,"Majestic Beaut"]
["2011-01-02","Jean",184,"Sunshine"]
["2011-01-03","Amburg",116,"Bellen"]
["2011-01-08","Maurice",168,"Sunshine"]
["2011-01-09","Cynthia",191,"Sunset"]
["2011-01-10","Marsha",114,"Carlota"]
["2011-01-11","Donna",114,"Carlota"]
["2011-01-11","Maurice",121,"Carlota"]
["2011-01-11","Sarah",149,"Majestic Beaut"]
["2011-01-12","Tawnya",152,"Sunset"]
["2011-01-12","Cynthia",121,"Sunset"]
["2011-01-12","Jean",109,"Sunset"]
["2011-01-13","Sarah",134,"Carlota"]
["2011-01-13","Mykola",114,"Sunset"]
["2011-01-13","Dawn",186,"Sunshine"]
["2011-01-14","Mykola",120,"Bellen"]
["2011-01-14","Maurice",139,"Carlota"]
["2011-01-14","Monique",104,"Sunset"]
["2011-01-15","Wendy",122,"Sunshine"]
["2011-01-18","Maurice",183,"Majestic Beaut"]
["2011-01-19","Dawn",199,"Carlota"]
["2011-01-19","Sreysros",199,"Sunshine"]
["2011-01-20","Jean",103,"Sunshine"]
["2011-01-21","Sarah",122,"Carlota"]
["2011-01-21","Dawn",156,"Majestic Beaut"]
["2011-01-22","Zemmia",132,"Bellen"]
["2011-01-22","Marsha",140,"Carlota"]
["2011-01-23","Shirley",189,"Sunset"]
["2011-01-24","Christine",162,"Carlota"]
["2011-01-25","Monique",121,"Sunshine"]
["2011-01-26","Julie",107,"Carlota"]
["2011-01-26","Marsha",177,"Sunshine"]
["2011-01-26","Donna",167,"Sunshine"]
["2011-01-27","Zemmia",162,"Majestic Beaut"]
["2011-01-28","Amburg",172,"Bellen"]
["2011-01-28","Marsha",177,"Carlota"]
["2011-01-28","Monique",199,"Carlota"]
["2011-01-28","Sreysros",182,"Carlota"]
["2011-01-28","Mykola",183,"Sunshine"]
["2011-01-29","Tawnya",146,"Sunset"]
["2011-01-30","Shegaw",179,"Carlota"]
["2011-01-31","Sarah",115,"Bellen"]
["2011-01-31","Alamzeb",199,"Carlota"]
["2011-01-31","Shegaw",117,"Sunset"]
["2011-01-31","Sarah",196,"Sunshine"]
["2011-01-31","Jessica",127,"Sunshine"]
["2011-02-01","Julie",110,"Carlota"]
["2011-02-01","Marsha",131,"Carlota"]
["2011-02-03","Julie",174,"Bellen"]
["2011-02-05","Dawn",146,"Bellen"]
["2011-02-05","Amburg",112,"Bellen"]
["2011-02-05","Christine",113,"Carlota"]
["2011-02-05","Christine",135,"Majestic Beaut"]
["2011-02-06","Dawn",111,"Bellen"]
["2011-02-06","Jessica",146,"Bellen"]
["2011-02-06","Amburg",194,"Carlota"]
["2011-02-07","Maurice",113,"Sunshine"]
["2011-02-09","Amburg",116,"Bellen"]
["2011-02-09","Wendy",138,"Sunshine"]
["2011-02-09","Monique",117,"Sunshine"]
["2011-02-11","Jessica",128,"Bellen"]
["2011-02-11","Monique",147,"Majestic Beaut"]
["2011-02-12","Christine",189,"Bellen"]
["2011-02-12","Yishak",186,"Majestic Beaut"]
["2011-02-12","Marsha",179,"Majestic Beaut"]
["2011-02-12","Christine",105,"Sunset"]
["2011-02-13","Donna",187,"Majestic Beaut"]
["2011-02-13","Dawn",186,"Sunshine"]
["2011-02-14","Maurice",154,"Bellen"]
["2011-02-14","Maurice",181,"Majestic Beaut"]
["2011-02-16","Wendy",154,"Sunset"]
["2011-02-17","Amburg",159,"Sunshine"]
["2011-02-18","Mykola",196,"Bellen"]
["2011-02-19","Jessica",103,"Sunshine"]
["2011-02-21","Dawn",136,"Sunset"]
["2011-02-21","Jean",102,"Sunshine"]
["2011-02-22","Wendy",197,"Carlota"]
["2011-02-24","Shegaw",158,"Carlota"]
["2011-02-26","Monique",151,"Majestic Beaut"]
["2011-03-02","Cynthia",162,"Bellen"]
["2011-03-02","Mykola",166,"Carlota"]
["2011-03-03","Dawn",120,"Bellen"]
["2011-03-03","Donna",143,"Sunset"]
["2011-03-03","Donna",141,"Sunshine"]
["2011-03-04","Yishak",199,"Bellen"]
["2011-03-04","Maurice",114,"Bellen"]
["2011-03-07","Dawn",144,"Carlota"]
["2011-03-09","Maurice",134,"Carlota"]
["2011-03-10","Shegaw",193,"Carlota"]
["2011-03-10","Shirley",168,"Majestic Beaut"]
["2011-03-10","Dawn",133,"Sunset"]
["2011-03-10","Mykola",187,"Sunshine"]
["2011-03-11","Donna",175,"Bellen"]
["2011-03-11","Monique",152,"Bellen"]
["2011-03-11","Zemmia",181,"Sunset"]
["2011-03-11","Shegaw",123,"Sunset"]
["2011-03-11","Monique",191,"Sunshine"]
["2011-03-12","Marsha",132,"Sunshine"]
["2011-03-12","Alamzeb",158,"Sunshine"]
["2011-03-13","Marsha",143,"Bellen"]
["2011-03-14","Maurice",182,"Bellen"]
["2011-03-14","Tawnya",145,"Bellen"]
["2011-03-14","Maurice",193,"Majestic Beaut"]
["2011-03-15","Amburg",137,"Sunshine"]
["2011-03-17","Shirley",186,"Bellen"]
["2011-03-17","Maurice",161,"Sunset"]
["2011-03-19","Marsha",109,"Majestic Beaut"]
["2011-03-20","Wendy",131,"Majestic Beaut"]
["2011-03-21","Shirley",133,"Bellen"]
["2011-03-24","Jessica",118,"Majestic Beaut"]
["2011-03-25","Tawnya",186,"Bellen"]
["2011-03-26","Cynthia",108,"Carlota"]
["2011-03-26","Shirley",109,"Majestic Beaut"]
["2011-03-26","Zemmia",184,"Majestic Beaut"]
["2011-03-27","Jessica",152,"Bellen"]
["2011-03-27","Sarah",181,"Majestic Beaut"]
["2011-03-27","Wendy",152,"Sunshine"]
["2011-03-28","Sreysros",175,"Majestic Beaut"]
["2011-03-29","Amburg",131,"Majestic Beaut"]
["2011-03-29","Marsha",112,"Sunset"]
["2011-03-29","Sarah",192,"Sunset"]
["2011-03-31","Jessica",111,"Bellen"]
["2011-03-31","Sreysros",104,"Carlota"]
["2011-03-31","Sarah",192,"Majestic Beaut"]
["2011-04-01","Amburg",189,"Bellen"]
["2011-04-02","Mykola",124,"Sunset"]
["2011-04-04","Sreysros",117,"Majestic Beaut"]
["2011-04-05","Shirley",104,"Bellen"]
["2011-04-05","Sarah",112,"Carlota"]
["2011-04-05","Monique",168,"Majestic Beaut"]
["2011-04-05","Cynthia",147,"Sunshine"]
["2011-04-07","Zemmia",170,"Sunset"]
["2011-04-07","Sarah",154,"Sunset"]
["2011-04-08","Jean",191,"Bellen"]
["2011-04-08","Tawnya",181,"Sunset"]
["2011-04-08","Jean",115,"Sunshine"]
["2011-04-13","Jessica",119,"Majestic Beaut"]
["2011-04-14","Shegaw",136,"Carlota"]
["2011-04-14","Alamzeb",145,"Sunset"]
["2011-04-16","Jean",143,"Bellen"]
["2011-04-16","Donna",153,"Sunshine"]
["2011-04-17","Mykola",152,"Bellen"]
["2011-04-17","Monique",133,"Bellen"]
["2011-04-17","Yishak",190,"Majestic Beaut"]
["2011-04-17","Marsha",152,"Sunshine"]
["2011-04-18","Monique",110,"Majestic Beaut"]
["2011-04-18","Maurice",177,"Sunset"]
["2011-04-19","Tawnya",123,"Majestic Beaut"]
["2011-04-19","Christine",129,"Sunset"]
["2011-04-19","Mykola",169,"Sunshine"]
["2011-04-20","Dawn",174,"Sunset"]
["2011-04-21","Maurice",129,"Sunset"]
["2011-04-22","Mykola",132,"Sunshine"]
["2011-04-23","Marsha",148,"Majestic Beaut"]
["2011-04-23","Donna",165,"Sunset"]
["2011-04-25","Shegaw",178,"Carlota"]
["2011-04-25","Zemmia",155,"Sunshine"]
["2011-04-26","Cynthia",172,"Bellen"]
["2011-04-26","Julie",112,"Carlota"]
["2011-04-26","Sreysros",180,"Sunset"]
["2011-04-26","Wendy",115,"Sunset"]
["2011-04-27","Maurice",190,"Majestic Beaut"]
["2011-04-28","Maurice",163,"Carlota"]
["2011-04-28","Jessica",106,"Carlota"]
["2011-04-28","Zemmia",115,"Majestic Beaut"]
["2011-04-28","Shirley",130,"Sunshine"]
["2011-05-01","Jean",139,"Carlota"]
["2011-05-01","Maurice",111,"Carlota"]
["2011-05-01","Alamzeb",157,"Sunshine"]
["2011-05-03","Shegaw",118,"Carlota"]
["2011-05-04","Mykola",118,"Carlota"]
["2011-05-04","Monique",126,"Sunset"]
["2011-05-04","Maurice",110,"Sunshine"]
["2011-05-04","Tawnya",173,"Sunshine"]
["2011-05-05","Tawnya",101,"Majestic Beaut"]
["2011-05-06","Cynthia",156,"Sunshine"]
["2011-05-07","Sarah",164,"Bellen"]
["2011-05-08","Jessica",160,"Carlota"]
["2011-05-09","Amburg",142,"Carlota"]
["2011-05-10","Sarah",144,"Bellen"]
["2011-05-10","Monique",145,"Sunshine"]
["2011-05-11","Zemmia",195,"Bellen"]
["2011-05-11","Dawn",166,"Carlota"]
["2011-05-11","Maurice",104,"Carlota"]
["2011-05-11","Jean",101,"Majestic Beaut"]
["2011-05-12","Jessica",182,"Majestic Beaut"]
["2011-05-12","Shirley",133,"Sunset"]
["2011-05-13","Jean",132,"Bellen"]
["2011-05-13","Marsha",158,"Majestic Beaut"]
["2011-05-14","Alamzeb",164,"Sunset"]
["2011-05-14","Zemmia",200,"Sunset"]
["2011-05-16","Jessica",113,"Carlota"]
["2011-05-16","Cynthia",106,"Sunshine"]
["2011-05-18","Alamzeb",175,"Bellen"]
["2011-05-18","Jean",115,"Carlota"]
["2011-05-19","Julie",144,"Bellen"]
["2011-05-20","Julie",175,"Majestic Beaut"]
["2011-05-22","Jessica",131,"Bellen"]
["2011-05-23","Mykola",152,"Carlota"]
["2011-05-24","Cynthia",110,"Carlota"]
["2011-05-24","Sarah",110,"Sunset"]
["2011-05-25","Alamzeb",178,"Sunset"]
["2011-05-26","Donna",103,"Majestic Beaut"]
["2011-05-26","Tawnya",113,"Sunset"]
["2011-05-26","Monique",181,"Sunset"]
["2011-05-26","Mykola",168,"Sunshine"]
["2011-05-26","Shirley",137,"Sunshine"]
["2011-05-27","Sarah",148,"Bellen"]
["2011-05-28","Sarah",200,"Carlota"]
["2011-05-28","Tawnya",140,"Majestic Beaut"]
["2011-05-29","Sreysros",113,"Bellen"]
["2011-05-29","Alamzeb",152,"Carlota"]
["2011-05-29","Donna",170,"Sunset"]
["2011-05-29","Tawnya",125,"Sunset"]
["2011-05-29","Monique",194,"Sunset"]
["2011-05-30","Shegaw",128,"Bellen"]
["2011-05-30","Maurice",191,"Carlota"]
["2011-05-31","Jean",157,"Sunset"]
["2011-06-02","Mykola",179,"Carlota"]
["2011-06-03","Mykola",197,"Bellen"]
["2011-06-03","Alamzeb",198,"Bellen"]
["2011-06-03","Tawnya",176,"Carlota"]
["2011-06-03","Shirley",199,"Sunshine"]
["2011-06-04","Jean",107,"Carlota"]
["2011-06-04","Monique",132,"Sunset"]
["2011-06-04","Julie",134,"Sunset"]
["2011-06-04","Mykola",191,"Sunshine"]
["2011-06-07","Wendy",119,"Sunshine"]
["2011-06-08","Jessica",147,"Sunshine"]
["2011-06-10","Maurice",166,"Majestic Beaut"]
["2011-06-10","Dawn",115,"Sunshine"]
["2011-06-12","Christine",132,"Bellen"]
["2011-06-12","Monique",148,"Bellen"]
["2011-06-12","Wendy",140,"Sunset"]
["2011-06-12","Yishak",114,"Sunset"]
["2011-06-12","Jessica",168,"Sunshine"]
["2011-06-13","Jessica",200,"Bellen"]
["2011-06-13","Sreysros",109,"Majestic Beaut"]
["2011-06-13","Maurice",102,"Sunset"]
["2011-06-14","Yishak",151,"Bellen"]
["2011-06-14","Marsha",160,"Majestic Beaut"]
["2011-06-14","Shirley",132,"Majestic Beaut"]
["2011-06-15","Christine",143,"Sunshine"]
["2011-06-16","Zemmia",114,"Carlota"]
["2011-06-18","Yishak",131,"Sunset"]
["2011-06-18","Amburg",197,"Sunshine"]
["2011-06-19","Shegaw",139,"Majestic Beaut"]
["2011-06-19","Wendy",124,"Sunshine"]
["2011-06-20","Dawn",174,"Bellen"]
["2011-06-20","Jean",196,"Sunshine"]
["2011-06-21","Julie",196,"Sunshine"]
["2011-06-21","Tawnya",175,"Sunshine"]
["2011-06-22","Monique",195,"Sunset"]
["2011-06-23","Maurice",108,"Carlota"]
["2011-06-24","Marsha",192,"Sunshine"]
["2011-06-25","Wendy",111,"Carlota"]
["2011-06-25","Shegaw",115,"Majestic Beaut"]
["2011-06-25","Tawnya",120,"Sunset"]
["2011-06-25","Jessica",175,"Sunshine"]
["2011-06-26","Yishak",104,"Carlota"]
["2011-06-27","Shirley",152,"Carlota"]
["2011-06-28","Alamzeb",131,"Carlota"]
["2011-06-28","Mykola",131,"Majestic Beaut"]
["2011-06-28","Jessica",133,"Sunshine"]
["2011-06-29","Jean",187,"Majestic Beaut"]
["2011-06-30","Cynthia",121,"Bellen"]
["2011-06-30","Shirley",200,"Sunshine"]
["2011-07-02","Zemmia",150,"Majestic Beaut"]
["2011-07-02","Mykola",152,"Sunset"]
["2011-07-03","Donna",128,"Bellen"]
["2011-07-03","Dawn",141,"Carlota"]
["2011-07-04","Zemmia",149,"Carlota"]
["2011-07-04","Tawnya",160,"Majestic Beaut"]
["2011-07-04","Jean",136,"Sunset"]
["2011-07-04","Dawn",112,"Sunshine"]
["2011-07-05","Donna",200,"Bellen"]
["2011-07-05","Tawnya",112,"Sunshine"]
["2011-07-06","Amburg",180,"Bellen"]
["2011-07-06","Dawn",140,"Carlota"]
["2011-07-07","Alamzeb",171,"Carlota"]
["2011-07-07","Tawnya",145,"Carlota"]
["2011-07-07","Donna",123,"Sunset"]
["2011-07-09","Mykola",193,"Majestic Beaut"]
["2011-07-10","Tawnya",113,"Bellen"]
["2011-07-10","Dawn",165,"Carlota"]
["2011-07-10","Marsha",178,"Majestic Beaut"]
["2011-07-10","Cynthia",142,"Majestic Beaut"]
["2011-07-10","Yishak",141,"Sunset"]
["2011-07-10","Shirley",154,"Sunset"]
["2011-07-11","Zemmia",140,"Majestic Beaut"]
["2011-07-11","Maurice",180,"Sunset"]
["2011-07-12","Shegaw",191,"Bellen"]
["2011-07-12","Alamzeb",141,"Sunshine"]
["2011-07-13","Jessica",145,"Majestic Beaut"]
["2011-07-13","Dawn",140,"Sunshine"]
["2011-07-13","Dawn",151,"Sunshine"]
["2011-07-14","Cynthia",144,"Carlota"]
["2011-07-15","Christine",185,"Sunset"]
["2011-07-16","Donna",152,"Bellen"]
["2011-07-16","Donna",182,"Majestic Beaut"]
["2011-07-16","Julie",152,"Majestic Beaut"]
["2011-07-16","Cynthia",127,"Sunset"]
["2011-07-16","Jean",183,"Sunshine"]
["2011-07-17","Dawn",149,"Carlota"]
["2011-07-18","Dawn",149,"Sunset"]
["2011-07-19","Mykola",197,"Carlota"]
["2011-07-21","Julie",110,"Sunshine"]
["2011-07-21","Sarah",112,"Sunshine"]
["2011-07-22","Mykola",114,"Carlota"]
["2011-07-22","Cynthia",193,"Sunset"]
["2011-07-24","Wendy",167,"Bellen"]
["2011-07-24","Christine",174,"Bellen"]

{"sheet":"780","index":2,"n_rows":9,"n_cols":13,"rows_kept":9,"cut":false,"hidden":false,"merged":[]}
["Sheet Names",null,"Crtieria",null,null,null,null,null,null,null,null,null,"IDs"]
["Jan",null,"ID101",null,null,null,null,null,null,null,null,null,"ID100"]
["Feb",null,"TOTAL",null,null,null,null,null,null,null,null,null,"ID101"]
["Mar",null,null,null,null,{"$f":"SUMIF(Jan:Mar!A2:A11,C2,Jan:Mar!B2:B11)","v":{"$error":"#VALUE!"}},null,null,null,null,null,null,"ID102"]
[null,null,"TOTAL"]
[null,null,null,null,"Reference Globally"]
[]
["jeffreybrown at Mr Excel Message Board"]
["http://www.mrexcel.com/forum/showthread.php?t=549723"]

{"sheet":"Jan","index":3,"n_rows":11,"n_cols":6,"rows_kept":11,"cut":false,"hidden":false,"merged":[]}
["ID","Units",null,"SUM"]
["ID102",3,null,null,null,"Calculate Locally"]
["ID100",3]
["ID102",1]
["ID102",4]
["ID101",5]
["ID102",10]
["ID100",5]
["ID100",8]
["ID101",3]
["ID101",1]

{"sheet":"Feb","index":4,"n_rows":11,"n_cols":4,"rows_kept":11,"cut":false,"hidden":false,"merged":[]}
["ID","Units",null,"SUM"]
["ID101",8]
["ID100",7]
["ID102",4]
["ID101",8]
["ID102",6]
["ID101",10]
["ID101",4]
["ID102",10]
["ID102",10]
["ID102",2]

{"sheet":"Mar","index":5,"n_rows":11,"n_cols":4,"rows_kept":11,"cut":false,"hidden":false,"merged":[]}
["ID","Units",null,"SUM"]
["ID101",3]
["ID102",7]
["ID102",5]
["ID102",6]
["ID100",7]
["ID100",6]
["ID100",1]
["ID100",1]
["ID101",2]
["ID102",5]

{"sheet":"780an","index":6,"n_rows":9,"n_cols":13,"rows_kept":9,"cut":false,"hidden":false,"merged":[]}
["Sheet Names",null,"Crtieria",null,null,null,null,null,null,null,null,null,"IDs"]
["Jan",null,"ID101",null,null,null,null,null,null,null,null,null,"ID100"]
["Feb",null,"TOTAL",null,null,null,null,null,null,null,null,null,"ID101"]
["Mar",null,{"$f":"SUMPRODUCT(SUMIF(INDIRECT(\"'\"&A2:A4&\"'!A2:A11\"),C2,INDIRECT(\"'\"&A2:A4&\"'!B2:B11\")))","v":44},null,null,null,null,null,null,null,null,null,"ID102"]
[null,null,"TOTAL"]
[null,null,{"$f":"SUM('Jan (2):Mar (2)'!D2)","v":44},null,"Reference Globally"]
[]
["jeffreybrown at Mr Excel Message Board"]
["http://www.mrexcel.com/forum/showthread.php?t=549723"]

{"sheet":"Jan (2)","index":7,"n_rows":11,"n_cols":6,"rows_kept":11,"cut":false,"hidden":false,"merged":[]}
["ID","Units",null,"SUM"]
["ID102",3,null,{"$f":"SUMIF(A2:A11,'780an'!C2,B2:B11)","v":9},null,"Calculate Locally"]
["ID100",3]
["ID102",1]
["ID102",4]
["ID101",5]
["ID102",10]
["ID100",5]
["ID100",8]
["ID101",3]
["ID101",1]

{"sheet":"Feb (2)","index":8,"n_rows":11,"n_cols":4,"rows_kept":11,"cut":false,"hidden":false,"merged":[]}
["ID","Units",null,"SUM"]
["ID101",8,null,{"$f":"SUMIF(A2:A11,'780an'!C2,B2:B11)","v":30}]
["ID100",7]
["ID102",4]
["ID101",8]
["ID102",6]
["ID101",10]
["ID101",4]
["ID102",10]
["ID102",10]
["ID102",2]

{"sheet":"Mar (2)","index":9,"n_rows":11,"n_cols":4,"rows_kept":11,"cut":false,"hidden":false,"merged":[]}
["ID","Units",null,"SUM"]
["ID101",3,null,{"$f":"SUMIF(A2:A11,'780an'!C2,B2:B11)","v":5}]
["ID102",7]
["ID102",5]
["ID102",6]
["ID100",7]
["ID100",6]
["ID100",1]
["ID100",1]
["ID101",2]
["ID102",5]

{"sheet":"781","index":10,"n_rows":24,"n_cols":8,"rows_kept":24,"cut":false,"hidden":false,"merged":[]}
["Property","Section","Month","Value"]
["Property1","section2","Feb"]
[]
[null,null,"Month"]
["Property","Section","Jan","Feb","Mar","Apr","May","Jun"]
["Property1","section1",199,633,718,124,399,236]
["Property1","section2",703,336,132,848,817,326]
["Property1","section3",787,131,716,351,685,802]
["Property1","section4",195,685,105,379,701,752]
["Property1","section5",505,436,888,673,419,516]
["Property1","section6",158,264,690,320,276,578]
["Property2","section11",625,193,830,139,389,180]
["Property2","sectionAA",165,177,365,129,492,515]
["Property2","section13",216,335,561,354,403,273]
["Property2","sectionT",587,121,538,632,230,350]
["Property2","sectionL",199,350,351,152,574,168]
["Property2","sectionPK",156,784,584,197,278,498]
[]
[]
[]
[]
[]
["Property1"]
["Property2"]

{"sheet":"781an","index":11,"n_rows":24,"n_cols":8,"rows_kept":24,"cut":false,"hidden":false,"merged":[]}
["Property","Section","Month","Value"]
["Property1","section2","Apr",{"$f":"IFERROR(INDEX(C6:H17,MATCH(A2&B2,A6:A17&B6:B17,0),MATCH(C2,C5:H5,0)),\"\")","v":848}]
[]
[null,null,"Month"]
["Property","Section","Jan","Feb","Mar","Apr","May","Jun"]
["Property1","section1",199,633,718,124,399,236]
["Property1","section2",703,336,132,848,817,326]
["Property1","section3",787,131,716,351,685,802]
["Property1","section4",195,685,105,379,701,752]
["Property1","section5",505,436,888,673,419,516]
["Property1","section6",158,264,690,320,276,578]
["Property2","section11",625,193,830,139,389,180]
["Property2","sectionAA",165,177,365,129,492,515]
["Property2","section13",216,335,561,354,403,273]
["Property2","sectionT",587,121,538,632,230,350]
["Property2","sectionL",199,350,351,152,574,168]
["Property2","sectionPK",156,784,584,197,278,498]
[]
[]
[]
[]
[]
["Property1"]
["Property2"]

{"sheet":"782","index":12,"n_rows":10001,"n_cols":4,"rows_kept":10001,"cut":false,"hidden":false,"merged":[]}
["value","T/F?",null,"Find any number with 4, 2, 3"]
[40000,null,null,"Examples: 42300, 49923, 40203, 43323"]
[40001]
[40002,null,null,"Count"]
[40003]
[40004]
[40005]
[40006]
[40007]
[40008]
[40009]
[40010]
[40011]
[40012]
[40013]
[40014]
[40015]
[40016]
[40017]
[40018]
[40019]
[40020]
[40021]
[40022]
[40023]
[40024]
[40025]
[40026]
[40027]
[40028]
[40029]
[40030]
[40031]
[40032]
[40033]
[40034]
[40035]
[40036]
[40037]
[40038]
[40039]
[40040]
[40041]
[40042]
[40043]
[40044]
[40045]
[40046]
[40047]
[40048]
[40049]
[40050]
[40051]
[40052]
[40053]
[40054]
[40055]
[40056]
[40057]
[40058]
[40059]
[40060]
[40061]
[40062]
[40063]
[40064]
[40065]
[40066]
[40067]
[40068]
[40069]
[40070]
[40071]
[40072]
[40073]
[40074]
[40075]
[40076]
[40077]
[40078]
[40079]
[40080]
[40081]
[40082]
[40083]
[40084]
[40085]
[40086]
[40087]
[40088]
[40089]
[40090]
[40091]
[40092]
[40093]
[40094]
[40095]
[40096]
[40097]
[40098]
[40099]
[40100]
[40101]
[40102]
[40103]
[40104]
[40105]
[40106]
[40107]
[40108]
[40109]
[40110]
[40111]
[40112]
[40113]
[40114]
[40115]
[40116]
[40117]
[40118]
[40119]
[40120]
[40121]
[40122]
[40123]
[40124]
[40125]
[40126]
[40127]
[40128]
[40129]
[40130]
[40131]
[40132]
[40133]
[40134]
[40135]
[40136]
[40137]
[40138]
[40139]
[40140]
[40141]
[40142]
[40143]
[40144]
[40145]
[40146]
[40147]
[40148]
[40149]
[40150]
[40151]
[40152]
[40153]
[40154]
[40155]
[40156]
[40157]
[40158]
[40159]
[40160]
[40161]
[40162]
[40163]
[40164]
[40165]
[40166]
[40167]
[40168]
[40169]
[40170]
[40171]
[40172]
[40173]
[40174]
[40175]
[40176]
[40177]
[40178]
[40179]
[40180]
[40181]
[40182]
[40183]
[40184]
[40185]
[40186]
[40187]
[40188]
[40189]
[40190]
[40191]
[40192]
[40193]
[40194]
[40195]
[40196]
[40197]
[40198]
[40199]
[40200]
[40201]
[40202]
[40203]
[40204]
[40205]
[40206]
[40207]
[40208]
[40209]
[40210]
[40211]
[40212]
[40213]
[40214]
[40215]
[40216]
[40217]
[40218]
[40219]
[40220]
[40221]
[40222]
[40223]
[40224]
[40225]
[40226]
[40227]
[40228]
[40229]
[40230]
[40231]
[40232]
[40233]
[40234]
[40235]
[40236]
[40237]
[40238]
[40239]
[40240]
[40241]
[40242]
[40243]
[40244]
[40245]
[40246]
[40247]
[40248]
[40249]
[40250]
[40251]
[40252]
[40253]
[40254]
[40255]
[40256]
[40257]
[40258]
[40259]
[40260]
[40261]
[40262]
[40263]
[40264]
[40265]
[40266]
[40267]
[40268]
[40269]
[40270]
[40271]
[40272]
[40273]
[40274]
[40275]
[40276]
[40277]
[40278]
[40279]
[40280]
[40281]
[40282]
[40283]
[40284]
[40285]
[40286]
[40287]
[40288]
[40289]
[40290]
[40291]
[40292]
[40293]
[40294]
[40295]
[40296]
[40297]
[40298]
[40299]
[40300]
[40301]
[40302]
[40303]
[40304]
[40305]
[40306]
[40307]
[40308]
[40309]
[40310]
[40311]
[40312]
[40313]
[40314]
[40315]
[40316]
[40317]
[40318]
[40319]
[40320]
[40321]
[40322]
[40323]
[40324]
[40325]
[40326]
[40327]
[40328]
[40329]
[40330]
[40331]
[40332]
[40333]
[40334]
[40335]
[40336]
[40337]
[40338]
[40339]
[40340]
[40341]
[40342]
[40343]
[40344]
[40345]
[40346]
[40347]
[40348]
[40349]
[40350]
[40351]
[40352]
[40353]
[40354]
[40355]
[40356]
[40357]
[40358]
[40359]
[40360]
[40361]
[40362]
[40363]
[40364]
[40365]
[40366]
[40367]
[40368]
[40369]
[40370]
[40371]
[40372]
[40373]
[40374]
[40375]
[40376]
[40377]
[40378]
[40379]
[40380]
[40381]
[40382]
[40383]
[40384]
[40385]
[40386]
[40387]
[40388]
[40389]
[40390]
[40391]
[40392]
[40393]
[40394]
[40395]
[40396]
[40397]
[40398]
[40399]
[40400]
[40401]
[40402]
[40403]
[40404]
[40405]
[40406]
[40407]
[40408]
[40409]
[40410]
[40411]
[40412]
[40413]
[40414]
[40415]
[40416]
[40417]
[40418]
[40419]
[40420]
[40421]
[40422]
[40423]
[40424]
[40425]
[40426]
[40427]
[40428]
[40429]
[40430]
[40431]
[40432]
[40433]
[40434]
[40435]
[40436]
[40437]
[40438]
[40439]
[40440]
[40441]
[40442]
[40443]
[40444]
[40445]
[40446]
[40447]
[40448]
[40449]
[40450]
[40451]
[40452]
[40453]
[40454]
[40455]
[40456]
[40457]
[40458]
[40459]
[40460]
[40461]
[40462]
[40463]
[40464]
[40465]
[40466]
[40467]
[40468]
[40469]
[40470]
[40471]
[40472]
[40473]
[40474]
[40475]
[40476]
[40477]
[40478]
[40479]
[40480]
[40481]
[40482]
[40483]
[40484]
[40485]
[40486]
[40487]
[40488]
[40489]
[40490]
[40491]
[40492]
[40493]
[40494]
[40495]
[40496]
[40497]
[40498]
[40499]
[40500]
[40501]
[40502]
[40503]
[40504]
[40505]
[40506]
[40507]
[40508]
[40509]
[40510]
[40511]
[40512]
[40513]
[40514]
[40515]
[40516]
[40517]
[40518]
[40519]
[40520]
[40521]
[40522]
[40523]
[40524]
[40525]
[40526]
[40527]
[40528]
[40529]
[40530]
[40531]
[40532]
[40533]
[40534]
[40535]
[40536]
[40537]
[40538]
[40539]
[40540]
[40541]
[40542]
[40543]
[40544]
[40545]
[40546]
[40547]
[40548]
[40549]
[40550]
[40551]
[40552]
[40553]
[40554]
[40555]
[40556]
[40557]
[40558]
[40559]
[40560]
[40561]
[40562]
[40563]
[40564]
[40565]
[40566]
[40567]
[40568]
[40569]
[40570]
[40571]
[40572]
[40573]
[40574]
[40575]
[40576]
[40577]
[40578]
[40579]
[40580]
[40581]
[40582]
[40583]
[40584]
[40585]
[40586]
[40587]
[40588]
[40589]
[40590]
[40591]
[40592]
[40593]
[40594]
[40595]
[40596]
[40597]
[40598]
[40599]
[40600]
[40601]
[40602]
[40603]
[40604]
[40605]
[40606]
[40607]
[40608]
[40609]
[40610]
[40611]
[40612]
[40613]
[40614]
[40615]
[40616]
[40617]
[40618]
[40619]
[40620]
[40621]
[40622]
[40623]
[40624]
[40625]
[40626]
[40627]
[40628]
[40629]
[40630]
[40631]
[40632]
[40633]
[40634]
[40635]
[40636]
[40637]
[40638]
[40639]
[40640]
[40641]
[40642]
[40643]
[40644]
[40645]
[40646]
[40647]
[40648]
[40649]
[40650]
[40651]
[40652]
[40653]
[40654]
[40655]
[40656]
[40657]
[40658]
[40659]
[40660]
[40661]
[40662]
[40663]
[40664]
[40665]
[40666]
[40667]
[40668]
[40669]
[40670]
[40671]
[40672]
[40673]
[40674]
[40675]
[40676]
[40677]
[40678]
[40679]
[40680]
[40681]
[40682]
[40683]
[40684]
[40685]
[40686]
[40687]
[40688]
[40689]
[40690]
[40691]
[40692]
[40693]
[40694]
[40695]
[40696]
[40697]
[40698]
[40699]
[40700]
[40701]
[40702]
[40703]
[40704]
[40705]
[40706]
[40707]
[40708]
[40709]
[40710]
[40711]
[40712]
[40713]
[40714]
[40715]
[40716]
[40717]
[40718]
[40719]
[40720]
[40721]
[40722]
[40723]
[40724]
[40725]
[40726]
[40727]
[40728]
[40729]
[40730]
[40731]
[40732]
[40733]
[40734]
[40735]
[40736]
[40737]
[40738]
[40739]
[40740]
[40741]
[40742]
[40743]
[40744]
[40745]
[40746]
[40747]
[40748]
[40749]
[40750]
[40751]
[40752]
[40753]
[40754]
[40755]
[40756]
[40757]
[40758]
[40759]
[40760]
[40761]
[40762]
[40763]
[40764]
[40765]
[40766]
[40767]
[40768]
[40769]
[40770]
[40771]
[40772]
[40773]
[40774]
[40775]
[40776]
[40777]
[40778]
[40779]
[40780]
[40781]
[40782]
[40783]
[40784]
[40785]
[40786]
[40787]
[40788]
[40789]
[40790]
[40791]
[40792]
[40793]
[40794]
[40795]
[40796]
[40797]
[40798]
[40799]
[40800]
[40801]
[40802]
[40803]
[40804]
[40805]
[40806]
[40807]
[40808]
[40809]
[40810]
[40811]
[40812]
[40813]
[40814]
[40815]
[40816]
[40817]
[40818]
[40819]
[40820]
[40821]
[40822]
[40823]
[40824]
[40825]
[40826]
[40827]
[40828]
[40829]
[40830]
[40831]
[40832]
[40833]
[40834]
[40835]
[40836]
[40837]
[40838]
[40839]
[40840]
[40841]
[40842]
[40843]
[40844]
[40845]
[40846]
[40847]
[40848]
[40849]
[40850]
[40851]
[40852]
[40853]
[40854]
[40855]
[40856]
[40857]
[40858]
[40859]
[40860]
[40861]
[40862]
[40863]
[40864]
[40865]
[40866]
[40867]
[40868]
[40869]
[40870]
[40871]
[40872]
[40873]
[40874]
[40875]
[40876]
[40877]
[40878]
[40879]
[40880]
[40881]
[40882]
[40883]
[40884]
[40885]
[40886]
[40887]
[40888]
[40889]
[40890]
[40891]
[40892]
[40893]
[40894]
[40895]
[40896]
[40897]
[40898]
[40899]
[40900]
[40901]
[40902]
[40903]
[40904]
[40905]
[40906]
[40907]
[40908]
[40909]
[40910]
[40911]
[40912]
[40913]
[40914]
[40915]
[40916]
[40917]
[40918]
[40919]
[40920]
[40921]
[40922]
[40923]
[40924]
[40925]
[40926]
[40927]
[40928]
[40929]
[40930]
[40931]
[40932]
[40933]
[40934]
[40935]
[40936]
[40937]
[40938]
[40939]
[40940]
[40941]
[40942]
[40943]
[40944]
[40945]
[40946]
[40947]
[40948]
[40949]
[40950]
[40951]
[40952]
[40953]
[40954]
[40955]
[40956]
[40957]
[40958]
[40959]
[40960]
[40961]
[40962]
[40963]
[40964]
[40965]
[40966]
[40967]
[40968]
[40969]
[40970]
[40971]
[40972]
[40973]
[40974]
[40975]
[40976]
[40977]
[40978]
[40979]
[40980]
[40981]
[40982]
[40983]
[40984]
[40985]
[40986]
[40987]
[40988]
[40989]
[40990]
[40991]
[40992]
[40993]
[40994]
[40995]
[40996]
[40997]
[40998]
[40999]
[41000]
[41001]
[41002]
[41003]
[41004]
[41005]
[41006]
[41007]
[41008]
[41009]
[41010]
[41011]
[41012]
[41013]
[41014]
[41015]
[41016]
[41017]
[41018]
[41019]
[41020]
[41021]
[41022]
[41023]
[41024]
[41025]
[41026]
[41027]
[41028]
[41029]
[41030]
[41031]
[41032]
[41033]
[41034]
[41035]
[41036]
[41037]
[41038]
[41039]
[41040]
[41041]
[41042]
[41043]
[41044]
[41045]
[41046]
[41047]
[41048]
[41049]
[41050]
[41051]
[41052]
[41053]
[41054]
[41055]
[41056]
[41057]
[41058]
[41059]
[41060]
[41061]
[41062]
[41063]
[41064]
[41065]
[41066]
[41067]
[41068]
[41069]
[41070]
[41071]
[41072]
[41073]
[41074]
[41075]
[41076]
[41077]
[41078]
[41079]
[41080]
[41081]
[41082]
[41083]
[41084]
[41085]
[41086]
[41087]
[41088]
[41089]
[41090]
[41091]
[41092]
[41093]
[41094]
[41095]
[41096]
[41097]
[41098]
[41099]
[41100]
[41101]
[41102]
[41103]
[41104]
[41105]
[41106]
[41107]
[41108]
[41109]
[41110]
[41111]
[41112]
[41113]
[41114]
[41115]
[41116]
[41117]
[41118]
[41119]
[41120]
[41121]
[41122]
[41123]
[41124]
[41125]
[41126]
[41127]
[41128]
[41129]
[41130]
[41131]
[41132]
[41133]
[41134]
[41135]
[41136]
[41137]
[41138]
[41139]
[41140]
[41141]
[41142]
[41143]
[41144]
[41145]
[41146]
[41147]
[41148]
[41149]
[41150]
[41151]
[41152]
[41153]
[41154]
[41155]
[41156]
[41157]
[41158]
[41159]
[41160]
[41161]
[41162]
[41163]
[41164]
[41165]
[41166]
[41167]
[41168]
[41169]
[41170]
[41171]
[41172]
[41173]
[41174]
[41175]
[41176]
[41177]
[41178]
[41179]
[41180]
[41181]
[41182]
[41183]
[41184]
[41185]
[41186]
[41187]
[41188]
[41189]
[41190]
[41191]
[41192]
[41193]
[41194]
[41195]
[41196]
[41197]
[41198]
[41199]
[41200]
[41201]
[41202]
[41203]
[41204]
[41205]
[41206]
[41207]
[41208]
[41209]
[41210]
[41211]
[41212]
[41213]
[41214]
[41215]
[41216]
[41217]
[41218]
[41219]
[41220]
[41221]
[41222]
[41223]
[41224]
[41225]
[41226]
[41227]
[41228]
[41229]
[41230]
[41231]
[41232]
[41233]
[41234]
[41235]
[41236]
[41237]
[41238]
[41239]
[41240]
[41241]
[41242]
[41243]
[41244]
[41245]
[41246]
[41247]
[41248]
[41249]
[41250]
[41251]
[41252]
[41253]
[41254]
[41255]
[41256]
[41257]
[41258]
[41259]
[41260]
[41261]
[41262]
[41263]
[41264]
[41265]
[41266]
[41267]
[41268]
[41269]
[41270]
[41271]
[41272]
[41273]
[41274]
[41275]
[41276]
[41277]
[41278]
[41279]
[41280]
[41281]
[41282]
[41283]
[41284]
[41285]
[41286]
[41287]
[41288]
[41289]
[41290]
[41291]
[41292]
[41293]
[41294]
[41295]
[41296]
[41297]
[41298]
[41299]
[41300]
[41301]
[41302]
[41303]
[41304]
[41305]
[41306]
[41307]
[41308]
[41309]
[41310]
[41311]
[41312]
[41313]
[41314]
[41315]
[41316]
[41317]
[41318]
[41319]
[41320]
[41321]
[41322]
[41323]
[41324]
[41325]
[41326]
[41327]
[41328]
[41329]
[41330]
[41331]
[41332]
[41333]
[41334]
[41335]
[41336]
[41337]
[41338]
[41339]
[41340]
[41341]
[41342]
[41343]
[41344]
[41345]
[41346]
[41347]
[41348]
[41349]
[41350]
[41351]
[41352]
[41353]
[41354]
[41355]
[41356]
[41357]
[41358]
[41359]
[41360]
[41361]
[41362]
[41363]
[41364]
[41365]
[41366]
[41367]
[41368]
[41369]
[41370]
[41371]
[41372]
[41373]
[41374]
[41375]
[41376]
[41377]
[41378]
[41379]
[41380]
[41381]
[41382]
[41383]
[41384]
[41385]
[41386]
[41387]
[41388]
[41389]
[41390]
[41391]
[41392]
[41393]
[41394]
[41395]
[41396]
[41397]
[41398]
[41399]
[41400]
[41401]
[41402]
[41403]
[41404]
[41405]
[41406]
[41407]
[41408]
[41409]
[41410]
[41411]
[41412]
[41413]
[41414]
[41415]
[41416]
[41417]
[41418]
[41419]
[41420]
[41421]
[41422]
[41423]
[41424]
[41425]
[41426]
[41427]
[41428]
[41429]
[41430]
[41431]
[41432]
[41433]
[41434]
[41435]
[41436]
[41437]
[41438]
[41439]
[41440]
[41441]
[41442]
[41443]
[41444]
[41445]
[41446]
[41447]
[41448]
[41449]
[41450]
[41451]
[41452]
[41453]
[41454]
[41455]
[41456]
[41457]
[41458]
[41459]
[41460]
[41461]
[41462]
[41463]
[41464]
[41465]
[41466]
[41467]
[41468]
[41469]
[41470]
[41471]
[41472]
[41473]
[41474]
[41475]
[41476]
[41477]
[41478]
[41479]
[41480]
[41481]
[41482]
[41483]
[41484]
[41485]
[41486]
[41487]
[41488]
[41489]
[41490]
[41491]
[41492]
[41493]
[41494]
[41495]
[41496]
[41497]
[41498]
[41499]
[41500]
[41501]
[41502]
[41503]
[41504]
[41505]
[41506]
[41507]
[41508]
[41509]
[41510]
[41511]
[41512]
[41513]
[41514]
[41515]
[41516]
[41517]
[41518]
[41519]
[41520]
[41521]
[41522]
[41523]
[41524]
[41525]
[41526]
[41527]
[41528]
[41529]
[41530]
[41531]
[41532]
[41533]
[41534]
[41535]
[41536]
[41537]
[41538]
[41539]
[41540]
[41541]
[41542]
[41543]
[41544]
[41545]
[41546]
[41547]
[41548]
[41549]
[41550]
[41551]
[41552]
[41553]
[41554]
[41555]
[41556]
[41557]
[41558]
[41559]
[41560]
[41561]
[41562]
[41563]
[41564]
[41565]
[41566]
[41567]
[41568]
[41569]
[41570]
[41571]
[41572]
[41573]
[41574]
[41575]
[41576]
[41577]
[41578]
[41579]
[41580]
[41581]
[41582]
[41583]
[41584]
[41585]
[41586]
[41587]
[41588]
[41589]
[41590]
[41591]
[41592]
[41593]
[41594]
[41595]
[41596]
[41597]
[41598]
[41599]
[41600]
[41601]
[41602]
[41603]
[41604]
[41605]
[41606]
[41607]
[41608]
[41609]
[41610]
[41611]
[41612]
[41613]
[41614]
[41615]
[41616]
[41617]
[41618]
[41619]
[41620]
[41621]
[41622]
[41623]
[41624]
[41625]
[41626]
[41627]
[41628]
[41629]
[41630]
[41631]
[41632]
[41633]
[41634]
[41635]
[41636]
[41637]
[41638]
[41639]
[41640]
[41641]
[41642]
[41643]
[41644]
[41645]
[41646]
[41647]
[41648]
[41649]
[41650]
[41651]
[41652]
[41653]
[41654]
[41655]
[41656]
[41657]
[41658]
[41659]
[41660]
[41661]
[41662]
[41663]
[41664]
[41665]
[41666]
[41667]
[41668]
[41669]
[41670]
[41671]
[41672]
[41673]
[41674]
[41675]
[41676]
[41677]
[41678]
[41679]
[41680]
[41681]
[41682]
[41683]
[41684]
[41685]
[41686]
[41687]
[41688]
[41689]
[41690]
[41691]
[41692]
[41693]
[41694]
[41695]
[41696]
[41697]
[41698]
[41699]
[41700]
[41701]
[41702]
[41703]
[41704]
[41705]
[41706]
[41707]
[41708]
[41709]
[41710]
[41711]
[41712]
[41713]
[41714]
[41715]
[41716]
[41717]
[41718]
[41719]
[41720]
[41721]
[41722]
[41723]
[41724]
[41725]
[41726]
[41727]
[41728]
[41729]
[41730]
[41731]
[41732]
[41733]
[41734]
[41735]
[41736]
[41737]
[41738]
[41739]
[41740]
[41741]
[41742]
[41743]
[41744]
[41745]
[41746]
[41747]
[41748]
[41749]
[41750]
[41751]
[41752]
[41753]
[41754]
[41755]
[41756]
[41757]
[41758]
[41759]
[41760]
[41761]
[41762]
[41763]
[41764]
[41765]
[41766]
[41767]
[41768]
[41769]
[41770]
[41771]
[41772]
[41773]
[41774]
[41775]
[41776]
[41777]
[41778]
[41779]
[41780]
[41781]
[41782]
[41783]
[41784]
[41785]
[41786]
[41787]
[41788]
[41789]
[41790]
[41791]
[41792]
[41793]
[41794]
[41795]
[41796]
[41797]
[41798]
[41799]
[41800]
[41801]
[41802]
[41803]
[41804]
[41805]
[41806]
[41807]
[41808]
[41809]
[41810]
[41811]
[41812]
[41813]
[41814]
[41815]
[41816]
[41817]
[41818]
[41819]
[41820]
[41821]
[41822]
[41823]
[41824]
[41825]
[41826]
[41827]
[41828]
[41829]
[41830]
[41831]
[41832]
[41833]
[41834]
[41835]
[41836]
[41837]
[41838]
[41839]
[41840]
[41841]
[41842]
[41843]
[41844]
[41845]
[41846]
[41847]
[41848]
[41849]
[41850]
[41851]
[41852]
[41853]
[41854]
[41855]
[41856]
[41857]
[41858]
[41859]
[41860]
[41861]
[41862]
[41863]
[41864]
[41865]
[41866]
[41867]
[41868]
[41869]
[41870]
[41871]
[41872]
[41873]
[41874]
[41875]
[41876]
[41877]
[41878]
[41879]
[41880]
[41881]
[41882]
[41883]
[41884]
[41885]
[41886]
[41887]
[41888]
[41889]
[41890]
[41891]
[41892]
[41893]
[41894]
[41895]
[41896]
[41897]
[41898]
[41899]
[41900]
[41901]
[41902]
[41903]
[41904]
[41905]
[41906]
[41907]
[41908]
[41909]
[41910]
[41911]
[41912]
[41913]
[41914]
[41915]
[41916]
[41917]
[41918]
[41919]
[41920]
[41921]
[41922]
[41923]
[41924]
[41925]
[41926]
[41927]
[41928]
[41929]
[41930]
[41931]
[41932]
[41933]
[41934]
[41935]
[41936]
[41937]
[41938]
[41939]
[41940]
[41941]
[41942]
[41943]
[41944]
[41945]
[41946]
[41947]
[41948]
[41949]
[41950]
[41951]
[41952]
[41953]
[41954]
[41955]
[41956]
[41957]
[41958]
[41959]
[41960]
[41961]
[41962]
[41963]
[41964]
[41965]
[41966]
[41967]
[41968]
[41969]
[41970]
[41971]
[41972]
[41973]
[41974]
[41975]
[41976]
[41977]
[41978]
[41979]
[41980]
[41981]
[41982]
[41983]
[41984]
[41985]
[41986]
[41987]
[41988]
[41989]
[41990]
[41991]
[41992]
[41993]
[41994]
[41995]
[41996]
[41997]
[41998]
[41999]
[42000]
[42001]
[42002]
[42003]
[42004]
[42005]
[42006]
[42007]
[42008]
[42009]
[42010]
[42011]
[42012]
[42013]
[42014]
[42015]
[42016]
[42017]
[42018]
[42019]
[42020]
[42021]
[42022]
[42023]
[42024]
[42025]
[42026]
[42027]
[42028]
[42029]
[42030]
[42031]
[42032]
[42033]
[42034]
[42035]
[42036]
[42037]
[42038]
[42039]
[42040]
[42041]
[42042]
[42043]
[42044]
[42045]
[42046]
[42047]
[42048]
[42049]
[42050]
[42051]
[42052]
[42053]
[42054]
[42055]
[42056]
[42057]
[42058]
[42059]
[42060]
[42061]
[42062]
[42063]
[42064]
[42065]
[42066]
[42067]
[42068]
[42069]
[42070]
[42071]
[42072]
[42073]
[42074]
[42075]
[42076]
[42077]
[42078]
[42079]
[42080]
[42081]
[42082]
[42083]
[42084]
[42085]
[42086]
[42087]
[42088]
[42089]
[42090]
[42091]
[42092]
[42093]
[42094]
[42095]
[42096]
[42097]
[42098]
[42099]
[42100]
[42101]
[42102]
[42103]
[42104]
[42105]
[42106]
[42107]
[42108]
[42109]
[42110]
[42111]
[42112]
[42113]
[42114]
[42115]
[42116]
[42117]
[42118]
[42119]
[42120]
[42121]
[42122]
[42123]
[42124]
[42125]
[42126]
[42127]
[42128]
[42129]
[42130]
[42131]
[42132]
[42133]
[42134]
[42135]
[42136]
[42137]
[42138]
[42139]
[42140]
[42141]
[42142]
[42143]
[42144]
[42145]
[42146]
[42147]
[42148]
[42149]
[42150]
[42151]
[42152]
[42153]
[42154]
[42155]
[42156]
[42157]
[42158]
[42159]
[42160]
[42161]
[42162]
[42163]
[42164]
[42165]
[42166]
[42167]
[42168]
[42169]
[42170]
[42171]
[42172]
[42173]
[42174]
[42175]
[42176]
[42177]
[42178]
[42179]
[42180]
[42181]
[42182]
[42183]
[42184]
[42185]
[42186]
[42187]
[42188]
[42189]
[42190]
[42191]
[42192]
[42193]
[42194]
[42195]
[42196]
[42197]
[42198]
[42199]
[42200]
[42201]
[42202]
[42203]
[42204]
[42205]
[42206]
[42207]
[42208]
[42209]
[42210]
[42211]
[42212]
[42213]
[42214]
[42215]
[42216]
[42217]
[42218]
[42219]
[42220]
[42221]
[42222]
[42223]
[42224]
[42225]
[42226]
[42227]
[42228]
[42229]
[42230]
[42231]
[42232]
[42233]
[42234]
[42235]
[42236]
[42237]
[42238]
[42239]
[42240]
[42241]
[42242]
[42243]
[42244]
[42245]
[42246]
[42247]
[42248]
[42249]
[42250]
[42251]
[42252]
[42253]
[42254]
[42255]
[42256]
[42257]
[42258]
[42259]
[42260]
[42261]
[42262]
[42263]
[42264]
[42265]
[42266]
[42267]
[42268]
[42269]
[42270]
[42271]
[42272]
[42273]
[42274]
[42275]
[42276]
[42277]
[42278]
[42279]
[42280]
[42281]
[42282]
[42283]
[42284]
[42285]
[42286]
[42287]
[42288]
[42289]
[42290]
[42291]
[42292]
[42293]
[42294]
[42295]
[42296]
[42297]
[42298]
[42299]
[42300]
[42301]
[42302]
[42303]
[42304]
[42305]
[42306]
[42307]
[42308]
[42309]
[42310]
[42311]
[42312]
[42313]
[42314]
[42315]
[42316]
[42317]
[42318]
[42319]
[42320]
[42321]
[42322]
[42323]
[42324]
[42325]
[42326]
[42327]
[42328]
[42329]
[42330]
[42331]
[42332]
[42333]
[42334]
[42335]
[42336]
[42337]
[42338]
[42339]
[42340]
[42341]
[42342]
[42343]
[42344]
[42345]
[42346]
[42347]
[42348]
[42349]
[42350]
[42351]
[42352]
[42353]
[42354]
[42355]
[42356]
[42357]
[42358]
[42359]
[42360]
[42361]
[42362]
[42363]
[42364]
[42365]
[42366]
[42367]
[42368]
[42369]
[42370]
[42371]
[42372]
[42373]
[42374]
[42375]
[42376]
[42377]
[42378]
[42379]
[42380]
[42381]
[42382]
[42383]
[42384]
[42385]
[42386]
[42387]
[42388]
[42389]
[42390]
[42391]
[42392]
[42393]
[42394]
[42395]
[42396]
[42397]
[42398]
[42399]
[42400]
[42401]
[42402]
[42403]
[42404]
[42405]
[42406]
[42407]
[42408]
[42409]
[42410]
[42411]
[42412]
[42413]
[42414]
[42415]
[42416]
[42417]
[42418]
[42419]
[42420]
[42421]
[42422]
[42423]
[42424]
[42425]
[42426]
[42427]
[42428]
[42429]
[42430]
[42431]
[42432]
[42433]
[42434]
[42435]
[42436]
[42437]
[42438]
[42439]
[42440]
[42441]
[42442]
[42443]
[42444]
[42445]
[42446]
[42447]
[42448]
[42449]
[42450]
[42451]
[42452]
[42453]
[42454]
[42455]
[42456]
[42457]
[42458]
[42459]
[42460]
[42461]
[42462]
[42463]
[42464]
[42465]
[42466]
[42467]
[42468]
[42469]
[42470]
[42471]
[42472]
[42473]
[42474]
[42475]
[42476]
[42477]
[42478]
[42479]
[42480]
[42481]
[42482]
[42483]
[42484]
[42485]
[42486]
[42487]
[42488]
[42489]
[42490]
[42491]
[42492]
[42493]
[42494]
[42495]
[42496]
[42497]
[42498]
[42499]
[42500]
[42501]
[42502]
[42503]
[42504]
[42505]
[42506]
[42507]
[42508]
[42509]
[42510]
[42511]
[42512]
[42513]
[42514]
[42515]
[42516]
[42517]
[42518]
[42519]
[42520]
[42521]
[42522]
[42523]
[42524]
[42525]
[42526]
[42527]
[42528]
[42529]
[42530]
[42531]
[42532]
[42533]
[42534]
[42535]
[42536]
[42537]
[42538]
[42539]
[42540]
[42541]
[42542]
[42543]
[42544]
[42545]
[42546]
[42547]
[42548]
[42549]
[42550]
[42551]
[42552]
[42553]
[42554]
[42555]
[42556]
[42557]
[42558]
[42559]
[42560]
[42561]
[42562]
[42563]
[42564]
[42565]
[42566]
[42567]
[42568]
[42569]
[42570]
[42571]
[42572]
[42573]
[42574]
[42575]
[42576]
[42577]
[42578]
[42579]
[42580]
[42581]
[42582]
[42583]
[42584]
[42585]
[42586]
[42587]
[42588]
[42589]
[42590]
[42591]
[42592]
[42593]
[42594]
[42595]
[42596]
[42597]
[42598]
[42599]
[42600]
[42601]
[42602]
[42603]
[42604]
[42605]
[42606]
[42607]
[42608]
[42609]
[42610]
[42611]
[42612]
[42613]
[42614]
[42615]
[42616]
[42617]
[42618]
[42619]
[42620]
[42621]
[42622]
[42623]
[42624]
[42625]
[42626]
[42627]
[42628]
[42629]
[42630]
[42631]
[42632]
[42633]
[42634]
[42635]
[42636]
[42637]
[42638]
[42639]
[42640]
[42641]
[42642]
[42643]
[42644]
[42645]
[42646]
[42647]
[42648]
[42649]
[42650]
[42651]
[42652]
[42653]
[42654]
[42655]
[42656]
[42657]
[42658]
[42659]
[42660]
[42661]
[42662]
[42663]
[42664]
[42665]
[42666]
[42667]
[42668]
[42669]
[42670]
[42671]
[42672]
[42673]
[42674]
[42675]
[42676]
[42677]
[42678]
[42679]
[42680]
[42681]
[42682]
[42683]
[42684]
[42685]
[42686]
[42687]
[42688]
[42689]
[42690]
[42691]
[42692]
[42693]
[42694]
[42695]
[42696]
[42697]
[42698]
[42699]
[42700]
[42701]
[42702]
[42703]
[42704]
[42705]
[42706]
[42707]
[42708]
[42709]
[42710]
[42711]
[42712]
[42713]
[42714]
[42715]
[42716]
[42717]
[42718]
[42719]
[42720]
[42721]
[42722]
[42723]
[42724]
[42725]
[42726]
[42727]
[42728]
[42729]
[42730]
[42731]
[42732]
[42733]
[42734]
[42735]
[42736]
[42737]
[42738]
[42739]
[42740]
[42741]
[42742]
[42743]
[42744]
[42745]
[42746]
[42747]
[42748]
[42749]
[42750]
[42751]
[42752]
[42753]
[42754]
[42755]
[42756]
[42757]
[42758]
[42759]
[42760]
[42761]
[42762]
[42763]
[42764]
[42765]
[42766]
[42767]
[42768]
[42769]
[42770]
[42771]
[42772]
[42773]
[42774]
[42775]
[42776]
[42777]
[42778]
[42779]
[42780]
[42781]
[42782]
[42783]
[42784]
[42785]
[42786]
[42787]
[42788]
[42789]
[42790]
[42791]
[42792]
[42793]
[42794]
[42795]
[42796]
[42797]
[42798]
[42799]
[42800]
[42801]
[42802]
[42803]
[42804]
[42805]
[42806]
[42807]
[42808]
[42809]
[42810]
[42811]
[42812]
[42813]
[42814]
[42815]
[42816]
[42817]
[42818]
[42819]
[42820]
[42821]
[42822]
[42823]
[42824]
[42825]
[42826]
[42827]
[42828]
[42829]
[42830]
[42831]
[42832]
[42833]
[42834]
[42835]
[42836]
[42837]
[42838]
[42839]
[42840]
[42841]
[42842]
[42843]
[42844]
[42845]
[42846]
[42847]
[42848]
[42849]
[42850]
[42851]
[42852]
[42853]
[42854]
[42855]
[42856]
[42857]
[42858]
[42859]
[42860]
[42861]
[42862]
[42863]
[42864]
[42865]
[42866]
[42867]
[42868]
[42869]
[42870]
[42871]
[42872]
[42873]
[42874]
[42875]
[42876]
[42877]
[42878]
[42879]
[42880]
[42881]
[42882]
[42883]
[42884]
[42885]
[42886]
[42887]
[42888]
[42889]
[42890]
[42891]
[42892]
[42893]
[42894]
[42895]
[42896]
[42897]
[42898]
[42899]
[42900]
[42901]
[42902]
[42903]
[42904]
[42905]
[42906]
[42907]
[42908]
[42909]
[42910]
[42911]
[42912]
[42913]
[42914]
[42915]
[42916]
[42917]
[42918]
[42919]
[42920]
[42921]
[42922]
[42923]
[42924]
[42925]
[42926]
[42927]
[42928]
[42929]
[42930]
[42931]
[42932]
[42933]
[42934]
[42935]
[42936]
[42937]
[42938]
[42939]
[42940]
[42941]
[42942]
[42943]
[42944]
[42945]
[42946]
[42947]
[42948]
[42949]
[42950]
[42951]
[42952]
[42953]
[42954]
[42955]
[42956]
[42957]
[42958]
[42959]
[42960]
[42961]
[42962]
[42963]
[42964]
[42965]
[42966]
[42967]
[42968]
[42969]
[42970]
[42971]
[42972]
[42973]
[42974]
[42975]
[42976]
[42977]
[42978]
[42979]
[42980]
[42981]
[42982]
[42983]
[42984]
[42985]
[42986]
[42987]
[42988]
[42989]
[42990]
[42991]
[42992]
[42993]
[42994]
[42995]
[42996]
[42997]
[42998]
[42999]
[43000]
[43001]
[43002]
[43003]
[43004]
[43005]
[43006]
[43007]
[43008]
[43009]
[43010]
[43011]
[43012]
[43013]
[43014]
[43015]
[43016]
[43017]
[43018]
[43019]
[43020]
[43021]
[43022]
[43023]
[43024]
[43025]
[43026]
[43027]
[43028]
[43029]
[43030]
[43031]
[43032]
[43033]
[43034]
[43035]
[43036]
[43037]
[43038]
[43039]
[43040]
[43041]
[43042]
[43043]
[43044]
[43045]
[43046]
[43047]
[43048]
[43049]
[43050]
[43051]
[43052]
[43053]
[43054]
[43055]
[43056]
[43057]
[43058]
[43059]
[43060]
[43061]
[43062]
[43063]
[43064]
[43065]
[43066]
[43067]
[43068]
[43069]
[43070]
[43071]
[43072]
[43073]
[43074]
[43075]
[43076]
[43077]
[43078]
[43079]
[43080]
[43081]
[43082]
[43083]
[43084]
[43085]
[43086]
[43087]
[43088]
[43089]
[43090]
[43091]
[43092]
[43093]
[43094]
[43095]
[43096]
[43097]
[43098]
[43099]
[43100]
[43101]
[43102]
[43103]
[43104]
[43105]
[43106]
[43107]
[43108]
[43109]
[43110]
[43111]
[43112]
[43113]
[43114]
[43115]
[43116]
[43117]
[43118]
[43119]
[43120]
[43121]
[43122]
[43123]
[43124]
[43125]
[43126]
[43127]
[43128]
[43129]
[43130]
[43131]
[43132]
[43133]
[43134]
[43135]
[43136]
[43137]
[43138]
[43139]
[43140]
[43141]
[43142]
[43143]
[43144]
[43145]
[43146]
[43147]
[43148]
[43149]
[43150]
[43151]
[43152]
[43153]
[43154]
[43155]
[43156]
[43157]
[43158]
[43159]
[43160]
[43161]
[43162]
[43163]
[43164]
[43165]
[43166]
[43167]
[43168]
[43169]
[43170]
[43171]
[43172]
[43173]
[43174]
[43175]
[43176]
[43177]
[43178]
[43179]
[43180]
[43181]
[43182]
[43183]
[43184]
[43185]
[43186]
[43187]
[43188]
[43189]
[43190]
[43191]
[43192]
[43193]
[43194]
[43195]
[43196]
[43197]
[43198]
[43199]
[43200]
[43201]
[43202]
[43203]
[43204]
[43205]
[43206]
[43207]
[43208]
[43209]
[43210]
[43211]
[43212]
[43213]
[43214]
[43215]
[43216]
[43217]
[43218]
[43219]
[43220]
[43221]
[43222]
[43223]
[43224]
[43225]
[43226]
[43227]
[43228]
[43229]
[43230]
[43231]
[43232]
[43233]
[43234]
[43235]
[43236]
[43237]
[43238]
[43239]
[43240]
[43241]
[43242]
[43243]
[43244]
[43245]
[43246]
[43247]
[43248]
[43249]
[43250]
[43251]
[43252]
[43253]
[43254]
[43255]
[43256]
[43257]
[43258]
[43259]
[43260]
[43261]
[43262]
[43263]
[43264]
[43265]
[43266]
[43267]
[43268]
[43269]
[43270]
[43271]
[43272]
[43273]
[43274]
[43275]
[43276]
[43277]
[43278]
[43279]
[43280]
[43281]
[43282]
[43283]
[43284]
[43285]
[43286]
[43287]
[43288]
[43289]
[43290]
[43291]
[43292]
[43293]
[43294]
[43295]
[43296]
[43297]
[43298]
[43299]
[43300]
[43301]
[43302]
[43303]
[43304]
[43305]
[43306]
[43307]
[43308]
[43309]
[43310]
[43311]
[43312]
[43313]
[43314]
[43315]
[43316]
[43317]
[43318]
[43319]
[43320]
[43321]
[43322]
[43323]
[43324]
[43325]
[43326]
[43327]
[43328]
[43329]
[43330]
[43331]
[43332]
[43333]
[43334]
[43335]
[43336]
[43337]
[43338]
[43339]
[43340]
[43341]
[43342]
[43343]
[43344]
[43345]
[43346]
[43347]
[43348]
[43349]
[43350]
[43351]
[43352]
[43353]
[43354]
[43355]
[43356]
[43357]
[43358]
[43359]
[43360]
[43361]
[43362]
[43363]
[43364]
[43365]
[43366]
[43367]
[43368]
[43369]
[43370]
[43371]
[43372]
[43373]
[43374]
[43375]
[43376]
[43377]
[43378]
[43379]
[43380]
[43381]
[43382]
[43383]
[43384]
[43385]
[43386]
[43387]
[43388]
[43389]
[43390]
[43391]
[43392]
[43393]
[43394]
[43395]
[43396]
[43397]
[43398]
[43399]
[43400]
[43401]
[43402]
[43403]
[43404]
[43405]
[43406]
[43407]
[43408]
[43409]
[43410]
[43411]
[43412]
[43413]
[43414]
[43415]
[43416]
[43417]
[43418]
[43419]
[43420]
[43421]
[43422]
[43423]
[43424]
[43425]
[43426]
[43427]
[43428]
[43429]
[43430]
[43431]
[43432]
[43433]
[43434]
[43435]
[43436]
[43437]
[43438]
[43439]
[43440]
[43441]
[43442]
[43443]
[43444]
[43445]
[43446]
[43447]
[43448]
[43449]
[43450]
[43451]
[43452]
[43453]
[43454]
[43455]
[43456]
[43457]
[43458]
[43459]
[43460]
[43461]
[43462]
[43463]
[43464]
[43465]
[43466]
[43467]
[43468]
[43469]
[43470]
[43471]
[43472]
[43473]
[43474]
[43475]
[43476]
[43477]
[43478]
[43479]
[43480]
[43481]
[43482]
[43483]
[43484]
[43485]
[43486]
[43487]
[43488]
[43489]
[43490]
[43491]
[43492]
[43493]
[43494]
[43495]
[43496]
[43497]
[43498]
[43499]
[43500]
[43501]
[43502]
[43503]
[43504]
[43505]
[43506]
[43507]
[43508]
[43509]
[43510]
[43511]
[43512]
[43513]
[43514]
[43515]
[43516]
[43517]
[43518]
[43519]
[43520]
[43521]
[43522]
[43523]
[43524]
[43525]
[43526]
[43527]
[43528]
[43529]
[43530]
[43531]
[43532]
[43533]
[43534]
[43535]
[43536]
[43537]
[43538]
[43539]
[43540]
[43541]
[43542]
[43543]
[43544]
[43545]
[43546]
[43547]
[43548]
[43549]
[43550]
[43551]
[43552]
[43553]
[43554]
[43555]
[43556]
[43557]
[43558]
[43559]
[43560]
[43561]
[43562]
[43563]
[43564]
[43565]
[43566]
[43567]
[43568]
[43569]
[43570]
[43571]
[43572]
[43573]
[43574]
[43575]
[43576]
[43577]
[43578]
[43579]
[43580]
[43581]
[43582]
[43583]
[43584]
[43585]
[43586]
[43587]
[43588]
[43589]
[43590]
[43591]
[43592]
[43593]
[43594]
[43595]
[43596]
[43597]
[43598]
[43599]
[43600]
[43601]
[43602]
[43603]
[43604]
[43605]
[43606]
[43607]
[43608]
[43609]
[43610]
[43611]
[43612]
[43613]
[43614]
[43615]
[43616]
[43617]
[43618]
[43619]
[43620]
[43621]
[43622]
[43623]
[43624]
[43625]
[43626]
[43627]
[43628]
[43629]
[43630]
[43631]
[43632]
[43633]
[43634]
[43635]
[43636]
[43637]
[43638]
[43639]
[43640]
[43641]
[43642]
[43643]
[43644]
[43645]
[43646]
[43647]
[43648]
[43649]
[43650]
[43651]
[43652]
[43653]
[43654]
[43655]
[43656]
[43657]
[43658]
[43659]
[43660]
[43661]
[43662]
[43663]
[43664]
[43665]
[43666]
[43667]
[43668]
[43669]
[43670]
[43671]
[43672]
[43673]
[43674]
[43675]
[43676]
[43677]
[43678]
[43679]
[43680]
[43681]
[43682]
[43683]
[43684]
[43685]
[43686]
[43687]
[43688]
[43689]
[43690]
[43691]
[43692]
[43693]
[43694]
[43695]
[43696]
[43697]
[43698]
[43699]
[43700]
[43701]
[43702]
[43703]
[43704]
[43705]
[43706]
[43707]
[43708]
[43709]
[43710]
[43711]
[43712]
[43713]
[43714]
[43715]
[43716]
[43717]
[43718]
[43719]
[43720]
[43721]
[43722]
[43723]
[43724]
[43725]
[43726]
[43727]
[43728]
[43729]
[43730]
[43731]
[43732]
[43733]
[43734]
[43735]
[43736]
[43737]
[43738]
[43739]
[43740]
[43741]
[43742]
[43743]
[43744]
[43745]
[43746]
[43747]
[43748]
[43749]
[43750]
[43751]
[43752]
[43753]
[43754]
[43755]
[43756]
[43757]
[43758]
[43759]
[43760]
[43761]
[43762]
[43763]
[43764]
[43765]
[43766]
[43767]
[43768]
[43769]
[43770]
[43771]
[43772]
[43773]
[43774]
[43775]
[43776]
[43777]
[43778]
[43779]
[43780]
[43781]
[43782]
[43783]
[43784]
[43785]
[43786]
[43787]
[43788]
[43789]
[43790]
[43791]
[43792]
[43793]
[43794]
[43795]
[43796]
[43797]
[43798]
[43799]
[43800]
[43801]
[43802]
[43803]
[43804]
[43805]
[43806]
[43807]
[43808]
[43809]
[43810]
[43811]
[43812]
[43813]
[43814]
[43815]
[43816]
[43817]
[43818]
[43819]
[43820]
[43821]
[43822]
[43823]
[43824]
[43825]
[43826]
[43827]
[43828]
[43829]
[43830]
[43831]
[43832]
[43833]
[43834]
[43835]
[43836]
[43837]
[43838]
[43839]
[43840]
[43841]
[43842]
[43843]
[43844]
[43845]
[43846]
[43847]
[43848]
[43849]
[43850]
[43851]
[43852]
[43853]
[43854]
[43855]
[43856]
[43857]
[43858]
[43859]
[43860]
[43861]
[43862]
[43863]
[43864]
[43865]
[43866]
[43867]
[43868]
[43869]
[43870]
[43871]
[43872]
[43873]
[43874]
[43875]
[43876]
[43877]
[43878]
[43879]
[43880]
[43881]
[43882]
[43883]
[43884]
[43885]
[43886]
[43887]
[43888]
[43889]
[43890]
[43891]
[43892]
[43893]
[43894]
[43895]
[43896]
[43897]
[43898]
[43899]
[43900]
[43901]
[43902]
[43903]
[43904]
[43905]
[43906]
[43907]
[43908]
[43909]
[43910]
[43911]
[43912]
[43913]
[43914]
[43915]
[43916]
[43917]
[43918]
[43919]
[43920]
[43921]
[43922]
[43923]
[43924]
[43925]
[43926]
[43927]
[43928]
[43929]
[43930]
[43931]
[43932]
[43933]
[43934]
[43935]
[43936]
[43937]
[43938]
[43939]
[43940]
[43941]
[43942]
[43943]
[43944]
[43945]
[43946]
[43947]
[43948]
[43949]
[43950]
[43951]
[43952]
[43953]
[43954]
[43955]
[43956]
[43957]
[43958]
[43959]
[43960]
[43961]
[43962]
[43963]
[43964]
[43965]
[43966]
[43967]
[43968]
[43969]
[43970]
[43971]
[43972]
[43973]
[43974]
[43975]
[43976]
[43977]
[43978]
[43979]
[43980]
[43981]
[43982]
[43983]
[43984]
[43985]
[43986]
[43987]
[43988]
[43989]
[43990]
[43991]
[43992]
[43993]
[43994]
[43995]
[43996]
[43997]
[43998]
[43999]
[44000]
[44001]
[44002]
[44003]
[44004]
[44005]
[44006]
[44007]
[44008]
[44009]
[44010]
[44011]
[44012]
[44013]
[44014]
[44015]
[44016]
[44017]
[44018]
[44019]
[44020]
[44021]
[44022]
[44023]
[44024]
[44025]
[44026]
[44027]
[44028]
[44029]
[44030]
[44031]
[44032]
[44033]
[44034]
[44035]
[44036]
[44037]
[44038]
[44039]
[44040]
[44041]
[44042]
[44043]
[44044]
[44045]
[44046]
[44047]
[44048]
[44049]
[44050]
[44051]
[44052]
[44053]
[44054]
[44055]
[44056]
[44057]
[44058]
[44059]
[44060]
[44061]
[44062]
[44063]
[44064]
[44065]
[44066]
[44067]
[44068]
[44069]
[44070]
[44071]
[44072]
[44073]
[44074]
[44075]
[44076]
[44077]
[44078]
[44079]
[44080]
[44081]
[44082]
[44083]
[44084]
[44085]
[44086]
[44087]
[44088]
[44089]
[44090]
[44091]
[44092]
[44093]
[44094]
[44095]
[44096]
[44097]
[44098]
[44099]
[44100]
[44101]
[44102]
[44103]
[44104]
[44105]
[44106]
[44107]
[44108]
[44109]
[44110]
[44111]
[44112]
[44113]
[44114]
[44115]
[44116]
[44117]
[44118]
[44119]
[44120]
[44121]
[44122]
[44123]
[44124]
[44125]
[44126]
[44127]
[44128]
[44129]
[44130]
[44131]
[44132]
[44133]
[44134]
[44135]
[44136]
[44137]
[44138]
[44139]
[44140]
[44141]
[44142]
[44143]
[44144]
[44145]
[44146]
[44147]
[44148]
[44149]
[44150]
[44151]
[44152]
[44153]
[44154]
[44155]
[44156]
[44157]
[44158]
[44159]
[44160]
[44161]
[44162]
[44163]
[44164]
[44165]
[44166]
[44167]
[44168]
[44169]
[44170]
[44171]
[44172]
[44173]
[44174]
[44175]
[44176]
[44177]
[44178]
[44179]
[44180]
[44181]
[44182]
[44183]
[44184]
[44185]
[44186]
[44187]
[44188]
[44189]
[44190]
[44191]
[44192]
[44193]
[44194]
[44195]
[44196]
[44197]
[44198]
[44199]
[44200]
[44201]
[44202]
[44203]
[44204]
[44205]
[44206]
[44207]
[44208]
[44209]
[44210]
[44211]
[44212]
[44213]
[44214]
[44215]
[44216]
[44217]
[44218]
[44219]
[44220]
[44221]
[44222]
[44223]
[44224]
[44225]
[44226]
[44227]
[44228]
[44229]
[44230]
[44231]
[44232]
[44233]
[44234]
[44235]
[44236]
[44237]
[44238]
[44239]
[44240]
[44241]
[44242]
[44243]
[44244]
[44245]
[44246]
[44247]
[44248]
[44249]
[44250]
[44251]
[44252]
[44253]
[44254]
[44255]
[44256]
[44257]
[44258]
[44259]
[44260]
[44261]
[44262]
[44263]
[44264]
[44265]
[44266]
[44267]
[44268]
[44269]
[44270]
[44271]
[44272]
[44273]
[44274]
[44275]
[44276]
[44277]
[44278]
[44279]
[44280]
[44281]
[44282]
[44283]
[44284]
[44285]
[44286]
[44287]
[44288]
[44289]
[44290]
[44291]
[44292]
[44293]
[44294]
[44295]
[44296]
[44297]
[44298]
[44299]
[44300]
[44301]
[44302]
[44303]
[44304]
[44305]
[44306]
[44307]
[44308]
[44309]
[44310]
[44311]
[44312]
[44313]
[44314]
[44315]
[44316]
[44317]
[44318]
[44319]
[44320]
[44321]
[44322]
[44323]
[44324]
[44325]
[44326]
[44327]
[44328]
[44329]
[44330]
[44331]
[44332]
[44333]
[44334]
[44335]
[44336]
[44337]
[44338]
[44339]
[44340]
[44341]
[44342]
[44343]
[44344]
[44345]
[44346]
[44347]
[44348]
[44349]
[44350]
[44351]
[44352]
[44353]
[44354]
[44355]
[44356]
[44357]
[44358]
[44359]
[44360]
[44361]
[44362]
[44363]
[44364]
[44365]
[44366]
[44367]
[44368]
[44369]
[44370]
[44371]
[44372]
[44373]
[44374]
[44375]
[44376]
[44377]
[44378]
[44379]
[44380]
[44381]
[44382]
[44383]
[44384]
[44385]
[44386]
[44387]
[44388]
[44389]
[44390]
[44391]
[44392]
[44393]
[44394]
[44395]
[44396]
[44397]
[44398]
[44399]
[44400]
[44401]
[44402]
[44403]
[44404]
[44405]
[44406]
[44407]
[44408]
[44409]
[44410]
[44411]
[44412]
[44413]
[44414]
[44415]
[44416]
[44417]
[44418]
[44419]
[44420]
[44421]
[44422]
[44423]
[44424]
[44425]
[44426]
[44427]
[44428]
[44429]
[44430]
[44431]
[44432]
[44433]
[44434]
[44435]
[44436]
[44437]
[44438]
[44439]
[44440]
[44441]
[44442]
[44443]
[44444]
[44445]
[44446]
[44447]
[44448]
[44449]
[44450]
[44451]
[44452]
[44453]
[44454]
[44455]
[44456]
[44457]
[44458]
[44459]
[44460]
[44461]
[44462]
[44463]
[44464]
[44465]
[44466]
[44467]
[44468]
[44469]
[44470]
[44471]
[44472]
[44473]
[44474]
[44475]
[44476]
[44477]
[44478]
[44479]
[44480]
[44481]
[44482]
[44483]
[44484]
[44485]
[44486]
[44487]
[44488]
[44489]
[44490]
[44491]
[44492]
[44493]
[44494]
[44495]
[44496]
[44497]
[44498]
[44499]
[44500]
[44501]
[44502]
[44503]
[44504]
[44505]
[44506]
[44507]
[44508]
[44509]
[44510]
[44511]
[44512]
[44513]
[44514]
[44515]
[44516]
[44517]
[44518]
[44519]
[44520]
[44521]
[44522]
[44523]
[44524]
[44525]
[44526]
[44527]
[44528]
[44529]
[44530]
[44531]
[44532]
[44533]
[44534]
[44535]
[44536]
[44537]
[44538]
[44539]
[44540]
[44541]
[44542]
[44543]
[44544]
[44545]
[44546]
[44547]
[44548]
[44549]
[44550]
[44551]
[44552]
[44553]
[44554]
[44555]
[44556]
[44557]
[44558]
[44559]
[44560]
[44561]
[44562]
[44563]
[44564]
[44565]
[44566]
[44567]
[44568]
[44569]
[44570]
[44571]
[44572]
[44573]
[44574]
[44575]
[44576]
[44577]
[44578]
[44579]
[44580]
[44581]
[44582]
[44583]
[44584]
[44585]
[44586]
[44587]
[44588]
[44589]
[44590]
[44591]
[44592]
[44593]
[44594]
[44595]
[44596]
[44597]
[44598]
[44599]
[44600]
[44601]
[44602]
[44603]
[44604]
[44605]
[44606]
[44607]
[44608]
[44609]
[44610]
[44611]
[44612]
[44613]
[44614]
[44615]
[44616]
[44617]
[44618]
[44619]
[44620]
[44621]
[44622]
[44623]
[44624]
[44625]
[44626]
[44627]
[44628]
[44629]
[44630]
[44631]
[44632]
[44633]
[44634]
[44635]
[44636]
[44637]
[44638]
[44639]
[44640]
[44641]
[44642]
[44643]
[44644]
[44645]
[44646]
[44647]
[44648]
[44649]
[44650]
[44651]
[44652]
[44653]
[44654]
[44655]
[44656]
[44657]
[44658]
[44659]
[44660]
[44661]
[44662]
[44663]
[44664]
[44665]
[44666]
[44667]
[44668]
[44669]
[44670]
[44671]
[44672]
[44673]
[44674]
[44675]
[44676]
[44677]
[44678]
[44679]
[44680]
[44681]
[44682]
[44683]
[44684]
[44685]
[44686]
[44687]
[44688]
[44689]
[44690]
[44691]
[44692]
[44693]
[44694]
[44695]
[44696]
[44697]
[44698]
[44699]
[44700]
[44701]
[44702]
[44703]
[44704]
[44705]
[44706]
[44707]
[44708]
[44709]
[44710]
[44711]
[44712]
[44713]
[44714]
[44715]
[44716]
[44717]
[44718]
[44719]
[44720]
[44721]
[44722]
[44723]
[44724]
[44725]
[44726]
[44727]
[44728]
[44729]
[44730]
[44731]
[44732]
[44733]
[44734]
[44735]
[44736]
[44737]
[44738]
[44739]
[44740]
[44741]
[44742]
[44743]
[44744]
[44745]
[44746]
[44747]
[44748]
[44749]
[44750]
[44751]
[44752]
[44753]
[44754]
[44755]
[44756]
[44757]
[44758]
[44759]
[44760]
[44761]
[44762]
[44763]
[44764]
[44765]
[44766]
[44767]
[44768]
[44769]
[44770]
[44771]
[44772]
[44773]
[44774]
[44775]
[44776]
[44777]
[44778]
[44779]
[44780]
[44781]
[44782]
[44783]
[44784]
[44785]
[44786]
[44787]
[44788]
[44789]
[44790]
[44791]
[44792]
[44793]
[44794]
[44795]
[44796]
[44797]
[44798]
[44799]
[44800]
[44801]
[44802]
[44803]
[44804]
[44805]
[44806]
[44807]
[44808]
[44809]
[44810]
[44811]
[44812]
[44813]
[44814]
[44815]
[44816]
[44817]
[44818]
[44819]
[44820]
[44821]
[44822]
[44823]
[44824]
[44825]
[44826]
[44827]
[44828]
[44829]
[44830]
[44831]
[44832]
[44833]
[44834]
[44835]
[44836]
[44837]
[44838]
[44839]
[44840]
[44841]
[44842]
[44843]
[44844]
[44845]
[44846]
[44847]
[44848]
[44849]
[44850]
[44851]
[44852]
[44853]
[44854]
[44855]
[44856]
[44857]
[44858]
[44859]
[44860]
[44861]
[44862]
[44863]
[44864]
[44865]
[44866]
[44867]
[44868]
[44869]
[44870]
[44871]
[44872]
[44873]
[44874]
[44875]
[44876]
[44877]
[44878]
[44879]
[44880]
[44881]
[44882]
[44883]
[44884]
[44885]
[44886]
[44887]
[44888]
[44889]
[44890]
[44891]
[44892]
[44893]
[44894]
[44895]
[44896]
[44897]
[44898]
[44899]
[44900]
[44901]
[44902]
[44903]
[44904]
[44905]
[44906]
[44907]
[44908]
[44909]
[44910]
[44911]
[44912]
[44913]
[44914]
[44915]
[44916]
[44917]
[44918]
[44919]
[44920]
[44921]
[44922]
[44923]
[44924]
[44925]
[44926]
[44927]
[44928]
[44929]
[44930]
[44931]
[44932]
[44933]
[44934]
[44935]
[44936]
[44937]
[44938]
[44939]
[44940]
[44941]
[44942]
[44943]
[44944]
[44945]
[44946]
[44947]
[44948]
[44949]
[44950]
[44951]
[44952]
[44953]
[44954]
[44955]
[44956]
[44957]
[44958]
[44959]
[44960]
[44961]
[44962]
[44963]
[44964]
[44965]
[44966]
[44967]
[44968]
[44969]
[44970]
[44971]
[44972]
[44973]
[44974]
[44975]
[44976]
[44977]
[44978]
[44979]
[44980]
[44981]
[44982]
[44983]
[44984]
[44985]
[44986]
[44987]
[44988]
[44989]
[44990]
[44991]
[44992]
[44993]
[44994]
[44995]
[44996]
[44997]
[44998]
[44999]
[45000]
[45001]
[45002]
[45003]
[45004]
[45005]
[45006]
[45007]
[45008]
[45009]
[45010]
[45011]
[45012]
[45013]
[45014]
[45015]
[45016]
[45017]
[45018]
[45019]
[45020]
[45021]
[45022]
[45023]
[45024]
[45025]
[45026]
[45027]
[45028]
[45029]
[45030]
[45031]
[45032]
[45033]
[45034]
[45035]
[45036]
[45037]
[45038]
[45039]
[45040]
[45041]
[45042]
[45043]
[45044]
[45045]
[45046]
[45047]
[45048]
[45049]
[45050]
[45051]
[45052]
[45053]
[45054]
[45055]
[45056]
[45057]
[45058]
[45059]
[45060]
[45061]
[45062]
[45063]
[45064]
[45065]
[45066]
[45067]
[45068]
[45069]
[45070]
[45071]
[45072]
[45073]
[45074]
[45075]
[45076]
[45077]
[45078]
[45079]
[45080]
[45081]
[45082]
[45083]
[45084]
[45085]
[45086]
[45087]
[45088]
[45089]
[45090]
[45091]
[45092]
[45093]
[45094]
[45095]
[45096]
[45097]
[45098]
[45099]
[45100]
[45101]
[45102]
[45103]
[45104]
[45105]
[45106]
[45107]
[45108]
[45109]
[45110]
[45111]
[45112]
[45113]
[45114]
[45115]
[45116]
[45117]
[45118]
[45119]
[45120]
[45121]
[45122]
[45123]
[45124]
[45125]
[45126]
[45127]
[45128]
[45129]
[45130]
[45131]
[45132]
[45133]
[45134]
[45135]
[45136]
[45137]
[45138]
[45139]
[45140]
[45141]
[45142]
[45143]
[45144]
[45145]
[45146]
[45147]
[45148]
[45149]
[45150]
[45151]
[45152]
[45153]
[45154]
[45155]
[45156]
[45157]
[45158]
[45159]
[45160]
[45161]
[45162]
[45163]
[45164]
[45165]
[45166]
[45167]
[45168]
[45169]
[45170]
[45171]
[45172]
[45173]
[45174]
[45175]
[45176]
[45177]
[45178]
[45179]
[45180]
[45181]
[45182]
[45183]
[45184]
[45185]
[45186]
[45187]
[45188]
[45189]
[45190]
[45191]
[45192]
[45193]
[45194]
[45195]
[45196]
[45197]
[45198]
[45199]
[45200]
[45201]
[45202]
[45203]
[45204]
[45205]
[45206]
[45207]
[45208]
[45209]
[45210]
[45211]
[45212]
[45213]
[45214]
[45215]
[45216]
[45217]
[45218]
[45219]
[45220]
[45221]
[45222]
[45223]
[45224]
[45225]
[45226]
[45227]
[45228]
[45229]
[45230]
[45231]
[45232]
[45233]
[45234]
[45235]
[45236]
[45237]
[45238]
[45239]
[45240]
[45241]
[45242]
[45243]
[45244]
[45245]
[45246]
[45247]
[45248]
[45249]
[45250]
[45251]
[45252]
[45253]
[45254]
[45255]
[45256]
[45257]
[45258]
[45259]
[45260]
[45261]
[45262]
[45263]
[45264]
[45265]
[45266]
[45267]
[45268]
[45269]
[45270]
[45271]
[45272]
[45273]
[45274]
[45275]
[45276]
[45277]
[45278]
[45279]
[45280]
[45281]
[45282]
[45283]
[45284]
[45285]
[45286]
[45287]
[45288]
[45289]
[45290]
[45291]
[45292]
[45293]
[45294]
[45295]
[45296]
[45297]
[45298]
[45299]
[45300]
[45301]
[45302]
[45303]
[45304]
[45305]
[45306]
[45307]
[45308]
[45309]
[45310]
[45311]
[45312]
[45313]
[45314]
[45315]
[45316]
[45317]
[45318]
[45319]
[45320]
[45321]
[45322]
[45323]
[45324]
[45325]
[45326]
[45327]
[45328]
[45329]
[45330]
[45331]
[45332]
[45333]
[45334]
[45335]
[45336]
[45337]
[45338]
[45339]
[45340]
[45341]
[45342]
[45343]
[45344]
[45345]
[45346]
[45347]
[45348]
[45349]
[45350]
[45351]
[45352]
[45353]
[45354]
[45355]
[45356]
[45357]
[45358]
[45359]
[45360]
[45361]
[45362]
[45363]
[45364]
[45365]
[45366]
[45367]
[45368]
[45369]
[45370]
[45371]
[45372]
[45373]
[45374]
[45375]
[45376]
[45377]
[45378]
[45379]
[45380]
[45381]
[45382]
[45383]
[45384]
[45385]
[45386]
[45387]
[45388]
[45389]
[45390]
[45391]
[45392]
[45393]
[45394]
[45395]
[45396]
[45397]
[45398]
[45399]
[45400]
[45401]
[45402]
[45403]
[45404]
[45405]
[45406]
[45407]
[45408]
[45409]
[45410]
[45411]
[45412]
[45413]
[45414]
[45415]
[45416]
[45417]
[45418]
[45419]
[45420]
[45421]
[45422]
[45423]
[45424]
[45425]
[45426]
[45427]
[45428]
[45429]
[45430]
[45431]
[45432]
[45433]
[45434]
[45435]
[45436]
[45437]
[45438]
[45439]
[45440]
[45441]
[45442]
[45443]
[45444]
[45445]
[45446]
[45447]
[45448]
[45449]
[45450]
[45451]
[45452]
[45453]
[45454]
[45455]
[45456]
[45457]
[45458]
[45459]
[45460]
[45461]
[45462]
[45463]
[45464]
[45465]
[45466]
[45467]
[45468]
[45469]
[45470]
[45471]
[45472]
[45473]
[45474]
[45475]
[45476]
[45477]
[45478]
[45479]
[45480]
[45481]
[45482]
[45483]
[45484]
[45485]
[45486]
[45487]
[45488]
[45489]
[45490]
[45491]
[45492]
[45493]
[45494]
[45495]
[45496]
[45497]
[45498]
[45499]
[45500]
[45501]
[45502]
[45503]
[45504]
[45505]
[45506]
[45507]
[45508]
[45509]
[45510]
[45511]
[45512]
[45513]
[45514]
[45515]
[45516]
[45517]
[45518]
[45519]
[45520]
[45521]
[45522]
[45523]
[45524]
[45525]
[45526]
[45527]
[45528]
[45529]
[45530]
[45531]
[45532]
[45533]
[45534]
[45535]
[45536]
[45537]
[45538]
[45539]
[45540]
[45541]
[45542]
[45543]
[45544]
[45545]
[45546]
[45547]
[45548]
[45549]
[45550]
[45551]
[45552]
[45553]
[45554]
[45555]
[45556]
[45557]
[45558]
[45559]
[45560]
[45561]
[45562]
[45563]
[45564]
[45565]
[45566]
[45567]
[45568]
[45569]
[45570]
[45571]
[45572]
[45573]
[45574]
[45575]
[45576]
[45577]
[45578]
[45579]
[45580]
[45581]
[45582]
[45583]
[45584]
[45585]
[45586]
[45587]
[45588]
[45589]
[45590]
[45591]
[45592]
[45593]
[45594]
[45595]
[45596]
[45597]
[45598]
[45599]
[45600]
[45601]
[45602]
[45603]
[45604]
[45605]
[45606]
[45607]
[45608]
[45609]
[45610]
[45611]
[45612]
[45613]
[45614]
[45615]
[45616]
[45617]
[45618]
[45619]
[45620]
[45621]
[45622]
[45623]
[45624]
[45625]
[45626]
[45627]
[45628]
[45629]
[45630]
[45631]
[45632]
[45633]
[45634]
[45635]
[45636]
[45637]
[45638]
[45639]
[45640]
[45641]
[45642]
[45643]
[45644]
[45645]
[45646]
[45647]
[45648]
[45649]
[45650]
[45651]
[45652]
[45653]
[45654]
[45655]
[45656]
[45657]
[45658]
[45659]
[45660]
[45661]
[45662]
[45663]
[45664]
[45665]
[45666]
[45667]
[45668]
[45669]
[45670]
[45671]
[45672]
[45673]
[45674]
[45675]
[45676]
[45677]
[45678]
[45679]
[45680]
[45681]
[45682]
[45683]
[45684]
[45685]
[45686]
[45687]
[45688]
[45689]
[45690]
[45691]
[45692]
[45693]
[45694]
[45695]
[45696]
[45697]
[45698]
[45699]
[45700]
[45701]
[45702]
[45703]
[45704]
[45705]
[45706]
[45707]
[45708]
[45709]
[45710]
[45711]
[45712]
[45713]
[45714]
[45715]
[45716]
[45717]
[45718]
[45719]
[45720]
[45721]
[45722]
[45723]
[45724]
[45725]
[45726]
[45727]
[45728]
[45729]
[45730]
[45731]
[45732]
[45733]
[45734]
[45735]
[45736]
[45737]
[45738]
[45739]
[45740]
[45741]
[45742]
[45743]
[45744]
[45745]
[45746]
[45747]
[45748]
[45749]
[45750]
[45751]
[45752]
[45753]
[45754]
[45755]
[45756]
[45757]
[45758]
[45759]
[45760]
[45761]
[45762]
[45763]
[45764]
[45765]
[45766]
[45767]
[45768]
[45769]
[45770]
[45771]
[45772]
[45773]
[45774]
[45775]
[45776]
[45777]
[45778]
[45779]
[45780]
[45781]
[45782]
[45783]
[45784]
[45785]
[45786]
[45787]
[45788]
[45789]
[45790]
[45791]
[45792]
[45793]
[45794]
[45795]
[45796]
[45797]
[45798]
[45799]
[45800]
[45801]
[45802]
[45803]
[45804]
[45805]
[45806]
[45807]
[45808]
[45809]
[45810]
[45811]
[45812]
[45813]
[45814]
[45815]
[45816]
[45817]
[45818]
[45819]
[45820]
[45821]
[45822]
[45823]
[45824]
[45825]
[45826]
[45827]
[45828]
[45829]
[45830]
[45831]
[45832]
[45833]
[45834]
[45835]
[45836]
[45837]
[45838]
[45839]
[45840]
[45841]
[45842]
[45843]
[45844]
[45845]
[45846]
[45847]
[45848]
[45849]
[45850]
[45851]
[45852]
[45853]
[45854]
[45855]
[45856]
[45857]
[45858]
[45859]
[45860]
[45861]
[45862]
[45863]
[45864]
[45865]
[45866]
[45867]
[45868]
[45869]
[45870]
[45871]
[45872]
[45873]
[45874]
[45875]
[45876]
[45877]
[45878]
[45879]
[45880]
[45881]
[45882]
[45883]
[45884]
[45885]
[45886]
[45887]
[45888]
[45889]
[45890]
[45891]
[45892]
[45893]
[45894]
[45895]
[45896]
[45897]
[45898]
[45899]
[45900]
[45901]
[45902]
[45903]
[45904]
[45905]
[45906]
[45907]
[45908]
[45909]
[45910]
[45911]
[45912]
[45913]
[45914]
[45915]
[45916]
[45917]
[45918]
[45919]
[45920]
[45921]
[45922]
[45923]
[45924]
[45925]
[45926]
[45927]
[45928]
[45929]
[45930]
[45931]
[45932]
[45933]
[45934]
[45935]
[45936]
[45937]
[45938]
[45939]
[45940]
[45941]
[45942]
[45943]
[45944]
[45945]
[45946]
[45947]
[45948]
[45949]
[45950]
[45951]
[45952]
[45953]
[45954]
[45955]
[45956]
[45957]
[45958]
[45959]
[45960]
[45961]
[45962]
[45963]
[45964]
[45965]
[45966]
[45967]
[45968]
[45969]
[45970]
[45971]
[45972]
[45973]
[45974]
[45975]
[45976]
[45977]
[45978]
[45979]
[45980]
[45981]
[45982]
[45983]
[45984]
[45985]
[45986]
[45987]
[45988]
[45989]
[45990]
[45991]
[45992]
[45993]
[45994]
[45995]
[45996]
[45997]
[45998]
[45999]
[46000]
[46001]
[46002]
[46003]
[46004]
[46005]
[46006]
[46007]
[46008]
[46009]
[46010]
[46011]
[46012]
[46013]
[46014]
[46015]
[46016]
[46017]
[46018]
[46019]
[46020]
[46021]
[46022]
[46023]
[46024]
[46025]
[46026]
[46027]
[46028]
[46029]
[46030]
[46031]
[46032]
[46033]
[46034]
[46035]
[46036]
[46037]
[46038]
[46039]
[46040]
[46041]
[46042]
[46043]
[46044]
[46045]
[46046]
[46047]
[46048]
[46049]
[46050]
[46051]
[46052]
[46053]
[46054]
[46055]
[46056]
[46057]
[46058]
[46059]
[46060]
[46061]
[46062]
[46063]
[46064]
[46065]
[46066]
[46067]
[46068]
[46069]
[46070]
[46071]
[46072]
[46073]
[46074]
[46075]
[46076]
[46077]
[46078]
[46079]
[46080]
[46081]
[46082]
[46083]
[46084]
[46085]
[46086]
[46087]
[46088]
[46089]
[46090]
[46091]
[46092]
[46093]
[46094]
[46095]
[46096]
[46097]
[46098]
[46099]
[46100]
[46101]
[46102]
[46103]
[46104]
[46105]
[46106]
[46107]
[46108]
[46109]
[46110]
[46111]
[46112]
[46113]
[46114]
[46115]
[46116]
[46117]
[46118]
[46119]
[46120]
[46121]
[46122]
[46123]
[46124]
[46125]
[46126]
[46127]
[46128]
[46129]
[46130]
[46131]
[46132]
[46133]
[46134]
[46135]
[46136]
[46137]
[46138]
[46139]
[46140]
[46141]
[46142]
[46143]
[46144]
[46145]
[46146]
[46147]
[46148]
[46149]
[46150]
[46151]
[46152]
[46153]
[46154]
[46155]
[46156]
[46157]
[46158]
[46159]
[46160]
[46161]
[46162]
[46163]
[46164]
[46165]
[46166]
[46167]
[46168]
[46169]
[46170]
[46171]
[46172]
[46173]
[46174]
[46175]
[46176]
[46177]
[46178]
[46179]
[46180]
[46181]
[46182]
[46183]
[46184]
[46185]
[46186]
[46187]
[46188]
[46189]
[46190]
[46191]
[46192]
[46193]
[46194]
[46195]
[46196]
[46197]
[46198]
[46199]
[46200]
[46201]
[46202]
[46203]
[46204]
[46205]
[46206]
[46207]
[46208]
[46209]
[46210]
[46211]
[46212]
[46213]
[46214]
[46215]
[46216]
[46217]
[46218]
[46219]
[46220]
[46221]
[46222]
[46223]
[46224]
[46225]
[46226]
[46227]
[46228]
[46229]
[46230]
[46231]
[46232]
[46233]
[46234]
[46235]
[46236]
[46237]
[46238]
[46239]
[46240]
[46241]
[46242]
[46243]
[46244]
[46245]
[46246]
[46247]
[46248]
[46249]
[46250]
[46251]
[46252]
[46253]
[46254]
[46255]
[46256]
[46257]
[46258]
[46259]
[46260]
[46261]
[46262]
[46263]
[46264]
[46265]
[46266]
[46267]
[46268]
[46269]
[46270]
[46271]
[46272]
[46273]
[46274]
[46275]
[46276]
[46277]
[46278]
[46279]
[46280]
[46281]
[46282]
[46283]
[46284]
[46285]
[46286]
[46287]
[46288]
[46289]
[46290]
[46291]
[46292]
[46293]
[46294]
[46295]
[46296]
[46297]
[46298]
[46299]
[46300]
[46301]
[46302]
[46303]
[46304]
[46305]
[46306]
[46307]
[46308]
[46309]
[46310]
[46311]
[46312]
[46313]
[46314]
[46315]
[46316]
[46317]
[46318]
[46319]
[46320]
[46321]
[46322]
[46323]
[46324]
[46325]
[46326]
[46327]
[46328]
[46329]
[46330]
[46331]
[46332]
[46333]
[46334]
[46335]
[46336]
[46337]
[46338]
[46339]
[46340]
[46341]
[46342]
[46343]
[46344]
[46345]
[46346]
[46347]
[46348]
[46349]
[46350]
[46351]
[46352]
[46353]
[46354]
[46355]
[46356]
[46357]
[46358]
[46359]
[46360]
[46361]
[46362]
[46363]
[46364]
[46365]
[46366]
[46367]
[46368]
[46369]
[46370]
[46371]
[46372]
[46373]
[46374]
[46375]
[46376]
[46377]
[46378]
[46379]
[46380]
[46381]
[46382]
[46383]
[46384]
[46385]
[46386]
[46387]
[46388]
[46389]
[46390]
[46391]
[46392]
[46393]
[46394]
[46395]
[46396]
[46397]
[46398]
[46399]
[46400]
[46401]
[46402]
[46403]
[46404]
[46405]
[46406]
[46407]
[46408]
[46409]
[46410]
[46411]
[46412]
[46413]
[46414]
[46415]
[46416]
[46417]
[46418]
[46419]
[46420]
[46421]
[46422]
[46423]
[46424]
[46425]
[46426]
[46427]
[46428]
[46429]
[46430]
[46431]
[46432]
[46433]
[46434]
[46435]
[46436]
[46437]
[46438]
[46439]
[46440]
[46441]
[46442]
[46443]
[46444]
[46445]
[46446]
[46447]
[46448]
[46449]
[46450]
[46451]
[46452]
[46453]
[46454]
[46455]
[46456]
[46457]
[46458]
[46459]
[46460]
[46461]
[46462]
[46463]
[46464]
[46465]
[46466]
[46467]
[46468]
[46469]
[46470]
[46471]
[46472]
[46473]
[46474]
[46475]
[46476]
[46477]
[46478]
[46479]
[46480]
[46481]
[46482]
[46483]
[46484]
[46485]
[46486]
[46487]
[46488]
[46489]
[46490]
[46491]
[46492]
[46493]
[46494]
[46495]
[46496]
[46497]
[46498]
[46499]
[46500]
[46501]
[46502]
[46503]
[46504]
[46505]
[46506]
[46507]
[46508]
[46509]
[46510]
[46511]
[46512]
[46513]
[46514]
[46515]
[46516]
[46517]
[46518]
[46519]
[46520]
[46521]
[46522]
[46523]
[46524]
[46525]
[46526]
[46527]
[46528]
[46529]
[46530]
[46531]
[46532]
[46533]
[46534]
[46535]
[46536]
[46537]
[46538]
[46539]
[46540]
[46541]
[46542]
[46543]
[46544]
[46545]
[46546]
[46547]
[46548]
[46549]
[46550]
[46551]
[46552]
[46553]
[46554]
[46555]
[46556]
[46557]
[46558]
[46559]
[46560]
[46561]
[46562]
[46563]
[46564]
[46565]
[46566]
[46567]
[46568]
[46569]
[46570]
[46571]
[46572]
[46573]
[46574]
[46575]
[46576]
[46577]
[46578]
[46579]
[46580]
[46581]
[46582]
[46583]
[46584]
[46585]
[46586]
[46587]
[46588]
[46589]
[46590]
[46591]
[46592]
[46593]
[46594]
[46595]
[46596]
[46597]
[46598]
[46599]
[46600]
[46601]
[46602]
[46603]
[46604]
[46605]
[46606]
[46607]
[46608]
[46609]
[46610]
[46611]
[46612]
[46613]
[46614]
[46615]
[46616]
[46617]
[46618]
[46619]
[46620]
[46621]
[46622]
[46623]
[46624]
[46625]
[46626]
[46627]
[46628]
[46629]
[46630]
[46631]
[46632]
[46633]
[46634]
[46635]
[46636]
[46637]
[46638]
[46639]
[46640]
[46641]
[46642]
[46643]
[46644]
[46645]
[46646]
[46647]
[46648]
[46649]
[46650]
[46651]
[46652]
[46653]
[46654]
[46655]
[46656]
[46657]
[46658]
[46659]
[46660]
[46661]
[46662]
[46663]
[46664]
[46665]
[46666]
[46667]
[46668]
[46669]
[46670]
[46671]
[46672]
[46673]
[46674]
[46675]
[46676]
[46677]
[46678]
[46679]
[46680]
[46681]
[46682]
[46683]
[46684]
[46685]
[46686]
[46687]
[46688]
[46689]
[46690]
[46691]
[46692]
[46693]
[46694]
[46695]
[46696]
[46697]
[46698]
[46699]
[46700]
[46701]
[46702]
[46703]
[46704]
[46705]
[46706]
[46707]
[46708]
[46709]
[46710]
[46711]
[46712]
[46713]
[46714]
[46715]
[46716]
[46717]
[46718]
[46719]
[46720]
[46721]
[46722]
[46723]
[46724]
[46725]
[46726]
[46727]
[46728]
[46729]
[46730]
[46731]
[46732]
[46733]
[46734]
[46735]
[46736]
[46737]
[46738]
[46739]
[46740]
[46741]
[46742]
[46743]
[46744]
[46745]
[46746]
[46747]
[46748]
[46749]
[46750]
[46751]
[46752]
[46753]
[46754]
[46755]
[46756]
[46757]
[46758]
[46759]
[46760]
[46761]
[46762]
[46763]
[46764]
[46765]
[46766]
[46767]
[46768]
[46769]
[46770]
[46771]
[46772]
[46773]
[46774]
[46775]
[46776]
[46777]
[46778]
[46779]
[46780]
[46781]
[46782]
[46783]
[46784]
[46785]
[46786]
[46787]
[46788]
[46789]
[46790]
[46791]
[46792]
[46793]
[46794]
[46795]
[46796]
[46797]
[46798]
[46799]
[46800]
[46801]
[46802]
[46803]
[46804]
[46805]
[46806]
[46807]
[46808]
[46809]
[46810]
[46811]
[46812]
[46813]
[46814]
[46815]
[46816]
[46817]
[46818]
[46819]
[46820]
[46821]
[46822]
[46823]
[46824]
[46825]
[46826]
[46827]
[46828]
[46829]
[46830]
[46831]
[46832]
[46833]
[46834]
[46835]
[46836]
[46837]
[46838]
[46839]
[46840]
[46841]
[46842]
[46843]
[46844]
[46845]
[46846]
[46847]
[46848]
[46849]
[46850]
[46851]
[46852]
[46853]
[46854]
[46855]
[46856]
[46857]
[46858]
[46859]
[46860]
[46861]
[46862]
[46863]
[46864]
[46865]
[46866]
[46867]
[46868]
[46869]
[46870]
[46871]
[46872]
[46873]
[46874]
[46875]
[46876]
[46877]
[46878]
[46879]
[46880]
[46881]
[46882]
[46883]
[46884]
[46885]
[46886]
[46887]
[46888]
[46889]
[46890]
[46891]
[46892]
[46893]
[46894]
[46895]
[46896]
[46897]
[46898]
[46899]
[46900]
[46901]
[46902]
[46903]
[46904]
[46905]
[46906]
[46907]
[46908]
[46909]
[46910]
[46911]
[46912]
[46913]
[46914]
[46915]
[46916]
[46917]
[46918]
[46919]
[46920]
[46921]
[46922]
[46923]
[46924]
[46925]
[46926]
[46927]
[46928]
[46929]
[46930]
[46931]
[46932]
[46933]
[46934]
[46935]
[46936]
[46937]
[46938]
[46939]
[46940]
[46941]
[46942]
[46943]
[46944]
[46945]
[46946]
[46947]
[46948]
[46949]
[46950]
[46951]
[46952]
[46953]
[46954]
[46955]
[46956]
[46957]
[46958]
[46959]
[46960]
[46961]
[46962]
[46963]
[46964]
[46965]
[46966]
[46967]
[46968]
[46969]
[46970]
[46971]
[46972]
[46973]
[46974]
[46975]
[46976]
[46977]
[46978]
[46979]
[46980]
[46981]
[46982]
[46983]
[46984]
[46985]
[46986]
[46987]
[46988]
[46989]
[46990]
[46991]
[46992]
[46993]
[46994]
[46995]
[46996]
[46997]
[46998]
[46999]
[47000]
[47001]
[47002]
[47003]
[47004]
[47005]
[47006]
[47007]
[47008]
[47009]
[47010]
[47011]
[47012]
[47013]
[47014]
[47015]
[47016]
[47017]
[47018]
[47019]
[47020]
[47021]
[47022]
[47023]
[47024]
[47025]
[47026]
[47027]
[47028]
[47029]
[47030]
[47031]
[47032]
[47033]
[47034]
[47035]
[47036]
[47037]
[47038]
[47039]
[47040]
[47041]
[47042]
[47043]
[47044]
[47045]
[47046]
[47047]
[47048]
[47049]
[47050]
[47051]
[47052]
[47053]
[47054]
[47055]
[47056]
[47057]
[47058]
[47059]
[47060]
[47061]
[47062]
[47063]
[47064]
[47065]
[47066]
[47067]
[47068]
[47069]
[47070]
[47071]
[47072]
[47073]
[47074]
[47075]
[47076]
[47077]
[47078]
[47079]
[47080]
[47081]
[47082]
[47083]
[47084]
[47085]
[47086]
[47087]
[47088]
[47089]
[47090]
[47091]
[47092]
[47093]
[47094]
[47095]
[47096]
[47097]
[47098]
[47099]
[47100]
[47101]
[47102]
[47103]
[47104]
[47105]
[47106]
[47107]
[47108]
[47109]
[47110]
[47111]
[47112]
[47113]
[47114]
[47115]
[47116]
[47117]
[47118]
[47119]
[47120]
[47121]
[47122]
[47123]
[47124]
[47125]
[47126]
[47127]
[47128]
[47129]
[47130]
[47131]
[47132]
[47133]
[47134]
[47135]
[47136]
[47137]
[47138]
[47139]
[47140]
[47141]
[47142]
[47143]
[47144]
[47145]
[47146]
[47147]
[47148]
[47149]
[47150]
[47151]
[47152]
[47153]
[47154]
[47155]
[47156]
[47157]
[47158]
[47159]
[47160]
[47161]
[47162]
[47163]
[47164]
[47165]
[47166]
[47167]
[47168]
[47169]
[47170]
[47171]
[47172]
[47173]
[47174]
[47175]
[47176]
[47177]
[47178]
[47179]
[47180]
[47181]
[47182]
[47183]
[47184]
[47185]
[47186]
[47187]
[47188]
[47189]
[47190]
[47191]
[47192]
[47193]
[47194]
[47195]
[47196]
[47197]
[47198]
[47199]
[47200]
[47201]
[47202]
[47203]
[47204]
[47205]
[47206]
[47207]
[47208]
[47209]
[47210]
[47211]
[47212]
[47213]
[47214]
[47215]
[47216]
[47217]
[47218]
[47219]
[47220]
[47221]
[47222]
[47223]
[47224]
[47225]
[47226]
[47227]
[47228]
[47229]
[47230]
[47231]
[47232]
[47233]
[47234]
[47235]
[47236]
[47237]
[47238]
[47239]
[47240]
[47241]
[47242]
[47243]
[47244]
[47245]
[47246]
[47247]
[47248]
[47249]
[47250]
[47251]
[47252]
[47253]
[47254]
[47255]
[47256]
[47257]
[47258]
[47259]
[47260]
[47261]
[47262]
[47263]
[47264]
[47265]
[47266]
[47267]
[47268]
[47269]
[47270]
[47271]
[47272]
[47273]
[47274]
[47275]
[47276]
[47277]
[47278]
[47279]
[47280]
[47281]
[47282]
[47283]
[47284]
[47285]
[47286]
[47287]
[47288]
[47289]
[47290]
[47291]
[47292]
[47293]
[47294]
[47295]
[47296]
[47297]
[47298]
[47299]
[47300]
[47301]
[47302]
[47303]
[47304]
[47305]
[47306]
[47307]
[47308]
[47309]
[47310]
[47311]
[47312]
[47313]
[47314]
[47315]
[47316]
[47317]
[47318]
[47319]
[47320]
[47321]
[47322]
[47323]
[47324]
[47325]
[47326]
[47327]
[47328]
[47329]
[47330]
[47331]
[47332]
[47333]
[47334]
[47335]
[47336]
[47337]
[47338]
[47339]
[47340]
[47341]
[47342]
[47343]
[47344]
[47345]
[47346]
[47347]
[47348]
[47349]
[47350]
[47351]
[47352]
[47353]
[47354]
[47355]
[47356]
[47357]
[47358]
[47359]
[47360]
[47361]
[47362]
[47363]
[47364]
[47365]
[47366]
[47367]
[47368]
[47369]
[47370]
[47371]
[47372]
[47373]
[47374]
[47375]
[47376]
[47377]
[47378]
[47379]
[47380]
[47381]
[47382]
[47383]
[47384]
[47385]
[47386]
[47387]
[47388]
[47389]
[47390]
[47391]
[47392]
[47393]
[47394]
[47395]
[47396]
[47397]
[47398]
[47399]
[47400]
[47401]
[47402]
[47403]
[47404]
[47405]
[47406]
[47407]
[47408]
[47409]
[47410]
[47411]
[47412]
[47413]
[47414]
[47415]
[47416]
[47417]
[47418]
[47419]
[47420]
[47421]
[47422]
[47423]
[47424]
[47425]
[47426]
[47427]
[47428]
[47429]
[47430]
[47431]
[47432]
[47433]
[47434]
[47435]
[47436]
[47437]
[47438]
[47439]
[47440]
[47441]
[47442]
[47443]
[47444]
[47445]
[47446]
[47447]
[47448]
[47449]
[47450]
[47451]
[47452]
[47453]
[47454]
[47455]
[47456]
[47457]
[47458]
[47459]
[47460]
[47461]
[47462]
[47463]
[47464]
[47465]
[47466]
[47467]
[47468]
[47469]
[47470]
[47471]
[47472]
[47473]
[47474]
[47475]
[47476]
[47477]
[47478]
[47479]
[47480]
[47481]
[47482]
[47483]
[47484]
[47485]
[47486]
[47487]
[47488]
[47489]
[47490]
[47491]
[47492]
[47493]
[47494]
[47495]
[47496]
[47497]
[47498]
[47499]
[47500]
[47501]
[47502]
[47503]
[47504]
[47505]
[47506]
[47507]
[47508]
[47509]
[47510]
[47511]
[47512]
[47513]
[47514]
[47515]
[47516]
[47517]
[47518]
[47519]
[47520]
[47521]
[47522]
[47523]
[47524]
[47525]
[47526]
[47527]
[47528]
[47529]
[47530]
[47531]
[47532]
[47533]
[47534]
[47535]
[47536]
[47537]
[47538]
[47539]
[47540]
[47541]
[47542]
[47543]
[47544]
[47545]
[47546]
[47547]
[47548]
[47549]
[47550]
[47551]
[47552]
[47553]
[47554]
[47555]
[47556]
[47557]
[47558]
[47559]
[47560]
[47561]
[47562]
[47563]
[47564]
[47565]
[47566]
[47567]
[47568]
[47569]
[47570]
[47571]
[47572]
[47573]
[47574]
[47575]
[47576]
[47577]
[47578]
[47579]
[47580]
[47581]
[47582]
[47583]
[47584]
[47585]
[47586]
[47587]
[47588]
[47589]
[47590]
[47591]
[47592]
[47593]
[47594]
[47595]
[47596]
[47597]
[47598]
[47599]
[47600]
[47601]
[47602]
[47603]
[47604]
[47605]
[47606]
[47607]
[47608]
[47609]
[47610]
[47611]
[47612]
[47613]
[47614]
[47615]
[47616]
[47617]
[47618]
[47619]
[47620]
[47621]
[47622]
[47623]
[47624]
[47625]
[47626]
[47627]
[47628]
[47629]
[47630]
[47631]
[47632]
[47633]
[47634]
[47635]
[47636]
[47637]
[47638]
[47639]
[47640]
[47641]
[47642]
[47643]
[47644]
[47645]
[47646]
[47647]
[47648]
[47649]
[47650]
[47651]
[47652]
[47653]
[47654]
[47655]
[47656]
[47657]
[47658]
[47659]
[47660]
[47661]
[47662]
[47663]
[47664]
[47665]
[47666]
[47667]
[47668]
[47669]
[47670]
[47671]
[47672]
[47673]
[47674]
[47675]
[47676]
[47677]
[47678]
[47679]
[47680]
[47681]
[47682]
[47683]
[47684]
[47685]
[47686]
[47687]
[47688]
[47689]
[47690]
[47691]
[47692]
[47693]
[47694]
[47695]
[47696]
[47697]
[47698]
[47699]
[47700]
[47701]
[47702]
[47703]
[47704]
[47705]
[47706]
[47707]
[47708]
[47709]
[47710]
[47711]
[47712]
[47713]
[47714]
[47715]
[47716]
[47717]
[47718]
[47719]
[47720]
[47721]
[47722]
[47723]
[47724]
[47725]
[47726]
[47727]
[47728]
[47729]
[47730]
[47731]
[47732]
[47733]
[47734]
[47735]
[47736]
[47737]
[47738]
[47739]
[47740]
[47741]
[47742]
[47743]
[47744]
[47745]
[47746]
[47747]
[47748]
[47749]
[47750]
[47751]
[47752]
[47753]
[47754]
[47755]
[47756]
[47757]
[47758]
[47759]
[47760]
[47761]
[47762]
[47763]
[47764]
[47765]
[47766]
[47767]
[47768]
[47769]
[47770]
[47771]
[47772]
[47773]
[47774]
[47775]
[47776]
[47777]
[47778]
[47779]
[47780]
[47781]
[47782]
[47783]
[47784]
[47785]
[47786]
[47787]
[47788]
[47789]
[47790]
[47791]
[47792]
[47793]
[47794]
[47795]
[47796]
[47797]
[47798]
[47799]
[47800]
[47801]
[47802]
[47803]
[47804]
[47805]
[47806]
[47807]
[47808]
[47809]
[47810]
[47811]
[47812]
[47813]
[47814]
[47815]
[47816]
[47817]
[47818]
[47819]
[47820]
[47821]
[47822]
[47823]
[47824]
[47825]
[47826]
[47827]
[47828]
[47829]
[47830]
[47831]
[47832]
[47833]
[47834]
[47835]
[47836]
[47837]
[47838]
[47839]
[47840]
[47841]
[47842]
[47843]
[47844]
[47845]
[47846]
[47847]
[47848]
[47849]
[47850]
[47851]
[47852]
[47853]
[47854]
[47855]
[47856]
[47857]
[47858]
[47859]
[47860]
[47861]
[47862]
[47863]
[47864]
[47865]
[47866]
[47867]
[47868]
[47869]
[47870]
[47871]
[47872]
[47873]
[47874]
[47875]
[47876]
[47877]
[47878]
[47879]
[47880]
[47881]
[47882]
[47883]
[47884]
[47885]
[47886]
[47887]
[47888]
[47889]
[47890]
[47891]
[47892]
[47893]
[47894]
[47895]
[47896]
[47897]
[47898]
[47899]
[47900]
[47901]
[47902]
[47903]
[47904]
[47905]
[47906]
[47907]
[47908]
[47909]
[47910]
[47911]
[47912]
[47913]
[47914]
[47915]
[47916]
[47917]
[47918]
[47919]
[47920]
[47921]
[47922]
[47923]
[47924]
[47925]
[47926]
[47927]
[47928]
[47929]
[47930]
[47931]
[47932]
[47933]
[47934]
[47935]
[47936]
[47937]
[47938]
[47939]
[47940]
[47941]
[47942]
[47943]
[47944]
[47945]
[47946]
[47947]
[47948]
[47949]
[47950]
[47951]
[47952]
[47953]
[47954]
[47955]
[47956]
[47957]
[47958]
[47959]
[47960]
[47961]
[47962]
[47963]
[47964]
[47965]
[47966]
[47967]
[47968]
[47969]
[47970]
[47971]
[47972]
[47973]
[47974]
[47975]
[47976]
[47977]
[47978]
[47979]
[47980]
[47981]
[47982]
[47983]
[47984]
[47985]
[47986]
[47987]
[47988]
[47989]
[47990]
[47991]
[47992]
[47993]
[47994]
[47995]
[47996]
[47997]
[47998]
[47999]
[48000]
[48001]
[48002]
[48003]
[48004]
[48005]
[48006]
[48007]
[48008]
[48009]
[48010]
[48011]
[48012]
[48013]
[48014]
[48015]
[48016]
[48017]
[48018]
[48019]
[48020]
[48021]
[48022]
[48023]
[48024]
[48025]
[48026]
[48027]
[48028]
[48029]
[48030]
[48031]
[48032]
[48033]
[48034]
[48035]
[48036]
[48037]
[48038]
[48039]
[48040]
[48041]
[48042]
[48043]
[48044]
[48045]
[48046]
[48047]
[48048]
[48049]
[48050]
[48051]
[48052]
[48053]
[48054]
[48055]
[48056]
[48057]
[48058]
[48059]
[48060]
[48061]
[48062]
[48063]
[48064]
[48065]
[48066]
[48067]
[48068]
[48069]
[48070]
[48071]
[48072]
[48073]
[48074]
[48075]
[48076]
[48077]
[48078]
[48079]
[48080]
[48081]
[48082]
[48083]
[48084]
[48085]
[48086]
[48087]
[48088]
[48089]
[48090]
[48091]
[48092]
[48093]
[48094]
[48095]
[48096]
[48097]
[48098]
[48099]
[48100]
[48101]
[48102]
[48103]
[48104]
[48105]
[48106]
[48107]
[48108]
[48109]
[48110]
[48111]
[48112]
[48113]
[48114]
[48115]
[48116]
[48117]
[48118]
[48119]
[48120]
[48121]
[48122]
[48123]
[48124]
[48125]
[48126]
[48127]
[48128]
[48129]
[48130]
[48131]
[48132]
[48133]
[48134]
[48135]
[48136]
[48137]
[48138]
[48139]
[48140]
[48141]
[48142]
[48143]
[48144]
[48145]
[48146]
[48147]
[48148]
[48149]
[48150]
[48151]
[48152]
[48153]
[48154]
[48155]
[48156]
[48157]
[48158]
[48159]
[48160]
[48161]
[48162]
[48163]
[48164]
[48165]
[48166]
[48167]
[48168]
[48169]
[48170]
[48171]
[48172]
[48173]
[48174]
[48175]
[48176]
[48177]
[48178]
[48179]
[48180]
[48181]
[48182]
[48183]
[48184]
[48185]
[48186]
[48187]
[48188]
[48189]
[48190]
[48191]
[48192]
[48193]
[48194]
[48195]
[48196]
[48197]
[48198]
[48199]
[48200]
[48201]
[48202]
[48203]
[48204]
[48205]
[48206]
[48207]
[48208]
[48209]
[48210]
[48211]
[48212]
[48213]
[48214]
[48215]
[48216]
[48217]
[48218]
[48219]
[48220]
[48221]
[48222]
[48223]
[48224]
[48225]
[48226]
[48227]
[48228]
[48229]
[48230]
[48231]
[48232]
[48233]
[48234]
[48235]
[48236]
[48237]
[48238]
[48239]
[48240]
[48241]
[48242]
[48243]
[48244]
[48245]
[48246]
[48247]
[48248]
[48249]
[48250]
[48251]
[48252]
[48253]
[48254]
[48255]
[48256]
[48257]
[48258]
[48259]
[48260]
[48261]
[48262]
[48263]
[48264]
[48265]
[48266]
[48267]
[48268]
[48269]
[48270]
[48271]
[48272]
[48273]
[48274]
[48275]
[48276]
[48277]
[48278]
[48279]
[48280]
[48281]
[48282]
[48283]
[48284]
[48285]
[48286]
[48287]
[48288]
[48289]
[48290]
[48291]
[48292]
[48293]
[48294]
[48295]
[48296]
[48297]
[48298]
[48299]
[48300]
[48301]
[48302]
[48303]
[48304]
[48305]
[48306]
[48307]
[48308]
[48309]
[48310]
[48311]
[48312]
[48313]
[48314]
[48315]
[48316]
[48317]
[48318]
[48319]
[48320]
[48321]
[48322]
[48323]
[48324]
[48325]
[48326]
[48327]
[48328]
[48329]
[48330]
[48331]
[48332]
[48333]
[48334]
[48335]
[48336]
[48337]
[48338]
[48339]
[48340]
[48341]
[48342]
[48343]
[48344]
[48345]
[48346]
[48347]
[48348]
[48349]
[48350]
[48351]
[48352]
[48353]
[48354]
[48355]
[48356]
[48357]
[48358]
[48359]
[48360]
[48361]
[48362]
[48363]
[48364]
[48365]
[48366]
[48367]
[48368]
[48369]
[48370]
[48371]
[48372]
[48373]
[48374]
[48375]
[48376]
[48377]
[48378]
[48379]
[48380]
[48381]
[48382]
[48383]
[48384]
[48385]
[48386]
[48387]
[48388]
[48389]
[48390]
[48391]
[48392]
[48393]
[48394]
[48395]
[48396]
[48397]
[48398]
[48399]
[48400]
[48401]
[48402]
[48403]
[48404]
[48405]
[48406]
[48407]
[48408]
[48409]
[48410]
[48411]
[48412]
[48413]
[48414]
[48415]
[48416]
[48417]
[48418]
[48419]
[48420]
[48421]
[48422]
[48423]
[48424]
[48425]
[48426]
[48427]
[48428]
[48429]
[48430]
[48431]
[48432]
[48433]
[48434]
[48435]
[48436]
[48437]
[48438]
[48439]
[48440]
[48441]
[48442]
[48443]
[48444]
[48445]
[48446]
[48447]
[48448]
[48449]
[48450]
[48451]
[48452]
[48453]
[48454]
[48455]
[48456]
[48457]
[48458]
[48459]
[48460]
[48461]
[48462]
[48463]
[48464]
[48465]
[48466]
[48467]
[48468]
[48469]
[48470]
[48471]
[48472]
[48473]
[48474]
[48475]
[48476]
[48477]
[48478]
[48479]
[48480]
[48481]
[48482]
[48483]
[48484]
[48485]
[48486]
[48487]
[48488]
[48489]
[48490]
[48491]
[48492]
[48493]
[48494]
[48495]
[48496]
[48497]
[48498]
[48499]
[48500]
[48501]
[48502]
[48503]
[48504]
[48505]
[48506]
[48507]
[48508]
[48509]
[48510]
[48511]
[48512]
[48513]
[48514]
[48515]
[48516]
[48517]
[48518]
[48519]
[48520]
[48521]
[48522]
[48523]
[48524]
[48525]
[48526]
[48527]
[48528]
[48529]
[48530]
[48531]
[48532]
[48533]
[48534]
[48535]
[48536]
[48537]
[48538]
[48539]
[48540]
[48541]
[48542]
[48543]
[48544]
[48545]
[48546]
[48547]
[48548]
[48549]
[48550]
[48551]
[48552]
[48553]
[48554]
[48555]
[48556]
[48557]
[48558]
[48559]
[48560]
[48561]
[48562]
[48563]
[48564]
[48565]
[48566]
[48567]
[48568]
[48569]
[48570]
[48571]
[48572]
[48573]
[48574]
[48575]
[48576]
[48577]
[48578]
[48579]
[48580]
[48581]
[48582]
[48583]
[48584]
[48585]
[48586]
[48587]
[48588]
[48589]
[48590]
[48591]
[48592]
[48593]
[48594]
[48595]
[48596]
[48597]
[48598]
[48599]
[48600]
[48601]
[48602]
[48603]
[48604]
[48605]
[48606]
[48607]
[48608]
[48609]
[48610]
[48611]
[48612]
[48613]
[48614]
[48615]
[48616]
[48617]
[48618]
[48619]
[48620]
[48621]
[48622]
[48623]
[48624]
[48625]
[48626]
[48627]
[48628]
[48629]
[48630]
[48631]
[48632]
[48633]
[48634]
[48635]
[48636]
[48637]
[48638]
[48639]
[48640]
[48641]
[48642]
[48643]
[48644]
[48645]
[48646]
[48647]
[48648]
[48649]
[48650]
[48651]
[48652]
[48653]
[48654]
[48655]
[48656]
[48657]
[48658]
[48659]
[48660]
[48661]
[48662]
[48663]
[48664]
[48665]
[48666]
[48667]
[48668]
[48669]
[48670]
[48671]
[48672]
[48673]
[48674]
[48675]
[48676]
[48677]
[48678]
[48679]
[48680]
[48681]
[48682]
[48683]
[48684]
[48685]
[48686]
[48687]
[48688]
[48689]
[48690]
[48691]
[48692]
[48693]
[48694]
[48695]
[48696]
[48697]
[48698]
[48699]
[48700]
[48701]
[48702]
[48703]
[48704]
[48705]
[48706]
[48707]
[48708]
[48709]
[48710]
[48711]
[48712]
[48713]
[48714]
[48715]
[48716]
[48717]
[48718]
[48719]
[48720]
[48721]
[48722]
[48723]
[48724]
[48725]
[48726]
[48727]
[48728]
[48729]
[48730]
[48731]
[48732]
[48733]
[48734]
[48735]
[48736]
[48737]
[48738]
[48739]
[48740]
[48741]
[48742]
[48743]
[48744]
[48745]
[48746]
[48747]
[48748]
[48749]
[48750]
[48751]
[48752]
[48753]
[48754]
[48755]
[48756]
[48757]
[48758]
[48759]
[48760]
[48761]
[48762]
[48763]
[48764]
[48765]
[48766]
[48767]
[48768]
[48769]
[48770]
[48771]
[48772]
[48773]
[48774]
[48775]
[48776]
[48777]
[48778]
[48779]
[48780]
[48781]
[48782]
[48783]
[48784]
[48785]
[48786]
[48787]
[48788]
[48789]
[48790]
[48791]
[48792]
[48793]
[48794]
[48795]
[48796]
[48797]
[48798]
[48799]
[48800]
[48801]
[48802]
[48803]
[48804]
[48805]
[48806]
[48807]
[48808]
[48809]
[48810]
[48811]
[48812]
[48813]
[48814]
[48815]
[48816]
[48817]
[48818]
[48819]
[48820]
[48821]
[48822]
[48823]
[48824]
[48825]
[48826]
[48827]
[48828]
[48829]
[48830]
[48831]
[48832]
[48833]
[48834]
[48835]
[48836]
[48837]
[48838]
[48839]
[48840]
[48841]
[48842]
[48843]
[48844]
[48845]
[48846]
[48847]
[48848]
[48849]
[48850]
[48851]
[48852]
[48853]
[48854]
[48855]
[48856]
[48857]
[48858]
[48859]
[48860]
[48861]
[48862]
[48863]
[48864]
[48865]
[48866]
[48867]
[48868]
[48869]
[48870]
[48871]
[48872]
[48873]
[48874]
[48875]
[48876]
[48877]
[48878]
[48879]
[48880]
[48881]
[48882]
[48883]
[48884]
[48885]
[48886]
[48887]
[48888]
[48889]
[48890]
[48891]
[48892]
[48893]
[48894]
[48895]
[48896]
[48897]
[48898]
[48899]
[48900]
[48901]
[48902]
[48903]
[48904]
[48905]
[48906]
[48907]
[48908]
[48909]
[48910]
[48911]
[48912]
[48913]
[48914]
[48915]
[48916]
[48917]
[48918]
[48919]
[48920]
[48921]
[48922]
[48923]
[48924]
[48925]
[48926]
[48927]
[48928]
[48929]
[48930]
[48931]
[48932]
[48933]
[48934]
[48935]
[48936]
[48937]
[48938]
[48939]
[48940]
[48941]
[48942]
[48943]
[48944]
[48945]
[48946]
[48947]
[48948]
[48949]
[48950]
[48951]
[48952]
[48953]
[48954]
[48955]
[48956]
[48957]
[48958]
[48959]
[48960]
[48961]
[48962]
[48963]
[48964]
[48965]
[48966]
[48967]
[48968]
[48969]
[48970]
[48971]
[48972]
[48973]
[48974]
[48975]
[48976]
[48977]
[48978]
[48979]
[48980]
[48981]
[48982]
[48983]
[48984]
[48985]
[48986]
[48987]
[48988]
[48989]
[48990]
[48991]
[48992]
[48993]
[48994]
[48995]
[48996]
[48997]
[48998]
[48999]
[49000]
[49001]
[49002]
[49003]
[49004]
[49005]
[49006]
[49007]
[49008]
[49009]
[49010]
[49011]
[49012]
[49013]
[49014]
[49015]
[49016]
[49017]
[49018]
[49019]
[49020]
[49021]
[49022]
[49023]
[49024]
[49025]
[49026]
[49027]
[49028]
[49029]
[49030]
[49031]
[49032]
[49033]
[49034]
[49035]
[49036]
[49037]
[49038]
[49039]
[49040]
[49041]
[49042]
[49043]
[49044]
[49045]
[49046]
[49047]
[49048]
[49049]
[49050]
[49051]
[49052]
[49053]
[49054]
[49055]
[49056]
[49057]
[49058]
[49059]
[49060]
[49061]
[49062]
[49063]
[49064]
[49065]
[49066]
[49067]
[49068]
[49069]
[49070]
[49071]
[49072]
[49073]
[49074]
[49075]
[49076]
[49077]
[49078]
[49079]
[49080]
[49081]
[49082]
[49083]
[49084]
[49085]
[49086]
[49087]
[49088]
[49089]
[49090]
[49091]
[49092]
[49093]
[49094]
[49095]
[49096]
[49097]
[49098]
[49099]
[49100]
[49101]
[49102]
[49103]
[49104]
[49105]
[49106]
[49107]
[49108]
[49109]
[49110]
[49111]
[49112]
[49113]
[49114]
[49115]
[49116]
[49117]
[49118]
[49119]
[49120]
[49121]
[49122]
[49123]
[49124]
[49125]
[49126]
[49127]
[49128]
[49129]
[49130]
[49131]
[49132]
[49133]
[49134]
[49135]
[49136]
[49137]
[49138]
[49139]
[49140]
[49141]
[49142]
[49143]
[49144]
[49145]
[49146]
[49147]
[49148]
[49149]
[49150]
[49151]
[49152]
[49153]
[49154]
[49155]
[49156]
[49157]
[49158]
[49159]
[49160]
[49161]
[49162]
[49163]
[49164]
[49165]
[49166]
[49167]
[49168]
[49169]
[49170]
[49171]
[49172]
[49173]
[49174]
[49175]
[49176]
[49177]
[49178]
[49179]
[49180]
[49181]
[49182]
[49183]
[49184]
[49185]
[49186]
[49187]
[49188]
[49189]
[49190]
[49191]
[49192]
[49193]
[49194]
[49195]
[49196]
[49197]
[49198]
[49199]
[49200]
[49201]
[49202]
[49203]
[49204]
[49205]
[49206]
[49207]
[49208]
[49209]
[49210]
[49211]
[49212]
[49213]
[49214]
[49215]
[49216]
[49217]
[49218]
[49219]
[49220]
[49221]
[49222]
[49223]
[49224]
[49225]
[49226]
[49227]
[49228]
[49229]
[49230]
[49231]
[49232]
[49233]
[49234]
[49235]
[49236]
[49237]
[49238]
[49239]
[49240]
[49241]
[49242]
[49243]
[49244]
[49245]
[49246]
[49247]
[49248]
[49249]
[49250]
[49251]
[49252]
[49253]
[49254]
[49255]
[49256]
[49257]
[49258]
[49259]
[49260]
[49261]
[49262]
[49263]
[49264]
[49265]
[49266]
[49267]
[49268]
[49269]
[49270]
[49271]
[49272]
[49273]
[49274]
[49275]
[49276]
[49277]
[49278]
[49279]
[49280]
[49281]
[49282]
[49283]
[49284]
[49285]
[49286]
[49287]
[49288]
[49289]
[49290]
[49291]
[49292]
[49293]
[49294]
[49295]
[49296]
[49297]
[49298]
[49299]
[49300]
[49301]
[49302]
[49303]
[49304]
[49305]
[49306]
[49307]
[49308]
[49309]
[49310]
[49311]
[49312]
[49313]
[49314]
[49315]
[49316]
[49317]
[49318]
[49319]
[49320]
[49321]
[49322]
[49323]
[49324]
[49325]
[49326]
[49327]
[49328]
[49329]
[49330]
[49331]
[49332]
[49333]
[49334]
[49335]
[49336]
[49337]
[49338]
[49339]
[49340]
[49341]
[49342]
[49343]
[49344]
[49345]
[49346]
[49347]
[49348]
[49349]
[49350]
[49351]
[49352]
[49353]
[49354]
[49355]
[49356]
[49357]
[49358]
[49359]
[49360]
[49361]
[49362]
[49363]
[49364]
[49365]
[49366]
[49367]
[49368]
[49369]
[49370]
[49371]
[49372]
[49373]
[49374]
[49375]
[49376]
[49377]
[49378]
[49379]
[49380]
[49381]
[49382]
[49383]
[49384]
[49385]
[49386]
[49387]
[49388]
[49389]
[49390]
[49391]
[49392]
[49393]
[49394]
[49395]
[49396]
[49397]
[49398]
[49399]
[49400]
[49401]
[49402]
[49403]
[49404]
[49405]
[49406]
[49407]
[49408]
[49409]
[49410]
[49411]
[49412]
[49413]
[49414]
[49415]
[49416]
[49417]
[49418]
[49419]
[49420]
[49421]
[49422]
[49423]
[49424]
[49425]
[49426]
[49427]
[49428]
[49429]
[49430]
[49431]
[49432]
[49433]
[49434]
[49435]
[49436]
[49437]
[49438]
[49439]
[49440]
[49441]
[49442]
[49443]
[49444]
[49445]
[49446]
[49447]
[49448]
[49449]
[49450]
[49451]
[49452]
[49453]
[49454]
[49455]
[49456]
[49457]
[49458]
[49459]
[49460]
[49461]
[49462]
[49463]
[49464]
[49465]
[49466]
[49467]
[49468]
[49469]
[49470]
[49471]
[49472]
[49473]
[49474]
[49475]
[49476]
[49477]
[49478]
[49479]
[49480]
[49481]
[49482]
[49483]
[49484]
[49485]
[49486]
[49487]
[49488]
[49489]
[49490]
[49491]
[49492]
[49493]
[49494]
[49495]
[49496]
[49497]
[49498]
[49499]
[49500]
[49501]
[49502]
[49503]
[49504]
[49505]
[49506]
[49507]
[49508]
[49509]
[49510]
[49511]
[49512]
[49513]
[49514]
[49515]
[49516]
[49517]
[49518]
[49519]
[49520]
[49521]
[49522]
[49523]
[49524]
[49525]
[49526]
[49527]
[49528]
[49529]
[49530]
[49531]
[49532]
[49533]
[49534]
[49535]
[49536]
[49537]
[49538]
[49539]
[49540]
[49541]
[49542]
[49543]
[49544]
[49545]
[49546]
[49547]
[49548]
[49549]
[49550]
[49551]
[49552]
[49553]
[49554]
[49555]
[49556]
[49557]
[49558]
[49559]
[49560]
[49561]
[49562]
[49563]
[49564]
[49565]
[49566]
[49567]
[49568]
[49569]
[49570]
[49571]
[49572]
[49573]
[49574]
[49575]
[49576]
[49577]
[49578]
[49579]
[49580]
[49581]
[49582]
[49583]
[49584]
[49585]
[49586]
[49587]
[49588]
[49589]
[49590]
[49591]
[49592]
[49593]
[49594]
[49595]
[49596]
[49597]
[49598]
[49599]
[49600]
[49601]
[49602]
[49603]
[49604]
[49605]
[49606]
[49607]
[49608]
[49609]
[49610]
[49611]
[49612]
[49613]
[49614]
[49615]
[49616]
[49617]
[49618]
[49619]
[49620]
[49621]
[49622]
[49623]
[49624]
[49625]
[49626]
[49627]
[49628]
[49629]
[49630]
[49631]
[49632]
[49633]
[49634]
[49635]
[49636]
[49637]
[49638]
[49639]
[49640]
[49641]
[49642]
[49643]
[49644]
[49645]
[49646]
[49647]
[49648]
[49649]
[49650]
[49651]
[49652]
[49653]
[49654]
[49655]
[49656]
[49657]
[49658]
[49659]
[49660]
[49661]
[49662]
[49663]
[49664]
[49665]
[49666]
[49667]
[49668]
[49669]
[49670]
[49671]
[49672]
[49673]
[49674]
[49675]
[49676]
[49677]
[49678]
[49679]
[49680]
[49681]
[49682]
[49683]
[49684]
[49685]
[49686]
[49687]
[49688]
[49689]
[49690]
[49691]
[49692]
[49693]
[49694]
[49695]
[49696]
[49697]
[49698]
[49699]
[49700]
[49701]
[49702]
[49703]
[49704]
[49705]
[49706]
[49707]
[49708]
[49709]
[49710]
[49711]
[49712]
[49713]
[49714]
[49715]
[49716]
[49717]
[49718]
[49719]
[49720]
[49721]
[49722]
[49723]
[49724]
[49725]
[49726]
[49727]
[49728]
[49729]
[49730]
[49731]
[49732]
[49733]
[49734]
[49735]
[49736]
[49737]
[49738]
[49739]
[49740]
[49741]
[49742]
[49743]
[49744]
[49745]
[49746]
[49747]
[49748]
[49749]
[49750]
[49751]
[49752]
[49753]
[49754]
[49755]
[49756]
[49757]
[49758]
[49759]
[49760]
[49761]
[49762]
[49763]
[49764]
[49765]
[49766]
[49767]
[49768]
[49769]
[49770]
[49771]
[49772]
[49773]
[49774]
[49775]
[49776]
[49777]
[49778]
[49779]
[49780]
[49781]
[49782]
[49783]
[49784]
[49785]
[49786]
[49787]
[49788]
[49789]
[49790]
[49791]
[49792]
[49793]
[49794]
[49795]
[49796]
[49797]
[49798]
[49799]
[49800]
[49801]
[49802]
[49803]
[49804]
[49805]
[49806]
[49807]
[49808]
[49809]
[49810]
[49811]
[49812]
[49813]
[49814]
[49815]
[49816]
[49817]
[49818]
[49819]
[49820]
[49821]
[49822]
[49823]
[49824]
[49825]
[49826]
[49827]
[49828]
[49829]
[49830]
[49831]
[49832]
[49833]
[49834]
[49835]
[49836]
[49837]
[49838]
[49839]
[49840]
[49841]
[49842]
[49843]
[49844]
[49845]
[49846]
[49847]
[49848]
[49849]
[49850]
[49851]
[49852]
[49853]
[49854]
[49855]
[49856]
[49857]
[49858]
[49859]
[49860]
[49861]
[49862]
[49863]
[49864]
[49865]
[49866]
[49867]
[49868]
[49869]
[49870]
[49871]
[49872]
[49873]
[49874]
[49875]
[49876]
[49877]
[49878]
[49879]
[49880]
[49881]
[49882]
[49883]
[49884]
[49885]
[49886]
[49887]
[49888]
[49889]
[49890]
[49891]
[49892]
[49893]
[49894]
[49895]
[49896]
[49897]
[49898]
[49899]
[49900]
[49901]
[49902]
[49903]
[49904]
[49905]
[49906]
[49907]
[49908]
[49909]
[49910]
[49911]
[49912]
[49913]
[49914]
[49915]
[49916]
[49917]
[49918]
[49919]
[49920]
[49921]
[49922]
[49923]
[49924]
[49925]
[49926]
[49927]
[49928]
[49929]
[49930]
[49931]
[49932]
[49933]
[49934]
[49935]
[49936]
[49937]
[49938]
[49939]
[49940]
[49941]
[49942]
[49943]
[49944]
[49945]
[49946]
[49947]
[49948]
[49949]
[49950]
[49951]
[49952]
[49953]
[49954]
[49955]
[49956]
[49957]
[49958]
[49959]
[49960]
[49961]
[49962]
[49963]
[49964]
[49965]
[49966]
[49967]
[49968]
[49969]
[49970]
[49971]
[49972]
[49973]
[49974]
[49975]
[49976]
[49977]
[49978]
[49979]
[49980]
[49981]
[49982]
[49983]
[49984]
[49985]
[49986]
[49987]
[49988]
[49989]
[49990]
[49991]
[49992]
[49993]
[49994]
[49995]
[49996]
[49997]
[49998]
[49999]

{"sheet":"782an","index":13,"n_rows":10001,"n_cols":4,"rows_kept":10001,"cut":false,"hidden":false,"merged":[]}
["value","T/F?",null,"Find any number with 4, 2, 3"]
[40000,{"$f":"ISNUMBER(SEARCH(\"*4*2*3*\",A2))","v":false},null,"Examples: 42300, 49923, 40203, 43323"]
[40231,{"$f":"ISNUMBER(SEARCH(\"*4*2*3*\",A3))","v":true}]
[40002,false,null,"Count"]
[40003,false,null,{"$f":"SUMPRODUCT(--ISNUMBER(SEARCH(\"*4*2*3*\",A2:A10001)))","v":524}]
[40004,false]
[40005,false,null,{"$f":"COUNTIF(B2:B10001,TRUE)","v":524}]
[40006,false]
[40007,false]
[40008,false]
[40009,false]
[40010,false]
[40011,false]
[40012,false]
[40013,false]
[40014,false]
[40015,false]
[40016,false]
[40017,false]
[40018,false]
[40019,false]
[40020,false]
[40021,false]
[40022,false]
[40023,true]
[40024,false]
[40025,false]
[40026,false]
[40027,false]
[40028,false]
[40029,false]
[40030,false]
[40031,false]
[40032,false]
[40033,false]
[40034,false]
[40035,false]
[40036,false]
[40037,false]
[40038,false]
[40039,false]
[40040,false]
[40041,false]
[40042,false]
[40043,false]
[40044,false]
[40045,false]
[40046,false]
[40047,false]
[40048,false]
[40049,false]
[40050,false]
[40051,false]
[40052,false]
[40053,false]
[40054,false]
[40055,false]
[40056,false]
[40057,false]
[40058,false]
[40059,false]
[40060,false]
[40061,false]
[40062,false]
[40063,false]
[40064,false]
[40065,{"$f":"ISNUMBER(SEARCH(\"*4*2*3*\",A67))","v":false}]
[40066,false]
[40067,false]
[40068,false]
[40069,false]
[40070,false]
[40071,false]
[40072,false]
[40073,false]
[40074,false]
[40075,false]
[40076,false]
[40077,false]
[40078,false]
[40079,false]
[40080,false]
[40081,false]
[40082,false]
[40083,false]
[40084,false]
[40085,false]
[40086,false]
[40087,false]
[40088,false]
[40089,false]
[40090,false]
[40091,false]
[40092,false]
[40093,false]
[40094,false]
[40095,false]
[40096,false]
[40097,false]
[40098,false]
[40099,false]
[40100,false]
[40101,false]
[40102,false]
[40103,false]
[40104,false]
[40105,false]
[40106,false]
[40107,false]
[40108,false]
[40109,false]
[40110,false]
[40111,false]
[40112,false]
[40113,false]
[40114,false]
[40115,false]
[40116,false]
[40117,false]
[40118,false]
[40119,false]
[40120,false]
[40121,false]
[40122,false]
[40123,true]
[40124,false]
[40125,false]
[40126,false]
[40127,false]
[40128,false]
[40129,{"$f":"ISNUMBER(SEARCH(\"*4*2*3*\",A131))","v":false}]
[40130,false]
[40131,false]
[40132,false]
[40133,false]
[40134,false]
[40135,false]
[40136,false]
[40137,false]
[40138,false]
[40139,false]
[40140,false]
[40141,false]
[40142,false]
[40143,false]
[40144,false]
[40145,false]
[40146,false]
[40147,false]
[40148,false]
[40149,false]
[40150,false]
[40151,false]
[40152,false]
[40153,false]
[40154,false]
[40155,false]
[40156,false]
[40157,false]
[40158,false]
[40159,false]
[40160,false]
[40161,false]
[40162,false]
[40163,false]
[40164,false]
[40165,false]
[40166,false]
[40167,false]
[40168,false]
[40169,false]
[40170,false]
[40171,false]
[40172,false]
[40173,false]
[40174,false]
[40175,false]
[40176,false]
[40177,false]
[40178,false]
[40179,false]
[40180,false]
[40181,false]
[40182,false]
[40183,false]
[40184,false]
[40185,false]
[40186,false]
[40187,false]
[40188,false]
[40189,false]
[40190,false]
[40191,false]
[40192,false]
[40193,{"$f":"ISNUMBER(SEARCH(\"*4*2*3*\",A195))","v":false}]
[40194,false]
[40195,false]
[40196,false]
[40197,false]
[40198,false]
[40199,false]
[40200,false]
[40201,false]
[40202,false]
[40203,true]
[40204,false]
[40205,false]
[40206,false]
[40207,false]
[40208,false]
[40209,false]
[40210,false]
[40211,false]
[40212,false]
[40213,true]
[40214,false]
[40215,false]
[40216,false]
[40217,false]
[40218,false]
[40219,false]
[40220,false]
[40221,false]
[40222,false]
[40223,true]
[40224,false]
[40225,false]
[40226,false]
[40227,false]
[40228,false]
[40229,false]
[40230,true]
[40231,true]
[40232,true]
[40233,true]
[40234,true]
[40235,true]
[40236,true]
[40237,true]
[40238,true]
[40239,true]
[40240,false]
[40241,false]
[40242,false]
[40243,true]
[40244,false]
[40245,false]
[40246,false]
[40247,false]
[40248,false]
[40249,false]
[40250,false]
[40251,false]
[40252,false]
[40253,true]
[40254,false]
[40255,false]
[40256,false]
[40257,{"$f":"ISNUMBER(SEARCH(\"*4*2*3*\",A259))","v":false}]
[40258,false]
[40259,false]
[40260,false]
[40261,false]
[40262,false]
[40263,true]
[40264,false]
[40265,false]
[40266,false]
[40267,false]
[40268,false]
[40269,false]
[40270,false]
[40271,false]
[40272,false]
[40273,true]
[40274,false]
[40275,false]
[40276,false]
[40277,false]
[40278,false]
[40279,false]
[40280,false]
[40281,false]
[40282,false]
[40283,true]
[40284,false]
[40285,false]
[40286,false]
[40287,false]
[40288,false]
[40289,false]
[40290,false]
[40291,false]
[40292,false]
[40293,true]
[40294,false]
[40295,false]
[40296,false]
[40297,false]
[40298,false]
[40299,false]
[40300,false]
[40301,false]
[40302,false]
[40303,false]
[40304,false]
[40305,false]
[40306,false]
[40307,false]
[40308,false]
[40309,false]
[40310,false]
[40311,false]
[40312,false]
[40313,false]
[40314,false]
[40315,false]
[40316,false]
[40317,false]
[40318,false]
[40319,false]
[40320,false]
[40321,{"$f":"ISNUMBER(SEARCH(\"*4*2*3*\",A323))","v":false}]
[40322,false]
[40323,true]
[40324,false]
[40325,false]
[40326,false]
[40327,false]
[40328,false]
[40329,false]
[40330,false]
[40331,false]
[40332,false]
[40333,false]
[40334,false]
[40335,false]
[40336,false]
[40337,false]
[40338,false]
[40339,false]
[40340,false]
[40341,false]
[40342,false]
[40343,false]
[40344,false]
[40345,false]
[40346,false]
[40347,false]
[40348,false]
[40349,false]
[40350,false]
[40351,false]
[40352,false]
[40353,false]
[40354,false]
[40355,false]
[40356,false]
[40357,false]
[40358,false]
[40359,false]
[40360,false]
[40361,false]
[40362,false]
[40363,false]
[40364,false]
[40365,false]
[40366,false]
[40367,false]
[40368,false]
[40369,false]
[40370,false]
[40371,false]
[40372,false]
[40373,false]
[40374,false]
[40375,false]
[40376,false]
[40377,false]
[40378,false]
[40379,false]
[40380,false]
[40381,false]
[40382,false]
[40383,false]
[40384,false]
[40385,{"$f":"ISNUMBER(SEARCH(\"*4*2*3*\",A387))","v":false}]
[40386,false]
[40387,false]
[40388,false]
[40389,false]
[40390,false]
[40391,false]
[40392,false]
[40393,false]
[40394,false]
[40395,false]
[40396,false]
[40397,false]
[40398,false]
[40399,false]
[40400,false]
[40401,false]
[40402,false]
[40403,false]
[40404,false]
[40405,false]
[40406,false]
[40407,false]
[40408,false]
[40409,false]
[40410,false]
[40411,false]
[40412,false]
[40413,false]
[40414,false]
[40415,false]
[40416,false]
[40417,false]
[40418,false]
[40419,false]
[40420,false]
[40421,false]
[40422,false]
[40423,true]
[40424,false]
[40425,false]
[40426,false]
[40427,false]
[40428,false]
[40429,false]
[40430,false]
[40431,false]
[40432,false]
[40433,false]
[40434,false]
[40435,false]
[40436,false]
[40437,false]
[40438,false]
[40439,false]
[40440,false]
[40441,false]
[40442,false]
[40443,false]
[40444,false]
[40445,false]
[40446,false]
[40447,false]
[40448,false]
[40449,{"$f":"ISNUMBER(SEARCH(\"*4*2*3*\",A451))","v":false}]
[40450,false]
[40451,false]
[40452,false]
[40453,false]
[40454,false]
[40455,false]
[40456,false]
[40457,false]
[40458,false]
[40459,false]
[40460,false]
[40461,false]
[40462,false]
[40463,false]
[40464,false]
[40465,false]
[40466,false]
[40467,false]
[40468,false]
[40469,false]
[40470,false]
[40471,false]
[40472,false]
[40473,false]
[40474,false]
[40475,false]
[40476,false]
[40477,false]
[40478,false]
[40479,false]
[40480,false]
[40481,false]
[40482,false]
[40483,false]
[40484,false]
[40485,false]
[40486,false]
[40487,false]
[40488,false]
[40489,false]
[40490,false]
[40491,false]
[40492,false]
[40493,false]
[40494,false]
[40495,false]
[40496,false]
[40497,false]
[40498,false]
[40499,false]
[40500,false]
[40501,false]
[40502,false]
[40503,false]
[40504,false]
[40505,false]
[40506,false]
[40507,false]
[40508,false]
[40509,false]
[40510,false]
[40511,false]
[40512,false]
[40513,{"$f":"ISNUMBER(SEARCH(\"*4*2*3*\",A515))","v":false}]
[40514,false]
[40515,false]
[40516,false]
[40517,false]
[40518,false]
[40519,false]
[40520,false]
[40521,false]
[40522,false]
[40523,true]
[40524,false]
[40525,false]
[40526,false]
[40527,false]
[40528,false]
[40529,false]
[40530,false]
[40531,false]
[40532,false]
[40533,false]
[40534,false]
[40535,false]
[40536,false]
[40537,false]
[40538,false]
[40539,false]
[40540,false]
[40541,false]
[40542,false]
[40543,false]
[40544,false]
[40545,false]
[40546,false]
[40547,false]
[40548,false]
[40549,false]
[40550,false]
[40551,false]
[40552,false]
[40553,false]
[40554,false]
[40555,false]
[40556,false]
[40557,false]
[40558,false]
[40559,false]
[40560,false]
[40561,false]
[40562,false]
[40563,false]
[40564,false]
[40565,false]
[40566,false]
[40567,false]
[40568,false]
[40569,false]
[40570,false]
[40571,false]
[40572,false]
[40573,false]
[40574,false]
[40575,false]
[40576,false]
[40577,{"$f":"ISNUMBER(SEARCH(\"*4*2*3*\",A579))","v":false}]
[40578,false]
[40579,false]
[40580,false]
[40581,false]
[40582,false]
[40583,false]
[40584,false]
[40585,false]
[40586,false]
[40587,false]
[40588,false]
[40589,false]
[40590,false]
[40591,false]
[40592,false]
[40593,false]
[40594,false]
[40595,false]
[40596,false]
[40597,false]
[40598,false]
[40599,false]
[40600,false]
[40601,false]
[40602,false]
[40603,false]
[40604,false]
[40605,false]
[40606,false]
[40607,false]
[40608,false]
[40609,false]
[40610,false]
[40611,false]
[40612,false]
[40613,false]
[40614,false]
[40615,false]
[40616,false]
[40617,false]
[40618,false]
[40619,false]
[40620,false]
[40621,false]
[40622,false]
[40623,true]
[40624,false]
[40625,false]
[40626,false]
[40627,false]
[40628,false]
[40629,false]
[40630,false]
[40631,false]
[40632,false]
[40633,false]
[40634,false]
[40635,false]
[40636,false]
[40637,false]
[40638,false]
[40639,false]
[40640,false]
[40641,{"$f":"ISNUMBER(SEARCH(\"*4*2*3*\",A643))","v":false}]
[40642,false]
[40643,false]
[40644,false]
[40645,false]
[40646,false]
[40647,false]
[40648,false]
[40649,false]
[40650,false]
[40651,false]
[40652,false]
[40653,false]
[40654,false]
[40655,false]
[40656,false]
[40657,false]
[40658,false]
[40659,false]
[40660,false]
[40661,false]
[40662,false]
[40663,false]
[40664,false]
[40665,false]
[40666,false]
[40667,false]
[40668,false]
[40669,false]
[40670,false]
[40671,false]
[40672,false]
[40673,false]
[40674,false]
[40675,false]
[40676,false]
[40677,false]
[40678,false]
[40679,false]
[40680,false]
[40681,false]
[40682,false]
[40683,false]
[40684,false]
[40685,false]
[40686,false]
[40687,false]
[40688,false]
[40689,false]
[40690,false]
[40691,false]
[40692,false]
[40693,false]
[40694,false]
[40695,false]
[40696,false]
[40697,false]
[40698,false]
[40699,false]
[40700,false]
[40701,false]
[40702,false]
[40703,false]
[40704,false]
[40705,{"$f":"ISNUMBER(SEARCH(\"*4*2*3*\",A707))","v":false}]
[40706,false]
[40707,false]
[40708,false]
[40709,false]
[40710,false]
[40711,false]
[40712,false]
[40713,false]
[40714,false]
[40715,false]
[40716,false]
[40717,false]
[40718,false]
[40719,false]
[40720,false]
[40721,false]
[40722,false]
[40723,true]
[40724,false]
[40725,false]
[40726,false]
[40727,false]
[40728,false]
[40729,false]
[40730,false]
[40731,false]
[40732,false]
[40733,false]
[40734,false]
[40735,false]
[40736,false]
[40737,false]
[40738,false]
[40739,false]
[40740,false]
[40741,false]
[40742,false]
[40743,false]
[40744,false]
[40745,false]
[40746,false]
[40747,false]
[40748,false]
[40749,false]
[40750,false]
[40751,false]
[40752,false]
[40753,false]
[40754,false]
[40755,false]
[40756,false]
[40757,false]
[40758,false]
[40759,false]
[40760,false]
[40761,false]
[40762,false]
[40763,false]
[40764,false]
[40765,false]
[40766,false]
[40767,false]
[40768,false]
[40769,{"$f":"ISNUMBER(SEARCH(\"*4*2*3*\",A771))","v":false}]
[40770,false]
[40771,false]
[40772,false]
[40773,false]
[40774,false]
[40775,false]
[40776,false]
[40777,false]
[40778,false]
[40779,false]
[40780,false]
[40781,false]
[40782,false]
[40783,false]
[40784,false]
[40785,false]
[40786,false]
[40787,false]
[40788,false]
[40789,false]
[40790,false]
[40791,false]
[40792,false]
[40793,false]
[40794,false]
[40795,false]
[40796,false]
[40797,false]
[40798,false]
[40799,false]
[40800,false]
[40801,false]
[40802,false]
[40803,false]
[40804,false]
[40805,false]
[40806,false]
[40807,false]
[40808,false]
[40809,false]
[40810,false]
[40811,false]
[40812,false]
[40813,false]
[40814,false]
[40815,false]
[40816,false]
[40817,false]
[40818,false]
[40819,false]
[40820,false]
[40821,false]
[40822,false]
[40823,true]
[40824,false]
[40825,false]
[40826,false]
[40827,false]
[40828,false]
[40829,false]
[40830,false]
[40831,false]
[40832,false]
[40833,{"$f":"ISNUMBER(SEARCH(\"*4*2*3*\",A835))","v":false}]
[40834,false]
[40835,false]
[40836,false]
[40837,false]
[40838,false]
[40839,false]
[40840,false]
[40841,false]
[40842,false]
[40843,false]
[40844,false]
[40845,false]
[40846,false]
[40847,false]
[40848,false]
[40849,false]
[40850,false]
[40851,false]
[40852,false]
[40853,false]
[40854,false]
[40855,false]
[40856,false]
[40857,false]
[40858,false]
[40859,false]
[40860,false]
[40861,false]
[40862,false]
[40863,false]
[40864,false]
[40865,false]
[40866,false]
[40867,false]
[40868,false]
[40869,false]
[40870,false]
[40871,false]
[40872,false]
[40873,false]
[40874,false]
[40875,false]
[40876,false]
[40877,false]
[40878,false]
[40879,false]
[40880,false]
[40881,false]
[40882,false]
[40883,false]
[40884,false]
[40885,false]
[40886,false]
[40887,false]
[40888,false]
[40889,false]
[40890,false]
[40891,false]
[40892,false]
[40893,false]
[40894,false]
[40895,false]
[40896,false]
[40897,{"$f":"ISNUMBER(SEARCH(\"*4*2*3*\",A899))","v":false}]
[40898,false]
[40899,false]
[40900,false]
[40901,false]
[40902,false]
[40903,false]
[40904,false]
[40905,false]
[40906,false]
[40907,false]
[40908,false]
[40909,false]
[40910,false]
[40911,false]
[40912,false]
[40913,false]
[40914,false]
[40915,false]
[40916,false]
[40917,false]
[40918,false]
[40919,false]
[40920,false]
[40921,false]
[40922,false]
[40923,true]
[40924,false]
[40925,false]
[40926,false]
[40927,false]
[40928,false]
[40929,false]
[40930,false]
[40931,false]
[40932,false]
[40933,false]
[40934,false]
[40935,false]
[40936,false]
[40937,false]
[40938,false]
[40939,false]
[40940,false]
[40941,false]
[40942,false]
[40943,false]
[40944,false]
[40945,false]
[40946,false]
[40947,false]
[40948,false]
[40949,false]
[40950,false]
[40951,false]
[40952,false]
[40953,false]
[40954,false]
[40955,false]
[40956,false]
[40957,false]
[40958,false]
[40959,false]
[40960,false]
[40961,{"$f":"ISNUMBER(SEARCH(\"*4*2*3*\",A963))","v":false}]
[40962,false]
[40963,false]
[40964,false]
[40965,false]
[40966,false]
[40967,false]
[40968,false]
[40969,false]
[40970,false]
[40971,false]
[40972,false]
[40973,false]
[40974,false]
[40975,false]
[40976,false]
[40977,false]
[40978,false]
[40979,false]
[40980,false]
[40981,false]
[40982,false]
[40983,false]
[40984,false]
[40985,false]
[40986,false]
[40987,false]
[40988,false]
[40989,false]
[40990,false]
[40991,false]
[40992,false]
[40993,false]
[40994,false]
[40995,false]
[40996,false]
[40997,false]
[40998,false]
[40999,false]
[41000,false]
[41001,false]
[41002,false]
[41003,false]
[41004,false]
[41005,false]
[41006,false]
[41007,false]
[41008,false]
[41009,false]
[41010,false]
[41011,false]
[41012,false]
[41013,false]
[41014,false]
[41015,false]
[41016,false]
[41017,false]
[41018,false]
[41019,false]
[41020,false]
[41021,false]
[41022,false]
[41023,true]
[41024,false]
[41025,{"$f":"ISNUMBER(SEARCH(\"*4*2*3*\",A1027))","v":false}]
[41026,false]
[41027,false]
[41028,false]
[41029,false]
[41030,false]
[41031,false]
[41032,false]
[41033,false]
[41034,false]
[41035,false]
[41036,false]
[41037,false]
[41038,false]
[41039,false]
[41040,false]
[41041,false]
[41042,false]
[41043,false]
[41044,false]
[41045,false]
[41046,false]
[41047,false]
[41048,false]
[41049,false]
[41050,false]
[41051,false]
[41052,false]
[41053,false]
[41054,false]
[41055,false]
[41056,false]
[41057,false]
[41058,false]
[41059,false]
[41060,false]
[41061,false]
[41062,false]
[41063,false]
[41064,false]
[41065,false]
[41066,false]
[41067,false]
[41068,false]
[41069,false]
[41070,false]
[41071,false]
[41072,false]
[41073,false]
[41074,false]
[41075,false]
[41076,false]
[41077,false]
[41078,false]
[41079,false]
[41080,false]
[41081,false]
[41082,false]
[41083,false]
[41084,false]
[41085,false]
[41086,false]
[41087,false]
[41088,false]
[41089,{"$f":"ISNUMBER(SEARCH(\"*4*2*3*\",A1091))","v":false}]
[41090,false]
[41091,false]
[41092,false]
[41093,false]
[41094,false]
[41095,false]
[41096,false]
[41097,false]
[41098,false]
[41099,false]
[41100,false]
[41101,false]
[41102,false]
[41103,false]
[41104,false]
[41105,false]
[41106,false]
[41107,false]
[41108,false]
[41109,false]
[41110,false]
[41111,false]
[41112,false]
[41113,false]
[41114,false]
[41115,false]
[41116,false]
[41117,false]
[41118,false]
[41119,false]
[41120,false]
[41121,false]
[41122,false]
[41123,true]
[41124,false]
[41125,false]
[41126,false]
[41127,false]
[41128,false]
[41129,false]
[41130,false]
[41131,false]
[41132,false]
[41133,false]
[41134,false]
[41135,false]
[41136,false]
[41137,false]
[41138,false]
[41139,false]
[41140,false]
[41141,false]
[41142,false]
[41143,false]
[41144,false]
[41145,false]
[41146,false]
[41147,false]
[41148,false]
[41149,false]
[41150,false]
[41151,false]
[41152,false]
[41153,{"$f":"ISNUMBER(SEARCH(\"*4*2*3*\",A1155))","v":false}]
[41154,false]
[41155,false]
[41156,false]
[41157,false]
[41158,false]
[41159,false]
[41160,false]
[41161,false]
[41162,false]
[41163,false]
[41164,false]
[41165,false]
[41166,false]
[41167,false]
[41168,false]
[41169,false]
[41170,false]
[41171,false]
[41172,false]
[41173,false]
[41174,false]
[41175,false]
[41176,false]
[41177,false]
[41178,false]
[41179,false]
[41180,false]
[41181,false]
[41182,false]
[41183,false]
[41184,false]
[41185,false]
[41186,false]
[41187,false]
[41188,false]
[41189,false]
[41190,false]
[41191,false]
[41192,false]
[41193,false]
[41194,false]
[41195,false]
[41196,false]
[41197,false]
[41198,false]
[41199,false]
[41200,false]
[41201,false]
[41202,false]
[41203,true]
[41204,false]
[41205,false]
[41206,false]
[41207,false]
[41208,false]
[41209,false]
[41210,false]
[41211,false]
[41212,false]
[41213,true]
[41214,false]
[41215,false]
[41216,false]
[41217,{"$f":"ISNUMBER(SEARCH(\"*4*2*3*\",A1219))","v":false}]
[41218,false]
[41219,false]
[41220,false]
[41221,false]
[41222,false]
[41223,true]
[41224,false]
[41225,false]
[41226,false]
[41227,false]
[41228,false]
[41229,false]
[41230,true]
[41231,true]
[41232,true]
[41233,true]
[41234,true]
[41235,true]
[41236,true]
[41237,true]
[41238,true]
[41239,true]
[41240,false]
[41241,false]
[41242,false]
[41243,true]
[41244,false]
[41245,false]
[41246,false]
[41247,false]
[41248,false]
[41249,false]
[41250,false]
[41251,false]
[41252,false]
[41253,true]
[41254,false]
[41255,false]
[41256,false]
[41257,false]
[41258,false]
[41259,false]
[41260,false]
[41261,false]
[41262,false]
[41263,true]
[41264,false]
[41265,false]
[41266,false]
[41267,false]
[41268,false]
[41269,false]
[41270,false]
[41271,false]
[41272,false]
[41273,true]
[41274,false]
[41275,false]
[41276,false]
[41277,false]
[41278,false]
[41279,false]
[41280,false]
[41281,{"$f":"ISNUMBER(SEARCH(\"*4*2*3*\",A1283))","v":false}]
[41282,false]
[41283,true]
[41284,false]
[41285,false]
[41286,false]
[41287,false]
[41288,false]
[41289,false]
[41290,false]
[41291,false]
[41292,false]
[41293,true]
[41294,false]
[41295,false]
[41296,false]
[41297,false]
[41298,false]
[41299,false]
[41300,false]
[41301,false]
[41302,false]
[41303,false]
[41304,false]
[41305,false]
[41306,false]
[41307,false]
[41308,false]
[41309,false]
[41310,false]
[41311,false]
[41312,false]
[41313,false]
[41314,false]
[41315,false]
[41316,false]
[41317,false]
[41318,false]
[41319,false]
[41320,false]
[41321,false]
[41322,false]
[41323,true]
[41324,false]
[41325,false]
[41326,false]
[41327,false]
[41328,false]
[41329,false]
[41330,false]
[41331,false]
[41332,false]
[41333,false]
[41334,false]
[41335,false]
[41336,false]
[41337,false]
[41338,false]
[41339,false]
[41340,false]
[41341,false]
[41342,false]
[41343,false]
[41344,false]
[41345,{"$f":"ISNUMBER(SEARCH(\"*4*2*3*\",A1347))","v":false}]
[41346,false]
[41347,false]
[41348,false]
[41349,false]
[41350,false]
[41351,false]
[41352,false]
[41353,false]
[41354,false]
[41355,false]
[41356,false]
[41357,false]
[41358,false]
[41359,false]
[41360,false]
[41361,false]
[41362,false]
[41363,false]
[41364,false]
[41365,false]
[41366,false]
[41367,false]
[41368,false]
[41369,false]
[41370,false]
[41371,false]
[41372,false]
[41373,false]
[41374,false]
[41375,false]
[41376,false]
[41377,false]
[41378,false]
[41379,false]
[41380,false]
[41381,false]
[41382,false]
[41383,false]
[41384,false]
[41385,false]
[41386,false]
[41387,false]
[41388,false]
[41389,false]
[41390,false]
[41391,false]
[41392,false]
[41393,false]
[41394,false]
[41395,false]
[41396,false]
[41397,false]
[41398,false]
[41399,false]
[41400,false]
[41401,false]
[41402,false]
[41403,false]
[41404,false]
[41405,false]
[41406,false]
[41407,false]
[41408,false]
[41409,{"$f":"ISNUMBER(SEARCH(\"*4*2*3*\",A1411))","v":false}]
[41410,false]
[41411,false]
[41412,false]
[41413,false]
[41414,false]
[41415,false]
[41416,false]
[41417,false]
[41418,false]
[41419,false]
[41420,false]
[41421,false]
[41422,false]
[41423,true]
[41424,false]
[41425,false]
[41426,false]
[41427,false]
[41428,false]
[41429,false]
[41430,false]
[41431,false]
[41432,false]
[41433,false]
[41434,false]
[41435,false]
[41436,false]
[41437,false]
[41438,false]
[41439,false]
[41440,false]
[41441,false]
[41442,false]
[41443,false]
[41444,false]
[41445,false]
[41446,false]
[41447,false]
[41448,false]
[41449,false]
[41450,false]
[41451,false]
[41452,false]
[41453,false]
[41454,false]
[41455,false]
[41456,false]
[41457,false]
[41458,false]
[41459,false]
[41460,false]
[41461,false]
[41462,false]
[41463,false]
[41464,false]
[41465,false]
[41466,false]
[41467,false]
[41468,false]
[41469,false]
[41470,false]
[41471,false]
[41472,false]
[41473,{"$f":"ISNUMBER(SEARCH(\"*4*2*3*\",A1475))","v":false}]
[41474,false]
[41475,false]
[41476,false]
[41477,false]
[41478,false]
[41479,false]
[41480,false]
[41481,false]
[41482,false]
[41483,false]
[41484,false]
[41485,false]
[41486,false]
[41487,false]
[41488,false]
[41489,false]
[41490,false]
[41491,false]
[41492,false]
[41493,false]
[41494,false]
[41495,false]
[41496,false]
[41497,false]
[41498,false]
[41499,false]
[41500,false]
[41501,false]
[41502,false]
[41503,false]
[41504,false]
[41505,false]
[41506,false]
[41507,false]
[41508,false]
[41509,false]
[41510,false]
[41511,false]
[41512,false]
[41513,false]
[41514,false]
[41515,false]
[41516,false]
[41517,false]
[41518,false]
[41519,false]
[41520,false]
[41521,false]
[41522,false]
[41523,true]
[41524,false]
[41525,false]
[41526,false]
[41527,false]
[41528,false]
[41529,false]
[41530,false]
[41531,false]
[41532,false]
[41533,false]
[41534,false]
[41535,false]
[41536,false]
[41537,{"$f":"ISNUMBER(SEARCH(\"*4*2*3*\",A1539))","v":false}]
[41538,false]
[41539,false]
[41540,false]
[41541,false]
[41542,false]
[41543,false]
[41544,false]
[41545,false]
[41546,false]
[41547,false]
[41548,false]
[41549,false]
[41550,false]
[41551,false]
[41552,false]
[41553,false]
[41554,false]
[41555,false]
[41556,false]
[41557,false]
[41558,false]
[41559,false]
[41560,false]
[41561,false]
[41562,false]
[41563,false]
[41564,false]
[41565,false]
[41566,false]
[41567,false]
[41568,false]
[41569,false]
[41570,false]
[41571,false]
[41572,false]
[41573,false]
[41574,false]
[41575,false]
[41576,false]
[41577,false]
[41578,false]
[41579,false]
[41580,false]
[41581,false]
[41582,false]
[41583,false]
[41584,false]
[41585,false]
[41586,false]
[41587,false]
[41588,false]
[41589,false]
[41590,false]
[41591,false]
[41592,false]
[41593,false]
[41594,false]
[41595,false]
[41596,false]
[41597,false]
[41598,false]
[41599,false]
[41600,false]
[41601,{"$f":"ISNUMBER(SEARCH(\"*4*2*3*\",A1603))","v":false}]
[41602,false]
[41603,false]
[41604,false]
[41605,false]
[41606,false]
[41607,false]
[41608,false]
[41609,false]
[41610,false]
[41611,false]
[41612,false]
[41613,false]
[41614,false]
[41615,false]
[41616,false]
[41617,false]
[41618,false]
[41619,false]
[41620,false]
[41621,false]
[41622,false]
[41623,true]
[41624,false]
[41625,false]
[41626,false]
[41627,false]
[41628,false]
[41629,false]
[41630,false]
[41631,false]
[41632,false]
[41633,false]
[41634,false]
[41635,false]
[41636,false]
[41637,false]
[41638,false]
[41639,false]
[41640,false]
[41641,false]
[41642,false]
[41643,false]
[41644,false]
[41645,false]
[41646,false]
[41647,false]
[41648,false]
[41649,false]
[41650,false]
[41651,false]
[41652,false]
[41653,false]
[41654,false]
[41655,false]
[41656,false]
[41657,false]
[41658,false]
[41659,false]
[41660,false]
[41661,false]
[41662,false]
[41663,false]
[41664,false]
[41665,{"$f":"ISNUMBER(SEARCH(\"*4*2*3*\",A1667))","v":false}]
[41666,false]
[41667,false]
[41668,false]
[41669,false]
[41670,false]
[41671,false]
[41672,false]
[41673,false]
[41674,false]
[41675,false]
[41676,false]
[41677,false]
[41678,false]
[41679,false]
[41680,false]
[41681,false]
[41682,false]
[41683,false]
[41684,false]
[41685,false]
[41686,false]
[41687,false]
[41688,false]
[41689,false]
[41690,false]
[41691,false]
[41692,false]
[41693,false]
[41694,false]
[41695,false]
[41696,false]
[41697,false]
[41698,false]
[41699,false]
[41700,false]
[41701,false]
[41702,false]
[41703,false]
[41704,false]
[41705,false]
[41706,false]
[41707,false]
[41708,false]
[41709,false]
[41710,false]
[41711,false]
[41712,false]
[41713,false]
[41714,false]
[41715,false]
[41716,false]
[41717,false]
[41718,false]
[41719,false]
[41720,false]
[41721,false]
[41722,false]
[41723,true]
[41724,false]
[41725,false]
[41726,false]
[41727,false]
[41728,false]
[41729,{"$f":"ISNUMBER(SEARCH(\"*4*2*3*\",A1731))","v":false}]
[41730,false]
[41731,false]
[41732,false]
[41733,false]
[41734,false]
[41735,false]
[41736,false]
[41737,false]
[41738,false]
[41739,false]
[41740,false]
[41741,false]
[41742,false]
[41743,false]
[41744,false]
[41745,false]
[41746,false]
[41747,false]
[41748,false]
[41749,false]
[41750,false]
[41751,false]
[41752,false]
[41753,false]
[41754,false]
[41755,false]
[41756,false]
[41757,false]
[41758,false]
[41759,false]
[41760,false]
[41761,false]
[41762,false]
[41763,false]
[41764,false]
[41765,false]
[41766,false]
[41767,false]
[41768,false]
[41769,false]
[41770,false]
[41771,false]
[41772,false]
[41773,false]
[41774,false]
[41775,false]
[41776,false]
[41777,false]
[41778,false]
[41779,false]
[41780,false]
[41781,false]
[41782,false]
[41783,false]
[41784,false]
[41785,false]
[41786,false]
[41787,false]
[41788,false]
[41789,false]
[41790,false]
[41791,false]
[41792,false]
[41793,{"$f":"ISNUMBER(SEARCH(\"*4*2*3*\",A1795))","v":false}]
[41794,false]
[41795,false]
[41796,false]
[41797,false]
[41798,false]
[41799,false]
[41800,false]
[41801,false]
[41802,false]
[41803,false]
[41804,false]
[41805,false]
[41806,false]
[41807,false]
[41808,false]
[41809,false]
[41810,false]
[41811,false]
[41812,false]
[41813,false]
[41814,false]
[41815,false]
[41816,false]
[41817,false]
[41818,false]
[41819,false]
[41820,false]
[41821,false]
[41822,false]
[41823,true]
[41824,false]
[41825,false]
[41826,false]
[41827,false]
[41828,false]
[41829,false]
[41830,false]
[41831,false]
[41832,false]
[41833,false]
[41834,false]
[41835,false]
[41836,false]
[41837,false]
[41838,false]
[41839,false]
[41840,false]
[41841,false]
[41842,false]
[41843,false]
[41844,false]
[41845,false]
[41846,false]
[41847,false]
[41848,false]
[41849,false]
[41850,false]
[41851,false]
[41852,false]
[41853,false]
[41854,false]
[41855,false]
[41856,false]
[41857,{"$f":"ISNUMBER(SEARCH(\"*4*2*3*\",A1859))","v":false}]
[41858,false]
[41859,false]
[41860,false]
[41861,false]
[41862,false]
[41863,false]
[41864,false]
[41865,false]
[41866,false]
[41867,false]
[41868,false]
[41869,false]
[41870,false]
[41871,false]
[41872,false]
[41873,false]
[41874,false]
[41875,false]
[41876,false]
[41877,false]
[41878,false]
[41879,false]
[41880,false]
[41881,false]
[41882,false]
[41883,false]
[41884,false]
[41885,false]
[41886,false]
[41887,false]
[41888,false]
[41889,false]
[41890,false]
[41891,false]
[41892,false]
[41893,false]
[41894,false]
[41895,false]
[41896,false]
[41897,false]
[41898,false]
[41899,false]
[41900,false]
[41901,false]
[41902,false]
[41903,false]
[41904,false]
[41905,false]
[41906,false]
[41907,false]
[41908,false]
[41909,false]
[41910,false]
[41911,false]
[41912,false]
[41913,false]
[41914,false]
[41915,false]
[41916,false]
[41917,false]
[41918,false]
[41919,false]
[41920,false]
[41921,{"$f":"ISNUMBER(SEARCH(\"*4*2*3*\",A1923))","v":false}]
[41922,false]
[41923,true]
[41924,false]
[41925,false]
[41926,false]
[41927,false]
[41928,false]
[41929,false]
[41930,false]
[41931,false]
[41932,false]
[41933,false]
[41934,false]
[41935,false]
[41936,false]
[41937,false]
[41938,false]
[41939,false]
[41940,false]
[41941,false]
[41942,false]
[41943,false]
[41944,false]
[41945,false]
[41946,false]
[41947,false]
[41948,false]
[41949,false]
[41950,false]
[41951,false]
[41952,false]
[41953,false]
[41954,false]
[41955,false]
[41956,false]
[41957,false]
[41958,false]
[41959,false]
[41960,false]
[41961,false]
[41962,false]
[41963,false]
[41964,false]
[41965,false]
[41966,false]
[41967,false]
[41968,false]
[41969,false]
[41970,false]
[41971,false]
[41972,false]
[41973,false]
[41974,false]
[41975,false]
[41976,false]
[41977,false]
[41978,false]
[41979,false]
[41980,false]
[41981,false]
[41982,false]
[41983,false]
[41984,false]
[41985,{"$f":"ISNUMBER(SEARCH(\"*4*2*3*\",A1987))","v":false}]
[41986,false]
[41987,false]
[41988,false]
[41989,false]
[41990,false]
[41991,false]
[41992,false]
[41993,false]
[41994,false]
[41995,false]
[41996,false]
[41997,false]
[41998,false]
[41999,false]
[42000,false]
[42001,false]
[42002,false]
[42003,true]
[42004,false]
[42005,false]
[42006,false]
[42007,false]
[42008,false]
[42009,false]
[42010,false]
[42011,false]
[42012,false]
[42013,true]
[42014,false]
[42015,false]
[42016,false]
[42017,false]
[42018,false]
[42019,false]
[42020,false]
[42021,false]
[42022,false]
[42023,true]
[42024,false]
[42025,false]
[42026,false]
[42027,false]
[42028,false]
[42029,false]
[42030,true]
[42031,true]
[42032,true]
[42033,true]
[42034,true]
[42035,true]
[42036,true]
[42037,true]
[42038,true]
[42039,true]
[42040,false]
[42041,false]
[42042,false]
[42043,true]
[42044,false]
[42045,false]
[42046,false]
[42047,false]
[42048,false]
[42049,{"$f":"ISNUMBER(SEARCH(\"*4*2*3*\",A2051))","v":false}]
[42050,false]
[42051,false]
[42052,false]
[42053,true]
[42054,false]
[42055,false]
[42056,false]
[42057,false]
[42058,false]
[42059,false]
[42060,false]
[42061,false]
[42062,false]
[42063,true]
[42064,false]
[42065,false]
[42066,false]
[42067,false]
[42068,false]
[42069,false]
[42070,false]
[42071,false]
[42072,false]
[42073,true]
[42074,false]
[42075,false]
[42076,false]
[42077,false]
[42078,false]
[42079,false]
[42080,false]
[42081,false]
[42082,false]
[42083,true]
[42084,false]
[42085,false]
[42086,false]
[42087,false]
[42088,false]
[42089,false]
[42090,false]
[42091,false]
[42092,false]
[42093,true]
[42094,false]
[42095,false]
[42096,false]
[42097,false]
[42098,false]
[42099,false]
[42100,false]
[42101,false]
[42102,false]
[42103,true]
[42104,false]
[42105,false]
[42106,false]
[42107,false]
[42108,false]
[42109,false]
[42110,false]
[42111,false]
[42112,false]
[42113,{"$f":"ISNUMBER(SEARCH(\"*4*2*3*\",A2115))","v":true}]
[42114,false]
[42115,false]
[42116,false]
[42117,false]
[42118,false]
[42119,false]
[42120,false]
[42121,false]
[42122,false]
[42123,true]
[42124,false]
[42125,false]
[42126,false]
[42127,false]
[42128,false]
[42129,false]
[42130,true]
[42131,true]
[42132,true]
[42133,true]
[42134,true]
[42135,true]
[42136,true]
[42137,true]
[42138,true]
[42139,true]
[42140,false]
[42141,false]
[42142,false]
[42143,true]
[42144,false]
[42145,false]
[42146,false]
[42147,false]
[42148,false]
[42149,false]
[42150,false]
[42151,false]
[42152,false]
[42153,true]
[42154,false]
[42155,false]
[42156,false]
[42157,false]
[42158,false]
[42159,false]
[42160,false]
[42161,false]
[42162,false]
[42163,true]
[42164,false]
[42165,false]
[42166,false]
[42167,false]
[42168,false]
[42169,false]
[42170,false]
[42171,false]
[42172,false]
[42173,true]
[42174,false]
[42175,false]
[42176,false]
[42177,{"$f":"ISNUMBER(SEARCH(\"*4*2*3*\",A2179))","v":false}]
[42178,false]
[42179,false]
[42180,false]
[42181,false]
[42182,false]
[42183,true]
[42184,false]
[42185,false]
[42186,false]
[42187,false]
[42188,false]
[42189,false]
[42190,false]
[42191,false]
[42192,false]
[42193,true]
[42194,false]
[42195,false]
[42196,false]
[42197,false]
[42198,false]
[42199,false]
[42200,false]
[42201,false]
[42202,false]
[42203,true]
[42204,false]
[42205,false]
[42206,false]
[42207,false]
[42208,false]
[42209,false]
[42210,false]
[42211,false]
[42212,false]
[42213,true]
[42214,false]
[42215,false]
[42216,false]
[42217,false]
[42218,false]
[42219,false]
[42220,false]
[42221,false]
[42222,false]
[42223,true]
[42224,false]
[42225,false]
[42226,false]
[42227,false]
[42228,false]
[42229,false]
[42230,true]
[42231,true]
[42232,true]
[42233,true]
[42234,true]
[42235,true]
[42236,true]
[42237,true]
[42238,true]
[42239,true]
[42240,false]
[42241,{"$f":"ISNUMBER(SEARCH(\"*4*2*3*\",A2243))","v":false}]
[42242,false]
[42243,true]
[42244,false]
[42245,false]
[42246,false]
[42247,false]
[42248,false]
[42249,false]
[42250,false]
[42251,false]
[42252,false]
[42253,true]
[42254,false]
[42255,false]
[42256,false]
[42257,false]
[42258,false]
[42259,false]
[42260,false]
[42261,false]
[42262,false]
[42263,true]
[42264,false]
[42265,false]
[42266,false]
[42267,false]
[42268,false]
[42269,false]
[42270,false]
[42271,false]
[42272,false]
[42273,true]
[42274,false]
[42275,false]
[42276,false]
[42277,false]
[42278,false]
[42279,false]
[42280,false]
[42281,false]
[42282,false]
[42283,true]
[42284,false]
[42285,false]
[42286,false]
[42287,false]
[42288,false]
[42289,false]
[42290,false]
[42291,false]
[42292,false]
[42293,true]
[42294,false]
[42295,false]
[42296,false]
[42297,false]
[42298,false]
[42299,false]
[42300,true]
[42301,true]
[42302,true]
[42303,true]
[42304,true]
[42305,{"$f":"ISNUMBER(SEARCH(\"*4*2*3*\",A2307))","v":true}]
[42306,true]
[42307,true]
[42308,true]
[42309,true]
[42310,true]
[42311,true]
[42312,true]
[42313,true]
[42314,true]
[42315,true]
[42316,true]
[42317,true]
[42318,true]
[42319,true]
[42320,true]
[42321,true]
[42322,true]
[42323,true]
[42324,true]
[42325,true]
[42326,true]
[42327,true]
[42328,true]
[42329,true]
[42330,true]
[42331,true]
[42332,true]
[42333,true]
[42334,true]
[42335,true]
[42336,true]
[42337,true]
[42338,true]
[42339,true]
[42340,true]
[42341,true]
[42342,true]
[42343,true]
[42344,true]
[42345,true]
[42346,true]
[42347,true]
[42348,true]
[42349,true]
[42350,true]
[42351,true]
[42352,true]
[42353,true]
[42354,true]
[42355,true]
[42356,true]
[42357,true]
[42358,true]
[42359,true]
[42360,true]
[42361,true]
[42362,true]
[42363,true]
[42364,true]
[42365,true]
[42366,true]
[42367,true]
[42368,true]
[42369,{"$f":"ISNUMBER(SEARCH(\"*4*2*3*\",A2371))","v":true}]
[42370,true]
[42371,true]
[42372,true]
[42373,true]
[42374,true]
[42375,true]
[42376,true]
[42377,true]
[42378,true]
[42379,true]
[42380,true]
[42381,true]
[42382,true]
[42383,true]
[42384,true]
[42385,true]
[42386,true]
[42387,true]
[42388,true]
[42389,true]
[42390,true]
[42391,true]
[42392,true]
[42393,true]
[42394,true]
[42395,true]
[42396,true]
[42397,true]
[42398,true]
[42399,true]
[42400,false]
[42401,false]
[42402,false]
[42403,true]
[42404,false]
[42405,false]
[42406,false]
[42407,false]
[42408,false]
[42409,false]
[42410,false]
[42411,false]
[42412,false]
[42413,true]
[42414,false]
[42415,false]
[42416,false]
[42417,false]
[42418,false]
[42419,false]
[42420,false]
[42421,false]
[42422,false]
[42423,true]
[42424,false]
[42425,false]
[42426,false]
[42427,false]
[42428,false]
[42429,false]
[42430,true]
[42431,true]
[42432,true]
[42433,{"$f":"ISNUMBER(SEARCH(\"*4*2*3*\",A2435))","v":true}]
[42434,true]
[42435,true]
[42436,true]
[42437,true]
[42438,true]
[42439,true]
[42440,false]
[42441,false]
[42442,false]
[42443,true]
[42444,false]
[42445,false]
[42446,false]
[42447,false]
[42448,false]
[42449,false]
[42450,false]
[42451,false]
[42452,false]
[42453,true]
[42454,false]
[42455,false]
[42456,false]
[42457,false]
[42458,false]
[42459,false]
[42460,false]
[42461,false]
[42462,false]
[42463,true]
[42464,false]
[42465,false]
[42466,false]
[42467,false]
[42468,false]
[42469,false]
[42470,false]
[42471,false]
[42472,false]
[42473,true]
[42474,false]
[42475,false]
[42476,false]
[42477,false]
[42478,false]
[42479,false]
[42480,false]
[42481,false]
[42482,false]
[42483,true]
[42484,false]
[42485,false]
[42486,false]
[42487,false]
[42488,false]
[42489,false]
[42490,false]
[42491,false]
[42492,false]
[42493,true]
[42494,false]
[42495,false]
[42496,false]
[42497,{"$f":"ISNUMBER(SEARCH(\"*4*2*3*\",A2499))","v":false}]
[42498,false]
[42499,false]
[42500,false]
[42501,false]
[42502,false]
[42503,true]
[42504,false]
[42505,false]
[42506,false]
[42507,false]
[42508,false]
[42509,false]
[42510,false]
[42511,false]
[42512,false]
[42513,true]
[42514,false]
[42515,false]
[42516,false]
[42517,false]
[42518,false]
[42519,false]
[42520,false]
[42521,false]
[42522,false]
[42523,true]
[42524,false]
[42525,false]
[42526,false]
[42527,false]
[42528,false]
[42529,false]
[42530,true]
[42531,true]
[42532,true]
[42533,true]
[42534,true]
[42535,true]
[42536,true]
[42537,true]
[42538,true]
[42539,true]
[42540,false]
[42541,false]
[42542,false]
[42543,true]
[42544,false]
[42545,false]
[42546,false]
[42547,false]
[42548,false]
[42549,false]
[42550,false]
[42551,false]
[42552,false]
[42553,true]
[42554,false]
[42555,false]
[42556,false]
[42557,false]
[42558,false]
[42559,false]
[42560,false]
[42561,{"$f":"ISNUMBER(SEARCH(\"*4*2*3*\",A2563))","v":false}]
[42562,false]
[42563,true]
[42564,false]
[42565,false]
[42566,false]
[42567,false]
[42568,false]
[42569,false]
[42570,false]
[42571,false]
[42572,false]
[42573,true]
[42574,false]
[42575,false]
[42576,false]
[42577,false]
[42578,false]
[42579,false]
[42580,false]
[42581,false]
[42582,false]
[42583,true]
[42584,false]
[42585,false]
[42586,false]
[42587,false]
[42588,false]
[42589,false]
[42590,false]
[42591,false]
[42592,false]
[42593,true]
[42594,false]
[42595,false]
[42596,false]
[42597,false]
[42598,false]
[42599,false]
[42600,false]
[42601,false]
[42602,false]
[42603,true]
[42604,false]
[42605,false]
[42606,false]
[42607,false]
[42608,false]
[42609,false]
[42610,false]
[42611,false]
[42612,false]
[42613,true]
[42614,false]
[42615,false]
[42616,false]
[42617,false]
[42618,false]
[42619,false]
[42620,false]
[42621,false]
[42622,false]
[42623,true]
[42624,false]
[42625,{"$f":"ISNUMBER(SEARCH(\"*4*2*3*\",A2627))","v":false}]
[42626,false]
[42627,false]
[42628,false]
[42629,false]
[42630,true]
[42631,true]
[42632,true]
[42633,true]
[42634,true]
[42635,true]
[42636,true]
[42637,true]
[42638,true]
[42639,true]
[42640,false]
[42641,false]
[42642,false]
[42643,true]
[42644,false]
[42645,false]
[42646,false]
[42647,false]
[42648,false]
[42649,false]
[42650,false]
[42651,false]
[42652,false]
[42653,true]
[42654,false]
[42655,false]
[42656,false]
[42657,false]
[42658,false]
[42659,false]
[42660,false]
[42661,false]
[42662,false]
[42663,true]
[42664,false]
[42665,false]
[42666,false]
[42667,false]
[42668,false]
[42669,false]
[42670,false]
[42671,false]
[42672,false]
[42673,true]
[42674,false]
[42675,false]
[42676,false]
[42677,false]
[42678,false]
[42679,false]
[42680,false]
[42681,false]
[42682,false]
[42683,true]
[42684,false]
[42685,false]
[42686,false]
[42687,false]
[42688,false]
[42689,{"$f":"ISNUMBER(SEARCH(\"*4*2*3*\",A2691))","v":false}]
[42690,false]
[42691,false]
[42692,false]
[42693,true]
[42694,false]
[42695,false]
[42696,false]
[42697,false]
[42698,false]
[42699,false]
[42700,false]
[42701,false]
[42702,false]
[42703,true]
[42704,false]
[42705,false]
[42706,false]
[42707,false]
[42708,false]
[42709,false]
[42710,false]
[42711,false]
[42712,false]
[42713,true]
[42714,false]
[42715,false]
[42716,false]
[42717,false]
[42718,false]
[42719,false]
[42720,false]
[42721,false]
[42722,false]
[42723,true]
[42724,false]
[42725,false]
[42726,false]
[42727,false]
[42728,false]
[42729,false]
[42730,true]
[42731,true]
[42732,true]
[42733,true]
[42734,true]
[42735,true]
[42736,true]
[42737,true]
[42738,true]
[42739,true]
[42740,false]
[42741,false]
[42742,false]
[42743,true]
[42744,false]
[42745,false]
[42746,false]
[42747,false]
[42748,false]
[42749,false]
[42750,false]
[42751,false]
[42752,false]
[42753,{"$f":"ISNUMBER(SEARCH(\"*4*2*3*\",A2755))","v":true}]
[42754,false]
[42755,false]
[42756,false]
[42757,false]
[42758,false]
[42759,false]
[42760,false]
[42761,false]
[42762,false]
[42763,true]
[42764,false]
[42765,false]
[42766,false]
[42767,false]
[42768,false]
[42769,false]
[42770,false]
[42771,false]
[42772,false]
[42773,true]
[42774,false]
[42775,false]
[42776,false]
[42777,false]
[42778,false]
[42779,false]
[42780,false]
[42781,false]
[42782,false]
[42783,true]
[42784,false]
[42785,false]
[42786,false]
[42787,false]
[42788,false]
[42789,false]
[42790,false]
[42791,false]
[42792,false]
[42793,true]
[42794,false]
[42795,false]
[42796,false]
[42797,false]
[42798,false]
[42799,false]
[42800,false]
[42801,false]
[42802,false]
[42803,true]
[42804,false]
[42805,false]
[42806,false]
[42807,false]
[42808,false]
[42809,false]
[42810,false]
[42811,false]
[42812,false]
[42813,true]
[42814,false]
[42815,false]
[42816,false]
[42817,{"$f":"ISNUMBER(SEARCH(\"*4*2*3*\",A2819))","v":false}]
[42818,false]
[42819,false]
[42820,false]
[42821,false]
[42822,false]
[42823,true]
[42824,false]
[42825,false]
[42826,false]
[42827,false]
[42828,false]
[42829,false]
[42830,true]
[42831,true]
[42832,true]
[42833,true]
[42834,true]
[42835,true]
[42836,true]
[42837,true]
[42838,true]
[42839,true]
[42840,false]
[42841,false]
[42842,false]
[42843,true]
[42844,false]
[42845,false]
[42846,false]
[42847,false]
[42848,false]
[42849,false]
[42850,false]
[42851,false]
[42852,false]
[42853,true]
[42854,false]
[42855,false]
[42856,false]
[42857,false]
[42858,false]
[42859,false]
[42860,false]
[42861,false]
[42862,false]
[42863,true]
[42864,false]
[42865,false]
[42866,false]
[42867,false]
[42868,false]
[42869,false]
[42870,false]
[42871,false]
[42872,false]
[42873,true]
[42874,false]
[42875,false]
[42876,false]
[42877,false]
[42878,false]
[42879,false]
[42880,false]
[42881,{"$f":"ISNUMBER(SEARCH(\"*4*2*3*\",A2883))","v":false}]
[42882,false]
[42883,true]
[42884,false]
[42885,false]
[42886,false]
[42887,false]
[42888,false]
[42889,false]
[42890,false]
[42891,false]
[42892,false]
[42893,true]
[42894,false]
[42895,false]
[42896,false]
[42897,false]
[42898,false]
[42899,false]
[42900,false]
[42901,false]
[42902,false]
[42903,true]
[42904,false]
[42905,false]
[42906,false]
[42907,false]
[42908,false]
[42909,false]
[42910,false]
[42911,false]
[42912,false]
[42913,true]
[42914,false]
[42915,false]
[42916,false]
[42917,false]
[42918,false]
[42919,false]
[42920,false]
[42921,false]
[42922,false]
[42923,true]
[42924,false]
[42925,false]
[42926,false]
[42927,false]
[42928,false]
[42929,false]
[42930,true]
[42931,true]
[42932,true]
[42933,true]
[42934,true]
[42935,true]
[42936,true]
[42937,true]
[42938,true]
[42939,true]
[42940,false]
[42941,false]
[42942,false]
[42943,true]
[42944,false]
[42945,{"$f":"ISNUMBER(SEARCH(\"*4*2*3*\",A2947))","v":false}]
[42946,false]
[42947,false]
[42948,false]
[42949,false]
[42950,false]
[42951,false]
[42952,false]
[42953,true]
[42954,false]
[42955,false]
[42956,false]
[42957,false]
[42958,false]
[42959,false]
[42960,false]
[42961,false]
[42962,false]
[42963,true]
[42964,false]
[42965,false]
[42966,false]
[42967,false]
[42968,false]
[42969,false]
[42970,false]
[42971,false]
[42972,false]
[42973,true]
[42974,false]
[42975,false]
[42976,false]
[42977,false]
[42978,false]
[42979,false]
[42980,false]
[42981,false]
[42982,false]
[42983,true]
[42984,false]
[42985,false]
[42986,false]
[42987,false]
[42988,false]
[42989,false]
[42990,false]
[42991,false]
[42992,false]
[42993,true]
[42994,false]
[42995,false]
[42996,false]
[42997,false]
[42998,false]
[42999,false]
[43000,false]
[43001,false]
[43002,false]
[43003,false]
[43004,false]
[43005,false]
[43006,false]
[43007,false]
[43008,false]
[43009,{"$f":"ISNUMBER(SEARCH(\"*4*2*3*\",A3011))","v":false}]
[43010,false]
[43011,false]
[43012,false]
[43013,false]
[43014,false]
[43015,false]
[43016,false]
[43017,false]
[43018,false]
[43019,false]
[43020,false]
[43021,false]
[43022,false]
[43023,true]
[43024,false]
[43025,false]
[43026,false]
[43027,false]
[43028,false]
[43029,false]
[43030,false]
[43031,false]
[43032,false]
[43033,false]
[43034,false]
[43035,false]
[43036,false]
[43037,false]
[43038,false]
[43039,false]
[43040,false]
[43041,false]
[43042,false]
[43043,false]
[43044,false]
[43045,false]
[43046,false]
[43047,false]
[43048,false]
[43049,false]
[43050,false]
[43051,false]
[43052,false]
[43053,false]
[43054,false]
[43055,false]
[43056,false]
[43057,false]
[43058,false]
[43059,false]
[43060,false]
[43061,false]
[43062,false]
[43063,false]
[43064,false]
[43065,false]
[43066,false]
[43067,false]
[43068,false]
[43069,false]
[43070,false]
[43071,false]
[43072,false]
[43073,{"$f":"ISNUMBER(SEARCH(\"*4*2*3*\",A3075))","v":false}]
[43074,false]
[43075,false]
[43076,false]
[43077,false]
[43078,false]
[43079,false]
[43080,false]
[43081,false]
[43082,false]
[43083,false]
[43084,false]
[43085,false]
[43086,false]
[43087,false]
[43088,false]
[43089,false]
[43090,false]
[43091,false]
[43092,false]
[43093,false]
[43094,false]
[43095,false]
[43096,false]
[43097,false]
[43098,false]
[43099,false]
[43100,false]
[43101,false]
[43102,false]
[43103,false]
[43104,false]
[43105,false]
[43106,false]
[43107,false]
[43108,false]
[43109,false]
[43110,false]
[43111,false]
[43112,false]
[43113,false]
[43114,false]
[43115,false]
[43116,false]
[43117,false]
[43118,false]
[43119,false]
[43120,false]
[43121,false]
[43122,false]
[43123,true]
[43124,false]
[43125,false]
[43126,false]
[43127,false]
[43128,false]
[43129,false]
[43130,false]
[43131,false]
[43132,false]
[43133,false]
[43134,false]
[43135,false]
[43136,false]
[43137,{"$f":"ISNUMBER(SEARCH(\"*4*2*3*\",A3139))","v":false}]
[43138,false]
[43139,false]
[43140,false]
[43141,false]
[43142,false]
[43143,false]
[43144,false]
[43145,false]
[43146,false]
[43147,false]
[43148,false]
[43149,false]
[43150,false]
[43151,false]
[43152,false]
[43153,false]
[43154,false]
[43155,false]
[43156,false]
[43157,false]
[43158,false]
[43159,false]
[43160,false]
[43161,false]
[43162,false]
[43163,false]
[43164,false]
[43165,false]
[43166,false]
[43167,false]
[43168,false]
[43169,false]
[43170,false]
[43171,false]
[43172,false]
[43173,false]
[43174,false]
[43175,false]
[43176,false]
[43177,false]
[43178,false]
[43179,false]
[43180,false]
[43181,false]
[43182,false]
[43183,false]
[43184,false]
[43185,false]
[43186,false]
[43187,false]
[43188,false]
[43189,false]
[43190,false]
[43191,false]
[43192,false]
[43193,false]
[43194,false]
[43195,false]
[43196,false]
[43197,false]
[43198,false]
[43199,false]
[43200,false]
[43201,{"$f":"ISNUMBER(SEARCH(\"*4*2*3*\",A3203))","v":false}]
[43202,false]
[43203,true]
[43204,false]
[43205,false]
[43206,false]
[43207,false]
[43208,false]
[43209,false]
[43210,false]
[43211,false]
[43212,false]
[43213,true]
[43214,false]
[43215,false]
[43216,false]
[43217,false]
[43218,false]
[43219,false]
[43220,false]
[43221,false]
[43222,false]
[43223,true]
[43224,false]
[43225,false]
[43226,false]
[43227,false]
[43228,false]
[43229,false]
[43230,true]
[43231,true]
[43232,true]
[43233,true]
[43234,true]
[43235,true]
[43236,true]
[43237,true]
[43238,true]
[43239,true]
[43240,false]
[43241,false]
[43242,false]
[43243,true]
[43244,false]
[43245,false]
[43246,false]
[43247,false]
[43248,false]
[43249,false]
[43250,false]
[43251,false]
[43252,false]
[43253,true]
[43254,false]
[43255,false]
[43256,false]
[43257,false]
[43258,false]
[43259,false]
[43260,false]
[43261,false]
[43262,false]
[43263,true]
[43264,false]
[43265,{"$f":"ISNUMBER(SEARCH(\"*4*2*3*\",A3267))","v":false}]
[43266,false]
[43267,false]
[43268,false]
[43269,false]
[43270,false]
[43271,false]
[43272,false]
[43273,true]
[43274,false]
[43275,false]
[43276,false]
[43277,false]
[43278,false]
[43279,false]
[43280,false]
[43281,false]
[43282,false]
[43283,true]
[43284,false]
[43285,false]
[43286,false]
[43287,false]
[43288,false]
[43289,false]
[43290,false]
[43291,false]
[43292,false]
[43293,true]
[43294,false]
[43295,false]
[43296,false]
[43297,false]
[43298,false]
[43299,false]
[43300,false]
[43301,false]
[43302,false]
[43303,false]
[43304,false]
[43305,false]
[43306,false]
[43307,false]
[43308,false]
[43309,false]
[43310,false]
[43311,false]
[43312,false]
[43313,false]
[43314,false]
[43315,false]
[43316,false]
[43317,false]
[43318,false]
[43319,false]
[43320,false]
[43321,false]
[43322,false]
[43323,true]
[43324,false]
[43325,false]
[43326,false]
[43327,false]
[43328,false]
[43329,{"$f":"ISNUMBER(SEARCH(\"*4*2*3*\",A3331))","v":false}]
[43330,false]
[43331,false]
[43332,false]
[43333,false]
[43334,false]
[43335,false]
[43336,false]
[43337,false]
[43338,false]
[43339,false]
[43340,false]
[43341,false]
[43342,false]
[43343,false]
[43344,false]
[43345,false]
[43346,false]
[43347,false]
[43348,false]
[43349,false]
[43350,false]
[43351,false]
[43352,false]
[43353,false]
[43354,false]
[43355,false]
[43356,false]
[43357,false]
[43358,false]
[43359,false]
[43360,false]
[43361,false]
[43362,false]
[43363,false]
[43364,false]
[43365,false]
[43366,false]
[43367,false]
[43368,false]
[43369,false]
[43370,false]
[43371,false]
[43372,false]
[43373,false]
[43374,false]
[43375,false]
[43376,false]
[43377,false]
[43378,false]
[43379,false]
[43380,false]
[43381,false]
[43382,false]
[43383,false]
[43384,false]
[43385,false]
[43386,false]
[43387,false]
[43388,false]
[43389,false]
[43390,false]
[43391,false]
[43392,false]
[43393,{"$f":"ISNUMBER(SEARCH(\"*4*2*3*\",A3395))","v":false}]
[43394,false]
[43395,false]
[43396,false]
[43397,false]
[43398,false]
[43399,false]
[43400,false]
[43401,false]
[43402,false]
[43403,false]
[43404,false]
[43405,false]
[43406,false]
[43407,false]
[43408,false]
[43409,false]
[43410,false]
[43411,false]
[43412,false]
[43413,false]
[43414,false]
[43415,false]
[43416,false]
[43417,false]
[43418,false]
[43419,false]
[43420,false]
[43421,false]
[43422,false]
[43423,true]
[43424,false]
[43425,false]
[43426,false]
[43427,false]
[43428,false]
[43429,false]
[43430,false]
[43431,false]
[43432,false]
[43433,false]
[43434,false]
[43435,false]
[43436,false]
[43437,false]
[43438,false]
[43439,false]
[43440,false]
[43441,false]
[43442,false]
[43443,false]
[43444,false]
[43445,false]
[43446,false]
[43447,false]
[43448,false]
[43449,false]
[43450,false]
[43451,false]
[43452,false]
[43453,false]
[43454,false]
[43455,false]
[43456,false]
[43457,{"$f":"ISNUMBER(SEARCH(\"*4*2*3*\",A3459))","v":false}]
[43458,false]
[43459,false]
[43460,false]
[43461,false]
[43462,false]
[43463,false]
[43464,false]
[43465,false]
[43466,false]
[43467,false]
[43468,false]
[43469,false]
[43470,false]
[43471,false]
[43472,false]
[43473,false]
[43474,false]
[43475,false]
[43476,false]
[43477,false]
[43478,false]
[43479,false]
[43480,false]
[43481,false]
[43482,false]
[43483,false]
[43484,false]
[43485,false]
[43486,false]
[43487,false]
[43488,false]
[43489,false]
[43490,false]
[43491,false]
[43492,false]
[43493,false]
[43494,false]
[43495,false]
[43496,false]
[43497,false]
[43498,false]
[43499,false]
[43500,false]
[43501,false]
[43502,false]
[43503,false]
[43504,false]
[43505,false]
[43506,false]
[43507,false]
[43508,false]
[43509,false]
[43510,false]
[43511,false]
[43512,false]
[43513,false]
[43514,false]
[43515,false]
[43516,false]
[43517,false]
[43518,false]
[43519,false]
[43520,false]
[43521,{"$f":"ISNUMBER(SEARCH(\"*4*2*3*\",A3523))","v":false}]
[43522,false]
[43523,true]
[43524,false]
[43525,false]
[43526,false]
[43527,false]
[43528,false]
[43529,false]
[43530,false]
[43531,false]
[43532,false]
[43533,false]
[43534,false]
[43535,false]
[43536,false]
[43537,false]
[43538,false]
[43539,false]
[43540,false]
[43541,false]
[43542,false]
[43543,false]
[43544,false]
[43545,false]
[43546,false]
[43547,false]
[43548,false]
[43549,false]
[43550,false]
[43551,false]
[43552,false]
[43553,false]
[43554,false]
[43555,false]
[43556,false]
[43557,false]
[43558,false]
[43559,false]
[43560,false]
[43561,false]
[43562,false]
[43563,false]
[43564,false]
[43565,false]
[43566,false]
[43567,false]
[43568,false]
[43569,false]
[43570,false]
[43571,false]
[43572,false]
[43573,false]
[43574,false]
[43575,false]
[43576,false]
[43577,false]
[43578,false]
[43579,false]
[43580,false]
[43581,false]
[43582,false]
[43583,false]
[43584,false]
[43585,{"$f":"ISNUMBER(SEARCH(\"*4*2*3*\",A3587))","v":false}]
[43586,false]
[43587,false]
[43588,false]
[43589,false]
[43590,false]
[43591,false]
[43592,false]
[43593,false]
[43594,false]
[43595,false]
[43596,false]
[43597,false]
[43598,false]
[43599,false]
[43600,false]
[43601,false]
[43602,false]
[43603,false]
[43604,false]
[43605,false]
[43606,false]
[43607,false]
[43608,false]
[43609,false]
[43610,false]
[43611,false]
[43612,false]
[43613,false]
[43614,false]
[43615,false]
[43616,false]
[43617,false]
[43618,false]
[43619,false]
[43620,false]
[43621,false]
[43622,false]
[43623,true]
[43624,false]
[43625,false]
[43626,false]
[43627,false]
[43628,false]
[43629,false]
[43630,false]
[43631,false]
[43632,false]
[43633,false]
[43634,false]
[43635,false]
[43636,false]
[43637,false]
[43638,false]
[43639,false]
[43640,false]
[43641,false]
[43642,false]
[43643,false]
[43644,false]
[43645,false]
[43646,false]
[43647,false]
[43648,false]
[43649,{"$f":"ISNUMBER(SEARCH(\"*4*2*3*\",A3651))","v":false}]
[43650,false]
[43651,false]
[43652,false]
[43653,false]
[43654,false]
[43655,false]
[43656,false]
[43657,false]
[43658,false]
[43659,false]
[43660,false]
[43661,false]
[43662,false]
[43663,false]
[43664,false]
[43665,false]
[43666,false]
[43667,false]
[43668,false]
[43669,false]
[43670,false]
[43671,false]
[43672,false]
[43673,false]
[43674,false]
[43675,false]
[43676,false]
[43677,false]
[43678,false]
[43679,false]
[43680,false]
[43681,false]
[43682,false]
[43683,false]
[43684,false]
[43685,false]
[43686,false]
[43687,false]
[43688,false]
[43689,false]
[43690,false]
[43691,false]
[43692,false]
[43693,false]
[43694,false]
[43695,false]
[43696,false]
[43697,false]
[43698,false]
[43699,false]
[43700,false]
[43701,false]
[43702,false]
[43703,false]
[43704,false]
[43705,false]
[43706,false]
[43707,false]
[43708,false]
[43709,false]
[43710,false]
[43711,false]
[43712,false]
[43713,{"$f":"ISNUMBER(SEARCH(\"*4*2*3*\",A3715))","v":false}]
[43714,false]
[43715,false]
[43716,false]
[43717,false]
[43718,false]
[43719,false]
[43720,false]
[43721,false]
[43722,false]
[43723,true]
[43724,false]
[43725,false]
[43726,false]
[43727,false]
[43728,false]
[43729,false]
[43730,false]
[43731,false]
[43732,false]
[43733,false]
[43734,false]
[43735,false]
[43736,false]
[43737,false]
[43738,false]
[43739,false]
[43740,false]
[43741,false]
[43742,false]
[43743,false]
[43744,false]
[43745,false]
[43746,false]
[43747,false]
[43748,false]
[43749,false]
[43750,false]
[43751,false]
[43752,false]
[43753,false]
[43754,false]
[43755,false]
[43756,false]
[43757,false]
[43758,false]
[43759,false]
[43760,false]
[43761,false]
[43762,false]
[43763,false]
[43764,false]
[43765,false]
[43766,false]
[43767,false]
[43768,false]
[43769,false]
[43770,false]
[43771,false]
[43772,false]
[43773,false]
[43774,false]
[43775,false]
[43776,false]
[43777,{"$f":"ISNUMBER(SEARCH(\"*4*2*3*\",A3779))","v":false}]
[43778,false]
[43779,false]
[43780,false]
[43781,false]
[43782,false]
[43783,false]
[43784,false]
[43785,false]
[43786,false]
[43787,false]
[43788,false]
[43789,false]
[43790,false]
[43791,false]
[43792,false]
[43793,false]
[43794,false]
[43795,false]
[43796,false]
[43797,false]
[43798,false]
[43799,false]
[43800,false]
[43801,false]
[43802,false]
[43803,false]
[43804,false]
[43805,false]
[43806,false]
[43807,false]
[43808,false]
[43809,false]
[43810,false]
[43811,false]
[43812,false]
[43813,false]
[43814,false]
[43815,false]
[43816,false]
[43817,false]
[43818,false]
[43819,false]
[43820,false]
[43821,false]
[43822,false]
[43823,true]
[43824,false]
[43825,false]
[43826,false]
[43827,false]
[43828,false]
[43829,false]
[43830,false]
[43831,false]
[43832,false]
[43833,false]
[43834,false]
[43835,false]
[43836,false]
[43837,false]
[43838,false]
[43839,false]
[43840,false]
[43841,{"$f":"ISNUMBER(SEARCH(\"*4*2*3*\",A3843))","v":false}]
[43842,false]
[43843,false]
[43844,false]
[43845,false]
[43846,false]
[43847,false]
[43848,false]
[43849,false]
[43850,false]
[43851,false]
[43852,false]
[43853,false]
[43854,false]
[43855,false]
[43856,false]
[43857,false]
[43858,false]
[43859,false]
[43860,false]
[43861,false]
[43862,false]
[43863,false]
[43864,false]
[43865,false]
[43866,false]
[43867,false]
[43868,false]
[43869,false]
[43870,false]
[43871,false]
[43872,false]
[43873,false]
[43874,false]
[43875,false]
[43876,false]
[43877,false]
[43878,false]
[43879,false]
[43880,false]
[43881,false]
[43882,false]
[43883,false]
[43884,false]
[43885,false]
[43886,false]
[43887,false]
[43888,false]
[43889,false]
[43890,false]
[43891,false]
[43892,false]
[43893,false]
[43894,false]
[43895,false]
[43896,false]
[43897,false]
[43898,false]
[43899,false]
[43900,false]
[43901,false]
[43902,false]
[43903,false]
[43904,false]
[43905,{"$f":"ISNUMBER(SEARCH(\"*4*2*3*\",A3907))","v":false}]
[43906,false]
[43907,false]
[43908,false]
[43909,false]
[43910,false]
[43911,false]
[43912,false]
[43913,false]
[43914,false]
[43915,false]
[43916,false]
[43917,false]
[43918,false]
[43919,false]
[43920,false]
[43921,false]
[43922,false]
[43923,true]
[43924,false]
[43925,false]
[43926,false]
[43927,false]
[43928,false]
[43929,false]
[43930,false]
[43931,false]
[43932,false]
[43933,false]
[43934,false]
[43935,false]
[43936,false]
[43937,false]
[43938,false]
[43939,false]
[43940,false]
[43941,false]
[43942,false]
[43943,false]
[43944,false]
[43945,false]
[43946,false]
[43947,false]
[43948,false]
[43949,false]
[43950,false]
[43951,false]
[43952,false]
[43953,false]
[43954,false]
[43955,false]
[43956,false]
[43957,false]
[43958,false]
[43959,false]
[43960,false]
[43961,false]
[43962,false]
[43963,false]
[43964,false]
[43965,false]
[43966,false]
[43967,false]
[43968,false]
[43969,{"$f":"ISNUMBER(SEARCH(\"*4*2*3*\",A3971))","v":false}]
[43970,false]
[43971,false]
[43972,false]
[43973,false]
[43974,false]
[43975,false]
[43976,false]
[43977,false]
[43978,false]
[43979,false]
[43980,false]
[43981,false]
[43982,false]
[43983,false]
[43984,false]
[43985,false]
[43986,false]
[43987,false]
[43988,false]
[43989,false]
[43990,false]
[43991,false]
[43992,false]
[43993,false]
[43994,false]
[43995,false]
[43996,false]
[43997,false]
[43998,false]
[43999,false]
[44000,false]
[44001,false]
[44002,false]
[44003,false]
[44004,false]
[44005,false]
[44006,false]
[44007,false]
[44008,false]
[44009,false]
[44010,false]
[44011,false]
[44012,false]
[44013,false]
[44014,false]
[44015,false]
[44016,false]
[44017,false]
[44018,false]
[44019,false]
[44020,false]
[44021,false]
[44022,false]
[44023,true]
[44024,false]
[44025,false]
[44026,false]
[44027,false]
[44028,false]
[44029,false]
[44030,false]
[44031,false]
[44032,false]
[44033,{"$f":"ISNUMBER(SEARCH(\"*4*2*3*\",A4035))","v":false}]
[44034,false]
[44035,false]
[44036,false]
[44037,false]
[44038,false]
[44039,false]
[44040,false]
[44041,false]
[44042,false]
[44043,false]
[44044,false]
[44045,false]
[44046,false]
[44047,false]
[44048,false]
[44049,false]
[44050,false]
[44051,false]
[44052,false]
[44053,false]
[44054,false]
[44055,false]
[44056,false]
[44057,false]
[44058,false]
[44059,false]
[44060,false]
[44061,false]
[44062,false]
[44063,false]
[44064,false]
[44065,false]
[44066,false]
[44067,false]
[44068,false]
[44069,false]
[44070,false]
[44071,false]
[44072,false]
[44073,false]
[44074,false]
[44075,false]
[44076,false]
[44077,false]
[44078,false]
[44079,false]
[44080,false]
[44081,false]
[44082,false]
[44083,false]
[44084,false]
[44085,false]
[44086,false]
[44087,false]
[44088,false]
[44089,false]
[44090,false]
[44091,false]
[44092,false]
[44093,false]
[44094,false]
[44095,false]
[44096,false]
[44097,{"$f":"ISNUMBER(SEARCH(\"*4*2*3*\",A4099))","v":false}]
[44098,false]
[44099,false]
[44100,false]
[44101,false]
[44102,false]
[44103,false]
[44104,false]
[44105,false]
[44106,false]
[44107,false]
[44108,false]
[44109,false]
[44110,false]
[44111,false]
[44112,false]
[44113,false]
[44114,false]
[44115,false]
[44116,false]
[44117,false]
[44118,false]
[44119,false]
[44120,false]
[44121,false]
[44122,false]
[44123,true]
[44124,false]
[44125,false]
[44126,false]
[44127,false]
[44128,false]
[44129,false]
[44130,false]
[44131,false]
[44132,false]
[44133,false]
[44134,false]
[44135,false]
[44136,false]
[44137,false]
[44138,false]
[44139,false]
[44140,false]
[44141,false]
[44142,false]
[44143,false]
[44144,false]
[44145,false]
[44146,false]
[44147,false]
[44148,false]
[44149,false]
[44150,false]
[44151,false]
[44152,false]
[44153,false]
[44154,false]
[44155,false]
[44156,false]
[44157,false]
[44158,false]
[44159,false]
[44160,false]
[44161,{"$f":"ISNUMBER(SEARCH(\"*4*2*3*\",A4163))","v":false}]
[44162,false]
[44163,false]
[44164,false]
[44165,false]
[44166,false]
[44167,false]
[44168,false]
[44169,false]
[44170,false]
[44171,false]
[44172,false]
[44173,false]
[44174,false]
[44175,false]
[44176,false]
[44177,false]
[44178,false]
[44179,false]
[44180,false]
[44181,false]
[44182,false]
[44183,false]
[44184,false]
[44185,false]
[44186,false]
[44187,false]
[44188,false]
[44189,false]
[44190,false]
[44191,false]
[44192,false]
[44193,false]
[44194,false]
[44195,false]
[44196,false]
[44197,false]
[44198,false]
[44199,false]
[44200,false]
[44201,false]
[44202,false]
[44203,true]
[44204,false]
[44205,false]
[44206,false]
[44207,false]
[44208,false]
[44209,false]
[44210,false]
[44211,false]
[44212,false]
[44213,true]
[44214,false]
[44215,false]
[44216,false]
[44217,false]
[44218,false]
[44219,false]
[44220,false]
[44221,false]
[44222,false]
[44223,true]
[44224,false]
[44225,{"$f":"ISNUMBER(SEARCH(\"*4*2*3*\",A4227))","v":false}]
[44226,false]
[44227,false]
[44228,false]
[44229,false]
[44230,true]
[44231,true]
[44232,true]
[44233,true]
[44234,true]
[44235,true]
[44236,true]
[44237,true]
[44238,true]
[44239,true]
[44240,false]
[44241,false]
[44242,false]
[44243,true]
[44244,false]
[44245,false]
[44246,false]
[44247,false]
[44248,false]
[44249,false]
[44250,false]
[44251,false]
[44252,false]
[44253,true]
[44254,false]
[44255,false]
[44256,false]
[44257,false]
[44258,false]
[44259,false]
[44260,false]
[44261,false]
[44262,false]
[44263,true]
[44264,false]
[44265,false]
[44266,false]
[44267,false]
[44268,false]
[44269,false]
[44270,false]
[44271,false]
[44272,false]
[44273,true]
[44274,false]
[44275,false]
[44276,false]
[44277,false]
[44278,false]
[44279,false]
[44280,false]
[44281,false]
[44282,false]
[44283,true]
[44284,false]
[44285,false]
[44286,false]
[44287,false]
[44288,false]
[44289,{"$f":"ISNUMBER(SEARCH(\"*4*2*3*\",A4291))","v":false}]
[44290,false]
[44291,false]
[44292,false]
[44293,true]
[44294,false]
[44295,false]
[44296,false]
[44297,false]
[44298,false]
[44299,false]
[44300,false]
[44301,false]
[44302,false]
[44303,false]
[44304,false]
[44305,false]
[44306,false]
[44307,false]
[44308,false]
[44309,false]
[44310,false]
[44311,false]
[44312,false]
[44313,false]
[44314,false]
[44315,false]
[44316,false]
[44317,false]
[44318,false]
[44319,false]
[44320,false]
[44321,false]
[44322,false]
[44323,true]
[44324,false]
[44325,false]
[44326,false]
[44327,false]
[44328,false]
[44329,false]
[44330,false]
[44331,false]
[44332,false]
[44333,false]
[44334,false]
[44335,false]
[44336,false]
[44337,false]
[44338,false]
[44339,false]
[44340,false]
[44341,false]
[44342,false]
[44343,false]
[44344,false]
[44345,false]
[44346,false]
[44347,false]
[44348,false]
[44349,false]
[44350,false]
[44351,false]
[44352,false]
[44353,{"$f":"ISNUMBER(SEARCH(\"*4*2*3*\",A4355))","v":false}]
[44354,false]
[44355,false]
[44356,false]
[44357,false]
[44358,false]
[44359,false]
[44360,false]
[44361,false]
[44362,false]
[44363,false]
[44364,false]
[44365,false]
[44366,false]
[44367,false]
[44368,false]
[44369,false]
[44370,false]
[44371,false]
[44372,false]
[44373,false]
[44374,false]
[44375,false]
[44376,false]
[44377,false]
[44378,false]
[44379,false]
[44380,false]
[44381,false]
[44382,false]
[44383,false]
[44384,false]
[44385,false]
[44386,false]
[44387,false]
[44388,false]
[44389,false]
[44390,false]
[44391,false]
[44392,false]
[44393,false]
[44394,false]
[44395,false]
[44396,false]
[44397,false]
[44398,false]
[44399,false]
[44400,false]
[44401,false]
[44402,false]
[44403,false]
[44404,false]
[44405,false]
[44406,false]
[44407,false]
[44408,false]
[44409,false]
[44410,false]
[44411,false]
[44412,false]
[44413,false]
[44414,false]
[44415,false]
[44416,false]
[44417,{"$f":"ISNUMBER(SEARCH(\"*4*2*3*\",A4419))","v":false}]
[44418,false]
[44419,false]
[44420,false]
[44421,false]
[44422,false]
[44423,true]
[44424,false]
[44425,false]
[44426,false]
[44427,false]
[44428,false]
[44429,false]
[44430,false]
[44431,false]
[44432,false]
[44433,false]
[44434,false]
[44435,false]
[44436,false]
[44437,false]
[44438,false]
[44439,false]
[44440,false]
[44441,false]
[44442,false]
[44443,false]
[44444,false]
[44445,false]
[44446,false]
[44447,false]
[44448,false]
[44449,false]
[44450,false]
[44451,false]
[44452,false]
[44453,false]
[44454,false]
[44455,false]
[44456,false]
[44457,false]
[44458,false]
[44459,false]
[44460,false]
[44461,false]
[44462,false]
[44463,false]
[44464,false]
[44465,false]
[44466,false]
[44467,false]
[44468,false]
[44469,false]
[44470,false]
[44471,false]
[44472,false]
[44473,false]
[44474,false]
[44475,false]
[44476,false]
[44477,false]
[44478,false]
[44479,false]
[44480,false]
[44481,{"$f":"ISNUMBER(SEARCH(\"*4*2*3*\",A4483))","v":false}]
[44482,false]
[44483,false]
[44484,false]
[44485,false]
[44486,false]
[44487,false]
[44488,false]
[44489,false]
[44490,false]
[44491,false]
[44492,false]
[44493,false]
[44494,false]
[44495,false]
[44496,false]
[44497,false]
[44498,false]
[44499,false]
[44500,false]
[44501,false]
[44502,false]
[44503,false]
[44504,false]
[44505,false]
[44506,false]
[44507,false]
[44508,false]
[44509,false]
[44510,false]
[44511,false]
[44512,false]
[44513,false]
[44514,false]
[44515,false]
[44516,false]
[44517,false]
[44518,false]
[44519,false]
[44520,false]
[44521,false]
[44522,false]
[44523,true]
[44524,false]
[44525,false]
[44526,false]
[44527,false]
[44528,false]
[44529,false]
[44530,false]
[44531,false]
[44532,false]
[44533,false]
[44534,false]
[44535,false]
[44536,false]
[44537,false]
[44538,false]
[44539,false]
[44540,false]
[44541,false]
[44542,false]
[44543,false]
[44544,false]
[44545,{"$f":"ISNUMBER(SEARCH(\"*4*2*3*\",A4547))","v":false}]
[44546,false]
[44547,false]
[44548,false]
[44549,false]
[44550,false]
[44551,false]
[44552,false]
[44553,false]
[44554,false]
[44555,false]
[44556,false]
[44557,false]
[44558,false]
[44559,false]
[44560,false]
[44561,false]
[44562,false]
[44563,false]
[44564,false]
[44565,false]
[44566,false]
[44567,false]
[44568,false]
[44569,false]
[44570,false]
[44571,false]
[44572,false]
[44573,false]
[44574,false]
[44575,false]
[44576,false]
[44577,false]
[44578,false]
[44579,false]
[44580,false]
[44581,false]
[44582,false]
[44583,false]
[44584,false]
[44585,false]
[44586,false]
[44587,false]
[44588,false]
[44589,false]
[44590,false]
[44591,false]
[44592,false]
[44593,false]
[44594,false]
[44595,false]
[44596,false]
[44597,false]
[44598,false]
[44599,false]
[44600,false]
[44601,false]
[44602,false]
[44603,false]
[44604,false]
[44605,false]
[44606,false]
[44607,false]
[44608,false]
[44609,{"$f":"ISNUMBER(SEARCH(\"*4*2*3*\",A4611))","v":false}]
[44610,false]
[44611,false]
[44612,false]
[44613,false]
[44614,false]
[44615,false]
[44616,false]
[44617,false]
[44618,false]
[44619,false]
[44620,false]
[44621,false]
[44622,false]
[44623,true]
[44624,false]
[44625,false]
[44626,false]
[44627,false]
[44628,false]
[44629,false]
[44630,false]
[44631,false]
[44632,false]
[44633,false]
[44634,false]
[44635,false]
[44636,false]
[44637,false]
[44638,false]
[44639,false]
[44640,false]
[44641,false]
[44642,false]
[44643,false]
[44644,false]
[44645,false]
[44646,false]
[44647,false]
[44648,false]
[44649,false]
[44650,false]
[44651,false]
[44652,false]
[44653,false]
[44654,false]
[44655,false]
[44656,false]
[44657,false]
[44658,false]
[44659,false]
[44660,false]
[44661,false]
[44662,false]
[44663,false]
[44664,false]
[44665,false]
[44666,false]
[44667,false]
[44668,false]
[44669,false]
[44670,false]
[44671,false]
[44672,false]
[44673,{"$f":"ISNUMBER(SEARCH(\"*4*2*3*\",A4675))","v":false}]
[44674,false]
[44675,false]
[44676,false]
[44677,false]
[44678,false]
[44679,false]
[44680,false]
[44681,false]
[44682,false]
[44683,false]
[44684,false]
[44685,false]
[44686,false]
[44687,false]
[44688,false]
[44689,false]
[44690,false]
[44691,false]
[44692,false]
[44693,false]
[44694,false]
[44695,false]
[44696,false]
[44697,false]
[44698,false]
[44699,false]
[44700,false]
[44701,false]
[44702,false]
[44703,false]
[44704,false]
[44705,false]
[44706,false]
[44707,false]
[44708,false]
[44709,false]
[44710,false]
[44711,false]
[44712,false]
[44713,false]
[44714,false]
[44715,false]
[44716,false]
[44717,false]
[44718,false]
[44719,false]
[44720,false]
[44721,false]
[44722,false]
[44723,true]
[44724,false]
[44725,false]
[44726,false]
[44727,false]
[44728,false]
[44729,false]
[44730,false]
[44731,false]
[44732,false]
[44733,false]
[44734,false]
[44735,false]
[44736,false]
[44737,{"$f":"ISNUMBER(SEARCH(\"*4*2*3*\",A4739))","v":false}]
[44738,false]
[44739,false]
[44740,false]
[44741,false]
[44742,false]
[44743,false]
[44744,false]
[44745,false]
[44746,false]
[44747,false]
[44748,false]
[44749,false]
[44750,false]
[44751,false]
[44752,false]
[44753,false]
[44754,false]
[44755,false]
[44756,false]
[44757,false]
[44758,false]
[44759,false]
[44760,false]
[44761,false]
[44762,false]
[44763,false]
[44764,false]
[44765,false]
[44766,false]
[44767,false]
[44768,false]
[44769,false]
[44770,false]
[44771,false]
[44772,false]
[44773,false]
[44774,false]
[44775,false]
[44776,false]
[44777,false]
[44778,false]
[44779,false]
[44780,false]
[44781,false]
[44782,false]
[44783,false]
[44784,false]
[44785,false]
[44786,false]
[44787,false]
[44788,false]
[44789,false]
[44790,false]
[44791,false]
[44792,false]
[44793,false]
[44794,false]
[44795,false]
[44796,false]
[44797,false]
[44798,false]
[44799,false]
[44800,false]
[44801,{"$f":"ISNUMBER(SEARCH(\"*4*2*3*\",A4803))","v":false}]
[44802,false]
[44803,false]
[44804,false]
[44805,false]
[44806,false]
[44807,false]
[44808,false]
[44809,false]
[44810,false]
[44811,false]
[44812,false]
[44813,false]
[44814,false]
[44815,false]
[44816,false]
[44817,false]
[44818,false]
[44819,false]
[44820,false]
[44821,false]
[44822,false]
[44823,true]
[44824,false]
[44825,false]
[44826,false]
[44827,false]
[44828,false]
[44829,false]
[44830,false]
[44831,false]
[44832,false]
[44833,false]
[44834,false]
[44835,false]
[44836,false]
[44837,false]
[44838,false]
[44839,false]
[44840,false]
[44841,false]
[44842,false]
[44843,false]
[44844,false]
[44845,false]
[44846,false]
[44847,false]
[44848,false]
[44849,false]
[44850,false]
[44851,false]
[44852,false]
[44853,false]
[44854,false]
[44855,false]
[44856,false]
[44857,false]
[44858,false]
[44859,false]
[44860,false]
[44861,false]
[44862,false]
[44863,false]
[44864,false]
[44865,{"$f":"ISNUMBER(SEARCH(\"*4*2*3*\",A4867))","v":false}]
[44866,false]
[44867,false]
[44868,false]
[44869,false]
[44870,false]
[44871,false]
[44872,false]
[44873,false]
[44874,false]
[44875,false]
[44876,false]
[44877,false]
[44878,false]
[44879,false]
[44880,false]
[44881,false]
[44882,false]
[44883,false]
[44884,false]
[44885,false]
[44886,false]
[44887,false]
[44888,false]
[44889,false]
[44890,false]
[44891,false]
[44892,false]
[44893,false]
[44894,false]
[44895,false]
[44896,false]
[44897,false]
[44898,false]
[44899,false]
[44900,false]
[44901,false]
[44902,false]
[44903,false]
[44904,false]
[44905,false]
[44906,false]
[44907,false]
[44908,false]
[44909,false]
[44910,false]
[44911,false]
[44912,false]
[44913,false]
[44914,false]
[44915,false]
[44916,false]
[44917,false]
[44918,false]
[44919,false]
[44920,false]
[44921,false]
[44922,false]
[44923,true]
[44924,false]
[44925,false]
[44926,false]
[44927,false]
[44928,false]
[44929,{"$f":"ISNUMBER(SEARCH(\"*4*2*3*\",A4931))","v":false}]
[44930,false]
[44931,false]
[44932,false]
[44933,false]
[44934,false]
[44935,false]
[44936,false]
[44937,false]
[44938,false]
[44939,false]
[44940,false]
[44941,false]
[44942,false]
[44943,false]
[44944,false]
[44945,false]
[44946,false]
[44947,false]
[44948,false]
[44949,false]
[44950,false]
[44951,false]
[44952,false]
[44953,false]
[44954,false]
[44955,false]
[44956,false]
[44957,false]
[44958,false]
[44959,false]
[44960,false]
[44961,false]
[44962,false]
[44963,false]
[44964,false]
[44965,false]
[44966,false]
[44967,false]
[44968,false]
[44969,false]
[44970,false]
[44971,false]
[44972,false]
[44973,false]
[44974,false]
[44975,false]
[44976,false]
[44977,false]
[44978,false]
[44979,false]
[44980,false]
[44981,false]
[44982,false]
[44983,false]
[44984,false]
[44985,false]
[44986,false]
[44987,false]
[44988,false]
[44989,false]
[44990,false]
[44991,false]
[44992,false]
[44993,{"$f":"ISNUMBER(SEARCH(\"*4*2*3*\",A4995))","v":false}]
[44994,false]
[44995,false]
[44996,false]
[44997,false]
[44998,false]
[44999,false]
[45000,false]
[45001,false]
[45002,false]
[45003,false]
[45004,false]
[45005,false]
[45006,false]
[45007,false]
[45008,false]
[45009,false]
[45010,false]
[45011,false]
[45012,false]
[45013,false]
[45014,false]
[45015,false]
[45016,false]
[45017,false]
[45018,false]
[45019,false]
[45020,false]
[45021,false]
[45022,false]
[45023,true]
[45024,false]
[45025,false]
[45026,false]
[45027,false]
[45028,false]
[45029,false]
[45030,false]
[45031,false]
[45032,false]
[45033,false]
[45034,false]
[45035,false]
[45036,false]
[45037,false]
[45038,false]
[45039,false]
[45040,false]
[45041,false]
[45042,false]
[45043,false]
[45044,false]
[45045,false]
[45046,false]
[45047,false]
[45048,false]
[45049,false]
[45050,false]
[45051,false]
[45052,false]
[45053,false]
[45054,false]
[45055,false]
[45056,false]
[45057,{"$f":"ISNUMBER(SEARCH(\"*4*2*3*\",A5059))","v":false}]
[45058,false]
[45059,false]
[45060,false]
[45061,false]
[45062,false]
[45063,false]
[45064,false]
[45065,false]
[45066,false]
[45067,false]
[45068,false]
[45069,false]
[45070,false]
[45071,false]
[45072,false]
[45073,false]
[45074,false]
[45075,false]
[45076,false]
[45077,false]
[45078,false]
[45079,false]
[45080,false]
[45081,false]
[45082,false]
[45083,false]
[45084,false]
[45085,false]
[45086,false]
[45087,false]
[45088,false]
[45089,false]
[45090,false]
[45091,false]
[45092,false]
[45093,false]
[45094,false]
[45095,false]
[45096,false]
[45097,false]
[45098,false]
[45099,false]
[45100,false]
[45101,false]
[45102,false]
[45103,false]
[45104,false]
[45105,false]
[45106,false]
[45107,false]
[45108,false]
[45109,false]
[45110,false]
[45111,false]
[45112,false]
[45113,false]
[45114,false]
[45115,false]
[45116,false]
[45117,false]
[45118,false]
[45119,false]
[45120,false]
[45121,{"$f":"ISNUMBER(SEARCH(\"*4*2*3*\",A5123))","v":false}]
[45122,false]
[45123,true]
[45124,false]
[45125,false]
[45126,false]
[45127,false]
[45128,false]
[45129,false]
[45130,false]
[45131,false]
[45132,false]
[45133,false]
[45134,false]
[45135,false]
[45136,false]
[45137,false]
[45138,false]
[45139,false]
[45140,false]
[45141,false]
[45142,false]
[45143,false]
[45144,false]
[45145,false]
[45146,false]
[45147,false]
[45148,false]
[45149,false]
[45150,false]
[45151,false]
[45152,false]
[45153,false]
[45154,false]
[45155,false]
[45156,false]
[45157,false]
[45158,false]
[45159,false]
[45160,false]
[45161,false]
[45162,false]
[45163,false]
[45164,false]
[45165,false]
[45166,false]
[45167,false]
[45168,false]
[45169,false]
[45170,false]
[45171,false]
[45172,false]
[45173,false]
[45174,false]
[45175,false]
[45176,false]
[45177,false]
[45178,false]
[45179,false]
[45180,false]
[45181,false]
[45182,false]
[45183,false]
[45184,false]
[45185,{"$f":"ISNUMBER(SEARCH(\"*4*2*3*\",A5187))","v":false}]
[45186,false]
[45187,false]
[45188,false]
[45189,false]
[45190,false]
[45191,false]
[45192,false]
[45193,false]
[45194,false]
[45195,false]
[45196,false]
[45197,false]
[45198,false]
[45199,false]
[45200,false]
[45201,false]
[45202,false]
[45203,true]
[45204,false]
[45205,false]
[45206,false]
[45207,false]
[45208,false]
[45209,false]
[45210,false]
[45211,false]
[45212,false]
[45213,true]
[45214,false]
[45215,false]
[45216,false]
[45217,false]
[45218,false]
[45219,false]
[45220,false]
[45221,false]
[45222,false]
[45223,true]
[45224,false]
[45225,false]
[45226,false]
[45227,false]
[45228,false]
[45229,false]
[45230,true]
[45231,true]
[45232,true]
[45233,true]
[45234,true]
[45235,true]
[45236,true]
[45237,true]
[45238,true]
[45239,true]
[45240,false]
[45241,false]
[45242,false]
[45243,true]
[45244,false]
[45245,false]
[45246,false]
[45247,false]
[45248,false]
[45249,{"$f":"ISNUMBER(SEARCH(\"*4*2*3*\",A5251))","v":false}]
[45250,false]
[45251,false]
[45252,false]
[45253,true]
[45254,false]
[45255,false]
[45256,false]
[45257,false]
[45258,false]
[45259,false]
[45260,false]
[45261,false]
[45262,false]
[45263,true]
[45264,false]
[45265,false]
[45266,false]
[45267,false]
[45268,false]
[45269,false]
[45270,false]
[45271,false]
[45272,false]
[45273,true]
[45274,false]
[45275,false]
[45276,false]
[45277,false]
[45278,false]
[45279,false]
[45280,false]
[45281,false]
[45282,false]
[45283,true]
[45284,false]
[45285,false]
[45286,false]
[45287,false]
[45288,false]
[45289,false]
[45290,false]
[45291,false]
[45292,false]
[45293,true]
[45294,false]
[45295,false]
[45296,false]
[45297,false]
[45298,false]
[45299,false]
[45300,false]
[45301,false]
[45302,false]
[45303,false]
[45304,false]
[45305,false]
[45306,false]
[45307,false]
[45308,false]
[45309,false]
[45310,false]
[45311,false]
[45312,false]
[45313,{"$f":"ISNUMBER(SEARCH(\"*4*2*3*\",A5315))","v":false}]
[45314,false]
[45315,false]
[45316,false]
[45317,false]
[45318,false]
[45319,false]
[45320,false]
[45321,false]
[45322,false]
[45323,true]
[45324,false]
[45325,false]
[45326,false]
[45327,false]
[45328,false]
[45329,false]
[45330,false]
[45331,false]
[45332,false]
[45333,false]
[45334,false]
[45335,false]
[45336,false]
[45337,false]
[45338,false]
[45339,false]
[45340,false]
[45341,false]
[45342,false]
[45343,false]
[45344,false]
[45345,false]
[45346,false]
[45347,false]
[45348,false]
[45349,false]
[45350,false]
[45351,false]
[45352,false]
[45353,false]
[45354,false]
[45355,false]
[45356,false]
[45357,false]
[45358,false]
[45359,false]
[45360,false]
[45361,false]
[45362,false]
[45363,false]
[45364,false]
[45365,false]
[45366,false]
[45367,false]
[45368,false]
[45369,false]
[45370,false]
[45371,false]
[45372,false]
[45373,false]
[45374,false]
[45375,false]
[45376,false]
[45377,{"$f":"ISNUMBER(SEARCH(\"*4*2*3*\",A5379))","v":false}]
[45378,false]
[45379,false]
[45380,false]
[45381,false]
[45382,false]
[45383,false]
[45384,false]
[45385,false]
[45386,false]
[45387,false]
[45388,false]
[45389,false]
[45390,false]
[45391,false]
[45392,false]
[45393,false]
[45394,false]
[45395,false]
[45396,false]
[45397,false]
[45398,false]
[45399,false]
[45400,false]
[45401,false]
[45402,false]
[45403,false]
[45404,false]
[45405,false]
[45406,false]
[45407,false]
[45408,false]
[45409,false]
[45410,false]
[45411,false]
[45412,false]
[45413,false]
[45414,false]
[45415,false]
[45416,false]
[45417,false]
[45418,false]
[45419,false]
[45420,false]
[45421,false]
[45422,false]
[45423,true]
[45424,false]
[45425,false]
[45426,false]
[45427,false]
[45428,false]
[45429,false]
[45430,false]
[45431,false]
[45432,false]
[45433,false]
[45434,false]
[45435,false]
[45436,false]
[45437,false]
[45438,false]
[45439,false]
[45440,false]
[45441,{"$f":"ISNUMBER(SEARCH(\"*4*2*3*\",A5443))","v":false}]
[45442,false]
[45443,false]
[45444,false]
[45445,false]
[45446,false]
[45447,false]
[45448,false]
[45449,false]
[45450,false]
[45451,false]
[45452,false]
[45453,false]
[45454,false]
[45455,false]
[45456,false]
[45457,false]
[45458,false]
[45459,false]
[45460,false]
[45461,false]
[45462,false]
[45463,false]
[45464,false]
[45465,false]
[45466,false]
[45467,false]
[45468,false]
[45469,false]
[45470,false]
[45471,false]
[45472,false]
[45473,false]
[45474,false]
[45475,false]
[45476,false]
[45477,false]
[45478,false]
[45479,false]
[45480,false]
[45481,false]
[45482,false]
[45483,false]
[45484,false]
[45485,false]
[45486,false]
[45487,false]
[45488,false]
[45489,false]
[45490,false]
[45491,false]
[45492,false]
[45493,false]
[45494,false]
[45495,false]
[45496,false]
[45497,false]
[45498,false]
[45499,false]
[45500,false]
[45501,false]
[45502,false]
[45503,false]
[45504,false]
[45505,{"$f":"ISNUMBER(SEARCH(\"*4*2*3*\",A5507))","v":false}]
[45506,false]
[45507,false]
[45508,false]
[45509,false]
[45510,false]
[45511,false]
[45512,false]
[45513,false]
[45514,false]
[45515,false]
[45516,false]
[45517,false]
[45518,false]
[45519,false]
[45520,false]
[45521,false]
[45522,false]
[45523,true]
[45524,false]
[45525,false]
[45526,false]
[45527,false]
[45528,false]
[45529,false]
[45530,false]
[45531,false]
[45532,false]
[45533,false]
[45534,false]
[45535,false]
[45536,false]
[45537,false]
[45538,false]
[45539,false]
[45540,false]
[45541,false]
[45542,false]
[45543,false]
[45544,false]
[45545,false]
[45546,false]
[45547,false]
[45548,false]
[45549,false]
[45550,false]
[45551,false]
[45552,false]
[45553,false]
[45554,false]
[45555,false]
[45556,false]
[45557,false]
[45558,false]
[45559,false]
[45560,false]
[45561,false]
[45562,false]
[45563,false]
[45564,false]
[45565,false]
[45566,false]
[45567,false]
[45568,false]
[45569,{"$f":"ISNUMBER(SEARCH(\"*4*2*3*\",A5571))","v":false}]
[45570,false]
[45571,false]
[45572,false]
[45573,false]
[45574,false]
[45575,false]
[45576,false]
[45577,false]
[45578,false]
[45579,false]
[45580,false]
[45581,false]
[45582,false]
[45583,false]
[45584,false]
[45585,false]
[45586,false]
[45587,false]
[45588,false]
[45589,false]
[45590,false]
[45591,false]
[45592,false]
[45593,false]
[45594,false]
[45595,false]
[45596,false]
[45597,false]
[45598,false]
[45599,false]
[45600,false]
[45601,false]
[45602,false]
[45603,false]
[45604,false]
[45605,false]
[45606,false]
[45607,false]
[45608,false]
[45609,false]
[45610,false]
[45611,false]
[45612,false]
[45613,false]
[45614,false]
[45615,false]
[45616,false]
[45617,false]
[45618,false]
[45619,false]
[45620,false]
[45621,false]
[45622,false]
[45623,true]
[45624,false]
[45625,false]
[45626,false]
[45627,false]
[45628,false]
[45629,false]
[45630,false]
[45631,false]
[45632,false]
[45633,{"$f":"ISNUMBER(SEARCH(\"*4*2*3*\",A5635))","v":false}]
[45634,false]
[45635,false]
[45636,false]
[45637,false]
[45638,false]
[45639,false]
[45640,false]
[45641,false]
[45642,false]
[45643,false]
[45644,false]
[45645,false]
[45646,false]
[45647,false]
[45648,false]
[45649,false]
[45650,false]
[45651,false]
[45652,false]
[45653,false]
[45654,false]
[45655,false]
[45656,false]
[45657,false]
[45658,false]
[45659,false]
[45660,false]
[45661,false]
[45662,false]
[45663,false]
[45664,false]
[45665,false]
[45666,false]
[45667,false]
[45668,false]
[45669,false]
[45670,false]
[45671,false]
[45672,false]
[45673,false]
[45674,false]
[45675,false]
[45676,false]
[45677,false]
[45678,false]
[45679,false]
[45680,false]
[45681,false]
[45682,false]
[45683,false]
[45684,false]
[45685,false]
[45686,false]
[45687,false]
[45688,false]
[45689,false]
[45690,false]
[45691,false]
[45692,false]
[45693,false]
[45694,false]
[45695,false]
[45696,false]
[45697,{"$f":"ISNUMBER(SEARCH(\"*4*2*3*\",A5699))","v":false}]
[45698,false]
[45699,false]
[45700,false]
[45701,false]
[45702,false]
[45703,false]
[45704,false]
[45705,false]
[45706,false]
[45707,false]
[45708,false]
[45709,false]
[45710,false]
[45711,false]
[45712,false]
[45713,false]
[45714,false]
[45715,false]
[45716,false]
[45717,false]
[45718,false]
[45719,false]
[45720,false]
[45721,false]
[45722,false]
[45723,true]
[45724,false]
[45725,false]
[45726,false]
[45727,false]
[45728,false]
[45729,false]
[45730,false]
[45731,false]
[45732,false]
[45733,false]
[45734,false]
[45735,false]
[45736,false]
[45737,false]
[45738,false]
[45739,false]
[45740,false]
[45741,false]
[45742,false]
[45743,false]
[45744,false]
[45745,false]
[45746,false]
[45747,false]
[45748,false]
[45749,false]
[45750,false]
[45751,false]
[45752,false]
[45753,false]
[45754,false]
[45755,false]
[45756,false]
[45757,false]
[45758,false]
[45759,false]
[45760,false]
[45761,{"$f":"ISNUMBER(SEARCH(\"*4*2*3*\",A5763))","v":false}]
[45762,false]
[45763,false]
[45764,false]
[45765,false]
[45766,false]
[45767,false]
[45768,false]
[45769,false]
[45770,false]
[45771,false]
[45772,false]
[45773,false]
[45774,false]
[45775,false]
[45776,false]
[45777,false]
[45778,false]
[45779,false]
[45780,false]
[45781,false]
[45782,false]
[45783,false]
[45784,false]
[45785,false]
[45786,false]
[45787,false]
[45788,false]
[45789,false]
[45790,false]
[45791,false]
[45792,false]
[45793,false]
[45794,false]
[45795,false]
[45796,false]
[45797,false]
[45798,false]
[45799,false]
[45800,false]
[45801,false]
[45802,false]
[45803,false]
[45804,false]
[45805,false]
[45806,false]
[45807,false]
[45808,false]
[45809,false]
[45810,false]
[45811,false]
[45812,false]
[45813,false]
[45814,false]
[45815,false]
[45816,false]
[45817,false]
[45818,false]
[45819,false]
[45820,false]
[45821,false]
[45822,false]
[45823,true]
[45824,false]
[45825,{"$f":"ISNUMBER(SEARCH(\"*4*2*3*\",A5827))","v":false}]
[45826,false]
[45827,false]
[45828,false]
[45829,false]
[45830,false]
[45831,false]
[45832,false]
[45833,false]
[45834,false]
[45835,false]
[45836,false]
[45837,false]
[45838,false]
[45839,false]
[45840,false]
[45841,false]
[45842,false]
[45843,false]
[45844,false]
[45845,false]
[45846,false]
[45847,false]
[45848,false]
[45849,false]
[45850,false]
[45851,false]
[45852,false]
[45853,false]
[45854,false]
[45855,false]
[45856,false]
[45857,false]
[45858,false]
[45859,false]
[45860,false]
[45861,false]
[45862,false]
[45863,false]
[45864,false]
[45865,false]
[45866,false]
[45867,false]
[45868,false]
[45869,false]
[45870,false]
[45871,false]
[45872,false]
[45873,false]
[45874,false]
[45875,false]
[45876,false]
[45877,false]
[45878,false]
[45879,false]
[45880,false]
[45881,false]
[45882,false]
[45883,false]
[45884,false]
[45885,false]
[45886,false]
[45887,false]
[45888,false]
[45889,{"$f":"ISNUMBER(SEARCH(\"*4*2*3*\",A5891))","v":false}]
[45890,false]
[45891,false]
[45892,false]
[45893,false]
[45894,false]
[45895,false]
[45896,false]
[45897,false]
[45898,false]
[45899,false]
[45900,false]
[45901,false]
[45902,false]
[45903,false]
[45904,false]
[45905,false]
[45906,false]
[45907,false]
[45908,false]
[45909,false]
[45910,false]
[45911,false]
[45912,false]
[45913,false]
[45914,false]
[45915,false]
[45916,false]
[45917,false]
[45918,false]
[45919,false]
[45920,false]
[45921,false]
[45922,false]
[45923,true]
[45924,false]
[45925,false]
[45926,false]
[45927,false]
[45928,false]
[45929,false]
[45930,false]
[45931,false]
[45932,false]
[45933,false]
[45934,false]
[45935,false]
[45936,false]
[45937,false]
[45938,false]
[45939,false]
[45940,false]
[45941,false]
[45942,false]
[45943,false]
[45944,false]
[45945,false]
[45946,false]
[45947,false]
[45948,false]
[45949,false]
[45950,false]
[45951,false]
[45952,false]
[45953,{"$f":"ISNUMBER(SEARCH(\"*4*2*3*\",A5955))","v":false}]
[45954,false]
[45955,false]
[45956,false]
[45957,false]
[45958,false]
[45959,false]
[45960,false]
[45961,false]
[45962,false]
[45963,false]
[45964,false]
[45965,false]
[45966,false]
[45967,false]
[45968,false]
[45969,false]
[45970,false]
[45971,false]
[45972,false]
[45973,false]
[45974,false]
[45975,false]
[45976,false]
[45977,false]
[45978,false]
[45979,false]
[45980,false]
[45981,false]
[45982,false]
[45983,false]
[45984,false]
[45985,false]
[45986,false]
[45987,false]
[45988,false]
[45989,false]
[45990,false]
[45991,false]
[45992,false]
[45993,false]
[45994,false]
[45995,false]
[45996,false]
[45997,false]
[45998,false]
[45999,false]
[46000,false]
[46001,false]
[46002,false]
[46003,false]
[46004,false]
[46005,false]
[46006,false]
[46007,false]
[46008,false]
[46009,false]
[46010,false]
[46011,false]
[46012,false]
[46013,false]
[46014,false]
[46015,false]
[46016,false]
[46017,{"$f":"ISNUMBER(SEARCH(\"*4*2*3*\",A6019))","v":false}]
[46018,false]
[46019,false]
[46020,false]
[46021,false]
[46022,false]
[46023,true]
[46024,false]
[46025,false]
[46026,false]
[46027,false]
[46028,false]
[46029,false]
[46030,false]
[46031,false]
[46032,false]
[46033,false]
[46034,false]
[46035,false]
[46036,false]
[46037,false]
[46038,false]
[46039,false]
[46040,false]
[46041,false]
[46042,false]
[46043,false]
[46044,false]
[46045,false]
[46046,false]
[46047,false]
[46048,false]
[46049,false]
[46050,false]
[46051,false]
[46052,false]
[46053,false]
[46054,false]
[46055,false]
[46056,false]
[46057,false]
[46058,false]
[46059,false]
[46060,false]
[46061,false]
[46062,false]
[46063,false]
[46064,false]
[46065,false]
[46066,false]
[46067,false]
[46068,false]
[46069,false]
[46070,false]
[46071,false]
[46072,false]
[46073,false]
[46074,false]
[46075,false]
[46076,false]
[46077,false]
[46078,false]
[46079,false]
[46080,false]
[46081,{"$f":"ISNUMBER(SEARCH(\"*4*2*3*\",A6083))","v":false}]
[46082,false]
[46083,false]
[46084,false]
[46085,false]
[46086,false]
[46087,false]
[46088,false]
[46089,false]
[46090,false]
[46091,false]
[46092,false]
[46093,false]
[46094,false]
[46095,false]
[46096,false]
[46097,false]
[46098,false]
[46099,false]
[46100,false]
[46101,false]
[46102,false]
[46103,false]
[46104,false]
[46105,false]
[46106,false]
[46107,false]
[46108,false]
[46109,false]
[46110,false]
[46111,false]
[46112,false]
[46113,false]
[46114,false]
[46115,false]
[46116,false]
[46117,false]
[46118,false]
[46119,false]
[46120,false]
[46121,false]
[46122,false]
[46123,true]
[46124,false]
[46125,false]
[46126,false]
[46127,false]
[46128,false]
[46129,false]
[46130,false]
[46131,false]
[46132,false]
[46133,false]
[46134,false]
[46135,false]
[46136,false]
[46137,false]
[46138,false]
[46139,false]
[46140,false]
[46141,false]
[46142,false]
[46143,false]
[46144,false]
[46145,{"$f":"ISNUMBER(SEARCH(\"*4*2*3*\",A6147))","v":false}]
[46146,false]
[46147,false]
[46148,false]
[46149,false]
[46150,false]
[46151,false]
[46152,false]
[46153,false]
[46154,false]
[46155,false]
[46156,false]
[46157,false]
[46158,false]
[46159,false]
[46160,false]
[46161,false]
[46162,false]
[46163,false]
[46164,false]
[46165,false]
[46166,false]
[46167,false]
[46168,false]
[46169,false]
[46170,false]
[46171,false]
[46172,false]
[46173,false]
[46174,false]
[46175,false]
[46176,false]
[46177,false]
[46178,false]
[46179,false]
[46180,false]
[46181,false]
[46182,false]
[46183,false]
[46184,false]
[46185,false]
[46186,false]
[46187,false]
[46188,false]
[46189,false]
[46190,false]
[46191,false]
[46192,false]
[46193,false]
[46194,false]
[46195,false]
[46196,false]
[46197,false]
[46198,false]
[46199,false]
[46200,false]
[46201,false]
[46202,false]
[46203,true]
[46204,false]
[46205,false]
[46206,false]
[46207,false]
[46208,false]
[46209,{"$f":"ISNUMBER(SEARCH(\"*4*2*3*\",A6211))","v":false}]
[46210,false]
[46211,false]
[46212,false]
[46213,true]
[46214,false]
[46215,false]
[46216,false]
[46217,false]
[46218,false]
[46219,false]
[46220,false]
[46221,false]
[46222,false]
[46223,true]
[46224,false]
[46225,false]
[46226,false]
[46227,false]
[46228,false]
[46229,false]
[46230,true]
[46231,true]
[46232,true]
[46233,true]
[46234,true]
[46235,true]
[46236,true]
[46237,true]
[46238,true]
[46239,true]
[46240,false]
[46241,false]
[46242,false]
[46243,true]
[46244,false]
[46245,false]
[46246,false]
[46247,false]
[46248,false]
[46249,false]
[46250,false]
[46251,false]
[46252,false]
[46253,true]
[46254,false]
[46255,false]
[46256,false]
[46257,false]
[46258,false]
[46259,false]
[46260,false]
[46261,false]
[46262,false]
[46263,true]
[46264,false]
[46265,false]
[46266,false]
[46267,false]
[46268,false]
[46269,false]
[46270,false]
[46271,false]
[46272,false]
[46273,{"$f":"ISNUMBER(SEARCH(\"*4*2*3*\",A6275))","v":true}]
[46274,false]
[46275,false]
[46276,false]
[46277,false]
[46278,false]
[46279,false]
[46280,false]
[46281,false]
[46282,false]
[46283,true]
[46284,false]
[46285,false]
[46286,false]
[46287,false]
[46288,false]
[46289,false]
[46290,false]
[46291,false]
[46292,false]
[46293,true]
[46294,false]
[46295,false]
[46296,false]
[46297,false]
[46298,false]
[46299,false]
[46300,false]
[46301,false]
[46302,false]
[46303,false]
[46304,false]
[46305,false]
[46306,false]
[46307,false]
[46308,false]
[46309,false]
[46310,false]
[46311,false]
[46312,false]
[46313,false]
[46314,false]
[46315,false]
[46316,false]
[46317,false]
[46318,false]
[46319,false]
[46320,false]
[46321,false]
[46322,false]
[46323,true]
[46324,false]
[46325,false]
[46326,false]
[46327,false]
[46328,false]
[46329,false]
[46330,false]
[46331,false]
[46332,false]
[46333,false]
[46334,false]
[46335,false]
[46336,false]
[46337,{"$f":"ISNUMBER(SEARCH(\"*4*2*3*\",A6339))","v":false}]
[46338,false]
[46339,false]
[46340,false]
[46341,false]
[46342,false]
[46343,false]
[46344,false]
[46345,false]
[46346,false]
[46347,false]
[46348,false]
[46349,false]
[46350,false]
[46351,false]
[46352,false]
[46353,false]
[46354,false]
[46355,false]
[46356,false]
[46357,false]
[46358,false]
[46359,false]
[46360,false]
[46361,false]
[46362,false]
[46363,false]
[46364,false]
[46365,false]
[46366,false]
[46367,false]
[46368,false]
[46369,false]
[46370,false]
[46371,false]
[46372,false]
[46373,false]
[46374,false]
[46375,false]
[46376,false]
[46377,false]
[46378,false]
[46379,false]
[46380,false]
[46381,false]
[46382,false]
[46383,false]
[46384,false]
[46385,false]
[46386,false]
[46387,false]
[46388,false]
[46389,false]
[46390,false]
[46391,false]
[46392,false]
[46393,false]
[46394,false]
[46395,false]
[46396,false]
[46397,false]
[46398,false]
[46399,false]
[46400,false]
[46401,{"$f":"ISNUMBER(SEARCH(\"*4*2*3*\",A6403))","v":false}]
[46402,false]
[46403,false]
[46404,false]
[46405,false]
[46406,false]
[46407,false]
[46408,false]
[46409,false]
[46410,false]
[46411,false]
[46412,false]
[46413,false]
[46414,false]
[46415,false]
[46416,false]
[46417,false]
[46418,false]
[46419,false]
[46420,false]
[46421,false]
[46422,false]
[46423,true]
[46424,false]
[46425,false]
[46426,false]
[46427,false]
[46428,false]
[46429,false]
[46430,false]
[46431,false]
[46432,false]
[46433,false]
[46434,false]
[46435,false]
[46436,false]
[46437,false]
[46438,false]
[46439,false]
[46440,false]
[46441,false]
[46442,false]
[46443,false]
[46444,false]
[46445,false]
[46446,false]
[46447,false]
[46448,false]
[46449,false]
[46450,false]
[46451,false]
[46452,false]
[46453,false]
[46454,false]
[46455,false]
[46456,false]
[46457,false]
[46458,false]
[46459,false]
[46460,false]
[46461,false]
[46462,false]
[46463,false]
[46464,false]
[46465,{"$f":"ISNUMBER(SEARCH(\"*4*2*3*\",A6467))","v":false}]
[46466,false]
[46467,false]
[46468,false]
[46469,false]
[46470,false]
[46471,false]
[46472,false]
[46473,false]
[46474,false]
[46475,false]
[46476,false]
[46477,false]
[46478,false]
[46479,false]
[46480,false]
[46481,false]
[46482,false]
[46483,false]
[46484,false]
[46485,false]
[46486,false]
[46487,false]
[46488,false]
[46489,false]
[46490,false]
[46491,false]
[46492,false]
[46493,false]
[46494,false]
[46495,false]
[46496,false]
[46497,false]
[46498,false]
[46499,false]
[46500,false]
[46501,false]
[46502,false]
[46503,false]
[46504,false]
[46505,false]
[46506,false]
[46507,false]
[46508,false]
[46509,false]
[46510,false]
[46511,false]
[46512,false]
[46513,false]
[46514,false]
[46515,false]
[46516,false]
[46517,false]
[46518,false]
[46519,false]
[46520,false]
[46521,false]
[46522,false]
[46523,true]
[46524,false]
[46525,false]
[46526,false]
[46527,false]
[46528,false]
[46529,{"$f":"ISNUMBER(SEARCH(\"*4*2*3*\",A6531))","v":false}]
[46530,false]
[46531,false]
[46532,false]
[46533,false]
[46534,false]
[46535,false]
[46536,false]
[46537,false]
[46538,false]
[46539,false]
[46540,false]
[46541,false]
[46542,false]
[46543,false]
[46544,false]
[46545,false]
[46546,false]
[46547,false]
[46548,false]
[46549,false]
[46550,false]
[46551,false]
[46552,false]
[46553,false]
[46554,false]
[46555,false]
[46556,false]
[46557,false]
[46558,false]
[46559,false]
[46560,false]
[46561,false]
[46562,false]
[46563,false]
[46564,false]
[46565,false]
[46566,false]
[46567,false]
[46568,false]
[46569,false]
[46570,false]
[46571,false]
[46572,false]
[46573,false]
[46574,false]
[46575,false]
[46576,false]
[46577,false]
[46578,false]
[46579,false]
[46580,false]
[46581,false]
[46582,false]
[46583,false]
[46584,false]
[46585,false]
[46586,false]
[46587,false]
[46588,false]
[46589,false]
[46590,false]
[46591,false]
[46592,false]
[46593,{"$f":"ISNUMBER(SEARCH(\"*4*2*3*\",A6595))","v":false}]
[46594,false]
[46595,false]
[46596,false]
[46597,false]
[46598,false]
[46599,false]
[46600,false]
[46601,false]
[46602,false]
[46603,false]
[46604,false]
[46605,false]
[46606,false]
[46607,false]
[46608,false]
[46609,false]
[46610,false]
[46611,false]
[46612,false]
[46613,false]
[46614,false]
[46615,false]
[46616,false]
[46617,false]
[46618,false]
[46619,false]
[46620,false]
[46621,false]
[46622,false]
[46623,true]
[46624,false]
[46625,false]
[46626,false]
[46627,false]
[46628,false]
[46629,false]
[46630,false]
[46631,false]
[46632,false]
[46633,false]
[46634,false]
[46635,false]
[46636,false]
[46637,false]
[46638,false]
[46639,false]
[46640,false]
[46641,false]
[46642,false]
[46643,false]
[46644,false]
[46645,false]
[46646,false]
[46647,false]
[46648,false]
[46649,false]
[46650,false]
[46651,false]
[46652,false]
[46653,false]
[46654,false]
[46655,false]
[46656,false]
[46657,{"$f":"ISNUMBER(SEARCH(\"*4*2*3*\",A6659))","v":false}]
[46658,false]
[46659,false]
[46660,false]
[46661,false]
[46662,false]
[46663,false]
[46664,false]
[46665,false]
[46666,false]
[46667,false]
[46668,false]
[46669,false]
[46670,false]
[46671,false]
[46672,false]
[46673,false]
[46674,false]
[46675,false]
[46676,false]
[46677,false]
[46678,false]
[46679,false]
[46680,false]
[46681,false]
[46682,false]
[46683,false]
[46684,false]
[46685,false]
[46686,false]
[46687,false]
[46688,false]
[46689,false]
[46690,false]
[46691,false]
[46692,false]
[46693,false]
[46694,false]
[46695,false]
[46696,false]
[46697,false]
[46698,false]
[46699,false]
[46700,false]
[46701,false]
[46702,false]
[46703,false]
[46704,false]
[46705,false]
[46706,false]
[46707,false]
[46708,false]
[46709,false]
[46710,false]
[46711,false]
[46712,false]
[46713,false]
[46714,false]
[46715,false]
[46716,false]
[46717,false]
[46718,false]
[46719,false]
[46720,false]
[46721,{"$f":"ISNUMBER(SEARCH(\"*4*2*3*\",A6723))","v":false}]
[46722,false]
[46723,true]
[46724,false]
[46725,false]
[46726,false]
[46727,false]
[46728,false]
[46729,false]
[46730,false]
[46731,false]
[46732,false]
[46733,false]
[46734,false]
[46735,false]
[46736,false]
[46737,false]
[46738,false]
[46739,false]
[46740,false]
[46741,false]
[46742,false]
[46743,false]
[46744,false]
[46745,false]
[46746,false]
[46747,false]
[46748,false]
[46749,false]
[46750,false]
[46751,false]
[46752,false]
[46753,false]
[46754,false]
[46755,false]
[46756,false]
[46757,false]
[46758,false]
[46759,false]
[46760,false]
[46761,false]
[46762,false]
[46763,false]
[46764,false]
[46765,false]
[46766,false]
[46767,false]
[46768,false]
[46769,false]
[46770,false]
[46771,false]
[46772,false]
[46773,false]
[46774,false]
[46775,false]
[46776,false]
[46777,false]
[46778,false]
[46779,false]
[46780,false]
[46781,false]
[46782,false]
[46783,false]
[46784,false]
[46785,{"$f":"ISNUMBER(SEARCH(\"*4*2*3*\",A6787))","v":false}]
[46786,false]
[46787,false]
[46788,false]
[46789,false]
[46790,false]
[46791,false]
[46792,false]
[46793,false]
[46794,false]
[46795,false]
[46796,false]
[46797,false]
[46798,false]
[46799,false]
[46800,false]
[46801,false]
[46802,false]
[46803,false]
[46804,false]
[46805,false]
[46806,false]
[46807,false]
[46808,false]
[46809,false]
[46810,false]
[46811,false]
[46812,false]
[46813,false]
[46814,false]
[46815,false]
[46816,false]
[46817,false]
[46818,false]
[46819,false]
[46820,false]
[46821,false]
[46822,false]
[46823,true]
[46824,false]
[46825,false]
[46826,false]
[46827,false]
[46828,false]
[46829,false]
[46830,false]
[46831,false]
[46832,false]
[46833,false]
[46834,false]
[46835,false]
[46836,false]
[46837,false]
[46838,false]
[46839,false]
[46840,false]
[46841,false]
[46842,false]
[46843,false]
[46844,false]
[46845,false]
[46846,false]
[46847,false]
[46848,false]
[46849,{"$f":"ISNUMBER(SEARCH(\"*4*2*3*\",A6851))","v":false}]
[46850,false]
[46851,false]
[46852,false]
[46853,false]
[46854,false]
[46855,false]
[46856,false]
[46857,false]
[46858,false]
[46859,false]
[46860,false]
[46861,false]
[46862,false]
[46863,false]
[46864,false]
[46865,false]
[46866,false]
[46867,false]
[46868,false]
[46869,false]
[46870,false]
[46871,false]
[46872,false]
[46873,false]
[46874,false]
[46875,false]
[46876,false]
[46877,false]
[46878,false]
[46879,false]
[46880,false]
[46881,false]
[46882,false]
[46883,false]
[46884,false]
[46885,false]
[46886,false]
[46887,false]
[46888,false]
[46889,false]
[46890,false]
[46891,false]
[46892,false]
[46893,false]
[46894,false]
[46895,false]
[46896,false]
[46897,false]
[46898,false]
[46899,false]
[46900,false]
[46901,false]
[46902,false]
[46903,false]
[46904,false]
[46905,false]
[46906,false]
[46907,false]
[46908,false]
[46909,false]
[46910,false]
[46911,false]
[46912,false]
[46913,{"$f":"ISNUMBER(SEARCH(\"*4*2*3*\",A6915))","v":false}]
[46914,false]
[46915,false]
[46916,false]
[46917,false]
[46918,false]
[46919,false]
[46920,false]
[46921,false]
[46922,false]
[46923,true]
[46924,false]
[46925,false]
[46926,false]
[46927,false]
[46928,false]
[46929,false]
[46930,false]
[46931,false]
[46932,false]
[46933,false]
[46934,false]
[46935,false]
[46936,false]
[46937,false]
[46938,false]
[46939,false]
[46940,false]
[46941,false]
[46942,false]
[46943,false]
[46944,false]
[46945,false]
[46946,false]
[46947,false]
[46948,false]
[46949,false]
[46950,false]
[46951,false]
[46952,false]
[46953,false]
[46954,false]
[46955,false]
[46956,false]
[46957,false]
[46958,false]
[46959,false]
[46960,false]
[46961,false]
[46962,false]
[46963,false]
[46964,false]
[46965,false]
[46966,false]
[46967,false]
[46968,false]
[46969,false]
[46970,false]
[46971,false]
[46972,false]
[46973,false]
[46974,false]
[46975,false]
[46976,false]
[46977,{"$f":"ISNUMBER(SEARCH(\"*4*2*3*\",A6979))","v":false}]
[46978,false]
[46979,false]
[46980,false]
[46981,false]
[46982,false]
[46983,false]
[46984,false]
[46985,false]
[46986,false]
[46987,false]
[46988,false]
[46989,false]
[46990,false]
[46991,false]
[46992,false]
[46993,false]
[46994,false]
[46995,false]
[46996,false]
[46997,false]
[46998,false]
[46999,false]
[47000,false]
[47001,false]
[47002,false]
[47003,false]
[47004,false]
[47005,false]
[47006,false]
[47007,false]
[47008,false]
[47009,false]
[47010,false]
[47011,false]
[47012,false]
[47013,false]
[47014,false]
[47015,false]
[47016,false]
[47017,false]
[47018,false]
[47019,false]
[47020,false]
[47021,false]
[47022,false]
[47023,true]
[47024,false]
[47025,false]
[47026,false]
[47027,false]
[47028,false]
[47029,false]
[47030,false]
[47031,false]
[47032,false]
[47033,false]
[47034,false]
[47035,false]
[47036,false]
[47037,false]
[47038,false]
[47039,false]
[47040,false]
[47041,{"$f":"ISNUMBER(SEARCH(\"*4*2*3*\",A7043))","v":false}]
[47042,false]
[47043,false]
[47044,false]
[47045,false]
[47046,false]
[47047,false]
[47048,false]
[47049,false]
[47050,false]
[47051,false]
[47052,false]
[47053,false]
[47054,false]
[47055,false]
[47056,false]
[47057,false]
[47058,false]
[47059,false]
[47060,false]
[47061,false]
[47062,false]
[47063,false]
[47064,false]
[47065,false]
[47066,false]
[47067,false]
[47068,false]
[47069,false]
[47070,false]
[47071,false]
[47072,false]
[47073,false]
[47074,false]
[47075,false]
[47076,false]
[47077,false]
[47078,false]
[47079,false]
[47080,false]
[47081,false]
[47082,false]
[47083,false]
[47084,false]
[47085,false]
[47086,false]
[47087,false]
[47088,false]
[47089,false]
[47090,false]
[47091,false]
[47092,false]
[47093,false]
[47094,false]
[47095,false]
[47096,false]
[47097,false]
[47098,false]
[47099,false]
[47100,false]
[47101,false]
[47102,false]
[47103,false]
[47104,false]
[47105,{"$f":"ISNUMBER(SEARCH(\"*4*2*3*\",A7107))","v":false}]
[47106,false]
[47107,false]
[47108,false]
[47109,false]
[47110,false]
[47111,false]
[47112,false]
[47113,false]
[47114,false]
[47115,false]
[47116,false]
[47117,false]
[47118,false]
[47119,false]
[47120,false]
[47121,false]
[47122,false]
[47123,true]
[47124,false]
[47125,false]
[47126,false]
[47127,false]
[47128,false]
[47129,false]
[47130,false]
[47131,false]
[47132,false]
[47133,false]
[47134,false]
[47135,false]
[47136,false]
[47137,false]
[47138,false]
[47139,false]
[47140,false]
[47141,false]
[47142,false]
[47143,false]
[47144,false]
[47145,false]
[47146,false]
[47147,false]
[47148,false]
[47149,false]
[47150,false]
[47151,false]
[47152,false]
[47153,false]
[47154,false]
[47155,false]
[47156,false]
[47157,false]
[47158,false]
[47159,false]
[47160,false]
[47161,false]
[47162,false]
[47163,false]
[47164,false]
[47165,false]
[47166,false]
[47167,false]
[47168,false]
[47169,{"$f":"ISNUMBER(SEARCH(\"*4*2*3*\",A7171))","v":false}]
[47170,false]
[47171,false]
[47172,false]
[47173,false]
[47174,false]
[47175,false]
[47176,false]
[47177,false]
[47178,false]
[47179,false]
[47180,false]
[47181,false]
[47182,false]
[47183,false]
[47184,false]
[47185,false]
[47186,false]
[47187,false]
[47188,false]
[47189,false]
[47190,false]
[47191,false]
[47192,false]
[47193,false]
[47194,false]
[47195,false]
[47196,false]
[47197,false]
[47198,false]
[47199,false]
[47200,false]
[47201,false]
[47202,false]
[47203,true]
[47204,false]
[47205,false]
[47206,false]
[47207,false]
[47208,false]
[47209,false]
[47210,false]
[47211,false]
[47212,false]
[47213,true]
[47214,false]
[47215,false]
[47216,false]
[47217,false]
[47218,false]
[47219,false]
[47220,false]
[47221,false]
[47222,false]
[47223,true]
[47224,false]
[47225,false]
[47226,false]
[47227,false]
[47228,false]
[47229,false]
[47230,true]
[47231,true]
[47232,true]
[47233,{"$f":"ISNUMBER(SEARCH(\"*4*2*3*\",A7235))","v":true}]
[47234,true]
[47235,true]
[47236,true]
[47237,true]
[47238,true]
[47239,true]
[47240,false]
[47241,false]
[47242,false]
[47243,true]
[47244,false]
[47245,false]
[47246,false]
[47247,false]
[47248,false]
[47249,false]
[47250,false]
[47251,false]
[47252,false]
[47253,true]
[47254,false]
[47255,false]
[47256,false]
[47257,false]
[47258,false]
[47259,false]
[47260,false]
[47261,false]
[47262,false]
[47263,true]
[47264,false]
[47265,false]
[47266,false]
[47267,false]
[47268,false]
[47269,false]
[47270,false]
[47271,false]
[47272,false]
[47273,true]
[47274,false]
[47275,false]
[47276,false]
[47277,false]
[47278,false]
[47279,false]
[47280,false]
[47281,false]
[47282,false]
[47283,true]
[47284,false]
[47285,false]
[47286,false]
[47287,false]
[47288,false]
[47289,false]
[47290,false]
[47291,false]
[47292,false]
[47293,true]
[47294,false]
[47295,false]
[47296,false]
[47297,{"$f":"ISNUMBER(SEARCH(\"*4*2*3*\",A7299))","v":false}]
[47298,false]
[47299,false]
[47300,false]
[47301,false]
[47302,false]
[47303,false]
[47304,false]
[47305,false]
[47306,false]
[47307,false]
[47308,false]
[47309,false]
[47310,false]
[47311,false]
[47312,false]
[47313,false]
[47314,false]
[47315,false]
[47316,false]
[47317,false]
[47318,false]
[47319,false]
[47320,false]
[47321,false]
[47322,false]
[47323,true]
[47324,false]
[47325,false]
[47326,false]
[47327,false]
[47328,false]
[47329,false]
[47330,false]
[47331,false]
[47332,false]
[47333,false]
[47334,false]
[47335,false]
[47336,false]
[47337,false]
[47338,false]
[47339,false]
[47340,false]
[47341,false]
[47342,false]
[47343,false]
[47344,false]
[47345,false]
[47346,false]
[47347,false]
[47348,false]
[47349,false]
[47350,false]
[47351,false]
[47352,false]
[47353,false]
[47354,false]
[47355,false]
[47356,false]
[47357,false]
[47358,false]
[47359,false]
[47360,false]
[47361,{"$f":"ISNUMBER(SEARCH(\"*4*2*3*\",A7363))","v":false}]
[47362,false]
[47363,false]
[47364,false]
[47365,false]
[47366,false]
[47367,false]
[47368,false]
[47369,false]
[47370,false]
[47371,false]
[47372,false]
[47373,false]
[47374,false]
[47375,false]
[47376,false]
[47377,false]
[47378,false]
[47379,false]
[47380,false]
[47381,false]
[47382,false]
[47383,false]
[47384,false]
[47385,false]
[47386,false]
[47387,false]
[47388,false]
[47389,false]
[47390,false]
[47391,false]
[47392,false]
[47393,false]
[47394,false]
[47395,false]
[47396,false]
[47397,false]
[47398,false]
[47399,false]
[47400,false]
[47401,false]
[47402,false]
[47403,false]
[47404,false]
[47405,false]
[47406,false]
[47407,false]
[47408,false]
[47409,false]
[47410,false]
[47411,false]
[47412,false]
[47413,false]
[47414,false]
[47415,false]
[47416,false]
[47417,false]
[47418,false]
[47419,false]
[47420,false]
[47421,false]
[47422,false]
[47423,true]
[47424,false]
[47425,{"$f":"ISNUMBER(SEARCH(\"*4*2*3*\",A7427))","v":false}]
[47426,false]
[47427,false]
[47428,false]
[47429,false]
[47430,false]
[47431,false]
[47432,false]
[47433,false]
[47434,false]
[47435,false]
[47436,false]
[47437,false]
[47438,false]
[47439,false]
[47440,false]
[47441,false]
[47442,false]
[47443,false]
[47444,false]
[47445,false]
[47446,false]
[47447,false]
[47448,false]
[47449,false]
[47450,false]
[47451,false]
[47452,false]
[47453,false]
[47454,false]
[47455,false]
[47456,false]
[47457,false]
[47458,false]
[47459,false]
[47460,false]
[47461,false]
[47462,false]
[47463,false]
[47464,false]
[47465,false]
[47466,false]
[47467,false]
[47468,false]
[47469,false]
[47470,false]
[47471,false]
[47472,false]
[47473,false]
[47474,false]
[47475,false]
[47476,false]
[47477,false]
[47478,false]
[47479,false]
[47480,false]
[47481,false]
[47482,false]
[47483,false]
[47484,false]
[47485,false]
[47486,false]
[47487,false]
[47488,false]
[47489,{"$f":"ISNUMBER(SEARCH(\"*4*2*3*\",A7491))","v":false}]
[47490,false]
[47491,false]
[47492,false]
[47493,false]
[47494,false]
[47495,false]
[47496,false]
[47497,false]
[47498,false]
[47499,false]
[47500,false]
[47501,false]
[47502,false]
[47503,false]
[47504,false]
[47505,false]
[47506,false]
[47507,false]
[47508,false]
[47509,false]
[47510,false]
[47511,false]
[47512,false]
[47513,false]
[47514,false]
[47515,false]
[47516,false]
[47517,false]
[47518,false]
[47519,false]
[47520,false]
[47521,false]
[47522,false]
[47523,true]
[47524,false]
[47525,false]
[47526,false]
[47527,false]
[47528,false]
[47529,false]
[47530,false]
[47531,false]
[47532,false]
[47533,false]
[47534,false]
[47535,false]
[47536,false]
[47537,false]
[47538,false]
[47539,false]
[47540,false]
[47541,false]
[47542,false]
[47543,false]
[47544,false]
[47545,false]
[47546,false]
[47547,false]
[47548,false]
[47549,false]
[47550,false]
[47551,false]
[47552,false]
[47553,{"$f":"ISNUMBER(SEARCH(\"*4*2*3*\",A7555))","v":false}]
[47554,false]
[47555,false]
[47556,false]
[47557,false]
[47558,false]
[47559,false]
[47560,false]
[47561,false]
[47562,false]
[47563,false]
[47564,false]
[47565,false]
[47566,false]
[47567,false]
[47568,false]
[47569,false]
[47570,false]
[47571,false]
[47572,false]
[47573,false]
[47574,false]
[47575,false]
[47576,false]
[47577,false]
[47578,false]
[47579,false]
[47580,false]
[47581,false]
[47582,false]
[47583,false]
[47584,false]
[47585,false]
[47586,false]
[47587,false]
[47588,false]
[47589,false]
[47590,false]
[47591,false]
[47592,false]
[47593,false]
[47594,false]
[47595,false]
[47596,false]
[47597,false]
[47598,false]
[47599,false]
[47600,false]
[47601,false]
[47602,false]
[47603,false]
[47604,false]
[47605,false]
[47606,false]
[47607,false]
[47608,false]
[47609,false]
[47610,false]
[47611,false]
[47612,false]
[47613,false]
[47614,false]
[47615,false]
[47616,false]
[47617,{"$f":"ISNUMBER(SEARCH(\"*4*2*3*\",A7619))","v":false}]
[47618,false]
[47619,false]
[47620,false]
[47621,false]
[47622,false]
[47623,true]
[47624,false]
[47625,false]
[47626,false]
[47627,false]
[47628,false]
[47629,false]
[47630,false]
[47631,false]
[47632,false]
[47633,false]
[47634,false]
[47635,false]
[47636,false]
[47637,false]
[47638,false]
[47639,false]
[47640,false]
[47641,false]
[47642,false]
[47643,false]
[47644,false]
[47645,false]
[47646,false]
[47647,false]
[47648,false]
[47649,false]
[47650,false]
[47651,false]
[47652,false]
[47653,false]
[47654,false]
[47655,false]
[47656,false]
[47657,false]
[47658,false]
[47659,false]
[47660,false]
[47661,false]
[47662,false]
[47663,false]
[47664,false]
[47665,false]
[47666,false]
[47667,false]
[47668,false]
[47669,false]
[47670,false]
[47671,false]
[47672,false]
[47673,false]
[47674,false]
[47675,false]
[47676,false]
[47677,false]
[47678,false]
[47679,false]
[47680,false]
[47681,{"$f":"ISNUMBER(SEARCH(\"*4*2*3*\",A7683))","v":false}]
[47682,false]
[47683,false]
[47684,false]
[47685,false]
[47686,false]
[47687,false]
[47688,false]
[47689,false]
[47690,false]
[47691,false]
[47692,false]
[47693,false]
[47694,false]
[47695,false]
[47696,false]
[47697,false]
[47698,false]
[47699,false]
[47700,false]
[47701,false]
[47702,false]
[47703,false]
[47704,false]
[47705,false]
[47706,false]
[47707,false]
[47708,false]
[47709,false]
[47710,false]
[47711,false]
[47712,false]
[47713,false]
[47714,false]
[47715,false]
[47716,false]
[47717,false]
[47718,false]
[47719,false]
[47720,false]
[47721,false]
[47722,false]
[47723,true]
[47724,false]
[47725,false]
[47726,false]
[47727,false]
[47728,false]
[47729,false]
[47730,false]
[47731,false]
[47732,false]
[47733,false]
[47734,false]
[47735,false]
[47736,false]
[47737,false]
[47738,false]
[47739,false]
[47740,false]
[47741,false]
[47742,false]
[47743,false]
[47744,false]
[47745,{"$f":"ISNUMBER(SEARCH(\"*4*2*3*\",A7747))","v":false}]
[47746,false]
[47747,false]
[47748,false]
[47749,false]
[47750,false]
[47751,false]
[47752,false]
[47753,false]
[47754,false]
[47755,false]
[47756,false]
[47757,false]
[47758,false]
[47759,false]
[47760,false]
[47761,false]
[47762,false]
[47763,false]
[47764,false]
[47765,false]
[47766,false]
[47767,false]
[47768,false]
[47769,false]
[47770,false]
[47771,false]
[47772,false]
[47773,false]
[47774,false]
[47775,false]
[47776,false]
[47777,false]
[47778,false]
[47779,false]
[47780,false]
[47781,false]
[47782,false]
[47783,false]
[47784,false]
[47785,false]
[47786,false]
[47787,false]
[47788,false]
[47789,false]
[47790,false]
[47791,false]
[47792,false]
[47793,false]
[47794,false]
[47795,false]
[47796,false]
[47797,false]
[47798,false]
[47799,false]
[47800,false]
[47801,false]
[47802,false]
[47803,false]
[47804,false]
[47805,false]
[47806,false]
[47807,false]
[47808,false]
[47809,{"$f":"ISNUMBER(SEARCH(\"*4*2*3*\",A7811))","v":false}]
[47810,false]
[47811,false]
[47812,false]
[47813,false]
[47814,false]
[47815,false]
[47816,false]
[47817,false]
[47818,false]
[47819,false]
[47820,false]
[47821,false]
[47822,false]
[47823,true]
[47824,false]
[47825,false]
[47826,false]
[47827,false]
[47828,false]
[47829,false]
[47830,false]
[47831,false]
[47832,false]
[47833,false]
[47834,false]
[47835,false]
[47836,false]
[47837,false]
[47838,false]
[47839,false]
[47840,false]
[47841,false]
[47842,false]
[47843,false]
[47844,false]
[47845,false]
[47846,false]
[47847,false]
[47848,false]
[47849,false]
[47850,false]
[47851,false]
[47852,false]
[47853,false]
[47854,false]
[47855,false]
[47856,false]
[47857,false]
[47858,false]
[47859,false]
[47860,false]
[47861,false]
[47862,false]
[47863,false]
[47864,false]
[47865,false]
[47866,false]
[47867,false]
[47868,false]
[47869,false]
[47870,false]
[47871,false]
[47872,false]
[47873,{"$f":"ISNUMBER(SEARCH(\"*4*2*3*\",A7875))","v":false}]
[47874,false]
[47875,false]
[47876,false]
[47877,false]
[47878,false]
[47879,false]
[47880,false]
[47881,false]
[47882,false]
[47883,false]
[47884,false]
[47885,false]
[47886,false]
[47887,false]
[47888,false]
[47889,false]
[47890,false]
[47891,false]
[47892,false]
[47893,false]
[47894,false]
[47895,false]
[47896,false]
[47897,false]
[47898,false]
[47899,false]
[47900,false]
[47901,false]
[47902,false]
[47903,false]
[47904,false]
[47905,false]
[47906,false]
[47907,false]
[47908,false]
[47909,false]
[47910,false]
[47911,false]
[47912,false]
[47913,false]
[47914,false]
[47915,false]
[47916,false]
[47917,false]
[47918,false]
[47919,false]
[47920,false]
[47921,false]
[47922,false]
[47923,true]
[47924,false]
[47925,false]
[47926,false]
[47927,false]
[47928,false]
[47929,false]
[47930,false]
[47931,false]
[47932,false]
[47933,false]
[47934,false]
[47935,false]
[47936,false]
[47937,{"$f":"ISNUMBER(SEARCH(\"*4*2*3*\",A7939))","v":false}]
[47938,false]
[47939,false]
[47940,false]
[47941,false]
[47942,false]
[47943,false]
[47944,false]
[47945,false]
[47946,false]
[47947,false]
[47948,false]
[47949,false]
[47950,false]
[47951,false]
[47952,false]
[47953,false]
[47954,false]
[47955,false]
[47956,false]
[47957,false]
[47958,false]
[47959,false]
[47960,false]
[47961,false]
[47962,false]
[47963,false]
[47964,false]
[47965,false]
[47966,false]
[47967,false]
[47968,false]
[47969,false]
[47970,false]
[47971,false]
[47972,false]
[47973,false]
[47974,false]
[47975,false]
[47976,false]
[47977,false]
[47978,false]
[47979,false]
[47980,false]
[47981,false]
[47982,false]
[47983,false]
[47984,false]
[47985,false]
[47986,false]
[47987,false]
[47988,false]
[47989,false]
[47990,false]
[47991,false]
[47992,false]
[47993,false]
[47994,false]
[47995,false]
[47996,false]
[47997,false]
[47998,false]
[47999,false]
[48000,false]
[48001,{"$f":"ISNUMBER(SEARCH(\"*4*2*3*\",A8003))","v":false}]
[48002,false]
[48003,false]
[48004,false]
[48005,false]
[48006,false]
[48007,false]
[48008,false]
[48009,false]
[48010,false]
[48011,false]
[48012,false]
[48013,false]
[48014,false]
[48015,false]
[48016,false]
[48017,false]
[48018,false]
[48019,false]
[48020,false]
[48021,false]
[48022,false]
[48023,true]
[48024,false]
[48025,false]
[48026,false]
[48027,false]
[48028,false]
[48029,false]
[48030,false]
[48031,false]
[48032,false]
[48033,false]
[48034,false]
[48035,false]
[48036,false]
[48037,false]
[48038,false]
[48039,false]
[48040,false]
[48041,false]
[48042,false]
[48043,false]
[48044,false]
[48045,false]
[48046,false]
[48047,false]
[48048,false]
[48049,false]
[48050,false]
[48051,false]
[48052,false]
[48053,false]
[48054,false]
[48055,false]
[48056,false]
[48057,false]
[48058,false]
[48059,false]
[48060,false]
[48061,false]
[48062,false]
[48063,false]
[48064,false]
[48065,{"$f":"ISNUMBER(SEARCH(\"*4*2*3*\",A8067))","v":false}]
[48066,false]
[48067,false]
[48068,false]
[48069,false]
[48070,false]
[48071,false]
[48072,false]
[48073,false]
[48074,false]
[48075,false]
[48076,false]
[48077,false]
[48078,false]
[48079,false]
[48080,false]
[48081,false]
[48082,false]
[48083,false]
[48084,false]
[48085,false]
[48086,false]
[48087,false]
[48088,false]
[48089,false]
[48090,false]
[48091,false]
[48092,false]
[48093,false]
[48094,false]
[48095,false]
[48096,false]
[48097,false]
[48098,false]
[48099,false]
[48100,false]
[48101,false]
[48102,false]
[48103,false]
[48104,false]
[48105,false]
[48106,false]
[48107,false]
[48108,false]
[48109,false]
[48110,false]
[48111,false]
[48112,false]
[48113,false]
[48114,false]
[48115,false]
[48116,false]
[48117,false]
[48118,false]
[48119,false]
[48120,false]
[48121,false]
[48122,false]
[48123,true]
[48124,false]
[48125,false]
[48126,false]
[48127,false]
[48128,false]
[48129,{"$f":"ISNUMBER(SEARCH(\"*4*2*3*\",A8131))","v":false}]
[48130,false]
[48131,false]
[48132,false]
[48133,false]
[48134,false]
[48135,false]
[48136,false]
[48137,false]
[48138,false]
[48139,false]
[48140,false]
[48141,false]
[48142,false]
[48143,false]
[48144,false]
[48145,false]
[48146,false]
[48147,false]
[48148,false]
[48149,false]
[48150,false]
[48151,false]
[48152,false]
[48153,false]
[48154,false]
[48155,false]
[48156,false]
[48157,false]
[48158,false]
[48159,false]
[48160,false]
[48161,false]
[48162,false]
[48163,false]
[48164,false]
[48165,false]
[48166,false]
[48167,false]
[48168,false]
[48169,false]
[48170,false]
[48171,false]
[48172,false]
[48173,false]
[48174,false]
[48175,false]
[48176,false]
[48177,false]
[48178,false]
[48179,false]
[48180,false]
[48181,false]
[48182,false]
[48183,false]
[48184,false]
[48185,false]
[48186,false]
[48187,false]
[48188,false]
[48189,false]
[48190,false]
[48191,false]
[48192,false]
[48193,{"$f":"ISNUMBER(SEARCH(\"*4*2*3*\",A8195))","v":false}]
[48194,false]
[48195,false]
[48196,false]
[48197,false]
[48198,false]
[48199,false]
[48200,false]
[48201,false]
[48202,false]
[48203,true]
[48204,false]
[48205,false]
[48206,false]
[48207,false]
[48208,false]
[48209,false]
[48210,false]
[48211,false]
[48212,false]
[48213,true]
[48214,false]
[48215,false]
[48216,false]
[48217,false]
[48218,false]
[48219,false]
[48220,false]
[48221,false]
[48222,false]
[48223,true]
[48224,false]
[48225,false]
[48226,false]
[48227,false]
[48228,false]
[48229,false]
[48230,true]
[48231,true]
[48232,true]
[48233,true]
[48234,true]
[48235,true]
[48236,true]
[48237,true]
[48238,true]
[48239,true]
[48240,false]
[48241,false]
[48242,false]
[48243,true]
[48244,false]
[48245,false]
[48246,false]
[48247,false]
[48248,false]
[48249,false]
[48250,false]
[48251,false]
[48252,false]
[48253,true]
[48254,false]
[48255,false]
[48256,false]
[48257,{"$f":"ISNUMBER(SEARCH(\"*4*2*3*\",A8259))","v":false}]
[48258,false]
[48259,false]
[48260,false]
[48261,false]
[48262,false]
[48263,true]
[48264,false]
[48265,false]
[48266,false]
[48267,false]
[48268,false]
[48269,false]
[48270,false]
[48271,false]
[48272,false]
[48273,true]
[48274,false]
[48275,false]
[48276,false]
[48277,false]
[48278,false]
[48279,false]
[48280,false]
[48281,false]
[48282,false]
[48283,true]
[48284,false]
[48285,false]
[48286,false]
[48287,false]
[48288,false]
[48289,false]
[48290,false]
[48291,false]
[48292,false]
[48293,true]
[48294,false]
[48295,false]
[48296,false]
[48297,false]
[48298,false]
[48299,false]
[48300,false]
[48301,false]
[48302,false]
[48303,false]
[48304,false]
[48305,false]
[48306,false]
[48307,false]
[48308,false]
[48309,false]
[48310,false]
[48311,false]
[48312,false]
[48313,false]
[48314,false]
[48315,false]
[48316,false]
[48317,false]
[48318,false]
[48319,false]
[48320,false]
[48321,{"$f":"ISNUMBER(SEARCH(\"*4*2*3*\",A8323))","v":false}]
[48322,false]
[48323,true]
[48324,false]
[48325,false]
[48326,false]
[48327,false]
[48328,false]
[48329,false]
[48330,false]
[48331,false]
[48332,false]
[48333,false]
[48334,false]
[48335,false]
[48336,false]
[48337,false]
[48338,false]
[48339,false]
[48340,false]
[48341,false]
[48342,false]
[48343,false]
[48344,false]
[48345,false]
[48346,false]
[48347,false]
[48348,false]
[48349,false]
[48350,false]
[48351,false]
[48352,false]
[48353,false]
[48354,false]
[48355,false]
[48356,false]
[48357,false]
[48358,false]
[48359,false]
[48360,false]
[48361,false]
[48362,false]
[48363,false]
[48364,false]
[48365,false]
[48366,false]
[48367,false]
[48368,false]
[48369,false]
[48370,false]
[48371,false]
[48372,false]
[48373,false]
[48374,false]
[48375,false]
[48376,false]
[48377,false]
[48378,false]
[48379,false]
[48380,false]
[48381,false]
[48382,false]
[48383,false]
[48384,false]
[48385,{"$f":"ISNUMBER(SEARCH(\"*4*2*3*\",A8387))","v":false}]
[48386,false]
[48387,false]
[48388,false]
[48389,false]
[48390,false]
[48391,false]
[48392,false]
[48393,false]
[48394,false]
[48395,false]
[48396,false]
[48397,false]
[48398,false]
[48399,false]
[48400,false]
[48401,false]
[48402,false]
[48403,false]
[48404,false]
[48405,false]
[48406,false]
[48407,false]
[48408,false]
[48409,false]
[48410,false]
[48411,false]
[48412,false]
[48413,false]
[48414,false]
[48415,false]
[48416,false]
[48417,false]
[48418,false]
[48419,false]
[48420,false]
[48421,false]
[48422,false]
[48423,true]
[48424,false]
[48425,false]
[48426,false]
[48427,false]
[48428,false]
[48429,false]
[48430,false]
[48431,false]
[48432,false]
[48433,false]
[48434,false]
[48435,false]
[48436,false]
[48437,false]
[48438,false]
[48439,false]
[48440,false]
[48441,false]
[48442,false]
[48443,false]
[48444,false]
[48445,false]
[48446,false]
[48447,false]
[48448,false]
[48449,{"$f":"ISNUMBER(SEARCH(\"*4*2*3*\",A8451))","v":false}]
[48450,false]
[48451,false]
[48452,false]
[48453,false]
[48454,false]
[48455,false]
[48456,false]
[48457,false]
[48458,false]
[48459,false]
[48460,false]
[48461,false]
[48462,false]
[48463,false]
[48464,false]
[48465,false]
[48466,false]
[48467,false]
[48468,false]
[48469,false]
[48470,false]
[48471,false]
[48472,false]
[48473,false]
[48474,false]
[48475,false]
[48476,false]
[48477,false]
[48478,false]
[48479,false]
[48480,false]
[48481,false]
[48482,false]
[48483,false]
[48484,false]
[48485,false]
[48486,false]
[48487,false]
[48488,false]
[48489,false]
[48490,false]
[48491,false]
[48492,false]
[48493,false]
[48494,false]
[48495,false]
[48496,false]
[48497,false]
[48498,false]
[48499,false]
[48500,false]
[48501,false]
[48502,false]
[48503,false]
[48504,false]
[48505,false]
[48506,false]
[48507,false]
[48508,false]
[48509,false]
[48510,false]
[48511,false]
[48512,false]
[48513,{"$f":"ISNUMBER(SEARCH(\"*4*2*3*\",A8515))","v":false}]
[48514,false]
[48515,false]
[48516,false]
[48517,false]
[48518,false]
[48519,false]
[48520,false]
[48521,false]
[48522,false]
[48523,true]
[48524,false]
[48525,false]
[48526,false]
[48527,false]
[48528,false]
[48529,false]
[48530,false]
[48531,false]
[48532,false]
[48533,false]
[48534,false]
[48535,false]
[48536,false]
[48537,false]
[48538,false]
[48539,false]
[48540,false]
[48541,false]
[48542,false]
[48543,false]
[48544,false]
[48545,false]
[48546,false]
[48547,false]
[48548,false]
[48549,false]
[48550,false]
[48551,false]
[48552,false]
[48553,false]
[48554,false]
[48555,false]
[48556,false]
[48557,false]
[48558,false]
[48559,false]
[48560,false]
[48561,false]
[48562,false]
[48563,false]
[48564,false]
[48565,false]
[48566,false]
[48567,false]
[48568,false]
[48569,false]
[48570,false]
[48571,false]
[48572,false]
[48573,false]
[48574,false]
[48575,false]
[48576,false]
[48577,{"$f":"ISNUMBER(SEARCH(\"*4*2*3*\",A8579))","v":false}]
[48578,false]
[48579,false]
[48580,false]
[48581,false]
[48582,false]
[48583,false]
[48584,false]
[48585,false]
[48586,false]
[48587,false]
[48588,false]
[48589,false]
[48590,false]
[48591,false]
[48592,false]
[48593,false]
[48594,false]
[48595,false]
[48596,false]
[48597,false]
[48598,false]
[48599,false]
[48600,false]
[48601,false]
[48602,false]
[48603,false]
[48604,false]
[48605,false]
[48606,false]
[48607,false]
[48608,false]
[48609,false]
[48610,false]
[48611,false]
[48612,false]
[48613,false]
[48614,false]
[48615,false]
[48616,false]
[48617,false]
[48618,false]
[48619,false]
[48620,false]
[48621,false]
[48622,false]
[48623,true]
[48624,false]
[48625,false]
[48626,false]
[48627,false]
[48628,false]
[48629,false]
[48630,false]
[48631,false]
[48632,false]
[48633,false]
[48634,false]
[48635,false]
[48636,false]
[48637,false]
[48638,false]
[48639,false]
[48640,false]
[48641,{"$f":"ISNUMBER(SEARCH(\"*4*2*3*\",A8643))","v":false}]
[48642,false]
[48643,false]
[48644,false]
[48645,false]
[48646,false]
[48647,false]
[48648,false]
[48649,false]
[48650,false]
[48651,false]
[48652,false]
[48653,false]
[48654,false]
[48655,false]
[48656,false]
[48657,false]
[48658,false]
[48659,false]
[48660,false]
[48661,false]
[48662,false]
[48663,false]
[48664,false]
[48665,false]
[48666,false]
[48667,false]
[48668,false]
[48669,false]
[48670,false]
[48671,false]
[48672,false]
[48673,false]
[48674,false]
[48675,false]
[48676,false]
[48677,false]
[48678,false]
[48679,false]
[48680,false]
[48681,false]
[48682,false]
[48683,false]
[48684,false]
[48685,false]
[48686,false]
[48687,false]
[48688,false]
[48689,false]
[48690,false]
[48691,false]
[48692,false]
[48693,false]
[48694,false]
[48695,false]
[48696,false]
[48697,false]
[48698,false]
[48699,false]
[48700,false]
[48701,false]
[48702,false]
[48703,false]
[48704,false]
[48705,{"$f":"ISNUMBER(SEARCH(\"*4*2*3*\",A8707))","v":false}]
[48706,false]
[48707,false]
[48708,false]
[48709,false]
[48710,false]
[48711,false]
[48712,false]
[48713,false]
[48714,false]
[48715,false]
[48716,false]
[48717,false]
[48718,false]
[48719,false]
[48720,false]
[48721,false]
[48722,false]
[48723,true]
[48724,false]
[48725,false]
[48726,false]
[48727,false]
[48728,false]
[48729,false]
[48730,false]
[48731,false]
[48732,false]
[48733,false]
[48734,false]
[48735,false]
[48736,false]
[48737,false]
[48738,false]
[48739,false]
[48740,false]
[48741,false]
[48742,false]
[48743,false]
[48744,false]
[48745,false]
[48746,false]
[48747,false]
[48748,false]
[48749,false]
[48750,false]
[48751,false]
[48752,false]
[48753,false]
[48754,false]
[48755,false]
[48756,false]
[48757,false]
[48758,false]
[48759,false]
[48760,false]
[48761,false]
[48762,false]
[48763,false]
[48764,false]
[48765,false]
[48766,false]
[48767,false]
[48768,false]
[48769,{"$f":"ISNUMBER(SEARCH(\"*4*2*3*\",A8771))","v":false}]
[48770,false]
[48771,false]
[48772,false]
[48773,false]
[48774,false]
[48775,false]
[48776,false]
[48777,false]
[48778,false]
[48779,false]
[48780,false]
[48781,false]
[48782,false]
[48783,false]
[48784,false]
[48785,false]
[48786,false]
[48787,false]
[48788,false]
[48789,false]
[48790,false]
[48791,false]
[48792,false]
[48793,false]
[48794,false]
[48795,false]
[48796,false]
[48797,false]
[48798,false]
[48799,false]
[48800,false]
[48801,false]
[48802,false]
[48803,false]
[48804,false]
[48805,false]
[48806,false]
[48807,false]
[48808,false]
[48809,false]
[48810,false]
[48811,false]
[48812,false]
[48813,false]
[48814,false]
[48815,false]
[48816,false]
[48817,false]
[48818,false]
[48819,false]
[48820,false]
[48821,false]
[48822,false]
[48823,true]
[48824,false]
[48825,false]
[48826,false]
[48827,false]
[48828,false]
[48829,false]
[48830,false]
[48831,false]
[48832,false]
[48833,{"$f":"ISNUMBER(SEARCH(\"*4*2*3*\",A8835))","v":false}]
[48834,false]
[48835,false]
[48836,false]
[48837,false]
[48838,false]
[48839,false]
[48840,false]
[48841,false]
[48842,false]
[48843,false]
[48844,false]
[48845,false]
[48846,false]
[48847,false]
[48848,false]
[48849,false]
[48850,false]
[48851,false]
[48852,false]
[48853,false]
[48854,false]
[48855,false]
[48856,false]
[48857,false]
[48858,false]
[48859,false]
[48860,false]
[48861,false]
[48862,false]
[48863,false]
[48864,false]
[48865,false]
[48866,false]
[48867,false]
[48868,false]
[48869,false]
[48870,false]
[48871,false]
[48872,false]
[48873,false]
[48874,false]
[48875,false]
[48876,false]
[48877,false]
[48878,false]
[48879,false]
[48880,false]
[48881,false]
[48882,false]
[48883,false]
[48884,false]
[48885,false]
[48886,false]
[48887,false]
[48888,false]
[48889,false]
[48890,false]
[48891,false]
[48892,false]
[48893,false]
[48894,false]
[48895,false]
[48896,false]
[48897,{"$f":"ISNUMBER(SEARCH(\"*4*2*3*\",A8899))","v":false}]
[48898,false]
[48899,false]
[48900,false]
[48901,false]
[48902,false]
[48903,false]
[48904,false]
[48905,false]
[48906,false]
[48907,false]
[48908,false]
[48909,false]
[48910,false]
[48911,false]
[48912,false]
[48913,false]
[48914,false]
[48915,false]
[48916,false]
[48917,false]
[48918,false]
[48919,false]
[48920,false]
[48921,false]
[48922,false]
[48923,true]
[48924,false]
[48925,false]
[48926,false]
[48927,false]
[48928,false]
[48929,false]
[48930,false]
[48931,false]
[48932,false]
[48933,false]
[48934,false]
[48935,false]
[48936,false]
[48937,false]
[48938,false]
[48939,false]
[48940,false]
[48941,false]
[48942,false]
[48943,false]
[48944,false]
[48945,false]
[48946,false]
[48947,false]
[48948,false]
[48949,false]
[48950,false]
[48951,false]
[48952,false]
[48953,false]
[48954,false]
[48955,false]
[48956,false]
[48957,false]
[48958,false]
[48959,false]
[48960,false]
[48961,{"$f":"ISNUMBER(SEARCH(\"*4*2*3*\",A8963))","v":false}]
[48962,false]
[48963,false]
[48964,false]
[48965,false]
[48966,false]
[48967,false]
[48968,false]
[48969,false]
[48970,false]
[48971,false]
[48972,false]
[48973,false]
[48974,false]
[48975,false]
[48976,false]
[48977,false]
[48978,false]
[48979,false]
[48980,false]
[48981,false]
[48982,false]
[48983,false]
[48984,false]
[48985,false]
[48986,false]
[48987,false]
[48988,false]
[48989,false]
[48990,false]
[48991,false]
[48992,false]
[48993,false]
[48994,false]
[48995,false]
[48996,false]
[48997,false]
[48998,false]
[48999,false]
[49000,false]
[49001,false]
[49002,false]
[49003,false]
[49004,false]
[49005,false]
[49006,false]
[49007,false]
[49008,false]
[49009,false]
[49010,false]
[49011,false]
[49012,false]
[49013,false]
[49014,false]
[49015,false]
[49016,false]
[49017,false]
[49018,false]
[49019,false]
[49020,false]
[49021,false]
[49022,false]
[49023,true]
[49024,false]
[49025,{"$f":"ISNUMBER(SEARCH(\"*4*2*3*\",A9027))","v":false}]
[49026,false]
[49027,false]
[49028,false]
[49029,false]
[49030,false]
[49031,false]
[49032,false]
[49033,false]
[49034,false]
[49035,false]
[49036,false]
[49037,false]
[49038,false]
[49039,false]
[49040,false]
[49041,false]
[49042,false]
[49043,false]
[49044,false]
[49045,false]
[49046,false]
[49047,false]
[49048,false]
[49049,false]
[49050,false]
[49051,false]
[49052,false]
[49053,false]
[49054,false]
[49055,false]
[49056,false]
[49057,false]
[49058,false]
[49059,false]
[49060,false]
[49061,false]
[49062,false]
[49063,false]
[49064,false]
[49065,false]
[49066,false]
[49067,false]
[49068,false]
[49069,false]
[49070,false]
[49071,false]
[49072,false]
[49073,false]
[49074,false]
[49075,false]
[49076,false]
[49077,false]
[49078,false]
[49079,false]
[49080,false]
[49081,false]
[49082,false]
[49083,false]
[49084,false]
[49085,false]
[49086,false]
[49087,false]
[49088,false]
[49089,{"$f":"ISNUMBER(SEARCH(\"*4*2*3*\",A9091))","v":false}]
[49090,false]
[49091,false]
[49092,false]
[49093,false]
[49094,false]
[49095,false]
[49096,false]
[49097,false]
[49098,false]
[49099,false]
[49100,false]
[49101,false]
[49102,false]
[49103,false]
[49104,false]
[49105,false]
[49106,false]
[49107,false]
[49108,false]
[49109,false]
[49110,false]
[49111,false]
[49112,false]
[49113,false]
[49114,false]
[49115,false]
[49116,false]
[49117,false]
[49118,false]
[49119,false]
[49120,false]
[49121,false]
[49122,false]
[49123,true]
[49124,false]
[49125,false]
[49126,false]
[49127,false]
[49128,false]
[49129,false]
[49130,false]
[49131,false]
[49132,false]
[49133,false]
[49134,false]
[49135,false]
[49136,false]
[49137,false]
[49138,false]
[49139,false]
[49140,false]
[49141,false]
[49142,false]
[49143,false]
[49144,false]
[49145,false]
[49146,false]
[49147,false]
[49148,false]
[49149,false]
[49150,false]
[49151,false]
[49152,false]
[49153,{"$f":"ISNUMBER(SEARCH(\"*4*2*3*\",A9155))","v":false}]
[49154,false]
[49155,false]
[49156,false]
[49157,false]
[49158,false]
[49159,false]
[49160,false]
[49161,false]
[49162,false]
[49163,false]
[49164,false]
[49165,false]
[49166,false]
[49167,false]
[49168,false]
[49169,false]
[49170,false]
[49171,false]
[49172,false]
[49173,false]
[49174,false]
[49175,false]
[49176,false]
[49177,false]
[49178,false]
[49179,false]
[49180,false]
[49181,false]
[49182,false]
[49183,false]
[49184,false]
[49185,false]
[49186,false]
[49187,false]
[49188,false]
[49189,false]
[49190,false]
[49191,false]
[49192,false]
[49193,false]
[49194,false]
[49195,false]
[49196,false]
[49197,false]
[49198,false]
[49199,false]
[49200,false]
[49201,false]
[49202,false]
[49203,true]
[49204,false]
[49205,false]
[49206,false]
[49207,false]
[49208,false]
[49209,false]
[49210,false]
[49211,false]
[49212,false]
[49213,true]
[49214,false]
[49215,false]
[49216,false]
[49217,{"$f":"ISNUMBER(SEARCH(\"*4*2*3*\",A9219))","v":false}]
[49218,false]
[49219,false]
[49220,false]
[49221,false]
[49222,false]
[49223,true]
[49224,false]
[49225,false]
[49226,false]
[49227,false]
[49228,false]
[49229,false]
[49230,true]
[49231,true]
[49232,true]
[49233,true]
[49234,true]
[49235,true]
[49236,true]
[49237,true]
[49238,true]
[49239,true]
[49240,false]
[49241,false]
[49242,false]
[49243,true]
[49244,false]
[49245,false]
[49246,false]
[49247,false]
[49248,false]
[49249,false]
[49250,false]
[49251,false]
[49252,false]
[49253,true]
[49254,false]
[49255,false]
[49256,false]
[49257,false]
[49258,false]
[49259,false]
[49260,false]
[49261,false]
[49262,false]
[49263,true]
[49264,false]
[49265,false]
[49266,false]
[49267,false]
[49268,false]
[49269,false]
[49270,false]
[49271,false]
[49272,false]
[49273,true]
[49274,false]
[49275,false]
[49276,false]
[49277,false]
[49278,false]
[49279,false]
[49280,false]
[49281,{"$f":"ISNUMBER(SEARCH(\"*4*2*3*\",A9283))","v":false}]
[49282,false]
[49283,true]
[49284,false]
[49285,false]
[49286,false]
[49287,false]
[49288,false]
[49289,false]
[49290,false]
[49291,false]
[49292,false]
[49293,true]
[49294,false]
[49295,false]
[49296,false]
[49297,false]
[49298,false]
[49299,false]
[49300,false]
[49301,false]
[49302,false]
[49303,false]
[49304,false]
[49305,false]
[49306,false]
[49307,false]
[49308,false]
[49309,false]
[49310,false]
[49311,false]
[49312,false]
[49313,false]
[49314,false]
[49315,false]
[49316,false]
[49317,false]
[49318,false]
[49319,false]
[49320,false]
[49321,false]
[49322,false]
[49323,true]
[49324,false]
[49325,false]
[49326,false]
[49327,false]
[49328,false]
[49329,false]
[49330,false]
[49331,false]
[49332,false]
[49333,false]
[49334,false]
[49335,false]
[49336,false]
[49337,false]
[49338,false]
[49339,false]
[49340,false]
[49341,false]
[49342,false]
[49343,false]
[49344,false]
[49345,{"$f":"ISNUMBER(SEARCH(\"*4*2*3*\",A9347))","v":false}]
[49346,false]
[49347,false]
[49348,false]
[49349,false]
[49350,false]
[49351,false]
[49352,false]
[49353,false]
[49354,false]
[49355,false]
[49356,false]
[49357,false]
[49358,false]
[49359,false]
[49360,false]
[49361,false]
[49362,false]
[49363,false]
[49364,false]
[49365,false]
[49366,false]
[49367,false]
[49368,false]
[49369,false]
[49370,false]
[49371,false]
[49372,false]
[49373,false]
[49374,false]
[49375,false]
[49376,false]
[49377,false]
[49378,false]
[49379,false]
[49380,false]
[49381,false]
[49382,false]
[49383,false]
[49384,false]
[49385,false]
[49386,false]
[49387,false]
[49388,false]
[49389,false]
[49390,false]
[49391,false]
[49392,false]
[49393,false]
[49394,false]
[49395,false]
[49396,false]
[49397,false]
[49398,false]
[49399,false]
[49400,false]
[49401,false]
[49402,false]
[49403,false]
[49404,false]
[49405,false]
[49406,false]
[49407,false]
[49408,false]
[49409,{"$f":"ISNUMBER(SEARCH(\"*4*2*3*\",A9411))","v":false}]
[49410,false]
[49411,false]
[49412,false]
[49413,false]
[49414,false]
[49415,false]
[49416,false]
[49417,false]
[49418,false]
[49419,false]
[49420,false]
[49421,false]
[49422,false]
[49423,true]
[49424,false]
[49425,false]
[49426,false]
[49427,false]
[49428,false]
[49429,false]
[49430,false]
[49431,false]
[49432,false]
[49433,false]
[49434,false]
[49435,false]
[49436,false]
[49437,false]
[49438,false]
[49439,false]
[49440,false]
[49441,false]
[49442,false]
[49443,false]
[49444,false]
[49445,false]
[49446,false]
[49447,false]
[49448,false]
[49449,false]
[49450,false]
[49451,false]
[49452,false]
[49453,false]
[49454,false]
[49455,false]
[49456,false]
[49457,false]
[49458,false]
[49459,false]
[49460,false]
[49461,false]
[49462,false]
[49463,false]
[49464,false]
[49465,false]
[49466,false]
[49467,false]
[49468,false]
[49469,false]
[49470,false]
[49471,false]
[49472,false]
[49473,{"$f":"ISNUMBER(SEARCH(\"*4*2*3*\",A9475))","v":false}]
[49474,false]
[49475,false]
[49476,false]
[49477,false]
[49478,false]
[49479,false]
[49480,false]
[49481,false]
[49482,false]
[49483,false]
[49484,false]
[49485,false]
[49486,false]
[49487,false]
[49488,false]
[49489,false]
[49490,false]
[49491,false]
[49492,false]
[49493,false]
[49494,false]
[49495,false]
[49496,false]
[49497,false]
[49498,false]
[49499,false]
[49500,false]
[49501,false]
[49502,false]
[49503,false]
[49504,false]
[49505,false]
[49506,false]
[49507,false]
[49508,false]
[49509,false]
[49510,false]
[49511,false]
[49512,false]
[49513,false]
[49514,false]
[49515,false]
[49516,false]
[49517,false]
[49518,false]
[49519,false]
[49520,false]
[49521,false]
[49522,false]
[49523,true]
[49524,false]
[49525,false]
[49526,false]
[49527,false]
[49528,false]
[49529,false]
[49530,false]
[49531,false]
[49532,false]
[49533,false]
[49534,false]
[49535,false]
[49536,false]
[49537,{"$f":"ISNUMBER(SEARCH(\"*4*2*3*\",A9539))","v":false}]
[49538,false]
[49539,false]
[49540,false]
[49541,false]
[49542,false]
[49543,false]
[49544,false]
[49545,false]
[49546,false]
[49547,false]
[49548,false]
[49549,false]
[49550,false]
[49551,false]
[49552,false]
[49553,false]
[49554,false]
[49555,false]
[49556,false]
[49557,false]
[49558,false]
[49559,false]
[49560,false]
[49561,false]
[49562,false]
[49563,false]
[49564,false]
[49565,false]
[49566,false]
[49567,false]
[49568,false]
[49569,false]
[49570,false]
[49571,false]
[49572,false]
[49573,false]
[49574,false]
[49575,false]
[49576,false]
[49577,false]
[49578,false]
[49579,false]
[49580,false]
[49581,false]
[49582,false]
[49583,false]
[49584,false]
[49585,false]
[49586,false]
[49587,false]
[49588,false]
[49589,false]
[49590,false]
[49591,false]
[49592,false]
[49593,false]
[49594,false]
[49595,false]
[49596,false]
[49597,false]
[49598,false]
[49599,false]
[49600,false]
[49601,{"$f":"ISNUMBER(SEARCH(\"*4*2*3*\",A9603))","v":false}]
[49602,false]
[49603,false]
[49604,false]
[49605,false]
[49606,false]
[49607,false]
[49608,false]
[49609,false]
[49610,false]
[49611,false]
[49612,false]
[49613,false]
[49614,false]
[49615,false]
[49616,false]
[49617,false]
[49618,false]
[49619,false]
[49620,false]
[49621,false]
[49622,false]
[49623,true]
[49624,false]
[49625,false]
[49626,false]
[49627,false]
[49628,false]
[49629,false]
[49630,false]
[49631,false]
[49632,false]
[49633,false]
[49634,false]
[49635,false]
[49636,false]
[49637,false]
[49638,false]
[49639,false]
[49640,false]
[49641,false]
[49642,false]
[49643,false]
[49644,false]
[49645,false]
[49646,false]
[49647,false]
[49648,false]
[49649,false]
[49650,false]
[49651,false]
[49652,false]
[49653,false]
[49654,false]
[49655,false]
[49656,false]
[49657,false]
[49658,false]
[49659,false]
[49660,false]
[49661,false]
[49662,false]
[49663,false]
[49664,false]
[49665,{"$f":"ISNUMBER(SEARCH(\"*4*2*3*\",A9667))","v":false}]
[49666,false]
[49667,false]
[49668,false]
[49669,false]
[49670,false]
[49671,false]
[49672,false]
[49673,false]
[49674,false]
[49675,false]
[49676,false]
[49677,false]
[49678,false]
[49679,false]
[49680,false]
[49681,false]
[49682,false]
[49683,false]
[49684,false]
[49685,false]
[49686,false]
[49687,false]
[49688,false]
[49689,false]
[49690,false]
[49691,false]
[49692,false]
[49693,false]
[49694,false]
[49695,false]
[49696,false]
[49697,false]
[49698,false]
[49699,false]
[49700,false]
[49701,false]
[49702,false]
[49703,false]
[49704,false]
[49705,false]
[49706,false]
[49707,false]
[49708,false]
[49709,false]
[49710,false]
[49711,false]
[49712,false]
[49713,false]
[49714,false]
[49715,false]
[49716,false]
[49717,false]
[49718,false]
[49719,false]
[49720,false]
[49721,false]
[49722,false]
[49723,true]
[49724,false]
[49725,false]
[49726,false]
[49727,false]
[49728,false]
[49729,{"$f":"ISNUMBER(SEARCH(\"*4*2*3*\",A9731))","v":false}]
[49730,false]
[49731,false]
[49732,false]
[49733,false]
[49734,false]
[49735,false]
[49736,false]
[49737,false]
[49738,false]
[49739,false]
[49740,false]
[49741,false]
[49742,false]
[49743,false]
[49744,false]
[49745,false]
[49746,false]
[49747,false]
[49748,false]
[49749,false]
[49750,false]
[49751,false]
[49752,false]
[49753,false]
[49754,false]
[49755,false]
[49756,false]
[49757,false]
[49758,false]
[49759,false]
[49760,false]
[49761,false]
[49762,false]
[49763,false]
[49764,false]
[49765,false]
[49766,false]
[49767,false]
[49768,false]
[49769,false]
[49770,false]
[49771,false]
[49772,false]
[49773,false]
[49774,false]
[49775,false]
[49776,false]
[49777,false]
[49778,false]
[49779,false]
[49780,false]
[49781,false]
[49782,false]
[49783,false]
[49784,false]
[49785,false]
[49786,false]
[49787,false]
[49788,false]
[49789,false]
[49790,false]
[49791,false]
[49792,false]
[49793,{"$f":"ISNUMBER(SEARCH(\"*4*2*3*\",A9795))","v":false}]
[49794,false]
[49795,false]
[49796,false]
[49797,false]
[49798,false]
[49799,false]
[49800,false]
[49801,false]
[49802,false]
[49803,false]
[49804,false]
[49805,false]
[49806,false]
[49807,false]
[49808,false]
[49809,false]
[49810,false]
[49811,false]
[49812,false]
[49813,false]
[49814,false]
[49815,false]
[49816,false]
[49817,false]
[49818,false]
[49819,false]
[49820,false]
[49821,false]
[49822,false]
[49823,true]
[49824,false]
[49825,false]
[49826,false]
[49827,false]
[49828,false]
[49829,false]
[49830,false]
[49831,false]
[49832,false]
[49833,false]
[49834,false]
[49835,false]
[49836,false]
[49837,false]
[49838,false]
[49839,false]
[49840,false]
[49841,false]
[49842,false]
[49843,false]
[49844,false]
[49845,false]
[49846,false]
[49847,false]
[49848,false]
[49849,false]
[49850,false]
[49851,false]
[49852,false]
[49853,false]
[49854,false]
[49855,false]
[49856,false]
[49857,{"$f":"ISNUMBER(SEARCH(\"*4*2*3*\",A9859))","v":false}]
[49858,false]
[49859,false]
[49860,false]
[49861,false]
[49862,false]
[49863,false]
[49864,false]
[49865,false]
[49866,false]
[49867,false]
[49868,false]
[49869,false]
[49870,false]
[49871,false]
[49872,false]
[49873,false]
[49874,false]
[49875,false]
[49876,false]
[49877,false]
[49878,false]
[49879,false]
[49880,false]
[49881,false]
[49882,false]
[49883,false]
[49884,false]
[49885,false]
[49886,false]
[49887,false]
[49888,false]
[49889,false]
[49890,false]
[49891,false]
[49892,false]
[49893,false]
[49894,false]
[49895,false]
[49896,false]
[49897,false]
[49898,false]
[49899,false]
[49900,false]
[49901,false]
[49902,false]
[49903,false]
[49904,false]
[49905,false]
[49906,false]
[49907,false]
[49908,false]
[49909,false]
[49910,false]
[49911,false]
[49912,false]
[49913,false]
[49914,false]
[49915,false]
[49916,false]
[49917,false]
[49918,false]
[49919,false]
[49920,false]
[49921,{"$f":"ISNUMBER(SEARCH(\"*4*2*3*\",A9923))","v":false}]
[49922,false]
[49923,true]
[49924,false]
[49925,false]
[49926,false]
[49927,false]
[49928,false]
[49929,false]
[49930,false]
[49931,false]
[49932,false]
[49933,false]
[49934,false]
[49935,false]
[49936,false]
[49937,false]
[49938,false]
[49939,false]
[49940,false]
[49941,false]
[49942,false]
[49943,false]
[49944,false]
[49945,false]
[49946,false]
[49947,false]
[49948,false]
[49949,false]
[49950,false]
[49951,false]
[49952,false]
[49953,false]
[49954,false]
[49955,false]
[49956,false]
[49957,false]
[49958,false]
[49959,false]
[49960,false]
[49961,false]
[49962,false]
[49963,false]
[49964,false]
[49965,false]
[49966,false]
[49967,false]
[49968,false]
[49969,false]
[49970,false]
[49971,false]
[49972,false]
[49973,false]
[49974,false]
[49975,false]
[49976,false]
[49977,false]
[49978,false]
[49979,false]
[49980,false]
[49981,false]
[49982,false]
[49983,false]
[49984,false]
[49985,{"$f":"ISNUMBER(SEARCH(\"*4*2*3*\",A9987))","v":false}]
[49986,false]
[49987,false]
[49988,false]
[49989,false]
[49990,false]
[49991,false]
[49992,false]
[49993,false]
[49994,false]
[49995,false]
[49996,false]
[49997,false]
[49998,false]
[49999,false]

{"sheet":"783","index":14,"n_rows":27,"n_cols":27,"rows_kept":27,"cut":false,"hidden":false,"merged":[]}
["Excel Magic Trick 783: Date Functions & Formulas (17 Examples)",null,null,null,null,null,null,null,null,null,"Years","Days in future","Holidays"]
[null,null,null,null,null,null,null,null,null,null,5,16,"2011-03-02"]
["Date","Day","Day","Month","Month","Year","Last Day of Month","Last Day of Month","First Day Next Month","First Day Next Month","Vest Date","Workday in Future","Last Monday",null,"Serial Date","WEEKDAY result",null,"Due Date","Today","Days Between Date (End - Beg)",null,"Project Start","Project End","Days Between Date, Inclusive = (End - Beg + 1)","Net Working Days",null,"Holday"]
["2011-02-11",null,null,null,null,null,null,null,null,null,null,null,null,null,"2011-05-16",null,null,"2011-04-21",{"$f":"TODAY()","v":"2011-05-21"},null,null,"2011-04-21",{"$f":"TODAY()","v":"2011-05-21"},null,null,null,"2011-05-16"]
["2012-02-16",null,null,null,null,null,null,null,null,null,null,null,null,null,"2011-05-17",null,null,"2011-04-22",{"$f":"TODAY()","v":"2011-05-21"},null,null,"2011-04-22",{"$f":"TODAY()","v":"2011-05-21"}]
["2011-02-20",null,null,null,null,null,null,null,null,null,null,null,null,null,"2011-05-18",null,null,"2011-04-23","2011-05-21",null,null,"2011-04-23","2011-05-21"]
["2011-03-09",null,null,null,null,null,null,null,null,null,null,null,null,null,"2011-05-19",null,null,"2011-04-24","2011-05-21",null,null,"2011-04-24","2011-05-21"]
["2011-02-22",null,null,null,null,null,null,null,null,null,null,null,null,null,"2011-05-20",null,null,"2011-04-25","2011-05-21",null,null,"2011-04-25","2011-05-21"]
["2011-02-12",null,null,null,null,null,null,null,null,null,null,null,null,null,"2011-05-21",null,null,"2011-04-26","2011-05-21",null,null,"2011-04-26","2011-05-21"]
["2011-03-10",null,null,null,null,null,null,null,null,null,null,null,null,null,"2011-05-22",null,null,"2011-04-27","2011-05-21",null,null,"2011-04-27","2011-05-21"]
["2011-03-15",null,null,null,null,null,null,null,null,null,null,null,null,null,null,null,null,"2011-04-28","2011-05-21",null,null,"2011-04-28","2011-05-21"]
["2011-02-16",null,null,null,null,null,null,null,null,null,null,null,null,null,null,null,null,"2011-04-29","2011-05-21",null,null,"2011-04-29","2011-05-21"]
["2011-02-24",null,null,null,null,null,null,null,null,null,null,null,null,null,null,null,null,"2011-04-30","2011-05-21",null,null,"2011-04-30","2011-05-21"]
["2011-03-14",null,null,null,null,null,null,null,null,null,null,null,null,null,null,null,null,"2011-05-01","2011-05-21",null,null,"2011-05-01","2011-05-21"]
["2011-03-05",null,null,null,null,null,null,null,null,null,null,null,null,null,null,null,null,"2011-05-02","2011-05-21",null,null,"2011-05-02","2011-05-21"]
["2011-03-01",null,null,null,null,null,null,null,null,null,null,null,null,null,null,null,null,"2011-05-03","2011-05-21",null,null,"2011-05-03","2011-05-21"]
["2011-03-09",null,null,null,null,null,null,null,null,null,null,null,null,null,null,null,null,"2011-05-04","2011-05-21",null,null,"2011-05-04","2011-05-21"]
["2011-03-12",null,null,null,null,null,null,null,null,null,null,null,null,null,null,null,null,"2011-05-05","2011-05-21",null,null,"2011-05-05","2011-05-21"]
["2011-03-16",null,null,null,null,null,null,null,null,null,null,null,null,null,null,null,null,"2011-05-06","2011-05-21",null,null,"2011-05-06","2011-05-21"]
["2011-03-14",null,null,null,null,null,null,null,null,null,null,null,null,null,"Ctrl + Shift + ~",null,null,"2011-05-07","2011-05-21",null,null,"2011-05-07","2011-05-21"]
["2011-02-17",null,null,null,null,null,null,null,null,null,null,null,null,null,null,null,null,"2011-05-08","2011-05-21",null,null,"2011-05-08","2011-05-21"]
["2011-02-25",null,null,null,null,null,null,null,null,null,null,null,null,null,null,null,null,"2011-05-09","2011-05-21",null,null,"2011-05-09","2011-05-21"]
[null,null,null,null,null,null,null,null,null,null,null,null,null,null,null,null,null,"2011-05-10","2011-05-21",null,null,"2011-05-10","2011-05-21"]
[null,null,null,null,null,null,null,null,null,null,"Start"]
[null,null,null,null,null,null,null,null,null,null,{"$f":"A4","v":"2011-02-11"},null,null,null,null,null,null,null,null,null,null,"2011-05-08","2011-05-21"]
[null,null,null,null,null,null,null,null,null,null,null,null,null,null,null,null,null,null,null,null,null,"2011-05-09","2011-05-21"]
[null,null,null,null,null,null,null,null,null,null,"List of First Days In Month",null,null,null,null,null,null,null,null,null,null,"2011-05-10","2011-05-21"]

{"sheet":"783an","index":15,"n_rows":33,"n_cols":27,"rows_kept":33,"cut":false,"hidden":false,"merged":[]}
[null,null,null,null,null,null,null,null,null,null,"Years","Days in future","Holidays"]
[null,null,null,null,null,null,null,null,null,null,5,16,"2011-03-02"]
["Date","Day","Day","Month","Month","Year","Last Day of Month","Last Day of Month","First Day Next Month","First Day Next Month","Vest Date","Workday in Future","Last Monday",null,"Serial Date","WEEKDAY result",null,"Due Date","Today","Days Between Date (End - Beg)",null,"Project Start","Project End","Days Between Date, Inclusive = (End - Beg + 1)","Net Working Days",null,"Holday"]
["2011-02-11",{"$f":"DAY(A4)","v":11},{"$f":"TEXT(A4,\"dddd\")","v":"Friday"},{"$f":"TEXT(A4,\"mmmm\")","v":"February"},{"$f":"MONTH(A4)","v":2},{"$f":"YEAR(A4)","v":2011},{"$f":"EOMONTH(A4,0)","v":"2011-02-28"},{"$f":"DATE(YEAR(A4),MONTH(A4)+1,0)","v":"2011-02-28"},{"$f":"EOMONTH(A4,0)+1","v":"2011-03-01"},{"$f":"DATE(YEAR(A4),MONTH(A4)+1,1)","v":"2011-03-01"},{"$f":"EDATE(A4,K$2*12)","v":"2016-02-11"},{"$f":"WORKDAY.INTL(A4,L$2,11,M$2)","v":"2011-03-03"},{"$f":"DATE(YEAR(A4),MONTH(A4),DAY(A4)-WEEKDAY(A4,3))","v":"2011-02-07"},null,"2011-05-16",{"$f":"WEEKDAY(O4,3)","v":0},null,"2011-04-21",{"$f":"TODAY()","v":"2011-05-21"},{"$f":"S4-R4","v":30},null,"2011-04-21",{"$f":"TODAY()","v":"2011-05-21"},{"$f":"W4-V4+1","v":31},{"$f":"NETWORKDAYS.INTL(V4,W4,11,$AA$4:$AA$8)","v":26},null,"2011-05-16"]
["2012-02-16",{"$f":"DAY(A5)","v":16},{"$f":"TEXT(A5,\"dddd\")","v":"Thursday"},{"$f":"TEXT(A5,\"mmmm\")","v":"February"},{"$f":"MONTH(A5)","v":2},{"$f":"YEAR(A5)","v":2012},{"$f":"EOMONTH(A5,0)","v":"2012-02-29"},{"$f":"DATE(YEAR(A5),MONTH(A5)+1,0)","v":"2012-02-29"},{"$f":"EOMONTH(A5,0)+1","v":"2012-03-01"},{"$f":"DATE(YEAR(A5),MONTH(A5)+1,1)","v":"2012-03-01"},"2017-02-16",{"$f":"WORKDAY.INTL(A5,L$2,11,M$2)","v":"2012-03-06"},{"$f":"DATE(YEAR(A5),MONTH(A5),DAY(A5)-WEEKDAY(A5,3))","v":"2012-02-13"},null,"2011-05-17",{"$f":"WEEKDAY(O5,3)","v":1},null,"2011-04-22",{"$f":"TODAY()","v":"2011-05-21"},29,null,"2011-04-22",{"$f":"TODAY()","v":"2011-05-21"},{"$f":"W5-V5+1","v":30},{"$f":"NETWORKDAYS.INTL(V5,W5,11,$AA$4:$AA$8)","v":25}]
["2011-02-20",{"$f":"DAY(A6)","v":20},"Sunday","February",2,{"$f":"YEAR(A6)","v":2011},{"$f":"EOMONTH(A6,0)","v":"2011-02-28"},"2011-02-28","2011-03-01","2011-03-01","2016-02-20","2011-03-11","2011-02-14",null,"2011-05-18",2,null,"2011-04-23","2011-05-21",28,null,"2011-04-23","2011-05-21",29,24]
["2011-03-09",9,"Wednesday","March",3,2011,"2011-03-31","2011-03-31","2011-04-01","2011-04-01","2016-03-09","2011-03-28","2011-03-07",null,"2011-05-19",3,null,"2011-04-24","2011-05-21",27,null,"2011-04-24","2011-05-21",28,23]
["2011-02-22",22,"Tuesday","February",2,2011,"2011-02-28","2011-02-28","2011-03-01","2011-03-01","2016-02-22","2011-03-14","2011-02-21",null,"2011-05-20",4,null,"2011-04-25","2011-05-21",26,null,"2011-04-25","2011-05-21",27,23]
["2011-02-12",12,"Saturday","February",2,2011,"2011-02-28","2011-02-28","2011-03-01","2011-03-01","2016-02-12","2011-03-04","2011-02-07",null,"2011-05-21",5,null,"2011-04-26","2011-05-21",25,null,"2011-04-26","2011-05-21",26,22]
["2011-03-10",10,"Thursday","March",3,2011,"2011-03-31","2011-03-31","2011-04-01","2011-04-01","2016-03-10","2011-03-29","2011-03-07",null,"2011-05-22",6,null,"2011-04-27","2011-05-21",24,null,"2011-04-27","2011-05-21",25,21]
["2011-03-15",15,"Tuesday","March",3,2011,"2011-03-31","2011-03-31","2011-04-01","2011-04-01","2016-03-15","2011-04-02","2011-03-14",null,null,null,null,"2011-04-28","2011-05-21",23,null,"2011-04-28","2011-05-21",24,20]
["2011-02-16",16,"Wednesday","February",2,2011,"2011-02-28","2011-02-28","2011-03-01","2011-03-01","2016-02-16","2011-03-08","2011-02-14",null,null,null,null,"2011-04-29","2011-05-21",22,null,"2011-04-29","2011-05-21",23,19]
["2011-02-24",24,"Thursday","February",2,2011,"2011-02-28","2011-02-28","2011-03-01","2011-03-01","2016-02-24","2011-03-16","2011-02-21",null,null,null,null,"2011-04-30","2011-05-21",21,null,"2011-04-30","2011-05-21",22,18]
["2011-03-14",14,"Monday","March",3,2011,"2011-03-31","2011-03-31","2011-04-01","2011-04-01","2016-03-14","2011-04-01","2011-03-14",null,null,null,null,"2011-05-01","2011-05-21",20,null,"2011-05-01","2011-05-21",21,17]
["2011-03-05",5,"Saturday","March",3,2011,"2011-03-31","2011-03-31","2011-04-01","2011-04-01","2016-03-05","2011-03-24","2011-02-28",null,null,null,null,"2011-05-02","2011-05-21",19,null,"2011-05-02","2011-05-21",20,17]
["2011-03-01",1,"Tuesday","March",3,2011,"2011-03-31","2011-03-31","2011-04-01","2011-04-01","2016-03-01","2011-03-21","2011-02-28",null,null,null,null,"2011-05-03","2011-05-21",18,null,"2011-05-03","2011-05-21",19,16]
["2011-03-09",9,"Wednesday","March",3,2011,"2011-03-31","2011-03-31","2011-04-01","2011-04-01","2016-03-09","2011-03-28","2011-03-07",null,null,null,null,"2011-05-04","2011-05-21",17,null,"2011-05-04","2011-05-21",18,15]
["2011-03-12",12,"Saturday","March",3,2011,"2011-03-31","2011-03-31","2011-04-01","2011-04-01","2016-03-12","2011-03-31","2011-03-07",null,null,null,null,"2011-05-05","2011-05-21",16,null,"2011-05-05","2011-05-21",17,14]
["2011-03-16",16,"Wednesday","March",3,2011,"2011-03-31","2011-03-31","2011-04-01","2011-04-01","2016-03-16","2011-04-04","2011-03-14",null,null,null,null,"2011-05-06","2011-05-21",15,null,"2011-05-06","2011-05-21",16,13]
["2011-03-14",14,"Monday","March",3,2011,"2011-03-31","2011-03-31","2011-04-01","2011-04-01","2016-03-14","2011-04-01","2011-03-14",null,null,null,null,"2011-05-07","2011-05-21",14,null,"2011-05-07","2011-05-21",15,12]
["2011-02-17",17,"Thursday","February",2,2011,"2011-02-28","2011-02-28","2011-03-01","2011-03-01","2016-02-17","2011-03-09","2011-02-14",null,null,null,null,"2011-05-08","2011-05-21",13,null,"2011-05-08","2011-05-21",14,11]
["2011-02-25",25,"Friday","February",2,2011,"2011-02-28","2011-02-28","2011-03-01","2011-03-01","2016-02-25","2011-03-17","2011-02-21",null,null,null,null,"2011-05-09","2011-05-21",12,null,"2011-05-09","2011-05-21",13,11]
[null,null,null,null,null,null,null,null,null,null,null,null,null,null,null,null,null,"2011-05-10","2011-05-21",11,null,"2011-05-10","2011-05-21",12,10]
[null,null,null,null,null,null,null,null,null,null,"Start"]
[null,null,null,null,null,null,null,null,null,null,{"$f":"A4","v":"2011-02-11"},null,null,null,null,null,null,null,null,null,null,"2011-05-08","2011-05-21",{"$f":"W25-V25+1","v":14},{"$f":"NETWORKDAYS.INTL(V25,W25,11,$AA$4:$AA$8)","v":11}]
[null,null,null,null,null,null,null,null,null,null,null,null,null,null,null,null,null,null,null,null,null,"2011-05-09","2011-05-21",13,11]
[null,null,null,null,null,null,null,null,null,null,"List of First Days In Month",null,null,null,null,null,null,null,null,null,null,"2011-05-10","2011-05-21",12,10]
[null,null,null,null,null,null,null,null,null,null,{"$f":"EOMONTH(K25,0)+1","v":"2011-03-01"}]
[null,null,null,null,null,null,null,null,null,null,{"$f":"EDATE(K28,1)","v":"2011-04-01"}]
[null,null,null,null,null,null,null,null,null,null,{"$f":"EDATE(K29,1)","v":"2011-05-01"}]
[null,null,null,null,null,null,null,null,null,null,"2011-06-01"]
[null,null,null,null,null,null,null,null,null,null,"2011-07-01"]
[null,null,null,null,null,null,null,null,null,null,"2011-08-01"]

{"sheet":"784","index":16,"n_rows":33,"n_cols":8,"rows_kept":33,"cut":false,"hidden":false,"merged":[]}
["Mr Excel Message Board:","http://www.mrexcel.com/forum/showthread.php?t=538637"]
[]
["Max",50,45,40,35,30,25]
["Scores",40,{"$f":"\"\"","v":""},true,0,null,"rad"]
[null,null,{"$f":"SUBSTITUTE(CELL(\"address\",C4),\"$\",\"\")&\" contains formula: =\"\"\"\"\"","v":"C4 contains formula: =\"\""}]
["In SUMPRODUCT function, the criteria <>\"\" will return a TRUE for any cell that is NOT \"empty or a null string\", which means which means a number, text, logical. <>\"\" sees both empty cell and formula blank.",null," =SUMPRODUCT(--(B4:G4<>\"\"),B3:G3)",null,null,null,null,"This would work if only numbers and empty cells were allowed in range."]
["In the SUMIF function, the criteria \"<>\" will return a TRUE for any cell that is NOT \"empty\", which means a number, text, logical or formula blank. \"<>\" sees only empty cell.",null," =SUMIF(B4:G4,\"<>\",B3:G3)",null,null,null,null,"This would work if only numbers and empty cells were allowed in range."]
["In the SUMIF function, the criteria \"=\" will return a TRUE for any cell that is \"empty\", which means nothing, not even a formula blank.",null," =SUMIF(B4:G4,\"=\",B3:G3)"]
[]
["ISBLANK function counts \"empty\" cells",null," =SUMPRODUCT(--ISBLANK(B4:G4))"]
["COUNTBLANK function counts \"empty or with a null string\"",null," =COUNTBLANK(B4:G4)"]
["Good for numbers only, including zero.",null," =SUM(SUMIF(B4:G4,{\">=0\",\"<0\"},B3:G3))",null,null,null,null,"**Array Syntax Does Not Require CSE"]
["Good for numbers only, including zero.",null," =SUMIF(B4:G4,\"<=9.99999999999999e307\",B3:G3)"]
[null,null,null,">=0","<0"]
["** \"<>\" in SUMIF and <>\"\" in SUMPRODUCT are not equivalent."]
["** ISBLANK function: Blank = \"empty cell\". Help (2010) says: \" blank (empty cell)\""]
["** COUNTBLANK function: Blank = \"empty or with a null string\". Help (2010) says: \"Cells with formulas that"]
["return \"\" (empty text) are also counted.\""]
["** Paste Special Skip Blanks: Blank =  \"empty cell\". Help (Excel 2010) says: \"To avoid"]
["replacing values in your paste area when blank cells occur in the copy area, select Skip Blanks\""]
["** Filter: Blank =  \"empty or with a null string\". Help (Excel 2010) says: \" The (Blanks) check box is"]
["available only if the range of cells or table column contains at least one blank cell.\""]
[]
[]
[]
[]
[]
[]
[null,null,null,null,null,"values"]
[null,null,null,null,null,9]
[null,null,null,null,null,{"$f":"\"\"","v":""},null,5]
[null,null,null,null,null,null,null,5]
[null,null,null,null,null,2]

{"sheet":"784an","index":17,"n_rows":33,"n_cols":8,"rows_kept":33,"cut":false,"hidden":false,"merged":[]}
["Mr Excel Message Board:","http://www.mrexcel.com/forum/showthread.php?t=538637"]
[]
["Max",50,45,40,35,30,25]
["Scores",40,{"$f":"\"\"","v":""},true,0,null,"rad"]
[null,null,{"$f":"SUBSTITUTE(CELL(\"address\",C4),\"$\",\"\")&\" contains formula: =\"\"\"\"\"","v":"C4 contains formula: =\"\""}]
["In SUMPRODUCT function, the criteria <>\"\" will return a TRUE for any cell that is NOT \"empty or a null string\", which means which means a number, text, logical. <>\"\" sees both empty cell and formula blank.",{"$f":"SUMPRODUCT(--(B4:G4<>\"\"),B3:G3)","v":150}," =SUMPRODUCT(--(B4:G4<>\"\"),B3:G3)",null,null,null,null,"This would work if only numbers and empty cells were allowed in range."]
["In the SUMIF function, the criteria \"<>\" will return a TRUE for any cell that is NOT \"empty\", which means a number, text, logical or formula blank. \"<>\" sees only empty cell.",{"$f":"SUMIF(B4:G4,\"<>\",B3:G3)","v":195}," =SUMIF(B4:G4,\"<>\",B3:G3)",null,null,null,null,"This would work if only numbers and empty cells were allowed in range."]
["In the SUMIF function, the criteria \"=\" will return a TRUE for any cell that is \"empty\", which means nothing, not even a formula blank.",{"$f":"SUMIF(B4:G4,\"=\",B3:G3)","v":30}," =SUMIF(B4:G4,\"=\",B3:G3)"]
[]
["ISBLANK function counts \"empty\" cells",{"$f":"SUMPRODUCT(--ISBLANK(B4:G4))","v":1}," =SUMPRODUCT(--ISBLANK(B4:G4))"]
["COUNTBLANK function counts \"empty or with a null string\"",{"$f":"COUNTBLANK(B4:G4)","v":2}," =COUNTBLANK(B4:G4)"]
["Good for numbers only, including zero.",{"$f":"SUM(SUMIF(B4:G4,{\">=0\",\"<0\"},B3:G3))","v":85}," =SUM(SUMIF(B4:G4,{\">=0\",\"<0\"},B3:G3))",null,null,null,null,"**Array Syntax Does Not Require CSE"]
["Good for numbers only, including zero.",{"$f":"SUMIF(B4:G4,\"<=9.99999999999999e307\",B3:G3)","v":85}," =SUMIF(B4:G4,\"<=9.99999999999999e307\",B3:G3)"]
[null,null,null,">=0","<0"]
["** \"<>\" in SUMIF and <>\"\" in SUMPRODUCT are not equivalent."]
["** ISBLANK function: Blank = \"empty cell\". Help (2010) says: \" blank (empty cell)\""]
["** COUNTBLANK function: Blank = \"empty or with a null string\". Help (2010) says: \"Cells with formulas that"]
["return \"\" (empty text) are also counted.\""]
["** Paste Special Skip Blanks: Blank =  \"empty cell\". Help (Excel 2010) says: \"To avoid"]
["replacing values in your paste area when blank cells occur in the copy area, select Skip Blanks\""]
["** Filter: Blank =  \"empty or with a null string\". Help (Excel 2010) says: \" The (Blanks) check box is"]
["available only if the range of cells or table column contains at least one blank cell.\""]
[]
[]
[]
[]
[]
[]
[null,null,null,null,null,"values"]
[null,null,null,null,null,9,null,9]
[null,null,null,null,null,{"$f":"\"\"","v":""},null,{"$f":"\"\"","v":""}]
[null,null,null,null,null,null,null,5]
[null,null,null,null,null,2,null,2]

{"sheet":"785","index":18,"n_rows":16,"n_cols":15,"rows_kept":16,"cut":false,"hidden":false,"merged":[]}
["Link:","Mr Excel & excelisfun Trick 78: Extract Top Two Customers In Each Industry with Formula"]
["Link:","http://www.mrexcel.com/forum/showthread.php?t=549147"]
[]
["Industry","Customer","Amount",null,"Top",3]
["A","Acct 1119",59948.7]
["B","Acct 1910",12138.44,null,"Industry/Customer","Customer 1","Customer 2","Customer 3","Customer 4",null,"Count","2003 formula"]
["B","Acct 2516",59948.7,null,"A",null,null,null,null,null,{"$f":"SUM(IF($A$5:$A$16=$E7,\n    IF($C$5:$C$16>=LARGE(IF($A$5:$A$16=$E7,$C$5:$C$16),$F$4),1)))","v":3},{"$f":"IF(COLUMNS($L7:L7)>$K7,\"\",INDEX($B$5:$B$16,MATCH(LARGE(IF($A$5:$A$16=$E7,\n    IF($C$5:$C$16>=LARGE(IF($A$5:$A$16=$E7,$C$5:$C$16),$F$4),\n    $C$5:$C$16+(ROW($C$5:$C$16)/1000000))),\n    COLUMNS($L7:L7)),$C$5:$C$16+ROW($C$5:$C$16)/1000000,0)))","v":"Acct 5201"},{"$f":"IF(COLUMNS($L7:M7)>$K7,\"\",INDEX($B$5:$B$16,MATCH(LARGE(IF($A$5:$A$16=$E7,\n    IF($C$5:$C$16>=LARGE(IF($A$5:$A$16=$E7,$C$5:$C$16),$F$4),\n    $C$5:$C$16+(ROW($C$5:$C$16)/1000000))),\n    COLUMNS($L7:M7)),$C$5:$C$16+ROW($C$5:$C$16)/1000000,0)))","v":"Acct 8375"},{"$f":"IF(COLUMNS($L7:N7)>$K7,\"\",INDEX($B$5:$B$16,MATCH(LARGE(IF($A$5:$A$16=$E7,\n    IF($C$5:$C$16>=LARGE(IF($A$5:$A$16=$E7,$C$5:$C$16),$F$4),\n    $C$5:$C$16+(ROW($C$5:$C$16)/1000000))),\n    COLUMNS($L7:N7)),$C$5:$C$16+ROW($C$5:$C$16)/1000000,0)))","v":"Acct 1119"},{"$f":"IF(COLUMNS($L7:O7)>$K7,\"\",INDEX($B$5:$B$16,MATCH(LARGE(IF($A$5:$A$16=$E7,\n    IF($C$5:$C$16>=LARGE(IF($A$5:$A$16=$E7,$C$5:$C$16),$F$4),\n    $C$5:$C$16+(ROW($C$5:$C$16)/1000000))),\n    COLUMNS($L7:O7)),$C$5:$C$16+ROW($C$5:$C$16)/1000000,0)))","v":""}]
["B","Acct 3743",59948.7,null,"B",null,null,null,null,null,{"$f":"SUM(IF($A$5:$A$16=$E8,\n    IF($C$5:$C$16>=LARGE(IF($A$5:$A$16=$E8,$C$5:$C$16),$F$4),1)))","v":4},{"$f":"IF(COLUMNS($L8:L8)>$K8,\"\",INDEX($B$5:$B$16,MATCH(LARGE(IF($A$5:$A$16=$E8,\n    IF($C$5:$C$16>=LARGE(IF($A$5:$A$16=$E8,$C$5:$C$16),$F$4),\n    $C$5:$C$16+(ROW($C$5:$C$16)/1000000))),\n    COLUMNS($L8:L8)),$C$5:$C$16+ROW($C$5:$C$16)/1000000,0)))","v":"Acct 4045"},{"$f":"IF(COLUMNS($L8:M8)>$K8,\"\",INDEX($B$5:$B$16,MATCH(LARGE(IF($A$5:$A$16=$E8,\n    IF($C$5:$C$16>=LARGE(IF($A$5:$A$16=$E8,$C$5:$C$16),$F$4),\n    $C$5:$C$16+(ROW($C$5:$C$16)/1000000))),\n    COLUMNS($L8:M8)),$C$5:$C$16+ROW($C$5:$C$16)/1000000,0)))","v":"Acct 7206"},{"$f":"IF(COLUMNS($L8:N8)>$K8,\"\",INDEX($B$5:$B$16,MATCH(LARGE(IF($A$5:$A$16=$E8,\n    IF($C$5:$C$16>=LARGE(IF($A$5:$A$16=$E8,$C$5:$C$16),$F$4),\n    $C$5:$C$16+(ROW($C$5:$C$16)/1000000))),\n    COLUMNS($L8:N8)),$C$5:$C$16+ROW($C$5:$C$16)/1000000,0)))","v":"Acct 3743"},{"$f":"IF(COLUMNS($L8:O8)>$K8,\"\",INDEX($B$5:$B$16,MATCH(LARGE(IF($A$5:$A$16=$E8,\n    IF($C$5:$C$16>=LARGE(IF($A$5:$A$16=$E8,$C$5:$C$16),$F$4),\n    $C$5:$C$16+(ROW($C$5:$C$16)/1000000))),\n    COLUMNS($L8:O8)),$C$5:$C$16+ROW($C$5:$C$16)/1000000,0)))","v":"Acct 2516"}]
["B","Acct 3806",13796.14]
["B","Acct 4007",52577.1]
["B","Acct 4045",79274.820000000007]
["A","Acct 4408",23608.9]
["A","Acct 5201",75850.2]
["B","Acct 7089",8774.7999999999993,null,"Industry/Customer","Customer 1","Customer 2","Customer 3","Customer 4"]
["B","Acct 7206",64366.5,null,"A",{"$f":"IF(COLUMNS($F15:F15)>SUM(($A$5:$A$16=$E15)*($C$5:$C$16>=LARGE(IF($A$5:$A$16=$E15,$C$5:$C$16),$F$4))),\"\",INDEX($B$5:$B$16,SMALL(IF($A$5:$A$16=$E15,IF($C$5:$C$16=LARGE(IF($A$5:$A$16=$E15,$C$5:$C$16),COLUMNS($F15:F15)),ROW($B$5:$B$16)-ROW($B$5)+1)),SUM(1*(LARGE(IF($A$5:$A$16=$E15,$C$5:$C$16),ROW(INDIRECT(\"1:\"&COLUMNS($F15:F15))))=LARGE(IF($A$5:$A$16=$E15,$C$5:$C$16),COLUMNS($F15:F15)))))))","v":"Acct 5201"},{"$f":"IF(COLUMNS($F15:G15)>SUM(($A$5:$A$16=$E15)*($C$5:$C$16>=LARGE(IF($A$5:$A$16=$E15,$C$5:$C$16),$F$4))),\"\",INDEX($B$5:$B$16,SMALL(IF($A$5:$A$16=$E15,IF($C$5:$C$16=LARGE(IF($A$5:$A$16=$E15,$C$5:$C$16),COLUMNS($F15:G15)),ROW($B$5:$B$16)-ROW($B$5)+1)),SUM(1*(LARGE(IF($A$5:$A$16=$E15,$C$5:$C$16),ROW(INDIRECT(\"1:\"&COLUMNS($F15:G15))))=LARGE(IF($A$5:$A$16=$E15,$C$5:$C$16),COLUMNS($F15:G15)))))))","v":"Acct 1119"},{"$f":"IF(COLUMNS($F15:H15)>SUM(($A$5:$A$16=$E15)*($C$5:$C$16>=LARGE(IF($A$5:$A$16=$E15,$C$5:$C$16),$F$4))),\"\",INDEX($B$5:$B$16,SMALL(IF($A$5:$A$16=$E15,IF($C$5:$C$16=LARGE(IF($A$5:$A$16=$E15,$C$5:$C$16),COLUMNS($F15:H15)),ROW($B$5:$B$16)-ROW($B$5)+1)),SUM(1*(LARGE(IF($A$5:$A$16=$E15,$C$5:$C$16),ROW(INDIRECT(\"1:\"&COLUMNS($F15:H15))))=LARGE(IF($A$5:$A$16=$E15,$C$5:$C$16),COLUMNS($F15:H15)))))))","v":"Acct 8375"},"."]
["A","Acct 8375",59948.7,null,"B",{"$f":"IF(COLUMNS($F16:F16)>SUM(($A$5:$A$16=$E16)*($C$5:$C$16>=LARGE(IF($A$5:$A$16=$E16,$C$5:$C$16),$F$4))),\"\",INDEX($B$5:$B$16,SMALL(IF($A$5:$A$16=$E16,IF($C$5:$C$16=LARGE(IF($A$5:$A$16=$E16,$C$5:$C$16),COLUMNS($F16:F16)),ROW($B$5:$B$16)-ROW($B$5)+1)),SUM(1*(LARGE(IF($A$5:$A$16=$E16,$C$5:$C$16),ROW(INDIRECT(\"1:\"&COLUMNS($F16:F16))))=LARGE(IF($A$5:$A$16=$E16,$C$5:$C$16),COLUMNS($F16:F16)))))))","v":"Acct 4045"},{"$f":"IF(COLUMNS($F16:G16)>SUM(($A$5:$A$16=$E16)*($C$5:$C$16>=LARGE(IF($A$5:$A$16=$E16,$C$5:$C$16),$F$4))),\"\",INDEX($B$5:$B$16,SMALL(IF($A$5:$A$16=$E16,IF($C$5:$C$16=LARGE(IF($A$5:$A$16=$E16,$C$5:$C$16),COLUMNS($F16:G16)),ROW($B$5:$B$16)-ROW($B$5)+1)),SUM(1*(LARGE(IF($A$5:$A$16=$E16,$C$5:$C$16),ROW(INDIRECT(\"1:\"&COLUMNS($F16:G16))))=LARGE(IF($A$5:$A$16=$E16,$C$5:$C$16),COLUMNS($F16:G16)))))))","v":"Acct 7206"},{"$f":"IF(COLUMNS($F16:H16)>SUM(($A$5:$A$16=$E16)*($C$5:$C$16>=LARGE(IF($A$5:$A$16=$E16,$C$5:$C$16),$F$4))),\"\",INDEX($B$5:$B$16,SMALL(IF($A$5:$A$16=$E16,IF($C$5:$C$16=LARGE(IF($A$5:$A$16=$E16,$C$5:$C$16),COLUMNS($F16:H16)),ROW($B$5:$B$16)-ROW($B$5)+1)),SUM(1*(LARGE(IF($A$5:$A$16=$E16,$C$5:$C$16),ROW(INDIRECT(\"1:\"&COLUMNS($F16:H16))))=LARGE(IF($A$5:$A$16=$E16,$C$5:$C$16),COLUMNS($F16:H16)))))))","v":"Acct 2516"},{"$f":"IF(COLUMNS($F16:I16)>SUM(($A$5:$A$16=$E16)*($C$5:$C$16>=LARGE(IF($A$5:$A$16=$E16,$C$5:$C$16),$F$4))),\"\",INDEX($B$5:$B$16,SMALL(IF($A$5:$A$16=$E16,IF($C$5:$C$16=LARGE(IF($A$5:$A$16=$E16,$C$5:$C$16),COLUMNS($F16:I16)),ROW($B$5:$B$16)-ROW($B$5)+1)),SUM(1*(LARGE(IF($A$5:$A$16=$E16,$C$5:$C$16),ROW(INDIRECT(\"1:\"&COLUMNS($F16:I16))))=LARGE(IF($A$5:$A$16=$E16,$C$5:$C$16),COLUMNS($F16:I16)))))))","v":"Acct 3743"}]

{"sheet":"785an","index":19,"n_rows":16,"n_cols":15,"rows_kept":16,"cut":false,"hidden":false,"merged":[]}
["Link:","Mr Excel & excelisfun Trick 78: Extract Top Two Customers In Each Industry with Formula"]
["Link:","http://www.mrexcel.com/forum/showthread.php?t=549147"]
[]
["Industry","Customer","Amount",null,"Top",3]
["A","Acct 1119",59948.7]
["B","Acct 1910",12138.44,null,"Industry/Customer","Customer 1","Customer 2","Customer 3","Customer 4",null,"Count","2003 formula"]
["B","Acct 2516",59948.7,null,"A",{"$f":"IFERROR(INDEX($B$5:$B$16,MATCH(LARGE(IF($A$5:$A$16=$E7,IF($C$5:$C$16>=LARGE(IF($A$5:$A$16=$E7,$C$5:$C$16),$F$4),$C$5:$C$16+ROW($C$5:$C$16)/10000)),COLUMNS($F7:F7)),$C$5:$C$16+ROW($C$5:$C$16)/10000,0)),\"\")","v":"Acct 5201"},{"$f":"IFERROR(INDEX($B$5:$B$16,MATCH(LARGE(IF($A$5:$A$16=$E7,IF($C$5:$C$16>=LARGE(IF($A$5:$A$16=$E7,$C$5:$C$16),$F$4),$C$5:$C$16+ROW($C$5:$C$16)/10000)),COLUMNS($F7:G7)),$C$5:$C$16+ROW($C$5:$C$16)/10000,0)),\"\")","v":"Acct 8375"},{"$f":"IFERROR(INDEX($B$5:$B$16,MATCH(LARGE(IF($A$5:$A$16=$E7,IF($C$5:$C$16>=LARGE(IF($A$5:$A$16=$E7,$C$5:$C$16),$F$4),$C$5:$C$16+ROW($C$5:$C$16)/10000)),COLUMNS($F7:H7)),$C$5:$C$16+ROW($C$5:$C$16)/10000,0)),\"\")","v":"Acct 1119"},{"$f":"IFERROR(INDEX($B$5:$B$16,MATCH(LARGE(IF($A$5:$A$16=$E7,IF($C$5:$C$16>=LARGE(IF($A$5:$A$16=$E7,$C$5:$C$16),$F$4),$C$5:$C$16+ROW($C$5:$C$16)/10000)),COLUMNS($F7:I7)),$C$5:$C$16+ROW($C$5:$C$16)/10000,0)),\"\")","v":""},null,{"$f":"SUM(IF($A$5:$A$16=$E7,\n    IF($C$5:$C$16>=LARGE(IF($A$5:$A$16=$E7,$C$5:$C$16),$F$4),1)))","v":3},{"$f":"IF(COLUMNS($L7:L7)>$K7,\"\",INDEX($B$5:$B$16,MATCH(LARGE(IF($A$5:$A$16=$E7,\n    IF($C$5:$C$16>=LARGE(IF($A$5:$A$16=$E7,$C$5:$C$16),$F$4),\n    $C$5:$C$16+(ROW($C$5:$C$16)/1000000))),\n    COLUMNS($L7:L7)),$C$5:$C$16+ROW($C$5:$C$16)/1000000,0)))","v":"Acct 5201"},{"$f":"IF(COLUMNS($L7:M7)>$K7,\"\",INDEX($B$5:$B$16,MATCH(LARGE(IF($A$5:$A$16=$E7,\n    IF($C$5:$C$16>=LARGE(IF($A$5:$A$16=$E7,$C$5:$C$16),$F$4),\n    $C$5:$C$16+(ROW($C$5:$C$16)/1000000))),\n    COLUMNS($L7:M7)),$C$5:$C$16+ROW($C$5:$C$16)/1000000,0)))","v":"Acct 8375"},{"$f":"IF(COLUMNS($L7:N7)>$K7,\"\",INDEX($B$5:$B$16,MATCH(LARGE(IF($A$5:$A$16=$E7,\n    IF($C$5:$C$16>=LARGE(IF($A$5:$A$16=$E7,$C$5:$C$16),$F$4),\n    $C$5:$C$16+(ROW($C$5:$C$16)/1000000))),\n    COLUMNS($L7:N7)),$C$5:$C$16+ROW($C$5:$C$16)/1000000,0)))","v":"Acct 1119"},{"$f":"IF(COLUMNS($L7:O7)>$K7,\"\",INDEX($B$5:$B$16,MATCH(LARGE(IF($A$5:$A$16=$E7,\n    IF($C$5:$C$16>=LARGE(IF($A$5:$A$16=$E7,$C$5:$C$16),$F$4),\n    $C$5:$C$16+(ROW($C$5:$C$16)/1000000))),\n    COLUMNS($L7:O7)),$C$5:$C$16+ROW($C$5:$C$16)/1000000,0)))","v":""}]
["B","Acct 3743",59948.7,null,"B",{"$f":"IFERROR(INDEX($B$5:$B$16,MATCH(LARGE(IF($A$5:$A$16=$E8,IF($C$5:$C$16>=LARGE(IF($A$5:$A$16=$E8,$C$5:$C$16),$F$4),$C$5:$C$16+ROW($C$5:$C$16)/10000)),COLUMNS($F8:F8)),$C$5:$C$16+ROW($C$5:$C$16)/10000,0)),\"\")","v":"Acct 4045"},{"$f":"IFERROR(INDEX($B$5:$B$16,MATCH(LARGE(IF($A$5:$A$16=$E8,IF($C$5:$C$16>=LARGE(IF($A$5:$A$16=$E8,$C$5:$C$16),$F$4),$C$5:$C$16+ROW($C$5:$C$16)/10000)),COLUMNS($F8:G8)),$C$5:$C$16+ROW($C$5:$C$16)/10000,0)),\"\")","v":"Acct 7206"},{"$f":"IFERROR(INDEX($B$5:$B$16,MATCH(LARGE(IF($A$5:$A$16=$E8,IF($C$5:$C$16>=LARGE(IF($A$5:$A$16=$E8,$C$5:$C$16),$F$4),$C$5:$C$16+ROW($C$5:$C$16)/10000)),COLUMNS($F8:H8)),$C$5:$C$16+ROW($C$5:$C$16)/10000,0)),\"\")","v":"Acct 3743"},{"$f":"IFERROR(INDEX($B$5:$B$16,MATCH(LARGE(IF($A$5:$A$16=$E8,IF($C$5:$C$16>=LARGE(IF($A$5:$A$16=$E8,$C$5:$C$16),$F$4),$C$5:$C$16+ROW($C$5:$C$16)/10000)),COLUMNS($F8:I8)),$C$5:$C$16+ROW($C$5:$C$16)/10000,0)),\"\")","v":"Acct 2516"},null,{"$f":"SUM(IF($A$5:$A$16=$E8,\n    IF($C$5:$C$16>=LARGE(IF($A$5:$A$16=$E8,$C$5:$C$16),$F$4),1)))","v":4},{"$f":"IF(COLUMNS($L8:L8)>$K8,\"\",INDEX($B$5:$B$16,MATCH(LARGE(IF($A$5:$A$16=$E8,\n    IF($C$5:$C$16>=LARGE(IF($A$5:$A$16=$E8,$C$5:$C$16),$F$4),\n    $C$5:$C$16+(ROW($C$5:$C$16)/1000000))),\n    COLUMNS($L8:L8)),$C$5:$C$16+ROW($C$5:$C$16)/1000000,0)))","v":"Acct 4045"},{"$f":"IF(COLUMNS($L8:M8)>$K8,\"\",INDEX($B$5:$B$16,MATCH(LARGE(IF($A$5:$A$16=$E8,\n    IF($C$5:$C$16>=LARGE(IF($A$5:$A$16=$E8,$C$5:$C$16),$F$4),\n    $C$5:$C$16+(ROW($C$5:$C$16)/1000000))),\n    COLUMNS($L8:M8)),$C$5:$C$16+ROW($C$5:$C$16)/1000000,0)))","v":"Acct 7206"},{"$f":"IF(COLUMNS($L8:N8)>$K8,\"\",INDEX($B$5:$B$16,MATCH(LARGE(IF($A$5:$A$16=$E8,\n    IF($C$5:$C$16>=LARGE(IF($A$5:$A$16=$E8,$C$5:$C$16),$F$4),\n    $C$5:$C$16+(ROW($C$5:$C$16)/1000000))),\n    COLUMNS($L8:N8)),$C$5:$C$16+ROW($C$5:$C$16)/1000000,0)))","v":"Acct 3743"},{"$f":"IF(COLUMNS($L8:O8)>$K8,\"\",INDEX($B$5:$B$16,MATCH(LARGE(IF($A$5:$A$16=$E8,\n    IF($C$5:$C$16>=LARGE(IF($A$5:$A$16=$E8,$C$5:$C$16),$F$4),\n    $C$5:$C$16+(ROW($C$5:$C$16)/1000000))),\n    COLUMNS($L8:O8)),$C$5:$C$16+ROW($C$5:$C$16)/1000000,0)))","v":"Acct 2516"}]
["B","Acct 3806",13796.14]
["B","Acct 4007",52577.1,null,null,{"$f":"LARGE(IF($A$5:$A$16=$E7,IF($C$5:$C$16>=LARGE(IF($A$5:$A$16=$E7,$C$5:$C$16),$F$4),$C$5:$C$16+ROW($C$5:$C$16)/10000)),COLUMNS($F7:F7))","v":75850.201300000001},{"$f":"LARGE(IF($A$5:$A$16=$E7,IF($C$5:$C$16>=LARGE(IF($A$5:$A$16=$E7,$C$5:$C$16),$F$4),$C$5:$C$16+ROW($C$5:$C$16)/10000)),COLUMNS($F7:G7))","v":59948.7016},{"$f":"LARGE(IF($A$5:$A$16=$E7,IF($C$5:$C$16>=LARGE(IF($A$5:$A$16=$E7,$C$5:$C$16),$F$4),$C$5:$C$16+ROW($C$5:$C$16)/10000)),COLUMNS($F7:H7))","v":59948.700499999999},{"$f":"LARGE(IF($A$5:$A$16=$E7,IF($C$5:$C$16>=LARGE(IF($A$5:$A$16=$E7,$C$5:$C$16),$F$4),$C$5:$C$16+ROW($C$5:$C$16)/10000)),COLUMNS($F7:I7))","v":{"$error":"#NUM!"}}]
["B","Acct 4045",79274.820000000007,null,null,{"$f":"LARGE(IF($A$5:$A$16=$E8,IF($C$5:$C$16>=LARGE(IF($A$5:$A$16=$E8,$C$5:$C$16),$F$4),$C$5:$C$16+ROW($C$5:$C$16)/10000)),COLUMNS($F8:F8))","v":79274.821100000001},{"$f":"LARGE(IF($A$5:$A$16=$E8,IF($C$5:$C$16>=LARGE(IF($A$5:$A$16=$E8,$C$5:$C$16),$F$4),$C$5:$C$16+ROW($C$5:$C$16)/10000)),COLUMNS($F8:G8))","v":64366.501499999998},{"$f":"LARGE(IF($A$5:$A$16=$E8,IF($C$5:$C$16>=LARGE(IF($A$5:$A$16=$E8,$C$5:$C$16),$F$4),$C$5:$C$16+ROW($C$5:$C$16)/10000)),COLUMNS($F8:H8))","v":59948.700799999999},{"$f":"LARGE(IF($A$5:$A$16=$E8,IF($C$5:$C$16>=LARGE(IF($A$5:$A$16=$E8,$C$5:$C$16),$F$4),$C$5:$C$16+ROW($C$5:$C$16)/10000)),COLUMNS($F8:I8))","v":59948.700699999994}]
["A","Acct 4408",23608.9]
["A","Acct 5201",75850.2]
["B","Acct 7089",8774.7999999999993,null,"Industry/Customer","Customer 1","Customer 2","Customer 3","Customer 4"]
["B","Acct 7206",64366.5,null,"A",{"$f":"IF(COLUMNS($F15:F15)>SUM(($A$5:$A$16=$E15)*($C$5:$C$16>=LARGE(IF($A$5:$A$16=$E15,$C$5:$C$16),$F$4))),\"\",INDEX($B$5:$B$16,SMALL(IF($A$5:$A$16=$E15,IF($C$5:$C$16=LARGE(IF($A$5:$A$16=$E15,$C$5:$C$16),COLUMNS($F15:F15)),ROW($B$5:$B$16)-ROW($B$5)+1)),SUM(1*(LARGE(IF($A$5:$A$16=$E15,$C$5:$C$16),ROW(INDIRECT(\"1:\"&COLUMNS($F15:F15))))=LARGE(IF($A$5:$A$16=$E15,$C$5:$C$16),COLUMNS($F15:F15)))))))","v":"Acct 5201"},{"$f":"IF(COLUMNS($F15:G15)>SUM(($A$5:$A$16=$E15)*($C$5:$C$16>=LARGE(IF($A$5:$A$16=$E15,$C$5:$C$16),$F$4))),\"\",INDEX($B$5:$B$16,SMALL(IF($A$5:$A$16=$E15,IF($C$5:$C$16=LARGE(IF($A$5:$A$16=$E15,$C$5:$C$16),COLUMNS($F15:G15)),ROW($B$5:$B$16)-ROW($B$5)+1)),SUM(1*(LARGE(IF($A$5:$A$16=$E15,$C$5:$C$16),ROW(INDIRECT(\"1:\"&COLUMNS($F15:G15))))=LARGE(IF($A$5:$A$16=$E15,$C$5:$C$16),COLUMNS($F15:G15)))))))","v":"Acct 1119"},{"$f":"IF(COLUMNS($F15:H15)>SUM(($A$5:$A$16=$E15)*($C$5:$C$16>=LARGE(IF($A$5:$A$16=$E15,$C$5:$C$16),$F$4))),\"\",INDEX($B$5:$B$16,SMALL(IF($A$5:$A$16=$E15,IF($C$5:$C$16=LARGE(IF($A$5:$A$16=$E15,$C$5:$C$16),COLUMNS($F15:H15)),ROW($B$5:$B$16)-ROW($B$5)+1)),SUM(1*(LARGE(IF($A$5:$A$16=$E15,$C$5:$C$16),ROW(INDIRECT(\"1:\"&COLUMNS($F15:H15))))=LARGE(IF($A$5:$A$16=$E15,$C$5:$C$16),COLUMNS($F15:H15)))))))","v":"Acct 8375"},"."]
["A","Acct 8375",59948.7,null,"B",{"$f":"IF(COLUMNS($F16:F16)>SUM(($A$5:$A$16=$E16)*($C$5:$C$16>=LARGE(IF($A$5:$A$16=$E16,$C$5:$C$16),$F$4))),\"\",INDEX($B$5:$B$16,SMALL(IF($A$5:$A$16=$E16,IF($C$5:$C$16=LARGE(IF($A$5:$A$16=$E16,$C$5:$C$16),COLUMNS($F16:F16)),ROW($B$5:$B$16)-ROW($B$5)+1)),SUM(1*(LARGE(IF($A$5:$A$16=$E16,$C$5:$C$16),ROW(INDIRECT(\"1:\"&COLUMNS($F16:F16))))=LARGE(IF($A$5:$A$16=$E16,$C$5:$C$16),COLUMNS($F16:F16)))))))","v":"Acct 4045"},{"$f":"IF(COLUMNS($F16:G16)>SUM(($A$5:$A$16=$E16)*($C$5:$C$16>=LARGE(IF($A$5:$A$16=$E16,$C$5:$C$16),$F$4))),\"\",INDEX($B$5:$B$16,SMALL(IF($A$5:$A$16=$E16,IF($C$5:$C$16=LARGE(IF($A$5:$A$16=$E16,$C$5:$C$16),COLUMNS($F16:G16)),ROW($B$5:$B$16)-ROW($B$5)+1)),SUM(1*(LARGE(IF($A$5:$A$16=$E16,$C$5:$C$16),ROW(INDIRECT(\"1:\"&COLUMNS($F16:G16))))=LARGE(IF($A$5:$A$16=$E16,$C$5:$C$16),COLUMNS($F16:G16)))))))","v":"Acct 7206"},{"$f":"IF(COLUMNS($F16:H16)>SUM(($A$5:$A$16=$E16)*($C$5:$C$16>=LARGE(IF($A$5:$A$16=$E16,$C$5:$C$16),$F$4))),\"\",INDEX($B$5:$B$16,SMALL(IF($A$5:$A$16=$E16,IF($C$5:$C$16=LARGE(IF($A$5:$A$16=$E16,$C$5:$C$16),COLUMNS($F16:H16)),ROW($B$5:$B$16)-ROW($B$5)+1)),SUM(1*(LARGE(IF($A$5:$A$16=$E16,$C$5:$C$16),ROW(INDIRECT(\"1:\"&COLUMNS($F16:H16))))=LARGE(IF($A$5:$A$16=$E16,$C$5:$C$16),COLUMNS($F16:H16)))))))","v":"Acct 2516"},{"$f":"IF(COLUMNS($F16:I16)>SUM(($A$5:$A$16=$E16)*($C$5:$C$16>=LARGE(IF($A$5:$A$16=$E16,$C$5:$C$16),$F$4))),\"\",INDEX($B$5:$B$16,SMALL(IF($A$5:$A$16=$E16,IF($C$5:$C$16=LARGE(IF($A$5:$A$16=$E16,$C$5:$C$16),COLUMNS($F16:I16)),ROW($B$5:$B$16)-ROW($B$5)+1)),SUM(1*(LARGE(IF($A$5:$A$16=$E16,$C$5:$C$16),ROW(INDIRECT(\"1:\"&COLUMNS($F16:I16))))=LARGE(IF($A$5:$A$16=$E16,$C$5:$C$16),COLUMNS($F16:I16)))))))","v":"Acct 3743"}]

{"sheet":"MrExcelExcelisfun78","index":20,"n_rows":194,"n_cols":15,"rows_kept":194,"cut":false,"hidden":false,"merged":[]}
["Industry","Customer","Amount",null,"Alex asks:  is there a way to show the top 2 customers per industry?"]
["A","Acct 8375",59948.701198641109]
["A","Acct 1119",59948.701198641109,null,"Top",3]
["A","Acct 5201",51158.299885325156,null,"**For the formula to work, you must do two sorts: 1st sort Amount column Z to A; and 2nd sort Industry A to Z.\n****For formula that workd no matter what the sort see sheet (Mike(2)."]
["A","Acct 4408",23608.901998540343,null,"Industry/Customer","Customer 1","Customer 2","Customer 3","Customer 4"]
["B","Acct 2516",59948.701198641109,null,"A",{"$f":"IFERROR(INDEX($B$2:$B$194,MATCH(LARGE(IF($A$2:$A$194=$E6,IF($C$2:$C$194>=LARGE(IF($A$2:$A$194=$E6,$C$2:$C$194),$F$3),$C$2:$C$194/(ROW($C$2:$C$194)/10000))),COLUMNS($F6:F6)),$C$2:$C$194/(ROW($C$2:$C$194)/10000),0)),\"\")","v":"Acct 8375"},{"$f":"IFERROR(INDEX($B$2:$B$194,MATCH(LARGE(IF($A$2:$A$194=$E6,IF($C$2:$C$194>=LARGE(IF($A$2:$A$194=$E6,$C$2:$C$194),$F$3),$C$2:$C$194/(ROW($C$2:$C$194)/10000))),COLUMNS($F6:G6)),$C$2:$C$194/(ROW($C$2:$C$194)/10000),0)),\"\")","v":"Acct 1119"},{"$f":"IFERROR(INDEX($B$2:$B$194,MATCH(LARGE(IF($A$2:$A$194=$E6,IF($C$2:$C$194>=LARGE(IF($A$2:$A$194=$E6,$C$2:$C$194),$F$3),$C$2:$C$194/(ROW($C$2:$C$194)/10000))),COLUMNS($F6:H6)),$C$2:$C$194/(ROW($C$2:$C$194)/10000),0)),\"\")","v":"Acct 5201"},{"$f":"IFERROR(INDEX($B$2:$B$194,MATCH(LARGE(IF($A$2:$A$194=$E6,IF($C$2:$C$194>=LARGE(IF($A$2:$A$194=$E6,$C$2:$C$194),$F$3),$C$2:$C$194/(ROW($C$2:$C$194)/10000))),COLUMNS($F6:I6)),$C$2:$C$194/(ROW($C$2:$C$194)/10000),0)),\"\")","v":""},null,null,{"$f":"IF(COLUMNS($F6:F6)>SUM(($A$2:$A$194=$E6)*($C$2:$C$194>=LARGE(IF($A$2:$A$194=$E6,$C$2:$C$194),$F$3))),\"\",INDEX($B$2:$B$194,SMALL(IF($A$2:$A$194=$E6,IF($C$2:$C$194=LARGE(IF($A$2:$A$194=$E6,$C$2:$C$194),COLUMNS($F6:F6)),ROW($B$2:$B$194)-ROW($B$2)+1)),SUM(1*(LARGE(IF($A$2:$A$194=$E6,$C$2:$C$194),ROW(INDIRECT(\"1:\"&COLUMNS($F6:F6))))=LARGE(IF($A$2:$A$194=$E6,$C$2:$C$194),COLUMNS($F6:F6)))))))","v":"Acct 8375"},{"$f":"IF(COLUMNS($F6:G6)>SUM(($A$2:$A$194=$E6)*($C$2:$C$194>=LARGE(IF($A$2:$A$194=$E6,$C$2:$C$194),$F$3))),\"\",INDEX($B$2:$B$194,SMALL(IF($A$2:$A$194=$E6,IF($C$2:$C$194=LARGE(IF($A$2:$A$194=$E6,$C$2:$C$194),COLUMNS($F6:G6)),ROW($B$2:$B$194)-ROW($B$2)+1)),SUM(1*(LARGE(IF($A$2:$A$194=$E6,$C$2:$C$194),ROW(INDIRECT(\"1:\"&COLUMNS($F6:G6))))=LARGE(IF($A$2:$A$194=$E6,$C$2:$C$194),COLUMNS($F6:G6)))))))","v":"Acct 1119"},{"$f":"IF(COLUMNS($F6:H6)>SUM(($A$2:$A$194=$E6)*($C$2:$C$194>=LARGE(IF($A$2:$A$194=$E6,$C$2:$C$194),$F$3))),\"\",INDEX($B$2:$B$194,SMALL(IF($A$2:$A$194=$E6,IF($C$2:$C$194=LARGE(IF($A$2:$A$194=$E6,$C$2:$C$194),COLUMNS($F6:H6)),ROW($B$2:$B$194)-ROW($B$2)+1)),SUM(1*(LARGE(IF($A$2:$A$194=$E6,$C$2:$C$194),ROW(INDIRECT(\"1:\"&COLUMNS($F6:H6))))=LARGE(IF($A$2:$A$194=$E6,$C$2:$C$194),COLUMNS($F6:H6)))))))","v":"Acct 5201"},{"$f":"IF(COLUMNS($F6:I6)>SUM(($A$2:$A$194=$E6)*($C$2:$C$194>=LARGE(IF($A$2:$A$194=$E6,$C$2:$C$194),$F$3))),\"\",INDEX($B$2:$B$194,SMALL(IF($A$2:$A$194=$E6,IF($C$2:$C$194=LARGE(IF($A$2:$A$194=$E6,$C$2:$C$194),COLUMNS($F6:I6)),ROW($B$2:$B$194)-ROW($B$2)+1)),SUM(1*(LARGE(IF($A$2:$A$194=$E6,$C$2:$C$194),ROW(INDIRECT(\"1:\"&COLUMNS($F6:I6))))=LARGE(IF($A$2:$A$194=$E6,$C$2:$C$194),COLUMNS($F6:I6)))))))","v":""}]
["B","Acct 3743",59948.701198641109,null,"B",{"$f":"IFERROR(INDEX($B$2:$B$194,MATCH(LARGE(IF($A$2:$A$194=$E7,IF($C$2:$C$194>=LARGE(IF($A$2:$A$194=$E7,$C$2:$C$194),$F$3),$C$2:$C$194/(ROW($C$2:$C$194)/10000))),COLUMNS($F7:F7)),$C$2:$C$194/(ROW($C$2:$C$194)/10000),0)),\"\")","v":"Acct 2516"},{"$f":"IFERROR(INDEX($B$2:$B$194,MATCH(LARGE(IF($A$2:$A$194=$E7,IF($C$2:$C$194>=LARGE(IF($A$2:$A$194=$E7,$C$2:$C$194),$F$3),$C$2:$C$194/(ROW($C$2:$C$194)/10000))),COLUMNS($F7:G7)),$C$2:$C$194/(ROW($C$2:$C$194)/10000),0)),\"\")","v":"Acct 4045"},{"$f":"IFERROR(INDEX($B$2:$B$194,MATCH(LARGE(IF($A$2:$A$194=$E7,IF($C$2:$C$194>=LARGE(IF($A$2:$A$194=$E7,$C$2:$C$194),$F$3),$C$2:$C$194/(ROW($C$2:$C$194)/10000))),COLUMNS($F7:H7)),$C$2:$C$194/(ROW($C$2:$C$194)/10000),0)),\"\")","v":"Acct 3743"},{"$f":"IFERROR(INDEX($B$2:$B$194,MATCH(LARGE(IF($A$2:$A$194=$E7,IF($C$2:$C$194>=LARGE(IF($A$2:$A$194=$E7,$C$2:$C$194),$F$3),$C$2:$C$194/(ROW($C$2:$C$194)/10000))),COLUMNS($F7:I7)),$C$2:$C$194/(ROW($C$2:$C$194)/10000),0)),\"\")","v":"Acct 7206"},null,null,{"$f":"IF(COLUMNS($F7:F7)>SUM(($A$2:$A$194=$E7)*($C$2:$C$194>=LARGE(IF($A$2:$A$194=$E7,$C$2:$C$194),$F$3))),\"\",INDEX($B$2:$B$194,SMALL(IF($A$2:$A$194=$E7,IF($C$2:$C$194=LARGE(IF($A$2:$A$194=$E7,$C$2:$C$194),COLUMNS($F7:F7)),ROW($B$2:$B$194)-ROW($B$2)+1)),SUM(1*(LARGE(IF($A$2:$A$194=$E7,$C$2:$C$194),ROW(INDIRECT(\"1:\"&COLUMNS($F7:F7))))=LARGE(IF($A$2:$A$194=$E7,$C$2:$C$194),COLUMNS($F7:F7)))))))","v":"Acct 4045"},{"$f":"IF(COLUMNS($F7:G7)>SUM(($A$2:$A$194=$E7)*($C$2:$C$194>=LARGE(IF($A$2:$A$194=$E7,$C$2:$C$194),$F$3))),\"\",INDEX($B$2:$B$194,SMALL(IF($A$2:$A$194=$E7,IF($C$2:$C$194=LARGE(IF($A$2:$A$194=$E7,$C$2:$C$194),COLUMNS($F7:G7)),ROW($B$2:$B$194)-ROW($B$2)+1)),SUM(1*(LARGE(IF($A$2:$A$194=$E7,$C$2:$C$194),ROW(INDIRECT(\"1:\"&COLUMNS($F7:G7))))=LARGE(IF($A$2:$A$194=$E7,$C$2:$C$194),COLUMNS($F7:G7)))))))","v":"Acct 7206"},{"$f":"IF(COLUMNS($F7:H7)>SUM(($A$2:$A$194=$E7)*($C$2:$C$194>=LARGE(IF($A$2:$A$194=$E7,$C$2:$C$194),$F$3))),\"\",INDEX($B$2:$B$194,SMALL(IF($A$2:$A$194=$E7,IF($C$2:$C$194=LARGE(IF($A$2:$A$194=$E7,$C$2:$C$194),COLUMNS($F7:H7)),ROW($B$2:$B$194)-ROW($B$2)+1)),SUM(1*(LARGE(IF($A$2:$A$194=$E7,$C$2:$C$194),ROW(INDIRECT(\"1:\"&COLUMNS($F7:H7))))=LARGE(IF($A$2:$A$194=$E7,$C$2:$C$194),COLUMNS($F7:H7)))))))","v":"Acct 2516"},{"$f":"IF(COLUMNS($F7:I7)>SUM(($A$2:$A$194=$E7)*($C$2:$C$194>=LARGE(IF($A$2:$A$194=$E7,$C$2:$C$194),$F$3))),\"\",INDEX($B$2:$B$194,SMALL(IF($A$2:$A$194=$E7,IF($C$2:$C$194=LARGE(IF($A$2:$A$194=$E7,$C$2:$C$194),COLUMNS($F7:I7)),ROW($B$2:$B$194)-ROW($B$2)+1)),SUM(1*(LARGE(IF($A$2:$A$194=$E7,$C$2:$C$194),ROW(INDIRECT(\"1:\"&COLUMNS($F7:I7))))=LARGE(IF($A$2:$A$194=$E7,$C$2:$C$194),COLUMNS($F7:I7)))))))","v":"Acct 3743"}]
["B","Acct 4045",79274.823478148726,null,"C",{"$f":"IFERROR(INDEX($B$2:$B$194,MATCH(LARGE(IF($A$2:$A$194=$E8,IF($C$2:$C$194>=LARGE(IF($A$2:$A$194=$E8,$C$2:$C$194),$F$3),$C$2:$C$194/(ROW($C$2:$C$194)/10000))),COLUMNS($F8:F8)),$C$2:$C$194/(ROW($C$2:$C$194)/10000),0)),\"\")","v":"Acct 4308"},{"$f":"IFERROR(INDEX($B$2:$B$194,MATCH(LARGE(IF($A$2:$A$194=$E8,IF($C$2:$C$194>=LARGE(IF($A$2:$A$194=$E8,$C$2:$C$194),$F$3),$C$2:$C$194/(ROW($C$2:$C$194)/10000))),COLUMNS($F8:G8)),$C$2:$C$194/(ROW($C$2:$C$194)/10000),0)),\"\")","v":"Acct 5600"},{"$f":"IFERROR(INDEX($B$2:$B$194,MATCH(LARGE(IF($A$2:$A$194=$E8,IF($C$2:$C$194>=LARGE(IF($A$2:$A$194=$E8,$C$2:$C$194),$F$3),$C$2:$C$194/(ROW($C$2:$C$194)/10000))),COLUMNS($F8:H8)),$C$2:$C$194/(ROW($C$2:$C$194)/10000),0)),\"\")","v":"Acct 6115"},{"$f":"IFERROR(INDEX($B$2:$B$194,MATCH(LARGE(IF($A$2:$A$194=$E8,IF($C$2:$C$194>=LARGE(IF($A$2:$A$194=$E8,$C$2:$C$194),$F$3),$C$2:$C$194/(ROW($C$2:$C$194)/10000))),COLUMNS($F8:I8)),$C$2:$C$194/(ROW($C$2:$C$194)/10000),0)),\"\")","v":""},null,null,{"$f":"IF(COLUMNS($F8:F8)>SUM(($A$2:$A$194=$E8)*($C$2:$C$194>=LARGE(IF($A$2:$A$194=$E8,$C$2:$C$194),$F$3))),\"\",INDEX($B$2:$B$194,SMALL(IF($A$2:$A$194=$E8,IF($C$2:$C$194=LARGE(IF($A$2:$A$194=$E8,$C$2:$C$194),COLUMNS($F8:F8)),ROW($B$2:$B$194)-ROW($B$2)+1)),SUM(1*(LARGE(IF($A$2:$A$194=$E8,$C$2:$C$194),ROW(INDIRECT(\"1:\"&COLUMNS($F8:F8))))=LARGE(IF($A$2:$A$194=$E8,$C$2:$C$194),COLUMNS($F8:F8)))))))","v":"Acct 4308"},{"$f":"IF(COLUMNS($F8:G8)>SUM(($A$2:$A$194=$E8)*($C$2:$C$194>=LARGE(IF($A$2:$A$194=$E8,$C$2:$C$194),$F$3))),\"\",INDEX($B$2:$B$194,SMALL(IF($A$2:$A$194=$E8,IF($C$2:$C$194=LARGE(IF($A$2:$A$194=$E8,$C$2:$C$194),COLUMNS($F8:G8)),ROW($B$2:$B$194)-ROW($B$2)+1)),SUM(1*(LARGE(IF($A$2:$A$194=$E8,$C$2:$C$194),ROW(INDIRECT(\"1:\"&COLUMNS($F8:G8))))=LARGE(IF($A$2:$A$194=$E8,$C$2:$C$194),COLUMNS($F8:G8)))))))","v":"Acct 5600"},{"$f":"IF(COLUMNS($F8:H8)>SUM(($A$2:$A$194=$E8)*($C$2:$C$194>=LARGE(IF($A$2:$A$194=$E8,$C$2:$C$194),$F$3))),\"\",INDEX($B$2:$B$194,SMALL(IF($A$2:$A$194=$E8,IF($C$2:$C$194=LARGE(IF($A$2:$A$194=$E8,$C$2:$C$194),COLUMNS($F8:H8)),ROW($B$2:$B$194)-ROW($B$2)+1)),SUM(1*(LARGE(IF($A$2:$A$194=$E8,$C$2:$C$194),ROW(INDIRECT(\"1:\"&COLUMNS($F8:H8))))=LARGE(IF($A$2:$A$194=$E8,$C$2:$C$194),COLUMNS($F8:H8)))))))","v":"Acct 6115"},{"$f":"IF(COLUMNS($F8:I8)>SUM(($A$2:$A$194=$E8)*($C$2:$C$194>=LARGE(IF($A$2:$A$194=$E8,$C$2:$C$194),$F$3))),\"\",INDEX($B$2:$B$194,SMALL(IF($A$2:$A$194=$E8,IF($C$2:$C$194=LARGE(IF($A$2:$A$194=$E8,$C$2:$C$194),COLUMNS($F8:I8)),ROW($B$2:$B$194)-ROW($B$2)+1)),SUM(1*(LARGE(IF($A$2:$A$194=$E8,$C$2:$C$194),ROW(INDIRECT(\"1:\"&COLUMNS($F8:I8))))=LARGE(IF($A$2:$A$194=$E8,$C$2:$C$194),COLUMNS($F8:I8)))))))","v":""}]
["B","Acct 7206",64366.495318589732,null,"D",{"$f":"IFERROR(INDEX($B$2:$B$194,MATCH(LARGE(IF($A$2:$A$194=$E9,IF($C$2:$C$194>=LARGE(IF($A$2:$A$194=$E9,$C$2:$C$194),$F$3),$C$2:$C$194/(ROW($C$2:$C$194)/10000))),COLUMNS($F9:F9)),$C$2:$C$194/(ROW($C$2:$C$194)/10000),0)),\"\")","v":"Acct 2337"},{"$f":"IFERROR(INDEX($B$2:$B$194,MATCH(LARGE(IF($A$2:$A$194=$E9,IF($C$2:$C$194>=LARGE(IF($A$2:$A$194=$E9,$C$2:$C$194),$F$3),$C$2:$C$194/(ROW($C$2:$C$194)/10000))),COLUMNS($F9:G9)),$C$2:$C$194/(ROW($C$2:$C$194)/10000),0)),\"\")","v":"Acct 8136"},{"$f":"IFERROR(INDEX($B$2:$B$194,MATCH(LARGE(IF($A$2:$A$194=$E9,IF($C$2:$C$194>=LARGE(IF($A$2:$A$194=$E9,$C$2:$C$194),$F$3),$C$2:$C$194/(ROW($C$2:$C$194)/10000))),COLUMNS($F9:H9)),$C$2:$C$194/(ROW($C$2:$C$194)/10000),0)),\"\")","v":"Acct 4816"},{"$f":"IFERROR(INDEX($B$2:$B$194,MATCH(LARGE(IF($A$2:$A$194=$E9,IF($C$2:$C$194>=LARGE(IF($A$2:$A$194=$E9,$C$2:$C$194),$F$3),$C$2:$C$194/(ROW($C$2:$C$194)/10000))),COLUMNS($F9:I9)),$C$2:$C$194/(ROW($C$2:$C$194)/10000),0)),\"\")","v":""},null,null,{"$f":"IF(COLUMNS($F9:F9)>SUM(($A$2:$A$194=$E9)*($C$2:$C$194>=LARGE(IF($A$2:$A$194=$E9,$C$2:$C$194),$F$3))),\"\",INDEX($B$2:$B$194,SMALL(IF($A$2:$A$194=$E9,IF($C$2:$C$194=LARGE(IF($A$2:$A$194=$E9,$C$2:$C$194),COLUMNS($F9:F9)),ROW($B$2:$B$194)-ROW($B$2)+1)),SUM(1*(LARGE(IF($A$2:$A$194=$E9,$C$2:$C$194),ROW(INDIRECT(\"1:\"&COLUMNS($F9:F9))))=LARGE(IF($A$2:$A$194=$E9,$C$2:$C$194),COLUMNS($F9:F9)))))))","v":"Acct 2337"},{"$f":"IF(COLUMNS($F9:G9)>SUM(($A$2:$A$194=$E9)*($C$2:$C$194>=LARGE(IF($A$2:$A$194=$E9,$C$2:$C$194),$F$3))),\"\",INDEX($B$2:$B$194,SMALL(IF($A$2:$A$194=$E9,IF($C$2:$C$194=LARGE(IF($A$2:$A$194=$E9,$C$2:$C$194),COLUMNS($F9:G9)),ROW($B$2:$B$194)-ROW($B$2)+1)),SUM(1*(LARGE(IF($A$2:$A$194=$E9,$C$2:$C$194),ROW(INDIRECT(\"1:\"&COLUMNS($F9:G9))))=LARGE(IF($A$2:$A$194=$E9,$C$2:$C$194),COLUMNS($F9:G9)))))))","v":"Acct 8136"},{"$f":"IF(COLUMNS($F9:H9)>SUM(($A$2:$A$194=$E9)*($C$2:$C$194>=LARGE(IF($A$2:$A$194=$E9,$C$2:$C$194),$F$3))),\"\",INDEX($B$2:$B$194,SMALL(IF($A$2:$A$194=$E9,IF($C$2:$C$194=LARGE(IF($A$2:$A$194=$E9,$C$2:$C$194),COLUMNS($F9:H9)),ROW($B$2:$B$194)-ROW($B$2)+1)),SUM(1*(LARGE(IF($A$2:$A$194=$E9,$C$2:$C$194),ROW(INDIRECT(\"1:\"&COLUMNS($F9:H9))))=LARGE(IF($A$2:$A$194=$E9,$C$2:$C$194),COLUMNS($F9:H9)))))))","v":"Acct 4816"},{"$f":"IF(COLUMNS($F9:I9)>SUM(($A$2:$A$194=$E9)*($C$2:$C$194>=LARGE(IF($A$2:$A$194=$E9,$C$2:$C$194),$F$3))),\"\",INDEX($B$2:$B$194,SMALL(IF($A$2:$A$194=$E9,IF($C$2:$C$194=LARGE(IF($A$2:$A$194=$E9,$C$2:$C$194),COLUMNS($F9:I9)),ROW($B$2:$B$194)-ROW($B$2)+1)),SUM(1*(LARGE(IF($A$2:$A$194=$E9,$C$2:$C$194),ROW(INDIRECT(\"1:\"&COLUMNS($F9:I9))))=LARGE(IF($A$2:$A$194=$E9,$C$2:$C$194),COLUMNS($F9:I9)))))))","v":""}]
["B","Acct 4007",52577.103164786662,null,"E",{"$f":"IFERROR(INDEX($B$2:$B$194,MATCH(LARGE(IF($A$2:$A$194=$E10,IF($C$2:$C$194>=LARGE(IF($A$2:$A$194=$E10,$C$2:$C$194),$F$3),$C$2:$C$194/(ROW($C$2:$C$194)/10000))),COLUMNS($F10:F10)),$C$2:$C$194/(ROW($C$2:$C$194)/10000),0)),\"\")","v":"Acct 3149"},{"$f":"IFERROR(INDEX($B$2:$B$194,MATCH(LARGE(IF($A$2:$A$194=$E10,IF($C$2:$C$194>=LARGE(IF($A$2:$A$194=$E10,$C$2:$C$194),$F$3),$C$2:$C$194/(ROW($C$2:$C$194)/10000))),COLUMNS($F10:G10)),$C$2:$C$194/(ROW($C$2:$C$194)/10000),0)),\"\")","v":"Acct 7662"},{"$f":"IFERROR(INDEX($B$2:$B$194,MATCH(LARGE(IF($A$2:$A$194=$E10,IF($C$2:$C$194>=LARGE(IF($A$2:$A$194=$E10,$C$2:$C$194),$F$3),$C$2:$C$194/(ROW($C$2:$C$194)/10000))),COLUMNS($F10:H10)),$C$2:$C$194/(ROW($C$2:$C$194)/10000),0)),\"\")","v":"Acct 4289"},{"$f":"IFERROR(INDEX($B$2:$B$194,MATCH(LARGE(IF($A$2:$A$194=$E10,IF($C$2:$C$194>=LARGE(IF($A$2:$A$194=$E10,$C$2:$C$194),$F$3),$C$2:$C$194/(ROW($C$2:$C$194)/10000))),COLUMNS($F10:I10)),$C$2:$C$194/(ROW($C$2:$C$194)/10000),0)),\"\")","v":""},null,null,{"$f":"IF(COLUMNS($F10:F10)>SUM(($A$2:$A$194=$E10)*($C$2:$C$194>=LARGE(IF($A$2:$A$194=$E10,$C$2:$C$194),$F$3))),\"\",INDEX($B$2:$B$194,SMALL(IF($A$2:$A$194=$E10,IF($C$2:$C$194=LARGE(IF($A$2:$A$194=$E10,$C$2:$C$194),COLUMNS($F10:F10)),ROW($B$2:$B$194)-ROW($B$2)+1)),SUM(1*(LARGE(IF($A$2:$A$194=$E10,$C$2:$C$194),ROW(INDIRECT(\"1:\"&COLUMNS($F10:F10))))=LARGE(IF($A$2:$A$194=$E10,$C$2:$C$194),COLUMNS($F10:F10)))))))","v":"Acct 3149"},{"$f":"IF(COLUMNS($F10:G10)>SUM(($A$2:$A$194=$E10)*($C$2:$C$194>=LARGE(IF($A$2:$A$194=$E10,$C$2:$C$194),$F$3))),\"\",INDEX($B$2:$B$194,SMALL(IF($A$2:$A$194=$E10,IF($C$2:$C$194=LARGE(IF($A$2:$A$194=$E10,$C$2:$C$194),COLUMNS($F10:G10)),ROW($B$2:$B$194)-ROW($B$2)+1)),SUM(1*(LARGE(IF($A$2:$A$194=$E10,$C$2:$C$194),ROW(INDIRECT(\"1:\"&COLUMNS($F10:G10))))=LARGE(IF($A$2:$A$194=$E10,$C$2:$C$194),COLUMNS($F10:G10)))))))","v":"Acct 7662"},{"$f":"IF(COLUMNS($F10:H10)>SUM(($A$2:$A$194=$E10)*($C$2:$C$194>=LARGE(IF($A$2:$A$194=$E10,$C$2:$C$194),$F$3))),\"\",INDEX($B$2:$B$194,SMALL(IF($A$2:$A$194=$E10,IF($C$2:$C$194=LARGE(IF($A$2:$A$194=$E10,$C$2:$C$194),COLUMNS($F10:H10)),ROW($B$2:$B$194)-ROW($B$2)+1)),SUM(1*(LARGE(IF($A$2:$A$194=$E10,$C$2:$C$194),ROW(INDIRECT(\"1:\"&COLUMNS($F10:H10))))=LARGE(IF($A$2:$A$194=$E10,$C$2:$C$194),COLUMNS($F10:H10)))))))","v":"Acct 4289"},{"$f":"IF(COLUMNS($F10:I10)>SUM(($A$2:$A$194=$E10)*($C$2:$C$194>=LARGE(IF($A$2:$A$194=$E10,$C$2:$C$194),$F$3))),\"\",INDEX($B$2:$B$194,SMALL(IF($A$2:$A$194=$E10,IF($C$2:$C$194=LARGE(IF($A$2:$A$194=$E10,$C$2:$C$194),COLUMNS($F10:I10)),ROW($B$2:$B$194)-ROW($B$2)+1)),SUM(1*(LARGE(IF($A$2:$A$194=$E10,$C$2:$C$194),ROW(INDIRECT(\"1:\"&COLUMNS($F10:I10))))=LARGE(IF($A$2:$A$194=$E10,$C$2:$C$194),COLUMNS($F10:I10)))))))","v":""}]
["B","Acct 3806",13796.142644822095,null,"F",{"$f":"IFERROR(INDEX($B$2:$B$194,MATCH(LARGE(IF($A$2:$A$194=$E11,IF($C$2:$C$194>=LARGE(IF($A$2:$A$194=$E11,$C$2:$C$194),$F$3),$C$2:$C$194/(ROW($C$2:$C$194)/10000))),COLUMNS($F11:F11)),$C$2:$C$194/(ROW($C$2:$C$194)/10000),0)),\"\")","v":"Acct 3626"},{"$f":"IFERROR(INDEX($B$2:$B$194,MATCH(LARGE(IF($A$2:$A$194=$E11,IF($C$2:$C$194>=LARGE(IF($A$2:$A$194=$E11,$C$2:$C$194),$F$3),$C$2:$C$194/(ROW($C$2:$C$194)/10000))),COLUMNS($F11:G11)),$C$2:$C$194/(ROW($C$2:$C$194)/10000),0)),\"\")","v":"Acct 7853"},{"$f":"IFERROR(INDEX($B$2:$B$194,MATCH(LARGE(IF($A$2:$A$194=$E11,IF($C$2:$C$194>=LARGE(IF($A$2:$A$194=$E11,$C$2:$C$194),$F$3),$C$2:$C$194/(ROW($C$2:$C$194)/10000))),COLUMNS($F11:H11)),$C$2:$C$194/(ROW($C$2:$C$194)/10000),0)),\"\")","v":"Acct 6976"},{"$f":"IFERROR(INDEX($B$2:$B$194,MATCH(LARGE(IF($A$2:$A$194=$E11,IF($C$2:$C$194>=LARGE(IF($A$2:$A$194=$E11,$C$2:$C$194),$F$3),$C$2:$C$194/(ROW($C$2:$C$194)/10000))),COLUMNS($F11:I11)),$C$2:$C$194/(ROW($C$2:$C$194)/10000),0)),\"\")","v":""},null,null,{"$f":"IF(COLUMNS($F11:F11)>SUM(($A$2:$A$194=$E11)*($C$2:$C$194>=LARGE(IF($A$2:$A$194=$E11,$C$2:$C$194),$F$3))),\"\",INDEX($B$2:$B$194,SMALL(IF($A$2:$A$194=$E11,IF($C$2:$C$194=LARGE(IF($A$2:$A$194=$E11,$C$2:$C$194),COLUMNS($F11:F11)),ROW($B$2:$B$194)-ROW($B$2)+1)),SUM(1*(LARGE(IF($A$2:$A$194=$E11,$C$2:$C$194),ROW(INDIRECT(\"1:\"&COLUMNS($F11:F11))))=LARGE(IF($A$2:$A$194=$E11,$C$2:$C$194),COLUMNS($F11:F11)))))))","v":"Acct 3626"},{"$f":"IF(COLUMNS($F11:G11)>SUM(($A$2:$A$194=$E11)*($C$2:$C$194>=LARGE(IF($A$2:$A$194=$E11,$C$2:$C$194),$F$3))),\"\",INDEX($B$2:$B$194,SMALL(IF($A$2:$A$194=$E11,IF($C$2:$C$194=LARGE(IF($A$2:$A$194=$E11,$C$2:$C$194),COLUMNS($F11:G11)),ROW($B$2:$B$194)-ROW($B$2)+1)),SUM(1*(LARGE(IF($A$2:$A$194=$E11,$C$2:$C$194),ROW(INDIRECT(\"1:\"&COLUMNS($F11:G11))))=LARGE(IF($A$2:$A$194=$E11,$C$2:$C$194),COLUMNS($F11:G11)))))))","v":"Acct 7853"},{"$f":"IF(COLUMNS($F11:H11)>SUM(($A$2:$A$194=$E11)*($C$2:$C$194>=LARGE(IF($A$2:$A$194=$E11,$C$2:$C$194),$F$3))),\"\",INDEX($B$2:$B$194,SMALL(IF($A$2:$A$194=$E11,IF($C$2:$C$194=LARGE(IF($A$2:$A$194=$E11,$C$2:$C$194),COLUMNS($F11:H11)),ROW($B$2:$B$194)-ROW($B$2)+1)),SUM(1*(LARGE(IF($A$2:$A$194=$E11,$C$2:$C$194),ROW(INDIRECT(\"1:\"&COLUMNS($F11:H11))))=LARGE(IF($A$2:$A$194=$E11,$C$2:$C$194),COLUMNS($F11:H11)))))))","v":"Acct 6976"},{"$f":"IF(COLUMNS($F11:I11)>SUM(($A$2:$A$194=$E11)*($C$2:$C$194>=LARGE(IF($A$2:$A$194=$E11,$C$2:$C$194),$F$3))),\"\",INDEX($B$2:$B$194,SMALL(IF($A$2:$A$194=$E11,IF($C$2:$C$194=LARGE(IF($A$2:$A$194=$E11,$C$2:$C$194),COLUMNS($F11:I11)),ROW($B$2:$B$194)-ROW($B$2)+1)),SUM(1*(LARGE(IF($A$2:$A$194=$E11,$C$2:$C$194),ROW(INDIRECT(\"1:\"&COLUMNS($F11:I11))))=LARGE(IF($A$2:$A$194=$E11,$C$2:$C$194),COLUMNS($F11:I11)))))))","v":""}]
["B","Acct 1910",12138.442495236857,null,"G",{"$f":"IFERROR(INDEX($B$2:$B$194,MATCH(LARGE(IF($A$2:$A$194=$E12,IF($C$2:$C$194>=LARGE(IF($A$2:$A$194=$E12,$C$2:$C$194),$F$3),$C$2:$C$194/(ROW($C$2:$C$194)/10000))),COLUMNS($F12:F12)),$C$2:$C$194/(ROW($C$2:$C$194)/10000),0)),\"\")","v":"Acct 4572"},{"$f":"IFERROR(INDEX($B$2:$B$194,MATCH(LARGE(IF($A$2:$A$194=$E12,IF($C$2:$C$194>=LARGE(IF($A$2:$A$194=$E12,$C$2:$C$194),$F$3),$C$2:$C$194/(ROW($C$2:$C$194)/10000))),COLUMNS($F12:G12)),$C$2:$C$194/(ROW($C$2:$C$194)/10000),0)),\"\")","v":"Acct 3463"},{"$f":"IFERROR(INDEX($B$2:$B$194,MATCH(LARGE(IF($A$2:$A$194=$E12,IF($C$2:$C$194>=LARGE(IF($A$2:$A$194=$E12,$C$2:$C$194),$F$3),$C$2:$C$194/(ROW($C$2:$C$194)/10000))),COLUMNS($F12:H12)),$C$2:$C$194/(ROW($C$2:$C$194)/10000),0)),\"\")","v":"Acct 4202"},{"$f":"IFERROR(INDEX($B$2:$B$194,MATCH(LARGE(IF($A$2:$A$194=$E12,IF($C$2:$C$194>=LARGE(IF($A$2:$A$194=$E12,$C$2:$C$194),$F$3),$C$2:$C$194/(ROW($C$2:$C$194)/10000))),COLUMNS($F12:I12)),$C$2:$C$194/(ROW($C$2:$C$194)/10000),0)),\"\")","v":""},null,null,{"$f":"IF(COLUMNS($F12:F12)>SUM(($A$2:$A$194=$E12)*($C$2:$C$194>=LARGE(IF($A$2:$A$194=$E12,$C$2:$C$194),$F$3))),\"\",INDEX($B$2:$B$194,SMALL(IF($A$2:$A$194=$E12,IF($C$2:$C$194=LARGE(IF($A$2:$A$194=$E12,$C$2:$C$194),COLUMNS($F12:F12)),ROW($B$2:$B$194)-ROW($B$2)+1)),SUM(1*(LARGE(IF($A$2:$A$194=$E12,$C$2:$C$194),ROW(INDIRECT(\"1:\"&COLUMNS($F12:F12))))=LARGE(IF($A$2:$A$194=$E12,$C$2:$C$194),COLUMNS($F12:F12)))))))","v":"Acct 4572"},{"$f":"IF(COLUMNS($F12:G12)>SUM(($A$2:$A$194=$E12)*($C$2:$C$194>=LARGE(IF($A$2:$A$194=$E12,$C$2:$C$194),$F$3))),\"\",INDEX($B$2:$B$194,SMALL(IF($A$2:$A$194=$E12,IF($C$2:$C$194=LARGE(IF($A$2:$A$194=$E12,$C$2:$C$194),COLUMNS($F12:G12)),ROW($B$2:$B$194)-ROW($B$2)+1)),SUM(1*(LARGE(IF($A$2:$A$194=$E12,$C$2:$C$194),ROW(INDIRECT(\"1:\"&COLUMNS($F12:G12))))=LARGE(IF($A$2:$A$194=$E12,$C$2:$C$194),COLUMNS($F12:G12)))))))","v":"Acct 3463"},{"$f":"IF(COLUMNS($F12:H12)>SUM(($A$2:$A$194=$E12)*($C$2:$C$194>=LARGE(IF($A$2:$A$194=$E12,$C$2:$C$194),$F$3))),\"\",INDEX($B$2:$B$194,SMALL(IF($A$2:$A$194=$E12,IF($C$2:$C$194=LARGE(IF($A$2:$A$194=$E12,$C$2:$C$194),COLUMNS($F12:H12)),ROW($B$2:$B$194)-ROW($B$2)+1)),SUM(1*(LARGE(IF($A$2:$A$194=$E12,$C$2:$C$194),ROW(INDIRECT(\"1:\"&COLUMNS($F12:H12))))=LARGE(IF($A$2:$A$194=$E12,$C$2:$C$194),COLUMNS($F12:H12)))))))","v":"Acct 4202"},{"$f":"IF(COLUMNS($F12:I12)>SUM(($A$2:$A$194=$E12)*($C$2:$C$194>=LARGE(IF($A$2:$A$194=$E12,$C$2:$C$194),$F$3))),\"\",INDEX($B$2:$B$194,SMALL(IF($A$2:$A$194=$E12,IF($C$2:$C$194=LARGE(IF($A$2:$A$194=$E12,$C$2:$C$194),COLUMNS($F12:I12)),ROW($B$2:$B$194)-ROW($B$2)+1)),SUM(1*(LARGE(IF($A$2:$A$194=$E12,$C$2:$C$194),ROW(INDIRECT(\"1:\"&COLUMNS($F12:I12))))=LARGE(IF($A$2:$A$194=$E12,$C$2:$C$194),COLUMNS($F12:I12)))))))","v":""}]
["B","Acct 7089",8774.8026805944846,null,"H",{"$f":"IFERROR(INDEX($B$2:$B$194,MATCH(LARGE(IF($A$2:$A$194=$E13,IF($C$2:$C$194>=LARGE(IF($A$2:$A$194=$E13,$C$2:$C$194),$F$3),$C$2:$C$194/(ROW($C$2:$C$194)/10000))),COLUMNS($F13:F13)),$C$2:$C$194/(ROW($C$2:$C$194)/10000),0)),\"\")","v":"Acct 7000"},{"$f":"IFERROR(INDEX($B$2:$B$194,MATCH(LARGE(IF($A$2:$A$194=$E13,IF($C$2:$C$194>=LARGE(IF($A$2:$A$194=$E13,$C$2:$C$194),$F$3),$C$2:$C$194/(ROW($C$2:$C$194)/10000))),COLUMNS($F13:G13)),$C$2:$C$194/(ROW($C$2:$C$194)/10000),0)),\"\")","v":"Acct 3609"},{"$f":"IFERROR(INDEX($B$2:$B$194,MATCH(LARGE(IF($A$2:$A$194=$E13,IF($C$2:$C$194>=LARGE(IF($A$2:$A$194=$E13,$C$2:$C$194),$F$3),$C$2:$C$194/(ROW($C$2:$C$194)/10000))),COLUMNS($F13:H13)),$C$2:$C$194/(ROW($C$2:$C$194)/10000),0)),\"\")","v":"Acct 4633"},{"$f":"IFERROR(INDEX($B$2:$B$194,MATCH(LARGE(IF($A$2:$A$194=$E13,IF($C$2:$C$194>=LARGE(IF($A$2:$A$194=$E13,$C$2:$C$194),$F$3),$C$2:$C$194/(ROW($C$2:$C$194)/10000))),COLUMNS($F13:I13)),$C$2:$C$194/(ROW($C$2:$C$194)/10000),0)),\"\")","v":""},null,null,{"$f":"IF(COLUMNS($F13:F13)>SUM(($A$2:$A$194=$E13)*($C$2:$C$194>=LARGE(IF($A$2:$A$194=$E13,$C$2:$C$194),$F$3))),\"\",INDEX($B$2:$B$194,SMALL(IF($A$2:$A$194=$E13,IF($C$2:$C$194=LARGE(IF($A$2:$A$194=$E13,$C$2:$C$194),COLUMNS($F13:F13)),ROW($B$2:$B$194)-ROW($B$2)+1)),SUM(1*(LARGE(IF($A$2:$A$194=$E13,$C$2:$C$194),ROW(INDIRECT(\"1:\"&COLUMNS($F13:F13))))=LARGE(IF($A$2:$A$194=$E13,$C$2:$C$194),COLUMNS($F13:F13)))))))","v":"Acct 7000"},{"$f":"IF(COLUMNS($F13:G13)>SUM(($A$2:$A$194=$E13)*($C$2:$C$194>=LARGE(IF($A$2:$A$194=$E13,$C$2:$C$194),$F$3))),\"\",INDEX($B$2:$B$194,SMALL(IF($A$2:$A$194=$E13,IF($C$2:$C$194=LARGE(IF($A$2:$A$194=$E13,$C$2:$C$194),COLUMNS($F13:G13)),ROW($B$2:$B$194)-ROW($B$2)+1)),SUM(1*(LARGE(IF($A$2:$A$194=$E13,$C$2:$C$194),ROW(INDIRECT(\"1:\"&COLUMNS($F13:G13))))=LARGE(IF($A$2:$A$194=$E13,$C$2:$C$194),COLUMNS($F13:G13)))))))","v":"Acct 3609"},{"$f":"IF(COLUMNS($F13:H13)>SUM(($A$2:$A$194=$E13)*($C$2:$C$194>=LARGE(IF($A$2:$A$194=$E13,$C$2:$C$194),$F$3))),\"\",INDEX($B$2:$B$194,SMALL(IF($A$2:$A$194=$E13,IF($C$2:$C$194=LARGE(IF($A$2:$A$194=$E13,$C$2:$C$194),COLUMNS($F13:H13)),ROW($B$2:$B$194)-ROW($B$2)+1)),SUM(1*(LARGE(IF($A$2:$A$194=$E13,$C$2:$C$194),ROW(INDIRECT(\"1:\"&COLUMNS($F13:H13))))=LARGE(IF($A$2:$A$194=$E13,$C$2:$C$194),COLUMNS($F13:H13)))))))","v":"Acct 4633"},{"$f":"IF(COLUMNS($F13:I13)>SUM(($A$2:$A$194=$E13)*($C$2:$C$194>=LARGE(IF($A$2:$A$194=$E13,$C$2:$C$194),$F$3))),\"\",INDEX($B$2:$B$194,SMALL(IF($A$2:$A$194=$E13,IF($C$2:$C$194=LARGE(IF($A$2:$A$194=$E13,$C$2:$C$194),COLUMNS($F13:I13)),ROW($B$2:$B$194)-ROW($B$2)+1)),SUM(1*(LARGE(IF($A$2:$A$194=$E13,$C$2:$C$194),ROW(INDIRECT(\"1:\"&COLUMNS($F13:I13))))=LARGE(IF($A$2:$A$194=$E13,$C$2:$C$194),COLUMNS($F13:I13)))))))","v":""}]
["C","Acct 4308",45239.218902719978,null,"I",{"$f":"IFERROR(INDEX($B$2:$B$194,MATCH(LARGE(IF($A$2:$A$194=$E14,IF($C$2:$C$194>=LARGE(IF($A$2:$A$194=$E14,$C$2:$C$194),$F$3),$C$2:$C$194/(ROW($C$2:$C$194)/10000))),COLUMNS($F14:F14)),$C$2:$C$194/(ROW($C$2:$C$194)/10000),0)),\"\")","v":"Acct 2335"},{"$f":"IFERROR(INDEX($B$2:$B$194,MATCH(LARGE(IF($A$2:$A$194=$E14,IF($C$2:$C$194>=LARGE(IF($A$2:$A$194=$E14,$C$2:$C$194),$F$3),$C$2:$C$194/(ROW($C$2:$C$194)/10000))),COLUMNS($F14:G14)),$C$2:$C$194/(ROW($C$2:$C$194)/10000),0)),\"\")","v":"Acct 7761"},{"$f":"IFERROR(INDEX($B$2:$B$194,MATCH(LARGE(IF($A$2:$A$194=$E14,IF($C$2:$C$194>=LARGE(IF($A$2:$A$194=$E14,$C$2:$C$194),$F$3),$C$2:$C$194/(ROW($C$2:$C$194)/10000))),COLUMNS($F14:H14)),$C$2:$C$194/(ROW($C$2:$C$194)/10000),0)),\"\")","v":"Acct 7297"},{"$f":"IFERROR(INDEX($B$2:$B$194,MATCH(LARGE(IF($A$2:$A$194=$E14,IF($C$2:$C$194>=LARGE(IF($A$2:$A$194=$E14,$C$2:$C$194),$F$3),$C$2:$C$194/(ROW($C$2:$C$194)/10000))),COLUMNS($F14:I14)),$C$2:$C$194/(ROW($C$2:$C$194)/10000),0)),\"\")","v":""},null,null,{"$f":"IF(COLUMNS($F14:F14)>SUM(($A$2:$A$194=$E14)*($C$2:$C$194>=LARGE(IF($A$2:$A$194=$E14,$C$2:$C$194),$F$3))),\"\",INDEX($B$2:$B$194,SMALL(IF($A$2:$A$194=$E14,IF($C$2:$C$194=LARGE(IF($A$2:$A$194=$E14,$C$2:$C$194),COLUMNS($F14:F14)),ROW($B$2:$B$194)-ROW($B$2)+1)),SUM(1*(LARGE(IF($A$2:$A$194=$E14,$C$2:$C$194),ROW(INDIRECT(\"1:\"&COLUMNS($F14:F14))))=LARGE(IF($A$2:$A$194=$E14,$C$2:$C$194),COLUMNS($F14:F14)))))))","v":"Acct 2335"},{"$f":"IF(COLUMNS($F14:G14)>SUM(($A$2:$A$194=$E14)*($C$2:$C$194>=LARGE(IF($A$2:$A$194=$E14,$C$2:$C$194),$F$3))),\"\",INDEX($B$2:$B$194,SMALL(IF($A$2:$A$194=$E14,IF($C$2:$C$194=LARGE(IF($A$2:$A$194=$E14,$C$2:$C$194),COLUMNS($F14:G14)),ROW($B$2:$B$194)-ROW($B$2)+1)),SUM(1*(LARGE(IF($A$2:$A$194=$E14,$C$2:$C$194),ROW(INDIRECT(\"1:\"&COLUMNS($F14:G14))))=LARGE(IF($A$2:$A$194=$E14,$C$2:$C$194),COLUMNS($F14:G14)))))))","v":"Acct 7761"},{"$f":"IF(COLUMNS($F14:H14)>SUM(($A$2:$A$194=$E14)*($C$2:$C$194>=LARGE(IF($A$2:$A$194=$E14,$C$2:$C$194),$F$3))),\"\",INDEX($B$2:$B$194,SMALL(IF($A$2:$A$194=$E14,IF($C$2:$C$194=LARGE(IF($A$2:$A$194=$E14,$C$2:$C$194),COLUMNS($F14:H14)),ROW($B$2:$B$194)-ROW($B$2)+1)),SUM(1*(LARGE(IF($A$2:$A$194=$E14,$C$2:$C$194),ROW(INDIRECT(\"1:\"&COLUMNS($F14:H14))))=LARGE(IF($A$2:$A$194=$E14,$C$2:$C$194),COLUMNS($F14:H14)))))))","v":"Acct 7297"},{"$f":"IF(COLUMNS($F14:I14)>SUM(($A$2:$A$194=$E14)*($C$2:$C$194>=LARGE(IF($A$2:$A$194=$E14,$C$2:$C$194),$F$3))),\"\",INDEX($B$2:$B$194,SMALL(IF($A$2:$A$194=$E14,IF($C$2:$C$194=LARGE(IF($A$2:$A$194=$E14,$C$2:$C$194),COLUMNS($F14:I14)),ROW($B$2:$B$194)-ROW($B$2)+1)),SUM(1*(LARGE(IF($A$2:$A$194=$E14,$C$2:$C$194),ROW(INDIRECT(\"1:\"&COLUMNS($F14:I14))))=LARGE(IF($A$2:$A$194=$E14,$C$2:$C$194),COLUMNS($F14:I14)))))))","v":""}]
["C","Acct 5600",25193.714664525236,null,"J",{"$f":"IFERROR(INDEX($B$2:$B$194,MATCH(LARGE(IF($A$2:$A$194=$E15,IF($C$2:$C$194>=LARGE(IF($A$2:$A$194=$E15,$C$2:$C$194),$F$3),$C$2:$C$194/(ROW($C$2:$C$194)/10000))),COLUMNS($F15:F15)),$C$2:$C$194/(ROW($C$2:$C$194)/10000),0)),\"\")","v":"Acct 6172"},{"$f":"IFERROR(INDEX($B$2:$B$194,MATCH(LARGE(IF($A$2:$A$194=$E15,IF($C$2:$C$194>=LARGE(IF($A$2:$A$194=$E15,$C$2:$C$194),$F$3),$C$2:$C$194/(ROW($C$2:$C$194)/10000))),COLUMNS($F15:G15)),$C$2:$C$194/(ROW($C$2:$C$194)/10000),0)),\"\")","v":"Acct 4394"},{"$f":"IFERROR(INDEX($B$2:$B$194,MATCH(LARGE(IF($A$2:$A$194=$E15,IF($C$2:$C$194>=LARGE(IF($A$2:$A$194=$E15,$C$2:$C$194),$F$3),$C$2:$C$194/(ROW($C$2:$C$194)/10000))),COLUMNS($F15:H15)),$C$2:$C$194/(ROW($C$2:$C$194)/10000),0)),\"\")","v":"Acct 7933"},{"$f":"IFERROR(INDEX($B$2:$B$194,MATCH(LARGE(IF($A$2:$A$194=$E15,IF($C$2:$C$194>=LARGE(IF($A$2:$A$194=$E15,$C$2:$C$194),$F$3),$C$2:$C$194/(ROW($C$2:$C$194)/10000))),COLUMNS($F15:I15)),$C$2:$C$194/(ROW($C$2:$C$194)/10000),0)),\"\")","v":""},null,null,{"$f":"IF(COLUMNS($F15:F15)>SUM(($A$2:$A$194=$E15)*($C$2:$C$194>=LARGE(IF($A$2:$A$194=$E15,$C$2:$C$194),$F$3))),\"\",INDEX($B$2:$B$194,SMALL(IF($A$2:$A$194=$E15,IF($C$2:$C$194=LARGE(IF($A$2:$A$194=$E15,$C$2:$C$194),COLUMNS($F15:F15)),ROW($B$2:$B$194)-ROW($B$2)+1)),SUM(1*(LARGE(IF($A$2:$A$194=$E15,$C$2:$C$194),ROW(INDIRECT(\"1:\"&COLUMNS($F15:F15))))=LARGE(IF($A$2:$A$194=$E15,$C$2:$C$194),COLUMNS($F15:F15)))))))","v":"Acct 6172"},{"$f":"IF(COLUMNS($F15:G15)>SUM(($A$2:$A$194=$E15)*($C$2:$C$194>=LARGE(IF($A$2:$A$194=$E15,$C$2:$C$194),$F$3))),\"\",INDEX($B$2:$B$194,SMALL(IF($A$2:$A$194=$E15,IF($C$2:$C$194=LARGE(IF($A$2:$A$194=$E15,$C$2:$C$194),COLUMNS($F15:G15)),ROW($B$2:$B$194)-ROW($B$2)+1)),SUM(1*(LARGE(IF($A$2:$A$194=$E15,$C$2:$C$194),ROW(INDIRECT(\"1:\"&COLUMNS($F15:G15))))=LARGE(IF($A$2:$A$194=$E15,$C$2:$C$194),COLUMNS($F15:G15)))))))","v":"Acct 4394"},{"$f":"IF(COLUMNS($F15:H15)>SUM(($A$2:$A$194=$E15)*($C$2:$C$194>=LARGE(IF($A$2:$A$194=$E15,$C$2:$C$194),$F$3))),\"\",INDEX($B$2:$B$194,SMALL(IF($A$2:$A$194=$E15,IF($C$2:$C$194=LARGE(IF($A$2:$A$194=$E15,$C$2:$C$194),COLUMNS($F15:H15)),ROW($B$2:$B$194)-ROW($B$2)+1)),SUM(1*(LARGE(IF($A$2:$A$194=$E15,$C$2:$C$194),ROW(INDIRECT(\"1:\"&COLUMNS($F15:H15))))=LARGE(IF($A$2:$A$194=$E15,$C$2:$C$194),COLUMNS($F15:H15)))))))","v":"Acct 7933"},{"$f":"IF(COLUMNS($F15:I15)>SUM(($A$2:$A$194=$E15)*($C$2:$C$194>=LARGE(IF($A$2:$A$194=$E15,$C$2:$C$194),$F$3))),\"\",INDEX($B$2:$B$194,SMALL(IF($A$2:$A$194=$E15,IF($C$2:$C$194=LARGE(IF($A$2:$A$194=$E15,$C$2:$C$194),COLUMNS($F15:I15)),ROW($B$2:$B$194)-ROW($B$2)+1)),SUM(1*(LARGE(IF($A$2:$A$194=$E15,$C$2:$C$194),ROW(INDIRECT(\"1:\"&COLUMNS($F15:I15))))=LARGE(IF($A$2:$A$194=$E15,$C$2:$C$194),COLUMNS($F15:I15)))))))","v":""}]
["C","Acct 6115",17495.623050845155,null,"K",{"$f":"IFERROR(INDEX($B$2:$B$194,MATCH(LARGE(IF($A$2:$A$194=$E16,IF($C$2:$C$194>=LARGE(IF($A$2:$A$194=$E16,$C$2:$C$194),$F$3),$C$2:$C$194/(ROW($C$2:$C$194)/10000))),COLUMNS($F16:F16)),$C$2:$C$194/(ROW($C$2:$C$194)/10000),0)),\"\")","v":"Acct 7565"},{"$f":"IFERROR(INDEX($B$2:$B$194,MATCH(LARGE(IF($A$2:$A$194=$E16,IF($C$2:$C$194>=LARGE(IF($A$2:$A$194=$E16,$C$2:$C$194),$F$3),$C$2:$C$194/(ROW($C$2:$C$194)/10000))),COLUMNS($F16:G16)),$C$2:$C$194/(ROW($C$2:$C$194)/10000),0)),\"\")","v":"Acct 6510"},{"$f":"IFERROR(INDEX($B$2:$B$194,MATCH(LARGE(IF($A$2:$A$194=$E16,IF($C$2:$C$194>=LARGE(IF($A$2:$A$194=$E16,$C$2:$C$194),$F$3),$C$2:$C$194/(ROW($C$2:$C$194)/10000))),COLUMNS($F16:H16)),$C$2:$C$194/(ROW($C$2:$C$194)/10000),0)),\"\")","v":"Acct 6891"},{"$f":"IFERROR(INDEX($B$2:$B$194,MATCH(LARGE(IF($A$2:$A$194=$E16,IF($C$2:$C$194>=LARGE(IF($A$2:$A$194=$E16,$C$2:$C$194),$F$3),$C$2:$C$194/(ROW($C$2:$C$194)/10000))),COLUMNS($F16:I16)),$C$2:$C$194/(ROW($C$2:$C$194)/10000),0)),\"\")","v":""},null,null,{"$f":"IF(COLUMNS($F16:F16)>SUM(($A$2:$A$194=$E16)*($C$2:$C$194>=LARGE(IF($A$2:$A$194=$E16,$C$2:$C$194),$F$3))),\"\",INDEX($B$2:$B$194,SMALL(IF($A$2:$A$194=$E16,IF($C$2:$C$194=LARGE(IF($A$2:$A$194=$E16,$C$2:$C$194),COLUMNS($F16:F16)),ROW($B$2:$B$194)-ROW($B$2)+1)),SUM(1*(LARGE(IF($A$2:$A$194=$E16,$C$2:$C$194),ROW(INDIRECT(\"1:\"&COLUMNS($F16:F16))))=LARGE(IF($A$2:$A$194=$E16,$C$2:$C$194),COLUMNS($F16:F16)))))))","v":"Acct 7565"},{"$f":"IF(COLUMNS($F16:G16)>SUM(($A$2:$A$194=$E16)*($C$2:$C$194>=LARGE(IF($A$2:$A$194=$E16,$C$2:$C$194),$F$3))),\"\",INDEX($B$2:$B$194,SMALL(IF($A$2:$A$194=$E16,IF($C$2:$C$194=LARGE(IF($A$2:$A$194=$E16,$C$2:$C$194),COLUMNS($F16:G16)),ROW($B$2:$B$194)-ROW($B$2)+1)),SUM(1*(LARGE(IF($A$2:$A$194=$E16,$C$2:$C$194),ROW(INDIRECT(\"1:\"&COLUMNS($F16:G16))))=LARGE(IF($A$2:$A$194=$E16,$C$2:$C$194),COLUMNS($F16:G16)))))))","v":"Acct 6510"},{"$f":"IF(COLUMNS($F16:H16)>SUM(($A$2:$A$194=$E16)*($C$2:$C$194>=LARGE(IF($A$2:$A$194=$E16,$C$2:$C$194),$F$3))),\"\",INDEX($B$2:$B$194,SMALL(IF($A$2:$A$194=$E16,IF($C$2:$C$194=LARGE(IF($A$2:$A$194=$E16,$C$2:$C$194),COLUMNS($F16:H16)),ROW($B$2:$B$194)-ROW($B$2)+1)),SUM(1*(LARGE(IF($A$2:$A$194=$E16,$C$2:$C$194),ROW(INDIRECT(\"1:\"&COLUMNS($F16:H16))))=LARGE(IF($A$2:$A$194=$E16,$C$2:$C$194),COLUMNS($F16:H16)))))))","v":"Acct 6891"},{"$f":"IF(COLUMNS($F16:I16)>SUM(($A$2:$A$194=$E16)*($C$2:$C$194>=LARGE(IF($A$2:$A$194=$E16,$C$2:$C$194),$F$3))),\"\",INDEX($B$2:$B$194,SMALL(IF($A$2:$A$194=$E16,IF($C$2:$C$194=LARGE(IF($A$2:$A$194=$E16,$C$2:$C$194),COLUMNS($F16:I16)),ROW($B$2:$B$194)-ROW($B$2)+1)),SUM(1*(LARGE(IF($A$2:$A$194=$E16,$C$2:$C$194),ROW(INDIRECT(\"1:\"&COLUMNS($F16:I16))))=LARGE(IF($A$2:$A$194=$E16,$C$2:$C$194),COLUMNS($F16:I16)))))))","v":""}]
["D","Acct 2337",98475.307688900779,null,"L",{"$f":"IFERROR(INDEX($B$2:$B$194,MATCH(LARGE(IF($A$2:$A$194=$E17,IF($C$2:$C$194>=LARGE(IF($A$2:$A$194=$E17,$C$2:$C$194),$F$3),$C$2:$C$194/(ROW($C$2:$C$194)/10000))),COLUMNS($F17:F17)),$C$2:$C$194/(ROW($C$2:$C$194)/10000),0)),\"\")","v":"Acct 8898"},{"$f":"IFERROR(INDEX($B$2:$B$194,MATCH(LARGE(IF($A$2:$A$194=$E17,IF($C$2:$C$194>=LARGE(IF($A$2:$A$194=$E17,$C$2:$C$194),$F$3),$C$2:$C$194/(ROW($C$2:$C$194)/10000))),COLUMNS($F17:G17)),$C$2:$C$194/(ROW($C$2:$C$194)/10000),0)),\"\")","v":"Acct 8210"},{"$f":"IFERROR(INDEX($B$2:$B$194,MATCH(LARGE(IF($A$2:$A$194=$E17,IF($C$2:$C$194>=LARGE(IF($A$2:$A$194=$E17,$C$2:$C$194),$F$3),$C$2:$C$194/(ROW($C$2:$C$194)/10000))),COLUMNS($F17:H17)),$C$2:$C$194/(ROW($C$2:$C$194)/10000),0)),\"\")","v":"Acct 8361"},{"$f":"IFERROR(INDEX($B$2:$B$194,MATCH(LARGE(IF($A$2:$A$194=$E17,IF($C$2:$C$194>=LARGE(IF($A$2:$A$194=$E17,$C$2:$C$194),$F$3),$C$2:$C$194/(ROW($C$2:$C$194)/10000))),COLUMNS($F17:I17)),$C$2:$C$194/(ROW($C$2:$C$194)/10000),0)),\"\")","v":""},null,null,{"$f":"IF(COLUMNS($F17:F17)>SUM(($A$2:$A$194=$E17)*($C$2:$C$194>=LARGE(IF($A$2:$A$194=$E17,$C$2:$C$194),$F$3))),\"\",INDEX($B$2:$B$194,SMALL(IF($A$2:$A$194=$E17,IF($C$2:$C$194=LARGE(IF($A$2:$A$194=$E17,$C$2:$C$194),COLUMNS($F17:F17)),ROW($B$2:$B$194)-ROW($B$2)+1)),SUM(1*(LARGE(IF($A$2:$A$194=$E17,$C$2:$C$194),ROW(INDIRECT(\"1:\"&COLUMNS($F17:F17))))=LARGE(IF($A$2:$A$194=$E17,$C$2:$C$194),COLUMNS($F17:F17)))))))","v":"Acct 8898"},{"$f":"IF(COLUMNS($F17:G17)>SUM(($A$2:$A$194=$E17)*($C$2:$C$194>=LARGE(IF($A$2:$A$194=$E17,$C$2:$C$194),$F$3))),\"\",INDEX($B$2:$B$194,SMALL(IF($A$2:$A$194=$E17,IF($C$2:$C$194=LARGE(IF($A$2:$A$194=$E17,$C$2:$C$194),COLUMNS($F17:G17)),ROW($B$2:$B$194)-ROW($B$2)+1)),SUM(1*(LARGE(IF($A$2:$A$194=$E17,$C$2:$C$194),ROW(INDIRECT(\"1:\"&COLUMNS($F17:G17))))=LARGE(IF($A$2:$A$194=$E17,$C$2:$C$194),COLUMNS($F17:G17)))))))","v":"Acct 8210"},{"$f":"IF(COLUMNS($F17:H17)>SUM(($A$2:$A$194=$E17)*($C$2:$C$194>=LARGE(IF($A$2:$A$194=$E17,$C$2:$C$194),$F$3))),\"\",INDEX($B$2:$B$194,SMALL(IF($A$2:$A$194=$E17,IF($C$2:$C$194=LARGE(IF($A$2:$A$194=$E17,$C$2:$C$194),COLUMNS($F17:H17)),ROW($B$2:$B$194)-ROW($B$2)+1)),SUM(1*(LARGE(IF($A$2:$A$194=$E17,$C$2:$C$194),ROW(INDIRECT(\"1:\"&COLUMNS($F17:H17))))=LARGE(IF($A$2:$A$194=$E17,$C$2:$C$194),COLUMNS($F17:H17)))))))","v":"Acct 8361"},{"$f":"IF(COLUMNS($F17:I17)>SUM(($A$2:$A$194=$E17)*($C$2:$C$194>=LARGE(IF($A$2:$A$194=$E17,$C$2:$C$194),$F$3))),\"\",INDEX($B$2:$B$194,SMALL(IF($A$2:$A$194=$E17,IF($C$2:$C$194=LARGE(IF($A$2:$A$194=$E17,$C$2:$C$194),COLUMNS($F17:I17)),ROW($B$2:$B$194)-ROW($B$2)+1)),SUM(1*(LARGE(IF($A$2:$A$194=$E17,$C$2:$C$194),ROW(INDIRECT(\"1:\"&COLUMNS($F17:I17))))=LARGE(IF($A$2:$A$194=$E17,$C$2:$C$194),COLUMNS($F17:I17)))))))","v":""}]
["D","Acct 8136",97846.31589242247,null,"M",{"$f":"IFERROR(INDEX($B$2:$B$194,MATCH(LARGE(IF($A$2:$A$194=$E18,IF($C$2:$C$194>=LARGE(IF($A$2:$A$194=$E18,$C$2:$C$194),$F$3),$C$2:$C$194/(ROW($C$2:$C$194)/10000))),COLUMNS($F18:F18)),$C$2:$C$194/(ROW($C$2:$C$194)/10000),0)),\"\")","v":"Acct 1839"},{"$f":"IFERROR(INDEX($B$2:$B$194,MATCH(LARGE(IF($A$2:$A$194=$E18,IF($C$2:$C$194>=LARGE(IF($A$2:$A$194=$E18,$C$2:$C$194),$F$3),$C$2:$C$194/(ROW($C$2:$C$194)/10000))),COLUMNS($F18:G18)),$C$2:$C$194/(ROW($C$2:$C$194)/10000),0)),\"\")","v":"Acct 8666"},{"$f":"IFERROR(INDEX($B$2:$B$194,MATCH(LARGE(IF($A$2:$A$194=$E18,IF($C$2:$C$194>=LARGE(IF($A$2:$A$194=$E18,$C$2:$C$194),$F$3),$C$2:$C$194/(ROW($C$2:$C$194)/10000))),COLUMNS($F18:H18)),$C$2:$C$194/(ROW($C$2:$C$194)/10000),0)),\"\")","v":"Acct 5486"},{"$f":"IFERROR(INDEX($B$2:$B$194,MATCH(LARGE(IF($A$2:$A$194=$E18,IF($C$2:$C$194>=LARGE(IF($A$2:$A$194=$E18,$C$2:$C$194),$F$3),$C$2:$C$194/(ROW($C$2:$C$194)/10000))),COLUMNS($F18:I18)),$C$2:$C$194/(ROW($C$2:$C$194)/10000),0)),\"\")","v":""},null,null,{"$f":"IF(COLUMNS($F18:F18)>SUM(($A$2:$A$194=$E18)*($C$2:$C$194>=LARGE(IF($A$2:$A$194=$E18,$C$2:$C$194),$F$3))),\"\",INDEX($B$2:$B$194,SMALL(IF($A$2:$A$194=$E18,IF($C$2:$C$194=LARGE(IF($A$2:$A$194=$E18,$C$2:$C$194),COLUMNS($F18:F18)),ROW($B$2:$B$194)-ROW($B$2)+1)),SUM(1*(LARGE(IF($A$2:$A$194=$E18,$C$2:$C$194),ROW(INDIRECT(\"1:\"&COLUMNS($F18:F18))))=LARGE(IF($A$2:$A$194=$E18,$C$2:$C$194),COLUMNS($F18:F18)))))))","v":"Acct 1839"},{"$f":"IF(COLUMNS($F18:G18)>SUM(($A$2:$A$194=$E18)*($C$2:$C$194>=LARGE(IF($A$2:$A$194=$E18,$C$2:$C$194),$F$3))),\"\",INDEX($B$2:$B$194,SMALL(IF($A$2:$A$194=$E18,IF($C$2:$C$194=LARGE(IF($A$2:$A$194=$E18,$C$2:$C$194),COLUMNS($F18:G18)),ROW($B$2:$B$194)-ROW($B$2)+1)),SUM(1*(LARGE(IF($A$2:$A$194=$E18,$C$2:$C$194),ROW(INDIRECT(\"1:\"&COLUMNS($F18:G18))))=LARGE(IF($A$2:$A$194=$E18,$C$2:$C$194),COLUMNS($F18:G18)))))))","v":"Acct 8666"},{"$f":"IF(COLUMNS($F18:H18)>SUM(($A$2:$A$194=$E18)*($C$2:$C$194>=LARGE(IF($A$2:$A$194=$E18,$C$2:$C$194),$F$3))),\"\",INDEX($B$2:$B$194,SMALL(IF($A$2:$A$194=$E18,IF($C$2:$C$194=LARGE(IF($A$2:$A$194=$E18,$C$2:$C$194),COLUMNS($F18:H18)),ROW($B$2:$B$194)-ROW($B$2)+1)),SUM(1*(LARGE(IF($A$2:$A$194=$E18,$C$2:$C$194),ROW(INDIRECT(\"1:\"&COLUMNS($F18:H18))))=LARGE(IF($A$2:$A$194=$E18,$C$2:$C$194),COLUMNS($F18:H18)))))))","v":"Acct 5486"},{"$f":"IF(COLUMNS($F18:I18)>SUM(($A$2:$A$194=$E18)*($C$2:$C$194>=LARGE(IF($A$2:$A$194=$E18,$C$2:$C$194),$F$3))),\"\",INDEX($B$2:$B$194,SMALL(IF($A$2:$A$194=$E18,IF($C$2:$C$194=LARGE(IF($A$2:$A$194=$E18,$C$2:$C$194),COLUMNS($F18:I18)),ROW($B$2:$B$194)-ROW($B$2)+1)),SUM(1*(LARGE(IF($A$2:$A$194=$E18,$C$2:$C$194),ROW(INDIRECT(\"1:\"&COLUMNS($F18:I18))))=LARGE(IF($A$2:$A$194=$E18,$C$2:$C$194),COLUMNS($F18:I18)))))))","v":""}]
["D","Acct 4816",26444.325750543539,null,"N",{"$f":"IFERROR(INDEX($B$2:$B$194,MATCH(LARGE(IF($A$2:$A$194=$E19,IF($C$2:$C$194>=LARGE(IF($A$2:$A$194=$E19,$C$2:$C$194),$F$3),$C$2:$C$194/(ROW($C$2:$C$194)/10000))),COLUMNS($F19:F19)),$C$2:$C$194/(ROW($C$2:$C$194)/10000),0)),\"\")","v":"Acct 7568"},{"$f":"IFERROR(INDEX($B$2:$B$194,MATCH(LARGE(IF($A$2:$A$194=$E19,IF($C$2:$C$194>=LARGE(IF($A$2:$A$194=$E19,$C$2:$C$194),$F$3),$C$2:$C$194/(ROW($C$2:$C$194)/10000))),COLUMNS($F19:G19)),$C$2:$C$194/(ROW($C$2:$C$194)/10000),0)),\"\")","v":"Acct 1881"},{"$f":"IFERROR(INDEX($B$2:$B$194,MATCH(LARGE(IF($A$2:$A$194=$E19,IF($C$2:$C$194>=LARGE(IF($A$2:$A$194=$E19,$C$2:$C$194),$F$3),$C$2:$C$194/(ROW($C$2:$C$194)/10000))),COLUMNS($F19:H19)),$C$2:$C$194/(ROW($C$2:$C$194)/10000),0)),\"\")","v":"Acct 2572"},{"$f":"IFERROR(INDEX($B$2:$B$194,MATCH(LARGE(IF($A$2:$A$194=$E19,IF($C$2:$C$194>=LARGE(IF($A$2:$A$194=$E19,$C$2:$C$194),$F$3),$C$2:$C$194/(ROW($C$2:$C$194)/10000))),COLUMNS($F19:I19)),$C$2:$C$194/(ROW($C$2:$C$194)/10000),0)),\"\")","v":""},null,null,{"$f":"IF(COLUMNS($F19:F19)>SUM(($A$2:$A$194=$E19)*($C$2:$C$194>=LARGE(IF($A$2:$A$194=$E19,$C$2:$C$194),$F$3))),\"\",INDEX($B$2:$B$194,SMALL(IF($A$2:$A$194=$E19,IF($C$2:$C$194=LARGE(IF($A$2:$A$194=$E19,$C$2:$C$194),COLUMNS($F19:F19)),ROW($B$2:$B$194)-ROW($B$2)+1)),SUM(1*(LARGE(IF($A$2:$A$194=$E19,$C$2:$C$194),ROW(INDIRECT(\"1:\"&COLUMNS($F19:F19))))=LARGE(IF($A$2:$A$194=$E19,$C$2:$C$194),COLUMNS($F19:F19)))))))","v":"Acct 7568"},{"$f":"IF(COLUMNS($F19:G19)>SUM(($A$2:$A$194=$E19)*($C$2:$C$194>=LARGE(IF($A$2:$A$194=$E19,$C$2:$C$194),$F$3))),\"\",INDEX($B$2:$B$194,SMALL(IF($A$2:$A$194=$E19,IF($C$2:$C$194=LARGE(IF($A$2:$A$194=$E19,$C$2:$C$194),COLUMNS($F19:G19)),ROW($B$2:$B$194)-ROW($B$2)+1)),SUM(1*(LARGE(IF($A$2:$A$194=$E19,$C$2:$C$194),ROW(INDIRECT(\"1:\"&COLUMNS($F19:G19))))=LARGE(IF($A$2:$A$194=$E19,$C$2:$C$194),COLUMNS($F19:G19)))))))","v":"Acct 1881"},{"$f":"IF(COLUMNS($F19:H19)>SUM(($A$2:$A$194=$E19)*($C$2:$C$194>=LARGE(IF($A$2:$A$194=$E19,$C$2:$C$194),$F$3))),\"\",INDEX($B$2:$B$194,SMALL(IF($A$2:$A$194=$E19,IF($C$2:$C$194=LARGE(IF($A$2:$A$194=$E19,$C$2:$C$194),COLUMNS($F19:H19)),ROW($B$2:$B$194)-ROW($B$2)+1)),SUM(1*(LARGE(IF($A$2:$A$194=$E19,$C$2:$C$194),ROW(INDIRECT(\"1:\"&COLUMNS($F19:H19))))=LARGE(IF($A$2:$A$194=$E19,$C$2:$C$194),COLUMNS($F19:H19)))))))","v":"Acct 2572"},{"$f":"IF(COLUMNS($F19:I19)>SUM(($A$2:$A$194=$E19)*($C$2:$C$194>=LARGE(IF($A$2:$A$194=$E19,$C$2:$C$194),$F$3))),\"\",INDEX($B$2:$B$194,SMALL(IF($A$2:$A$194=$E19,IF($C$2:$C$194=LARGE(IF($A$2:$A$194=$E19,$C$2:$C$194),COLUMNS($F19:I19)),ROW($B$2:$B$194)-ROW($B$2)+1)),SUM(1*(LARGE(IF($A$2:$A$194=$E19,$C$2:$C$194),ROW(INDIRECT(\"1:\"&COLUMNS($F19:I19))))=LARGE(IF($A$2:$A$194=$E19,$C$2:$C$194),COLUMNS($F19:I19)))))))","v":""}]
["E","Acct 3149",72092.199651957693,null,"O",{"$f":"IFERROR(INDEX($B$2:$B$194,MATCH(LARGE(IF($A$2:$A$194=$E20,IF($C$2:$C$194>=LARGE(IF($A$2:$A$194=$E20,$C$2:$C$194),$F$3),$C$2:$C$194/(ROW($C$2:$C$194)/10000))),COLUMNS($F20:F20)),$C$2:$C$194/(ROW($C$2:$C$194)/10000),0)),\"\")","v":"Acct 2274"},{"$f":"IFERROR(INDEX($B$2:$B$194,MATCH(LARGE(IF($A$2:$A$194=$E20,IF($C$2:$C$194>=LARGE(IF($A$2:$A$194=$E20,$C$2:$C$194),$F$3),$C$2:$C$194/(ROW($C$2:$C$194)/10000))),COLUMNS($F20:G20)),$C$2:$C$194/(ROW($C$2:$C$194)/10000),0)),\"\")","v":"Acct 4857"},{"$f":"IFERROR(INDEX($B$2:$B$194,MATCH(LARGE(IF($A$2:$A$194=$E20,IF($C$2:$C$194>=LARGE(IF($A$2:$A$194=$E20,$C$2:$C$194),$F$3),$C$2:$C$194/(ROW($C$2:$C$194)/10000))),COLUMNS($F20:H20)),$C$2:$C$194/(ROW($C$2:$C$194)/10000),0)),\"\")","v":"Acct 3449"},{"$f":"IFERROR(INDEX($B$2:$B$194,MATCH(LARGE(IF($A$2:$A$194=$E20,IF($C$2:$C$194>=LARGE(IF($A$2:$A$194=$E20,$C$2:$C$194),$F$3),$C$2:$C$194/(ROW($C$2:$C$194)/10000))),COLUMNS($F20:I20)),$C$2:$C$194/(ROW($C$2:$C$194)/10000),0)),\"\")","v":""},null,null,{"$f":"IF(COLUMNS($F20:F20)>SUM(($A$2:$A$194=$E20)*($C$2:$C$194>=LARGE(IF($A$2:$A$194=$E20,$C$2:$C$194),$F$3))),\"\",INDEX($B$2:$B$194,SMALL(IF($A$2:$A$194=$E20,IF($C$2:$C$194=LARGE(IF($A$2:$A$194=$E20,$C$2:$C$194),COLUMNS($F20:F20)),ROW($B$2:$B$194)-ROW($B$2)+1)),SUM(1*(LARGE(IF($A$2:$A$194=$E20,$C$2:$C$194),ROW(INDIRECT(\"1:\"&COLUMNS($F20:F20))))=LARGE(IF($A$2:$A$194=$E20,$C$2:$C$194),COLUMNS($F20:F20)))))))","v":"Acct 2274"},{"$f":"IF(COLUMNS($F20:G20)>SUM(($A$2:$A$194=$E20)*($C$2:$C$194>=LARGE(IF($A$2:$A$194=$E20,$C$2:$C$194),$F$3))),\"\",INDEX($B$2:$B$194,SMALL(IF($A$2:$A$194=$E20,IF($C$2:$C$194=LARGE(IF($A$2:$A$194=$E20,$C$2:$C$194),COLUMNS($F20:G20)),ROW($B$2:$B$194)-ROW($B$2)+1)),SUM(1*(LARGE(IF($A$2:$A$194=$E20,$C$2:$C$194),ROW(INDIRECT(\"1:\"&COLUMNS($F20:G20))))=LARGE(IF($A$2:$A$194=$E20,$C$2:$C$194),COLUMNS($F20:G20)))))))","v":"Acct 4857"},{"$f":"IF(COLUMNS($F20:H20)>SUM(($A$2:$A$194=$E20)*($C$2:$C$194>=LARGE(IF($A$2:$A$194=$E20,$C$2:$C$194),$F$3))),\"\",INDEX($B$2:$B$194,SMALL(IF($A$2:$A$194=$E20,IF($C$2:$C$194=LARGE(IF($A$2:$A$194=$E20,$C$2:$C$194),COLUMNS($F20:H20)),ROW($B$2:$B$194)-ROW($B$2)+1)),SUM(1*(LARGE(IF($A$2:$A$194=$E20,$C$2:$C$194),ROW(INDIRECT(\"1:\"&COLUMNS($F20:H20))))=LARGE(IF($A$2:$A$194=$E20,$C$2:$C$194),COLUMNS($F20:H20)))))))","v":"Acct 3449"},{"$f":"IF(COLUMNS($F20:I20)>SUM(($A$2:$A$194=$E20)*($C$2:$C$194>=LARGE(IF($A$2:$A$194=$E20,$C$2:$C$194),$F$3))),\"\",INDEX($B$2:$B$194,SMALL(IF($A$2:$A$194=$E20,IF($C$2:$C$194=LARGE(IF($A$2:$A$194=$E20,$C$2:$C$194),COLUMNS($F20:I20)),ROW($B$2:$B$194)-ROW($B$2)+1)),SUM(1*(LARGE(IF($A$2:$A$194=$E20,$C$2:$C$194),ROW(INDIRECT(\"1:\"&COLUMNS($F20:I20))))=LARGE(IF($A$2:$A$194=$E20,$C$2:$C$194),COLUMNS($F20:I20)))))))","v":""}]
["E","Acct 7662",65470.184284119059,null,"P",{"$f":"IFERROR(INDEX($B$2:$B$194,MATCH(LARGE(IF($A$2:$A$194=$E21,IF($C$2:$C$194>=LARGE(IF($A$2:$A$194=$E21,$C$2:$C$194),$F$3),$C$2:$C$194/(ROW($C$2:$C$194)/10000))),COLUMNS($F21:F21)),$C$2:$C$194/(ROW($C$2:$C$194)/10000),0)),\"\")","v":"Acct 7506"},{"$f":"IFERROR(INDEX($B$2:$B$194,MATCH(LARGE(IF($A$2:$A$194=$E21,IF($C$2:$C$194>=LARGE(IF($A$2:$A$194=$E21,$C$2:$C$194),$F$3),$C$2:$C$194/(ROW($C$2:$C$194)/10000))),COLUMNS($F21:G21)),$C$2:$C$194/(ROW($C$2:$C$194)/10000),0)),\"\")","v":"Acct 8246"},{"$f":"IFERROR(INDEX($B$2:$B$194,MATCH(LARGE(IF($A$2:$A$194=$E21,IF($C$2:$C$194>=LARGE(IF($A$2:$A$194=$E21,$C$2:$C$194),$F$3),$C$2:$C$194/(ROW($C$2:$C$194)/10000))),COLUMNS($F21:H21)),$C$2:$C$194/(ROW($C$2:$C$194)/10000),0)),\"\")","v":"Acct 7863"},{"$f":"IFERROR(INDEX($B$2:$B$194,MATCH(LARGE(IF($A$2:$A$194=$E21,IF($C$2:$C$194>=LARGE(IF($A$2:$A$194=$E21,$C$2:$C$194),$F$3),$C$2:$C$194/(ROW($C$2:$C$194)/10000))),COLUMNS($F21:I21)),$C$2:$C$194/(ROW($C$2:$C$194)/10000),0)),\"\")","v":""},null,null,{"$f":"IF(COLUMNS($F21:F21)>SUM(($A$2:$A$194=$E21)*($C$2:$C$194>=LARGE(IF($A$2:$A$194=$E21,$C$2:$C$194),$F$3))),\"\",INDEX($B$2:$B$194,SMALL(IF($A$2:$A$194=$E21,IF($C$2:$C$194=LARGE(IF($A$2:$A$194=$E21,$C$2:$C$194),COLUMNS($F21:F21)),ROW($B$2:$B$194)-ROW($B$2)+1)),SUM(1*(LARGE(IF($A$2:$A$194=$E21,$C$2:$C$194),ROW(INDIRECT(\"1:\"&COLUMNS($F21:F21))))=LARGE(IF($A$2:$A$194=$E21,$C$2:$C$194),COLUMNS($F21:F21)))))))","v":"Acct 7506"},{"$f":"IF(COLUMNS($F21:G21)>SUM(($A$2:$A$194=$E21)*($C$2:$C$194>=LARGE(IF($A$2:$A$194=$E21,$C$2:$C$194),$F$3))),\"\",INDEX($B$2:$B$194,SMALL(IF($A$2:$A$194=$E21,IF($C$2:$C$194=LARGE(IF($A$2:$A$194=$E21,$C$2:$C$194),COLUMNS($F21:G21)),ROW($B$2:$B$194)-ROW($B$2)+1)),SUM(1*(LARGE(IF($A$2:$A$194=$E21,$C$2:$C$194),ROW(INDIRECT(\"1:\"&COLUMNS($F21:G21))))=LARGE(IF($A$2:$A$194=$E21,$C$2:$C$194),COLUMNS($F21:G21)))))))","v":"Acct 8246"},{"$f":"IF(COLUMNS($F21:H21)>SUM(($A$2:$A$194=$E21)*($C$2:$C$194>=LARGE(IF($A$2:$A$194=$E21,$C$2:$C$194),$F$3))),\"\",INDEX($B$2:$B$194,SMALL(IF($A$2:$A$194=$E21,IF($C$2:$C$194=LARGE(IF($A$2:$A$194=$E21,$C$2:$C$194),COLUMNS($F21:H21)),ROW($B$2:$B$194)-ROW($B$2)+1)),SUM(1*(LARGE(IF($A$2:$A$194=$E21,$C$2:$C$194),ROW(INDIRECT(\"1:\"&COLUMNS($F21:H21))))=LARGE(IF($A$2:$A$194=$E21,$C$2:$C$194),COLUMNS($F21:H21)))))))","v":"Acct 7863"},{"$f":"IF(COLUMNS($F21:I21)>SUM(($A$2:$A$194=$E21)*($C$2:$C$194>=LARGE(IF($A$2:$A$194=$E21,$C$2:$C$194),$F$3))),\"\",INDEX($B$2:$B$194,SMALL(IF($A$2:$A$194=$E21,IF($C$2:$C$194=LARGE(IF($A$2:$A$194=$E21,$C$2:$C$194),COLUMNS($F21:I21)),ROW($B$2:$B$194)-ROW($B$2)+1)),SUM(1*(LARGE(IF($A$2:$A$194=$E21,$C$2:$C$194),ROW(INDIRECT(\"1:\"&COLUMNS($F21:I21))))=LARGE(IF($A$2:$A$194=$E21,$C$2:$C$194),COLUMNS($F21:I21)))))))","v":""}]
["E","Acct 4289",64944.26296356738,null,"Q",{"$f":"IFERROR(INDEX($B$2:$B$194,MATCH(LARGE(IF($A$2:$A$194=$E22,IF($C$2:$C$194>=LARGE(IF($A$2:$A$194=$E22,$C$2:$C$194),$F$3),$C$2:$C$194/(ROW($C$2:$C$194)/10000))),COLUMNS($F22:F22)),$C$2:$C$194/(ROW($C$2:$C$194)/10000),0)),\"\")","v":"Acct 3599"},{"$f":"IFERROR(INDEX($B$2:$B$194,MATCH(LARGE(IF($A$2:$A$194=$E22,IF($C$2:$C$194>=LARGE(IF($A$2:$A$194=$E22,$C$2:$C$194),$F$3),$C$2:$C$194/(ROW($C$2:$C$194)/10000))),COLUMNS($F22:G22)),$C$2:$C$194/(ROW($C$2:$C$194)/10000),0)),\"\")","v":"Acct 1289"},{"$f":"IFERROR(INDEX($B$2:$B$194,MATCH(LARGE(IF($A$2:$A$194=$E22,IF($C$2:$C$194>=LARGE(IF($A$2:$A$194=$E22,$C$2:$C$194),$F$3),$C$2:$C$194/(ROW($C$2:$C$194)/10000))),COLUMNS($F22:H22)),$C$2:$C$194/(ROW($C$2:$C$194)/10000),0)),\"\")","v":"Acct 3068"},{"$f":"IFERROR(INDEX($B$2:$B$194,MATCH(LARGE(IF($A$2:$A$194=$E22,IF($C$2:$C$194>=LARGE(IF($A$2:$A$194=$E22,$C$2:$C$194),$F$3),$C$2:$C$194/(ROW($C$2:$C$194)/10000))),COLUMNS($F22:I22)),$C$2:$C$194/(ROW($C$2:$C$194)/10000),0)),\"\")","v":""},null,null,{"$f":"IF(COLUMNS($F22:F22)>SUM(($A$2:$A$194=$E22)*($C$2:$C$194>=LARGE(IF($A$2:$A$194=$E22,$C$2:$C$194),$F$3))),\"\",INDEX($B$2:$B$194,SMALL(IF($A$2:$A$194=$E22,IF($C$2:$C$194=LARGE(IF($A$2:$A$194=$E22,$C$2:$C$194),COLUMNS($F22:F22)),ROW($B$2:$B$194)-ROW($B$2)+1)),SUM(1*(LARGE(IF($A$2:$A$194=$E22,$C$2:$C$194),ROW(INDIRECT(\"1:\"&COLUMNS($F22:F22))))=LARGE(IF($A$2:$A$194=$E22,$C$2:$C$194),COLUMNS($F22:F22)))))))","v":"Acct 3599"},{"$f":"IF(COLUMNS($F22:G22)>SUM(($A$2:$A$194=$E22)*($C$2:$C$194>=LARGE(IF($A$2:$A$194=$E22,$C$2:$C$194),$F$3))),\"\",INDEX($B$2:$B$194,SMALL(IF($A$2:$A$194=$E22,IF($C$2:$C$194=LARGE(IF($A$2:$A$194=$E22,$C$2:$C$194),COLUMNS($F22:G22)),ROW($B$2:$B$194)-ROW($B$2)+1)),SUM(1*(LARGE(IF($A$2:$A$194=$E22,$C$2:$C$194),ROW(INDIRECT(\"1:\"&COLUMNS($F22:G22))))=LARGE(IF($A$2:$A$194=$E22,$C$2:$C$194),COLUMNS($F22:G22)))))))","v":"Acct 1289"},{"$f":"IF(COLUMNS($F22:H22)>SUM(($A$2:$A$194=$E22)*($C$2:$C$194>=LARGE(IF($A$2:$A$194=$E22,$C$2:$C$194),$F$3))),\"\",INDEX($B$2:$B$194,SMALL(IF($A$2:$A$194=$E22,IF($C$2:$C$194=LARGE(IF($A$2:$A$194=$E22,$C$2:$C$194),COLUMNS($F22:H22)),ROW($B$2:$B$194)-ROW($B$2)+1)),SUM(1*(LARGE(IF($A$2:$A$194=$E22,$C$2:$C$194),ROW(INDIRECT(\"1:\"&COLUMNS($F22:H22))))=LARGE(IF($A$2:$A$194=$E22,$C$2:$C$194),COLUMNS($F22:H22)))))))","v":"Acct 3068"},{"$f":"IF(COLUMNS($F22:I22)>SUM(($A$2:$A$194=$E22)*($C$2:$C$194>=LARGE(IF($A$2:$A$194=$E22,$C$2:$C$194),$F$3))),\"\",INDEX($B$2:$B$194,SMALL(IF($A$2:$A$194=$E22,IF($C$2:$C$194=LARGE(IF($A$2:$A$194=$E22,$C$2:$C$194),COLUMNS($F22:I22)),ROW($B$2:$B$194)-ROW($B$2)+1)),SUM(1*(LARGE(IF($A$2:$A$194=$E22,$C$2:$C$194),ROW(INDIRECT(\"1:\"&COLUMNS($F22:I22))))=LARGE(IF($A$2:$A$194=$E22,$C$2:$C$194),COLUMNS($F22:I22)))))))","v":""}]
["E","Acct 7792",62998.694120045839,null,"R",{"$f":"IFERROR(INDEX($B$2:$B$194,MATCH(LARGE(IF($A$2:$A$194=$E23,IF($C$2:$C$194>=LARGE(IF($A$2:$A$194=$E23,$C$2:$C$194),$F$3),$C$2:$C$194/(ROW($C$2:$C$194)/10000))),COLUMNS($F23:F23)),$C$2:$C$194/(ROW($C$2:$C$194)/10000),0)),\"\")","v":"Acct 4164"},{"$f":"IFERROR(INDEX($B$2:$B$194,MATCH(LARGE(IF($A$2:$A$194=$E23,IF($C$2:$C$194>=LARGE(IF($A$2:$A$194=$E23,$C$2:$C$194),$F$3),$C$2:$C$194/(ROW($C$2:$C$194)/10000))),COLUMNS($F23:G23)),$C$2:$C$194/(ROW($C$2:$C$194)/10000),0)),\"\")","v":"Acct 7397"},{"$f":"IFERROR(INDEX($B$2:$B$194,MATCH(LARGE(IF($A$2:$A$194=$E23,IF($C$2:$C$194>=LARGE(IF($A$2:$A$194=$E23,$C$2:$C$194),$F$3),$C$2:$C$194/(ROW($C$2:$C$194)/10000))),COLUMNS($F23:H23)),$C$2:$C$194/(ROW($C$2:$C$194)/10000),0)),\"\")","v":"Acct 6023"},{"$f":"IFERROR(INDEX($B$2:$B$194,MATCH(LARGE(IF($A$2:$A$194=$E23,IF($C$2:$C$194>=LARGE(IF($A$2:$A$194=$E23,$C$2:$C$194),$F$3),$C$2:$C$194/(ROW($C$2:$C$194)/10000))),COLUMNS($F23:I23)),$C$2:$C$194/(ROW($C$2:$C$194)/10000),0)),\"\")","v":""},null,null,{"$f":"IF(COLUMNS($F23:F23)>SUM(($A$2:$A$194=$E23)*($C$2:$C$194>=LARGE(IF($A$2:$A$194=$E23,$C$2:$C$194),$F$3))),\"\",INDEX($B$2:$B$194,SMALL(IF($A$2:$A$194=$E23,IF($C$2:$C$194=LARGE(IF($A$2:$A$194=$E23,$C$2:$C$194),COLUMNS($F23:F23)),ROW($B$2:$B$194)-ROW($B$2)+1)),SUM(1*(LARGE(IF($A$2:$A$194=$E23,$C$2:$C$194),ROW(INDIRECT(\"1:\"&COLUMNS($F23:F23))))=LARGE(IF($A$2:$A$194=$E23,$C$2:$C$194),COLUMNS($F23:F23)))))))","v":"Acct 4164"},{"$f":"IF(COLUMNS($F23:G23)>SUM(($A$2:$A$194=$E23)*($C$2:$C$194>=LARGE(IF($A$2:$A$194=$E23,$C$2:$C$194),$F$3))),\"\",INDEX($B$2:$B$194,SMALL(IF($A$2:$A$194=$E23,IF($C$2:$C$194=LARGE(IF($A$2:$A$194=$E23,$C$2:$C$194),COLUMNS($F23:G23)),ROW($B$2:$B$194)-ROW($B$2)+1)),SUM(1*(LARGE(IF($A$2:$A$194=$E23,$C$2:$C$194),ROW(INDIRECT(\"1:\"&COLUMNS($F23:G23))))=LARGE(IF($A$2:$A$194=$E23,$C$2:$C$194),COLUMNS($F23:G23)))))))","v":"Acct 7397"},{"$f":"IF(COLUMNS($F23:H23)>SUM(($A$2:$A$194=$E23)*($C$2:$C$194>=LARGE(IF($A$2:$A$194=$E23,$C$2:$C$194),$F$3))),\"\",INDEX($B$2:$B$194,SMALL(IF($A$2:$A$194=$E23,IF($C$2:$C$194=LARGE(IF($A$2:$A$194=$E23,$C$2:$C$194),COLUMNS($F23:H23)),ROW($B$2:$B$194)-ROW($B$2)+1)),SUM(1*(LARGE(IF($A$2:$A$194=$E23,$C$2:$C$194),ROW(INDIRECT(\"1:\"&COLUMNS($F23:H23))))=LARGE(IF($A$2:$A$194=$E23,$C$2:$C$194),COLUMNS($F23:H23)))))))","v":"Acct 6023"},{"$f":"IF(COLUMNS($F23:I23)>SUM(($A$2:$A$194=$E23)*($C$2:$C$194>=LARGE(IF($A$2:$A$194=$E23,$C$2:$C$194),$F$3))),\"\",INDEX($B$2:$B$194,SMALL(IF($A$2:$A$194=$E23,IF($C$2:$C$194=LARGE(IF($A$2:$A$194=$E23,$C$2:$C$194),COLUMNS($F23:I23)),ROW($B$2:$B$194)-ROW($B$2)+1)),SUM(1*(LARGE(IF($A$2:$A$194=$E23,$C$2:$C$194),ROW(INDIRECT(\"1:\"&COLUMNS($F23:I23))))=LARGE(IF($A$2:$A$194=$E23,$C$2:$C$194),COLUMNS($F23:I23)))))))","v":""}]
["E","Acct 5617",62734.08329937575,null,"S",{"$f":"IFERROR(INDEX($B$2:$B$194,MATCH(LARGE(IF($A$2:$A$194=$E24,IF($C$2:$C$194>=LARGE(IF($A$2:$A$194=$E24,$C$2:$C$194),$F$3),$C$2:$C$194/(ROW($C$2:$C$194)/10000))),COLUMNS($F24:F24)),$C$2:$C$194/(ROW($C$2:$C$194)/10000),0)),\"\")","v":"Acct 2814"},{"$f":"IFERROR(INDEX($B$2:$B$194,MATCH(LARGE(IF($A$2:$A$194=$E24,IF($C$2:$C$194>=LARGE(IF($A$2:$A$194=$E24,$C$2:$C$194),$F$3),$C$2:$C$194/(ROW($C$2:$C$194)/10000))),COLUMNS($F24:G24)),$C$2:$C$194/(ROW($C$2:$C$194)/10000),0)),\"\")","v":"Acct 4150"},{"$f":"IFERROR(INDEX($B$2:$B$194,MATCH(LARGE(IF($A$2:$A$194=$E24,IF($C$2:$C$194>=LARGE(IF($A$2:$A$194=$E24,$C$2:$C$194),$F$3),$C$2:$C$194/(ROW($C$2:$C$194)/10000))),COLUMNS($F24:H24)),$C$2:$C$194/(ROW($C$2:$C$194)/10000),0)),\"\")","v":"Acct 8643"},{"$f":"IFERROR(INDEX($B$2:$B$194,MATCH(LARGE(IF($A$2:$A$194=$E24,IF($C$2:$C$194>=LARGE(IF($A$2:$A$194=$E24,$C$2:$C$194),$F$3),$C$2:$C$194/(ROW($C$2:$C$194)/10000))),COLUMNS($F24:I24)),$C$2:$C$194/(ROW($C$2:$C$194)/10000),0)),\"\")","v":""},null,null,{"$f":"IF(COLUMNS($F24:F24)>SUM(($A$2:$A$194=$E24)*($C$2:$C$194>=LARGE(IF($A$2:$A$194=$E24,$C$2:$C$194),$F$3))),\"\",INDEX($B$2:$B$194,SMALL(IF($A$2:$A$194=$E24,IF($C$2:$C$194=LARGE(IF($A$2:$A$194=$E24,$C$2:$C$194),COLUMNS($F24:F24)),ROW($B$2:$B$194)-ROW($B$2)+1)),SUM(1*(LARGE(IF($A$2:$A$194=$E24,$C$2:$C$194),ROW(INDIRECT(\"1:\"&COLUMNS($F24:F24))))=LARGE(IF($A$2:$A$194=$E24,$C$2:$C$194),COLUMNS($F24:F24)))))))","v":"Acct 2814"},{"$f":"IF(COLUMNS($F24:G24)>SUM(($A$2:$A$194=$E24)*($C$2:$C$194>=LARGE(IF($A$2:$A$194=$E24,$C$2:$C$194),$F$3))),\"\",INDEX($B$2:$B$194,SMALL(IF($A$2:$A$194=$E24,IF($C$2:$C$194=LARGE(IF($A$2:$A$194=$E24,$C$2:$C$194),COLUMNS($F24:G24)),ROW($B$2:$B$194)-ROW($B$2)+1)),SUM(1*(LARGE(IF($A$2:$A$194=$E24,$C$2:$C$194),ROW(INDIRECT(\"1:\"&COLUMNS($F24:G24))))=LARGE(IF($A$2:$A$194=$E24,$C$2:$C$194),COLUMNS($F24:G24)))))))","v":"Acct 4150"},{"$f":"IF(COLUMNS($F24:H24)>SUM(($A$2:$A$194=$E24)*($C$2:$C$194>=LARGE(IF($A$2:$A$194=$E24,$C$2:$C$194),$F$3))),\"\",INDEX($B$2:$B$194,SMALL(IF($A$2:$A$194=$E24,IF($C$2:$C$194=LARGE(IF($A$2:$A$194=$E24,$C$2:$C$194),COLUMNS($F24:H24)),ROW($B$2:$B$194)-ROW($B$2)+1)),SUM(1*(LARGE(IF($A$2:$A$194=$E24,$C$2:$C$194),ROW(INDIRECT(\"1:\"&COLUMNS($F24:H24))))=LARGE(IF($A$2:$A$194=$E24,$C$2:$C$194),COLUMNS($F24:H24)))))))","v":"Acct 8643"},{"$f":"IF(COLUMNS($F24:I24)>SUM(($A$2:$A$194=$E24)*($C$2:$C$194>=LARGE(IF($A$2:$A$194=$E24,$C$2:$C$194),$F$3))),\"\",INDEX($B$2:$B$194,SMALL(IF($A$2:$A$194=$E24,IF($C$2:$C$194=LARGE(IF($A$2:$A$194=$E24,$C$2:$C$194),COLUMNS($F24:I24)),ROW($B$2:$B$194)-ROW($B$2)+1)),SUM(1*(LARGE(IF($A$2:$A$194=$E24,$C$2:$C$194),ROW(INDIRECT(\"1:\"&COLUMNS($F24:I24))))=LARGE(IF($A$2:$A$194=$E24,$C$2:$C$194),COLUMNS($F24:I24)))))))","v":""}]
["E","Acct 7210",50013.311746072031,null,"T",{"$f":"IFERROR(INDEX($B$2:$B$194,MATCH(LARGE(IF($A$2:$A$194=$E25,IF($C$2:$C$194>=LARGE(IF($A$2:$A$194=$E25,$C$2:$C$194),$F$3),$C$2:$C$194/(ROW($C$2:$C$194)/10000))),COLUMNS($F25:F25)),$C$2:$C$194/(ROW($C$2:$C$194)/10000),0)),\"\")","v":"Acct 2211"},{"$f":"IFERROR(INDEX($B$2:$B$194,MATCH(LARGE(IF($A$2:$A$194=$E25,IF($C$2:$C$194>=LARGE(IF($A$2:$A$194=$E25,$C$2:$C$194),$F$3),$C$2:$C$194/(ROW($C$2:$C$194)/10000))),COLUMNS($F25:G25)),$C$2:$C$194/(ROW($C$2:$C$194)/10000),0)),\"\")","v":"Acct 7416"},{"$f":"IFERROR(INDEX($B$2:$B$194,MATCH(LARGE(IF($A$2:$A$194=$E25,IF($C$2:$C$194>=LARGE(IF($A$2:$A$194=$E25,$C$2:$C$194),$F$3),$C$2:$C$194/(ROW($C$2:$C$194)/10000))),COLUMNS($F25:H25)),$C$2:$C$194/(ROW($C$2:$C$194)/10000),0)),\"\")","v":"Acct 4526"},{"$f":"IFERROR(INDEX($B$2:$B$194,MATCH(LARGE(IF($A$2:$A$194=$E25,IF($C$2:$C$194>=LARGE(IF($A$2:$A$194=$E25,$C$2:$C$194),$F$3),$C$2:$C$194/(ROW($C$2:$C$194)/10000))),COLUMNS($F25:I25)),$C$2:$C$194/(ROW($C$2:$C$194)/10000),0)),\"\")","v":""},null,null,{"$f":"IF(COLUMNS($F25:F25)>SUM(($A$2:$A$194=$E25)*($C$2:$C$194>=LARGE(IF($A$2:$A$194=$E25,$C$2:$C$194),$F$3))),\"\",INDEX($B$2:$B$194,SMALL(IF($A$2:$A$194=$E25,IF($C$2:$C$194=LARGE(IF($A$2:$A$194=$E25,$C$2:$C$194),COLUMNS($F25:F25)),ROW($B$2:$B$194)-ROW($B$2)+1)),SUM(1*(LARGE(IF($A$2:$A$194=$E25,$C$2:$C$194),ROW(INDIRECT(\"1:\"&COLUMNS($F25:F25))))=LARGE(IF($A$2:$A$194=$E25,$C$2:$C$194),COLUMNS($F25:F25)))))))","v":"Acct 2211"},{"$f":"IF(COLUMNS($F25:G25)>SUM(($A$2:$A$194=$E25)*($C$2:$C$194>=LARGE(IF($A$2:$A$194=$E25,$C$2:$C$194),$F$3))),\"\",INDEX($B$2:$B$194,SMALL(IF($A$2:$A$194=$E25,IF($C$2:$C$194=LARGE(IF($A$2:$A$194=$E25,$C$2:$C$194),COLUMNS($F25:G25)),ROW($B$2:$B$194)-ROW($B$2)+1)),SUM(1*(LARGE(IF($A$2:$A$194=$E25,$C$2:$C$194),ROW(INDIRECT(\"1:\"&COLUMNS($F25:G25))))=LARGE(IF($A$2:$A$194=$E25,$C$2:$C$194),COLUMNS($F25:G25)))))))","v":"Acct 7416"},{"$f":"IF(COLUMNS($F25:H25)>SUM(($A$2:$A$194=$E25)*($C$2:$C$194>=LARGE(IF($A$2:$A$194=$E25,$C$2:$C$194),$F$3))),\"\",INDEX($B$2:$B$194,SMALL(IF($A$2:$A$194=$E25,IF($C$2:$C$194=LARGE(IF($A$2:$A$194=$E25,$C$2:$C$194),COLUMNS($F25:H25)),ROW($B$2:$B$194)-ROW($B$2)+1)),SUM(1*(LARGE(IF($A$2:$A$194=$E25,$C$2:$C$194),ROW(INDIRECT(\"1:\"&COLUMNS($F25:H25))))=LARGE(IF($A$2:$A$194=$E25,$C$2:$C$194),COLUMNS($F25:H25)))))))","v":"Acct 4526"},{"$f":"IF(COLUMNS($F25:I25)>SUM(($A$2:$A$194=$E25)*($C$2:$C$194>=LARGE(IF($A$2:$A$194=$E25,$C$2:$C$194),$F$3))),\"\",INDEX($B$2:$B$194,SMALL(IF($A$2:$A$194=$E25,IF($C$2:$C$194=LARGE(IF($A$2:$A$194=$E25,$C$2:$C$194),COLUMNS($F25:I25)),ROW($B$2:$B$194)-ROW($B$2)+1)),SUM(1*(LARGE(IF($A$2:$A$194=$E25,$C$2:$C$194),ROW(INDIRECT(\"1:\"&COLUMNS($F25:I25))))=LARGE(IF($A$2:$A$194=$E25,$C$2:$C$194),COLUMNS($F25:I25)))))))","v":""}]
["E","Acct 4341",39233.444282046439,null,"U",{"$f":"IFERROR(INDEX($B$2:$B$194,MATCH(LARGE(IF($A$2:$A$194=$E26,IF($C$2:$C$194>=LARGE(IF($A$2:$A$194=$E26,$C$2:$C$194),$F$3),$C$2:$C$194/(ROW($C$2:$C$194)/10000))),COLUMNS($F26:F26)),$C$2:$C$194/(ROW($C$2:$C$194)/10000),0)),\"\")","v":"Acct 6175"},{"$f":"IFERROR(INDEX($B$2:$B$194,MATCH(LARGE(IF($A$2:$A$194=$E26,IF($C$2:$C$194>=LARGE(IF($A$2:$A$194=$E26,$C$2:$C$194),$F$3),$C$2:$C$194/(ROW($C$2:$C$194)/10000))),COLUMNS($F26:G26)),$C$2:$C$194/(ROW($C$2:$C$194)/10000),0)),\"\")","v":"Acct 3099"},{"$f":"IFERROR(INDEX($B$2:$B$194,MATCH(LARGE(IF($A$2:$A$194=$E26,IF($C$2:$C$194>=LARGE(IF($A$2:$A$194=$E26,$C$2:$C$194),$F$3),$C$2:$C$194/(ROW($C$2:$C$194)/10000))),COLUMNS($F26:H26)),$C$2:$C$194/(ROW($C$2:$C$194)/10000),0)),\"\")","v":"Acct 3368"},{"$f":"IFERROR(INDEX($B$2:$B$194,MATCH(LARGE(IF($A$2:$A$194=$E26,IF($C$2:$C$194>=LARGE(IF($A$2:$A$194=$E26,$C$2:$C$194),$F$3),$C$2:$C$194/(ROW($C$2:$C$194)/10000))),COLUMNS($F26:I26)),$C$2:$C$194/(ROW($C$2:$C$194)/10000),0)),\"\")","v":""},null,null,{"$f":"IF(COLUMNS($F26:F26)>SUM(($A$2:$A$194=$E26)*($C$2:$C$194>=LARGE(IF($A$2:$A$194=$E26,$C$2:$C$194),$F$3))),\"\",INDEX($B$2:$B$194,SMALL(IF($A$2:$A$194=$E26,IF($C$2:$C$194=LARGE(IF($A$2:$A$194=$E26,$C$2:$C$194),COLUMNS($F26:F26)),ROW($B$2:$B$194)-ROW($B$2)+1)),SUM(1*(LARGE(IF($A$2:$A$194=$E26,$C$2:$C$194),ROW(INDIRECT(\"1:\"&COLUMNS($F26:F26))))=LARGE(IF($A$2:$A$194=$E26,$C$2:$C$194),COLUMNS($F26:F26)))))))","v":"Acct 6175"},{"$f":"IF(COLUMNS($F26:G26)>SUM(($A$2:$A$194=$E26)*($C$2:$C$194>=LARGE(IF($A$2:$A$194=$E26,$C$2:$C$194),$F$3))),\"\",INDEX($B$2:$B$194,SMALL(IF($A$2:$A$194=$E26,IF($C$2:$C$194=LARGE(IF($A$2:$A$194=$E26,$C$2:$C$194),COLUMNS($F26:G26)),ROW($B$2:$B$194)-ROW($B$2)+1)),SUM(1*(LARGE(IF($A$2:$A$194=$E26,$C$2:$C$194),ROW(INDIRECT(\"1:\"&COLUMNS($F26:G26))))=LARGE(IF($A$2:$A$194=$E26,$C$2:$C$194),COLUMNS($F26:G26)))))))","v":"Acct 3099"},{"$f":"IF(COLUMNS($F26:H26)>SUM(($A$2:$A$194=$E26)*($C$2:$C$194>=LARGE(IF($A$2:$A$194=$E26,$C$2:$C$194),$F$3))),\"\",INDEX($B$2:$B$194,SMALL(IF($A$2:$A$194=$E26,IF($C$2:$C$194=LARGE(IF($A$2:$A$194=$E26,$C$2:$C$194),COLUMNS($F26:H26)),ROW($B$2:$B$194)-ROW($B$2)+1)),SUM(1*(LARGE(IF($A$2:$A$194=$E26,$C$2:$C$194),ROW(INDIRECT(\"1:\"&COLUMNS($F26:H26))))=LARGE(IF($A$2:$A$194=$E26,$C$2:$C$194),COLUMNS($F26:H26)))))))","v":"Acct 3368"},{"$f":"IF(COLUMNS($F26:I26)>SUM(($A$2:$A$194=$E26)*($C$2:$C$194>=LARGE(IF($A$2:$A$194=$E26,$C$2:$C$194),$F$3))),\"\",INDEX($B$2:$B$194,SMALL(IF($A$2:$A$194=$E26,IF($C$2:$C$194=LARGE(IF($A$2:$A$194=$E26,$C$2:$C$194),COLUMNS($F26:I26)),ROW($B$2:$B$194)-ROW($B$2)+1)),SUM(1*(LARGE(IF($A$2:$A$194=$E26,$C$2:$C$194),ROW(INDIRECT(\"1:\"&COLUMNS($F26:I26))))=LARGE(IF($A$2:$A$194=$E26,$C$2:$C$194),COLUMNS($F26:I26)))))))","v":""}]
["E","Acct 6062",29832.458673877827,null,"V",{"$f":"IFERROR(INDEX($B$2:$B$194,MATCH(LARGE(IF($A$2:$A$194=$E27,IF($C$2:$C$194>=LARGE(IF($A$2:$A$194=$E27,$C$2:$C$194),$F$3),$C$2:$C$194/(ROW($C$2:$C$194)/10000))),COLUMNS($F27:F27)),$C$2:$C$194/(ROW($C$2:$C$194)/10000),0)),\"\")","v":"Acct 2893"},{"$f":"IFERROR(INDEX($B$2:$B$194,MATCH(LARGE(IF($A$2:$A$194=$E27,IF($C$2:$C$194>=LARGE(IF($A$2:$A$194=$E27,$C$2:$C$194),$F$3),$C$2:$C$194/(ROW($C$2:$C$194)/10000))),COLUMNS($F27:G27)),$C$2:$C$194/(ROW($C$2:$C$194)/10000),0)),\"\")","v":"Acct 6058"},{"$f":"IFERROR(INDEX($B$2:$B$194,MATCH(LARGE(IF($A$2:$A$194=$E27,IF($C$2:$C$194>=LARGE(IF($A$2:$A$194=$E27,$C$2:$C$194),$F$3),$C$2:$C$194/(ROW($C$2:$C$194)/10000))),COLUMNS($F27:H27)),$C$2:$C$194/(ROW($C$2:$C$194)/10000),0)),\"\")","v":"Acct 8919"},{"$f":"IFERROR(INDEX($B$2:$B$194,MATCH(LARGE(IF($A$2:$A$194=$E27,IF($C$2:$C$194>=LARGE(IF($A$2:$A$194=$E27,$C$2:$C$194),$F$3),$C$2:$C$194/(ROW($C$2:$C$194)/10000))),COLUMNS($F27:I27)),$C$2:$C$194/(ROW($C$2:$C$194)/10000),0)),\"\")","v":""},null,null,{"$f":"IF(COLUMNS($F27:F27)>SUM(($A$2:$A$194=$E27)*($C$2:$C$194>=LARGE(IF($A$2:$A$194=$E27,$C$2:$C$194),$F$3))),\"\",INDEX($B$2:$B$194,SMALL(IF($A$2:$A$194=$E27,IF($C$2:$C$194=LARGE(IF($A$2:$A$194=$E27,$C$2:$C$194),COLUMNS($F27:F27)),ROW($B$2:$B$194)-ROW($B$2)+1)),SUM(1*(LARGE(IF($A$2:$A$194=$E27,$C$2:$C$194),ROW(INDIRECT(\"1:\"&COLUMNS($F27:F27))))=LARGE(IF($A$2:$A$194=$E27,$C$2:$C$194),COLUMNS($F27:F27)))))))","v":"Acct 2893"},{"$f":"IF(COLUMNS($F27:G27)>SUM(($A$2:$A$194=$E27)*($C$2:$C$194>=LARGE(IF($A$2:$A$194=$E27,$C$2:$C$194),$F$3))),\"\",INDEX($B$2:$B$194,SMALL(IF($A$2:$A$194=$E27,IF($C$2:$C$194=LARGE(IF($A$2:$A$194=$E27,$C$2:$C$194),COLUMNS($F27:G27)),ROW($B$2:$B$194)-ROW($B$2)+1)),SUM(1*(LARGE(IF($A$2:$A$194=$E27,$C$2:$C$194),ROW(INDIRECT(\"1:\"&COLUMNS($F27:G27))))=LARGE(IF($A$2:$A$194=$E27,$C$2:$C$194),COLUMNS($F27:G27)))))))","v":"Acct 6058"},{"$f":"IF(COLUMNS($F27:H27)>SUM(($A$2:$A$194=$E27)*($C$2:$C$194>=LARGE(IF($A$2:$A$194=$E27,$C$2:$C$194),$F$3))),\"\",INDEX($B$2:$B$194,SMALL(IF($A$2:$A$194=$E27,IF($C$2:$C$194=LARGE(IF($A$2:$A$194=$E27,$C$2:$C$194),COLUMNS($F27:H27)),ROW($B$2:$B$194)-ROW($B$2)+1)),SUM(1*(LARGE(IF($A$2:$A$194=$E27,$C$2:$C$194),ROW(INDIRECT(\"1:\"&COLUMNS($F27:H27))))=LARGE(IF($A$2:$A$194=$E27,$C$2:$C$194),COLUMNS($F27:H27)))))))","v":"Acct 8919"},{"$f":"IF(COLUMNS($F27:I27)>SUM(($A$2:$A$194=$E27)*($C$2:$C$194>=LARGE(IF($A$2:$A$194=$E27,$C$2:$C$194),$F$3))),\"\",INDEX($B$2:$B$194,SMALL(IF($A$2:$A$194=$E27,IF($C$2:$C$194=LARGE(IF($A$2:$A$194=$E27,$C$2:$C$194),COLUMNS($F27:I27)),ROW($B$2:$B$194)-ROW($B$2)+1)),SUM(1*(LARGE(IF($A$2:$A$194=$E27,$C$2:$C$194),ROW(INDIRECT(\"1:\"&COLUMNS($F27:I27))))=LARGE(IF($A$2:$A$194=$E27,$C$2:$C$194),COLUMNS($F27:I27)))))))","v":""}]
["E","Acct 1364",17251.793375353474,null,"W",{"$f":"IFERROR(INDEX($B$2:$B$194,MATCH(LARGE(IF($A$2:$A$194=$E28,IF($C$2:$C$194>=LARGE(IF($A$2:$A$194=$E28,$C$2:$C$194),$F$3),$C$2:$C$194/(ROW($C$2:$C$194)/10000))),COLUMNS($F28:F28)),$C$2:$C$194/(ROW($C$2:$C$194)/10000),0)),\"\")","v":"Acct 5113"},{"$f":"IFERROR(INDEX($B$2:$B$194,MATCH(LARGE(IF($A$2:$A$194=$E28,IF($C$2:$C$194>=LARGE(IF($A$2:$A$194=$E28,$C$2:$C$194),$F$3),$C$2:$C$194/(ROW($C$2:$C$194)/10000))),COLUMNS($F28:G28)),$C$2:$C$194/(ROW($C$2:$C$194)/10000),0)),\"\")","v":"Acct 3607"},{"$f":"IFERROR(INDEX($B$2:$B$194,MATCH(LARGE(IF($A$2:$A$194=$E28,IF($C$2:$C$194>=LARGE(IF($A$2:$A$194=$E28,$C$2:$C$194),$F$3),$C$2:$C$194/(ROW($C$2:$C$194)/10000))),COLUMNS($F28:H28)),$C$2:$C$194/(ROW($C$2:$C$194)/10000),0)),\"\")","v":"Acct 5655"},{"$f":"IFERROR(INDEX($B$2:$B$194,MATCH(LARGE(IF($A$2:$A$194=$E28,IF($C$2:$C$194>=LARGE(IF($A$2:$A$194=$E28,$C$2:$C$194),$F$3),$C$2:$C$194/(ROW($C$2:$C$194)/10000))),COLUMNS($F28:I28)),$C$2:$C$194/(ROW($C$2:$C$194)/10000),0)),\"\")","v":""},null,null,{"$f":"IF(COLUMNS($F28:F28)>SUM(($A$2:$A$194=$E28)*($C$2:$C$194>=LARGE(IF($A$2:$A$194=$E28,$C$2:$C$194),$F$3))),\"\",INDEX($B$2:$B$194,SMALL(IF($A$2:$A$194=$E28,IF($C$2:$C$194=LARGE(IF($A$2:$A$194=$E28,$C$2:$C$194),COLUMNS($F28:F28)),ROW($B$2:$B$194)-ROW($B$2)+1)),SUM(1*(LARGE(IF($A$2:$A$194=$E28,$C$2:$C$194),ROW(INDIRECT(\"1:\"&COLUMNS($F28:F28))))=LARGE(IF($A$2:$A$194=$E28,$C$2:$C$194),COLUMNS($F28:F28)))))))","v":"Acct 5113"},{"$f":"IF(COLUMNS($F28:G28)>SUM(($A$2:$A$194=$E28)*($C$2:$C$194>=LARGE(IF($A$2:$A$194=$E28,$C$2:$C$194),$F$3))),\"\",INDEX($B$2:$B$194,SMALL(IF($A$2:$A$194=$E28,IF($C$2:$C$194=LARGE(IF($A$2:$A$194=$E28,$C$2:$C$194),COLUMNS($F28:G28)),ROW($B$2:$B$194)-ROW($B$2)+1)),SUM(1*(LARGE(IF($A$2:$A$194=$E28,$C$2:$C$194),ROW(INDIRECT(\"1:\"&COLUMNS($F28:G28))))=LARGE(IF($A$2:$A$194=$E28,$C$2:$C$194),COLUMNS($F28:G28)))))))","v":"Acct 3607"},{"$f":"IF(COLUMNS($F28:H28)>SUM(($A$2:$A$194=$E28)*($C$2:$C$194>=LARGE(IF($A$2:$A$194=$E28,$C$2:$C$194),$F$3))),\"\",INDEX($B$2:$B$194,SMALL(IF($A$2:$A$194=$E28,IF($C$2:$C$194=LARGE(IF($A$2:$A$194=$E28,$C$2:$C$194),COLUMNS($F28:H28)),ROW($B$2:$B$194)-ROW($B$2)+1)),SUM(1*(LARGE(IF($A$2:$A$194=$E28,$C$2:$C$194),ROW(INDIRECT(\"1:\"&COLUMNS($F28:H28))))=LARGE(IF($A$2:$A$194=$E28,$C$2:$C$194),COLUMNS($F28:H28)))))))","v":"Acct 5655"},{"$f":"IF(COLUMNS($F28:I28)>SUM(($A$2:$A$194=$E28)*($C$2:$C$194>=LARGE(IF($A$2:$A$194=$E28,$C$2:$C$194),$F$3))),\"\",INDEX($B$2:$B$194,SMALL(IF($A$2:$A$194=$E28,IF($C$2:$C$194=LARGE(IF($A$2:$A$194=$E28,$C$2:$C$194),COLUMNS($F28:I28)),ROW($B$2:$B$194)-ROW($B$2)+1)),SUM(1*(LARGE(IF($A$2:$A$194=$E28,$C$2:$C$194),ROW(INDIRECT(\"1:\"&COLUMNS($F28:I28))))=LARGE(IF($A$2:$A$194=$E28,$C$2:$C$194),COLUMNS($F28:I28)))))))","v":""}]
["E","Acct 5119",10396.892563135962,null,"X",{"$f":"IFERROR(INDEX($B$2:$B$194,MATCH(LARGE(IF($A$2:$A$194=$E29,IF($C$2:$C$194>=LARGE(IF($A$2:$A$194=$E29,$C$2:$C$194),$F$3),$C$2:$C$194/(ROW($C$2:$C$194)/10000))),COLUMNS($F29:F29)),$C$2:$C$194/(ROW($C$2:$C$194)/10000),0)),\"\")","v":"Acct 1468"},{"$f":"IFERROR(INDEX($B$2:$B$194,MATCH(LARGE(IF($A$2:$A$194=$E29,IF($C$2:$C$194>=LARGE(IF($A$2:$A$194=$E29,$C$2:$C$194),$F$3),$C$2:$C$194/(ROW($C$2:$C$194)/10000))),COLUMNS($F29:G29)),$C$2:$C$194/(ROW($C$2:$C$194)/10000),0)),\"\")","v":"Acct 8421"},{"$f":"IFERROR(INDEX($B$2:$B$194,MATCH(LARGE(IF($A$2:$A$194=$E29,IF($C$2:$C$194>=LARGE(IF($A$2:$A$194=$E29,$C$2:$C$194),$F$3),$C$2:$C$194/(ROW($C$2:$C$194)/10000))),COLUMNS($F29:H29)),$C$2:$C$194/(ROW($C$2:$C$194)/10000),0)),\"\")","v":"Acct 5176"},{"$f":"IFERROR(INDEX($B$2:$B$194,MATCH(LARGE(IF($A$2:$A$194=$E29,IF($C$2:$C$194>=LARGE(IF($A$2:$A$194=$E29,$C$2:$C$194),$F$3),$C$2:$C$194/(ROW($C$2:$C$194)/10000))),COLUMNS($F29:I29)),$C$2:$C$194/(ROW($C$2:$C$194)/10000),0)),\"\")","v":""},null,null,{"$f":"IF(COLUMNS($F29:F29)>SUM(($A$2:$A$194=$E29)*($C$2:$C$194>=LARGE(IF($A$2:$A$194=$E29,$C$2:$C$194),$F$3))),\"\",INDEX($B$2:$B$194,SMALL(IF($A$2:$A$194=$E29,IF($C$2:$C$194=LARGE(IF($A$2:$A$194=$E29,$C$2:$C$194),COLUMNS($F29:F29)),ROW($B$2:$B$194)-ROW($B$2)+1)),SUM(1*(LARGE(IF($A$2:$A$194=$E29,$C$2:$C$194),ROW(INDIRECT(\"1:\"&COLUMNS($F29:F29))))=LARGE(IF($A$2:$A$194=$E29,$C$2:$C$194),COLUMNS($F29:F29)))))))","v":"Acct 1468"},{"$f":"IF(COLUMNS($F29:G29)>SUM(($A$2:$A$194=$E29)*($C$2:$C$194>=LARGE(IF($A$2:$A$194=$E29,$C$2:$C$194),$F$3))),\"\",INDEX($B$2:$B$194,SMALL(IF($A$2:$A$194=$E29,IF($C$2:$C$194=LARGE(IF($A$2:$A$194=$E29,$C$2:$C$194),COLUMNS($F29:G29)),ROW($B$2:$B$194)-ROW($B$2)+1)),SUM(1*(LARGE(IF($A$2:$A$194=$E29,$C$2:$C$194),ROW(INDIRECT(\"1:\"&COLUMNS($F29:G29))))=LARGE(IF($A$2:$A$194=$E29,$C$2:$C$194),COLUMNS($F29:G29)))))))","v":"Acct 8421"},{"$f":"IF(COLUMNS($F29:H29)>SUM(($A$2:$A$194=$E29)*($C$2:$C$194>=LARGE(IF($A$2:$A$194=$E29,$C$2:$C$194),$F$3))),\"\",INDEX($B$2:$B$194,SMALL(IF($A$2:$A$194=$E29,IF($C$2:$C$194=LARGE(IF($A$2:$A$194=$E29,$C$2:$C$194),COLUMNS($F29:H29)),ROW($B$2:$B$194)-ROW($B$2)+1)),SUM(1*(LARGE(IF($A$2:$A$194=$E29,$C$2:$C$194),ROW(INDIRECT(\"1:\"&COLUMNS($F29:H29))))=LARGE(IF($A$2:$A$194=$E29,$C$2:$C$194),COLUMNS($F29:H29)))))))","v":"Acct 5176"},{"$f":"IF(COLUMNS($F29:I29)>SUM(($A$2:$A$194=$E29)*($C$2:$C$194>=LARGE(IF($A$2:$A$194=$E29,$C$2:$C$194),$F$3))),\"\",INDEX($B$2:$B$194,SMALL(IF($A$2:$A$194=$E29,IF($C$2:$C$194=LARGE(IF($A$2:$A$194=$E29,$C$2:$C$194),COLUMNS($F29:I29)),ROW($B$2:$B$194)-ROW($B$2)+1)),SUM(1*(LARGE(IF($A$2:$A$194=$E29,$C$2:$C$194),ROW(INDIRECT(\"1:\"&COLUMNS($F29:I29))))=LARGE(IF($A$2:$A$194=$E29,$C$2:$C$194),COLUMNS($F29:I29)))))))","v":""}]
["F","Acct 3626",83709.062277228455,null,"Y",{"$f":"IFERROR(INDEX($B$2:$B$194,MATCH(LARGE(IF($A$2:$A$194=$E30,IF($C$2:$C$194>=LARGE(IF($A$2:$A$194=$E30,$C$2:$C$194),$F$3),$C$2:$C$194/(ROW($C$2:$C$194)/10000))),COLUMNS($F30:F30)),$C$2:$C$194/(ROW($C$2:$C$194)/10000),0)),\"\")","v":"Acct 6120"},{"$f":"IFERROR(INDEX($B$2:$B$194,MATCH(LARGE(IF($A$2:$A$194=$E30,IF($C$2:$C$194>=LARGE(IF($A$2:$A$194=$E30,$C$2:$C$194),$F$3),$C$2:$C$194/(ROW($C$2:$C$194)/10000))),COLUMNS($F30:G30)),$C$2:$C$194/(ROW($C$2:$C$194)/10000),0)),\"\")","v":"Acct 8634"},{"$f":"IFERROR(INDEX($B$2:$B$194,MATCH(LARGE(IF($A$2:$A$194=$E30,IF($C$2:$C$194>=LARGE(IF($A$2:$A$194=$E30,$C$2:$C$194),$F$3),$C$2:$C$194/(ROW($C$2:$C$194)/10000))),COLUMNS($F30:H30)),$C$2:$C$194/(ROW($C$2:$C$194)/10000),0)),\"\")","v":"Acct 2377"},{"$f":"IFERROR(INDEX($B$2:$B$194,MATCH(LARGE(IF($A$2:$A$194=$E30,IF($C$2:$C$194>=LARGE(IF($A$2:$A$194=$E30,$C$2:$C$194),$F$3),$C$2:$C$194/(ROW($C$2:$C$194)/10000))),COLUMNS($F30:I30)),$C$2:$C$194/(ROW($C$2:$C$194)/10000),0)),\"\")","v":""},null,null,{"$f":"IF(COLUMNS($F30:F30)>SUM(($A$2:$A$194=$E30)*($C$2:$C$194>=LARGE(IF($A$2:$A$194=$E30,$C$2:$C$194),$F$3))),\"\",INDEX($B$2:$B$194,SMALL(IF($A$2:$A$194=$E30,IF($C$2:$C$194=LARGE(IF($A$2:$A$194=$E30,$C$2:$C$194),COLUMNS($F30:F30)),ROW($B$2:$B$194)-ROW($B$2)+1)),SUM(1*(LARGE(IF($A$2:$A$194=$E30,$C$2:$C$194),ROW(INDIRECT(\"1:\"&COLUMNS($F30:F30))))=LARGE(IF($A$2:$A$194=$E30,$C$2:$C$194),COLUMNS($F30:F30)))))))","v":"Acct 6120"},{"$f":"IF(COLUMNS($F30:G30)>SUM(($A$2:$A$194=$E30)*($C$2:$C$194>=LARGE(IF($A$2:$A$194=$E30,$C$2:$C$194),$F$3))),\"\",INDEX($B$2:$B$194,SMALL(IF($A$2:$A$194=$E30,IF($C$2:$C$194=LARGE(IF($A$2:$A$194=$E30,$C$2:$C$194),COLUMNS($F30:G30)),ROW($B$2:$B$194)-ROW($B$2)+1)),SUM(1*(LARGE(IF($A$2:$A$194=$E30,$C$2:$C$194),ROW(INDIRECT(\"1:\"&COLUMNS($F30:G30))))=LARGE(IF($A$2:$A$194=$E30,$C$2:$C$194),COLUMNS($F30:G30)))))))","v":"Acct 8634"},{"$f":"IF(COLUMNS($F30:H30)>SUM(($A$2:$A$194=$E30)*($C$2:$C$194>=LARGE(IF($A$2:$A$194=$E30,$C$2:$C$194),$F$3))),\"\",INDEX($B$2:$B$194,SMALL(IF($A$2:$A$194=$E30,IF($C$2:$C$194=LARGE(IF($A$2:$A$194=$E30,$C$2:$C$194),COLUMNS($F30:H30)),ROW($B$2:$B$194)-ROW($B$2)+1)),SUM(1*(LARGE(IF($A$2:$A$194=$E30,$C$2:$C$194),ROW(INDIRECT(\"1:\"&COLUMNS($F30:H30))))=LARGE(IF($A$2:$A$194=$E30,$C$2:$C$194),COLUMNS($F30:H30)))))))","v":"Acct 2377"},{"$f":"IF(COLUMNS($F30:I30)>SUM(($A$2:$A$194=$E30)*($C$2:$C$194>=LARGE(IF($A$2:$A$194=$E30,$C$2:$C$194),$F$3))),\"\",INDEX($B$2:$B$194,SMALL(IF($A$2:$A$194=$E30,IF($C$2:$C$194=LARGE(IF($A$2:$A$194=$E30,$C$2:$C$194),COLUMNS($F30:I30)),ROW($B$2:$B$194)-ROW($B$2)+1)),SUM(1*(LARGE(IF($A$2:$A$194=$E30,$C$2:$C$194),ROW(INDIRECT(\"1:\"&COLUMNS($F30:I30))))=LARGE(IF($A$2:$A$194=$E30,$C$2:$C$194),COLUMNS($F30:I30)))))))","v":""}]
["F","Acct 7853",67756.829240491483,null,"Z",{"$f":"IF(COLUMNS($F31:F31)>SUM(($A$2:$A$194=$E31)*($C$2:$C$194>=LARGE(IF($A$2:$A$194=$E31,$C$2:$C$194),$F$3))),\"\",INDEX($B$2:$B$194,SMALL(IF($A$2:$A$194=$E31,IF($C$2:$C$194=LARGE(IF($A$2:$A$194=$E31,$C$2:$C$194),COLUMNS($F31:F31)),ROW($B$2:$B$194)-ROW($B$2)+1)),SUM(1*(LARGE(IF($A$2:$A$194=$E31,$C$2:$C$194),ROW(INDIRECT(\"1:\"&COLUMNS($F31:F31))))=LARGE(IF($A$2:$A$194=$E31,$C$2:$C$194),COLUMNS($F31:F31)))))))","v":"Acct 7408"},{"$f":"IF(COLUMNS($F31:G31)>SUM(($A$2:$A$194=$E31)*($C$2:$C$194>=LARGE(IF($A$2:$A$194=$E31,$C$2:$C$194),$F$3))),\"\",INDEX($B$2:$B$194,SMALL(IF($A$2:$A$194=$E31,IF($C$2:$C$194=LARGE(IF($A$2:$A$194=$E31,$C$2:$C$194),COLUMNS($F31:G31)),ROW($B$2:$B$194)-ROW($B$2)+1)),SUM(1*(LARGE(IF($A$2:$A$194=$E31,$C$2:$C$194),ROW(INDIRECT(\"1:\"&COLUMNS($F31:G31))))=LARGE(IF($A$2:$A$194=$E31,$C$2:$C$194),COLUMNS($F31:G31)))))))","v":"Acct 2468"},{"$f":"IF(COLUMNS($F31:H31)>SUM(($A$2:$A$194=$E31)*($C$2:$C$194>=LARGE(IF($A$2:$A$194=$E31,$C$2:$C$194),$F$3))),\"\",INDEX($B$2:$B$194,SMALL(IF($A$2:$A$194=$E31,IF($C$2:$C$194=LARGE(IF($A$2:$A$194=$E31,$C$2:$C$194),COLUMNS($F31:H31)),ROW($B$2:$B$194)-ROW($B$2)+1)),SUM(1*(LARGE(IF($A$2:$A$194=$E31,$C$2:$C$194),ROW(INDIRECT(\"1:\"&COLUMNS($F31:H31))))=LARGE(IF($A$2:$A$194=$E31,$C$2:$C$194),COLUMNS($F31:H31)))))))","v":"Acct 6122"},{"$f":"IF(COLUMNS($F31:I31)>SUM(($A$2:$A$194=$E31)*($C$2:$C$194>=LARGE(IF($A$2:$A$194=$E31,$C$2:$C$194),$F$3))),\"\",INDEX($B$2:$B$194,SMALL(IF($A$2:$A$194=$E31,IF($C$2:$C$194=LARGE(IF($A$2:$A$194=$E31,$C$2:$C$194),COLUMNS($F31:I31)),ROW($B$2:$B$194)-ROW($B$2)+1)),SUM(1*(LARGE(IF($A$2:$A$194=$E31,$C$2:$C$194),ROW(INDIRECT(\"1:\"&COLUMNS($F31:I31))))=LARGE(IF($A$2:$A$194=$E31,$C$2:$C$194),COLUMNS($F31:I31)))))))","v":""},null,null,{"$f":"IF(COLUMNS($F31:F31)>SUM(($A$2:$A$194=$E31)*($C$2:$C$194>=LARGE(IF($A$2:$A$194=$E31,$C$2:$C$194),$F$3))),\"\",INDEX($B$2:$B$194,SMALL(IF($A$2:$A$194=$E31,IF($C$2:$C$194=LARGE(IF($A$2:$A$194=$E31,$C$2:$C$194),COLUMNS($F31:F31)),ROW($B$2:$B$194)-ROW($B$2)+1)),SUM(1*(LARGE(IF($A$2:$A$194=$E31,$C$2:$C$194),ROW(INDIRECT(\"1:\"&COLUMNS($F31:F31))))=LARGE(IF($A$2:$A$194=$E31,$C$2:$C$194),COLUMNS($F31:F31)))))))","v":"Acct 7408"},{"$f":"IF(COLUMNS($F31:G31)>SUM(($A$2:$A$194=$E31)*($C$2:$C$194>=LARGE(IF($A$2:$A$194=$E31,$C$2:$C$194),$F$3))),\"\",INDEX($B$2:$B$194,SMALL(IF($A$2:$A$194=$E31,IF($C$2:$C$194=LARGE(IF($A$2:$A$194=$E31,$C$2:$C$194),COLUMNS($F31:G31)),ROW($B$2:$B$194)-ROW($B$2)+1)),SUM(1*(LARGE(IF($A$2:$A$194=$E31,$C$2:$C$194),ROW(INDIRECT(\"1:\"&COLUMNS($F31:G31))))=LARGE(IF($A$2:$A$194=$E31,$C$2:$C$194),COLUMNS($F31:G31)))))))","v":"Acct 2468"},{"$f":"IF(COLUMNS($F31:H31)>SUM(($A$2:$A$194=$E31)*($C$2:$C$194>=LARGE(IF($A$2:$A$194=$E31,$C$2:$C$194),$F$3))),\"\",INDEX($B$2:$B$194,SMALL(IF($A$2:$A$194=$E31,IF($C$2:$C$194=LARGE(IF($A$2:$A$194=$E31,$C$2:$C$194),COLUMNS($F31:H31)),ROW($B$2:$B$194)-ROW($B$2)+1)),SUM(1*(LARGE(IF($A$2:$A$194=$E31,$C$2:$C$194),ROW(INDIRECT(\"1:\"&COLUMNS($F31:H31))))=LARGE(IF($A$2:$A$194=$E31,$C$2:$C$194),COLUMNS($F31:H31)))))))","v":"Acct 6122"},{"$f":"IF(COLUMNS($F31:I31)>SUM(($A$2:$A$194=$E31)*($C$2:$C$194>=LARGE(IF($A$2:$A$194=$E31,$C$2:$C$194),$F$3))),\"\",INDEX($B$2:$B$194,SMALL(IF($A$2:$A$194=$E31,IF($C$2:$C$194=LARGE(IF($A$2:$A$194=$E31,$C$2:$C$194),COLUMNS($F31:I31)),ROW($B$2:$B$194)-ROW($B$2)+1)),SUM(1*(LARGE(IF($A$2:$A$194=$E31,$C$2:$C$194),ROW(INDIRECT(\"1:\"&COLUMNS($F31:I31))))=LARGE(IF($A$2:$A$194=$E31,$C$2:$C$194),COLUMNS($F31:I31)))))))","v":""}]
["F","Acct 6976",59664.026927225699]
["F","Acct 5891",48310.794809471889]
["F","Acct 7434",43426.488050126041]
["F","Acct 1805",20969.511691952881]
["F","Acct 3479",2233.0877044513641]
["G","Acct 4572",98032.383611700527]
["G","Acct 3463",78194.091269626821]
["G","Acct 4202",76665.750257587832]
["G","Acct 6885",56257.227525234288]
["G","Acct 6445",40864.926055360163]
["G","Acct 5336",6883.7709958614932]
["H","Acct 7000",95458.07830050755]
["H","Acct 3609",89821.418741519999]
["H","Acct 4633",89361.942591034429]
["H","Acct 3846",86798.501207525958]
["H","Acct 1067",43392.063969875504]
["H","Acct 5766",24277.339010315001]
["H","Acct 2003",20094.052456190082]
["H","Acct 6171",19433.15046207772]
["H","Acct 3929",7789.3703568382207]
["H","Acct 8365",3466.3045130392866]
["H","Acct 8318",1854.4621656475856]
["H","Acct 5742",68.401019163055736]
["I","Acct 2335",96986.478946464005]
["I","Acct 7761",94931.171086085713]
["I","Acct 7297",90699.261858278114]
["I","Acct 5300",87789.328269525518]
["I","Acct 3853",86204.595435424795]
["I","Acct 1079",74531.421535208792]
["I","Acct 4623",74069.427022633623]
["I","Acct 2401",66564.803428470259]
["I","Acct 5360",53569.205169452172]
["I","Acct 8371",23389.143038519091]
["I","Acct 2234",12050.678952141358]
["J","Acct 6172",93547.891564467995]
["J","Acct 4394",88084.334500708588]
["J","Acct 7933",87655.308899984651]
["J","Acct 7673",82293.104880033716]
["J","Acct 8868",81510.467506900051]
["J","Acct 1385",69549.267947399916]
["J","Acct 1353",64993.578410125861]
["J","Acct 3839",62790.980512658687]
["J","Acct 7937",37230.676759181959]
["J","Acct 3572",27859.12782444404]
["J","Acct 8285",16955.51182875994]
["J","Acct 4583",9687.6331415009954]
["K","Acct 7565",84888.3557188181]
["K","Acct 6510",70681.601631156314]
["K","Acct 6891",59407.130969918151]
["K","Acct 2455",56457.318323541193]
["K","Acct 5001",37382.501380440444]
["L","Acct 8898",98419.82694628532]
["L","Acct 8210",72573.353135136334]
["L","Acct 8361",57832.389120664964]
["L","Acct 8038",41764.529772309797]
["L","Acct 3155",33360.942138445571]
["L","Acct 5975",10963.989377962658]
["L","Acct 3693",5145.0679813428878]
["M","Acct 1839",93012.868685983034]
["M","Acct 8666",89585.223662240242]
["M","Acct 5486",83186.624258868935]
["M","Acct 7791",71962.025844609889]
["M","Acct 7844",70209.460628448345]
["M","Acct 3951",65416.931332410903]
["M","Acct 5535",59374.365818534447]
["M","Acct 5922",53247.285606027915]
["M","Acct 1928",53083.049022911968]
["M","Acct 1489",30363.21523896942]
["M","Acct 2671",19973.06971246413]
["M","Acct 8409",18684.296007320787]
["M","Acct 1029",12275.341687067708]
["M","Acct 5378",5989.472665921614]
["N","Acct 7568",75958.520399238434]
["N","Acct 1881",68036.179783628075]
["N","Acct 2572",35387.666055635462]
["N","Acct 6471",26247.804740380965]
["N","Acct 3287",16958.805359766848]
["N","Acct 5385",16270.326629001696]
["N","Acct 6968",3441.5438593462522]
["O","Acct 2274",98826.453609775665]
["O","Acct 4857",80257.656503568927]
["O","Acct 3449",42019.850448222431]
["O","Acct 8704",28612.064572513373]
["O","Acct 3511",28534.865024923994]
["P","Acct 7506",98371.957216768133]
["P","Acct 8246",85292.137879763279]
["P","Acct 7863",85194.239646258648]
["P","Acct 1457",81855.218059321414]
["P","Acct 2682",47153.535610922416]
["P","Acct 8012",42087.342515283024]
["P","Acct 2752",41447.981980571625]
["P","Acct 6769",37767.112763393619]
["P","Acct 3180",13917.201059140294]
["Q","Acct 3599",83535.147175419741]
["Q","Acct 1289",44824.408958438311]
["Q","Acct 3068",31145.337098534397]
["Q","Acct 1496",14932.955485635446]
["R","Acct 4164",88970.843076139776]
["R","Acct 7397",85708.50929882683]
["R","Acct 6023",74273.508848181009]
["R","Acct 4100",43672.911787917968]
["R","Acct 8152",36607.047572390074]
["R","Acct 7092",29185.529257034559]
["R","Acct 2588",25304.69252127334]
["R","Acct 4783",7744.3144514072856]
["S","Acct 2814",76834.025919695297]
["S","Acct 4150",56289.341835275176]
["S","Acct 8643",47809.554028744547]
["S","Acct 6269",41921.984416262072]
["S","Acct 1034",34929.233956985816]
["S","Acct 8653",30915.561620566979]
["S","Acct 1315",6428.7769890917998]
["T","Acct 2211",77993.273405303655]
["T","Acct 7416",52875.38074087417]
["T","Acct 4526",34201.873974298614]
["T","Acct 6104",34131.139663162045]
["T","Acct 8943",18023.937649358435]
["T","Acct 1804",11937.654793067864]
["T","Acct 7464",11534.378379106869]
["T","Acct 2776",10598.165394744552]
["U","Acct 6175",94460.225887369714]
["U","Acct 3099",69380.535860821517]
["U","Acct 3368",50397.749597289985]
["U","Acct 4996",27407.916767624385]
["U","Acct 5124",20942.261918338823]
["U","Acct 1799",19966.876355848693]
["V","Acct 2893",90009.426074220391]
["V","Acct 6058",89086.219281350044]
["V","Acct 8919",80698.698876596623]
["V","Acct 3637",77526.661323302294]
["V","Acct 7968",76227.680486931786]
["V","Acct 6752",72064.545259473292]
["V","Acct 5203",69539.252716050803]
["V","Acct 4579",51261.581782236441]
["V","Acct 2607",44606.242804784924]
["V","Acct 6361",35569.629642003863]
["W","Acct 5113",84485.285822197315]
["W","Acct 3607",84196.837223824099]
["W","Acct 5655",83233.555443191712]
["W","Acct 5177",60065.297803779948]
["W","Acct 7776",56415.591684292442]
["W","Acct 8156",28647.069512270285]
["W","Acct 4708",22122.262555228601]
["W","Acct 1970",17766.844024179351]
["W","Acct 8513",13218.842175105949]
["X","Acct 1468",96875.666033515285]
["X","Acct 8421",91985.651518750223]
["X","Acct 5176",67364.968983625469]
["X","Acct 5243",39771.947012448916]
["Y","Acct 6120",67790.265221296489]
["Y","Acct 8634",54469.545793770703]
["Y","Acct 2377",36832.298898686]
["Y","Acct 2318",23587.42117057553]
["Y","Acct 5888",6870.4628633050379]
["Z","Acct 7408",99579.82654280118]
["Z","Acct 2468",82730.192313480526]
["Z","Acct 6122",80274.179806068685]
["Z","Acct 1782",35550.520792141171]
["Z","Acct 8453",24668.664993029066]
["Z","Acct 8259",17226.994831884102]
["Z","Acct 2300",15073.748208474048]
["Z","Acct 4734",14909.96885258835]
["Z","Acct 2666",12675.218539484102]

{"sheet":"786","index":21,"n_rows":42,"n_cols":7,"rows_kept":42,"cut":false,"hidden":false,"merged":[]}
["Sales","WeekStartDate",null,"Today",{"$f":"TODAY()+F1","v":"2011-06-15"},25]
[{"$f":"RANDBETWEEN(50000,85000)","v":71019},{"$f":"DATE(YEAR(TODAY()-16),MONTH(TODAY()-16),DAY(TODAY()-16)-WEEKDAY(TODAY()-16,3))","v":"2011-05-02"}]
[56150,{"$f":"B2+7","v":"2011-05-09"},null,"Chart Title:"]
[79443,{"$f":"B3+7","v":"2011-05-16"},null,null,null,"Chart Label","Number"]
[70047,"2011-05-23",null,null,"Date","Date","Sales"]
[59245,"2011-05-30",null,"Prior Monday"]
[52793,"2011-06-06"]
[62670,"2011-06-13"]
[72351,"2011-06-20"]
[75792,"2011-06-27"]
[64611,"2011-07-04"]
[77481,"2011-07-11",null,null,"Dates","WEEKDAY"]
[74009,"2011-07-18",null,null,"2010-09-13"]
[70178,"2011-07-25",null,null,"2010-09-14"]
[69162,"2011-08-01",null,null,"2010-09-15"]
[55042,"2011-08-08",null,null,"2010-09-16"]
[75983,"2011-08-15",null,null,"2010-09-17"]
[56323,"2011-08-22",null,null,"2010-09-18"]
[58883,"2011-08-29",null,null,"2010-09-19"]
[50998,"2011-09-05"]
[67942,"2011-09-12"]
[63585,"2011-09-19"]
[54846,"2011-09-26"]
[83459,"2011-10-03"]
[77185,"2011-10-10"]
[84157,"2011-10-17"]
[69863,"2011-10-24"]
[55597,"2011-10-31"]
[78686,"2011-11-07"]
[55637,"2011-11-14"]
[82184,"2011-11-21"]
[56671,"2011-11-28"]
[76499,"2011-12-05"]
[71198,"2011-12-12"]
[81344,"2011-12-19"]
[83839,"2011-12-26"]
[83736,"2012-01-02"]
[79682,"2012-01-09"]
[82860,"2012-01-16"]
[59151,"2012-01-23"]
[72357,"2012-01-30"]
[62302,"2012-02-06"]

{"sheet":"786(an)","index":22,"n_rows":42,"n_cols":7,"rows_kept":42,"cut":false,"hidden":false,"merged":[]}
["Sales","WeekStartDate",null,"Today",{"$f":"TODAY()+F1","v":"2011-05-11"},-10]
[{"$f":"RANDBETWEEN(50000,85000)","v":72647},{"$f":"DATE(YEAR(TODAY()-16),MONTH(TODAY()-16),DAY(TODAY()-16)-WEEKDAY(TODAY()-16,3))","v":"2011-05-02"}]
[54622,{"$f":"B2+7","v":"2011-05-09"},null,"Chart Title:",{"$f":"\"Five Week Chart Starting \"&TEXT(E6,\"dddd, m/d/yyy\")","v":"Five Week Chart Starting Monday, 5/9/2011"}]
[81594,{"$f":"B3+7","v":"2011-05-16"},null,null,null,"Chart Label","Number"]
[51870,"2011-05-23",null,null,"Date","Date","Sales"]
[58596,"2011-05-30",null,"Prior Monday",{"$f":"DATE(YEAR(E1),MONTH(E1),DAY(E1)-WEEKDAY(E1,3))","v":"2011-05-09"},{"$f":"\"Week \"&ROWS(F$6:F6)&\", \"&TEXT(E6,\"ddd, m/d/yyy\")","v":"Week 1, Mon, 5/9/2011"},{"$f":"INDEX($A$2:$A$42,MATCH(E6,$B$2:$B$42,0))","v":54622}]
[63907,"2011-06-06",null,null,{"$f":"E6+7","v":"2011-05-16"},{"$f":"\"Week \"&ROWS(F$6:F7)&\", \"&TEXT(E7,\"ddd, m/d/yyy\")","v":"Week 2, Mon, 5/16/2011"},{"$f":"INDEX($A$2:$A$42,MATCH(E7,$B$2:$B$42,0))","v":81594}]
[71196,"2011-06-13",null,null,{"$f":"E7+7","v":"2011-05-23"},{"$f":"\"Week \"&ROWS(F$6:F8)&\", \"&TEXT(E8,\"ddd, m/d/yyy\")","v":"Week 3, Mon, 5/23/2011"},51870]
[77155,"2011-06-20",null,null,"2011-05-30",{"$f":"\"Week \"&ROWS(F$6:F9)&\", \"&TEXT(E9,\"ddd, m/d/yyy\")","v":"Week 4, Mon, 5/30/2011"},58596]
[72304,"2011-06-27",null,null,"2011-06-06",{"$f":"\"Week \"&ROWS(F$6:F10)&\", \"&TEXT(E10,\"ddd, m/d/yyy\")","v":"Week 5, Mon, 6/6/2011"},63907]
[57347,"2011-07-04"]
[69176,"2011-07-11",null,null,"Dates","WEEKDAY"]
[77782,"2011-07-18",null,null,"2010-09-13",{"$f":"WEEKDAY(E13,3)","v":0},{"$f":"DAY(E13)-WEEKDAY(E13,3)","v":13}]
[81978,"2011-07-25",null,null,"2010-09-14",{"$f":"WEEKDAY(E14,3)","v":1},{"$f":"DAY(E14)-WEEKDAY(E14,3)","v":13}]
[55424,"2011-08-01",null,null,"2010-09-15",2,13]
[76936,"2011-08-08",null,null,"2010-09-16",3,13]
[64924,"2011-08-15",null,null,"2010-09-17",4,13]
[64863,"2011-08-22",null,null,"2010-09-18",5,13]
[75557,"2011-08-29",null,null,"2010-09-19",6,13]
[80161,"2011-09-05"]
[71424,"2011-09-12"]
[64326,"2011-09-19"]
[78568,"2011-09-26"]
[66722,"2011-10-03"]
[54165,"2011-10-10"]
[74320,"2011-10-17"]
[65187,"2011-10-24"]
[54126,"2011-10-31"]
[71982,"2011-11-07"]
[72938,"2011-11-14"]
[79123,"2011-11-21"]
[67868,"2011-11-28"]
[83771,"2011-12-05"]
[82242,"2011-12-12"]
[63812,"2011-12-19"]
[50052,"2011-12-26"]
[70311,"2012-01-02"]
[57075,"2012-01-09"]
[54907,"2012-01-16"]
[65439,"2012-01-23"]
[58720,"2012-01-30"]
[73196,"2012-02-06"]