{"text_format":"1","workbook":"xlsx","n_sheets":26,"sheets":["NOTES","661","661an","662","662an","663","663an","664","664an","665","665an","666a","666an","667","667an","668","668an","669","669an","T(1)","T(2)","T(3)","670","670an","671","671an"],"not_rendered":{"charts":0,"images":0,"macros":0,"external_links":0,"defined_names":13,"comments":0,"pivot_tables":0},"unopened":[],"bounds":{"document_bytes":16777216,"sheet_cells":100000,"rows_first":2000,"rows_last":500,"rows_between":2000,"halvings":0,"cell_chars":16384,"cell_head_chars":4096},"cells_cut":0,"cells_raw":0,"read":"whole","date_system":"1900"}

{"sheet":"NOTES","index":0,"n_rows":32,"n_cols":5,"rows_kept":32,"cut":false,"hidden":false,"merged":[]}
["An aggregate function is a function that returns a single value from a collection of input values."]
["AGGREGATE function - two types"]
[" =AGGREGATE(function_num,option,array,[k])\nfunctions 14 - 19 can handle arrays"]
[" =AGGREGATE(function_num,option,ref1,ref2,[ref3])\nnot for arrays"]
["If the formula requires a second argument and you don't provide it, you get an #VALUE! Error (like SMALL without the k argument."]
["The AGGREGATE function is designed for columns of data, or vertical ranges. It is not designed for rows of data, or horizontal ranges. For example, when you subtotal a horizontal range using option 1, such as AGGREGATE(1, 1, ref1), hiding a column does not affect the aggregate sum value. But, hiding a row in vertical range does affect the aggregate."]
["If you use 3-D cell references, you get an #VALUE!"]
["http://en.wikipedia.org/wiki/Aggregate_function"]
["http://office.microsoft.com/en-us/excel-help/aggregate-function-HA010338704.aspx"]
[]
["SUBTOTAL function only has 11 functions"]
["1st argument",null,null,"2nd argument"]
["function_num","Function",null,"option","what it does"]
[1,"AVERAGE",null,0,"Ignore nested SUBTOTAL and AGGREGATE functions"]
[2,"COUNT",null,1,"Ignore hidden rows, nested SUBTOTAL and AGGREGATE functions"]
[3,"COUNTA",null,2,"Ignore error values, nested SUBTOTAL and AGGREGATE functions"]
[4,"MAX",null,3,"Ignore hidden rows, error values, nested SUBTOTAL and AGGREGATE functions"]
[5,"MIN",null,4,"Ignore nothing"]
[6,"PRODUCT",null,5,"Ignore hidden rows"]
[7,"STDDEV.S",null,6,"Ignore error values"]
[8,"STDDEV.P",null,7,"Ignore hidden rows and error values"]
[9,"SUM"]
[10,"VAR.S"]
[11,"VAR.P"]
[12,"MEDIAN"]
[13,"MODE.SNGL"]
[14,"LARGE"]
[15,"SMALL"]
[16,"PERCENTILE.INC"]
[17,"QUARTILE.INC"]
[18,"PERCENTILE.EXC"]
[19,"QUARTILE.EXC"]

{"sheet":"661","index":1,"n_rows":102,"n_cols":16,"rows_kept":102,"cut":false,"hidden":false,"merged":[]}
["Date","SalesRep","Sales ",null,{"$f":"VLOOKUP(F1,{1,\"AVERAGE\";2,\"COUNT\";3,\"COUNTA\";4,\"MAX\";5,\"MIN\";6,\"PRODUCT\";7,\"STDEV.S\";8,\"STDEV.P\";9,\"SUM\";10,\"VAR.S\";11,\"VAR.P\";12,\"MEDIAN\";13,\"MODE.SNGL\";14,\"LARGE\";15,\"SMALL\";16,\"PERCENTILE.INC\";17,\"QUARTILE.INC\";18,\"PERCENTILE.EXC\";19,\"QUARTILE.EXC\"},2,0)","v":"AVERAGE"},1,null,null,{"$f":"AVERAGE($C$2:$C$102)","v":114.13168316831684},{"$f":"ShowFormulaToLeft","v":"=AVERAGE($C$2:$C$102)"},null,null,"No",{"$f":"C1","v":"Sales "}]
["2009-12-25","Gault",94.69,null,{"$f":"VLOOKUP(F2,{1,\"AVERAGE\";2,\"COUNT\";3,\"COUNTA\";4,\"MAX\";5,\"MIN\";6,\"PRODUCT\";7,\"STDEV.S\";8,\"STDEV.P\";9,\"SUM\";10,\"VAR.S\";11,\"VAR.P\";12,\"MEDIAN\";13,\"MODE.SNGL\";14,\"LARGE\";15,\"SMALL\";16,\"PERCENTILE.INC\";17,\"QUARTILE.INC\";18,\"PERCENTILE.EXC\";19,\"QUARTILE.EXC\"},2,0)","v":"COUNT"},2,null,null,{"$f":"COUNT($C$2:$C$102)","v":101},{"$f":"ShowFormulaToLeft","v":"=COUNT($C$2:$C$102)"},null,null,{"$f":"ROWS(M$2:M2)","v":1},{"$f":"SMALL($C$2:$C$102,ROWS(N$2:N2))","v":75.040000000000006}]
["2009-12-15","Smith",130.19999999999999,null,{"$f":"VLOOKUP(F3,{1,\"AVERAGE\";2,\"COUNT\";3,\"COUNTA\";4,\"MAX\";5,\"MIN\";6,\"PRODUCT\";7,\"STDEV.S\";8,\"STDEV.P\";9,\"SUM\";10,\"VAR.S\";11,\"VAR.P\";12,\"MEDIAN\";13,\"MODE.SNGL\";14,\"LARGE\";15,\"SMALL\";16,\"PERCENTILE.INC\";17,\"QUARTILE.INC\";18,\"PERCENTILE.EXC\";19,\"QUARTILE.EXC\"},2,0)","v":"COUNTA"},3,null,null,{"$f":"COUNTA($C$2:$C$102)","v":101},{"$f":"ShowFormulaToLeft","v":"=COUNTA($C$2:$C$102)"},null,null,{"$f":"ROWS(M$2:M3)","v":2},{"$f":"SMALL($C$2:$C$102,ROWS(N$2:N3))","v":75.17}]
["2009-12-11","Franks",149.94999999999999,null,{"$f":"VLOOKUP(F4,{1,\"AVERAGE\";2,\"COUNT\";3,\"COUNTA\";4,\"MAX\";5,\"MIN\";6,\"PRODUCT\";7,\"STDEV.S\";8,\"STDEV.P\";9,\"SUM\";10,\"VAR.S\";11,\"VAR.P\";12,\"MEDIAN\";13,\"MODE.SNGL\";14,\"LARGE\";15,\"SMALL\";16,\"PERCENTILE.INC\";17,\"QUARTILE.INC\";18,\"PERCENTILE.EXC\";19,\"QUARTILE.EXC\"},2,0)","v":"MAX"},4,null,null,{"$f":"MAX($C$2:$C$102)","v":154.31},{"$f":"ShowFormulaToLeft","v":"=MAX($C$2:$C$102)"},null,null,{"$f":"ROWS(M$2:M4)","v":3},{"$f":"SMALL($C$2:$C$102,ROWS(N$2:N4))","v":75.349999999999994}]
["2009-12-01","Gault",94.11,null,{"$f":"VLOOKUP(F5,{1,\"AVERAGE\";2,\"COUNT\";3,\"COUNTA\";4,\"MAX\";5,\"MIN\";6,\"PRODUCT\";7,\"STDEV.S\";8,\"STDEV.P\";9,\"SUM\";10,\"VAR.S\";11,\"VAR.P\";12,\"MEDIAN\";13,\"MODE.SNGL\";14,\"LARGE\";15,\"SMALL\";16,\"PERCENTILE.INC\";17,\"QUARTILE.INC\";18,\"PERCENTILE.EXC\";19,\"QUARTILE.EXC\"},2,0)","v":"MIN"},5,null,null,{"$f":"MIN($C$2:$C$102)","v":75.040000000000006},{"$f":"ShowFormulaToLeft","v":"=MIN($C$2:$C$102)"},null,null,{"$f":"ROWS(M$2:M5)","v":4},{"$f":"SMALL($C$2:$C$102,ROWS(N$2:N5))","v":76.260000000000005}]
["2009-12-11","Franks",136.13999999999999,null,{"$f":"VLOOKUP(F6,{1,\"AVERAGE\";2,\"COUNT\";3,\"COUNTA\";4,\"MAX\";5,\"MIN\";6,\"PRODUCT\";7,\"STDEV.S\";8,\"STDEV.P\";9,\"SUM\";10,\"VAR.S\";11,\"VAR.P\";12,\"MEDIAN\";13,\"MODE.SNGL\";14,\"LARGE\";15,\"SMALL\";16,\"PERCENTILE.INC\";17,\"QUARTILE.INC\";18,\"PERCENTILE.EXC\";19,\"QUARTILE.EXC\"},2,0)","v":"PRODUCT"},6,null,null,{"$f":"PRODUCT($C$2:$C$102)","v":8.4456823732325592E+206},{"$f":"ShowFormulaToLeft","v":"=PRODUCT($C$2:$C$102)"},null,null,{"$f":"ROWS(M$2:M6)","v":5},{"$f":"SMALL($C$2:$C$102,ROWS(N$2:N6))","v":76.59}]
["2010-02-12","Pham",133.16999999999999,null,{"$f":"VLOOKUP(F7,{1,\"AVERAGE\";2,\"COUNT\";3,\"COUNTA\";4,\"MAX\";5,\"MIN\";6,\"PRODUCT\";7,\"STDEV.S\";8,\"STDEV.P\";9,\"SUM\";10,\"VAR.S\";11,\"VAR.P\";12,\"MEDIAN\";13,\"MODE.SNGL\";14,\"LARGE\";15,\"SMALL\";16,\"PERCENTILE.INC\";17,\"QUARTILE.INC\";18,\"PERCENTILE.EXC\";19,\"QUARTILE.EXC\"},2,0)","v":"STDEV.S"},7,null,null,{"$f":"_xlfn.STDEV.S($C$2:$C$102)","v":22.121727783756103},{"$f":"ShowFormulaToLeft","v":"=STDEV.S($C$2:$C$102)"},null,null,{"$f":"ROWS(M$2:M7)","v":6},{"$f":"SMALL($C$2:$C$102,ROWS(N$2:N7))","v":76.650000000000006}]
["2009-12-07","Smith",80.81,null,{"$f":"VLOOKUP(F8,{1,\"AVERAGE\";2,\"COUNT\";3,\"COUNTA\";4,\"MAX\";5,\"MIN\";6,\"PRODUCT\";7,\"STDEV.S\";8,\"STDEV.P\";9,\"SUM\";10,\"VAR.S\";11,\"VAR.P\";12,\"MEDIAN\";13,\"MODE.SNGL\";14,\"LARGE\";15,\"SMALL\";16,\"PERCENTILE.INC\";17,\"QUARTILE.INC\";18,\"PERCENTILE.EXC\";19,\"QUARTILE.EXC\"},2,0)","v":"STDEV.P"},8,null,null,{"$f":"_xlfn.STDEV.P($C$2:$C$102)","v":22.011941856538932},{"$f":"ShowFormulaToLeft","v":"=STDEV.P($C$2:$C$102)"},null,null,{"$f":"ROWS(M$2:M8)","v":7},{"$f":"SMALL($C$2:$C$102,ROWS(N$2:N8))","v":78.459999999999994}]
["2009-11-23","Smith",125.38,null,{"$f":"VLOOKUP(F9,{1,\"AVERAGE\";2,\"COUNT\";3,\"COUNTA\";4,\"MAX\";5,\"MIN\";6,\"PRODUCT\";7,\"STDEV.S\";8,\"STDEV.P\";9,\"SUM\";10,\"VAR.S\";11,\"VAR.P\";12,\"MEDIAN\";13,\"MODE.SNGL\";14,\"LARGE\";15,\"SMALL\";16,\"PERCENTILE.INC\";17,\"QUARTILE.INC\";18,\"PERCENTILE.EXC\";19,\"QUARTILE.EXC\"},2,0)","v":"SUM"},9,null,null,{"$f":"SUM($C$2:$C$102)","v":11527.300000000001},{"$f":"ShowFormulaToLeft","v":"=SUM($C$2:$C$102)"},null,null,{"$f":"ROWS(M$2:M9)","v":8},{"$f":"SMALL($C$2:$C$102,ROWS(N$2:N9))","v":78.89}]
["2009-11-23","Gault",78.95,null,{"$f":"VLOOKUP(F10,{1,\"AVERAGE\";2,\"COUNT\";3,\"COUNTA\";4,\"MAX\";5,\"MIN\";6,\"PRODUCT\";7,\"STDEV.S\";8,\"STDEV.P\";9,\"SUM\";10,\"VAR.S\";11,\"VAR.P\";12,\"MEDIAN\";13,\"MODE.SNGL\";14,\"LARGE\";15,\"SMALL\";16,\"PERCENTILE.INC\";17,\"QUARTILE.INC\";18,\"PERCENTILE.EXC\";19,\"QUARTILE.EXC\"},2,0)","v":"VAR.S"},10,null,null,{"$f":"_xlfn.VAR.S($C$2:$C$102)","v":489.37084013860675},{"$f":"ShowFormulaToLeft","v":"=VAR.S($C$2:$C$102)"},null,null,{"$f":"ROWS(M$2:M10)","v":9},{"$f":"SMALL($C$2:$C$102,ROWS(N$2:N10))","v":78.95}]
["2010-01-23","Smith",113.86,null,{"$f":"VLOOKUP(F11,{1,\"AVERAGE\";2,\"COUNT\";3,\"COUNTA\";4,\"MAX\";5,\"MIN\";6,\"PRODUCT\";7,\"STDEV.S\";8,\"STDEV.P\";9,\"SUM\";10,\"VAR.S\";11,\"VAR.P\";12,\"MEDIAN\";13,\"MODE.SNGL\";14,\"LARGE\";15,\"SMALL\";16,\"PERCENTILE.INC\";17,\"QUARTILE.INC\";18,\"PERCENTILE.EXC\";19,\"QUARTILE.EXC\"},2,0)","v":"VAR.P"},11,null,null,{"$f":"_xlfn.VAR.P($C$2:$C$102)","v":484.52558429565062},{"$f":"ShowFormulaToLeft","v":"=VAR.P($C$2:$C$102)"},null,null,{"$f":"ROWS(M$2:M11)","v":10},{"$f":"SMALL($C$2:$C$102,ROWS(N$2:N11))","v":79.11}]
["2010-01-21","Pham",139.38,null,{"$f":"VLOOKUP(F12,{1,\"AVERAGE\";2,\"COUNT\";3,\"COUNTA\";4,\"MAX\";5,\"MIN\";6,\"PRODUCT\";7,\"STDEV.S\";8,\"STDEV.P\";9,\"SUM\";10,\"VAR.S\";11,\"VAR.P\";12,\"MEDIAN\";13,\"MODE.SNGL\";14,\"LARGE\";15,\"SMALL\";16,\"PERCENTILE.INC\";17,\"QUARTILE.INC\";18,\"PERCENTILE.EXC\";19,\"QUARTILE.EXC\"},2,0)","v":"MEDIAN"},12,null,null,{"$f":"MEDIAN($C$2:$C$102)","v":114.93},{"$f":"ShowFormulaToLeft","v":"=MEDIAN($C$2:$C$102)"},null,null,{"$f":"ROWS(M$2:M12)","v":11},{"$f":"SMALL($C$2:$C$102,ROWS(N$2:N12))","v":79.42}]
["2009-12-20","Gault",98.71,null,{"$f":"VLOOKUP(F13,{1,\"AVERAGE\";2,\"COUNT\";3,\"COUNTA\";4,\"MAX\";5,\"MIN\";6,\"PRODUCT\";7,\"STDEV.S\";8,\"STDEV.P\";9,\"SUM\";10,\"VAR.S\";11,\"VAR.P\";12,\"MEDIAN\";13,\"MODE.SNGL\";14,\"LARGE\";15,\"SMALL\";16,\"PERCENTILE.INC\";17,\"QUARTILE.INC\";18,\"PERCENTILE.EXC\";19,\"QUARTILE.EXC\"},2,0)","v":"MODE.SNGL"},13,null,null,{"$f":"_xlfn.MODE.SNGL($C$2:$C$102)","v":{"$error":"#N/A"}},{"$f":"ShowFormulaToLeft","v":"=MODE.SNGL($C$2:$C$102)"},null,null,{"$f":"ROWS(M$2:M13)","v":12},{"$f":"SMALL($C$2:$C$102,ROWS(N$2:N13))","v":80.81}]
["2009-12-07","Pham",76.650000000000006,null,null,null,null,null,null,null,null,null,{"$f":"ROWS(M$2:M14)","v":13},{"$f":"SMALL($C$2:$C$102,ROWS(N$2:N14))","v":83.26}]
["2010-02-11","Gault",126.62,null,{"$f":"VLOOKUP(F15,{1,\"AVERAGE\";2,\"COUNT\";3,\"COUNTA\";4,\"MAX\";5,\"MIN\";6,\"PRODUCT\";7,\"STDEV.S\";8,\"STDEV.P\";9,\"SUM\";10,\"VAR.S\";11,\"VAR.P\";12,\"MEDIAN\";13,\"MODE.SNGL\";14,\"LARGE\";15,\"SMALL\";16,\"PERCENTILE.INC\";17,\"QUARTILE.INC\";18,\"PERCENTILE.EXC\";19,\"QUARTILE.EXC\"},2,0)","v":"LARGE"},14,null,2,null,null,null,null,{"$f":"ROWS(M$2:M15)","v":14},{"$f":"SMALL($C$2:$C$102,ROWS(N$2:N15))","v":83.37}]
["2010-01-13","Franks",107.9,null,{"$f":"VLOOKUP(F16,{1,\"AVERAGE\";2,\"COUNT\";3,\"COUNTA\";4,\"MAX\";5,\"MIN\";6,\"PRODUCT\";7,\"STDEV.S\";8,\"STDEV.P\";9,\"SUM\";10,\"VAR.S\";11,\"VAR.P\";12,\"MEDIAN\";13,\"MODE.SNGL\";14,\"LARGE\";15,\"SMALL\";16,\"PERCENTILE.INC\";17,\"QUARTILE.INC\";18,\"PERCENTILE.EXC\";19,\"QUARTILE.EXC\"},2,0)","v":"SMALL"},15,null,{"$f":"H15","v":2},null,null,null,null,{"$f":"ROWS(M$2:M16)","v":15},{"$f":"SMALL($C$2:$C$102,ROWS(N$2:N16))","v":85.14}]
["2010-01-28","Gault",130.54,null,{"$f":"VLOOKUP(F17,{1,\"AVERAGE\";2,\"COUNT\";3,\"COUNTA\";4,\"MAX\";5,\"MIN\";6,\"PRODUCT\";7,\"STDEV.S\";8,\"STDEV.P\";9,\"SUM\";10,\"VAR.S\";11,\"VAR.P\";12,\"MEDIAN\";13,\"MODE.SNGL\";14,\"LARGE\";15,\"SMALL\";16,\"PERCENTILE.INC\";17,\"QUARTILE.INC\";18,\"PERCENTILE.EXC\";19,\"QUARTILE.EXC\"},2,0)","v":"PERCENTILE.INC"},16,null,0.9,"old method",null,null,null,{"$f":"ROWS(M$2:M17)","v":16},{"$f":"SMALL($C$2:$C$102,ROWS(N$2:N17))","v":86.1}]
["2010-01-25","Gault",140.71,null,{"$f":"VLOOKUP(F18,{1,\"AVERAGE\";2,\"COUNT\";3,\"COUNTA\";4,\"MAX\";5,\"MIN\";6,\"PRODUCT\";7,\"STDEV.S\";8,\"STDEV.P\";9,\"SUM\";10,\"VAR.S\";11,\"VAR.P\";12,\"MEDIAN\";13,\"MODE.SNGL\";14,\"LARGE\";15,\"SMALL\";16,\"PERCENTILE.INC\";17,\"QUARTILE.INC\";18,\"PERCENTILE.EXC\";19,\"QUARTILE.EXC\"},2,0)","v":"QUARTILE.INC"},17,null,1,"old method",null,null,null,{"$f":"ROWS(M$2:M18)","v":17},{"$f":"SMALL($C$2:$C$102,ROWS(N$2:N18))","v":87.06}]
["2010-02-10","Sioux",108.72,null,{"$f":"VLOOKUP(F19,{1,\"AVERAGE\";2,\"COUNT\";3,\"COUNTA\";4,\"MAX\";5,\"MIN\";6,\"PRODUCT\";7,\"STDEV.S\";8,\"STDEV.P\";9,\"SUM\";10,\"VAR.S\";11,\"VAR.P\";12,\"MEDIAN\";13,\"MODE.SNGL\";14,\"LARGE\";15,\"SMALL\";16,\"PERCENTILE.INC\";17,\"QUARTILE.INC\";18,\"PERCENTILE.EXC\";19,\"QUARTILE.EXC\"},2,0)","v":"PERCENTILE.EXC"},18,null,{"$f":"H17","v":0.9},"new method",{"$f":"VLOOKUP((COUNT($C$2:$C$102)+1)*$H$17,$M$2:$N$102,2)+(VLOOKUP((COUNT($C$2:$C$102)+1)*$H$17+1,$M$2:$N$102,2)-VLOOKUP((COUNT($C$2:$C$102)+1)*$H$17,$M$2:$N$102,2))*MOD((COUNT($C$2:$C$102)+1)*$H$17,1)","v":140.67600000000002},null,null,{"$f":"ROWS(M$2:M19)","v":18},{"$f":"SMALL($C$2:$C$102,ROWS(N$2:N19))","v":88.51}]
["2009-12-26","Smith",135.18,null,{"$f":"VLOOKUP(F20,{1,\"AVERAGE\";2,\"COUNT\";3,\"COUNTA\";4,\"MAX\";5,\"MIN\";6,\"PRODUCT\";7,\"STDEV.S\";8,\"STDEV.P\";9,\"SUM\";10,\"VAR.S\";11,\"VAR.P\";12,\"MEDIAN\";13,\"MODE.SNGL\";14,\"LARGE\";15,\"SMALL\";16,\"PERCENTILE.INC\";17,\"QUARTILE.INC\";18,\"PERCENTILE.EXC\";19,\"QUARTILE.EXC\"},2,0)","v":"QUARTILE.EXC"},19,null,{"$f":"H18","v":1},"new method",null,null,null,{"$f":"ROWS(M$2:M20)","v":19},{"$f":"SMALL($C$2:$C$102,ROWS(N$2:N20))","v":88.69}]
["2009-12-14","Gault",142.55000000000001,null,null,null,null,null,null,null,null,null,{"$f":"ROWS(M$2:M21)","v":20},{"$f":"SMALL($C$2:$C$102,ROWS(N$2:N21))","v":89.11}]
["2010-02-12","Smith",140.54,null,null,null,null,null,null,null,null,null,{"$f":"ROWS(M$2:M22)","v":21},{"$f":"SMALL($C$2:$C$102,ROWS(N$2:N22))","v":93.15}]
["2010-01-19","Franks",75.040000000000006,null,"2nd argument",null,null,null,null,null,null,null,{"$f":"ROWS(M$2:M23)","v":22},{"$f":"SMALL($C$2:$C$102,ROWS(N$2:N23))","v":93.33}]
["2010-02-16","Pham",93.15,null,"option","what it does",null,null,null,null,null,null,{"$f":"ROWS(M$2:M24)","v":23},{"$f":"SMALL($C$2:$C$102,ROWS(N$2:N24))","v":93.37}]
["2010-01-07","Sioux",132.51,null,0,"Ignore nested SUBTOTAL and AGGREGATE functions",null,null,null,null,null,null,{"$f":"ROWS(M$2:M25)","v":24},{"$f":"SMALL($C$2:$C$102,ROWS(N$2:N25))","v":94.11}]
["2010-01-16","Chin",85.14,null,1,"Ignore hidden rows, nested SUBTOTAL and AGGREGATE functions",null,null,null,null,null,null,{"$f":"ROWS(M$2:M26)","v":25},{"$f":"SMALL($C$2:$C$102,ROWS(N$2:N26))","v":94.69}]
["2010-02-15","Franks",108.85,null,2,"Ignore error values, nested SUBTOTAL and AGGREGATE functions",null,null,null,null,null,null,{"$f":"ROWS(M$2:M27)","v":26},{"$f":"SMALL($C$2:$C$102,ROWS(N$2:N27))","v":96.17}]
["2009-12-13","Sioux",139.91999999999999,null,3,"Ignore hidden rows, error values, nested SUBTOTAL and AGGREGATE functions",null,null,null,null,null,null,{"$f":"ROWS(M$2:M28)","v":27},{"$f":"SMALL($C$2:$C$102,ROWS(N$2:N28))","v":98.71}]
["2010-01-04","Franks",104.35,null,4,"Ignore nothing",null,null,null,null,null,null,{"$f":"ROWS(M$2:M29)","v":28},{"$f":"SMALL($C$2:$C$102,ROWS(N$2:N29))","v":100.09}]
["2009-12-14","Gault",88.51,null,5,"Ignore hidden rows",null,null,null,null,null,null,{"$f":"ROWS(M$2:M30)","v":29},{"$f":"SMALL($C$2:$C$102,ROWS(N$2:N30))","v":100.76}]
["2010-02-01","Gault",136.76,null,6,"Ignore error values",null,null,null,null,null,null,{"$f":"ROWS(M$2:M31)","v":30},{"$f":"SMALL($C$2:$C$102,ROWS(N$2:N31))","v":100.83}]
["2009-11-25","Pham",109.57,null,7,"Ignore hidden rows and error values",null,null,null,null,null,null,{"$f":"ROWS(M$2:M32)","v":31},{"$f":"SMALL($C$2:$C$102,ROWS(N$2:N32))","v":102.17}]
["2010-02-07","Franks",125.81,null,null,null,null,null,null,null,null,null,{"$f":"ROWS(M$2:M33)","v":32},{"$f":"SMALL($C$2:$C$102,ROWS(N$2:N33))","v":102.24}]
["2009-12-22","Pham",150.09,null,null,null,null,null,null,null,null,null,{"$f":"ROWS(M$2:M34)","v":33},{"$f":"SMALL($C$2:$C$102,ROWS(N$2:N34))","v":102.64}]
["2009-12-07","Sioux",147.53,null,null,null,null,null,null,null,null,null,{"$f":"ROWS(M$2:M35)","v":34},{"$f":"SMALL($C$2:$C$102,ROWS(N$2:N35))","v":104.35}]
["2009-12-12","Chin",102.17,null,null,null,null,null,null,null,null,null,{"$f":"ROWS(M$2:M36)","v":35},{"$f":"SMALL($C$2:$C$102,ROWS(N$2:N36))","v":104.36}]
["2009-12-30","Smith",114.4,null,null,null,null,null,null,null,null,null,{"$f":"ROWS(M$2:M37)","v":36},{"$f":"SMALL($C$2:$C$102,ROWS(N$2:N37))","v":104.5}]
["2009-12-27","Chin",129.65,null,null,null,null,null,null,null,null,null,{"$f":"ROWS(M$2:M38)","v":37},{"$f":"SMALL($C$2:$C$102,ROWS(N$2:N38))","v":104.57}]
["2009-12-29","Chin",128.94999999999999,null,null,null,null,null,null,null,null,null,{"$f":"ROWS(M$2:M39)","v":38},{"$f":"SMALL($C$2:$C$102,ROWS(N$2:N39))","v":106.94}]
["2010-01-05","Gault",121.33,null,null,null,null,null,null,null,null,null,{"$f":"ROWS(M$2:M40)","v":39},{"$f":"SMALL($C$2:$C$102,ROWS(N$2:N40))","v":107.9}]
["2009-12-15","Pham",102.64,null,null,null,null,null,null,null,null,null,{"$f":"ROWS(M$2:M41)","v":40},{"$f":"SMALL($C$2:$C$102,ROWS(N$2:N41))","v":108.54}]
["2009-12-01","Pham",132.12,null,null,null,null,null,null,null,null,null,{"$f":"ROWS(M$2:M42)","v":41},{"$f":"SMALL($C$2:$C$102,ROWS(N$2:N42))","v":108.72}]
["2010-02-07","Franks",100.83,null,null,null,null,null,null,null,null,null,{"$f":"ROWS(M$2:M43)","v":42},{"$f":"SMALL($C$2:$C$102,ROWS(N$2:N43))","v":108.85}]
["2009-11-26","Sioux",79.42,null,null,null,null,null,null,null,null,null,{"$f":"ROWS(M$2:M44)","v":43},{"$f":"SMALL($C$2:$C$102,ROWS(N$2:N44))","v":109.57}]
["2010-01-04","Pham",100.09,null,null,null,null,null,null,null,null,null,{"$f":"ROWS(M$2:M45)","v":44},{"$f":"SMALL($C$2:$C$102,ROWS(N$2:N45))","v":109.7}]
["2010-01-29","Franks",83.37,null,null,null,null,null,null,null,null,null,{"$f":"ROWS(M$2:M46)","v":45},{"$f":"SMALL($C$2:$C$102,ROWS(N$2:N46))","v":112.03}]
["2010-01-19","Franks",89.11,null,null,null,null,null,null,null,null,null,{"$f":"ROWS(M$2:M47)","v":46},{"$f":"SMALL($C$2:$C$102,ROWS(N$2:N47))","v":112.5}]
["2010-02-14","Smith",126.97,null,null,null,null,null,null,null,null,null,{"$f":"ROWS(M$2:M48)","v":47},{"$f":"SMALL($C$2:$C$102,ROWS(N$2:N48))","v":113.86}]
["2009-12-03","Smith",154.31,null,null,null,null,null,null,null,null,null,{"$f":"ROWS(M$2:M49)","v":48},{"$f":"SMALL($C$2:$C$102,ROWS(N$2:N49))","v":114.4}]
["2010-01-02","Sioux",76.59,null,null,null,null,null,null,null,null,null,{"$f":"ROWS(M$2:M50)","v":49},{"$f":"SMALL($C$2:$C$102,ROWS(N$2:N50))","v":114.53}]
["2009-12-29","Gault",106.94,null,null,null,null,null,null,null,null,null,{"$f":"ROWS(M$2:M51)","v":50},{"$f":"SMALL($C$2:$C$102,ROWS(N$2:N51))","v":114.54}]
["2009-11-26","Chin",129.86000000000001,null,null,null,null,null,null,null,null,null,{"$f":"ROWS(M$2:M52)","v":51},{"$f":"SMALL($C$2:$C$102,ROWS(N$2:N52))","v":114.93}]
["2009-12-24","Pham",100.76,null,null,null,null,null,null,null,null,null,{"$f":"ROWS(M$2:M53)","v":52},{"$f":"SMALL($C$2:$C$102,ROWS(N$2:N53))","v":115.67}]
["2009-12-10","Gault",124.59,null,null,null,null,null,null,null,null,null,{"$f":"ROWS(M$2:M54)","v":53},{"$f":"SMALL($C$2:$C$102,ROWS(N$2:N54))","v":117.63}]
["2009-12-31","Smith",150.31,null,null,null,null,null,null,null,null,null,{"$f":"ROWS(M$2:M55)","v":54},{"$f":"SMALL($C$2:$C$102,ROWS(N$2:N55))","v":119.09}]
["2009-12-16","Franks",119.78,null,null,null,null,null,null,null,null,null,{"$f":"ROWS(M$2:M56)","v":55},{"$f":"SMALL($C$2:$C$102,ROWS(N$2:N56))","v":119.53}]
["2010-01-03","Pham",93.37,null,null,null,null,null,null,null,null,null,{"$f":"ROWS(M$2:M57)","v":56},{"$f":"SMALL($C$2:$C$102,ROWS(N$2:N57))","v":119.78}]
["2009-12-26","Chin",87.06,null,null,null,null,null,null,null,null,null,{"$f":"ROWS(M$2:M58)","v":57},{"$f":"SMALL($C$2:$C$102,ROWS(N$2:N58))","v":121.33}]
["2010-01-05","Smith",147.49,null,null,null,null,null,null,null,null,null,{"$f":"ROWS(M$2:M59)","v":58},{"$f":"SMALL($C$2:$C$102,ROWS(N$2:N59))","v":122.21}]
["2009-12-19","Smith",136.94,null,null,null,null,null,null,null,null,null,{"$f":"ROWS(M$2:M60)","v":59},{"$f":"SMALL($C$2:$C$102,ROWS(N$2:N60))","v":123.13}]
["2009-11-20","Gault",93.33,null,null,null,null,null,null,null,null,null,{"$f":"ROWS(M$2:M61)","v":60},{"$f":"SMALL($C$2:$C$102,ROWS(N$2:N61))","v":124.59}]
["2010-01-03","Smith",128.97,null,null,null,null,null,null,null,null,null,{"$f":"ROWS(M$2:M62)","v":61},{"$f":"SMALL($C$2:$C$102,ROWS(N$2:N62))","v":125.38}]
["2009-12-14","Smith",114.93,null,null,null,null,null,null,null,null,null,{"$f":"ROWS(M$2:M63)","v":62},{"$f":"SMALL($C$2:$C$102,ROWS(N$2:N63))","v":125.81}]
["2010-01-01","Sioux",104.57,null,null,null,null,null,null,null,null,null,{"$f":"ROWS(M$2:M64)","v":63},{"$f":"SMALL($C$2:$C$102,ROWS(N$2:N64))","v":126.33}]
["2009-11-27","Sioux",119.53,null,null,null,null,null,null,null,null,null,{"$f":"ROWS(M$2:M65)","v":64},{"$f":"SMALL($C$2:$C$102,ROWS(N$2:N65))","v":126.62}]
["2010-01-01","Pham",127.99,null,null,null,null,null,null,null,null,null,{"$f":"ROWS(M$2:M66)","v":65},{"$f":"SMALL($C$2:$C$102,ROWS(N$2:N66))","v":126.97}]
["2009-12-03","Smith",88.69,null,null,null,null,null,null,null,null,null,{"$f":"ROWS(M$2:M67)","v":66},{"$f":"SMALL($C$2:$C$102,ROWS(N$2:N67))","v":127.99}]
["2009-11-25","Smith",115.67,null,null,null,null,null,null,null,null,null,{"$f":"ROWS(M$2:M68)","v":67},{"$f":"SMALL($C$2:$C$102,ROWS(N$2:N68))","v":128.15}]
["2010-01-07","Pham",114.54,null,null,null,null,null,null,null,null,null,{"$f":"ROWS(M$2:M69)","v":68},{"$f":"SMALL($C$2:$C$102,ROWS(N$2:N69))","v":128.94999999999999}]
["2010-02-02","Smith",128.15,null,null,null,null,null,null,null,null,null,{"$f":"ROWS(M$2:M70)","v":69},{"$f":"SMALL($C$2:$C$102,ROWS(N$2:N70))","v":128.97}]
["2010-02-08","Gault",126.33,null,null,null,null,null,null,null,null,null,{"$f":"ROWS(M$2:M71)","v":70},{"$f":"SMALL($C$2:$C$102,ROWS(N$2:N71))","v":129.65}]
["2010-01-13","Smith",112.03,null,null,null,null,null,null,null,null,null,{"$f":"ROWS(M$2:M72)","v":71},{"$f":"SMALL($C$2:$C$102,ROWS(N$2:N72))","v":129.86000000000001}]
["2009-11-20","Smith",145.33000000000001,null,null,null,null,null,null,null,null,null,{"$f":"ROWS(M$2:M73)","v":72},{"$f":"SMALL($C$2:$C$102,ROWS(N$2:N73))","v":130.19999999999999}]
["2009-12-23","Gault",109.7,null,null,null,null,null,null,null,null,null,{"$f":"ROWS(M$2:M74)","v":73},{"$f":"SMALL($C$2:$C$102,ROWS(N$2:N74))","v":130.37}]
["2009-11-26","Sioux",139.13,null,null,null,null,null,null,null,null,null,{"$f":"ROWS(M$2:M75)","v":74},{"$f":"SMALL($C$2:$C$102,ROWS(N$2:N75))","v":130.5}]
["2009-12-01","Sioux",112.5,null,null,null,null,null,null,null,null,null,{"$f":"ROWS(M$2:M76)","v":75},{"$f":"SMALL($C$2:$C$102,ROWS(N$2:N76))","v":130.54}]
["2009-11-29","Pham",122.21,null,null,null,null,null,null,null,null,null,{"$f":"ROWS(M$2:M77)","v":76},{"$f":"SMALL($C$2:$C$102,ROWS(N$2:N77))","v":131.04}]
["2010-01-13","Smith",135.77000000000001,null,null,null,null,null,null,null,null,null,{"$f":"ROWS(M$2:M78)","v":77},{"$f":"SMALL($C$2:$C$102,ROWS(N$2:N78))","v":132.12}]
["2010-01-09","Pham",75.17,null,null,null,null,null,null,null,null,null,{"$f":"ROWS(M$2:M79)","v":78},{"$f":"SMALL($C$2:$C$102,ROWS(N$2:N79))","v":132.51}]
["2010-01-30","Sioux",104.5,null,null,null,null,null,null,null,null,null,{"$f":"ROWS(M$2:M80)","v":79},{"$f":"SMALL($C$2:$C$102,ROWS(N$2:N80))","v":133.16999999999999}]
["2010-02-04","Gault",86.1,null,null,null,null,null,null,null,null,null,{"$f":"ROWS(M$2:M81)","v":80},{"$f":"SMALL($C$2:$C$102,ROWS(N$2:N81))","v":134.11000000000001}]
["2010-01-02","Sioux",143.85,null,null,null,null,null,null,null,null,null,{"$f":"ROWS(M$2:M82)","v":81},{"$f":"SMALL($C$2:$C$102,ROWS(N$2:N82))","v":135.02000000000001}]
["2010-01-16","Gault",104.36,null,null,null,null,null,null,null,null,null,{"$f":"ROWS(M$2:M83)","v":82},{"$f":"SMALL($C$2:$C$102,ROWS(N$2:N83))","v":135.18}]
["2009-12-28","Smith",135.02000000000001,null,null,null,null,null,null,null,null,null,{"$f":"ROWS(M$2:M84)","v":83},{"$f":"SMALL($C$2:$C$102,ROWS(N$2:N84))","v":135.77000000000001}]
["2009-12-26","Pham",83.26,null,null,null,null,null,null,null,null,null,{"$f":"ROWS(M$2:M85)","v":84},{"$f":"SMALL($C$2:$C$102,ROWS(N$2:N85))","v":136.13999999999999}]
["2009-11-28","Sioux",114.53,null,null,null,null,null,null,null,null,null,{"$f":"ROWS(M$2:M86)","v":85},{"$f":"SMALL($C$2:$C$102,ROWS(N$2:N86))","v":136.76}]
["2010-02-02","Smith",117.63,null,null,null,null,null,null,null,null,null,{"$f":"ROWS(M$2:M87)","v":86},{"$f":"SMALL($C$2:$C$102,ROWS(N$2:N87))","v":136.94}]
["2009-12-27","Gault",102.24,null,null,null,null,null,null,null,null,null,{"$f":"ROWS(M$2:M88)","v":87},{"$f":"SMALL($C$2:$C$102,ROWS(N$2:N88))","v":139.13}]
["2010-02-01","Chin",139.21,null,null,null,null,null,null,null,null,null,{"$f":"ROWS(M$2:M89)","v":88},{"$f":"SMALL($C$2:$C$102,ROWS(N$2:N89))","v":139.21}]
["2009-12-25","Smith",119.09,null,null,null,null,null,null,null,null,null,{"$f":"ROWS(M$2:M90)","v":89},{"$f":"SMALL($C$2:$C$102,ROWS(N$2:N90))","v":139.38}]
["2010-01-17","Pham",134.11000000000001,null,null,null,null,null,null,null,null,null,{"$f":"ROWS(M$2:M91)","v":90},{"$f":"SMALL($C$2:$C$102,ROWS(N$2:N91))","v":139.91999999999999}]
["2010-01-15","Sioux",96.17,null,null,null,null,null,null,null,null,null,{"$f":"ROWS(M$2:M92)","v":91},{"$f":"SMALL($C$2:$C$102,ROWS(N$2:N92))","v":140.54},null,{"$f":"N93-N92","v":0.17000000000001592}]
["2010-01-10","Smith",108.54,null,null,null,null,null,null,null,null,null,{"$f":"ROWS(M$2:M93)","v":92},{"$f":"SMALL($C$2:$C$102,ROWS(N$2:N93))","v":140.71},null,{"$f":"P92*0.8","v":0.13600000000001275}]
["2010-01-05","Gault",78.89,null,null,null,null,null,null,null,null,null,{"$f":"ROWS(M$2:M94)","v":93},{"$f":"SMALL($C$2:$C$102,ROWS(N$2:N94))","v":142.55000000000001}]
["2010-01-20","Pham",130.37,null,null,null,null,null,null,null,null,null,{"$f":"ROWS(M$2:M95)","v":94},{"$f":"SMALL($C$2:$C$102,ROWS(N$2:N95))","v":143.85}]
["2009-12-08","Chin",130.5,null,null,null,null,null,null,null,null,null,{"$f":"ROWS(M$2:M96)","v":95},{"$f":"SMALL($C$2:$C$102,ROWS(N$2:N96))","v":145.33000000000001}]
["2010-01-16","Franks",123.13,null,null,null,null,null,null,null,null,null,{"$f":"ROWS(M$2:M97)","v":96},{"$f":"SMALL($C$2:$C$102,ROWS(N$2:N97))","v":147.49}]
["2009-12-19","Gault",131.04,null,null,null,null,null,null,null,null,null,{"$f":"ROWS(M$2:M98)","v":97},{"$f":"SMALL($C$2:$C$102,ROWS(N$2:N98))","v":147.53}]
["2009-12-17","Pham",76.260000000000005,null,null,null,null,null,null,null,null,null,{"$f":"ROWS(M$2:M99)","v":98},{"$f":"SMALL($C$2:$C$102,ROWS(N$2:N99))","v":149.94999999999999}]
["2010-01-19","Pham",78.459999999999994,null,null,null,null,null,null,null,null,null,{"$f":"ROWS(M$2:M100)","v":99},{"$f":"SMALL($C$2:$C$102,ROWS(N$2:N100))","v":150.09}]
["2009-11-21","Gault",79.11,null,null,null,null,null,null,null,null,null,{"$f":"ROWS(M$2:M101)","v":100},{"$f":"SMALL($C$2:$C$102,ROWS(N$2:N101))","v":150.31}]
["2010-02-18","Gault",75.349999999999994,null,null,null,null,null,null,null,null,null,{"$f":"ROWS(M$2:M102)","v":101},{"$f":"SMALL($C$2:$C$102,ROWS(N$2:N102))","v":154.31}]

{"sheet":"661an","index":2,"n_rows":102,"n_cols":16,"rows_kept":102,"cut":false,"hidden":false,"merged":[]}
["Date","SalesRep","Sales ",null,{"$f":"VLOOKUP(F1,{1,\"AVERAGE\";2,\"COUNT\";3,\"COUNTA\";4,\"MAX\";5,\"MIN\";6,\"PRODUCT\";7,\"STDEV.S\";8,\"STDEV.P\";9,\"SUM\";10,\"VAR.S\";11,\"VAR.P\";12,\"MEDIAN\";13,\"MODE.SNGL\";14,\"LARGE\";15,\"SMALL\";16,\"PERCENTILE.INC\";17,\"QUARTILE.INC\";18,\"PERCENTILE.EXC\";19,\"QUARTILE.EXC\"},2,0)","v":"AVERAGE"},1,{"$f":"_xlfn.AGGREGATE(F1,4,$C$2:$C$102)","v":114.13168316831684},null,{"$f":"AVERAGE($C$2:$C$102)","v":114.13168316831684},{"$f":"ShowFormulaToLeft","v":"=AVERAGE($C$2:$C$102)"},null,null,"No",{"$f":"C1","v":"Sales "}]
["2009-12-25","Gault",94.69,null,{"$f":"VLOOKUP(F2,{1,\"AVERAGE\";2,\"COUNT\";3,\"COUNTA\";4,\"MAX\";5,\"MIN\";6,\"PRODUCT\";7,\"STDEV.S\";8,\"STDEV.P\";9,\"SUM\";10,\"VAR.S\";11,\"VAR.P\";12,\"MEDIAN\";13,\"MODE.SNGL\";14,\"LARGE\";15,\"SMALL\";16,\"PERCENTILE.INC\";17,\"QUARTILE.INC\";18,\"PERCENTILE.EXC\";19,\"QUARTILE.EXC\"},2,0)","v":"COUNT"},2,{"$f":"_xlfn.AGGREGATE(F2,4,$C$2:$C$102)","v":101},null,{"$f":"COUNT($C$2:$C$102)","v":101},{"$f":"ShowFormulaToLeft","v":"=COUNT($C$2:$C$102)"},null,null,{"$f":"ROWS(M$2:M2)","v":1},{"$f":"SMALL($C$2:$C$102,ROWS(N$2:N2))","v":75.040000000000006}]
["2009-12-15","Smith",130.19999999999999,null,{"$f":"VLOOKUP(F3,{1,\"AVERAGE\";2,\"COUNT\";3,\"COUNTA\";4,\"MAX\";5,\"MIN\";6,\"PRODUCT\";7,\"STDEV.S\";8,\"STDEV.P\";9,\"SUM\";10,\"VAR.S\";11,\"VAR.P\";12,\"MEDIAN\";13,\"MODE.SNGL\";14,\"LARGE\";15,\"SMALL\";16,\"PERCENTILE.INC\";17,\"QUARTILE.INC\";18,\"PERCENTILE.EXC\";19,\"QUARTILE.EXC\"},2,0)","v":"COUNTA"},3,101,null,{"$f":"COUNTA($C$2:$C$102)","v":101},{"$f":"ShowFormulaToLeft","v":"=COUNTA($C$2:$C$102)"},null,null,{"$f":"ROWS(M$2:M3)","v":2},{"$f":"SMALL($C$2:$C$102,ROWS(N$2:N3))","v":75.17}]
["2009-12-11","Franks",149.94999999999999,null,{"$f":"VLOOKUP(F4,{1,\"AVERAGE\";2,\"COUNT\";3,\"COUNTA\";4,\"MAX\";5,\"MIN\";6,\"PRODUCT\";7,\"STDEV.S\";8,\"STDEV.P\";9,\"SUM\";10,\"VAR.S\";11,\"VAR.P\";12,\"MEDIAN\";13,\"MODE.SNGL\";14,\"LARGE\";15,\"SMALL\";16,\"PERCENTILE.INC\";17,\"QUARTILE.INC\";18,\"PERCENTILE.EXC\";19,\"QUARTILE.EXC\"},2,0)","v":"MAX"},4,154.31,null,{"$f":"MAX($C$2:$C$102)","v":154.31},{"$f":"ShowFormulaToLeft","v":"=MAX($C$2:$C$102)"},null,null,{"$f":"ROWS(M$2:M4)","v":3},{"$f":"SMALL($C$2:$C$102,ROWS(N$2:N4))","v":75.349999999999994}]
["2009-12-01","Gault",94.11,null,{"$f":"VLOOKUP(F5,{1,\"AVERAGE\";2,\"COUNT\";3,\"COUNTA\";4,\"MAX\";5,\"MIN\";6,\"PRODUCT\";7,\"STDEV.S\";8,\"STDEV.P\";9,\"SUM\";10,\"VAR.S\";11,\"VAR.P\";12,\"MEDIAN\";13,\"MODE.SNGL\";14,\"LARGE\";15,\"SMALL\";16,\"PERCENTILE.INC\";17,\"QUARTILE.INC\";18,\"PERCENTILE.EXC\";19,\"QUARTILE.EXC\"},2,0)","v":"MIN"},5,75.040000000000006,null,{"$f":"MIN($C$2:$C$102)","v":75.040000000000006},{"$f":"ShowFormulaToLeft","v":"=MIN($C$2:$C$102)"},null,null,{"$f":"ROWS(M$2:M5)","v":4},{"$f":"SMALL($C$2:$C$102,ROWS(N$2:N5))","v":76.260000000000005}]
["2009-12-11","Franks",136.13999999999999,null,{"$f":"VLOOKUP(F6,{1,\"AVERAGE\";2,\"COUNT\";3,\"COUNTA\";4,\"MAX\";5,\"MIN\";6,\"PRODUCT\";7,\"STDEV.S\";8,\"STDEV.P\";9,\"SUM\";10,\"VAR.S\";11,\"VAR.P\";12,\"MEDIAN\";13,\"MODE.SNGL\";14,\"LARGE\";15,\"SMALL\";16,\"PERCENTILE.INC\";17,\"QUARTILE.INC\";18,\"PERCENTILE.EXC\";19,\"QUARTILE.EXC\"},2,0)","v":"PRODUCT"},6,8.4456823732325592E+206,null,{"$f":"PRODUCT($C$2:$C$102)","v":8.4456823732325592E+206},{"$f":"ShowFormulaToLeft","v":"=PRODUCT($C$2:$C$102)"},null,null,{"$f":"ROWS(M$2:M6)","v":5},{"$f":"SMALL($C$2:$C$102,ROWS(N$2:N6))","v":76.59}]
["2010-02-12","Pham",133.16999999999999,null,{"$f":"VLOOKUP(F7,{1,\"AVERAGE\";2,\"COUNT\";3,\"COUNTA\";4,\"MAX\";5,\"MIN\";6,\"PRODUCT\";7,\"STDEV.S\";8,\"STDEV.P\";9,\"SUM\";10,\"VAR.S\";11,\"VAR.P\";12,\"MEDIAN\";13,\"MODE.SNGL\";14,\"LARGE\";15,\"SMALL\";16,\"PERCENTILE.INC\";17,\"QUARTILE.INC\";18,\"PERCENTILE.EXC\";19,\"QUARTILE.EXC\"},2,0)","v":"STDEV.S"},7,22.121727783756103,null,{"$f":"_xlfn.STDEV.S($C$2:$C$102)","v":22.121727783756103},{"$f":"ShowFormulaToLeft","v":"=STDEV.S($C$2:$C$102)"},null,null,{"$f":"ROWS(M$2:M7)","v":6},{"$f":"SMALL($C$2:$C$102,ROWS(N$2:N7))","v":76.650000000000006}]
["2009-12-07","Smith",80.81,null,{"$f":"VLOOKUP(F8,{1,\"AVERAGE\";2,\"COUNT\";3,\"COUNTA\";4,\"MAX\";5,\"MIN\";6,\"PRODUCT\";7,\"STDEV.S\";8,\"STDEV.P\";9,\"SUM\";10,\"VAR.S\";11,\"VAR.P\";12,\"MEDIAN\";13,\"MODE.SNGL\";14,\"LARGE\";15,\"SMALL\";16,\"PERCENTILE.INC\";17,\"QUARTILE.INC\";18,\"PERCENTILE.EXC\";19,\"QUARTILE.EXC\"},2,0)","v":"STDEV.P"},8,22.011941856538932,null,{"$f":"_xlfn.STDEV.P($C$2:$C$102)","v":22.011941856538932},{"$f":"ShowFormulaToLeft","v":"=STDEV.P($C$2:$C$102)"},null,null,{"$f":"ROWS(M$2:M8)","v":7},{"$f":"SMALL($C$2:$C$102,ROWS(N$2:N8))","v":78.459999999999994}]
["2009-11-23","Smith",125.38,null,{"$f":"VLOOKUP(F9,{1,\"AVERAGE\";2,\"COUNT\";3,\"COUNTA\";4,\"MAX\";5,\"MIN\";6,\"PRODUCT\";7,\"STDEV.S\";8,\"STDEV.P\";9,\"SUM\";10,\"VAR.S\";11,\"VAR.P\";12,\"MEDIAN\";13,\"MODE.SNGL\";14,\"LARGE\";15,\"SMALL\";16,\"PERCENTILE.INC\";17,\"QUARTILE.INC\";18,\"PERCENTILE.EXC\";19,\"QUARTILE.EXC\"},2,0)","v":"SUM"},9,11527.300000000001,null,{"$f":"SUM($C$2:$C$102)","v":11527.300000000001},{"$f":"ShowFormulaToLeft","v":"=SUM($C$2:$C$102)"},null,null,{"$f":"ROWS(M$2:M9)","v":8},{"$f":"SMALL($C$2:$C$102,ROWS(N$2:N9))","v":78.89}]
["2009-11-23","Gault",78.95,null,{"$f":"VLOOKUP(F10,{1,\"AVERAGE\";2,\"COUNT\";3,\"COUNTA\";4,\"MAX\";5,\"MIN\";6,\"PRODUCT\";7,\"STDEV.S\";8,\"STDEV.P\";9,\"SUM\";10,\"VAR.S\";11,\"VAR.P\";12,\"MEDIAN\";13,\"MODE.SNGL\";14,\"LARGE\";15,\"SMALL\";16,\"PERCENTILE.INC\";17,\"QUARTILE.INC\";18,\"PERCENTILE.EXC\";19,\"QUARTILE.EXC\"},2,0)","v":"VAR.S"},10,489.37084013860675,null,{"$f":"_xlfn.VAR.S($C$2:$C$102)","v":489.37084013860675},{"$f":"ShowFormulaToLeft","v":"=VAR.S($C$2:$C$102)"},null,null,{"$f":"ROWS(M$2:M10)","v":9},{"$f":"SMALL($C$2:$C$102,ROWS(N$2:N10))","v":78.95}]
["2010-01-23","Smith",113.86,null,{"$f":"VLOOKUP(F11,{1,\"AVERAGE\";2,\"COUNT\";3,\"COUNTA\";4,\"MAX\";5,\"MIN\";6,\"PRODUCT\";7,\"STDEV.S\";8,\"STDEV.P\";9,\"SUM\";10,\"VAR.S\";11,\"VAR.P\";12,\"MEDIAN\";13,\"MODE.SNGL\";14,\"LARGE\";15,\"SMALL\";16,\"PERCENTILE.INC\";17,\"QUARTILE.INC\";18,\"PERCENTILE.EXC\";19,\"QUARTILE.EXC\"},2,0)","v":"VAR.P"},11,484.52558429565062,null,{"$f":"_xlfn.VAR.P($C$2:$C$102)","v":484.52558429565062},{"$f":"ShowFormulaToLeft","v":"=VAR.P($C$2:$C$102)"},null,null,{"$f":"ROWS(M$2:M11)","v":10},{"$f":"SMALL($C$2:$C$102,ROWS(N$2:N11))","v":79.11}]
["2010-01-21","Pham",139.38,null,{"$f":"VLOOKUP(F12,{1,\"AVERAGE\";2,\"COUNT\";3,\"COUNTA\";4,\"MAX\";5,\"MIN\";6,\"PRODUCT\";7,\"STDEV.S\";8,\"STDEV.P\";9,\"SUM\";10,\"VAR.S\";11,\"VAR.P\";12,\"MEDIAN\";13,\"MODE.SNGL\";14,\"LARGE\";15,\"SMALL\";16,\"PERCENTILE.INC\";17,\"QUARTILE.INC\";18,\"PERCENTILE.EXC\";19,\"QUARTILE.EXC\"},2,0)","v":"MEDIAN"},12,114.93,null,{"$f":"MEDIAN($C$2:$C$102)","v":114.93},{"$f":"ShowFormulaToLeft","v":"=MEDIAN($C$2:$C$102)"},null,null,{"$f":"ROWS(M$2:M12)","v":11},{"$f":"SMALL($C$2:$C$102,ROWS(N$2:N12))","v":79.42}]
["2009-12-20","Gault",98.71,null,{"$f":"VLOOKUP(F13,{1,\"AVERAGE\";2,\"COUNT\";3,\"COUNTA\";4,\"MAX\";5,\"MIN\";6,\"PRODUCT\";7,\"STDEV.S\";8,\"STDEV.P\";9,\"SUM\";10,\"VAR.S\";11,\"VAR.P\";12,\"MEDIAN\";13,\"MODE.SNGL\";14,\"LARGE\";15,\"SMALL\";16,\"PERCENTILE.INC\";17,\"QUARTILE.INC\";18,\"PERCENTILE.EXC\";19,\"QUARTILE.EXC\"},2,0)","v":"MODE.SNGL"},13,{"$error":"#N/A"},null,{"$f":"_xlfn.MODE.SNGL($C$2:$C$102)","v":{"$error":"#N/A"}},{"$f":"ShowFormulaToLeft","v":"=MODE.SNGL($C$2:$C$102)"},null,null,{"$f":"ROWS(M$2:M13)","v":12},{"$f":"SMALL($C$2:$C$102,ROWS(N$2:N13))","v":80.81}]
["2009-12-07","Pham",76.650000000000006,null,null,null,null,null,null,null,null,null,{"$f":"ROWS(M$2:M14)","v":13},{"$f":"SMALL($C$2:$C$102,ROWS(N$2:N14))","v":83.26}]
["2010-02-11","Gault",126.62,null,{"$f":"VLOOKUP(F15,{1,\"AVERAGE\";2,\"COUNT\";3,\"COUNTA\";4,\"MAX\";5,\"MIN\";6,\"PRODUCT\";7,\"STDEV.S\";8,\"STDEV.P\";9,\"SUM\";10,\"VAR.S\";11,\"VAR.P\";12,\"MEDIAN\";13,\"MODE.SNGL\";14,\"LARGE\";15,\"SMALL\";16,\"PERCENTILE.INC\";17,\"QUARTILE.INC\";18,\"PERCENTILE.EXC\";19,\"QUARTILE.EXC\"},2,0)","v":"LARGE"},14,{"$f":"_xlfn.AGGREGATE(F15,4,$C$2:$C$102,H15)","v":147.53},5,null,null,null,null,{"$f":"ROWS(M$2:M15)","v":14},{"$f":"SMALL($C$2:$C$102,ROWS(N$2:N15))","v":83.37}]
["2010-01-13","Franks",107.9,null,{"$f":"VLOOKUP(F16,{1,\"AVERAGE\";2,\"COUNT\";3,\"COUNTA\";4,\"MAX\";5,\"MIN\";6,\"PRODUCT\";7,\"STDEV.S\";8,\"STDEV.P\";9,\"SUM\";10,\"VAR.S\";11,\"VAR.P\";12,\"MEDIAN\";13,\"MODE.SNGL\";14,\"LARGE\";15,\"SMALL\";16,\"PERCENTILE.INC\";17,\"QUARTILE.INC\";18,\"PERCENTILE.EXC\";19,\"QUARTILE.EXC\"},2,0)","v":"SMALL"},15,{"$f":"_xlfn.AGGREGATE(F16,4,$C$2:$C$102,H16)","v":76.59},{"$f":"H15","v":5},null,null,null,null,{"$f":"ROWS(M$2:M16)","v":15},{"$f":"SMALL($C$2:$C$102,ROWS(N$2:N16))","v":85.14}]
["2010-01-28","Gault",130.54,null,{"$f":"VLOOKUP(F17,{1,\"AVERAGE\";2,\"COUNT\";3,\"COUNTA\";4,\"MAX\";5,\"MIN\";6,\"PRODUCT\";7,\"STDEV.S\";8,\"STDEV.P\";9,\"SUM\";10,\"VAR.S\";11,\"VAR.P\";12,\"MEDIAN\";13,\"MODE.SNGL\";14,\"LARGE\";15,\"SMALL\";16,\"PERCENTILE.INC\";17,\"QUARTILE.INC\";18,\"PERCENTILE.EXC\";19,\"QUARTILE.EXC\"},2,0)","v":"PERCENTILE.INC"},16,140.54,0.9,"old method",null,null,null,{"$f":"ROWS(M$2:M17)","v":16},{"$f":"SMALL($C$2:$C$102,ROWS(N$2:N17))","v":86.1}]
["2010-01-25","Gault",140.71,null,{"$f":"VLOOKUP(F18,{1,\"AVERAGE\";2,\"COUNT\";3,\"COUNTA\";4,\"MAX\";5,\"MIN\";6,\"PRODUCT\";7,\"STDEV.S\";8,\"STDEV.P\";9,\"SUM\";10,\"VAR.S\";11,\"VAR.P\";12,\"MEDIAN\";13,\"MODE.SNGL\";14,\"LARGE\";15,\"SMALL\";16,\"PERCENTILE.INC\";17,\"QUARTILE.INC\";18,\"PERCENTILE.EXC\";19,\"QUARTILE.EXC\"},2,0)","v":"QUARTILE.INC"},17,96.17,1,"old method",null,null,null,{"$f":"ROWS(M$2:M18)","v":17},{"$f":"SMALL($C$2:$C$102,ROWS(N$2:N18))","v":87.06}]
["2010-02-10","Sioux",108.72,null,{"$f":"VLOOKUP(F19,{1,\"AVERAGE\";2,\"COUNT\";3,\"COUNTA\";4,\"MAX\";5,\"MIN\";6,\"PRODUCT\";7,\"STDEV.S\";8,\"STDEV.P\";9,\"SUM\";10,\"VAR.S\";11,\"VAR.P\";12,\"MEDIAN\";13,\"MODE.SNGL\";14,\"LARGE\";15,\"SMALL\";16,\"PERCENTILE.INC\";17,\"QUARTILE.INC\";18,\"PERCENTILE.EXC\";19,\"QUARTILE.EXC\"},2,0)","v":"PERCENTILE.EXC"},18,140.67600000000002,{"$f":"H17","v":0.9},"new method",{"$f":"VLOOKUP((COUNT($C$2:$C$102)+1)*$H$17,$M$2:$N$102,2)+(VLOOKUP((COUNT($C$2:$C$102)+1)*$H$17+1,$M$2:$N$102,2)-VLOOKUP((COUNT($C$2:$C$102)+1)*$H$17,$M$2:$N$102,2))*MOD((COUNT($C$2:$C$102)+1)*$H$17,1)","v":140.67600000000002},null,null,{"$f":"ROWS(M$2:M19)","v":18},{"$f":"SMALL($C$2:$C$102,ROWS(N$2:N19))","v":88.51}]
["2009-12-26","Smith",135.18,null,{"$f":"VLOOKUP(F20,{1,\"AVERAGE\";2,\"COUNT\";3,\"COUNTA\";4,\"MAX\";5,\"MIN\";6,\"PRODUCT\";7,\"STDEV.S\";8,\"STDEV.P\";9,\"SUM\";10,\"VAR.S\";11,\"VAR.P\";12,\"MEDIAN\";13,\"MODE.SNGL\";14,\"LARGE\";15,\"SMALL\";16,\"PERCENTILE.INC\";17,\"QUARTILE.INC\";18,\"PERCENTILE.EXC\";19,\"QUARTILE.EXC\"},2,0)","v":"QUARTILE.EXC"},19,95.43,{"$f":"H18","v":1},"new method",null,null,null,{"$f":"ROWS(M$2:M20)","v":19},{"$f":"SMALL($C$2:$C$102,ROWS(N$2:N20))","v":88.69}]
["2009-12-14","Gault",142.55000000000001,null,null,null,null,null,null,null,null,null,{"$f":"ROWS(M$2:M21)","v":20},{"$f":"SMALL($C$2:$C$102,ROWS(N$2:N21))","v":89.11}]
["2010-02-12","Smith",140.54,null,null,null,null,null,null,null,null,null,{"$f":"ROWS(M$2:M22)","v":21},{"$f":"SMALL($C$2:$C$102,ROWS(N$2:N22))","v":93.15}]
["2010-01-19","Franks",75.040000000000006,null,"2nd argument",null,null,null,null,null,null,null,{"$f":"ROWS(M$2:M23)","v":22},{"$f":"SMALL($C$2:$C$102,ROWS(N$2:N23))","v":93.33}]
["2010-02-16","Pham",93.15,null,"option","what it does",null,null,null,null,null,null,{"$f":"ROWS(M$2:M24)","v":23},{"$f":"SMALL($C$2:$C$102,ROWS(N$2:N24))","v":93.37}]
["2010-01-07","Sioux",132.51,null,0,"Ignore nested SUBTOTAL and AGGREGATE functions",null,null,null,null,null,null,{"$f":"ROWS(M$2:M25)","v":24},{"$f":"SMALL($C$2:$C$102,ROWS(N$2:N25))","v":94.11}]
["2010-01-16","Chin",85.14,null,1,"Ignore hidden rows, nested SUBTOTAL and AGGREGATE functions",null,null,null,null,null,null,{"$f":"ROWS(M$2:M26)","v":25},{"$f":"SMALL($C$2:$C$102,ROWS(N$2:N26))","v":94.69}]
["2010-02-15","Franks",108.85,null,2,"Ignore error values, nested SUBTOTAL and AGGREGATE functions",null,null,null,null,null,null,{"$f":"ROWS(M$2:M27)","v":26},{"$f":"SMALL($C$2:$C$102,ROWS(N$2:N27))","v":96.17}]
["2009-12-13","Sioux",139.91999999999999,null,3,"Ignore hidden rows, error values, nested SUBTOTAL and AGGREGATE functions",null,null,null,null,null,null,{"$f":"ROWS(M$2:M28)","v":27},{"$f":"SMALL($C$2:$C$102,ROWS(N$2:N28))","v":98.71}]
["2010-01-04","Franks",104.35,null,4,"Ignore nothing",null,null,null,null,null,null,{"$f":"ROWS(M$2:M29)","v":28},{"$f":"SMALL($C$2:$C$102,ROWS(N$2:N29))","v":100.09}]
["2009-12-14","Gault",88.51,null,5,"Ignore hidden rows",null,null,null,null,null,null,{"$f":"ROWS(M$2:M30)","v":29},{"$f":"SMALL($C$2:$C$102,ROWS(N$2:N30))","v":100.76}]
["2010-02-01","Gault",136.76,null,6,"Ignore error values",null,null,null,null,null,null,{"$f":"ROWS(M$2:M31)","v":30},{"$f":"SMALL($C$2:$C$102,ROWS(N$2:N31))","v":100.83}]
["2009-11-25","Pham",109.57,null,7,"Ignore hidden rows and error values",null,null,null,null,null,null,{"$f":"ROWS(M$2:M32)","v":31},{"$f":"SMALL($C$2:$C$102,ROWS(N$2:N32))","v":102.17}]
["2010-02-07","Franks",125.81,null,null,null,null,null,null,null,null,null,{"$f":"ROWS(M$2:M33)","v":32},{"$f":"SMALL($C$2:$C$102,ROWS(N$2:N33))","v":102.24}]
["2009-12-22","Pham",150.09,null,null,null,null,null,null,null,null,null,{"$f":"ROWS(M$2:M34)","v":33},{"$f":"SMALL($C$2:$C$102,ROWS(N$2:N34))","v":102.64}]
["2009-12-07","Sioux",147.53,null,null,null,null,null,null,null,null,null,{"$f":"ROWS(M$2:M35)","v":34},{"$f":"SMALL($C$2:$C$102,ROWS(N$2:N35))","v":104.35}]
["2009-12-12","Chin",102.17,null,null,null,null,null,null,null,null,null,{"$f":"ROWS(M$2:M36)","v":35},{"$f":"SMALL($C$2:$C$102,ROWS(N$2:N36))","v":104.36}]
["2009-12-30","Smith",114.4,null,null,null,null,null,null,null,null,null,{"$f":"ROWS(M$2:M37)","v":36},{"$f":"SMALL($C$2:$C$102,ROWS(N$2:N37))","v":104.5}]
["2009-12-27","Chin",129.65,null,null,null,null,null,null,null,null,null,{"$f":"ROWS(M$2:M38)","v":37},{"$f":"SMALL($C$2:$C$102,ROWS(N$2:N38))","v":104.57}]
["2009-12-29","Chin",128.94999999999999,null,null,null,null,null,null,null,null,null,{"$f":"ROWS(M$2:M39)","v":38},{"$f":"SMALL($C$2:$C$102,ROWS(N$2:N39))","v":106.94}]
["2010-01-05","Gault",121.33,null,null,null,null,null,null,null,null,null,{"$f":"ROWS(M$2:M40)","v":39},{"$f":"SMALL($C$2:$C$102,ROWS(N$2:N40))","v":107.9}]
["2009-12-15","Pham",102.64,null,null,null,null,null,null,null,null,null,{"$f":"ROWS(M$2:M41)","v":40},{"$f":"SMALL($C$2:$C$102,ROWS(N$2:N41))","v":108.54}]
["2009-12-01","Pham",132.12,null,null,null,null,null,null,null,null,null,{"$f":"ROWS(M$2:M42)","v":41},{"$f":"SMALL($C$2:$C$102,ROWS(N$2:N42))","v":108.72}]
["2010-02-07","Franks",100.83,null,null,null,null,null,null,null,null,null,{"$f":"ROWS(M$2:M43)","v":42},{"$f":"SMALL($C$2:$C$102,ROWS(N$2:N43))","v":108.85}]
["2009-11-26","Sioux",79.42,null,null,null,null,null,null,null,null,null,{"$f":"ROWS(M$2:M44)","v":43},{"$f":"SMALL($C$2:$C$102,ROWS(N$2:N44))","v":109.57}]
["2010-01-04","Pham",100.09,null,null,null,null,null,null,null,null,null,{"$f":"ROWS(M$2:M45)","v":44},{"$f":"SMALL($C$2:$C$102,ROWS(N$2:N45))","v":109.7}]
["2010-01-29","Franks",83.37,null,null,null,null,null,null,null,null,null,{"$f":"ROWS(M$2:M46)","v":45},{"$f":"SMALL($C$2:$C$102,ROWS(N$2:N46))","v":112.03}]
["2010-01-19","Franks",89.11,null,null,null,null,null,null,null,null,null,{"$f":"ROWS(M$2:M47)","v":46},{"$f":"SMALL($C$2:$C$102,ROWS(N$2:N47))","v":112.5}]
["2010-02-14","Smith",126.97,null,null,null,null,null,null,null,null,null,{"$f":"ROWS(M$2:M48)","v":47},{"$f":"SMALL($C$2:$C$102,ROWS(N$2:N48))","v":113.86}]
["2009-12-03","Smith",154.31,null,null,null,null,null,null,null,null,null,{"$f":"ROWS(M$2:M49)","v":48},{"$f":"SMALL($C$2:$C$102,ROWS(N$2:N49))","v":114.4}]
["2010-01-02","Sioux",76.59,null,null,null,null,null,null,null,null,null,{"$f":"ROWS(M$2:M50)","v":49},{"$f":"SMALL($C$2:$C$102,ROWS(N$2:N50))","v":114.53}]
["2009-12-29","Gault",106.94,null,null,null,null,null,null,null,null,null,{"$f":"ROWS(M$2:M51)","v":50},{"$f":"SMALL($C$2:$C$102,ROWS(N$2:N51))","v":114.54}]
["2009-11-26","Chin",129.86000000000001,null,null,null,null,null,null,null,null,null,{"$f":"ROWS(M$2:M52)","v":51},{"$f":"SMALL($C$2:$C$102,ROWS(N$2:N52))","v":114.93}]
["2009-12-24","Pham",100.76,null,null,null,null,null,null,null,null,null,{"$f":"ROWS(M$2:M53)","v":52},{"$f":"SMALL($C$2:$C$102,ROWS(N$2:N53))","v":115.67}]
["2009-12-10","Gault",124.59,null,null,null,null,null,null,null,null,null,{"$f":"ROWS(M$2:M54)","v":53},{"$f":"SMALL($C$2:$C$102,ROWS(N$2:N54))","v":117.63}]
["2009-12-31","Smith",150.31,null,null,null,null,null,null,null,null,null,{"$f":"ROWS(M$2:M55)","v":54},{"$f":"SMALL($C$2:$C$102,ROWS(N$2:N55))","v":119.09}]
["2009-12-16","Franks",119.78,null,null,null,null,null,null,null,null,null,{"$f":"ROWS(M$2:M56)","v":55},{"$f":"SMALL($C$2:$C$102,ROWS(N$2:N56))","v":119.53}]
["2010-01-03","Pham",93.37,null,null,null,null,null,null,null,null,null,{"$f":"ROWS(M$2:M57)","v":56},{"$f":"SMALL($C$2:$C$102,ROWS(N$2:N57))","v":119.78}]
["2009-12-26","Chin",87.06,null,null,null,null,null,null,null,null,null,{"$f":"ROWS(M$2:M58)","v":57},{"$f":"SMALL($C$2:$C$102,ROWS(N$2:N58))","v":121.33}]
["2010-01-05","Smith",147.49,null,null,null,null,null,null,null,null,null,{"$f":"ROWS(M$2:M59)","v":58},{"$f":"SMALL($C$2:$C$102,ROWS(N$2:N59))","v":122.21}]
["2009-12-19","Smith",136.94,null,null,null,null,null,null,null,null,null,{"$f":"ROWS(M$2:M60)","v":59},{"$f":"SMALL($C$2:$C$102,ROWS(N$2:N60))","v":123.13}]
["2009-11-20","Gault",93.33,null,null,null,null,null,null,null,null,null,{"$f":"ROWS(M$2:M61)","v":60},{"$f":"SMALL($C$2:$C$102,ROWS(N$2:N61))","v":124.59}]
["2010-01-03","Smith",128.97,null,null,null,null,null,null,null,null,null,{"$f":"ROWS(M$2:M62)","v":61},{"$f":"SMALL($C$2:$C$102,ROWS(N$2:N62))","v":125.38}]
["2009-12-14","Smith",114.93,null,null,null,null,null,null,null,null,null,{"$f":"ROWS(M$2:M63)","v":62},{"$f":"SMALL($C$2:$C$102,ROWS(N$2:N63))","v":125.81}]
["2010-01-01","Sioux",104.57,null,null,null,null,null,null,null,null,null,{"$f":"ROWS(M$2:M64)","v":63},{"$f":"SMALL($C$2:$C$102,ROWS(N$2:N64))","v":126.33}]
["2009-11-27","Sioux",119.53,null,null,null,null,null,null,null,null,null,{"$f":"ROWS(M$2:M65)","v":64},{"$f":"SMALL($C$2:$C$102,ROWS(N$2:N65))","v":126.62}]
["2010-01-01","Pham",127.99,null,null,null,null,null,null,null,null,null,{"$f":"ROWS(M$2:M66)","v":65},{"$f":"SMALL($C$2:$C$102,ROWS(N$2:N66))","v":126.97}]
["2009-12-03","Smith",88.69,null,null,null,null,null,null,null,null,null,{"$f":"ROWS(M$2:M67)","v":66},{"$f":"SMALL($C$2:$C$102,ROWS(N$2:N67))","v":127.99}]
["2009-11-25","Smith",115.67,null,null,null,null,null,null,null,null,null,{"$f":"ROWS(M$2:M68)","v":67},{"$f":"SMALL($C$2:$C$102,ROWS(N$2:N68))","v":128.15}]
["2010-01-07","Pham",114.54,null,null,null,null,null,null,null,null,null,{"$f":"ROWS(M$2:M69)","v":68},{"$f":"SMALL($C$2:$C$102,ROWS(N$2:N69))","v":128.94999999999999}]
["2010-02-02","Smith",128.15,null,null,null,null,null,null,null,null,null,{"$f":"ROWS(M$2:M70)","v":69},{"$f":"SMALL($C$2:$C$102,ROWS(N$2:N70))","v":128.97}]
["2010-02-08","Gault",126.33,null,null,null,null,null,null,null,null,null,{"$f":"ROWS(M$2:M71)","v":70},{"$f":"SMALL($C$2:$C$102,ROWS(N$2:N71))","v":129.65}]
["2010-01-13","Smith",112.03,null,null,null,null,null,null,null,null,null,{"$f":"ROWS(M$2:M72)","v":71},{"$f":"SMALL($C$2:$C$102,ROWS(N$2:N72))","v":129.86000000000001}]
["2009-11-20","Smith",145.33000000000001,null,null,null,null,null,null,null,null,null,{"$f":"ROWS(M$2:M73)","v":72},{"$f":"SMALL($C$2:$C$102,ROWS(N$2:N73))","v":130.19999999999999}]
["2009-12-23","Gault",109.7,null,null,null,null,null,null,null,null,null,{"$f":"ROWS(M$2:M74)","v":73},{"$f":"SMALL($C$2:$C$102,ROWS(N$2:N74))","v":130.37}]
["2009-11-26","Sioux",139.13,null,null,null,null,null,null,null,null,null,{"$f":"ROWS(M$2:M75)","v":74},{"$f":"SMALL($C$2:$C$102,ROWS(N$2:N75))","v":130.5}]
["2009-12-01","Sioux",112.5,null,null,null,null,null,null,null,null,null,{"$f":"ROWS(M$2:M76)","v":75},{"$f":"SMALL($C$2:$C$102,ROWS(N$2:N76))","v":130.54}]
["2009-11-29","Pham",122.21,null,null,null,null,null,null,null,null,null,{"$f":"ROWS(M$2:M77)","v":76},{"$f":"SMALL($C$2:$C$102,ROWS(N$2:N77))","v":131.04}]
["2010-01-13","Smith",135.77000000000001,null,null,null,null,null,null,null,null,null,{"$f":"ROWS(M$2:M78)","v":77},{"$f":"SMALL($C$2:$C$102,ROWS(N$2:N78))","v":132.12}]
["2010-01-09","Pham",75.17,null,null,null,null,null,null,null,null,null,{"$f":"ROWS(M$2:M79)","v":78},{"$f":"SMALL($C$2:$C$102,ROWS(N$2:N79))","v":132.51}]
["2010-01-30","Sioux",104.5,null,null,null,null,null,null,null,null,null,{"$f":"ROWS(M$2:M80)","v":79},{"$f":"SMALL($C$2:$C$102,ROWS(N$2:N80))","v":133.16999999999999}]
["2010-02-04","Gault",86.1,null,null,null,null,null,null,null,null,null,{"$f":"ROWS(M$2:M81)","v":80},{"$f":"SMALL($C$2:$C$102,ROWS(N$2:N81))","v":134.11000000000001}]
["2010-01-02","Sioux",143.85,null,null,null,null,null,null,null,null,null,{"$f":"ROWS(M$2:M82)","v":81},{"$f":"SMALL($C$2:$C$102,ROWS(N$2:N82))","v":135.02000000000001}]
["2010-01-16","Gault",104.36,null,null,null,null,null,null,null,null,null,{"$f":"ROWS(M$2:M83)","v":82},{"$f":"SMALL($C$2:$C$102,ROWS(N$2:N83))","v":135.18}]
["2009-12-28","Smith",135.02000000000001,null,null,null,null,null,null,null,null,null,{"$f":"ROWS(M$2:M84)","v":83},{"$f":"SMALL($C$2:$C$102,ROWS(N$2:N84))","v":135.77000000000001}]
["2009-12-26","Pham",83.26,null,null,null,null,null,null,null,null,null,{"$f":"ROWS(M$2:M85)","v":84},{"$f":"SMALL($C$2:$C$102,ROWS(N$2:N85))","v":136.13999999999999}]
["2009-11-28","Sioux",114.53,null,null,null,null,null,null,null,null,null,{"$f":"ROWS(M$2:M86)","v":85},{"$f":"SMALL($C$2:$C$102,ROWS(N$2:N86))","v":136.76}]
["2010-02-02","Smith",117.63,null,null,null,null,null,null,null,null,null,{"$f":"ROWS(M$2:M87)","v":86},{"$f":"SMALL($C$2:$C$102,ROWS(N$2:N87))","v":136.94}]
["2009-12-27","Gault",102.24,null,null,null,null,null,null,null,null,null,{"$f":"ROWS(M$2:M88)","v":87},{"$f":"SMALL($C$2:$C$102,ROWS(N$2:N88))","v":139.13}]
["2010-02-01","Chin",139.21,null,null,null,null,null,null,null,null,null,{"$f":"ROWS(M$2:M89)","v":88},{"$f":"SMALL($C$2:$C$102,ROWS(N$2:N89))","v":139.21}]
["2009-12-25","Smith",119.09,null,null,null,null,null,null,null,null,null,{"$f":"ROWS(M$2:M90)","v":89},{"$f":"SMALL($C$2:$C$102,ROWS(N$2:N90))","v":139.38}]
["2010-01-17","Pham",134.11000000000001,null,null,null,null,null,null,null,null,null,{"$f":"ROWS(M$2:M91)","v":90},{"$f":"SMALL($C$2:$C$102,ROWS(N$2:N91))","v":139.91999999999999}]
["2010-01-15","Sioux",96.17,null,null,null,null,null,null,null,null,null,{"$f":"ROWS(M$2:M92)","v":91},{"$f":"SMALL($C$2:$C$102,ROWS(N$2:N92))","v":140.54},null,{"$f":"N93-N92","v":0.17000000000001592}]
["2010-01-10","Smith",108.54,null,null,null,null,null,null,null,null,null,{"$f":"ROWS(M$2:M93)","v":92},{"$f":"SMALL($C$2:$C$102,ROWS(N$2:N93))","v":140.71},null,{"$f":"P92*0.8","v":0.13600000000001275}]
["2010-01-05","Gault",78.89,null,null,null,null,null,null,null,null,null,{"$f":"ROWS(M$2:M94)","v":93},{"$f":"SMALL($C$2:$C$102,ROWS(N$2:N94))","v":142.55000000000001}]
["2010-01-20","Pham",130.37,null,null,null,null,null,null,null,null,null,{"$f":"ROWS(M$2:M95)","v":94},{"$f":"SMALL($C$2:$C$102,ROWS(N$2:N95))","v":143.85}]
["2009-12-08","Chin",130.5,null,null,null,null,null,null,null,null,null,{"$f":"ROWS(M$2:M96)","v":95},{"$f":"SMALL($C$2:$C$102,ROWS(N$2:N96))","v":145.33000000000001}]
["2010-01-16","Franks",123.13,null,null,null,null,null,null,null,null,null,{"$f":"ROWS(M$2:M97)","v":96},{"$f":"SMALL($C$2:$C$102,ROWS(N$2:N97))","v":147.49}]
["2009-12-19","Gault",131.04,null,null,null,null,null,null,null,null,null,{"$f":"ROWS(M$2:M98)","v":97},{"$f":"SMALL($C$2:$C$102,ROWS(N$2:N98))","v":147.53}]
["2009-12-17","Pham",76.260000000000005,null,null,null,null,null,null,null,null,null,{"$f":"ROWS(M$2:M99)","v":98},{"$f":"SMALL($C$2:$C$102,ROWS(N$2:N99))","v":149.94999999999999}]
["2010-01-19","Pham",78.459999999999994,null,null,null,null,null,null,null,null,null,{"$f":"ROWS(M$2:M100)","v":99},{"$f":"SMALL($C$2:$C$102,ROWS(N$2:N100))","v":150.09}]
["2009-11-21","Gault",79.11,null,null,null,null,null,null,null,null,null,{"$f":"ROWS(M$2:M101)","v":100},{"$f":"SMALL($C$2:$C$102,ROWS(N$2:N101))","v":150.31}]
["2010-02-18","Gault",75.349999999999994,null,null,null,null,null,null,null,null,null,{"$f":"ROWS(M$2:M102)","v":101},{"$f":"SMALL($C$2:$C$102,ROWS(N$2:N102))","v":154.31}]

{"sheet":"662","index":3,"n_rows":30,"n_cols":9,"rows_kept":30,"cut":false,"hidden":false,"merged":[]}
["The AGGREGATE function is designed for columns of data, or vertical ranges. It is not designed for rows of data, or horizontal ranges. For example, when you subtotal a horizontal range using option 1, such as AGGREGATE(1, 1, ref1), hiding a column does not affect the aggregate sum value. But, hiding a row in vertical range does affect the aggregate."]
[]
["Date","2010-07-19","2010-07-20","2010-07-21","2010-07-22","2010-07-23","2010-07-24","2010-07-25","2010-07-26"]
["Sales",1,1,1,1,1,1,1,1]
[]
["Date","Sales"]
["2010-07-19",1]
["2010-07-20",1]
["2010-07-21",1]
["2010-07-22",1]
["2010-07-23",1]
["2010-07-24",1]
["2010-07-25",1]
["2010-07-26",1]
[]
["rows",null,"Total"]
["columns ignored",null,"Total"]
["rows",null,"SUBTOTAL function"]
["rows",null,"AGGREGATE options argument = 7"]
[]
["2nd argument"]
["option","what it does"]
[0,"Ignore nested SUBTOTAL and AGGREGATE functions"]
[1,"Ignore hidden rows, nested SUBTOTAL and AGGREGATE functions"]
[2,"Ignore error values, nested SUBTOTAL and AGGREGATE functions"]
[3,"Ignore hidden rows, error values, nested SUBTOTAL and AGGREGATE functions"]
[4,"Ignore nothing"]
[5,"Ignore hidden rows"]
[6,"Ignore error values"]
[7,"Ignore hidden rows and error values"]

{"sheet":"662an","index":4,"n_rows":30,"n_cols":9,"rows_kept":30,"cut":false,"hidden":false,"merged":[]}
["The AGGREGATE function is designed for columns of data, or vertical ranges. It is not designed for rows of data, or horizontal ranges. For example, when you subtotal a horizontal range using option 1, such as AGGREGATE(1, 1, ref1), hiding a column does not affect the aggregate sum value. But, hiding a row in vertical range does affect the aggregate."]
[]
["Date","2010-07-19","2010-07-20","2010-07-21","2010-07-22","2010-07-23","2010-07-24","2010-07-25","2010-07-26"]
["Sales",1,1,1,1,1,1,1,1]
[]
["Date","Sales"]
["2010-07-19",1]
["2010-07-20",1]
["2010-07-21",{"$f":"1/0","v":{"$error":"#DIV/0!"}}]
["2010-07-22",1]
["2010-07-23",1]
["2010-07-24",1]
["2010-07-25",1]
["2010-07-26",1]
[]
["rows",{"$f":"_xlfn.AGGREGATE(9,5,B7:B14)","v":{"$error":"#DIV/0!"}},"Total"]
["columns ignored",{"$f":"_xlfn.AGGREGATE(9,5,B4:I4)","v":8},"Total"]
["rows",{"$f":"SUBTOTAL(109,B7:B14)","v":{"$error":"#DIV/0!"}},"SUBTOTAL function"]
["rows",{"$f":"_xlfn.AGGREGATE(9,7,B7:B13)","v":4},"AGGREGATE options argument = 7"]
[]
["2nd argument"]
["option","what it does"]
[0,"Ignore nested SUBTOTAL and AGGREGATE functions"]
[1,"Ignore hidden rows, nested SUBTOTAL and AGGREGATE functions"]
[2,"Ignore error values, nested SUBTOTAL and AGGREGATE functions"]
[3,"Ignore hidden rows, error values, nested SUBTOTAL and AGGREGATE functions"]
[4,"Ignore nothing"]
[5,"Ignore hidden rows"]
[6,"Ignore error values"]
[7,"Ignore hidden rows and error values"]

{"sheet":"663","index":5,"n_rows":28,"n_cols":9,"rows_kept":28,"cut":false,"hidden":false,"merged":[]}
["Date","Product","Lookup Price",null,null,null,null,"Pro 1",10]
["2010-07-19","Pro 1",{"$f":"VLOOKUP(B2,$H$1:$I$3,2,0)","v":10},null,null,null,null,"Pro 2",205]
["2010-07-20","Pro 2",205,null,null,null,null,"Pro 3",98]
["2010-07-21","Pro 3",98]
["2010-07-22","Pro 1",10]
["2010-07-23","Pro 2",205]
["2010-07-24","Pro 3",98]
["2010-07-25","Pro 4",{"$error":"#N/A"}]
["2010-07-26","Pro 2",205]
["2010-07-27","Pro 3",98]
["2010-07-28","Pro 5",{"$error":"#N/A"}]
["2010-07-29","Pro 2",205]
["2010-07-30","Pro 3",98]
[null,"Total",null,"SUM does not like errors"]
[null,"Total",null,"old method requires Ctrl + Shift = Enter"]
[null,"Total",null,"just errors"]
[null,"Total",null,"errors and hidden"]
[]
["2nd argument"]
["option","what it does"]
[0,"Ignore nested SUBTOTAL and AGGREGATE functions"]
[1,"Ignore hidden rows, nested SUBTOTAL and AGGREGATE functions"]
[2,"Ignore error values, nested SUBTOTAL and AGGREGATE functions"]
[3,"Ignore hidden rows, error values, nested SUBTOTAL and AGGREGATE functions"]
[4,"Ignore nothing"]
[5,"Ignore hidden rows"]
[6,"Ignore error values"]
[7,"Ignore hidden rows and error values"]

{"sheet":"663an","index":6,"n_rows":28,"n_cols":9,"rows_kept":28,"cut":false,"hidden":false,"merged":[]}
["Date","Product","Lookup Price",null,null,null,null,"Pro 1",10]
["2010-07-19","Pro 1",{"$f":"VLOOKUP(B2,$H$1:$I$3,2,0)","v":10},null,null,null,null,"Pro 2",205]
["2010-07-20","Pro 2",205,null,null,null,null,"Pro 3",98]
["2010-07-21","Pro 3",98]
["2010-07-22","Pro 1",10]
["2010-07-23","Pro 2",205]
["2010-07-24","Pro 3",98]
["2010-07-25","Pro 4",{"$error":"#N/A"}]
["2010-07-26","Pro 2",205]
["2010-07-27","Pro 3",98]
["2010-07-28","Pro 5",{"$error":"#N/A"}]
["2010-07-29","Pro 2",205]
["2010-07-30","Pro 3",98]
[null,"Total",{"$f":"SUM(C2:C13)","v":{"$error":"#N/A"}},"SUM does not like errors"]
[null,"Total",{"$f":"SUM(IF(ISNUMBER(C2:C13),C2:C13))","v":1232},"old method requires Ctrl + Shift = Enter"]
[null,"Total",{"$f":"_xlfn.AGGREGATE(9,6,C2:C13)","v":1232},"just errors"]
[null,"Total",{"$f":"_xlfn.AGGREGATE(9,7,C2:C13)","v":1027},"errors and hidden"]
[]
["2nd argument"]
["option","what it does"]
[0,"Ignore nested SUBTOTAL and AGGREGATE functions"]
[1,"Ignore hidden rows, nested SUBTOTAL and AGGREGATE functions"]
[2,"Ignore error values, nested SUBTOTAL and AGGREGATE functions"]
[3,"Ignore hidden rows, error values, nested SUBTOTAL and AGGREGATE functions"]
[4,"Ignore nothing"]
[5,"Ignore hidden rows"]
[6,"Ignore error values"]
[7,"Ignore hidden rows and error values"]

{"sheet":"664","index":7,"n_rows":28,"n_cols":8,"rows_kept":28,"cut":false,"hidden":false,"merged":[]}
["Date","Product","SalesRep","Sales",null,null,"Avoid Nested SUBTOTALS"]
["2012-11-29","Bellen","Chin",988,null,null,{"$f":"AVERAGE(D2:D16)","v":1235.5999999999999},{"$f":"ShowFormulaToLeft","v":"=AVERAGE(D2:D16)"}]
["2011-02-09","Sunset","Chin",315,null,null,{"$f":"AVERAGE(D2:D3,D5:D6,D8,D10:D12,D14)","v":686.44444444444446},{"$f":"ShowFormulaToLeft","v":"=AVERAGE(D2:D3,D5:D6,D8,D10:D12,D14)"}]
[null,null,"Chin Total",{"$f":"SUBTOTAL(9,D2:D3)","v":1303},null,"Mean - Average",null,{"$f":"ShowFormulaToLeft","v":""}]
["2012-09-24","Sunset","Gault",315,null,"Mean - Average",null,{"$f":"ShowFormulaToLeft","v":""}]
["2011-08-30","Sunset","Gault",682,null,"Median",null,{"$f":"ShowFormulaToLeft","v":""}]
[null,null,"Gault Total",{"$f":"SUBTOTAL(9,D5:D6)","v":997},null,"Mode",null,{"$f":"ShowFormulaToLeft","v":""}]
["2012-08-19","Bellen","Pham",682]
[null,null,"Pham Total",{"$f":"SUBTOTAL(9,D8:D8)","v":682}]
["2012-05-17","Quad","Sioux",621]
["2012-07-16","Sunshine","Sioux",988]
["2011-09-21","Quad","Sioux",621]
[null,null,"Sioux Total",{"$f":"SUBTOTAL(9,D10:D12)","v":2230}]
["2012-03-31","Carlota","Smith",966]
[null,null,"Smith Total",{"$f":"SUBTOTAL(9,D14:D14)","v":966}]
[null,null,"Grand Total",{"$f":"SUBTOTAL(9,D2:D14)","v":6178}]
[]
[]
["2nd argument"]
["option","what it does"]
[0,"Ignore nested SUBTOTAL and AGGREGATE functions"]
[1,"Ignore hidden rows, nested SUBTOTAL and AGGREGATE functions"]
[2,"Ignore error values, nested SUBTOTAL and AGGREGATE functions"]
[3,"Ignore hidden rows, error values, nested SUBTOTAL and AGGREGATE functions"]
[4,"Ignore nothing"]
[5,"Ignore hidden rows"]
[6,"Ignore error values"]
[7,"Ignore hidden rows and error values"]

{"sheet":"664an","index":8,"n_rows":28,"n_cols":8,"rows_kept":28,"cut":false,"hidden":false,"merged":[]}
["Date","Product","SalesRep","Sales",null,null,"Avoid Nested SUBTOTALS"]
["2012-11-29","Bellen","Chin",988,null,null,{"$f":"AVERAGE(D2:D16)","v":1235.5999999999999},{"$f":"ShowFormulaToLeft","v":"=AVERAGE(D2:D16)"}]
["2011-02-09","Sunset","Chin",315,null,null,{"$f":"AVERAGE(D2:D3,D5:D6,D8,D10:D12,D14)","v":686.44444444444446},{"$f":"ShowFormulaToLeft","v":"=AVERAGE(D2:D3,D5:D6,D8,D10:D12,D14)"}]
[null,null,"Chin Total",{"$f":"SUBTOTAL(9,D2:D3)","v":1303},null,"Mean - Average",{"$f":"_xlfn.AGGREGATE(1,0,D2:D16)","v":686.44444444444446},{"$f":"ShowFormulaToLeft","v":"=AGGREGATE(1,0,D2:D16)"}]
["2012-09-24","Sunset","Gault",315,null,"Mean - Average",{"$f":"SUBTOTAL(1,D2:D16)","v":686.44444444444446},{"$f":"ShowFormulaToLeft","v":"=SUBTOTAL(1,D2:D16)"}]
["2011-08-30","Sunset","Gault",682,null,"Median",{"$f":"_xlfn.AGGREGATE(12,0,D2:D16)","v":682},{"$f":"ShowFormulaToLeft","v":"=AGGREGATE(12,0,D2:D16)"}]
[null,null,"Gault Total",{"$f":"SUBTOTAL(9,D5:D6)","v":997},null,"Mode",{"$f":"_xlfn.AGGREGATE(13,0,D2:D16)","v":988},{"$f":"ShowFormulaToLeft","v":"=AGGREGATE(13,0,D2:D16)"}]
["2012-08-19","Bellen","Pham",682]
[null,null,"Pham Total",{"$f":"SUBTOTAL(9,D8:D8)","v":682}]
["2012-05-17","Quad","Sioux",621]
["2012-07-16","Sunshine","Sioux",988]
["2011-09-21","Quad","Sioux",621]
[null,null,"Sioux Total",{"$f":"SUBTOTAL(9,D10:D12)","v":2230}]
["2012-03-31","Carlota","Smith",966]
[null,null,"Smith Total",{"$f":"SUBTOTAL(9,D14:D14)","v":966}]
[null,null,"Grand Total",{"$f":"SUBTOTAL(9,D2:D14)","v":6178}]
[]
[]
["2nd argument"]
["option","what it does"]
[0,"Ignore nested SUBTOTAL and AGGREGATE functions"]
[1,"Ignore hidden rows, nested SUBTOTAL and AGGREGATE functions"]
[2,"Ignore error values, nested SUBTOTAL and AGGREGATE functions"]
[3,"Ignore hidden rows, error values, nested SUBTOTAL and AGGREGATE functions"]
[4,"Ignore nothing"]
[5,"Ignore hidden rows"]
[6,"Ignore error values"]
[7,"Ignore hidden rows and error values"]

{"sheet":"665","index":9,"n_rows":107,"n_cols":3,"rows_kept":107,"cut":false,"hidden":false,"merged":[]}
["Median for only filtered",null,{"$f":"ShowFormulaToLeft","v":""}]
["add only filtered",null,{"$f":"ShowFormulaToLeft","v":""}]
["add only filtered",null,{"$f":"ShowFormulaToLeft","v":""}]
[]
["Date","SalesRep","Sales "]
["2009-12-25","Gault",94.69]
["2009-12-15","Smith",130.19999999999999]
["2009-12-11","Franks",149.94999999999999]
["2009-12-01","Gault",94.11]
["2009-12-11","Franks",136.13999999999999]
["2010-02-12","Pham",133.16999999999999]
["2009-12-07","Smith",80.81]
["2009-11-23","Smith",125.38]
["2009-11-23","Gault",78.95]
["2010-01-23","Smith",113.86]
["2010-01-21","Pham",139.38]
["2009-12-20","Gault",98.71]
["2009-12-07","Pham",76.650000000000006]
["2010-02-11","Gault",126.62]
["2010-01-13","Franks",107.9]
["2010-01-28","Gault",130.54]
["2010-01-25","Gault",140.71]
["2010-02-10","Sioux",108.72]
["2009-12-26","Smith",135.18]
["2009-12-14","Gault",142.55000000000001]
["2010-02-12","Smith",140.54]
["2010-01-19","Franks",75.040000000000006]
["2010-02-16","Pham",93.15]
["2010-01-07","Sioux",132.51]
["2010-01-16","Chin",85.14]
["2010-02-15","Franks",108.85]
["2009-12-13","Sioux",139.91999999999999]
["2010-01-04","Franks",104.35]
["2009-12-14","Gault",88.51]
["2010-02-01","Gault",136.76]
["2009-11-25","Pham",109.57]
["2010-02-07","Franks",125.81]
["2009-12-22","Pham",150.09]
["2009-12-07","Sioux",147.53]
["2009-12-12","Chin",102.17]
["2009-12-30","Smith",114.4]
["2009-12-27","Chin",129.65]
["2009-12-29","Chin",128.94999999999999]
["2010-01-05","Gault",121.33]
["2009-12-15","Pham",102.64]
["2009-12-01","Pham",132.12]
["2010-02-07","Franks",100.83]
["2009-11-26","Sioux",79.42]
["2010-01-04","Pham",100.09]
["2010-01-29","Franks",83.37]
["2010-01-19","Franks",89.11]
["2010-02-14","Smith",126.97]
["2009-12-03","Smith",154.31]
["2010-01-02","Sioux",76.59]
["2009-12-29","Gault",106.94]
["2009-11-26","Chin",129.86000000000001]
["2009-12-24","Pham",100.76]
["2009-12-10","Gault",124.59]
["2009-12-31","Smith",150.31]
["2009-12-16","Franks",119.78]
["2010-01-03","Pham",93.37]
["2009-12-26","Chin",87.06]
["2010-01-05","Smith",147.49]
["2009-12-19","Smith",136.94]
["2009-11-20","Gault",93.33]
["2010-01-03","Smith",128.97]
["2009-12-14","Smith",114.93]
["2010-01-01","Sioux",104.57]
["2009-11-27","Sioux",119.53]
["2010-01-01","Pham",127.99]
["2009-12-03","Smith",88.69]
["2009-11-25","Smith",115.67]
["2010-01-07","Pham",114.54]
["2010-02-02","Smith",128.15]
["2010-02-08","Gault",126.33]
["2010-01-13","Smith",112.03]
["2009-11-20","Smith",145.33000000000001]
["2009-12-23","Gault",109.7]
["2009-11-26","Sioux",139.13]
["2009-12-01","Sioux",112.5]
["2009-11-29","Pham",122.21]
["2010-01-13","Smith",135.77000000000001]
["2010-01-09","Pham",75.17]
["2010-01-30","Sioux",104.5]
["2010-02-04","Gault",86.1]
["2010-01-02","Sioux",143.85]
["2010-01-16","Gault",104.36]
["2009-12-28","Smith",135.02000000000001]
["2009-12-26","Pham",83.26]
["2009-11-28","Sioux",114.53]
["2010-02-02","Smith",117.63]
["2009-12-27","Gault",102.24]
["2010-02-01","Chin",139.21]
["2009-12-25","Smith",119.09]
["2010-01-17","Pham",134.11000000000001]
["2010-01-15","Sioux",96.17]
["2010-01-10","Smith",108.54]
["2010-01-05","Gault",78.89]
["2010-01-20","Pham",130.37]
["2009-12-08","Chin",130.5]
["2010-01-16","Franks",123.13]
["2009-12-19","Gault",131.04]
["2009-12-17","Pham",76.260000000000005]
["2010-01-19","Pham",78.459999999999994]
["2009-11-21","Gault",79.11]
["2010-02-18","Gault",75.349999999999994]
[null,null,{"$f":"SUBTOTAL(9,C6:C106)","v":6010.91}]

{"sheet":"665an","index":10,"n_rows":107,"n_cols":3,"rows_kept":107,"cut":false,"hidden":false,"merged":[]}
["Median for only filtered",{"$f":"_xlfn.AGGREGATE(12,5,C6:C107)","v":119.09},{"$f":"ShowFormulaToLeft","v":"=AGGREGATE(12,5,C6:C107)"}]
["add only filtered",{"$f":"_xlfn.AGGREGATE(9,5,C6:C106)","v":6010.91},{"$f":"ShowFormulaToLeft","v":"=AGGREGATE(9,5,C6:C106)"}]
["add only filtered",{"$f":"SUBTOTAL(9,C6:C106)","v":6010.91},{"$f":"ShowFormulaToLeft","v":"=SUBTOTAL(9,C6:C106)"}]
[]
["Date","SalesRep","Sales "]
["2009-12-25","Gault",94.69]
["2009-12-15","Smith",130.19999999999999]
["2009-12-11","Franks",149.94999999999999]
["2009-12-01","Gault",94.11]
["2009-12-11","Franks",136.13999999999999]
["2010-02-12","Pham",133.16999999999999]
["2009-12-07","Smith",80.81]
["2009-11-23","Smith",125.38]
["2009-11-23","Gault",78.95]
["2010-01-23","Smith",113.86]
["2010-01-21","Pham",139.38]
["2009-12-20","Gault",98.71]
["2009-12-07","Pham",76.650000000000006]
["2010-02-11","Gault",126.62]
["2010-01-13","Franks",107.9]
["2010-01-28","Gault",130.54]
["2010-01-25","Gault",140.71]
["2010-02-10","Sioux",108.72]
["2009-12-26","Smith",135.18]
["2009-12-14","Gault",142.55000000000001]
["2010-02-12","Smith",140.54]
["2010-01-19","Franks",75.040000000000006]
["2010-02-16","Pham",93.15]
["2010-01-07","Sioux",132.51]
["2010-01-16","Chin",85.14]
["2010-02-15","Franks",108.85]
["2009-12-13","Sioux",139.91999999999999]
["2010-01-04","Franks",104.35]
["2009-12-14","Gault",88.51]
["2010-02-01","Gault",136.76]
["2009-11-25","Pham",109.57]
["2010-02-07","Franks",125.81]
["2009-12-22","Pham",150.09]
["2009-12-07","Sioux",147.53]
["2009-12-12","Chin",102.17]
["2009-12-30","Smith",114.4]
["2009-12-27","Chin",129.65]
["2009-12-29","Chin",128.94999999999999]
["2010-01-05","Gault",121.33]
["2009-12-15","Pham",102.64]
["2009-12-01","Pham",132.12]
["2010-02-07","Franks",100.83]
["2009-11-26","Sioux",79.42]
["2010-01-04","Pham",100.09]
["2010-01-29","Franks",83.37]
["2010-01-19","Franks",89.11]
["2010-02-14","Smith",126.97]
["2009-12-03","Smith",154.31]
["2010-01-02","Sioux",76.59]
["2009-12-29","Gault",106.94]
["2009-11-26","Chin",129.86000000000001]
["2009-12-24","Pham",100.76]
["2009-12-10","Gault",124.59]
["2009-12-31","Smith",150.31]
["2009-12-16","Franks",119.78]
["2010-01-03","Pham",93.37]
["2009-12-26","Chin",87.06]
["2010-01-05","Smith",147.49]
["2009-12-19","Smith",136.94]
["2009-11-20","Gault",93.33]
["2010-01-03","Smith",128.97]
["2009-12-14","Smith",114.93]
["2010-01-01","Sioux",104.57]
["2009-11-27","Sioux",119.53]
["2010-01-01","Pham",127.99]
["2009-12-03","Smith",88.69]
["2009-11-25","Smith",115.67]
["2010-01-07","Pham",114.54]
["2010-02-02","Smith",128.15]
["2010-02-08","Gault",126.33]
["2010-01-13","Smith",112.03]
["2009-11-20","Smith",145.33000000000001]
["2009-12-23","Gault",109.7]
["2009-11-26","Sioux",139.13]
["2009-12-01","Sioux",112.5]
["2009-11-29","Pham",122.21]
["2010-01-13","Smith",135.77000000000001]
["2010-01-09","Pham",75.17]
["2010-01-30","Sioux",104.5]
["2010-02-04","Gault",86.1]
["2010-01-02","Sioux",143.85]
["2010-01-16","Gault",104.36]
["2009-12-28","Smith",135.02000000000001]
["2009-12-26","Pham",83.26]
["2009-11-28","Sioux",114.53]
["2010-02-02","Smith",117.63]
["2009-12-27","Gault",102.24]
["2010-02-01","Chin",139.21]
["2009-12-25","Smith",119.09]
["2010-01-17","Pham",134.11000000000001]
["2010-01-15","Sioux",96.17]
["2010-01-10","Smith",108.54]
["2010-01-05","Gault",78.89]
["2010-01-20","Pham",130.37]
["2009-12-08","Chin",130.5]
["2010-01-16","Franks",123.13]
["2009-12-19","Gault",131.04]
["2009-12-17","Pham",76.260000000000005]
["2010-01-19","Pham",78.459999999999994]
["2009-11-21","Gault",79.11]
["2010-02-18","Gault",75.349999999999994]
[null,null,{"$f":"SUBTOTAL(9,C6:C106)","v":6010.91}]

{"sheet":"666a","index":11,"n_rows":15,"n_cols":5,"rows_kept":15,"cut":false,"hidden":false,"merged":[]}
[null,null,null,"Which Large?","Which Employee?"]
[{"$f":"\"Large \"&D2","v":"Large 3"},null,null,3,"Sioux"]
["Array on non-filtered"]
["Array on non-filtered"]
[]
["Date","Product","SalesRep","Sales"]
["2012-09-24","Sunset","Gault",315]
["2012-03-31","Carlota","Smith",966]
["2012-11-29","Bellen","Chin",988]
["2011-08-30","Sunset","Gault",682]
["2012-08-19","Bellen","Pham",682]
["2011-02-09","Sunset","Chin",315]
["2012-05-17","Quad","Sioux",621]
["2012-07-16","Sunshine","Sioux",988]
["2011-09-21","Quad","Sioux",751]

{"sheet":"666an","index":12,"n_rows":15,"n_cols":5,"rows_kept":15,"cut":false,"hidden":false,"merged":[]}
[null,null,null,"Which Large?","Which Employee?"]
[{"$f":"\"Large \"&D2","v":"Large 2"},{"$f":"_xlfn.AGGREGATE(14,4,D7:D15,D2)","v":988},null,2,"Gault"]
["Array on non-filtered",{"$f":"_xlfn.AGGREGATE(14,6,D7:D15/(C7:C15=E2),D2)","v":315}]
["Array on non-filtered",{"$f":"LARGE(IF(C7:C15=E2,D7:D15),D2)","v":315},null,{"$f":"LARGE(D7:D15,D2)","v":988}]
[]
["Date","Product","SalesRep","Sales"]
["2012-09-24","Sunset","Gault",315]
["2012-03-31","Carlota","Smith",966]
["2012-11-29","Bellen","Chin",988]
["2011-08-30","Sunset","Gault",682]
["2012-08-19","Bellen","Pham",682]
["2011-02-09","Sunset","Chin",315]
["2012-05-17","Quad","Sioux",621]
["2012-07-16","Sunshine","Sioux",988]
["2011-09-21","Quad","Sioux",751]

{"sheet":"667","index":13,"n_rows":102,"n_cols":14,"rows_kept":102,"cut":false,"hidden":false,"merged":[]}
["Date","SalesRep","Sales ",null,"SalesRep/Large",1,2,3,4,5]
["2009-12-25","Gault",94.69,null,"Gault",null,null,null,null,null,null,6.8000000000000005E-4,6.8000000000000005E-4,6.8999999999999997E-4]
["2009-12-15","Smith",130.19999999999999,null,"Smith"]
["2009-12-11","Franks",149.94999999999999,null,"Franks"]
["2009-12-01","Gault",94.11,null,"Pham"]
["2009-12-11","Franks",136.13999999999999,null,"Sioux"]
["2010-02-12","Pham",133.16999999999999,null,"Chin"]
["2009-12-07","Smith",80.81]
["2009-11-23","Smith",125.38,null,"SalesRep/Large",1,2,3,4,5]
["2009-11-23","Gault",78.95,null,"Gault",{"$f":"LARGE(IF($B$2:$B$102=$E10,$C$2:$C$102),F$9)","v":142.55000000000001},{"$f":"LARGE(IF($B$2:$B$102=$E10,$C$2:$C$102),G$9)","v":140.71},{"$f":"LARGE(IF($B$2:$B$102=$E10,$C$2:$C$102),H$9)","v":136.76},{"$f":"LARGE(IF($B$2:$B$102=$E10,$C$2:$C$102),I$9)","v":131.04},{"$f":"LARGE(IF($B$2:$B$102=$E10,$C$2:$C$102),J$9)","v":130.54},null,6.8000000000000005E-4,6.8000000000000005E-4,6.8000000000000005E-4]
["2010-01-23","Smith",113.86,null,"Smith",{"$f":"LARGE(IF($B$2:$B$102=$E11,$C$2:$C$102),F$9)","v":154.31},{"$f":"LARGE(IF($B$2:$B$102=$E11,$C$2:$C$102),G$9)","v":150.31},{"$f":"LARGE(IF($B$2:$B$102=$E11,$C$2:$C$102),H$9)","v":147.49},{"$f":"LARGE(IF($B$2:$B$102=$E11,$C$2:$C$102),I$9)","v":145.33000000000001},{"$f":"LARGE(IF($B$2:$B$102=$E11,$C$2:$C$102),J$9)","v":140.54}]
["2010-01-21","Pham",139.38,null,"Franks",{"$f":"LARGE(IF($B$2:$B$102=$E12,$C$2:$C$102),F$9)","v":149.94999999999999},{"$f":"LARGE(IF($B$2:$B$102=$E12,$C$2:$C$102),G$9)","v":136.13999999999999},{"$f":"LARGE(IF($B$2:$B$102=$E12,$C$2:$C$102),H$9)","v":125.81},{"$f":"LARGE(IF($B$2:$B$102=$E12,$C$2:$C$102),I$9)","v":123.13},{"$f":"LARGE(IF($B$2:$B$102=$E12,$C$2:$C$102),J$9)","v":119.78}]
["2009-12-20","Gault",98.71,null,"Pham",{"$f":"LARGE(IF($B$2:$B$102=$E13,$C$2:$C$102),F$9)","v":150.09},{"$f":"LARGE(IF($B$2:$B$102=$E13,$C$2:$C$102),G$9)","v":139.38},{"$f":"LARGE(IF($B$2:$B$102=$E13,$C$2:$C$102),H$9)","v":134.11000000000001},{"$f":"LARGE(IF($B$2:$B$102=$E13,$C$2:$C$102),I$9)","v":133.16999999999999},{"$f":"LARGE(IF($B$2:$B$102=$E13,$C$2:$C$102),J$9)","v":132.12}]
["2009-12-07","Pham",76.650000000000006,null,"Sioux",{"$f":"LARGE(IF($B$2:$B$102=$E14,$C$2:$C$102),F$9)","v":147.53},{"$f":"LARGE(IF($B$2:$B$102=$E14,$C$2:$C$102),G$9)","v":143.85},{"$f":"LARGE(IF($B$2:$B$102=$E14,$C$2:$C$102),H$9)","v":139.91999999999999},{"$f":"LARGE(IF($B$2:$B$102=$E14,$C$2:$C$102),I$9)","v":139.13},{"$f":"LARGE(IF($B$2:$B$102=$E14,$C$2:$C$102),J$9)","v":132.51}]
["2010-02-11","Gault",126.62,null,"Chin",{"$f":"LARGE(IF($B$2:$B$102=$E15,$C$2:$C$102),F$9)","v":139.21},{"$f":"LARGE(IF($B$2:$B$102=$E15,$C$2:$C$102),G$9)","v":130.5},{"$f":"LARGE(IF($B$2:$B$102=$E15,$C$2:$C$102),H$9)","v":129.86000000000001},{"$f":"LARGE(IF($B$2:$B$102=$E15,$C$2:$C$102),I$9)","v":129.65},{"$f":"LARGE(IF($B$2:$B$102=$E15,$C$2:$C$102),J$9)","v":128.94999999999999}]
["2010-01-13","Franks",107.9]
["2010-01-28","Gault",130.54]
["2010-01-25","Gault",140.71]
["2010-02-10","Sioux",108.72]
["2009-12-26","Smith",135.18]
["2009-12-14","Gault",142.55000000000001]
["2010-02-12","Smith",140.54]
["2010-01-19","Franks",75.040000000000006]
["2010-02-16","Pham",93.15]
["2010-01-07","Sioux",132.51]
["2010-01-16","Chin",85.14]
["2010-02-15","Franks",108.85]
["2009-12-13","Sioux",139.91999999999999]
["2010-01-04","Franks",104.35]
["2009-12-14","Gault",88.51]
["2010-02-01","Gault",136.76]
["2009-11-25","Pham",109.57]
["2010-02-07","Franks",125.81]
["2009-12-22","Pham",150.09]
["2009-12-07","Sioux",147.53]
["2009-12-12","Chin",102.17]
["2009-12-30","Smith",114.4]
["2009-12-27","Chin",129.65]
["2009-12-29","Chin",128.94999999999999]
["2010-01-05","Gault",121.33]
["2009-12-15","Pham",102.64]
["2009-12-01","Pham",132.12]
["2010-02-07","Franks",100.83]
["2009-11-26","Sioux",79.42]
["2010-01-04","Pham",100.09]
["2010-01-29","Franks",83.37]
["2010-01-19","Franks",89.11]
["2010-02-14","Smith",126.97]
["2009-12-03","Smith",154.31]
["2010-01-02","Sioux",76.59]
["2009-12-29","Gault",106.94]
["2009-11-26","Chin",129.86000000000001]
["2009-12-24","Pham",100.76]
["2009-12-10","Gault",124.59]
["2009-12-31","Smith",150.31]
["2009-12-16","Franks",119.78]
["2010-01-03","Pham",93.37]
["2009-12-26","Chin",87.06]
["2010-01-05","Smith",147.49]
["2009-12-19","Smith",136.94]
["2009-11-20","Gault",93.33]
["2010-01-03","Smith",128.97]
["2009-12-14","Smith",114.93]
["2010-01-01","Sioux",104.57]
["2009-11-27","Sioux",119.53]
["2010-01-01","Pham",127.99]
["2009-12-03","Smith",88.69]
["2009-11-25","Smith",115.67]
["2010-01-07","Pham",114.54]
["2010-02-02","Smith",128.15]
["2010-02-08","Gault",126.33]
["2010-01-13","Smith",112.03]
["2009-11-20","Smith",145.33000000000001]
["2009-12-23","Gault",109.7]
["2009-11-26","Sioux",139.13]
["2009-12-01","Sioux",112.5]
["2009-11-29","Pham",122.21]
["2010-01-13","Smith",135.77000000000001]
["2010-01-09","Pham",75.17]
["2010-01-30","Sioux",104.5]
["2010-02-04","Gault",86.1]
["2010-01-02","Sioux",143.85]
["2010-01-16","Gault",104.36]
["2009-12-28","Smith",135.02000000000001]
["2009-12-26","Pham",83.26]
["2009-11-28","Sioux",114.53]
["2010-02-02","Smith",117.63]
["2009-12-27","Gault",102.24]
["2010-02-01","Chin",139.21]
["2009-12-25","Smith",119.09]
["2010-01-17","Pham",134.11000000000001]
["2010-01-15","Sioux",96.17]
["2010-01-10","Smith",108.54]
["2010-01-05","Gault",78.89]
["2010-01-20","Pham",130.37]
["2009-12-08","Chin",130.5]
["2010-01-16","Franks",123.13]
["2009-12-19","Gault",131.04]
["2009-12-17","Pham",76.260000000000005]
["2010-01-19","Pham",78.459999999999994]
["2009-11-21","Gault",79.11]
["2010-02-18","Gault",75.349999999999994]

{"sheet":"667an","index":14,"n_rows":102,"n_cols":14,"rows_kept":102,"cut":false,"hidden":false,"merged":[]}
["Date","SalesRep","Sales ",null,"SalesRep/Large",1,2,3,4,5]
["2009-12-25","Gault",94.69,null,"Gault",{"$f":"_xlfn.AGGREGATE(14,6,$C$2:$C$102/($B$2:$B$102=$E2),F$1)","v":142.55000000000001},{"$f":"_xlfn.AGGREGATE(14,6,$C$2:$C$102/($B$2:$B$102=$E2),G$1)","v":140.71},136.76,131.04,130.54,null,6.8000000000000005E-4,6.8000000000000005E-4,6.8999999999999997E-4]
["2009-12-15","Smith",130.19999999999999,null,"Smith",{"$f":"_xlfn.AGGREGATE(14,6,$C$2:$C$102/($B$2:$B$102=$E3),F$1)","v":154.31},150.31,147.49,145.33000000000001,140.54]
["2009-12-11","Franks",149.94999999999999,null,"Franks",149.94999999999999,136.13999999999999,125.81,123.13,119.78]
["2009-12-01","Gault",94.11,null,"Pham",150.09,139.38,134.11000000000001,133.16999999999999,132.12]
["2009-12-11","Franks",136.13999999999999,null,"Sioux",147.53,143.85,139.91999999999999,139.13,132.51]
["2010-02-12","Pham",133.16999999999999,null,"Chin",139.21,130.5,129.86000000000001,129.65,128.94999999999999]
["2009-12-07","Smith",80.81]
["2009-11-23","Smith",125.38,null,"SalesRep/Large",1,2,3,4,5]
["2009-11-23","Gault",78.95,null,"Gault",{"$f":"LARGE(IF($B$2:$B$102=$E10,$C$2:$C$102),F$9)","v":142.55000000000001},{"$f":"LARGE(IF($B$2:$B$102=$E10,$C$2:$C$102),G$9)","v":140.71},{"$f":"LARGE(IF($B$2:$B$102=$E10,$C$2:$C$102),H$9)","v":136.76},{"$f":"LARGE(IF($B$2:$B$102=$E10,$C$2:$C$102),I$9)","v":131.04},{"$f":"LARGE(IF($B$2:$B$102=$E10,$C$2:$C$102),J$9)","v":130.54},null,6.8000000000000005E-4,6.8000000000000005E-4,6.8000000000000005E-4]
["2010-01-23","Smith",113.86,null,"Smith",{"$f":"LARGE(IF($B$2:$B$102=$E11,$C$2:$C$102),F$9)","v":154.31},{"$f":"LARGE(IF($B$2:$B$102=$E11,$C$2:$C$102),G$9)","v":150.31},{"$f":"LARGE(IF($B$2:$B$102=$E11,$C$2:$C$102),H$9)","v":147.49},{"$f":"LARGE(IF($B$2:$B$102=$E11,$C$2:$C$102),I$9)","v":145.33000000000001},{"$f":"LARGE(IF($B$2:$B$102=$E11,$C$2:$C$102),J$9)","v":140.54}]
["2010-01-21","Pham",139.38,null,"Franks",{"$f":"LARGE(IF($B$2:$B$102=$E12,$C$2:$C$102),F$9)","v":149.94999999999999},{"$f":"LARGE(IF($B$2:$B$102=$E12,$C$2:$C$102),G$9)","v":136.13999999999999},{"$f":"LARGE(IF($B$2:$B$102=$E12,$C$2:$C$102),H$9)","v":125.81},{"$f":"LARGE(IF($B$2:$B$102=$E12,$C$2:$C$102),I$9)","v":123.13},{"$f":"LARGE(IF($B$2:$B$102=$E12,$C$2:$C$102),J$9)","v":119.78}]
["2009-12-20","Gault",98.71,null,"Pham",{"$f":"LARGE(IF($B$2:$B$102=$E13,$C$2:$C$102),F$9)","v":150.09},{"$f":"LARGE(IF($B$2:$B$102=$E13,$C$2:$C$102),G$9)","v":139.38},{"$f":"LARGE(IF($B$2:$B$102=$E13,$C$2:$C$102),H$9)","v":134.11000000000001},{"$f":"LARGE(IF($B$2:$B$102=$E13,$C$2:$C$102),I$9)","v":133.16999999999999},{"$f":"LARGE(IF($B$2:$B$102=$E13,$C$2:$C$102),J$9)","v":132.12}]
["2009-12-07","Pham",76.650000000000006,null,"Sioux",{"$f":"LARGE(IF($B$2:$B$102=$E14,$C$2:$C$102),F$9)","v":147.53},{"$f":"LARGE(IF($B$2:$B$102=$E14,$C$2:$C$102),G$9)","v":143.85},{"$f":"LARGE(IF($B$2:$B$102=$E14,$C$2:$C$102),H$9)","v":139.91999999999999},{"$f":"LARGE(IF($B$2:$B$102=$E14,$C$2:$C$102),I$9)","v":139.13},{"$f":"LARGE(IF($B$2:$B$102=$E14,$C$2:$C$102),J$9)","v":132.51}]
["2010-02-11","Gault",126.62,null,"Chin",{"$f":"LARGE(IF($B$2:$B$102=$E15,$C$2:$C$102),F$9)","v":139.21},{"$f":"LARGE(IF($B$2:$B$102=$E15,$C$2:$C$102),G$9)","v":130.5},{"$f":"LARGE(IF($B$2:$B$102=$E15,$C$2:$C$102),H$9)","v":129.86000000000001},{"$f":"LARGE(IF($B$2:$B$102=$E15,$C$2:$C$102),I$9)","v":129.65},{"$f":"LARGE(IF($B$2:$B$102=$E15,$C$2:$C$102),J$9)","v":128.94999999999999}]
["2010-01-13","Franks",107.9]
["2010-01-28","Gault",130.54]
["2010-01-25","Gault",140.71]
["2010-02-10","Sioux",108.72]
["2009-12-26","Smith",135.18]
["2009-12-14","Gault",142.55000000000001]
["2010-02-12","Smith",140.54]
["2010-01-19","Franks",75.040000000000006]
["2010-02-16","Pham",93.15]
["2010-01-07","Sioux",132.51]
["2010-01-16","Chin",85.14]
["2010-02-15","Franks",108.85]
["2009-12-13","Sioux",139.91999999999999]
["2010-01-04","Franks",104.35]
["2009-12-14","Gault",88.51]
["2010-02-01","Gault",136.76]
["2009-11-25","Pham",109.57]
["2010-02-07","Franks",125.81]
["2009-12-22","Pham",150.09]
["2009-12-07","Sioux",147.53]
["2009-12-12","Chin",102.17]
["2009-12-30","Smith",114.4]
["2009-12-27","Chin",129.65]
["2009-12-29","Chin",128.94999999999999]
["2010-01-05","Gault",121.33]
["2009-12-15","Pham",102.64]
["2009-12-01","Pham",132.12]
["2010-02-07","Franks",100.83]
["2009-11-26","Sioux",79.42]
["2010-01-04","Pham",100.09]
["2010-01-29","Franks",83.37]
["2010-01-19","Franks",89.11]
["2010-02-14","Smith",126.97]
["2009-12-03","Smith",154.31]
["2010-01-02","Sioux",76.59]
["2009-12-29","Gault",106.94]
["2009-11-26","Chin",129.86000000000001]
["2009-12-24","Pham",100.76]
["2009-12-10","Gault",124.59]
["2009-12-31","Smith",150.31]
["2009-12-16","Franks",119.78]
["2010-01-03","Pham",93.37]
["2009-12-26","Chin",87.06]
["2010-01-05","Smith",147.49]
["2009-12-19","Smith",136.94]
["2009-11-20","Gault",93.33]
["2010-01-03","Smith",128.97]
["2009-12-14","Smith",114.93]
["2010-01-01","Sioux",104.57]
["2009-11-27","Sioux",119.53]
["2010-01-01","Pham",127.99]
["2009-12-03","Smith",88.69]
["2009-11-25","Smith",115.67]
["2010-01-07","Pham",114.54]
["2010-02-02","Smith",128.15]
["2010-02-08","Gault",126.33]
["2010-01-13","Smith",112.03]
["2009-11-20","Smith",145.33000000000001]
["2009-12-23","Gault",109.7]
["2009-11-26","Sioux",139.13]
["2009-12-01","Sioux",112.5]
["2009-11-29","Pham",122.21]
["2010-01-13","Smith",135.77000000000001]
["2010-01-09","Pham",75.17]
["2010-01-30","Sioux",104.5]
["2010-02-04","Gault",86.1]
["2010-01-02","Sioux",143.85]
["2010-01-16","Gault",104.36]
["2009-12-28","Smith",135.02000000000001]
["2009-12-26","Pham",83.26]
["2009-11-28","Sioux",114.53]
["2010-02-02","Smith",117.63]
["2009-12-27","Gault",102.24]
["2010-02-01","Chin",139.21]
["2009-12-25","Smith",119.09]
["2010-01-17","Pham",134.11000000000001]
["2010-01-15","Sioux",96.17]
["2010-01-10","Smith",108.54]
["2010-01-05","Gault",78.89]
["2010-01-20","Pham",130.37]
["2009-12-08","Chin",130.5]
["2010-01-16","Franks",123.13]
["2009-12-19","Gault",131.04]
["2009-12-17","Pham",76.260000000000005]
["2010-01-19","Pham",78.459999999999994]
["2009-11-21","Gault",79.11]
["2010-02-18","Gault",75.349999999999994]

{"sheet":"668","index":15,"n_rows":102,"n_cols":8,"rows_kept":102,"cut":false,"hidden":false,"merged":[]}
["School","CPA Score",null,"Top 10% Percentile",null,null,"School",{"$f":"TEXT(E2,\"0,0%\")&\" rank\"","v":"90% rank"}]
["s4",95,null,null,0.9,null,"s1"]
["s2",45,null,null,null,null,"s2"]
["s1",64,null,null,null,null,"s3"]
["s2",24,null,null,null,null,"s4"]
["s4",4]
["s1",61,null,null,null,null,"School",{"$f":"TEXT(E2,\"0,0%\")&\" rank\"","v":"90% rank"}]
["s2",12,null,null,null,null,"s1",{"$f":"_xlfn.PERCENTILE.EXC(IF($A$2:$A$102=G8,$B$2:$B$102),E$2)","v":95}]
["s4",84,null,null,null,null,"s2",{"$f":"_xlfn.PERCENTILE.EXC(IF($A$2:$A$102=G9,$B$2:$B$102),E$2)","v":93.9}]
["s3",44,null,null,null,null,"s3",{"$f":"_xlfn.PERCENTILE.EXC(IF($A$2:$A$102=G10,$B$2:$B$102),E$2)","v":96.2}]
["s4",53,null,null,null,null,"s4",{"$f":"_xlfn.PERCENTILE.EXC(IF($A$2:$A$102=G11,$B$2:$B$102),E$2)","v":85.6}]
["s1",29]
["s2",97]
["s1",52]
["s4",30]
["s1",93]
["s3",23]
["s3",89]
["s1",16]
["s2",62]
["s2",42]
["s4",92]
["s4",51]
["s1",22]
["s3",24]
["s4",78]
["s1",93]
["s3",14]
["s3",3]
["s4",61]
["s3",74]
["s4",35]
["s2",93]
["s1",97]
["s1",8]
["s3",88]
["s4",39]
["s4",52]
["s2",61]
["s4",28]
["s4",20]
["s2",24]
["s3",14]
["s3",55]
["s2",94]
["s1",24]
["s4",16]
["s4",42]
["s3",99]
["s3",51]
["s1",8]
["s3",54]
["s2",60]
["s1",34]
["s4",67]
["s2",91]
["s1",20]
["s1",12]
["s2",1]
["s4",8]
["s2",78]
["s1",6]
["s1",29]
["s1",95]
["s4",39]
["s2",35]
["s1",21]
["s3",57]
["s4",59]
["s4",43]
["s1",11]
["s1",46]
["s1",96]
["s4",52]
["s3",42]
["s4",73]
["s1",21]
["s4",83]
["s3",67]
["s1",7]
["s4",60]
["s2",50]
["s1",53]
["s1",45]
["s2",2]
["s3",71]
["s4",75]
["s3",48]
["s2",30]
["s3",67]
["s3",98]
["s1",90]
["s3",63]
["s3",32]
["s1",61]
["s2",71]
["s4",52]
["s3",95]
["s1",29]
["s2",83]
["s3",23]
["s3",24]

{"sheet":"668an","index":16,"n_rows":102,"n_cols":8,"rows_kept":102,"cut":false,"hidden":false,"merged":[]}
["School","CPA Score",null,"Top 10% Percentile",null,null,"School",{"$f":"TEXT(E2,\"0,0%\")&\" rank\"","v":"90% rank"}]
["s4",95,null,{"$f":"_xlfn.AGGREGATE(18,4,B2:B102,E2)","v":93},0.9,null,"s1",{"$f":"_xlfn.AGGREGATE(18,6,$B$2:$B$102/($A$2:$A$102=G2),E$2)","v":95}]
["s2",45,null,{"$f":"_xlfn.PERCENTILE.EXC(B2:B102,E2)","v":93},null,null,"s2",{"$f":"_xlfn.AGGREGATE(18,6,$B$2:$B$102/($A$2:$A$102=G3),E$2)","v":93.9}]
["s1",64,null,null,null,null,"s3",96.2]
["s2",24,null,null,null,null,"s4",85.6]
["s4",4]
["s1",61,null,null,null,null,"School",{"$f":"TEXT(E2,\"0,0%\")&\" rank\"","v":"90% rank"}]
["s2",12,null,null,null,null,"s1",{"$f":"_xlfn.PERCENTILE.EXC(IF($A$2:$A$102=G8,$B$2:$B$102),E$2)","v":95}]
["s4",84,null,null,null,null,"s2",{"$f":"_xlfn.PERCENTILE.EXC(IF($A$2:$A$102=G9,$B$2:$B$102),E$2)","v":93.9}]
["s3",44,null,null,null,null,"s3",{"$f":"_xlfn.PERCENTILE.EXC(IF($A$2:$A$102=G10,$B$2:$B$102),E$2)","v":96.2}]
["s4",53,null,null,null,null,"s4",{"$f":"_xlfn.PERCENTILE.EXC(IF($A$2:$A$102=G11,$B$2:$B$102),E$2)","v":85.6}]
["s1",29]
["s2",97]
["s1",52]
["s4",30]
["s1",93]
["s3",23]
["s3",89]
["s1",16]
["s2",62]
["s2",42]
["s4",92]
["s4",51]
["s1",22]
["s3",24]
["s4",78]
["s1",93]
["s3",14]
["s3",3]
["s4",61]
["s3",74]
["s4",35]
["s2",93]
["s1",97]
["s1",8]
["s3",88]
["s4",39]
["s4",52]
["s2",61]
["s4",28]
["s4",20]
["s2",24]
["s3",14]
["s3",55]
["s2",94]
["s1",24]
["s4",16]
["s4",42]
["s3",99]
["s3",51]
["s1",8]
["s3",54]
["s2",60]
["s1",34]
["s4",67]
["s2",91]
["s1",20]
["s1",12]
["s2",1]
["s4",8]
["s2",78]
["s1",6]
["s1",29]
["s1",95]
["s4",39]
["s2",35]
["s1",21]
["s3",57]
["s4",59]
["s4",43]
["s1",11]
["s1",46]
["s1",96]
["s4",52]
["s3",42]
["s4",73]
["s1",21]
["s4",83]
["s3",67]
["s1",7]
["s4",60]
["s2",50]
["s1",53]
["s1",45]
["s2",2]
["s3",71]
["s4",75]
["s3",48]
["s2",30]
["s3",67]
["s3",98]
["s1",90]
["s3",63]
["s3",32]
["s1",61]
["s2",71]
["s4",52]
["s3",95]
["s1",29]
["s2",83]
["s3",23]
["s3",24]

{"sheet":"669","index":17,"n_rows":11,"n_cols":1,"rows_kept":11,"cut":false,"hidden":false,"merged":[]}
[]
[]
[]
[]
[]
[]
[]
[]
[]
[]
["No 3-D cell references"]

{"sheet":"669an","index":18,"n_rows":12,"n_cols":1,"rows_kept":12,"cut":false,"hidden":false,"merged":[]}
[]
[]
[]
[]
[]
[]
[]
[]
[]
[]
["No 3-D cell references"]
[{"$f":"_xlfn.AGGREGATE(9,4,'T(1):T(3)'!B2)","v":{"$error":"#VALUE!"}}]

{"sheet":"T(1)","index":19,"n_rows":5,"n_cols":4,"rows_kept":5,"cut":false,"hidden":false,"merged":[]}
[null,"Jan","Feb","Mar"]
["Pro 1",{"$f":"INT(RAND()*25)","v":5},20,6]
["Pro 2",16,13,20]
["Pro 3",20,19,9]
["Pro 4",8,7,10]

{"sheet":"T(2)","index":20,"n_rows":5,"n_cols":4,"rows_kept":5,"cut":false,"hidden":false,"merged":[]}
[null,"Jan","Feb","Mar"]
["Pro 1",{"$f":"INT(RAND()*25)","v":9},6,21]
["Pro 2",13,11,19]
["Pro 3",21,15,15]
["Pro 4",16,6,14]

{"sheet":"T(3)","index":21,"n_rows":5,"n_cols":4,"rows_kept":5,"cut":false,"hidden":false,"merged":[]}
[null,"Jan","Feb","Mar"]
["Pro 1",{"$f":"INT(RAND()*25)","v":12},18,20]
["Pro 2",8,10,15]
["Pro 3",20,2,16]
["Pro 4",3,17,20]

{"sheet":"670","index":22,"n_rows":102,"n_cols":13,"rows_kept":102,"cut":false,"hidden":false,"merged":[]}
["Date","SalesRep","Sales ",null,"Month","SalesRep","Count",null,"SalesRep"]
["2009-12-25","Gault",94.69,null,null,"Gault",{"$f":"COUNTIF($A$2:$C$102,F2)","v":23},null,"Gault"]
["2009-12-15","Smith",130.19999999999999,null,null,null,null,null,"Smith"]
["2009-12-11","Franks",149.94999999999999,null,"Date","SalesRep","Sales ",null,"Franks",null,"Date","SalesRep","Sales "]
["2009-12-01","Gault",94.11,null,null,null,null,null,"Pham",null,{"$f":"IF(ROWS(K$5:K5)>$G$2,\"\",INDEX(A$2:A$102,SMALL(IF($B$2:$B$102=$F$2,ROW($B$2:$B$102)-ROW($B$2)+1),ROWS(K$5:K5))))","v":"2009-12-25"},{"$f":"IF(ROWS(L$5:L5)>$G$2,\"\",INDEX(B$2:B$102,SMALL(IF($B$2:$B$102=$F$2,ROW($B$2:$B$102)-ROW($B$2)+1),ROWS(L$5:L5))))","v":"Gault"},{"$f":"IF(ROWS(M$5:M5)>$G$2,\"\",INDEX(C$2:C$102,SMALL(IF($B$2:$B$102=$F$2,ROW($B$2:$B$102)-ROW($B$2)+1),ROWS(M$5:M5))))","v":94.69}]
["2009-12-11","Franks",136.13999999999999,null,null,null,null,null,"Sioux",null,{"$f":"IF(ROWS(K$5:K6)>$G$2,\"\",INDEX(A$2:A$102,SMALL(IF($B$2:$B$102=$F$2,ROW($B$2:$B$102)-ROW($B$2)+1),ROWS(K$5:K6))))","v":"2009-12-01"},{"$f":"IF(ROWS(L$5:L6)>$G$2,\"\",INDEX(B$2:B$102,SMALL(IF($B$2:$B$102=$F$2,ROW($B$2:$B$102)-ROW($B$2)+1),ROWS(L$5:L6))))","v":"Gault"},{"$f":"IF(ROWS(M$5:M6)>$G$2,\"\",INDEX(C$2:C$102,SMALL(IF($B$2:$B$102=$F$2,ROW($B$2:$B$102)-ROW($B$2)+1),ROWS(M$5:M6))))","v":94.11}]
["2010-02-12","Pham",133.16999999999999,null,null,null,null,null,"Chin",null,{"$f":"IF(ROWS(K$5:K7)>$G$2,\"\",INDEX(A$2:A$102,SMALL(IF($B$2:$B$102=$F$2,ROW($B$2:$B$102)-ROW($B$2)+1),ROWS(K$5:K7))))","v":"2009-11-23"},{"$f":"IF(ROWS(L$5:L7)>$G$2,\"\",INDEX(B$2:B$102,SMALL(IF($B$2:$B$102=$F$2,ROW($B$2:$B$102)-ROW($B$2)+1),ROWS(L$5:L7))))","v":"Gault"},{"$f":"IF(ROWS(M$5:M7)>$G$2,\"\",INDEX(C$2:C$102,SMALL(IF($B$2:$B$102=$F$2,ROW($B$2:$B$102)-ROW($B$2)+1),ROWS(M$5:M7))))","v":78.95}]
["2009-12-07","Smith",80.81,null,null,null,null,null,null,null,{"$f":"IF(ROWS(K$5:K8)>$G$2,\"\",INDEX(A$2:A$102,SMALL(IF($B$2:$B$102=$F$2,ROW($B$2:$B$102)-ROW($B$2)+1),ROWS(K$5:K8))))","v":"2009-12-20"},{"$f":"IF(ROWS(L$5:L8)>$G$2,\"\",INDEX(B$2:B$102,SMALL(IF($B$2:$B$102=$F$2,ROW($B$2:$B$102)-ROW($B$2)+1),ROWS(L$5:L8))))","v":"Gault"},{"$f":"IF(ROWS(M$5:M8)>$G$2,\"\",INDEX(C$2:C$102,SMALL(IF($B$2:$B$102=$F$2,ROW($B$2:$B$102)-ROW($B$2)+1),ROWS(M$5:M8))))","v":98.71}]
["2009-11-23","Smith",125.38,null,null,null,null,null,null,null,{"$f":"IF(ROWS(K$5:K9)>$G$2,\"\",INDEX(A$2:A$102,SMALL(IF($B$2:$B$102=$F$2,ROW($B$2:$B$102)-ROW($B$2)+1),ROWS(K$5:K9))))","v":"2010-02-11"},{"$f":"IF(ROWS(L$5:L9)>$G$2,\"\",INDEX(B$2:B$102,SMALL(IF($B$2:$B$102=$F$2,ROW($B$2:$B$102)-ROW($B$2)+1),ROWS(L$5:L9))))","v":"Gault"},{"$f":"IF(ROWS(M$5:M9)>$G$2,\"\",INDEX(C$2:C$102,SMALL(IF($B$2:$B$102=$F$2,ROW($B$2:$B$102)-ROW($B$2)+1),ROWS(M$5:M9))))","v":126.62}]
["2009-11-23","Gault",78.95,null,null,null,null,null,null,null,{"$f":"IF(ROWS(K$5:K10)>$G$2,\"\",INDEX(A$2:A$102,SMALL(IF($B$2:$B$102=$F$2,ROW($B$2:$B$102)-ROW($B$2)+1),ROWS(K$5:K10))))","v":"2010-01-28"},{"$f":"IF(ROWS(L$5:L10)>$G$2,\"\",INDEX(B$2:B$102,SMALL(IF($B$2:$B$102=$F$2,ROW($B$2:$B$102)-ROW($B$2)+1),ROWS(L$5:L10))))","v":"Gault"},{"$f":"IF(ROWS(M$5:M10)>$G$2,\"\",INDEX(C$2:C$102,SMALL(IF($B$2:$B$102=$F$2,ROW($B$2:$B$102)-ROW($B$2)+1),ROWS(M$5:M10))))","v":130.54}]
["2010-01-23","Smith",113.86,null,null,null,null,null,null,null,{"$f":"IF(ROWS(K$5:K11)>$G$2,\"\",INDEX(A$2:A$102,SMALL(IF($B$2:$B$102=$F$2,ROW($B$2:$B$102)-ROW($B$2)+1),ROWS(K$5:K11))))","v":"2010-01-25"},{"$f":"IF(ROWS(L$5:L11)>$G$2,\"\",INDEX(B$2:B$102,SMALL(IF($B$2:$B$102=$F$2,ROW($B$2:$B$102)-ROW($B$2)+1),ROWS(L$5:L11))))","v":"Gault"},{"$f":"IF(ROWS(M$5:M11)>$G$2,\"\",INDEX(C$2:C$102,SMALL(IF($B$2:$B$102=$F$2,ROW($B$2:$B$102)-ROW($B$2)+1),ROWS(M$5:M11))))","v":140.71}]
["2010-01-21","Pham",139.38,null,null,null,null,null,null,null,{"$f":"IF(ROWS(K$5:K12)>$G$2,\"\",INDEX(A$2:A$102,SMALL(IF($B$2:$B$102=$F$2,ROW($B$2:$B$102)-ROW($B$2)+1),ROWS(K$5:K12))))","v":"2009-12-14"},{"$f":"IF(ROWS(L$5:L12)>$G$2,\"\",INDEX(B$2:B$102,SMALL(IF($B$2:$B$102=$F$2,ROW($B$2:$B$102)-ROW($B$2)+1),ROWS(L$5:L12))))","v":"Gault"},{"$f":"IF(ROWS(M$5:M12)>$G$2,\"\",INDEX(C$2:C$102,SMALL(IF($B$2:$B$102=$F$2,ROW($B$2:$B$102)-ROW($B$2)+1),ROWS(M$5:M12))))","v":142.55000000000001}]
["2009-12-20","Gault",98.71,null,null,null,null,null,null,null,{"$f":"IF(ROWS(K$5:K13)>$G$2,\"\",INDEX(A$2:A$102,SMALL(IF($B$2:$B$102=$F$2,ROW($B$2:$B$102)-ROW($B$2)+1),ROWS(K$5:K13))))","v":"2009-12-14"},{"$f":"IF(ROWS(L$5:L13)>$G$2,\"\",INDEX(B$2:B$102,SMALL(IF($B$2:$B$102=$F$2,ROW($B$2:$B$102)-ROW($B$2)+1),ROWS(L$5:L13))))","v":"Gault"},{"$f":"IF(ROWS(M$5:M13)>$G$2,\"\",INDEX(C$2:C$102,SMALL(IF($B$2:$B$102=$F$2,ROW($B$2:$B$102)-ROW($B$2)+1),ROWS(M$5:M13))))","v":88.51}]
["2009-12-07","Pham",76.650000000000006,null,null,null,null,null,null,null,{"$f":"IF(ROWS(K$5:K14)>$G$2,\"\",INDEX(A$2:A$102,SMALL(IF($B$2:$B$102=$F$2,ROW($B$2:$B$102)-ROW($B$2)+1),ROWS(K$5:K14))))","v":"2010-02-01"},{"$f":"IF(ROWS(L$5:L14)>$G$2,\"\",INDEX(B$2:B$102,SMALL(IF($B$2:$B$102=$F$2,ROW($B$2:$B$102)-ROW($B$2)+1),ROWS(L$5:L14))))","v":"Gault"},{"$f":"IF(ROWS(M$5:M14)>$G$2,\"\",INDEX(C$2:C$102,SMALL(IF($B$2:$B$102=$F$2,ROW($B$2:$B$102)-ROW($B$2)+1),ROWS(M$5:M14))))","v":136.76}]
["2010-02-11","Gault",126.62,null,null,null,null,null,null,null,{"$f":"IF(ROWS(K$5:K15)>$G$2,\"\",INDEX(A$2:A$102,SMALL(IF($B$2:$B$102=$F$2,ROW($B$2:$B$102)-ROW($B$2)+1),ROWS(K$5:K15))))","v":"2010-01-05"},{"$f":"IF(ROWS(L$5:L15)>$G$2,\"\",INDEX(B$2:B$102,SMALL(IF($B$2:$B$102=$F$2,ROW($B$2:$B$102)-ROW($B$2)+1),ROWS(L$5:L15))))","v":"Gault"},{"$f":"IF(ROWS(M$5:M15)>$G$2,\"\",INDEX(C$2:C$102,SMALL(IF($B$2:$B$102=$F$2,ROW($B$2:$B$102)-ROW($B$2)+1),ROWS(M$5:M15))))","v":121.33}]
["2010-01-13","Franks",107.9,null,null,null,null,null,null,null,{"$f":"IF(ROWS(K$5:K16)>$G$2,\"\",INDEX(A$2:A$102,SMALL(IF($B$2:$B$102=$F$2,ROW($B$2:$B$102)-ROW($B$2)+1),ROWS(K$5:K16))))","v":"2009-12-29"},{"$f":"IF(ROWS(L$5:L16)>$G$2,\"\",INDEX(B$2:B$102,SMALL(IF($B$2:$B$102=$F$2,ROW($B$2:$B$102)-ROW($B$2)+1),ROWS(L$5:L16))))","v":"Gault"},{"$f":"IF(ROWS(M$5:M16)>$G$2,\"\",INDEX(C$2:C$102,SMALL(IF($B$2:$B$102=$F$2,ROW($B$2:$B$102)-ROW($B$2)+1),ROWS(M$5:M16))))","v":106.94}]
["2010-01-28","Gault",130.54,null,null,null,null,null,null,null,{"$f":"IF(ROWS(K$5:K17)>$G$2,\"\",INDEX(A$2:A$102,SMALL(IF($B$2:$B$102=$F$2,ROW($B$2:$B$102)-ROW($B$2)+1),ROWS(K$5:K17))))","v":"2009-12-10"},{"$f":"IF(ROWS(L$5:L17)>$G$2,\"\",INDEX(B$2:B$102,SMALL(IF($B$2:$B$102=$F$2,ROW($B$2:$B$102)-ROW($B$2)+1),ROWS(L$5:L17))))","v":"Gault"},{"$f":"IF(ROWS(M$5:M17)>$G$2,\"\",INDEX(C$2:C$102,SMALL(IF($B$2:$B$102=$F$2,ROW($B$2:$B$102)-ROW($B$2)+1),ROWS(M$5:M17))))","v":124.59}]
["2010-01-25","Gault",140.71,null,null,null,null,null,null,null,{"$f":"IF(ROWS(K$5:K18)>$G$2,\"\",INDEX(A$2:A$102,SMALL(IF($B$2:$B$102=$F$2,ROW($B$2:$B$102)-ROW($B$2)+1),ROWS(K$5:K18))))","v":"2009-11-20"},{"$f":"IF(ROWS(L$5:L18)>$G$2,\"\",INDEX(B$2:B$102,SMALL(IF($B$2:$B$102=$F$2,ROW($B$2:$B$102)-ROW($B$2)+1),ROWS(L$5:L18))))","v":"Gault"},{"$f":"IF(ROWS(M$5:M18)>$G$2,\"\",INDEX(C$2:C$102,SMALL(IF($B$2:$B$102=$F$2,ROW($B$2:$B$102)-ROW($B$2)+1),ROWS(M$5:M18))))","v":93.33}]
["2010-02-10","Sioux",108.72,null,null,null,null,null,null,null,{"$f":"IF(ROWS(K$5:K19)>$G$2,\"\",INDEX(A$2:A$102,SMALL(IF($B$2:$B$102=$F$2,ROW($B$2:$B$102)-ROW($B$2)+1),ROWS(K$5:K19))))","v":"2010-02-08"},{"$f":"IF(ROWS(L$5:L19)>$G$2,\"\",INDEX(B$2:B$102,SMALL(IF($B$2:$B$102=$F$2,ROW($B$2:$B$102)-ROW($B$2)+1),ROWS(L$5:L19))))","v":"Gault"},{"$f":"IF(ROWS(M$5:M19)>$G$2,\"\",INDEX(C$2:C$102,SMALL(IF($B$2:$B$102=$F$2,ROW($B$2:$B$102)-ROW($B$2)+1),ROWS(M$5:M19))))","v":126.33}]
["2009-12-26","Smith",135.18,null,null,null,null,null,null,null,{"$f":"IF(ROWS(K$5:K20)>$G$2,\"\",INDEX(A$2:A$102,SMALL(IF($B$2:$B$102=$F$2,ROW($B$2:$B$102)-ROW($B$2)+1),ROWS(K$5:K20))))","v":"2009-12-23"},{"$f":"IF(ROWS(L$5:L20)>$G$2,\"\",INDEX(B$2:B$102,SMALL(IF($B$2:$B$102=$F$2,ROW($B$2:$B$102)-ROW($B$2)+1),ROWS(L$5:L20))))","v":"Gault"},{"$f":"IF(ROWS(M$5:M20)>$G$2,\"\",INDEX(C$2:C$102,SMALL(IF($B$2:$B$102=$F$2,ROW($B$2:$B$102)-ROW($B$2)+1),ROWS(M$5:M20))))","v":109.7}]
["2009-12-14","Gault",142.55000000000001,null,null,null,null,null,null,null,{"$f":"IF(ROWS(K$5:K21)>$G$2,\"\",INDEX(A$2:A$102,SMALL(IF($B$2:$B$102=$F$2,ROW($B$2:$B$102)-ROW($B$2)+1),ROWS(K$5:K21))))","v":"2010-02-04"},{"$f":"IF(ROWS(L$5:L21)>$G$2,\"\",INDEX(B$2:B$102,SMALL(IF($B$2:$B$102=$F$2,ROW($B$2:$B$102)-ROW($B$2)+1),ROWS(L$5:L21))))","v":"Gault"},{"$f":"IF(ROWS(M$5:M21)>$G$2,\"\",INDEX(C$2:C$102,SMALL(IF($B$2:$B$102=$F$2,ROW($B$2:$B$102)-ROW($B$2)+1),ROWS(M$5:M21))))","v":86.1}]
["2010-02-12","Smith",140.54,null,null,null,null,null,null,null,{"$f":"IF(ROWS(K$5:K22)>$G$2,\"\",INDEX(A$2:A$102,SMALL(IF($B$2:$B$102=$F$2,ROW($B$2:$B$102)-ROW($B$2)+1),ROWS(K$5:K22))))","v":"2010-01-16"},{"$f":"IF(ROWS(L$5:L22)>$G$2,\"\",INDEX(B$2:B$102,SMALL(IF($B$2:$B$102=$F$2,ROW($B$2:$B$102)-ROW($B$2)+1),ROWS(L$5:L22))))","v":"Gault"},{"$f":"IF(ROWS(M$5:M22)>$G$2,\"\",INDEX(C$2:C$102,SMALL(IF($B$2:$B$102=$F$2,ROW($B$2:$B$102)-ROW($B$2)+1),ROWS(M$5:M22))))","v":104.36}]
["2010-01-19","Franks",75.040000000000006,null,null,null,null,null,null,null,{"$f":"IF(ROWS(K$5:K23)>$G$2,\"\",INDEX(A$2:A$102,SMALL(IF($B$2:$B$102=$F$2,ROW($B$2:$B$102)-ROW($B$2)+1),ROWS(K$5:K23))))","v":"2009-12-27"},{"$f":"IF(ROWS(L$5:L23)>$G$2,\"\",INDEX(B$2:B$102,SMALL(IF($B$2:$B$102=$F$2,ROW($B$2:$B$102)-ROW($B$2)+1),ROWS(L$5:L23))))","v":"Gault"},{"$f":"IF(ROWS(M$5:M23)>$G$2,\"\",INDEX(C$2:C$102,SMALL(IF($B$2:$B$102=$F$2,ROW($B$2:$B$102)-ROW($B$2)+1),ROWS(M$5:M23))))","v":102.24}]
["2010-02-16","Pham",93.15,null,null,null,null,null,null,null,{"$f":"IF(ROWS(K$5:K24)>$G$2,\"\",INDEX(A$2:A$102,SMALL(IF($B$2:$B$102=$F$2,ROW($B$2:$B$102)-ROW($B$2)+1),ROWS(K$5:K24))))","v":"2010-01-05"},{"$f":"IF(ROWS(L$5:L24)>$G$2,\"\",INDEX(B$2:B$102,SMALL(IF($B$2:$B$102=$F$2,ROW($B$2:$B$102)-ROW($B$2)+1),ROWS(L$5:L24))))","v":"Gault"},{"$f":"IF(ROWS(M$5:M24)>$G$2,\"\",INDEX(C$2:C$102,SMALL(IF($B$2:$B$102=$F$2,ROW($B$2:$B$102)-ROW($B$2)+1),ROWS(M$5:M24))))","v":78.89}]
["2010-01-07","Sioux",132.51,null,null,null,null,null,null,null,{"$f":"IF(ROWS(K$5:K25)>$G$2,\"\",INDEX(A$2:A$102,SMALL(IF($B$2:$B$102=$F$2,ROW($B$2:$B$102)-ROW($B$2)+1),ROWS(K$5:K25))))","v":"2009-12-19"},{"$f":"IF(ROWS(L$5:L25)>$G$2,\"\",INDEX(B$2:B$102,SMALL(IF($B$2:$B$102=$F$2,ROW($B$2:$B$102)-ROW($B$2)+1),ROWS(L$5:L25))))","v":"Gault"},{"$f":"IF(ROWS(M$5:M25)>$G$2,\"\",INDEX(C$2:C$102,SMALL(IF($B$2:$B$102=$F$2,ROW($B$2:$B$102)-ROW($B$2)+1),ROWS(M$5:M25))))","v":131.04}]
["2010-01-16","Chin",85.14,null,null,null,null,null,null,null,{"$f":"IF(ROWS(K$5:K26)>$G$2,\"\",INDEX(A$2:A$102,SMALL(IF($B$2:$B$102=$F$2,ROW($B$2:$B$102)-ROW($B$2)+1),ROWS(K$5:K26))))","v":"2009-11-21"},{"$f":"IF(ROWS(L$5:L26)>$G$2,\"\",INDEX(B$2:B$102,SMALL(IF($B$2:$B$102=$F$2,ROW($B$2:$B$102)-ROW($B$2)+1),ROWS(L$5:L26))))","v":"Gault"},{"$f":"IF(ROWS(M$5:M26)>$G$2,\"\",INDEX(C$2:C$102,SMALL(IF($B$2:$B$102=$F$2,ROW($B$2:$B$102)-ROW($B$2)+1),ROWS(M$5:M26))))","v":79.11}]
["2010-02-15","Franks",108.85,null,null,null,null,null,null,null,{"$f":"IF(ROWS(K$5:K27)>$G$2,\"\",INDEX(A$2:A$102,SMALL(IF($B$2:$B$102=$F$2,ROW($B$2:$B$102)-ROW($B$2)+1),ROWS(K$5:K27))))","v":"2010-02-18"},{"$f":"IF(ROWS(L$5:L27)>$G$2,\"\",INDEX(B$2:B$102,SMALL(IF($B$2:$B$102=$F$2,ROW($B$2:$B$102)-ROW($B$2)+1),ROWS(L$5:L27))))","v":"Gault"},{"$f":"IF(ROWS(M$5:M27)>$G$2,\"\",INDEX(C$2:C$102,SMALL(IF($B$2:$B$102=$F$2,ROW($B$2:$B$102)-ROW($B$2)+1),ROWS(M$5:M27))))","v":75.349999999999994}]
["2009-12-13","Sioux",139.91999999999999,null,null,null,null,null,null,null,{"$f":"IF(ROWS(K$5:K28)>$G$2,\"\",INDEX(A$2:A$102,SMALL(IF($B$2:$B$102=$F$2,ROW($B$2:$B$102)-ROW($B$2)+1),ROWS(K$5:K28))))","v":""},{"$f":"IF(ROWS(L$5:L28)>$G$2,\"\",INDEX(B$2:B$102,SMALL(IF($B$2:$B$102=$F$2,ROW($B$2:$B$102)-ROW($B$2)+1),ROWS(L$5:L28))))","v":""},{"$f":"IF(ROWS(M$5:M28)>$G$2,\"\",INDEX(C$2:C$102,SMALL(IF($B$2:$B$102=$F$2,ROW($B$2:$B$102)-ROW($B$2)+1),ROWS(M$5:M28))))","v":""}]
["2010-01-04","Franks",104.35,null,null,null,null,null,null,null,{"$f":"IF(ROWS(K$5:K29)>$G$2,\"\",INDEX(A$2:A$102,SMALL(IF($B$2:$B$102=$F$2,ROW($B$2:$B$102)-ROW($B$2)+1),ROWS(K$5:K29))))","v":""},{"$f":"IF(ROWS(L$5:L29)>$G$2,\"\",INDEX(B$2:B$102,SMALL(IF($B$2:$B$102=$F$2,ROW($B$2:$B$102)-ROW($B$2)+1),ROWS(L$5:L29))))","v":""},{"$f":"IF(ROWS(M$5:M29)>$G$2,\"\",INDEX(C$2:C$102,SMALL(IF($B$2:$B$102=$F$2,ROW($B$2:$B$102)-ROW($B$2)+1),ROWS(M$5:M29))))","v":""}]
["2009-12-14","Gault",88.51,null,null,null,null,null,null,null,{"$f":"IF(ROWS(K$5:K30)>$G$2,\"\",INDEX(A$2:A$102,SMALL(IF($B$2:$B$102=$F$2,ROW($B$2:$B$102)-ROW($B$2)+1),ROWS(K$5:K30))))","v":""},{"$f":"IF(ROWS(L$5:L30)>$G$2,\"\",INDEX(B$2:B$102,SMALL(IF($B$2:$B$102=$F$2,ROW($B$2:$B$102)-ROW($B$2)+1),ROWS(L$5:L30))))","v":""},{"$f":"IF(ROWS(M$5:M30)>$G$2,\"\",INDEX(C$2:C$102,SMALL(IF($B$2:$B$102=$F$2,ROW($B$2:$B$102)-ROW($B$2)+1),ROWS(M$5:M30))))","v":""}]
["2010-02-01","Gault",136.76,null,null,null,null,null,null,null,{"$f":"IF(ROWS(K$5:K31)>$G$2,\"\",INDEX(A$2:A$102,SMALL(IF($B$2:$B$102=$F$2,ROW($B$2:$B$102)-ROW($B$2)+1),ROWS(K$5:K31))))","v":""},{"$f":"IF(ROWS(L$5:L31)>$G$2,\"\",INDEX(B$2:B$102,SMALL(IF($B$2:$B$102=$F$2,ROW($B$2:$B$102)-ROW($B$2)+1),ROWS(L$5:L31))))","v":""},{"$f":"IF(ROWS(M$5:M31)>$G$2,\"\",INDEX(C$2:C$102,SMALL(IF($B$2:$B$102=$F$2,ROW($B$2:$B$102)-ROW($B$2)+1),ROWS(M$5:M31))))","v":""}]
["2009-11-25","Pham",109.57,null,null,null,null,null,null,null,{"$f":"IF(ROWS(K$5:K32)>$G$2,\"\",INDEX(A$2:A$102,SMALL(IF($B$2:$B$102=$F$2,ROW($B$2:$B$102)-ROW($B$2)+1),ROWS(K$5:K32))))","v":""},{"$f":"IF(ROWS(L$5:L32)>$G$2,\"\",INDEX(B$2:B$102,SMALL(IF($B$2:$B$102=$F$2,ROW($B$2:$B$102)-ROW($B$2)+1),ROWS(L$5:L32))))","v":""},{"$f":"IF(ROWS(M$5:M32)>$G$2,\"\",INDEX(C$2:C$102,SMALL(IF($B$2:$B$102=$F$2,ROW($B$2:$B$102)-ROW($B$2)+1),ROWS(M$5:M32))))","v":""}]
["2010-02-07","Franks",125.81,null,null,null,null,null,null,null,{"$f":"IF(ROWS(K$5:K33)>$G$2,\"\",INDEX(A$2:A$102,SMALL(IF($B$2:$B$102=$F$2,ROW($B$2:$B$102)-ROW($B$2)+1),ROWS(K$5:K33))))","v":""},{"$f":"IF(ROWS(L$5:L33)>$G$2,\"\",INDEX(B$2:B$102,SMALL(IF($B$2:$B$102=$F$2,ROW($B$2:$B$102)-ROW($B$2)+1),ROWS(L$5:L33))))","v":""},{"$f":"IF(ROWS(M$5:M33)>$G$2,\"\",INDEX(C$2:C$102,SMALL(IF($B$2:$B$102=$F$2,ROW($B$2:$B$102)-ROW($B$2)+1),ROWS(M$5:M33))))","v":""}]
["2009-12-22","Pham",150.09,null,null,null,null,null,null,null,{"$f":"IF(ROWS(K$5:K34)>$G$2,\"\",INDEX(A$2:A$102,SMALL(IF($B$2:$B$102=$F$2,ROW($B$2:$B$102)-ROW($B$2)+1),ROWS(K$5:K34))))","v":""},{"$f":"IF(ROWS(L$5:L34)>$G$2,\"\",INDEX(B$2:B$102,SMALL(IF($B$2:$B$102=$F$2,ROW($B$2:$B$102)-ROW($B$2)+1),ROWS(L$5:L34))))","v":""},{"$f":"IF(ROWS(M$5:M34)>$G$2,\"\",INDEX(C$2:C$102,SMALL(IF($B$2:$B$102=$F$2,ROW($B$2:$B$102)-ROW($B$2)+1),ROWS(M$5:M34))))","v":""}]
["2009-12-07","Sioux",147.53,null,null,null,null,null,null,null,{"$f":"IF(ROWS(K$5:K35)>$G$2,\"\",INDEX(A$2:A$102,SMALL(IF($B$2:$B$102=$F$2,ROW($B$2:$B$102)-ROW($B$2)+1),ROWS(K$5:K35))))","v":""},{"$f":"IF(ROWS(L$5:L35)>$G$2,\"\",INDEX(B$2:B$102,SMALL(IF($B$2:$B$102=$F$2,ROW($B$2:$B$102)-ROW($B$2)+1),ROWS(L$5:L35))))","v":""},{"$f":"IF(ROWS(M$5:M35)>$G$2,\"\",INDEX(C$2:C$102,SMALL(IF($B$2:$B$102=$F$2,ROW($B$2:$B$102)-ROW($B$2)+1),ROWS(M$5:M35))))","v":""}]
["2009-12-12","Chin",102.17,null,null,null,null,null,null,null,{"$f":"IF(ROWS(K$5:K36)>$G$2,\"\",INDEX(A$2:A$102,SMALL(IF($B$2:$B$102=$F$2,ROW($B$2:$B$102)-ROW($B$2)+1),ROWS(K$5:K36))))","v":""},{"$f":"IF(ROWS(L$5:L36)>$G$2,\"\",INDEX(B$2:B$102,SMALL(IF($B$2:$B$102=$F$2,ROW($B$2:$B$102)-ROW($B$2)+1),ROWS(L$5:L36))))","v":""},{"$f":"IF(ROWS(M$5:M36)>$G$2,\"\",INDEX(C$2:C$102,SMALL(IF($B$2:$B$102=$F$2,ROW($B$2:$B$102)-ROW($B$2)+1),ROWS(M$5:M36))))","v":""}]
["2009-12-30","Smith",114.4,null,null,null,null,null,null,null,{"$f":"IF(ROWS(K$5:K37)>$G$2,\"\",INDEX(A$2:A$102,SMALL(IF($B$2:$B$102=$F$2,ROW($B$2:$B$102)-ROW($B$2)+1),ROWS(K$5:K37))))","v":""},{"$f":"IF(ROWS(L$5:L37)>$G$2,\"\",INDEX(B$2:B$102,SMALL(IF($B$2:$B$102=$F$2,ROW($B$2:$B$102)-ROW($B$2)+1),ROWS(L$5:L37))))","v":""},{"$f":"IF(ROWS(M$5:M37)>$G$2,\"\",INDEX(C$2:C$102,SMALL(IF($B$2:$B$102=$F$2,ROW($B$2:$B$102)-ROW($B$2)+1),ROWS(M$5:M37))))","v":""}]
["2009-12-27","Chin",129.65,null,null,null,null,null,null,null,{"$f":"IF(ROWS(K$5:K38)>$G$2,\"\",INDEX(A$2:A$102,SMALL(IF($B$2:$B$102=$F$2,ROW($B$2:$B$102)-ROW($B$2)+1),ROWS(K$5:K38))))","v":""},{"$f":"IF(ROWS(L$5:L38)>$G$2,\"\",INDEX(B$2:B$102,SMALL(IF($B$2:$B$102=$F$2,ROW($B$2:$B$102)-ROW($B$2)+1),ROWS(L$5:L38))))","v":""},{"$f":"IF(ROWS(M$5:M38)>$G$2,\"\",INDEX(C$2:C$102,SMALL(IF($B$2:$B$102=$F$2,ROW($B$2:$B$102)-ROW($B$2)+1),ROWS(M$5:M38))))","v":""}]
["2009-12-29","Chin",128.94999999999999,null,null,null,null,null,null,null,{"$f":"IF(ROWS(K$5:K39)>$G$2,\"\",INDEX(A$2:A$102,SMALL(IF($B$2:$B$102=$F$2,ROW($B$2:$B$102)-ROW($B$2)+1),ROWS(K$5:K39))))","v":""},{"$f":"IF(ROWS(L$5:L39)>$G$2,\"\",INDEX(B$2:B$102,SMALL(IF($B$2:$B$102=$F$2,ROW($B$2:$B$102)-ROW($B$2)+1),ROWS(L$5:L39))))","v":""},{"$f":"IF(ROWS(M$5:M39)>$G$2,\"\",INDEX(C$2:C$102,SMALL(IF($B$2:$B$102=$F$2,ROW($B$2:$B$102)-ROW($B$2)+1),ROWS(M$5:M39))))","v":""}]
["2010-01-05","Gault",121.33,null,null,null,null,null,null,null,{"$f":"IF(ROWS(K$5:K40)>$G$2,\"\",INDEX(A$2:A$102,SMALL(IF($B$2:$B$102=$F$2,ROW($B$2:$B$102)-ROW($B$2)+1),ROWS(K$5:K40))))","v":""},{"$f":"IF(ROWS(L$5:L40)>$G$2,\"\",INDEX(B$2:B$102,SMALL(IF($B$2:$B$102=$F$2,ROW($B$2:$B$102)-ROW($B$2)+1),ROWS(L$5:L40))))","v":""},{"$f":"IF(ROWS(M$5:M40)>$G$2,\"\",INDEX(C$2:C$102,SMALL(IF($B$2:$B$102=$F$2,ROW($B$2:$B$102)-ROW($B$2)+1),ROWS(M$5:M40))))","v":""}]
["2009-12-15","Pham",102.64,null,null,null,null,null,null,null,{"$f":"IF(ROWS(K$5:K41)>$G$2,\"\",INDEX(A$2:A$102,SMALL(IF($B$2:$B$102=$F$2,ROW($B$2:$B$102)-ROW($B$2)+1),ROWS(K$5:K41))))","v":""},{"$f":"IF(ROWS(L$5:L41)>$G$2,\"\",INDEX(B$2:B$102,SMALL(IF($B$2:$B$102=$F$2,ROW($B$2:$B$102)-ROW($B$2)+1),ROWS(L$5:L41))))","v":""},{"$f":"IF(ROWS(M$5:M41)>$G$2,\"\",INDEX(C$2:C$102,SMALL(IF($B$2:$B$102=$F$2,ROW($B$2:$B$102)-ROW($B$2)+1),ROWS(M$5:M41))))","v":""}]
["2009-12-01","Pham",132.12,null,null,null,null,null,null,null,{"$f":"IF(ROWS(K$5:K42)>$G$2,\"\",INDEX(A$2:A$102,SMALL(IF($B$2:$B$102=$F$2,ROW($B$2:$B$102)-ROW($B$2)+1),ROWS(K$5:K42))))","v":""},{"$f":"IF(ROWS(L$5:L42)>$G$2,\"\",INDEX(B$2:B$102,SMALL(IF($B$2:$B$102=$F$2,ROW($B$2:$B$102)-ROW($B$2)+1),ROWS(L$5:L42))))","v":""},{"$f":"IF(ROWS(M$5:M42)>$G$2,\"\",INDEX(C$2:C$102,SMALL(IF($B$2:$B$102=$F$2,ROW($B$2:$B$102)-ROW($B$2)+1),ROWS(M$5:M42))))","v":""}]
["2010-02-07","Franks",100.83,null,null,null,null,null,null,null,{"$f":"IF(ROWS(K$5:K43)>$G$2,\"\",INDEX(A$2:A$102,SMALL(IF($B$2:$B$102=$F$2,ROW($B$2:$B$102)-ROW($B$2)+1),ROWS(K$5:K43))))","v":""},{"$f":"IF(ROWS(L$5:L43)>$G$2,\"\",INDEX(B$2:B$102,SMALL(IF($B$2:$B$102=$F$2,ROW($B$2:$B$102)-ROW($B$2)+1),ROWS(L$5:L43))))","v":""},{"$f":"IF(ROWS(M$5:M43)>$G$2,\"\",INDEX(C$2:C$102,SMALL(IF($B$2:$B$102=$F$2,ROW($B$2:$B$102)-ROW($B$2)+1),ROWS(M$5:M43))))","v":""}]
["2009-11-26","Sioux",79.42,null,null,null,null,null,null,null,{"$f":"IF(ROWS(K$5:K44)>$G$2,\"\",INDEX(A$2:A$102,SMALL(IF($B$2:$B$102=$F$2,ROW($B$2:$B$102)-ROW($B$2)+1),ROWS(K$5:K44))))","v":""},{"$f":"IF(ROWS(L$5:L44)>$G$2,\"\",INDEX(B$2:B$102,SMALL(IF($B$2:$B$102=$F$2,ROW($B$2:$B$102)-ROW($B$2)+1),ROWS(L$5:L44))))","v":""},{"$f":"IF(ROWS(M$5:M44)>$G$2,\"\",INDEX(C$2:C$102,SMALL(IF($B$2:$B$102=$F$2,ROW($B$2:$B$102)-ROW($B$2)+1),ROWS(M$5:M44))))","v":""}]
["2010-01-04","Pham",100.09,null,null,null,null,null,null,null,{"$f":"IF(ROWS(K$5:K45)>$G$2,\"\",INDEX(A$2:A$102,SMALL(IF($B$2:$B$102=$F$2,ROW($B$2:$B$102)-ROW($B$2)+1),ROWS(K$5:K45))))","v":""},{"$f":"IF(ROWS(L$5:L45)>$G$2,\"\",INDEX(B$2:B$102,SMALL(IF($B$2:$B$102=$F$2,ROW($B$2:$B$102)-ROW($B$2)+1),ROWS(L$5:L45))))","v":""},{"$f":"IF(ROWS(M$5:M45)>$G$2,\"\",INDEX(C$2:C$102,SMALL(IF($B$2:$B$102=$F$2,ROW($B$2:$B$102)-ROW($B$2)+1),ROWS(M$5:M45))))","v":""}]
["2010-01-29","Franks",83.37,null,null,null,null,null,null,null,{"$f":"IF(ROWS(K$5:K46)>$G$2,\"\",INDEX(A$2:A$102,SMALL(IF($B$2:$B$102=$F$2,ROW($B$2:$B$102)-ROW($B$2)+1),ROWS(K$5:K46))))","v":""},{"$f":"IF(ROWS(L$5:L46)>$G$2,\"\",INDEX(B$2:B$102,SMALL(IF($B$2:$B$102=$F$2,ROW($B$2:$B$102)-ROW($B$2)+1),ROWS(L$5:L46))))","v":""},{"$f":"IF(ROWS(M$5:M46)>$G$2,\"\",INDEX(C$2:C$102,SMALL(IF($B$2:$B$102=$F$2,ROW($B$2:$B$102)-ROW($B$2)+1),ROWS(M$5:M46))))","v":""}]
["2010-01-19","Franks",89.11,null,null,null,null,null,null,null,{"$f":"IF(ROWS(K$5:K47)>$G$2,\"\",INDEX(A$2:A$102,SMALL(IF($B$2:$B$102=$F$2,ROW($B$2:$B$102)-ROW($B$2)+1),ROWS(K$5:K47))))","v":""},{"$f":"IF(ROWS(L$5:L47)>$G$2,\"\",INDEX(B$2:B$102,SMALL(IF($B$2:$B$102=$F$2,ROW($B$2:$B$102)-ROW($B$2)+1),ROWS(L$5:L47))))","v":""},{"$f":"IF(ROWS(M$5:M47)>$G$2,\"\",INDEX(C$2:C$102,SMALL(IF($B$2:$B$102=$F$2,ROW($B$2:$B$102)-ROW($B$2)+1),ROWS(M$5:M47))))","v":""}]
["2010-02-14","Smith",126.97,null,null,null,null,null,null,null,{"$f":"IF(ROWS(K$5:K48)>$G$2,\"\",INDEX(A$2:A$102,SMALL(IF($B$2:$B$102=$F$2,ROW($B$2:$B$102)-ROW($B$2)+1),ROWS(K$5:K48))))","v":""},{"$f":"IF(ROWS(L$5:L48)>$G$2,\"\",INDEX(B$2:B$102,SMALL(IF($B$2:$B$102=$F$2,ROW($B$2:$B$102)-ROW($B$2)+1),ROWS(L$5:L48))))","v":""},{"$f":"IF(ROWS(M$5:M48)>$G$2,\"\",INDEX(C$2:C$102,SMALL(IF($B$2:$B$102=$F$2,ROW($B$2:$B$102)-ROW($B$2)+1),ROWS(M$5:M48))))","v":""}]
["2009-12-03","Smith",154.31,null,null,null,null,null,null,null,{"$f":"IF(ROWS(K$5:K49)>$G$2,\"\",INDEX(A$2:A$102,SMALL(IF($B$2:$B$102=$F$2,ROW($B$2:$B$102)-ROW($B$2)+1),ROWS(K$5:K49))))","v":""},{"$f":"IF(ROWS(L$5:L49)>$G$2,\"\",INDEX(B$2:B$102,SMALL(IF($B$2:$B$102=$F$2,ROW($B$2:$B$102)-ROW($B$2)+1),ROWS(L$5:L49))))","v":""},{"$f":"IF(ROWS(M$5:M49)>$G$2,\"\",INDEX(C$2:C$102,SMALL(IF($B$2:$B$102=$F$2,ROW($B$2:$B$102)-ROW($B$2)+1),ROWS(M$5:M49))))","v":""}]
["2010-01-02","Sioux",76.59,null,null,null,null,null,null,null,{"$f":"IF(ROWS(K$5:K50)>$G$2,\"\",INDEX(A$2:A$102,SMALL(IF($B$2:$B$102=$F$2,ROW($B$2:$B$102)-ROW($B$2)+1),ROWS(K$5:K50))))","v":""},{"$f":"IF(ROWS(L$5:L50)>$G$2,\"\",INDEX(B$2:B$102,SMALL(IF($B$2:$B$102=$F$2,ROW($B$2:$B$102)-ROW($B$2)+1),ROWS(L$5:L50))))","v":""},{"$f":"IF(ROWS(M$5:M50)>$G$2,\"\",INDEX(C$2:C$102,SMALL(IF($B$2:$B$102=$F$2,ROW($B$2:$B$102)-ROW($B$2)+1),ROWS(M$5:M50))))","v":""}]
["2009-12-29","Gault",106.94,null,null,null,null,null,null,null,{"$f":"IF(ROWS(K$5:K51)>$G$2,\"\",INDEX(A$2:A$102,SMALL(IF($B$2:$B$102=$F$2,ROW($B$2:$B$102)-ROW($B$2)+1),ROWS(K$5:K51))))","v":""},{"$f":"IF(ROWS(L$5:L51)>$G$2,\"\",INDEX(B$2:B$102,SMALL(IF($B$2:$B$102=$F$2,ROW($B$2:$B$102)-ROW($B$2)+1),ROWS(L$5:L51))))","v":""},{"$f":"IF(ROWS(M$5:M51)>$G$2,\"\",INDEX(C$2:C$102,SMALL(IF($B$2:$B$102=$F$2,ROW($B$2:$B$102)-ROW($B$2)+1),ROWS(M$5:M51))))","v":""}]
["2009-11-26","Chin",129.86000000000001,null,null,null,null,null,null,null,{"$f":"IF(ROWS(K$5:K52)>$G$2,\"\",INDEX(A$2:A$102,SMALL(IF($B$2:$B$102=$F$2,ROW($B$2:$B$102)-ROW($B$2)+1),ROWS(K$5:K52))))","v":""},{"$f":"IF(ROWS(L$5:L52)>$G$2,\"\",INDEX(B$2:B$102,SMALL(IF($B$2:$B$102=$F$2,ROW($B$2:$B$102)-ROW($B$2)+1),ROWS(L$5:L52))))","v":""},{"$f":"IF(ROWS(M$5:M52)>$G$2,\"\",INDEX(C$2:C$102,SMALL(IF($B$2:$B$102=$F$2,ROW($B$2:$B$102)-ROW($B$2)+1),ROWS(M$5:M52))))","v":""}]
["2009-12-24","Pham",100.76,null,null,null,null,null,null,null,{"$f":"IF(ROWS(K$5:K53)>$G$2,\"\",INDEX(A$2:A$102,SMALL(IF($B$2:$B$102=$F$2,ROW($B$2:$B$102)-ROW($B$2)+1),ROWS(K$5:K53))))","v":""},{"$f":"IF(ROWS(L$5:L53)>$G$2,\"\",INDEX(B$2:B$102,SMALL(IF($B$2:$B$102=$F$2,ROW($B$2:$B$102)-ROW($B$2)+1),ROWS(L$5:L53))))","v":""},{"$f":"IF(ROWS(M$5:M53)>$G$2,\"\",INDEX(C$2:C$102,SMALL(IF($B$2:$B$102=$F$2,ROW($B$2:$B$102)-ROW($B$2)+1),ROWS(M$5:M53))))","v":""}]
["2009-12-10","Gault",124.59,null,null,null,null,null,null,null,{"$f":"IF(ROWS(K$5:K54)>$G$2,\"\",INDEX(A$2:A$102,SMALL(IF($B$2:$B$102=$F$2,ROW($B$2:$B$102)-ROW($B$2)+1),ROWS(K$5:K54))))","v":""},{"$f":"IF(ROWS(L$5:L54)>$G$2,\"\",INDEX(B$2:B$102,SMALL(IF($B$2:$B$102=$F$2,ROW($B$2:$B$102)-ROW($B$2)+1),ROWS(L$5:L54))))","v":""},{"$f":"IF(ROWS(M$5:M54)>$G$2,\"\",INDEX(C$2:C$102,SMALL(IF($B$2:$B$102=$F$2,ROW($B$2:$B$102)-ROW($B$2)+1),ROWS(M$5:M54))))","v":""}]
["2009-12-31","Smith",150.31,null,null,null,null,null,null,null,{"$f":"IF(ROWS(K$5:K55)>$G$2,\"\",INDEX(A$2:A$102,SMALL(IF($B$2:$B$102=$F$2,ROW($B$2:$B$102)-ROW($B$2)+1),ROWS(K$5:K55))))","v":""},{"$f":"IF(ROWS(L$5:L55)>$G$2,\"\",INDEX(B$2:B$102,SMALL(IF($B$2:$B$102=$F$2,ROW($B$2:$B$102)-ROW($B$2)+1),ROWS(L$5:L55))))","v":""},{"$f":"IF(ROWS(M$5:M55)>$G$2,\"\",INDEX(C$2:C$102,SMALL(IF($B$2:$B$102=$F$2,ROW($B$2:$B$102)-ROW($B$2)+1),ROWS(M$5:M55))))","v":""}]
["2009-12-16","Franks",119.78,null,null,null,null,null,null,null,{"$f":"IF(ROWS(K$5:K56)>$G$2,\"\",INDEX(A$2:A$102,SMALL(IF($B$2:$B$102=$F$2,ROW($B$2:$B$102)-ROW($B$2)+1),ROWS(K$5:K56))))","v":""},{"$f":"IF(ROWS(L$5:L56)>$G$2,\"\",INDEX(B$2:B$102,SMALL(IF($B$2:$B$102=$F$2,ROW($B$2:$B$102)-ROW($B$2)+1),ROWS(L$5:L56))))","v":""},{"$f":"IF(ROWS(M$5:M56)>$G$2,\"\",INDEX(C$2:C$102,SMALL(IF($B$2:$B$102=$F$2,ROW($B$2:$B$102)-ROW($B$2)+1),ROWS(M$5:M56))))","v":""}]
["2010-01-03","Pham",93.37,null,null,null,null,null,null,null,{"$f":"IF(ROWS(K$5:K57)>$G$2,\"\",INDEX(A$2:A$102,SMALL(IF($B$2:$B$102=$F$2,ROW($B$2:$B$102)-ROW($B$2)+1),ROWS(K$5:K57))))","v":""},{"$f":"IF(ROWS(L$5:L57)>$G$2,\"\",INDEX(B$2:B$102,SMALL(IF($B$2:$B$102=$F$2,ROW($B$2:$B$102)-ROW($B$2)+1),ROWS(L$5:L57))))","v":""},{"$f":"IF(ROWS(M$5:M57)>$G$2,\"\",INDEX(C$2:C$102,SMALL(IF($B$2:$B$102=$F$2,ROW($B$2:$B$102)-ROW($B$2)+1),ROWS(M$5:M57))))","v":""}]
["2009-12-26","Chin",87.06,null,null,null,null,null,null,null,{"$f":"IF(ROWS(K$5:K58)>$G$2,\"\",INDEX(A$2:A$102,SMALL(IF($B$2:$B$102=$F$2,ROW($B$2:$B$102)-ROW($B$2)+1),ROWS(K$5:K58))))","v":""},{"$f":"IF(ROWS(L$5:L58)>$G$2,\"\",INDEX(B$2:B$102,SMALL(IF($B$2:$B$102=$F$2,ROW($B$2:$B$102)-ROW($B$2)+1),ROWS(L$5:L58))))","v":""},{"$f":"IF(ROWS(M$5:M58)>$G$2,\"\",INDEX(C$2:C$102,SMALL(IF($B$2:$B$102=$F$2,ROW($B$2:$B$102)-ROW($B$2)+1),ROWS(M$5:M58))))","v":""}]
["2010-01-05","Smith",147.49,null,null,null,null,null,null,null,{"$f":"IF(ROWS(K$5:K59)>$G$2,\"\",INDEX(A$2:A$102,SMALL(IF($B$2:$B$102=$F$2,ROW($B$2:$B$102)-ROW($B$2)+1),ROWS(K$5:K59))))","v":""},{"$f":"IF(ROWS(L$5:L59)>$G$2,\"\",INDEX(B$2:B$102,SMALL(IF($B$2:$B$102=$F$2,ROW($B$2:$B$102)-ROW($B$2)+1),ROWS(L$5:L59))))","v":""},{"$f":"IF(ROWS(M$5:M59)>$G$2,\"\",INDEX(C$2:C$102,SMALL(IF($B$2:$B$102=$F$2,ROW($B$2:$B$102)-ROW($B$2)+1),ROWS(M$5:M59))))","v":""}]
["2009-12-19","Smith",136.94,null,null,null,null,null,null,null,{"$f":"IF(ROWS(K$5:K60)>$G$2,\"\",INDEX(A$2:A$102,SMALL(IF($B$2:$B$102=$F$2,ROW($B$2:$B$102)-ROW($B$2)+1),ROWS(K$5:K60))))","v":""},{"$f":"IF(ROWS(L$5:L60)>$G$2,\"\",INDEX(B$2:B$102,SMALL(IF($B$2:$B$102=$F$2,ROW($B$2:$B$102)-ROW($B$2)+1),ROWS(L$5:L60))))","v":""},{"$f":"IF(ROWS(M$5:M60)>$G$2,\"\",INDEX(C$2:C$102,SMALL(IF($B$2:$B$102=$F$2,ROW($B$2:$B$102)-ROW($B$2)+1),ROWS(M$5:M60))))","v":""}]
["2009-11-20","Gault",93.33,null,null,null,null,null,null,null,{"$f":"IF(ROWS(K$5:K61)>$G$2,\"\",INDEX(A$2:A$102,SMALL(IF($B$2:$B$102=$F$2,ROW($B$2:$B$102)-ROW($B$2)+1),ROWS(K$5:K61))))","v":""},{"$f":"IF(ROWS(L$5:L61)>$G$2,\"\",INDEX(B$2:B$102,SMALL(IF($B$2:$B$102=$F$2,ROW($B$2:$B$102)-ROW($B$2)+1),ROWS(L$5:L61))))","v":""},{"$f":"IF(ROWS(M$5:M61)>$G$2,\"\",INDEX(C$2:C$102,SMALL(IF($B$2:$B$102=$F$2,ROW($B$2:$B$102)-ROW($B$2)+1),ROWS(M$5:M61))))","v":""}]
["2010-01-03","Smith",128.97,null,null,null,null,null,null,null,{"$f":"IF(ROWS(K$5:K62)>$G$2,\"\",INDEX(A$2:A$102,SMALL(IF($B$2:$B$102=$F$2,ROW($B$2:$B$102)-ROW($B$2)+1),ROWS(K$5:K62))))","v":""},{"$f":"IF(ROWS(L$5:L62)>$G$2,\"\",INDEX(B$2:B$102,SMALL(IF($B$2:$B$102=$F$2,ROW($B$2:$B$102)-ROW($B$2)+1),ROWS(L$5:L62))))","v":""},{"$f":"IF(ROWS(M$5:M62)>$G$2,\"\",INDEX(C$2:C$102,SMALL(IF($B$2:$B$102=$F$2,ROW($B$2:$B$102)-ROW($B$2)+1),ROWS(M$5:M62))))","v":""}]
["2009-12-14","Smith",114.93,null,null,null,null,null,null,null,{"$f":"IF(ROWS(K$5:K63)>$G$2,\"\",INDEX(A$2:A$102,SMALL(IF($B$2:$B$102=$F$2,ROW($B$2:$B$102)-ROW($B$2)+1),ROWS(K$5:K63))))","v":""},{"$f":"IF(ROWS(L$5:L63)>$G$2,\"\",INDEX(B$2:B$102,SMALL(IF($B$2:$B$102=$F$2,ROW($B$2:$B$102)-ROW($B$2)+1),ROWS(L$5:L63))))","v":""},{"$f":"IF(ROWS(M$5:M63)>$G$2,\"\",INDEX(C$2:C$102,SMALL(IF($B$2:$B$102=$F$2,ROW($B$2:$B$102)-ROW($B$2)+1),ROWS(M$5:M63))))","v":""}]
["2010-01-01","Sioux",104.57,null,null,null,null,null,null,null,{"$f":"IF(ROWS(K$5:K64)>$G$2,\"\",INDEX(A$2:A$102,SMALL(IF($B$2:$B$102=$F$2,ROW($B$2:$B$102)-ROW($B$2)+1),ROWS(K$5:K64))))","v":""},{"$f":"IF(ROWS(L$5:L64)>$G$2,\"\",INDEX(B$2:B$102,SMALL(IF($B$2:$B$102=$F$2,ROW($B$2:$B$102)-ROW($B$2)+1),ROWS(L$5:L64))))","v":""},{"$f":"IF(ROWS(M$5:M64)>$G$2,\"\",INDEX(C$2:C$102,SMALL(IF($B$2:$B$102=$F$2,ROW($B$2:$B$102)-ROW($B$2)+1),ROWS(M$5:M64))))","v":""}]
["2009-11-27","Sioux",119.53,null,null,null,null,null,null,null,{"$f":"IF(ROWS(K$5:K65)>$G$2,\"\",INDEX(A$2:A$102,SMALL(IF($B$2:$B$102=$F$2,ROW($B$2:$B$102)-ROW($B$2)+1),ROWS(K$5:K65))))","v":""},{"$f":"IF(ROWS(L$5:L65)>$G$2,\"\",INDEX(B$2:B$102,SMALL(IF($B$2:$B$102=$F$2,ROW($B$2:$B$102)-ROW($B$2)+1),ROWS(L$5:L65))))","v":""},{"$f":"IF(ROWS(M$5:M65)>$G$2,\"\",INDEX(C$2:C$102,SMALL(IF($B$2:$B$102=$F$2,ROW($B$2:$B$102)-ROW($B$2)+1),ROWS(M$5:M65))))","v":""}]
["2010-01-01","Pham",127.99,null,null,null,null,null,null,null,{"$f":"IF(ROWS(K$5:K66)>$G$2,\"\",INDEX(A$2:A$102,SMALL(IF($B$2:$B$102=$F$2,ROW($B$2:$B$102)-ROW($B$2)+1),ROWS(K$5:K66))))","v":""},{"$f":"IF(ROWS(L$5:L66)>$G$2,\"\",INDEX(B$2:B$102,SMALL(IF($B$2:$B$102=$F$2,ROW($B$2:$B$102)-ROW($B$2)+1),ROWS(L$5:L66))))","v":""},{"$f":"IF(ROWS(M$5:M66)>$G$2,\"\",INDEX(C$2:C$102,SMALL(IF($B$2:$B$102=$F$2,ROW($B$2:$B$102)-ROW($B$2)+1),ROWS(M$5:M66))))","v":""}]
["2009-12-03","Smith",88.69]
["2009-11-25","Smith",115.67]
["2010-01-07","Pham",114.54]
["2010-02-02","Smith",128.15]
["2010-02-08","Gault",126.33]
["2010-01-13","Smith",112.03]
["2009-11-20","Smith",145.33000000000001]
["2009-12-23","Gault",109.7]
["2009-11-26","Sioux",139.13]
["2009-12-01","Sioux",112.5]
["2009-11-29","Pham",122.21]
["2010-01-13","Smith",135.77000000000001]
["2010-01-09","Pham",75.17]
["2010-01-30","Sioux",104.5]
["2010-02-04","Gault",86.1]
["2010-01-02","Sioux",143.85]
["2010-01-16","Gault",104.36]
["2009-12-28","Smith",135.02000000000001]
["2009-12-26","Pham",83.26]
["2009-11-28","Sioux",114.53]
["2010-02-02","Smith",117.63]
["2009-12-27","Gault",102.24]
["2010-02-01","Chin",139.21]
["2009-12-25","Smith",119.09]
["2010-01-17","Pham",134.11000000000001]
["2010-01-15","Sioux",96.17]
["2010-01-10","Smith",108.54]
["2010-01-05","Gault",78.89]
["2010-01-20","Pham",130.37]
["2009-12-08","Chin",130.5]
["2010-01-16","Franks",123.13]
["2009-12-19","Gault",131.04]
["2009-12-17","Pham",76.260000000000005]
["2010-01-19","Pham",78.459999999999994]
["2009-11-21","Gault",79.11]
["2010-02-18","Gault",75.349999999999994]

{"sheet":"670an","index":23,"n_rows":102,"n_cols":13,"rows_kept":102,"cut":false,"hidden":false,"merged":[]}
["Date","SalesRep","Sales ",null,"Month","SalesRep","Count",null,"SalesRep"]
["2009-12-25","Gault",94.69,null,null,"Sioux",{"$f":"COUNTIF($A$2:$C$102,F2)","v":14},null,"Gault"]
["2009-12-15","Smith",130.19999999999999,null,null,null,null,null,"Smith"]
["2009-12-11","Franks",149.94999999999999,null,"Date","SalesRep","Sales ",null,"Franks",null,"Date","SalesRep","Sales "]
["2009-12-01","Gault",94.11,null,{"$f":"IF(ROWS(E$5:E5)>$G$2,\"\",INDEX(A$2:A$102,_xlfn.AGGREGATE(15,6,(ROW($A$2:$A$102)-ROW($A$2)+1)/($B$2:$B$102=$F$2),ROWS(E$5:E5))))","v":"2010-02-10"},{"$f":"IF(ROWS(F$5:F5)>$G$2,\"\",INDEX(B$2:B$102,_xlfn.AGGREGATE(15,6,(ROW($A$2:$A$102)-ROW($A$2)+1)/($B$2:$B$102=$F$2),ROWS(F$5:F5))))","v":"Sioux"},{"$f":"IF(ROWS(G$5:G5)>$G$2,\"\",INDEX(C$2:C$102,_xlfn.AGGREGATE(15,6,(ROW($A$2:$A$102)-ROW($A$2)+1)/($B$2:$B$102=$F$2),ROWS(G$5:G5))))","v":108.72},null,"Pham",null,{"$f":"IF(ROWS(K$5:K5)>$G$2,\"\",INDEX(A$2:A$102,SMALL(IF($B$2:$B$102=$F$2,ROW($B$2:$B$102)-ROW($B$2)+1),ROWS(K$5:K5))))","v":"2010-02-10"},{"$f":"IF(ROWS(L$5:L5)>$G$2,\"\",INDEX(B$2:B$102,SMALL(IF($B$2:$B$102=$F$2,ROW($B$2:$B$102)-ROW($B$2)+1),ROWS(L$5:L5))))","v":"Sioux"},{"$f":"IF(ROWS(M$5:M5)>$G$2,\"\",INDEX(C$2:C$102,SMALL(IF($B$2:$B$102=$F$2,ROW($B$2:$B$102)-ROW($B$2)+1),ROWS(M$5:M5))))","v":108.72}]
["2009-12-11","Franks",136.13999999999999,null,{"$f":"IF(ROWS(E$5:E6)>$G$2,\"\",INDEX(A$2:A$102,_xlfn.AGGREGATE(15,6,(ROW($A$2:$A$102)-ROW($A$2)+1)/($B$2:$B$102=$F$2),ROWS(E$5:E6))))","v":"2010-01-07"},{"$f":"IF(ROWS(F$5:F6)>$G$2,\"\",INDEX(B$2:B$102,_xlfn.AGGREGATE(15,6,(ROW($A$2:$A$102)-ROW($A$2)+1)/($B$2:$B$102=$F$2),ROWS(F$5:F6))))","v":"Sioux"},{"$f":"IF(ROWS(G$5:G6)>$G$2,\"\",INDEX(C$2:C$102,_xlfn.AGGREGATE(15,6,(ROW($A$2:$A$102)-ROW($A$2)+1)/($B$2:$B$102=$F$2),ROWS(G$5:G6))))","v":132.51},null,"Sioux",null,{"$f":"IF(ROWS(K$5:K6)>$G$2,\"\",INDEX(A$2:A$102,SMALL(IF($B$2:$B$102=$F$2,ROW($B$2:$B$102)-ROW($B$2)+1),ROWS(K$5:K6))))","v":"2010-01-07"},{"$f":"IF(ROWS(L$5:L6)>$G$2,\"\",INDEX(B$2:B$102,SMALL(IF($B$2:$B$102=$F$2,ROW($B$2:$B$102)-ROW($B$2)+1),ROWS(L$5:L6))))","v":"Sioux"},{"$f":"IF(ROWS(M$5:M6)>$G$2,\"\",INDEX(C$2:C$102,SMALL(IF($B$2:$B$102=$F$2,ROW($B$2:$B$102)-ROW($B$2)+1),ROWS(M$5:M6))))","v":132.51}]
["2010-02-12","Pham",133.16999999999999,null,{"$f":"IF(ROWS(E$5:E7)>$G$2,\"\",INDEX(A$2:A$102,_xlfn.AGGREGATE(15,6,(ROW($A$2:$A$102)-ROW($A$2)+1)/($B$2:$B$102=$F$2),ROWS(E$5:E7))))","v":"2009-12-13"},{"$f":"IF(ROWS(F$5:F7)>$G$2,\"\",INDEX(B$2:B$102,_xlfn.AGGREGATE(15,6,(ROW($A$2:$A$102)-ROW($A$2)+1)/($B$2:$B$102=$F$2),ROWS(F$5:F7))))","v":"Sioux"},{"$f":"IF(ROWS(G$5:G7)>$G$2,\"\",INDEX(C$2:C$102,_xlfn.AGGREGATE(15,6,(ROW($A$2:$A$102)-ROW($A$2)+1)/($B$2:$B$102=$F$2),ROWS(G$5:G7))))","v":139.91999999999999},null,"Chin",null,{"$f":"IF(ROWS(K$5:K7)>$G$2,\"\",INDEX(A$2:A$102,SMALL(IF($B$2:$B$102=$F$2,ROW($B$2:$B$102)-ROW($B$2)+1),ROWS(K$5:K7))))","v":"2009-12-13"},{"$f":"IF(ROWS(L$5:L7)>$G$2,\"\",INDEX(B$2:B$102,SMALL(IF($B$2:$B$102=$F$2,ROW($B$2:$B$102)-ROW($B$2)+1),ROWS(L$5:L7))))","v":"Sioux"},{"$f":"IF(ROWS(M$5:M7)>$G$2,\"\",INDEX(C$2:C$102,SMALL(IF($B$2:$B$102=$F$2,ROW($B$2:$B$102)-ROW($B$2)+1),ROWS(M$5:M7))))","v":139.91999999999999}]
["2009-12-07","Smith",80.81,null,{"$f":"IF(ROWS(E$5:E8)>$G$2,\"\",INDEX(A$2:A$102,_xlfn.AGGREGATE(15,6,(ROW($A$2:$A$102)-ROW($A$2)+1)/($B$2:$B$102=$F$2),ROWS(E$5:E8))))","v":"2009-12-07"},{"$f":"IF(ROWS(F$5:F8)>$G$2,\"\",INDEX(B$2:B$102,_xlfn.AGGREGATE(15,6,(ROW($A$2:$A$102)-ROW($A$2)+1)/($B$2:$B$102=$F$2),ROWS(F$5:F8))))","v":"Sioux"},{"$f":"IF(ROWS(G$5:G8)>$G$2,\"\",INDEX(C$2:C$102,_xlfn.AGGREGATE(15,6,(ROW($A$2:$A$102)-ROW($A$2)+1)/($B$2:$B$102=$F$2),ROWS(G$5:G8))))","v":147.53},null,null,null,{"$f":"IF(ROWS(K$5:K8)>$G$2,\"\",INDEX(A$2:A$102,SMALL(IF($B$2:$B$102=$F$2,ROW($B$2:$B$102)-ROW($B$2)+1),ROWS(K$5:K8))))","v":"2009-12-07"},{"$f":"IF(ROWS(L$5:L8)>$G$2,\"\",INDEX(B$2:B$102,SMALL(IF($B$2:$B$102=$F$2,ROW($B$2:$B$102)-ROW($B$2)+1),ROWS(L$5:L8))))","v":"Sioux"},{"$f":"IF(ROWS(M$5:M8)>$G$2,\"\",INDEX(C$2:C$102,SMALL(IF($B$2:$B$102=$F$2,ROW($B$2:$B$102)-ROW($B$2)+1),ROWS(M$5:M8))))","v":147.53}]
["2009-11-23","Smith",125.38,null,{"$f":"IF(ROWS(E$5:E9)>$G$2,\"\",INDEX(A$2:A$102,_xlfn.AGGREGATE(15,6,(ROW($A$2:$A$102)-ROW($A$2)+1)/($B$2:$B$102=$F$2),ROWS(E$5:E9))))","v":"2009-11-26"},{"$f":"IF(ROWS(F$5:F9)>$G$2,\"\",INDEX(B$2:B$102,_xlfn.AGGREGATE(15,6,(ROW($A$2:$A$102)-ROW($A$2)+1)/($B$2:$B$102=$F$2),ROWS(F$5:F9))))","v":"Sioux"},{"$f":"IF(ROWS(G$5:G9)>$G$2,\"\",INDEX(C$2:C$102,_xlfn.AGGREGATE(15,6,(ROW($A$2:$A$102)-ROW($A$2)+1)/($B$2:$B$102=$F$2),ROWS(G$5:G9))))","v":79.42},null,null,null,{"$f":"IF(ROWS(K$5:K9)>$G$2,\"\",INDEX(A$2:A$102,SMALL(IF($B$2:$B$102=$F$2,ROW($B$2:$B$102)-ROW($B$2)+1),ROWS(K$5:K9))))","v":"2009-11-26"},{"$f":"IF(ROWS(L$5:L9)>$G$2,\"\",INDEX(B$2:B$102,SMALL(IF($B$2:$B$102=$F$2,ROW($B$2:$B$102)-ROW($B$2)+1),ROWS(L$5:L9))))","v":"Sioux"},{"$f":"IF(ROWS(M$5:M9)>$G$2,\"\",INDEX(C$2:C$102,SMALL(IF($B$2:$B$102=$F$2,ROW($B$2:$B$102)-ROW($B$2)+1),ROWS(M$5:M9))))","v":79.42}]
["2009-11-23","Gault",78.95,null,{"$f":"IF(ROWS(E$5:E10)>$G$2,\"\",INDEX(A$2:A$102,_xlfn.AGGREGATE(15,6,(ROW($A$2:$A$102)-ROW($A$2)+1)/($B$2:$B$102=$F$2),ROWS(E$5:E10))))","v":"2010-01-02"},{"$f":"IF(ROWS(F$5:F10)>$G$2,\"\",INDEX(B$2:B$102,_xlfn.AGGREGATE(15,6,(ROW($A$2:$A$102)-ROW($A$2)+1)/($B$2:$B$102=$F$2),ROWS(F$5:F10))))","v":"Sioux"},{"$f":"IF(ROWS(G$5:G10)>$G$2,\"\",INDEX(C$2:C$102,_xlfn.AGGREGATE(15,6,(ROW($A$2:$A$102)-ROW($A$2)+1)/($B$2:$B$102=$F$2),ROWS(G$5:G10))))","v":76.59},null,null,null,{"$f":"IF(ROWS(K$5:K10)>$G$2,\"\",INDEX(A$2:A$102,SMALL(IF($B$2:$B$102=$F$2,ROW($B$2:$B$102)-ROW($B$2)+1),ROWS(K$5:K10))))","v":"2010-01-02"},{"$f":"IF(ROWS(L$5:L10)>$G$2,\"\",INDEX(B$2:B$102,SMALL(IF($B$2:$B$102=$F$2,ROW($B$2:$B$102)-ROW($B$2)+1),ROWS(L$5:L10))))","v":"Sioux"},{"$f":"IF(ROWS(M$5:M10)>$G$2,\"\",INDEX(C$2:C$102,SMALL(IF($B$2:$B$102=$F$2,ROW($B$2:$B$102)-ROW($B$2)+1),ROWS(M$5:M10))))","v":76.59}]
["2010-01-23","Smith",113.86,null,{"$f":"IF(ROWS(E$5:E11)>$G$2,\"\",INDEX(A$2:A$102,_xlfn.AGGREGATE(15,6,(ROW($A$2:$A$102)-ROW($A$2)+1)/($B$2:$B$102=$F$2),ROWS(E$5:E11))))","v":"2010-01-01"},{"$f":"IF(ROWS(F$5:F11)>$G$2,\"\",INDEX(B$2:B$102,_xlfn.AGGREGATE(15,6,(ROW($A$2:$A$102)-ROW($A$2)+1)/($B$2:$B$102=$F$2),ROWS(F$5:F11))))","v":"Sioux"},{"$f":"IF(ROWS(G$5:G11)>$G$2,\"\",INDEX(C$2:C$102,_xlfn.AGGREGATE(15,6,(ROW($A$2:$A$102)-ROW($A$2)+1)/($B$2:$B$102=$F$2),ROWS(G$5:G11))))","v":104.57},null,null,null,{"$f":"IF(ROWS(K$5:K11)>$G$2,\"\",INDEX(A$2:A$102,SMALL(IF($B$2:$B$102=$F$2,ROW($B$2:$B$102)-ROW($B$2)+1),ROWS(K$5:K11))))","v":"2010-01-01"},{"$f":"IF(ROWS(L$5:L11)>$G$2,\"\",INDEX(B$2:B$102,SMALL(IF($B$2:$B$102=$F$2,ROW($B$2:$B$102)-ROW($B$2)+1),ROWS(L$5:L11))))","v":"Sioux"},{"$f":"IF(ROWS(M$5:M11)>$G$2,\"\",INDEX(C$2:C$102,SMALL(IF($B$2:$B$102=$F$2,ROW($B$2:$B$102)-ROW($B$2)+1),ROWS(M$5:M11))))","v":104.57}]
["2010-01-21","Pham",139.38,null,{"$f":"IF(ROWS(E$5:E12)>$G$2,\"\",INDEX(A$2:A$102,_xlfn.AGGREGATE(15,6,(ROW($A$2:$A$102)-ROW($A$2)+1)/($B$2:$B$102=$F$2),ROWS(E$5:E12))))","v":"2009-11-27"},{"$f":"IF(ROWS(F$5:F12)>$G$2,\"\",INDEX(B$2:B$102,_xlfn.AGGREGATE(15,6,(ROW($A$2:$A$102)-ROW($A$2)+1)/($B$2:$B$102=$F$2),ROWS(F$5:F12))))","v":"Sioux"},{"$f":"IF(ROWS(G$5:G12)>$G$2,\"\",INDEX(C$2:C$102,_xlfn.AGGREGATE(15,6,(ROW($A$2:$A$102)-ROW($A$2)+1)/($B$2:$B$102=$F$2),ROWS(G$5:G12))))","v":119.53},null,null,null,{"$f":"IF(ROWS(K$5:K12)>$G$2,\"\",INDEX(A$2:A$102,SMALL(IF($B$2:$B$102=$F$2,ROW($B$2:$B$102)-ROW($B$2)+1),ROWS(K$5:K12))))","v":"2009-11-27"},{"$f":"IF(ROWS(L$5:L12)>$G$2,\"\",INDEX(B$2:B$102,SMALL(IF($B$2:$B$102=$F$2,ROW($B$2:$B$102)-ROW($B$2)+1),ROWS(L$5:L12))))","v":"Sioux"},{"$f":"IF(ROWS(M$5:M12)>$G$2,\"\",INDEX(C$2:C$102,SMALL(IF($B$2:$B$102=$F$2,ROW($B$2:$B$102)-ROW($B$2)+1),ROWS(M$5:M12))))","v":119.53}]
["2009-12-20","Gault",98.71,null,{"$f":"IF(ROWS(E$5:E13)>$G$2,\"\",INDEX(A$2:A$102,_xlfn.AGGREGATE(15,6,(ROW($A$2:$A$102)-ROW($A$2)+1)/($B$2:$B$102=$F$2),ROWS(E$5:E13))))","v":"2009-11-26"},{"$f":"IF(ROWS(F$5:F13)>$G$2,\"\",INDEX(B$2:B$102,_xlfn.AGGREGATE(15,6,(ROW($A$2:$A$102)-ROW($A$2)+1)/($B$2:$B$102=$F$2),ROWS(F$5:F13))))","v":"Sioux"},{"$f":"IF(ROWS(G$5:G13)>$G$2,\"\",INDEX(C$2:C$102,_xlfn.AGGREGATE(15,6,(ROW($A$2:$A$102)-ROW($A$2)+1)/($B$2:$B$102=$F$2),ROWS(G$5:G13))))","v":139.13},null,null,null,{"$f":"IF(ROWS(K$5:K13)>$G$2,\"\",INDEX(A$2:A$102,SMALL(IF($B$2:$B$102=$F$2,ROW($B$2:$B$102)-ROW($B$2)+1),ROWS(K$5:K13))))","v":"2009-11-26"},{"$f":"IF(ROWS(L$5:L13)>$G$2,\"\",INDEX(B$2:B$102,SMALL(IF($B$2:$B$102=$F$2,ROW($B$2:$B$102)-ROW($B$2)+1),ROWS(L$5:L13))))","v":"Sioux"},{"$f":"IF(ROWS(M$5:M13)>$G$2,\"\",INDEX(C$2:C$102,SMALL(IF($B$2:$B$102=$F$2,ROW($B$2:$B$102)-ROW($B$2)+1),ROWS(M$5:M13))))","v":139.13}]
["2009-12-07","Pham",76.650000000000006,null,{"$f":"IF(ROWS(E$5:E14)>$G$2,\"\",INDEX(A$2:A$102,_xlfn.AGGREGATE(15,6,(ROW($A$2:$A$102)-ROW($A$2)+1)/($B$2:$B$102=$F$2),ROWS(E$5:E14))))","v":"2009-12-01"},{"$f":"IF(ROWS(F$5:F14)>$G$2,\"\",INDEX(B$2:B$102,_xlfn.AGGREGATE(15,6,(ROW($A$2:$A$102)-ROW($A$2)+1)/($B$2:$B$102=$F$2),ROWS(F$5:F14))))","v":"Sioux"},{"$f":"IF(ROWS(G$5:G14)>$G$2,\"\",INDEX(C$2:C$102,_xlfn.AGGREGATE(15,6,(ROW($A$2:$A$102)-ROW($A$2)+1)/($B$2:$B$102=$F$2),ROWS(G$5:G14))))","v":112.5},null,null,null,{"$f":"IF(ROWS(K$5:K14)>$G$2,\"\",INDEX(A$2:A$102,SMALL(IF($B$2:$B$102=$F$2,ROW($B$2:$B$102)-ROW($B$2)+1),ROWS(K$5:K14))))","v":"2009-12-01"},{"$f":"IF(ROWS(L$5:L14)>$G$2,\"\",INDEX(B$2:B$102,SMALL(IF($B$2:$B$102=$F$2,ROW($B$2:$B$102)-ROW($B$2)+1),ROWS(L$5:L14))))","v":"Sioux"},{"$f":"IF(ROWS(M$5:M14)>$G$2,\"\",INDEX(C$2:C$102,SMALL(IF($B$2:$B$102=$F$2,ROW($B$2:$B$102)-ROW($B$2)+1),ROWS(M$5:M14))))","v":112.5}]
["2010-02-11","Gault",126.62,null,{"$f":"IF(ROWS(E$5:E15)>$G$2,\"\",INDEX(A$2:A$102,_xlfn.AGGREGATE(15,6,(ROW($A$2:$A$102)-ROW($A$2)+1)/($B$2:$B$102=$F$2),ROWS(E$5:E15))))","v":"2010-01-30"},{"$f":"IF(ROWS(F$5:F15)>$G$2,\"\",INDEX(B$2:B$102,_xlfn.AGGREGATE(15,6,(ROW($A$2:$A$102)-ROW($A$2)+1)/($B$2:$B$102=$F$2),ROWS(F$5:F15))))","v":"Sioux"},{"$f":"IF(ROWS(G$5:G15)>$G$2,\"\",INDEX(C$2:C$102,_xlfn.AGGREGATE(15,6,(ROW($A$2:$A$102)-ROW($A$2)+1)/($B$2:$B$102=$F$2),ROWS(G$5:G15))))","v":104.5},null,null,null,{"$f":"IF(ROWS(K$5:K15)>$G$2,\"\",INDEX(A$2:A$102,SMALL(IF($B$2:$B$102=$F$2,ROW($B$2:$B$102)-ROW($B$2)+1),ROWS(K$5:K15))))","v":"2010-01-30"},{"$f":"IF(ROWS(L$5:L15)>$G$2,\"\",INDEX(B$2:B$102,SMALL(IF($B$2:$B$102=$F$2,ROW($B$2:$B$102)-ROW($B$2)+1),ROWS(L$5:L15))))","v":"Sioux"},{"$f":"IF(ROWS(M$5:M15)>$G$2,\"\",INDEX(C$2:C$102,SMALL(IF($B$2:$B$102=$F$2,ROW($B$2:$B$102)-ROW($B$2)+1),ROWS(M$5:M15))))","v":104.5}]
["2010-01-13","Franks",107.9,null,{"$f":"IF(ROWS(E$5:E16)>$G$2,\"\",INDEX(A$2:A$102,_xlfn.AGGREGATE(15,6,(ROW($A$2:$A$102)-ROW($A$2)+1)/($B$2:$B$102=$F$2),ROWS(E$5:E16))))","v":"2010-01-02"},{"$f":"IF(ROWS(F$5:F16)>$G$2,\"\",INDEX(B$2:B$102,_xlfn.AGGREGATE(15,6,(ROW($A$2:$A$102)-ROW($A$2)+1)/($B$2:$B$102=$F$2),ROWS(F$5:F16))))","v":"Sioux"},{"$f":"IF(ROWS(G$5:G16)>$G$2,\"\",INDEX(C$2:C$102,_xlfn.AGGREGATE(15,6,(ROW($A$2:$A$102)-ROW($A$2)+1)/($B$2:$B$102=$F$2),ROWS(G$5:G16))))","v":143.85},null,null,null,{"$f":"IF(ROWS(K$5:K16)>$G$2,\"\",INDEX(A$2:A$102,SMALL(IF($B$2:$B$102=$F$2,ROW($B$2:$B$102)-ROW($B$2)+1),ROWS(K$5:K16))))","v":"2010-01-02"},{"$f":"IF(ROWS(L$5:L16)>$G$2,\"\",INDEX(B$2:B$102,SMALL(IF($B$2:$B$102=$F$2,ROW($B$2:$B$102)-ROW($B$2)+1),ROWS(L$5:L16))))","v":"Sioux"},{"$f":"IF(ROWS(M$5:M16)>$G$2,\"\",INDEX(C$2:C$102,SMALL(IF($B$2:$B$102=$F$2,ROW($B$2:$B$102)-ROW($B$2)+1),ROWS(M$5:M16))))","v":143.85}]
["2010-01-28","Gault",130.54,null,{"$f":"IF(ROWS(E$5:E17)>$G$2,\"\",INDEX(A$2:A$102,_xlfn.AGGREGATE(15,6,(ROW($A$2:$A$102)-ROW($A$2)+1)/($B$2:$B$102=$F$2),ROWS(E$5:E17))))","v":"2009-11-28"},{"$f":"IF(ROWS(F$5:F17)>$G$2,\"\",INDEX(B$2:B$102,_xlfn.AGGREGATE(15,6,(ROW($A$2:$A$102)-ROW($A$2)+1)/($B$2:$B$102=$F$2),ROWS(F$5:F17))))","v":"Sioux"},{"$f":"IF(ROWS(G$5:G17)>$G$2,\"\",INDEX(C$2:C$102,_xlfn.AGGREGATE(15,6,(ROW($A$2:$A$102)-ROW($A$2)+1)/($B$2:$B$102=$F$2),ROWS(G$5:G17))))","v":114.53},null,null,null,{"$f":"IF(ROWS(K$5:K17)>$G$2,\"\",INDEX(A$2:A$102,SMALL(IF($B$2:$B$102=$F$2,ROW($B$2:$B$102)-ROW($B$2)+1),ROWS(K$5:K17))))","v":"2009-11-28"},{"$f":"IF(ROWS(L$5:L17)>$G$2,\"\",INDEX(B$2:B$102,SMALL(IF($B$2:$B$102=$F$2,ROW($B$2:$B$102)-ROW($B$2)+1),ROWS(L$5:L17))))","v":"Sioux"},{"$f":"IF(ROWS(M$5:M17)>$G$2,\"\",INDEX(C$2:C$102,SMALL(IF($B$2:$B$102=$F$2,ROW($B$2:$B$102)-ROW($B$2)+1),ROWS(M$5:M17))))","v":114.53}]
["2010-01-25","Gault",140.71,null,{"$f":"IF(ROWS(E$5:E18)>$G$2,\"\",INDEX(A$2:A$102,_xlfn.AGGREGATE(15,6,(ROW($A$2:$A$102)-ROW($A$2)+1)/($B$2:$B$102=$F$2),ROWS(E$5:E18))))","v":"2010-01-15"},{"$f":"IF(ROWS(F$5:F18)>$G$2,\"\",INDEX(B$2:B$102,_xlfn.AGGREGATE(15,6,(ROW($A$2:$A$102)-ROW($A$2)+1)/($B$2:$B$102=$F$2),ROWS(F$5:F18))))","v":"Sioux"},{"$f":"IF(ROWS(G$5:G18)>$G$2,\"\",INDEX(C$2:C$102,_xlfn.AGGREGATE(15,6,(ROW($A$2:$A$102)-ROW($A$2)+1)/($B$2:$B$102=$F$2),ROWS(G$5:G18))))","v":96.17},null,null,null,{"$f":"IF(ROWS(K$5:K18)>$G$2,\"\",INDEX(A$2:A$102,SMALL(IF($B$2:$B$102=$F$2,ROW($B$2:$B$102)-ROW($B$2)+1),ROWS(K$5:K18))))","v":"2010-01-15"},{"$f":"IF(ROWS(L$5:L18)>$G$2,\"\",INDEX(B$2:B$102,SMALL(IF($B$2:$B$102=$F$2,ROW($B$2:$B$102)-ROW($B$2)+1),ROWS(L$5:L18))))","v":"Sioux"},{"$f":"IF(ROWS(M$5:M18)>$G$2,\"\",INDEX(C$2:C$102,SMALL(IF($B$2:$B$102=$F$2,ROW($B$2:$B$102)-ROW($B$2)+1),ROWS(M$5:M18))))","v":96.17}]
["2010-02-10","Sioux",108.72,null,{"$f":"IF(ROWS(E$5:E19)>$G$2,\"\",INDEX(A$2:A$102,_xlfn.AGGREGATE(15,6,(ROW($A$2:$A$102)-ROW($A$2)+1)/($B$2:$B$102=$F$2),ROWS(E$5:E19))))","v":""},{"$f":"IF(ROWS(F$5:F19)>$G$2,\"\",INDEX(B$2:B$102,_xlfn.AGGREGATE(15,6,(ROW($A$2:$A$102)-ROW($A$2)+1)/($B$2:$B$102=$F$2),ROWS(F$5:F19))))","v":""},{"$f":"IF(ROWS(G$5:G19)>$G$2,\"\",INDEX(C$2:C$102,_xlfn.AGGREGATE(15,6,(ROW($A$2:$A$102)-ROW($A$2)+1)/($B$2:$B$102=$F$2),ROWS(G$5:G19))))","v":""},null,null,null,{"$f":"IF(ROWS(K$5:K19)>$G$2,\"\",INDEX(A$2:A$102,SMALL(IF($B$2:$B$102=$F$2,ROW($B$2:$B$102)-ROW($B$2)+1),ROWS(K$5:K19))))","v":""},{"$f":"IF(ROWS(L$5:L19)>$G$2,\"\",INDEX(B$2:B$102,SMALL(IF($B$2:$B$102=$F$2,ROW($B$2:$B$102)-ROW($B$2)+1),ROWS(L$5:L19))))","v":""},{"$f":"IF(ROWS(M$5:M19)>$G$2,\"\",INDEX(C$2:C$102,SMALL(IF($B$2:$B$102=$F$2,ROW($B$2:$B$102)-ROW($B$2)+1),ROWS(M$5:M19))))","v":""}]
["2009-12-26","Smith",135.18,null,{"$f":"IF(ROWS(E$5:E20)>$G$2,\"\",INDEX(A$2:A$102,_xlfn.AGGREGATE(15,6,(ROW($A$2:$A$102)-ROW($A$2)+1)/($B$2:$B$102=$F$2),ROWS(E$5:E20))))","v":""},{"$f":"IF(ROWS(F$5:F20)>$G$2,\"\",INDEX(B$2:B$102,_xlfn.AGGREGATE(15,6,(ROW($A$2:$A$102)-ROW($A$2)+1)/($B$2:$B$102=$F$2),ROWS(F$5:F20))))","v":""},{"$f":"IF(ROWS(G$5:G20)>$G$2,\"\",INDEX(C$2:C$102,_xlfn.AGGREGATE(15,6,(ROW($A$2:$A$102)-ROW($A$2)+1)/($B$2:$B$102=$F$2),ROWS(G$5:G20))))","v":""},null,null,null,{"$f":"IF(ROWS(K$5:K20)>$G$2,\"\",INDEX(A$2:A$102,SMALL(IF($B$2:$B$102=$F$2,ROW($B$2:$B$102)-ROW($B$2)+1),ROWS(K$5:K20))))","v":""},{"$f":"IF(ROWS(L$5:L20)>$G$2,\"\",INDEX(B$2:B$102,SMALL(IF($B$2:$B$102=$F$2,ROW($B$2:$B$102)-ROW($B$2)+1),ROWS(L$5:L20))))","v":""},{"$f":"IF(ROWS(M$5:M20)>$G$2,\"\",INDEX(C$2:C$102,SMALL(IF($B$2:$B$102=$F$2,ROW($B$2:$B$102)-ROW($B$2)+1),ROWS(M$5:M20))))","v":""}]
["2009-12-14","Gault",142.55000000000001,null,{"$f":"IF(ROWS(E$5:E21)>$G$2,\"\",INDEX(A$2:A$102,_xlfn.AGGREGATE(15,6,(ROW($A$2:$A$102)-ROW($A$2)+1)/($B$2:$B$102=$F$2),ROWS(E$5:E21))))","v":""},{"$f":"IF(ROWS(F$5:F21)>$G$2,\"\",INDEX(B$2:B$102,_xlfn.AGGREGATE(15,6,(ROW($A$2:$A$102)-ROW($A$2)+1)/($B$2:$B$102=$F$2),ROWS(F$5:F21))))","v":""},{"$f":"IF(ROWS(G$5:G21)>$G$2,\"\",INDEX(C$2:C$102,_xlfn.AGGREGATE(15,6,(ROW($A$2:$A$102)-ROW($A$2)+1)/($B$2:$B$102=$F$2),ROWS(G$5:G21))))","v":""},null,null,null,{"$f":"IF(ROWS(K$5:K21)>$G$2,\"\",INDEX(A$2:A$102,SMALL(IF($B$2:$B$102=$F$2,ROW($B$2:$B$102)-ROW($B$2)+1),ROWS(K$5:K21))))","v":""},{"$f":"IF(ROWS(L$5:L21)>$G$2,\"\",INDEX(B$2:B$102,SMALL(IF($B$2:$B$102=$F$2,ROW($B$2:$B$102)-ROW($B$2)+1),ROWS(L$5:L21))))","v":""},{"$f":"IF(ROWS(M$5:M21)>$G$2,\"\",INDEX(C$2:C$102,SMALL(IF($B$2:$B$102=$F$2,ROW($B$2:$B$102)-ROW($B$2)+1),ROWS(M$5:M21))))","v":""}]
["2010-02-12","Smith",140.54,null,{"$f":"IF(ROWS(E$5:E22)>$G$2,\"\",INDEX(A$2:A$102,_xlfn.AGGREGATE(15,6,(ROW($A$2:$A$102)-ROW($A$2)+1)/($B$2:$B$102=$F$2),ROWS(E$5:E22))))","v":""},{"$f":"IF(ROWS(F$5:F22)>$G$2,\"\",INDEX(B$2:B$102,_xlfn.AGGREGATE(15,6,(ROW($A$2:$A$102)-ROW($A$2)+1)/($B$2:$B$102=$F$2),ROWS(F$5:F22))))","v":""},{"$f":"IF(ROWS(G$5:G22)>$G$2,\"\",INDEX(C$2:C$102,_xlfn.AGGREGATE(15,6,(ROW($A$2:$A$102)-ROW($A$2)+1)/($B$2:$B$102=$F$2),ROWS(G$5:G22))))","v":""},null,null,null,{"$f":"IF(ROWS(K$5:K22)>$G$2,\"\",INDEX(A$2:A$102,SMALL(IF($B$2:$B$102=$F$2,ROW($B$2:$B$102)-ROW($B$2)+1),ROWS(K$5:K22))))","v":""},{"$f":"IF(ROWS(L$5:L22)>$G$2,\"\",INDEX(B$2:B$102,SMALL(IF($B$2:$B$102=$F$2,ROW($B$2:$B$102)-ROW($B$2)+1),ROWS(L$5:L22))))","v":""},{"$f":"IF(ROWS(M$5:M22)>$G$2,\"\",INDEX(C$2:C$102,SMALL(IF($B$2:$B$102=$F$2,ROW($B$2:$B$102)-ROW($B$2)+1),ROWS(M$5:M22))))","v":""}]
["2010-01-19","Franks",75.040000000000006,null,{"$f":"IF(ROWS(E$5:E23)>$G$2,\"\",INDEX(A$2:A$102,_xlfn.AGGREGATE(15,6,(ROW($A$2:$A$102)-ROW($A$2)+1)/($B$2:$B$102=$F$2),ROWS(E$5:E23))))","v":""},{"$f":"IF(ROWS(F$5:F23)>$G$2,\"\",INDEX(B$2:B$102,_xlfn.AGGREGATE(15,6,(ROW($A$2:$A$102)-ROW($A$2)+1)/($B$2:$B$102=$F$2),ROWS(F$5:F23))))","v":""},{"$f":"IF(ROWS(G$5:G23)>$G$2,\"\",INDEX(C$2:C$102,_xlfn.AGGREGATE(15,6,(ROW($A$2:$A$102)-ROW($A$2)+1)/($B$2:$B$102=$F$2),ROWS(G$5:G23))))","v":""},null,null,null,{"$f":"IF(ROWS(K$5:K23)>$G$2,\"\",INDEX(A$2:A$102,SMALL(IF($B$2:$B$102=$F$2,ROW($B$2:$B$102)-ROW($B$2)+1),ROWS(K$5:K23))))","v":""},{"$f":"IF(ROWS(L$5:L23)>$G$2,\"\",INDEX(B$2:B$102,SMALL(IF($B$2:$B$102=$F$2,ROW($B$2:$B$102)-ROW($B$2)+1),ROWS(L$5:L23))))","v":""},{"$f":"IF(ROWS(M$5:M23)>$G$2,\"\",INDEX(C$2:C$102,SMALL(IF($B$2:$B$102=$F$2,ROW($B$2:$B$102)-ROW($B$2)+1),ROWS(M$5:M23))))","v":""}]
["2010-02-16","Pham",93.15,null,{"$f":"IF(ROWS(E$5:E24)>$G$2,\"\",INDEX(A$2:A$102,_xlfn.AGGREGATE(15,6,(ROW($A$2:$A$102)-ROW($A$2)+1)/($B$2:$B$102=$F$2),ROWS(E$5:E24))))","v":""},{"$f":"IF(ROWS(F$5:F24)>$G$2,\"\",INDEX(B$2:B$102,_xlfn.AGGREGATE(15,6,(ROW($A$2:$A$102)-ROW($A$2)+1)/($B$2:$B$102=$F$2),ROWS(F$5:F24))))","v":""},{"$f":"IF(ROWS(G$5:G24)>$G$2,\"\",INDEX(C$2:C$102,_xlfn.AGGREGATE(15,6,(ROW($A$2:$A$102)-ROW($A$2)+1)/($B$2:$B$102=$F$2),ROWS(G$5:G24))))","v":""},null,null,null,{"$f":"IF(ROWS(K$5:K24)>$G$2,\"\",INDEX(A$2:A$102,SMALL(IF($B$2:$B$102=$F$2,ROW($B$2:$B$102)-ROW($B$2)+1),ROWS(K$5:K24))))","v":""},{"$f":"IF(ROWS(L$5:L24)>$G$2,\"\",INDEX(B$2:B$102,SMALL(IF($B$2:$B$102=$F$2,ROW($B$2:$B$102)-ROW($B$2)+1),ROWS(L$5:L24))))","v":""},{"$f":"IF(ROWS(M$5:M24)>$G$2,\"\",INDEX(C$2:C$102,SMALL(IF($B$2:$B$102=$F$2,ROW($B$2:$B$102)-ROW($B$2)+1),ROWS(M$5:M24))))","v":""}]
["2010-01-07","Sioux",132.51,null,{"$f":"IF(ROWS(E$5:E25)>$G$2,\"\",INDEX(A$2:A$102,_xlfn.AGGREGATE(15,6,(ROW($A$2:$A$102)-ROW($A$2)+1)/($B$2:$B$102=$F$2),ROWS(E$5:E25))))","v":""},{"$f":"IF(ROWS(F$5:F25)>$G$2,\"\",INDEX(B$2:B$102,_xlfn.AGGREGATE(15,6,(ROW($A$2:$A$102)-ROW($A$2)+1)/($B$2:$B$102=$F$2),ROWS(F$5:F25))))","v":""},{"$f":"IF(ROWS(G$5:G25)>$G$2,\"\",INDEX(C$2:C$102,_xlfn.AGGREGATE(15,6,(ROW($A$2:$A$102)-ROW($A$2)+1)/($B$2:$B$102=$F$2),ROWS(G$5:G25))))","v":""},null,null,null,{"$f":"IF(ROWS(K$5:K25)>$G$2,\"\",INDEX(A$2:A$102,SMALL(IF($B$2:$B$102=$F$2,ROW($B$2:$B$102)-ROW($B$2)+1),ROWS(K$5:K25))))","v":""},{"$f":"IF(ROWS(L$5:L25)>$G$2,\"\",INDEX(B$2:B$102,SMALL(IF($B$2:$B$102=$F$2,ROW($B$2:$B$102)-ROW($B$2)+1),ROWS(L$5:L25))))","v":""},{"$f":"IF(ROWS(M$5:M25)>$G$2,\"\",INDEX(C$2:C$102,SMALL(IF($B$2:$B$102=$F$2,ROW($B$2:$B$102)-ROW($B$2)+1),ROWS(M$5:M25))))","v":""}]
["2010-01-16","Chin",85.14,null,{"$f":"IF(ROWS(E$5:E26)>$G$2,\"\",INDEX(A$2:A$102,_xlfn.AGGREGATE(15,6,(ROW($A$2:$A$102)-ROW($A$2)+1)/($B$2:$B$102=$F$2),ROWS(E$5:E26))))","v":""},{"$f":"IF(ROWS(F$5:F26)>$G$2,\"\",INDEX(B$2:B$102,_xlfn.AGGREGATE(15,6,(ROW($A$2:$A$102)-ROW($A$2)+1)/($B$2:$B$102=$F$2),ROWS(F$5:F26))))","v":""},{"$f":"IF(ROWS(G$5:G26)>$G$2,\"\",INDEX(C$2:C$102,_xlfn.AGGREGATE(15,6,(ROW($A$2:$A$102)-ROW($A$2)+1)/($B$2:$B$102=$F$2),ROWS(G$5:G26))))","v":""},null,null,null,{"$f":"IF(ROWS(K$5:K26)>$G$2,\"\",INDEX(A$2:A$102,SMALL(IF($B$2:$B$102=$F$2,ROW($B$2:$B$102)-ROW($B$2)+1),ROWS(K$5:K26))))","v":""},{"$f":"IF(ROWS(L$5:L26)>$G$2,\"\",INDEX(B$2:B$102,SMALL(IF($B$2:$B$102=$F$2,ROW($B$2:$B$102)-ROW($B$2)+1),ROWS(L$5:L26))))","v":""},{"$f":"IF(ROWS(M$5:M26)>$G$2,\"\",INDEX(C$2:C$102,SMALL(IF($B$2:$B$102=$F$2,ROW($B$2:$B$102)-ROW($B$2)+1),ROWS(M$5:M26))))","v":""}]
["2010-02-15","Franks",108.85,null,{"$f":"IF(ROWS(E$5:E27)>$G$2,\"\",INDEX(A$2:A$102,_xlfn.AGGREGATE(15,6,(ROW($A$2:$A$102)-ROW($A$2)+1)/($B$2:$B$102=$F$2),ROWS(E$5:E27))))","v":""},{"$f":"IF(ROWS(F$5:F27)>$G$2,\"\",INDEX(B$2:B$102,_xlfn.AGGREGATE(15,6,(ROW($A$2:$A$102)-ROW($A$2)+1)/($B$2:$B$102=$F$2),ROWS(F$5:F27))))","v":""},{"$f":"IF(ROWS(G$5:G27)>$G$2,\"\",INDEX(C$2:C$102,_xlfn.AGGREGATE(15,6,(ROW($A$2:$A$102)-ROW($A$2)+1)/($B$2:$B$102=$F$2),ROWS(G$5:G27))))","v":""},null,null,null,{"$f":"IF(ROWS(K$5:K27)>$G$2,\"\",INDEX(A$2:A$102,SMALL(IF($B$2:$B$102=$F$2,ROW($B$2:$B$102)-ROW($B$2)+1),ROWS(K$5:K27))))","v":""},{"$f":"IF(ROWS(L$5:L27)>$G$2,\"\",INDEX(B$2:B$102,SMALL(IF($B$2:$B$102=$F$2,ROW($B$2:$B$102)-ROW($B$2)+1),ROWS(L$5:L27))))","v":""},{"$f":"IF(ROWS(M$5:M27)>$G$2,\"\",INDEX(C$2:C$102,SMALL(IF($B$2:$B$102=$F$2,ROW($B$2:$B$102)-ROW($B$2)+1),ROWS(M$5:M27))))","v":""}]
["2009-12-13","Sioux",139.91999999999999,null,{"$f":"IF(ROWS(E$5:E28)>$G$2,\"\",INDEX(A$2:A$102,_xlfn.AGGREGATE(15,6,(ROW($A$2:$A$102)-ROW($A$2)+1)/($B$2:$B$102=$F$2),ROWS(E$5:E28))))","v":""},{"$f":"IF(ROWS(F$5:F28)>$G$2,\"\",INDEX(B$2:B$102,_xlfn.AGGREGATE(15,6,(ROW($A$2:$A$102)-ROW($A$2)+1)/($B$2:$B$102=$F$2),ROWS(F$5:F28))))","v":""},{"$f":"IF(ROWS(G$5:G28)>$G$2,\"\",INDEX(C$2:C$102,_xlfn.AGGREGATE(15,6,(ROW($A$2:$A$102)-ROW($A$2)+1)/($B$2:$B$102=$F$2),ROWS(G$5:G28))))","v":""},null,null,null,{"$f":"IF(ROWS(K$5:K28)>$G$2,\"\",INDEX(A$2:A$102,SMALL(IF($B$2:$B$102=$F$2,ROW($B$2:$B$102)-ROW($B$2)+1),ROWS(K$5:K28))))","v":""},{"$f":"IF(ROWS(L$5:L28)>$G$2,\"\",INDEX(B$2:B$102,SMALL(IF($B$2:$B$102=$F$2,ROW($B$2:$B$102)-ROW($B$2)+1),ROWS(L$5:L28))))","v":""},{"$f":"IF(ROWS(M$5:M28)>$G$2,\"\",INDEX(C$2:C$102,SMALL(IF($B$2:$B$102=$F$2,ROW($B$2:$B$102)-ROW($B$2)+1),ROWS(M$5:M28))))","v":""}]
["2010-01-04","Franks",104.35,null,{"$f":"IF(ROWS(E$5:E29)>$G$2,\"\",INDEX(A$2:A$102,_xlfn.AGGREGATE(15,6,(ROW($A$2:$A$102)-ROW($A$2)+1)/($B$2:$B$102=$F$2),ROWS(E$5:E29))))","v":""},{"$f":"IF(ROWS(F$5:F29)>$G$2,\"\",INDEX(B$2:B$102,_xlfn.AGGREGATE(15,6,(ROW($A$2:$A$102)-ROW($A$2)+1)/($B$2:$B$102=$F$2),ROWS(F$5:F29))))","v":""},{"$f":"IF(ROWS(G$5:G29)>$G$2,\"\",INDEX(C$2:C$102,_xlfn.AGGREGATE(15,6,(ROW($A$2:$A$102)-ROW($A$2)+1)/($B$2:$B$102=$F$2),ROWS(G$5:G29))))","v":""},null,null,null,{"$f":"IF(ROWS(K$5:K29)>$G$2,\"\",INDEX(A$2:A$102,SMALL(IF($B$2:$B$102=$F$2,ROW($B$2:$B$102)-ROW($B$2)+1),ROWS(K$5:K29))))","v":""},{"$f":"IF(ROWS(L$5:L29)>$G$2,\"\",INDEX(B$2:B$102,SMALL(IF($B$2:$B$102=$F$2,ROW($B$2:$B$102)-ROW($B$2)+1),ROWS(L$5:L29))))","v":""},{"$f":"IF(ROWS(M$5:M29)>$G$2,\"\",INDEX(C$2:C$102,SMALL(IF($B$2:$B$102=$F$2,ROW($B$2:$B$102)-ROW($B$2)+1),ROWS(M$5:M29))))","v":""}]
["2009-12-14","Gault",88.51,null,{"$f":"IF(ROWS(E$5:E30)>$G$2,\"\",INDEX(A$2:A$102,_xlfn.AGGREGATE(15,6,(ROW($A$2:$A$102)-ROW($A$2)+1)/($B$2:$B$102=$F$2),ROWS(E$5:E30))))","v":""},{"$f":"IF(ROWS(F$5:F30)>$G$2,\"\",INDEX(B$2:B$102,_xlfn.AGGREGATE(15,6,(ROW($A$2:$A$102)-ROW($A$2)+1)/($B$2:$B$102=$F$2),ROWS(F$5:F30))))","v":""},{"$f":"IF(ROWS(G$5:G30)>$G$2,\"\",INDEX(C$2:C$102,_xlfn.AGGREGATE(15,6,(ROW($A$2:$A$102)-ROW($A$2)+1)/($B$2:$B$102=$F$2),ROWS(G$5:G30))))","v":""},null,null,null,{"$f":"IF(ROWS(K$5:K30)>$G$2,\"\",INDEX(A$2:A$102,SMALL(IF($B$2:$B$102=$F$2,ROW($B$2:$B$102)-ROW($B$2)+1),ROWS(K$5:K30))))","v":""},{"$f":"IF(ROWS(L$5:L30)>$G$2,\"\",INDEX(B$2:B$102,SMALL(IF($B$2:$B$102=$F$2,ROW($B$2:$B$102)-ROW($B$2)+1),ROWS(L$5:L30))))","v":""},{"$f":"IF(ROWS(M$5:M30)>$G$2,\"\",INDEX(C$2:C$102,SMALL(IF($B$2:$B$102=$F$2,ROW($B$2:$B$102)-ROW($B$2)+1),ROWS(M$5:M30))))","v":""}]
["2010-02-01","Gault",136.76,null,{"$f":"IF(ROWS(E$5:E31)>$G$2,\"\",INDEX(A$2:A$102,_xlfn.AGGREGATE(15,6,(ROW($A$2:$A$102)-ROW($A$2)+1)/($B$2:$B$102=$F$2),ROWS(E$5:E31))))","v":""},{"$f":"IF(ROWS(F$5:F31)>$G$2,\"\",INDEX(B$2:B$102,_xlfn.AGGREGATE(15,6,(ROW($A$2:$A$102)-ROW($A$2)+1)/($B$2:$B$102=$F$2),ROWS(F$5:F31))))","v":""},{"$f":"IF(ROWS(G$5:G31)>$G$2,\"\",INDEX(C$2:C$102,_xlfn.AGGREGATE(15,6,(ROW($A$2:$A$102)-ROW($A$2)+1)/($B$2:$B$102=$F$2),ROWS(G$5:G31))))","v":""},null,null,null,{"$f":"IF(ROWS(K$5:K31)>$G$2,\"\",INDEX(A$2:A$102,SMALL(IF($B$2:$B$102=$F$2,ROW($B$2:$B$102)-ROW($B$2)+1),ROWS(K$5:K31))))","v":""},{"$f":"IF(ROWS(L$5:L31)>$G$2,\"\",INDEX(B$2:B$102,SMALL(IF($B$2:$B$102=$F$2,ROW($B$2:$B$102)-ROW($B$2)+1),ROWS(L$5:L31))))","v":""},{"$f":"IF(ROWS(M$5:M31)>$G$2,\"\",INDEX(C$2:C$102,SMALL(IF($B$2:$B$102=$F$2,ROW($B$2:$B$102)-ROW($B$2)+1),ROWS(M$5:M31))))","v":""}]
["2009-11-25","Pham",109.57,null,{"$f":"IF(ROWS(E$5:E32)>$G$2,\"\",INDEX(A$2:A$102,_xlfn.AGGREGATE(15,6,(ROW($A$2:$A$102)-ROW($A$2)+1)/($B$2:$B$102=$F$2),ROWS(E$5:E32))))","v":""},{"$f":"IF(ROWS(F$5:F32)>$G$2,\"\",INDEX(B$2:B$102,_xlfn.AGGREGATE(15,6,(ROW($A$2:$A$102)-ROW($A$2)+1)/($B$2:$B$102=$F$2),ROWS(F$5:F32))))","v":""},{"$f":"IF(ROWS(G$5:G32)>$G$2,\"\",INDEX(C$2:C$102,_xlfn.AGGREGATE(15,6,(ROW($A$2:$A$102)-ROW($A$2)+1)/($B$2:$B$102=$F$2),ROWS(G$5:G32))))","v":""},null,null,null,{"$f":"IF(ROWS(K$5:K32)>$G$2,\"\",INDEX(A$2:A$102,SMALL(IF($B$2:$B$102=$F$2,ROW($B$2:$B$102)-ROW($B$2)+1),ROWS(K$5:K32))))","v":""},{"$f":"IF(ROWS(L$5:L32)>$G$2,\"\",INDEX(B$2:B$102,SMALL(IF($B$2:$B$102=$F$2,ROW($B$2:$B$102)-ROW($B$2)+1),ROWS(L$5:L32))))","v":""},{"$f":"IF(ROWS(M$5:M32)>$G$2,\"\",INDEX(C$2:C$102,SMALL(IF($B$2:$B$102=$F$2,ROW($B$2:$B$102)-ROW($B$2)+1),ROWS(M$5:M32))))","v":""}]
["2010-02-07","Franks",125.81,null,{"$f":"IF(ROWS(E$5:E33)>$G$2,\"\",INDEX(A$2:A$102,_xlfn.AGGREGATE(15,6,(ROW($A$2:$A$102)-ROW($A$2)+1)/($B$2:$B$102=$F$2),ROWS(E$5:E33))))","v":""},{"$f":"IF(ROWS(F$5:F33)>$G$2,\"\",INDEX(B$2:B$102,_xlfn.AGGREGATE(15,6,(ROW($A$2:$A$102)-ROW($A$2)+1)/($B$2:$B$102=$F$2),ROWS(F$5:F33))))","v":""},{"$f":"IF(ROWS(G$5:G33)>$G$2,\"\",INDEX(C$2:C$102,_xlfn.AGGREGATE(15,6,(ROW($A$2:$A$102)-ROW($A$2)+1)/($B$2:$B$102=$F$2),ROWS(G$5:G33))))","v":""},null,null,null,{"$f":"IF(ROWS(K$5:K33)>$G$2,\"\",INDEX(A$2:A$102,SMALL(IF($B$2:$B$102=$F$2,ROW($B$2:$B$102)-ROW($B$2)+1),ROWS(K$5:K33))))","v":""},{"$f":"IF(ROWS(L$5:L33)>$G$2,\"\",INDEX(B$2:B$102,SMALL(IF($B$2:$B$102=$F$2,ROW($B$2:$B$102)-ROW($B$2)+1),ROWS(L$5:L33))))","v":""},{"$f":"IF(ROWS(M$5:M33)>$G$2,\"\",INDEX(C$2:C$102,SMALL(IF($B$2:$B$102=$F$2,ROW($B$2:$B$102)-ROW($B$2)+1),ROWS(M$5:M33))))","v":""}]
["2009-12-22","Pham",150.09,null,{"$f":"IF(ROWS(E$5:E34)>$G$2,\"\",INDEX(A$2:A$102,_xlfn.AGGREGATE(15,6,(ROW($A$2:$A$102)-ROW($A$2)+1)/($B$2:$B$102=$F$2),ROWS(E$5:E34))))","v":""},{"$f":"IF(ROWS(F$5:F34)>$G$2,\"\",INDEX(B$2:B$102,_xlfn.AGGREGATE(15,6,(ROW($A$2:$A$102)-ROW($A$2)+1)/($B$2:$B$102=$F$2),ROWS(F$5:F34))))","v":""},{"$f":"IF(ROWS(G$5:G34)>$G$2,\"\",INDEX(C$2:C$102,_xlfn.AGGREGATE(15,6,(ROW($A$2:$A$102)-ROW($A$2)+1)/($B$2:$B$102=$F$2),ROWS(G$5:G34))))","v":""},null,null,null,{"$f":"IF(ROWS(K$5:K34)>$G$2,\"\",INDEX(A$2:A$102,SMALL(IF($B$2:$B$102=$F$2,ROW($B$2:$B$102)-ROW($B$2)+1),ROWS(K$5:K34))))","v":""},{"$f":"IF(ROWS(L$5:L34)>$G$2,\"\",INDEX(B$2:B$102,SMALL(IF($B$2:$B$102=$F$2,ROW($B$2:$B$102)-ROW($B$2)+1),ROWS(L$5:L34))))","v":""},{"$f":"IF(ROWS(M$5:M34)>$G$2,\"\",INDEX(C$2:C$102,SMALL(IF($B$2:$B$102=$F$2,ROW($B$2:$B$102)-ROW($B$2)+1),ROWS(M$5:M34))))","v":""}]
["2009-12-07","Sioux",147.53,null,{"$f":"IF(ROWS(E$5:E35)>$G$2,\"\",INDEX(A$2:A$102,_xlfn.AGGREGATE(15,6,(ROW($A$2:$A$102)-ROW($A$2)+1)/($B$2:$B$102=$F$2),ROWS(E$5:E35))))","v":""},{"$f":"IF(ROWS(F$5:F35)>$G$2,\"\",INDEX(B$2:B$102,_xlfn.AGGREGATE(15,6,(ROW($A$2:$A$102)-ROW($A$2)+1)/($B$2:$B$102=$F$2),ROWS(F$5:F35))))","v":""},{"$f":"IF(ROWS(G$5:G35)>$G$2,\"\",INDEX(C$2:C$102,_xlfn.AGGREGATE(15,6,(ROW($A$2:$A$102)-ROW($A$2)+1)/($B$2:$B$102=$F$2),ROWS(G$5:G35))))","v":""},null,null,null,{"$f":"IF(ROWS(K$5:K35)>$G$2,\"\",INDEX(A$2:A$102,SMALL(IF($B$2:$B$102=$F$2,ROW($B$2:$B$102)-ROW($B$2)+1),ROWS(K$5:K35))))","v":""},{"$f":"IF(ROWS(L$5:L35)>$G$2,\"\",INDEX(B$2:B$102,SMALL(IF($B$2:$B$102=$F$2,ROW($B$2:$B$102)-ROW($B$2)+1),ROWS(L$5:L35))))","v":""},{"$f":"IF(ROWS(M$5:M35)>$G$2,\"\",INDEX(C$2:C$102,SMALL(IF($B$2:$B$102=$F$2,ROW($B$2:$B$102)-ROW($B$2)+1),ROWS(M$5:M35))))","v":""}]
["2009-12-12","Chin",102.17,null,{"$f":"IF(ROWS(E$5:E36)>$G$2,\"\",INDEX(A$2:A$102,_xlfn.AGGREGATE(15,6,(ROW($A$2:$A$102)-ROW($A$2)+1)/($B$2:$B$102=$F$2),ROWS(E$5:E36))))","v":""},{"$f":"IF(ROWS(F$5:F36)>$G$2,\"\",INDEX(B$2:B$102,_xlfn.AGGREGATE(15,6,(ROW($A$2:$A$102)-ROW($A$2)+1)/($B$2:$B$102=$F$2),ROWS(F$5:F36))))","v":""},{"$f":"IF(ROWS(G$5:G36)>$G$2,\"\",INDEX(C$2:C$102,_xlfn.AGGREGATE(15,6,(ROW($A$2:$A$102)-ROW($A$2)+1)/($B$2:$B$102=$F$2),ROWS(G$5:G36))))","v":""},null,null,null,{"$f":"IF(ROWS(K$5:K36)>$G$2,\"\",INDEX(A$2:A$102,SMALL(IF($B$2:$B$102=$F$2,ROW($B$2:$B$102)-ROW($B$2)+1),ROWS(K$5:K36))))","v":""},{"$f":"IF(ROWS(L$5:L36)>$G$2,\"\",INDEX(B$2:B$102,SMALL(IF($B$2:$B$102=$F$2,ROW($B$2:$B$102)-ROW($B$2)+1),ROWS(L$5:L36))))","v":""},{"$f":"IF(ROWS(M$5:M36)>$G$2,\"\",INDEX(C$2:C$102,SMALL(IF($B$2:$B$102=$F$2,ROW($B$2:$B$102)-ROW($B$2)+1),ROWS(M$5:M36))))","v":""}]
["2009-12-30","Smith",114.4,null,{"$f":"IF(ROWS(E$5:E37)>$G$2,\"\",INDEX(A$2:A$102,_xlfn.AGGREGATE(15,6,(ROW($A$2:$A$102)-ROW($A$2)+1)/($B$2:$B$102=$F$2),ROWS(E$5:E37))))","v":""},{"$f":"IF(ROWS(F$5:F37)>$G$2,\"\",INDEX(B$2:B$102,_xlfn.AGGREGATE(15,6,(ROW($A$2:$A$102)-ROW($A$2)+1)/($B$2:$B$102=$F$2),ROWS(F$5:F37))))","v":""},{"$f":"IF(ROWS(G$5:G37)>$G$2,\"\",INDEX(C$2:C$102,_xlfn.AGGREGATE(15,6,(ROW($A$2:$A$102)-ROW($A$2)+1)/($B$2:$B$102=$F$2),ROWS(G$5:G37))))","v":""},null,null,null,{"$f":"IF(ROWS(K$5:K37)>$G$2,\"\",INDEX(A$2:A$102,SMALL(IF($B$2:$B$102=$F$2,ROW($B$2:$B$102)-ROW($B$2)+1),ROWS(K$5:K37))))","v":""},{"$f":"IF(ROWS(L$5:L37)>$G$2,\"\",INDEX(B$2:B$102,SMALL(IF($B$2:$B$102=$F$2,ROW($B$2:$B$102)-ROW($B$2)+1),ROWS(L$5:L37))))","v":""},{"$f":"IF(ROWS(M$5:M37)>$G$2,\"\",INDEX(C$2:C$102,SMALL(IF($B$2:$B$102=$F$2,ROW($B$2:$B$102)-ROW($B$2)+1),ROWS(M$5:M37))))","v":""}]
["2009-12-27","Chin",129.65,null,{"$f":"IF(ROWS(E$5:E38)>$G$2,\"\",INDEX(A$2:A$102,_xlfn.AGGREGATE(15,6,(ROW($A$2:$A$102)-ROW($A$2)+1)/($B$2:$B$102=$F$2),ROWS(E$5:E38))))","v":""},{"$f":"IF(ROWS(F$5:F38)>$G$2,\"\",INDEX(B$2:B$102,_xlfn.AGGREGATE(15,6,(ROW($A$2:$A$102)-ROW($A$2)+1)/($B$2:$B$102=$F$2),ROWS(F$5:F38))))","v":""},{"$f":"IF(ROWS(G$5:G38)>$G$2,\"\",INDEX(C$2:C$102,_xlfn.AGGREGATE(15,6,(ROW($A$2:$A$102)-ROW($A$2)+1)/($B$2:$B$102=$F$2),ROWS(G$5:G38))))","v":""},null,null,null,{"$f":"IF(ROWS(K$5:K38)>$G$2,\"\",INDEX(A$2:A$102,SMALL(IF($B$2:$B$102=$F$2,ROW($B$2:$B$102)-ROW($B$2)+1),ROWS(K$5:K38))))","v":""},{"$f":"IF(ROWS(L$5:L38)>$G$2,\"\",INDEX(B$2:B$102,SMALL(IF($B$2:$B$102=$F$2,ROW($B$2:$B$102)-ROW($B$2)+1),ROWS(L$5:L38))))","v":""},{"$f":"IF(ROWS(M$5:M38)>$G$2,\"\",INDEX(C$2:C$102,SMALL(IF($B$2:$B$102=$F$2,ROW($B$2:$B$102)-ROW($B$2)+1),ROWS(M$5:M38))))","v":""}]
["2009-12-29","Chin",128.94999999999999,null,{"$f":"IF(ROWS(E$5:E39)>$G$2,\"\",INDEX(A$2:A$102,_xlfn.AGGREGATE(15,6,(ROW($A$2:$A$102)-ROW($A$2)+1)/($B$2:$B$102=$F$2),ROWS(E$5:E39))))","v":""},{"$f":"IF(ROWS(F$5:F39)>$G$2,\"\",INDEX(B$2:B$102,_xlfn.AGGREGATE(15,6,(ROW($A$2:$A$102)-ROW($A$2)+1)/($B$2:$B$102=$F$2),ROWS(F$5:F39))))","v":""},{"$f":"IF(ROWS(G$5:G39)>$G$2,\"\",INDEX(C$2:C$102,_xlfn.AGGREGATE(15,6,(ROW($A$2:$A$102)-ROW($A$2)+1)/($B$2:$B$102=$F$2),ROWS(G$5:G39))))","v":""},null,null,null,{"$f":"IF(ROWS(K$5:K39)>$G$2,\"\",INDEX(A$2:A$102,SMALL(IF($B$2:$B$102=$F$2,ROW($B$2:$B$102)-ROW($B$2)+1),ROWS(K$5:K39))))","v":""},{"$f":"IF(ROWS(L$5:L39)>$G$2,\"\",INDEX(B$2:B$102,SMALL(IF($B$2:$B$102=$F$2,ROW($B$2:$B$102)-ROW($B$2)+1),ROWS(L$5:L39))))","v":""},{"$f":"IF(ROWS(M$5:M39)>$G$2,\"\",INDEX(C$2:C$102,SMALL(IF($B$2:$B$102=$F$2,ROW($B$2:$B$102)-ROW($B$2)+1),ROWS(M$5:M39))))","v":""}]
["2010-01-05","Gault",121.33,null,{"$f":"IF(ROWS(E$5:E40)>$G$2,\"\",INDEX(A$2:A$102,_xlfn.AGGREGATE(15,6,(ROW($A$2:$A$102)-ROW($A$2)+1)/($B$2:$B$102=$F$2),ROWS(E$5:E40))))","v":""},{"$f":"IF(ROWS(F$5:F40)>$G$2,\"\",INDEX(B$2:B$102,_xlfn.AGGREGATE(15,6,(ROW($A$2:$A$102)-ROW($A$2)+1)/($B$2:$B$102=$F$2),ROWS(F$5:F40))))","v":""},{"$f":"IF(ROWS(G$5:G40)>$G$2,\"\",INDEX(C$2:C$102,_xlfn.AGGREGATE(15,6,(ROW($A$2:$A$102)-ROW($A$2)+1)/($B$2:$B$102=$F$2),ROWS(G$5:G40))))","v":""},null,null,null,{"$f":"IF(ROWS(K$5:K40)>$G$2,\"\",INDEX(A$2:A$102,SMALL(IF($B$2:$B$102=$F$2,ROW($B$2:$B$102)-ROW($B$2)+1),ROWS(K$5:K40))))","v":""},{"$f":"IF(ROWS(L$5:L40)>$G$2,\"\",INDEX(B$2:B$102,SMALL(IF($B$2:$B$102=$F$2,ROW($B$2:$B$102)-ROW($B$2)+1),ROWS(L$5:L40))))","v":""},{"$f":"IF(ROWS(M$5:M40)>$G$2,\"\",INDEX(C$2:C$102,SMALL(IF($B$2:$B$102=$F$2,ROW($B$2:$B$102)-ROW($B$2)+1),ROWS(M$5:M40))))","v":""}]
["2009-12-15","Pham",102.64,null,{"$f":"IF(ROWS(E$5:E41)>$G$2,\"\",INDEX(A$2:A$102,_xlfn.AGGREGATE(15,6,(ROW($A$2:$A$102)-ROW($A$2)+1)/($B$2:$B$102=$F$2),ROWS(E$5:E41))))","v":""},{"$f":"IF(ROWS(F$5:F41)>$G$2,\"\",INDEX(B$2:B$102,_xlfn.AGGREGATE(15,6,(ROW($A$2:$A$102)-ROW($A$2)+1)/($B$2:$B$102=$F$2),ROWS(F$5:F41))))","v":""},{"$f":"IF(ROWS(G$5:G41)>$G$2,\"\",INDEX(C$2:C$102,_xlfn.AGGREGATE(15,6,(ROW($A$2:$A$102)-ROW($A$2)+1)/($B$2:$B$102=$F$2),ROWS(G$5:G41))))","v":""},null,null,null,{"$f":"IF(ROWS(K$5:K41)>$G$2,\"\",INDEX(A$2:A$102,SMALL(IF($B$2:$B$102=$F$2,ROW($B$2:$B$102)-ROW($B$2)+1),ROWS(K$5:K41))))","v":""},{"$f":"IF(ROWS(L$5:L41)>$G$2,\"\",INDEX(B$2:B$102,SMALL(IF($B$2:$B$102=$F$2,ROW($B$2:$B$102)-ROW($B$2)+1),ROWS(L$5:L41))))","v":""},{"$f":"IF(ROWS(M$5:M41)>$G$2,\"\",INDEX(C$2:C$102,SMALL(IF($B$2:$B$102=$F$2,ROW($B$2:$B$102)-ROW($B$2)+1),ROWS(M$5:M41))))","v":""}]
["2009-12-01","Pham",132.12,null,{"$f":"IF(ROWS(E$5:E42)>$G$2,\"\",INDEX(A$2:A$102,_xlfn.AGGREGATE(15,6,(ROW($A$2:$A$102)-ROW($A$2)+1)/($B$2:$B$102=$F$2),ROWS(E$5:E42))))","v":""},{"$f":"IF(ROWS(F$5:F42)>$G$2,\"\",INDEX(B$2:B$102,_xlfn.AGGREGATE(15,6,(ROW($A$2:$A$102)-ROW($A$2)+1)/($B$2:$B$102=$F$2),ROWS(F$5:F42))))","v":""},{"$f":"IF(ROWS(G$5:G42)>$G$2,\"\",INDEX(C$2:C$102,_xlfn.AGGREGATE(15,6,(ROW($A$2:$A$102)-ROW($A$2)+1)/($B$2:$B$102=$F$2),ROWS(G$5:G42))))","v":""},null,null,null,{"$f":"IF(ROWS(K$5:K42)>$G$2,\"\",INDEX(A$2:A$102,SMALL(IF($B$2:$B$102=$F$2,ROW($B$2:$B$102)-ROW($B$2)+1),ROWS(K$5:K42))))","v":""},{"$f":"IF(ROWS(L$5:L42)>$G$2,\"\",INDEX(B$2:B$102,SMALL(IF($B$2:$B$102=$F$2,ROW($B$2:$B$102)-ROW($B$2)+1),ROWS(L$5:L42))))","v":""},{"$f":"IF(ROWS(M$5:M42)>$G$2,\"\",INDEX(C$2:C$102,SMALL(IF($B$2:$B$102=$F$2,ROW($B$2:$B$102)-ROW($B$2)+1),ROWS(M$5:M42))))","v":""}]
["2010-02-07","Franks",100.83,null,{"$f":"IF(ROWS(E$5:E43)>$G$2,\"\",INDEX(A$2:A$102,_xlfn.AGGREGATE(15,6,(ROW($A$2:$A$102)-ROW($A$2)+1)/($B$2:$B$102=$F$2),ROWS(E$5:E43))))","v":""},{"$f":"IF(ROWS(F$5:F43)>$G$2,\"\",INDEX(B$2:B$102,_xlfn.AGGREGATE(15,6,(ROW($A$2:$A$102)-ROW($A$2)+1)/($B$2:$B$102=$F$2),ROWS(F$5:F43))))","v":""},{"$f":"IF(ROWS(G$5:G43)>$G$2,\"\",INDEX(C$2:C$102,_xlfn.AGGREGATE(15,6,(ROW($A$2:$A$102)-ROW($A$2)+1)/($B$2:$B$102=$F$2),ROWS(G$5:G43))))","v":""},null,null,null,{"$f":"IF(ROWS(K$5:K43)>$G$2,\"\",INDEX(A$2:A$102,SMALL(IF($B$2:$B$102=$F$2,ROW($B$2:$B$102)-ROW($B$2)+1),ROWS(K$5:K43))))","v":""},{"$f":"IF(ROWS(L$5:L43)>$G$2,\"\",INDEX(B$2:B$102,SMALL(IF($B$2:$B$102=$F$2,ROW($B$2:$B$102)-ROW($B$2)+1),ROWS(L$5:L43))))","v":""},{"$f":"IF(ROWS(M$5:M43)>$G$2,\"\",INDEX(C$2:C$102,SMALL(IF($B$2:$B$102=$F$2,ROW($B$2:$B$102)-ROW($B$2)+1),ROWS(M$5:M43))))","v":""}]
["2009-11-26","Sioux",79.42,null,{"$f":"IF(ROWS(E$5:E44)>$G$2,\"\",INDEX(A$2:A$102,_xlfn.AGGREGATE(15,6,(ROW($A$2:$A$102)-ROW($A$2)+1)/($B$2:$B$102=$F$2),ROWS(E$5:E44))))","v":""},{"$f":"IF(ROWS(F$5:F44)>$G$2,\"\",INDEX(B$2:B$102,_xlfn.AGGREGATE(15,6,(ROW($A$2:$A$102)-ROW($A$2)+1)/($B$2:$B$102=$F$2),ROWS(F$5:F44))))","v":""},{"$f":"IF(ROWS(G$5:G44)>$G$2,\"\",INDEX(C$2:C$102,_xlfn.AGGREGATE(15,6,(ROW($A$2:$A$102)-ROW($A$2)+1)/($B$2:$B$102=$F$2),ROWS(G$5:G44))))","v":""},null,null,null,{"$f":"IF(ROWS(K$5:K44)>$G$2,\"\",INDEX(A$2:A$102,SMALL(IF($B$2:$B$102=$F$2,ROW($B$2:$B$102)-ROW($B$2)+1),ROWS(K$5:K44))))","v":""},{"$f":"IF(ROWS(L$5:L44)>$G$2,\"\",INDEX(B$2:B$102,SMALL(IF($B$2:$B$102=$F$2,ROW($B$2:$B$102)-ROW($B$2)+1),ROWS(L$5:L44))))","v":""},{"$f":"IF(ROWS(M$5:M44)>$G$2,\"\",INDEX(C$2:C$102,SMALL(IF($B$2:$B$102=$F$2,ROW($B$2:$B$102)-ROW($B$2)+1),ROWS(M$5:M44))))","v":""}]
["2010-01-04","Pham",100.09,null,{"$f":"IF(ROWS(E$5:E45)>$G$2,\"\",INDEX(A$2:A$102,_xlfn.AGGREGATE(15,6,(ROW($A$2:$A$102)-ROW($A$2)+1)/($B$2:$B$102=$F$2),ROWS(E$5:E45))))","v":""},{"$f":"IF(ROWS(F$5:F45)>$G$2,\"\",INDEX(B$2:B$102,_xlfn.AGGREGATE(15,6,(ROW($A$2:$A$102)-ROW($A$2)+1)/($B$2:$B$102=$F$2),ROWS(F$5:F45))))","v":""},{"$f":"IF(ROWS(G$5:G45)>$G$2,\"\",INDEX(C$2:C$102,_xlfn.AGGREGATE(15,6,(ROW($A$2:$A$102)-ROW($A$2)+1)/($B$2:$B$102=$F$2),ROWS(G$5:G45))))","v":""},null,null,null,{"$f":"IF(ROWS(K$5:K45)>$G$2,\"\",INDEX(A$2:A$102,SMALL(IF($B$2:$B$102=$F$2,ROW($B$2:$B$102)-ROW($B$2)+1),ROWS(K$5:K45))))","v":""},{"$f":"IF(ROWS(L$5:L45)>$G$2,\"\",INDEX(B$2:B$102,SMALL(IF($B$2:$B$102=$F$2,ROW($B$2:$B$102)-ROW($B$2)+1),ROWS(L$5:L45))))","v":""},{"$f":"IF(ROWS(M$5:M45)>$G$2,\"\",INDEX(C$2:C$102,SMALL(IF($B$2:$B$102=$F$2,ROW($B$2:$B$102)-ROW($B$2)+1),ROWS(M$5:M45))))","v":""}]
["2010-01-29","Franks",83.37,null,{"$f":"IF(ROWS(E$5:E46)>$G$2,\"\",INDEX(A$2:A$102,_xlfn.AGGREGATE(15,6,(ROW($A$2:$A$102)-ROW($A$2)+1)/($B$2:$B$102=$F$2),ROWS(E$5:E46))))","v":""},{"$f":"IF(ROWS(F$5:F46)>$G$2,\"\",INDEX(B$2:B$102,_xlfn.AGGREGATE(15,6,(ROW($A$2:$A$102)-ROW($A$2)+1)/($B$2:$B$102=$F$2),ROWS(F$5:F46))))","v":""},{"$f":"IF(ROWS(G$5:G46)>$G$2,\"\",INDEX(C$2:C$102,_xlfn.AGGREGATE(15,6,(ROW($A$2:$A$102)-ROW($A$2)+1)/($B$2:$B$102=$F$2),ROWS(G$5:G46))))","v":""},null,null,null,{"$f":"IF(ROWS(K$5:K46)>$G$2,\"\",INDEX(A$2:A$102,SMALL(IF($B$2:$B$102=$F$2,ROW($B$2:$B$102)-ROW($B$2)+1),ROWS(K$5:K46))))","v":""},{"$f":"IF(ROWS(L$5:L46)>$G$2,\"\",INDEX(B$2:B$102,SMALL(IF($B$2:$B$102=$F$2,ROW($B$2:$B$102)-ROW($B$2)+1),ROWS(L$5:L46))))","v":""},{"$f":"IF(ROWS(M$5:M46)>$G$2,\"\",INDEX(C$2:C$102,SMALL(IF($B$2:$B$102=$F$2,ROW($B$2:$B$102)-ROW($B$2)+1),ROWS(M$5:M46))))","v":""}]
["2010-01-19","Franks",89.11,null,{"$f":"IF(ROWS(E$5:E47)>$G$2,\"\",INDEX(A$2:A$102,_xlfn.AGGREGATE(15,6,(ROW($A$2:$A$102)-ROW($A$2)+1)/($B$2:$B$102=$F$2),ROWS(E$5:E47))))","v":""},{"$f":"IF(ROWS(F$5:F47)>$G$2,\"\",INDEX(B$2:B$102,_xlfn.AGGREGATE(15,6,(ROW($A$2:$A$102)-ROW($A$2)+1)/($B$2:$B$102=$F$2),ROWS(F$5:F47))))","v":""},{"$f":"IF(ROWS(G$5:G47)>$G$2,\"\",INDEX(C$2:C$102,_xlfn.AGGREGATE(15,6,(ROW($A$2:$A$102)-ROW($A$2)+1)/($B$2:$B$102=$F$2),ROWS(G$5:G47))))","v":""},null,null,null,{"$f":"IF(ROWS(K$5:K47)>$G$2,\"\",INDEX(A$2:A$102,SMALL(IF($B$2:$B$102=$F$2,ROW($B$2:$B$102)-ROW($B$2)+1),ROWS(K$5:K47))))","v":""},{"$f":"IF(ROWS(L$5:L47)>$G$2,\"\",INDEX(B$2:B$102,SMALL(IF($B$2:$B$102=$F$2,ROW($B$2:$B$102)-ROW($B$2)+1),ROWS(L$5:L47))))","v":""},{"$f":"IF(ROWS(M$5:M47)>$G$2,\"\",INDEX(C$2:C$102,SMALL(IF($B$2:$B$102=$F$2,ROW($B$2:$B$102)-ROW($B$2)+1),ROWS(M$5:M47))))","v":""}]
["2010-02-14","Smith",126.97,null,{"$f":"IF(ROWS(E$5:E48)>$G$2,\"\",INDEX(A$2:A$102,_xlfn.AGGREGATE(15,6,(ROW($A$2:$A$102)-ROW($A$2)+1)/($B$2:$B$102=$F$2),ROWS(E$5:E48))))","v":""},{"$f":"IF(ROWS(F$5:F48)>$G$2,\"\",INDEX(B$2:B$102,_xlfn.AGGREGATE(15,6,(ROW($A$2:$A$102)-ROW($A$2)+1)/($B$2:$B$102=$F$2),ROWS(F$5:F48))))","v":""},{"$f":"IF(ROWS(G$5:G48)>$G$2,\"\",INDEX(C$2:C$102,_xlfn.AGGREGATE(15,6,(ROW($A$2:$A$102)-ROW($A$2)+1)/($B$2:$B$102=$F$2),ROWS(G$5:G48))))","v":""},null,null,null,{"$f":"IF(ROWS(K$5:K48)>$G$2,\"\",INDEX(A$2:A$102,SMALL(IF($B$2:$B$102=$F$2,ROW($B$2:$B$102)-ROW($B$2)+1),ROWS(K$5:K48))))","v":""},{"$f":"IF(ROWS(L$5:L48)>$G$2,\"\",INDEX(B$2:B$102,SMALL(IF($B$2:$B$102=$F$2,ROW($B$2:$B$102)-ROW($B$2)+1),ROWS(L$5:L48))))","v":""},{"$f":"IF(ROWS(M$5:M48)>$G$2,\"\",INDEX(C$2:C$102,SMALL(IF($B$2:$B$102=$F$2,ROW($B$2:$B$102)-ROW($B$2)+1),ROWS(M$5:M48))))","v":""}]
["2009-12-03","Smith",154.31,null,{"$f":"IF(ROWS(E$5:E49)>$G$2,\"\",INDEX(A$2:A$102,_xlfn.AGGREGATE(15,6,(ROW($A$2:$A$102)-ROW($A$2)+1)/($B$2:$B$102=$F$2),ROWS(E$5:E49))))","v":""},{"$f":"IF(ROWS(F$5:F49)>$G$2,\"\",INDEX(B$2:B$102,_xlfn.AGGREGATE(15,6,(ROW($A$2:$A$102)-ROW($A$2)+1)/($B$2:$B$102=$F$2),ROWS(F$5:F49))))","v":""},{"$f":"IF(ROWS(G$5:G49)>$G$2,\"\",INDEX(C$2:C$102,_xlfn.AGGREGATE(15,6,(ROW($A$2:$A$102)-ROW($A$2)+1)/($B$2:$B$102=$F$2),ROWS(G$5:G49))))","v":""},null,null,null,{"$f":"IF(ROWS(K$5:K49)>$G$2,\"\",INDEX(A$2:A$102,SMALL(IF($B$2:$B$102=$F$2,ROW($B$2:$B$102)-ROW($B$2)+1),ROWS(K$5:K49))))","v":""},{"$f":"IF(ROWS(L$5:L49)>$G$2,\"\",INDEX(B$2:B$102,SMALL(IF($B$2:$B$102=$F$2,ROW($B$2:$B$102)-ROW($B$2)+1),ROWS(L$5:L49))))","v":""},{"$f":"IF(ROWS(M$5:M49)>$G$2,\"\",INDEX(C$2:C$102,SMALL(IF($B$2:$B$102=$F$2,ROW($B$2:$B$102)-ROW($B$2)+1),ROWS(M$5:M49))))","v":""}]
["2010-01-02","Sioux",76.59,null,{"$f":"IF(ROWS(E$5:E50)>$G$2,\"\",INDEX(A$2:A$102,_xlfn.AGGREGATE(15,6,(ROW($A$2:$A$102)-ROW($A$2)+1)/($B$2:$B$102=$F$2),ROWS(E$5:E50))))","v":""},{"$f":"IF(ROWS(F$5:F50)>$G$2,\"\",INDEX(B$2:B$102,_xlfn.AGGREGATE(15,6,(ROW($A$2:$A$102)-ROW($A$2)+1)/($B$2:$B$102=$F$2),ROWS(F$5:F50))))","v":""},{"$f":"IF(ROWS(G$5:G50)>$G$2,\"\",INDEX(C$2:C$102,_xlfn.AGGREGATE(15,6,(ROW($A$2:$A$102)-ROW($A$2)+1)/($B$2:$B$102=$F$2),ROWS(G$5:G50))))","v":""},null,null,null,{"$f":"IF(ROWS(K$5:K50)>$G$2,\"\",INDEX(A$2:A$102,SMALL(IF($B$2:$B$102=$F$2,ROW($B$2:$B$102)-ROW($B$2)+1),ROWS(K$5:K50))))","v":""},{"$f":"IF(ROWS(L$5:L50)>$G$2,\"\",INDEX(B$2:B$102,SMALL(IF($B$2:$B$102=$F$2,ROW($B$2:$B$102)-ROW($B$2)+1),ROWS(L$5:L50))))","v":""},{"$f":"IF(ROWS(M$5:M50)>$G$2,\"\",INDEX(C$2:C$102,SMALL(IF($B$2:$B$102=$F$2,ROW($B$2:$B$102)-ROW($B$2)+1),ROWS(M$5:M50))))","v":""}]
["2009-12-29","Gault",106.94,null,{"$f":"IF(ROWS(E$5:E51)>$G$2,\"\",INDEX(A$2:A$102,_xlfn.AGGREGATE(15,6,(ROW($A$2:$A$102)-ROW($A$2)+1)/($B$2:$B$102=$F$2),ROWS(E$5:E51))))","v":""},{"$f":"IF(ROWS(F$5:F51)>$G$2,\"\",INDEX(B$2:B$102,_xlfn.AGGREGATE(15,6,(ROW($A$2:$A$102)-ROW($A$2)+1)/($B$2:$B$102=$F$2),ROWS(F$5:F51))))","v":""},{"$f":"IF(ROWS(G$5:G51)>$G$2,\"\",INDEX(C$2:C$102,_xlfn.AGGREGATE(15,6,(ROW($A$2:$A$102)-ROW($A$2)+1)/($B$2:$B$102=$F$2),ROWS(G$5:G51))))","v":""},null,null,null,{"$f":"IF(ROWS(K$5:K51)>$G$2,\"\",INDEX(A$2:A$102,SMALL(IF($B$2:$B$102=$F$2,ROW($B$2:$B$102)-ROW($B$2)+1),ROWS(K$5:K51))))","v":""},{"$f":"IF(ROWS(L$5:L51)>$G$2,\"\",INDEX(B$2:B$102,SMALL(IF($B$2:$B$102=$F$2,ROW($B$2:$B$102)-ROW($B$2)+1),ROWS(L$5:L51))))","v":""},{"$f":"IF(ROWS(M$5:M51)>$G$2,\"\",INDEX(C$2:C$102,SMALL(IF($B$2:$B$102=$F$2,ROW($B$2:$B$102)-ROW($B$2)+1),ROWS(M$5:M51))))","v":""}]
["2009-11-26","Chin",129.86000000000001,null,{"$f":"IF(ROWS(E$5:E52)>$G$2,\"\",INDEX(A$2:A$102,_xlfn.AGGREGATE(15,6,(ROW($A$2:$A$102)-ROW($A$2)+1)/($B$2:$B$102=$F$2),ROWS(E$5:E52))))","v":""},{"$f":"IF(ROWS(F$5:F52)>$G$2,\"\",INDEX(B$2:B$102,_xlfn.AGGREGATE(15,6,(ROW($A$2:$A$102)-ROW($A$2)+1)/($B$2:$B$102=$F$2),ROWS(F$5:F52))))","v":""},{"$f":"IF(ROWS(G$5:G52)>$G$2,\"\",INDEX(C$2:C$102,_xlfn.AGGREGATE(15,6,(ROW($A$2:$A$102)-ROW($A$2)+1)/($B$2:$B$102=$F$2),ROWS(G$5:G52))))","v":""},null,null,null,{"$f":"IF(ROWS(K$5:K52)>$G$2,\"\",INDEX(A$2:A$102,SMALL(IF($B$2:$B$102=$F$2,ROW($B$2:$B$102)-ROW($B$2)+1),ROWS(K$5:K52))))","v":""},{"$f":"IF(ROWS(L$5:L52)>$G$2,\"\",INDEX(B$2:B$102,SMALL(IF($B$2:$B$102=$F$2,ROW($B$2:$B$102)-ROW($B$2)+1),ROWS(L$5:L52))))","v":""},{"$f":"IF(ROWS(M$5:M52)>$G$2,\"\",INDEX(C$2:C$102,SMALL(IF($B$2:$B$102=$F$2,ROW($B$2:$B$102)-ROW($B$2)+1),ROWS(M$5:M52))))","v":""}]
["2009-12-24","Pham",100.76,null,{"$f":"IF(ROWS(E$5:E53)>$G$2,\"\",INDEX(A$2:A$102,_xlfn.AGGREGATE(15,6,(ROW($A$2:$A$102)-ROW($A$2)+1)/($B$2:$B$102=$F$2),ROWS(E$5:E53))))","v":""},{"$f":"IF(ROWS(F$5:F53)>$G$2,\"\",INDEX(B$2:B$102,_xlfn.AGGREGATE(15,6,(ROW($A$2:$A$102)-ROW($A$2)+1)/($B$2:$B$102=$F$2),ROWS(F$5:F53))))","v":""},{"$f":"IF(ROWS(G$5:G53)>$G$2,\"\",INDEX(C$2:C$102,_xlfn.AGGREGATE(15,6,(ROW($A$2:$A$102)-ROW($A$2)+1)/($B$2:$B$102=$F$2),ROWS(G$5:G53))))","v":""},null,null,null,{"$f":"IF(ROWS(K$5:K53)>$G$2,\"\",INDEX(A$2:A$102,SMALL(IF($B$2:$B$102=$F$2,ROW($B$2:$B$102)-ROW($B$2)+1),ROWS(K$5:K53))))","v":""},{"$f":"IF(ROWS(L$5:L53)>$G$2,\"\",INDEX(B$2:B$102,SMALL(IF($B$2:$B$102=$F$2,ROW($B$2:$B$102)-ROW($B$2)+1),ROWS(L$5:L53))))","v":""},{"$f":"IF(ROWS(M$5:M53)>$G$2,\"\",INDEX(C$2:C$102,SMALL(IF($B$2:$B$102=$F$2,ROW($B$2:$B$102)-ROW($B$2)+1),ROWS(M$5:M53))))","v":""}]
["2009-12-10","Gault",124.59,null,{"$f":"IF(ROWS(E$5:E54)>$G$2,\"\",INDEX(A$2:A$102,_xlfn.AGGREGATE(15,6,(ROW($A$2:$A$102)-ROW($A$2)+1)/($B$2:$B$102=$F$2),ROWS(E$5:E54))))","v":""},{"$f":"IF(ROWS(F$5:F54)>$G$2,\"\",INDEX(B$2:B$102,_xlfn.AGGREGATE(15,6,(ROW($A$2:$A$102)-ROW($A$2)+1)/($B$2:$B$102=$F$2),ROWS(F$5:F54))))","v":""},{"$f":"IF(ROWS(G$5:G54)>$G$2,\"\",INDEX(C$2:C$102,_xlfn.AGGREGATE(15,6,(ROW($A$2:$A$102)-ROW($A$2)+1)/($B$2:$B$102=$F$2),ROWS(G$5:G54))))","v":""},null,null,null,{"$f":"IF(ROWS(K$5:K54)>$G$2,\"\",INDEX(A$2:A$102,SMALL(IF($B$2:$B$102=$F$2,ROW($B$2:$B$102)-ROW($B$2)+1),ROWS(K$5:K54))))","v":""},{"$f":"IF(ROWS(L$5:L54)>$G$2,\"\",INDEX(B$2:B$102,SMALL(IF($B$2:$B$102=$F$2,ROW($B$2:$B$102)-ROW($B$2)+1),ROWS(L$5:L54))))","v":""},{"$f":"IF(ROWS(M$5:M54)>$G$2,\"\",INDEX(C$2:C$102,SMALL(IF($B$2:$B$102=$F$2,ROW($B$2:$B$102)-ROW($B$2)+1),ROWS(M$5:M54))))","v":""}]
["2009-12-31","Smith",150.31,null,{"$f":"IF(ROWS(E$5:E55)>$G$2,\"\",INDEX(A$2:A$102,_xlfn.AGGREGATE(15,6,(ROW($A$2:$A$102)-ROW($A$2)+1)/($B$2:$B$102=$F$2),ROWS(E$5:E55))))","v":""},{"$f":"IF(ROWS(F$5:F55)>$G$2,\"\",INDEX(B$2:B$102,_xlfn.AGGREGATE(15,6,(ROW($A$2:$A$102)-ROW($A$2)+1)/($B$2:$B$102=$F$2),ROWS(F$5:F55))))","v":""},{"$f":"IF(ROWS(G$5:G55)>$G$2,\"\",INDEX(C$2:C$102,_xlfn.AGGREGATE(15,6,(ROW($A$2:$A$102)-ROW($A$2)+1)/($B$2:$B$102=$F$2),ROWS(G$5:G55))))","v":""},null,null,null,{"$f":"IF(ROWS(K$5:K55)>$G$2,\"\",INDEX(A$2:A$102,SMALL(IF($B$2:$B$102=$F$2,ROW($B$2:$B$102)-ROW($B$2)+1),ROWS(K$5:K55))))","v":""},{"$f":"IF(ROWS(L$5:L55)>$G$2,\"\",INDEX(B$2:B$102,SMALL(IF($B$2:$B$102=$F$2,ROW($B$2:$B$102)-ROW($B$2)+1),ROWS(L$5:L55))))","v":""},{"$f":"IF(ROWS(M$5:M55)>$G$2,\"\",INDEX(C$2:C$102,SMALL(IF($B$2:$B$102=$F$2,ROW($B$2:$B$102)-ROW($B$2)+1),ROWS(M$5:M55))))","v":""}]
["2009-12-16","Franks",119.78,null,{"$f":"IF(ROWS(E$5:E56)>$G$2,\"\",INDEX(A$2:A$102,_xlfn.AGGREGATE(15,6,(ROW($A$2:$A$102)-ROW($A$2)+1)/($B$2:$B$102=$F$2),ROWS(E$5:E56))))","v":""},{"$f":"IF(ROWS(F$5:F56)>$G$2,\"\",INDEX(B$2:B$102,_xlfn.AGGREGATE(15,6,(ROW($A$2:$A$102)-ROW($A$2)+1)/($B$2:$B$102=$F$2),ROWS(F$5:F56))))","v":""},{"$f":"IF(ROWS(G$5:G56)>$G$2,\"\",INDEX(C$2:C$102,_xlfn.AGGREGATE(15,6,(ROW($A$2:$A$102)-ROW($A$2)+1)/($B$2:$B$102=$F$2),ROWS(G$5:G56))))","v":""},null,null,null,{"$f":"IF(ROWS(K$5:K56)>$G$2,\"\",INDEX(A$2:A$102,SMALL(IF($B$2:$B$102=$F$2,ROW($B$2:$B$102)-ROW($B$2)+1),ROWS(K$5:K56))))","v":""},{"$f":"IF(ROWS(L$5:L56)>$G$2,\"\",INDEX(B$2:B$102,SMALL(IF($B$2:$B$102=$F$2,ROW($B$2:$B$102)-ROW($B$2)+1),ROWS(L$5:L56))))","v":""},{"$f":"IF(ROWS(M$5:M56)>$G$2,\"\",INDEX(C$2:C$102,SMALL(IF($B$2:$B$102=$F$2,ROW($B$2:$B$102)-ROW($B$2)+1),ROWS(M$5:M56))))","v":""}]
["2010-01-03","Pham",93.37,null,{"$f":"IF(ROWS(E$5:E57)>$G$2,\"\",INDEX(A$2:A$102,_xlfn.AGGREGATE(15,6,(ROW($A$2:$A$102)-ROW($A$2)+1)/($B$2:$B$102=$F$2),ROWS(E$5:E57))))","v":""},{"$f":"IF(ROWS(F$5:F57)>$G$2,\"\",INDEX(B$2:B$102,_xlfn.AGGREGATE(15,6,(ROW($A$2:$A$102)-ROW($A$2)+1)/($B$2:$B$102=$F$2),ROWS(F$5:F57))))","v":""},{"$f":"IF(ROWS(G$5:G57)>$G$2,\"\",INDEX(C$2:C$102,_xlfn.AGGREGATE(15,6,(ROW($A$2:$A$102)-ROW($A$2)+1)/($B$2:$B$102=$F$2),ROWS(G$5:G57))))","v":""},null,null,null,{"$f":"IF(ROWS(K$5:K57)>$G$2,\"\",INDEX(A$2:A$102,SMALL(IF($B$2:$B$102=$F$2,ROW($B$2:$B$102)-ROW($B$2)+1),ROWS(K$5:K57))))","v":""},{"$f":"IF(ROWS(L$5:L57)>$G$2,\"\",INDEX(B$2:B$102,SMALL(IF($B$2:$B$102=$F$2,ROW($B$2:$B$102)-ROW($B$2)+1),ROWS(L$5:L57))))","v":""},{"$f":"IF(ROWS(M$5:M57)>$G$2,\"\",INDEX(C$2:C$102,SMALL(IF($B$2:$B$102=$F$2,ROW($B$2:$B$102)-ROW($B$2)+1),ROWS(M$5:M57))))","v":""}]
["2009-12-26","Chin",87.06,null,{"$f":"IF(ROWS(E$5:E58)>$G$2,\"\",INDEX(A$2:A$102,_xlfn.AGGREGATE(15,6,(ROW($A$2:$A$102)-ROW($A$2)+1)/($B$2:$B$102=$F$2),ROWS(E$5:E58))))","v":""},{"$f":"IF(ROWS(F$5:F58)>$G$2,\"\",INDEX(B$2:B$102,_xlfn.AGGREGATE(15,6,(ROW($A$2:$A$102)-ROW($A$2)+1)/($B$2:$B$102=$F$2),ROWS(F$5:F58))))","v":""},{"$f":"IF(ROWS(G$5:G58)>$G$2,\"\",INDEX(C$2:C$102,_xlfn.AGGREGATE(15,6,(ROW($A$2:$A$102)-ROW($A$2)+1)/($B$2:$B$102=$F$2),ROWS(G$5:G58))))","v":""},null,null,null,{"$f":"IF(ROWS(K$5:K58)>$G$2,\"\",INDEX(A$2:A$102,SMALL(IF($B$2:$B$102=$F$2,ROW($B$2:$B$102)-ROW($B$2)+1),ROWS(K$5:K58))))","v":""},{"$f":"IF(ROWS(L$5:L58)>$G$2,\"\",INDEX(B$2:B$102,SMALL(IF($B$2:$B$102=$F$2,ROW($B$2:$B$102)-ROW($B$2)+1),ROWS(L$5:L58))))","v":""},{"$f":"IF(ROWS(M$5:M58)>$G$2,\"\",INDEX(C$2:C$102,SMALL(IF($B$2:$B$102=$F$2,ROW($B$2:$B$102)-ROW($B$2)+1),ROWS(M$5:M58))))","v":""}]
["2010-01-05","Smith",147.49,null,{"$f":"IF(ROWS(E$5:E59)>$G$2,\"\",INDEX(A$2:A$102,_xlfn.AGGREGATE(15,6,(ROW($A$2:$A$102)-ROW($A$2)+1)/($B$2:$B$102=$F$2),ROWS(E$5:E59))))","v":""},{"$f":"IF(ROWS(F$5:F59)>$G$2,\"\",INDEX(B$2:B$102,_xlfn.AGGREGATE(15,6,(ROW($A$2:$A$102)-ROW($A$2)+1)/($B$2:$B$102=$F$2),ROWS(F$5:F59))))","v":""},{"$f":"IF(ROWS(G$5:G59)>$G$2,\"\",INDEX(C$2:C$102,_xlfn.AGGREGATE(15,6,(ROW($A$2:$A$102)-ROW($A$2)+1)/($B$2:$B$102=$F$2),ROWS(G$5:G59))))","v":""},null,null,null,{"$f":"IF(ROWS(K$5:K59)>$G$2,\"\",INDEX(A$2:A$102,SMALL(IF($B$2:$B$102=$F$2,ROW($B$2:$B$102)-ROW($B$2)+1),ROWS(K$5:K59))))","v":""},{"$f":"IF(ROWS(L$5:L59)>$G$2,\"\",INDEX(B$2:B$102,SMALL(IF($B$2:$B$102=$F$2,ROW($B$2:$B$102)-ROW($B$2)+1),ROWS(L$5:L59))))","v":""},{"$f":"IF(ROWS(M$5:M59)>$G$2,\"\",INDEX(C$2:C$102,SMALL(IF($B$2:$B$102=$F$2,ROW($B$2:$B$102)-ROW($B$2)+1),ROWS(M$5:M59))))","v":""}]
["2009-12-19","Smith",136.94,null,{"$f":"IF(ROWS(E$5:E60)>$G$2,\"\",INDEX(A$2:A$102,_xlfn.AGGREGATE(15,6,(ROW($A$2:$A$102)-ROW($A$2)+1)/($B$2:$B$102=$F$2),ROWS(E$5:E60))))","v":""},{"$f":"IF(ROWS(F$5:F60)>$G$2,\"\",INDEX(B$2:B$102,_xlfn.AGGREGATE(15,6,(ROW($A$2:$A$102)-ROW($A$2)+1)/($B$2:$B$102=$F$2),ROWS(F$5:F60))))","v":""},{"$f":"IF(ROWS(G$5:G60)>$G$2,\"\",INDEX(C$2:C$102,_xlfn.AGGREGATE(15,6,(ROW($A$2:$A$102)-ROW($A$2)+1)/($B$2:$B$102=$F$2),ROWS(G$5:G60))))","v":""},null,null,null,{"$f":"IF(ROWS(K$5:K60)>$G$2,\"\",INDEX(A$2:A$102,SMALL(IF($B$2:$B$102=$F$2,ROW($B$2:$B$102)-ROW($B$2)+1),ROWS(K$5:K60))))","v":""},{"$f":"IF(ROWS(L$5:L60)>$G$2,\"\",INDEX(B$2:B$102,SMALL(IF($B$2:$B$102=$F$2,ROW($B$2:$B$102)-ROW($B$2)+1),ROWS(L$5:L60))))","v":""},{"$f":"IF(ROWS(M$5:M60)>$G$2,\"\",INDEX(C$2:C$102,SMALL(IF($B$2:$B$102=$F$2,ROW($B$2:$B$102)-ROW($B$2)+1),ROWS(M$5:M60))))","v":""}]
["2009-11-20","Gault",93.33,null,{"$f":"IF(ROWS(E$5:E61)>$G$2,\"\",INDEX(A$2:A$102,_xlfn.AGGREGATE(15,6,(ROW($A$2:$A$102)-ROW($A$2)+1)/($B$2:$B$102=$F$2),ROWS(E$5:E61))))","v":""},{"$f":"IF(ROWS(F$5:F61)>$G$2,\"\",INDEX(B$2:B$102,_xlfn.AGGREGATE(15,6,(ROW($A$2:$A$102)-ROW($A$2)+1)/($B$2:$B$102=$F$2),ROWS(F$5:F61))))","v":""},{"$f":"IF(ROWS(G$5:G61)>$G$2,\"\",INDEX(C$2:C$102,_xlfn.AGGREGATE(15,6,(ROW($A$2:$A$102)-ROW($A$2)+1)/($B$2:$B$102=$F$2),ROWS(G$5:G61))))","v":""},null,null,null,{"$f":"IF(ROWS(K$5:K61)>$G$2,\"\",INDEX(A$2:A$102,SMALL(IF($B$2:$B$102=$F$2,ROW($B$2:$B$102)-ROW($B$2)+1),ROWS(K$5:K61))))","v":""},{"$f":"IF(ROWS(L$5:L61)>$G$2,\"\",INDEX(B$2:B$102,SMALL(IF($B$2:$B$102=$F$2,ROW($B$2:$B$102)-ROW($B$2)+1),ROWS(L$5:L61))))","v":""},{"$f":"IF(ROWS(M$5:M61)>$G$2,\"\",INDEX(C$2:C$102,SMALL(IF($B$2:$B$102=$F$2,ROW($B$2:$B$102)-ROW($B$2)+1),ROWS(M$5:M61))))","v":""}]
["2010-01-03","Smith",128.97,null,{"$f":"IF(ROWS(E$5:E62)>$G$2,\"\",INDEX(A$2:A$102,_xlfn.AGGREGATE(15,6,(ROW($A$2:$A$102)-ROW($A$2)+1)/($B$2:$B$102=$F$2),ROWS(E$5:E62))))","v":""},{"$f":"IF(ROWS(F$5:F62)>$G$2,\"\",INDEX(B$2:B$102,_xlfn.AGGREGATE(15,6,(ROW($A$2:$A$102)-ROW($A$2)+1)/($B$2:$B$102=$F$2),ROWS(F$5:F62))))","v":""},{"$f":"IF(ROWS(G$5:G62)>$G$2,\"\",INDEX(C$2:C$102,_xlfn.AGGREGATE(15,6,(ROW($A$2:$A$102)-ROW($A$2)+1)/($B$2:$B$102=$F$2),ROWS(G$5:G62))))","v":""},null,null,null,{"$f":"IF(ROWS(K$5:K62)>$G$2,\"\",INDEX(A$2:A$102,SMALL(IF($B$2:$B$102=$F$2,ROW($B$2:$B$102)-ROW($B$2)+1),ROWS(K$5:K62))))","v":""},{"$f":"IF(ROWS(L$5:L62)>$G$2,\"\",INDEX(B$2:B$102,SMALL(IF($B$2:$B$102=$F$2,ROW($B$2:$B$102)-ROW($B$2)+1),ROWS(L$5:L62))))","v":""},{"$f":"IF(ROWS(M$5:M62)>$G$2,\"\",INDEX(C$2:C$102,SMALL(IF($B$2:$B$102=$F$2,ROW($B$2:$B$102)-ROW($B$2)+1),ROWS(M$5:M62))))","v":""}]
["2009-12-14","Smith",114.93,null,{"$f":"IF(ROWS(E$5:E63)>$G$2,\"\",INDEX(A$2:A$102,_xlfn.AGGREGATE(15,6,(ROW($A$2:$A$102)-ROW($A$2)+1)/($B$2:$B$102=$F$2),ROWS(E$5:E63))))","v":""},{"$f":"IF(ROWS(F$5:F63)>$G$2,\"\",INDEX(B$2:B$102,_xlfn.AGGREGATE(15,6,(ROW($A$2:$A$102)-ROW($A$2)+1)/($B$2:$B$102=$F$2),ROWS(F$5:F63))))","v":""},{"$f":"IF(ROWS(G$5:G63)>$G$2,\"\",INDEX(C$2:C$102,_xlfn.AGGREGATE(15,6,(ROW($A$2:$A$102)-ROW($A$2)+1)/($B$2:$B$102=$F$2),ROWS(G$5:G63))))","v":""},null,null,null,{"$f":"IF(ROWS(K$5:K63)>$G$2,\"\",INDEX(A$2:A$102,SMALL(IF($B$2:$B$102=$F$2,ROW($B$2:$B$102)-ROW($B$2)+1),ROWS(K$5:K63))))","v":""},{"$f":"IF(ROWS(L$5:L63)>$G$2,\"\",INDEX(B$2:B$102,SMALL(IF($B$2:$B$102=$F$2,ROW($B$2:$B$102)-ROW($B$2)+1),ROWS(L$5:L63))))","v":""},{"$f":"IF(ROWS(M$5:M63)>$G$2,\"\",INDEX(C$2:C$102,SMALL(IF($B$2:$B$102=$F$2,ROW($B$2:$B$102)-ROW($B$2)+1),ROWS(M$5:M63))))","v":""}]
["2010-01-01","Sioux",104.57,null,{"$f":"IF(ROWS(E$5:E64)>$G$2,\"\",INDEX(A$2:A$102,_xlfn.AGGREGATE(15,6,(ROW($A$2:$A$102)-ROW($A$2)+1)/($B$2:$B$102=$F$2),ROWS(E$5:E64))))","v":""},{"$f":"IF(ROWS(F$5:F64)>$G$2,\"\",INDEX(B$2:B$102,_xlfn.AGGREGATE(15,6,(ROW($A$2:$A$102)-ROW($A$2)+1)/($B$2:$B$102=$F$2),ROWS(F$5:F64))))","v":""},{"$f":"IF(ROWS(G$5:G64)>$G$2,\"\",INDEX(C$2:C$102,_xlfn.AGGREGATE(15,6,(ROW($A$2:$A$102)-ROW($A$2)+1)/($B$2:$B$102=$F$2),ROWS(G$5:G64))))","v":""},null,null,null,{"$f":"IF(ROWS(K$5:K64)>$G$2,\"\",INDEX(A$2:A$102,SMALL(IF($B$2:$B$102=$F$2,ROW($B$2:$B$102)-ROW($B$2)+1),ROWS(K$5:K64))))","v":""},{"$f":"IF(ROWS(L$5:L64)>$G$2,\"\",INDEX(B$2:B$102,SMALL(IF($B$2:$B$102=$F$2,ROW($B$2:$B$102)-ROW($B$2)+1),ROWS(L$5:L64))))","v":""},{"$f":"IF(ROWS(M$5:M64)>$G$2,\"\",INDEX(C$2:C$102,SMALL(IF($B$2:$B$102=$F$2,ROW($B$2:$B$102)-ROW($B$2)+1),ROWS(M$5:M64))))","v":""}]
["2009-11-27","Sioux",119.53,null,{"$f":"IF(ROWS(E$5:E65)>$G$2,\"\",INDEX(A$2:A$102,_xlfn.AGGREGATE(15,6,(ROW($A$2:$A$102)-ROW($A$2)+1)/($B$2:$B$102=$F$2),ROWS(E$5:E65))))","v":""},{"$f":"IF(ROWS(F$5:F65)>$G$2,\"\",INDEX(B$2:B$102,_xlfn.AGGREGATE(15,6,(ROW($A$2:$A$102)-ROW($A$2)+1)/($B$2:$B$102=$F$2),ROWS(F$5:F65))))","v":""},{"$f":"IF(ROWS(G$5:G65)>$G$2,\"\",INDEX(C$2:C$102,_xlfn.AGGREGATE(15,6,(ROW($A$2:$A$102)-ROW($A$2)+1)/($B$2:$B$102=$F$2),ROWS(G$5:G65))))","v":""},null,null,null,{"$f":"IF(ROWS(K$5:K65)>$G$2,\"\",INDEX(A$2:A$102,SMALL(IF($B$2:$B$102=$F$2,ROW($B$2:$B$102)-ROW($B$2)+1),ROWS(K$5:K65))))","v":""},{"$f":"IF(ROWS(L$5:L65)>$G$2,\"\",INDEX(B$2:B$102,SMALL(IF($B$2:$B$102=$F$2,ROW($B$2:$B$102)-ROW($B$2)+1),ROWS(L$5:L65))))","v":""},{"$f":"IF(ROWS(M$5:M65)>$G$2,\"\",INDEX(C$2:C$102,SMALL(IF($B$2:$B$102=$F$2,ROW($B$2:$B$102)-ROW($B$2)+1),ROWS(M$5:M65))))","v":""}]
["2010-01-01","Pham",127.99,null,{"$f":"IF(ROWS(E$5:E66)>$G$2,\"\",INDEX(A$2:A$102,_xlfn.AGGREGATE(15,6,(ROW($A$2:$A$102)-ROW($A$2)+1)/($B$2:$B$102=$F$2),ROWS(E$5:E66))))","v":""},{"$f":"IF(ROWS(F$5:F66)>$G$2,\"\",INDEX(B$2:B$102,_xlfn.AGGREGATE(15,6,(ROW($A$2:$A$102)-ROW($A$2)+1)/($B$2:$B$102=$F$2),ROWS(F$5:F66))))","v":""},{"$f":"IF(ROWS(G$5:G66)>$G$2,\"\",INDEX(C$2:C$102,_xlfn.AGGREGATE(15,6,(ROW($A$2:$A$102)-ROW($A$2)+1)/($B$2:$B$102=$F$2),ROWS(G$5:G66))))","v":""},null,null,null,{"$f":"IF(ROWS(K$5:K66)>$G$2,\"\",INDEX(A$2:A$102,SMALL(IF($B$2:$B$102=$F$2,ROW($B$2:$B$102)-ROW($B$2)+1),ROWS(K$5:K66))))","v":""},{"$f":"IF(ROWS(L$5:L66)>$G$2,\"\",INDEX(B$2:B$102,SMALL(IF($B$2:$B$102=$F$2,ROW($B$2:$B$102)-ROW($B$2)+1),ROWS(L$5:L66))))","v":""},{"$f":"IF(ROWS(M$5:M66)>$G$2,\"\",INDEX(C$2:C$102,SMALL(IF($B$2:$B$102=$F$2,ROW($B$2:$B$102)-ROW($B$2)+1),ROWS(M$5:M66))))","v":""}]
["2009-12-03","Smith",88.69]
["2009-11-25","Smith",115.67]
["2010-01-07","Pham",114.54]
["2010-02-02","Smith",128.15]
["2010-02-08","Gault",126.33]
["2010-01-13","Smith",112.03]
["2009-11-20","Smith",145.33000000000001]
["2009-12-23","Gault",109.7]
["2009-11-26","Sioux",139.13]
["2009-12-01","Sioux",112.5]
["2009-11-29","Pham",122.21]
["2010-01-13","Smith",135.77000000000001]
["2010-01-09","Pham",75.17]
["2010-01-30","Sioux",104.5]
["2010-02-04","Gault",86.1]
["2010-01-02","Sioux",143.85]
["2010-01-16","Gault",104.36]
["2009-12-28","Smith",135.02000000000001]
["2009-12-26","Pham",83.26]
["2009-11-28","Sioux",114.53]
["2010-02-02","Smith",117.63]
["2009-12-27","Gault",102.24]
["2010-02-01","Chin",139.21]
["2009-12-25","Smith",119.09]
["2010-01-17","Pham",134.11000000000001]
["2010-01-15","Sioux",96.17]
["2010-01-10","Smith",108.54]
["2010-01-05","Gault",78.89]
["2010-01-20","Pham",130.37]
["2009-12-08","Chin",130.5]
["2010-01-16","Franks",123.13]
["2009-12-19","Gault",131.04]
["2009-12-17","Pham",76.260000000000005]
["2010-01-19","Pham",78.459999999999994]
["2009-11-21","Gault",79.11]
["2010-02-18","Gault",75.349999999999994]

{"sheet":"671","index":24,"n_rows":102,"n_cols":13,"rows_kept":102,"cut":false,"hidden":false,"merged":[]}
["Date","SalesRep","Sales ",null,"Year","SalesRep","Count",null,"SalesRep"]
["2009-12-25","Gault",94.69,null,2009,"Gault",{"$f":"SUMPRODUCT(--(YEAR($A$2:$A$102)=E2),--($B$2:$B$102=F2))","v":13},null,"Gault"]
["2009-12-15","Smith",130.19999999999999,null,null,null,null,null,"Smith"]
["2009-12-11","Franks",149.94999999999999,null,"Date","SalesRep","Sales ",null,"Franks",null,"Date","SalesRep","Sales "]
["2009-12-01","Gault",94.11,null,null,null,null,null,"Pham",null,{"$f":"IF(ROWS(K$5:K5)>$G$2,\"\",INDEX(A$2:A$102,SMALL(IF($B$2:$B$102=$F$2,IF(YEAR($A$2:$A$102)=$E$2,ROW($B$2:$B$102)-ROW($B$2)+1)),ROWS(K$5:K5))))","v":"2009-12-25"},{"$f":"IF(ROWS(L$5:L5)>$G$2,\"\",INDEX(B$2:B$102,SMALL(IF($B$2:$B$102=$F$2,IF(YEAR($A$2:$A$102)=$E$2,ROW($B$2:$B$102)-ROW($B$2)+1)),ROWS(L$5:L5))))","v":"Gault"},{"$f":"IF(ROWS(M$5:M5)>$G$2,\"\",INDEX(C$2:C$102,SMALL(IF($B$2:$B$102=$F$2,IF(YEAR($A$2:$A$102)=$E$2,ROW($B$2:$B$102)-ROW($B$2)+1)),ROWS(M$5:M5))))","v":94.69}]
["2009-12-11","Franks",136.13999999999999,null,null,null,null,null,"Sioux",null,{"$f":"IF(ROWS(K$5:K6)>$G$2,\"\",INDEX(A$2:A$102,SMALL(IF($B$2:$B$102=$F$2,IF(YEAR($A$2:$A$102)=$E$2,ROW($B$2:$B$102)-ROW($B$2)+1)),ROWS(K$5:K6))))","v":"2009-12-01"},{"$f":"IF(ROWS(L$5:L6)>$G$2,\"\",INDEX(B$2:B$102,SMALL(IF($B$2:$B$102=$F$2,IF(YEAR($A$2:$A$102)=$E$2,ROW($B$2:$B$102)-ROW($B$2)+1)),ROWS(L$5:L6))))","v":"Gault"},{"$f":"IF(ROWS(M$5:M6)>$G$2,\"\",INDEX(C$2:C$102,SMALL(IF($B$2:$B$102=$F$2,IF(YEAR($A$2:$A$102)=$E$2,ROW($B$2:$B$102)-ROW($B$2)+1)),ROWS(M$5:M6))))","v":94.11}]
["2010-02-12","Pham",133.16999999999999,null,null,null,null,null,"Chin",null,{"$f":"IF(ROWS(K$5:K7)>$G$2,\"\",INDEX(A$2:A$102,SMALL(IF($B$2:$B$102=$F$2,IF(YEAR($A$2:$A$102)=$E$2,ROW($B$2:$B$102)-ROW($B$2)+1)),ROWS(K$5:K7))))","v":"2009-11-23"},{"$f":"IF(ROWS(L$5:L7)>$G$2,\"\",INDEX(B$2:B$102,SMALL(IF($B$2:$B$102=$F$2,IF(YEAR($A$2:$A$102)=$E$2,ROW($B$2:$B$102)-ROW($B$2)+1)),ROWS(L$5:L7))))","v":"Gault"},{"$f":"IF(ROWS(M$5:M7)>$G$2,\"\",INDEX(C$2:C$102,SMALL(IF($B$2:$B$102=$F$2,IF(YEAR($A$2:$A$102)=$E$2,ROW($B$2:$B$102)-ROW($B$2)+1)),ROWS(M$5:M7))))","v":78.95}]
["2009-12-07","Smith",80.81,null,null,null,null,null,null,null,{"$f":"IF(ROWS(K$5:K8)>$G$2,\"\",INDEX(A$2:A$102,SMALL(IF($B$2:$B$102=$F$2,IF(YEAR($A$2:$A$102)=$E$2,ROW($B$2:$B$102)-ROW($B$2)+1)),ROWS(K$5:K8))))","v":"2009-12-20"},{"$f":"IF(ROWS(L$5:L8)>$G$2,\"\",INDEX(B$2:B$102,SMALL(IF($B$2:$B$102=$F$2,IF(YEAR($A$2:$A$102)=$E$2,ROW($B$2:$B$102)-ROW($B$2)+1)),ROWS(L$5:L8))))","v":"Gault"},{"$f":"IF(ROWS(M$5:M8)>$G$2,\"\",INDEX(C$2:C$102,SMALL(IF($B$2:$B$102=$F$2,IF(YEAR($A$2:$A$102)=$E$2,ROW($B$2:$B$102)-ROW($B$2)+1)),ROWS(M$5:M8))))","v":98.71}]
["2009-11-23","Smith",125.38,null,null,null,null,null,null,null,{"$f":"IF(ROWS(K$5:K9)>$G$2,\"\",INDEX(A$2:A$102,SMALL(IF($B$2:$B$102=$F$2,IF(YEAR($A$2:$A$102)=$E$2,ROW($B$2:$B$102)-ROW($B$2)+1)),ROWS(K$5:K9))))","v":"2009-12-14"},{"$f":"IF(ROWS(L$5:L9)>$G$2,\"\",INDEX(B$2:B$102,SMALL(IF($B$2:$B$102=$F$2,IF(YEAR($A$2:$A$102)=$E$2,ROW($B$2:$B$102)-ROW($B$2)+1)),ROWS(L$5:L9))))","v":"Gault"},{"$f":"IF(ROWS(M$5:M9)>$G$2,\"\",INDEX(C$2:C$102,SMALL(IF($B$2:$B$102=$F$2,IF(YEAR($A$2:$A$102)=$E$2,ROW($B$2:$B$102)-ROW($B$2)+1)),ROWS(M$5:M9))))","v":142.55000000000001}]
["2009-11-23","Gault",78.95,null,null,null,null,null,null,null,{"$f":"IF(ROWS(K$5:K10)>$G$2,\"\",INDEX(A$2:A$102,SMALL(IF($B$2:$B$102=$F$2,IF(YEAR($A$2:$A$102)=$E$2,ROW($B$2:$B$102)-ROW($B$2)+1)),ROWS(K$5:K10))))","v":"2009-12-14"},{"$f":"IF(ROWS(L$5:L10)>$G$2,\"\",INDEX(B$2:B$102,SMALL(IF($B$2:$B$102=$F$2,IF(YEAR($A$2:$A$102)=$E$2,ROW($B$2:$B$102)-ROW($B$2)+1)),ROWS(L$5:L10))))","v":"Gault"},{"$f":"IF(ROWS(M$5:M10)>$G$2,\"\",INDEX(C$2:C$102,SMALL(IF($B$2:$B$102=$F$2,IF(YEAR($A$2:$A$102)=$E$2,ROW($B$2:$B$102)-ROW($B$2)+1)),ROWS(M$5:M10))))","v":88.51}]
["2010-01-23","Smith",113.86,null,null,null,null,null,null,null,{"$f":"IF(ROWS(K$5:K11)>$G$2,\"\",INDEX(A$2:A$102,SMALL(IF($B$2:$B$102=$F$2,IF(YEAR($A$2:$A$102)=$E$2,ROW($B$2:$B$102)-ROW($B$2)+1)),ROWS(K$5:K11))))","v":"2009-12-29"},{"$f":"IF(ROWS(L$5:L11)>$G$2,\"\",INDEX(B$2:B$102,SMALL(IF($B$2:$B$102=$F$2,IF(YEAR($A$2:$A$102)=$E$2,ROW($B$2:$B$102)-ROW($B$2)+1)),ROWS(L$5:L11))))","v":"Gault"},{"$f":"IF(ROWS(M$5:M11)>$G$2,\"\",INDEX(C$2:C$102,SMALL(IF($B$2:$B$102=$F$2,IF(YEAR($A$2:$A$102)=$E$2,ROW($B$2:$B$102)-ROW($B$2)+1)),ROWS(M$5:M11))))","v":106.94}]
["2010-01-21","Pham",139.38,null,null,null,null,null,null,null,{"$f":"IF(ROWS(K$5:K12)>$G$2,\"\",INDEX(A$2:A$102,SMALL(IF($B$2:$B$102=$F$2,IF(YEAR($A$2:$A$102)=$E$2,ROW($B$2:$B$102)-ROW($B$2)+1)),ROWS(K$5:K12))))","v":"2009-12-10"},{"$f":"IF(ROWS(L$5:L12)>$G$2,\"\",INDEX(B$2:B$102,SMALL(IF($B$2:$B$102=$F$2,IF(YEAR($A$2:$A$102)=$E$2,ROW($B$2:$B$102)-ROW($B$2)+1)),ROWS(L$5:L12))))","v":"Gault"},{"$f":"IF(ROWS(M$5:M12)>$G$2,\"\",INDEX(C$2:C$102,SMALL(IF($B$2:$B$102=$F$2,IF(YEAR($A$2:$A$102)=$E$2,ROW($B$2:$B$102)-ROW($B$2)+1)),ROWS(M$5:M12))))","v":124.59}]
["2009-12-20","Gault",98.71,null,null,null,null,null,null,null,{"$f":"IF(ROWS(K$5:K13)>$G$2,\"\",INDEX(A$2:A$102,SMALL(IF($B$2:$B$102=$F$2,IF(YEAR($A$2:$A$102)=$E$2,ROW($B$2:$B$102)-ROW($B$2)+1)),ROWS(K$5:K13))))","v":"2009-11-20"},{"$f":"IF(ROWS(L$5:L13)>$G$2,\"\",INDEX(B$2:B$102,SMALL(IF($B$2:$B$102=$F$2,IF(YEAR($A$2:$A$102)=$E$2,ROW($B$2:$B$102)-ROW($B$2)+1)),ROWS(L$5:L13))))","v":"Gault"},{"$f":"IF(ROWS(M$5:M13)>$G$2,\"\",INDEX(C$2:C$102,SMALL(IF($B$2:$B$102=$F$2,IF(YEAR($A$2:$A$102)=$E$2,ROW($B$2:$B$102)-ROW($B$2)+1)),ROWS(M$5:M13))))","v":93.33}]
["2009-12-07","Pham",76.650000000000006,null,null,null,null,null,null,null,{"$f":"IF(ROWS(K$5:K14)>$G$2,\"\",INDEX(A$2:A$102,SMALL(IF($B$2:$B$102=$F$2,IF(YEAR($A$2:$A$102)=$E$2,ROW($B$2:$B$102)-ROW($B$2)+1)),ROWS(K$5:K14))))","v":"2009-12-23"},{"$f":"IF(ROWS(L$5:L14)>$G$2,\"\",INDEX(B$2:B$102,SMALL(IF($B$2:$B$102=$F$2,IF(YEAR($A$2:$A$102)=$E$2,ROW($B$2:$B$102)-ROW($B$2)+1)),ROWS(L$5:L14))))","v":"Gault"},{"$f":"IF(ROWS(M$5:M14)>$G$2,\"\",INDEX(C$2:C$102,SMALL(IF($B$2:$B$102=$F$2,IF(YEAR($A$2:$A$102)=$E$2,ROW($B$2:$B$102)-ROW($B$2)+1)),ROWS(M$5:M14))))","v":109.7}]
["2010-02-11","Gault",126.62,null,null,null,null,null,null,null,{"$f":"IF(ROWS(K$5:K15)>$G$2,\"\",INDEX(A$2:A$102,SMALL(IF($B$2:$B$102=$F$2,IF(YEAR($A$2:$A$102)=$E$2,ROW($B$2:$B$102)-ROW($B$2)+1)),ROWS(K$5:K15))))","v":"2009-12-27"},{"$f":"IF(ROWS(L$5:L15)>$G$2,\"\",INDEX(B$2:B$102,SMALL(IF($B$2:$B$102=$F$2,IF(YEAR($A$2:$A$102)=$E$2,ROW($B$2:$B$102)-ROW($B$2)+1)),ROWS(L$5:L15))))","v":"Gault"},{"$f":"IF(ROWS(M$5:M15)>$G$2,\"\",INDEX(C$2:C$102,SMALL(IF($B$2:$B$102=$F$2,IF(YEAR($A$2:$A$102)=$E$2,ROW($B$2:$B$102)-ROW($B$2)+1)),ROWS(M$5:M15))))","v":102.24}]
["2010-01-13","Franks",107.9,null,null,null,null,null,null,null,{"$f":"IF(ROWS(K$5:K16)>$G$2,\"\",INDEX(A$2:A$102,SMALL(IF($B$2:$B$102=$F$2,IF(YEAR($A$2:$A$102)=$E$2,ROW($B$2:$B$102)-ROW($B$2)+1)),ROWS(K$5:K16))))","v":"2009-12-19"},{"$f":"IF(ROWS(L$5:L16)>$G$2,\"\",INDEX(B$2:B$102,SMALL(IF($B$2:$B$102=$F$2,IF(YEAR($A$2:$A$102)=$E$2,ROW($B$2:$B$102)-ROW($B$2)+1)),ROWS(L$5:L16))))","v":"Gault"},{"$f":"IF(ROWS(M$5:M16)>$G$2,\"\",INDEX(C$2:C$102,SMALL(IF($B$2:$B$102=$F$2,IF(YEAR($A$2:$A$102)=$E$2,ROW($B$2:$B$102)-ROW($B$2)+1)),ROWS(M$5:M16))))","v":131.04}]
["2010-01-28","Gault",130.54,null,null,null,null,null,null,null,{"$f":"IF(ROWS(K$5:K17)>$G$2,\"\",INDEX(A$2:A$102,SMALL(IF($B$2:$B$102=$F$2,IF(YEAR($A$2:$A$102)=$E$2,ROW($B$2:$B$102)-ROW($B$2)+1)),ROWS(K$5:K17))))","v":"2009-11-21"},{"$f":"IF(ROWS(L$5:L17)>$G$2,\"\",INDEX(B$2:B$102,SMALL(IF($B$2:$B$102=$F$2,IF(YEAR($A$2:$A$102)=$E$2,ROW($B$2:$B$102)-ROW($B$2)+1)),ROWS(L$5:L17))))","v":"Gault"},{"$f":"IF(ROWS(M$5:M17)>$G$2,\"\",INDEX(C$2:C$102,SMALL(IF($B$2:$B$102=$F$2,IF(YEAR($A$2:$A$102)=$E$2,ROW($B$2:$B$102)-ROW($B$2)+1)),ROWS(M$5:M17))))","v":79.11}]
["2010-01-25","Gault",140.71,null,null,null,null,null,null,null,{"$f":"IF(ROWS(K$5:K18)>$G$2,\"\",INDEX(A$2:A$102,SMALL(IF($B$2:$B$102=$F$2,IF(YEAR($A$2:$A$102)=$E$2,ROW($B$2:$B$102)-ROW($B$2)+1)),ROWS(K$5:K18))))","v":""},{"$f":"IF(ROWS(L$5:L18)>$G$2,\"\",INDEX(B$2:B$102,SMALL(IF($B$2:$B$102=$F$2,IF(YEAR($A$2:$A$102)=$E$2,ROW($B$2:$B$102)-ROW($B$2)+1)),ROWS(L$5:L18))))","v":""},{"$f":"IF(ROWS(M$5:M18)>$G$2,\"\",INDEX(C$2:C$102,SMALL(IF($B$2:$B$102=$F$2,IF(YEAR($A$2:$A$102)=$E$2,ROW($B$2:$B$102)-ROW($B$2)+1)),ROWS(M$5:M18))))","v":""}]
["2010-02-10","Sioux",108.72,null,null,null,null,null,null,null,{"$f":"IF(ROWS(K$5:K19)>$G$2,\"\",INDEX(A$2:A$102,SMALL(IF($B$2:$B$102=$F$2,IF(YEAR($A$2:$A$102)=$E$2,ROW($B$2:$B$102)-ROW($B$2)+1)),ROWS(K$5:K19))))","v":""},{"$f":"IF(ROWS(L$5:L19)>$G$2,\"\",INDEX(B$2:B$102,SMALL(IF($B$2:$B$102=$F$2,IF(YEAR($A$2:$A$102)=$E$2,ROW($B$2:$B$102)-ROW($B$2)+1)),ROWS(L$5:L19))))","v":""},{"$f":"IF(ROWS(M$5:M19)>$G$2,\"\",INDEX(C$2:C$102,SMALL(IF($B$2:$B$102=$F$2,IF(YEAR($A$2:$A$102)=$E$2,ROW($B$2:$B$102)-ROW($B$2)+1)),ROWS(M$5:M19))))","v":""}]
["2009-12-26","Smith",135.18,null,null,null,null,null,null,null,{"$f":"IF(ROWS(K$5:K20)>$G$2,\"\",INDEX(A$2:A$102,SMALL(IF($B$2:$B$102=$F$2,IF(YEAR($A$2:$A$102)=$E$2,ROW($B$2:$B$102)-ROW($B$2)+1)),ROWS(K$5:K20))))","v":""},{"$f":"IF(ROWS(L$5:L20)>$G$2,\"\",INDEX(B$2:B$102,SMALL(IF($B$2:$B$102=$F$2,IF(YEAR($A$2:$A$102)=$E$2,ROW($B$2:$B$102)-ROW($B$2)+1)),ROWS(L$5:L20))))","v":""},{"$f":"IF(ROWS(M$5:M20)>$G$2,\"\",INDEX(C$2:C$102,SMALL(IF($B$2:$B$102=$F$2,IF(YEAR($A$2:$A$102)=$E$2,ROW($B$2:$B$102)-ROW($B$2)+1)),ROWS(M$5:M20))))","v":""}]
["2009-12-14","Gault",142.55000000000001,null,null,null,null,null,null,null,{"$f":"IF(ROWS(K$5:K21)>$G$2,\"\",INDEX(A$2:A$102,SMALL(IF($B$2:$B$102=$F$2,IF(YEAR($A$2:$A$102)=$E$2,ROW($B$2:$B$102)-ROW($B$2)+1)),ROWS(K$5:K21))))","v":""},{"$f":"IF(ROWS(L$5:L21)>$G$2,\"\",INDEX(B$2:B$102,SMALL(IF($B$2:$B$102=$F$2,IF(YEAR($A$2:$A$102)=$E$2,ROW($B$2:$B$102)-ROW($B$2)+1)),ROWS(L$5:L21))))","v":""},{"$f":"IF(ROWS(M$5:M21)>$G$2,\"\",INDEX(C$2:C$102,SMALL(IF($B$2:$B$102=$F$2,IF(YEAR($A$2:$A$102)=$E$2,ROW($B$2:$B$102)-ROW($B$2)+1)),ROWS(M$5:M21))))","v":""}]
["2010-02-12","Smith",140.54,null,null,null,null,null,null,null,{"$f":"IF(ROWS(K$5:K22)>$G$2,\"\",INDEX(A$2:A$102,SMALL(IF($B$2:$B$102=$F$2,IF(YEAR($A$2:$A$102)=$E$2,ROW($B$2:$B$102)-ROW($B$2)+1)),ROWS(K$5:K22))))","v":""},{"$f":"IF(ROWS(L$5:L22)>$G$2,\"\",INDEX(B$2:B$102,SMALL(IF($B$2:$B$102=$F$2,IF(YEAR($A$2:$A$102)=$E$2,ROW($B$2:$B$102)-ROW($B$2)+1)),ROWS(L$5:L22))))","v":""},{"$f":"IF(ROWS(M$5:M22)>$G$2,\"\",INDEX(C$2:C$102,SMALL(IF($B$2:$B$102=$F$2,IF(YEAR($A$2:$A$102)=$E$2,ROW($B$2:$B$102)-ROW($B$2)+1)),ROWS(M$5:M22))))","v":""}]
["2010-01-19","Franks",75.040000000000006,null,null,null,null,null,null,null,{"$f":"IF(ROWS(K$5:K23)>$G$2,\"\",INDEX(A$2:A$102,SMALL(IF($B$2:$B$102=$F$2,IF(YEAR($A$2:$A$102)=$E$2,ROW($B$2:$B$102)-ROW($B$2)+1)),ROWS(K$5:K23))))","v":""},{"$f":"IF(ROWS(L$5:L23)>$G$2,\"\",INDEX(B$2:B$102,SMALL(IF($B$2:$B$102=$F$2,IF(YEAR($A$2:$A$102)=$E$2,ROW($B$2:$B$102)-ROW($B$2)+1)),ROWS(L$5:L23))))","v":""},{"$f":"IF(ROWS(M$5:M23)>$G$2,\"\",INDEX(C$2:C$102,SMALL(IF($B$2:$B$102=$F$2,IF(YEAR($A$2:$A$102)=$E$2,ROW($B$2:$B$102)-ROW($B$2)+1)),ROWS(M$5:M23))))","v":""}]
["2010-02-16","Pham",93.15,null,null,null,null,null,null,null,{"$f":"IF(ROWS(K$5:K24)>$G$2,\"\",INDEX(A$2:A$102,SMALL(IF($B$2:$B$102=$F$2,IF(YEAR($A$2:$A$102)=$E$2,ROW($B$2:$B$102)-ROW($B$2)+1)),ROWS(K$5:K24))))","v":""},{"$f":"IF(ROWS(L$5:L24)>$G$2,\"\",INDEX(B$2:B$102,SMALL(IF($B$2:$B$102=$F$2,IF(YEAR($A$2:$A$102)=$E$2,ROW($B$2:$B$102)-ROW($B$2)+1)),ROWS(L$5:L24))))","v":""},{"$f":"IF(ROWS(M$5:M24)>$G$2,\"\",INDEX(C$2:C$102,SMALL(IF($B$2:$B$102=$F$2,IF(YEAR($A$2:$A$102)=$E$2,ROW($B$2:$B$102)-ROW($B$2)+1)),ROWS(M$5:M24))))","v":""}]
["2010-01-07","Sioux",132.51,null,null,null,null,null,null,null,{"$f":"IF(ROWS(K$5:K25)>$G$2,\"\",INDEX(A$2:A$102,SMALL(IF($B$2:$B$102=$F$2,IF(YEAR($A$2:$A$102)=$E$2,ROW($B$2:$B$102)-ROW($B$2)+1)),ROWS(K$5:K25))))","v":""},{"$f":"IF(ROWS(L$5:L25)>$G$2,\"\",INDEX(B$2:B$102,SMALL(IF($B$2:$B$102=$F$2,IF(YEAR($A$2:$A$102)=$E$2,ROW($B$2:$B$102)-ROW($B$2)+1)),ROWS(L$5:L25))))","v":""},{"$f":"IF(ROWS(M$5:M25)>$G$2,\"\",INDEX(C$2:C$102,SMALL(IF($B$2:$B$102=$F$2,IF(YEAR($A$2:$A$102)=$E$2,ROW($B$2:$B$102)-ROW($B$2)+1)),ROWS(M$5:M25))))","v":""}]
["2010-01-16","Chin",85.14,null,null,null,null,null,null,null,{"$f":"IF(ROWS(K$5:K26)>$G$2,\"\",INDEX(A$2:A$102,SMALL(IF($B$2:$B$102=$F$2,IF(YEAR($A$2:$A$102)=$E$2,ROW($B$2:$B$102)-ROW($B$2)+1)),ROWS(K$5:K26))))","v":""},{"$f":"IF(ROWS(L$5:L26)>$G$2,\"\",INDEX(B$2:B$102,SMALL(IF($B$2:$B$102=$F$2,IF(YEAR($A$2:$A$102)=$E$2,ROW($B$2:$B$102)-ROW($B$2)+1)),ROWS(L$5:L26))))","v":""},{"$f":"IF(ROWS(M$5:M26)>$G$2,\"\",INDEX(C$2:C$102,SMALL(IF($B$2:$B$102=$F$2,IF(YEAR($A$2:$A$102)=$E$2,ROW($B$2:$B$102)-ROW($B$2)+1)),ROWS(M$5:M26))))","v":""}]
["2010-02-15","Franks",108.85,null,null,null,null,null,null,null,{"$f":"IF(ROWS(K$5:K27)>$G$2,\"\",INDEX(A$2:A$102,SMALL(IF($B$2:$B$102=$F$2,IF(YEAR($A$2:$A$102)=$E$2,ROW($B$2:$B$102)-ROW($B$2)+1)),ROWS(K$5:K27))))","v":""},{"$f":"IF(ROWS(L$5:L27)>$G$2,\"\",INDEX(B$2:B$102,SMALL(IF($B$2:$B$102=$F$2,IF(YEAR($A$2:$A$102)=$E$2,ROW($B$2:$B$102)-ROW($B$2)+1)),ROWS(L$5:L27))))","v":""},{"$f":"IF(ROWS(M$5:M27)>$G$2,\"\",INDEX(C$2:C$102,SMALL(IF($B$2:$B$102=$F$2,IF(YEAR($A$2:$A$102)=$E$2,ROW($B$2:$B$102)-ROW($B$2)+1)),ROWS(M$5:M27))))","v":""}]
["2009-12-13","Sioux",139.91999999999999,null,null,null,null,null,null,null,{"$f":"IF(ROWS(K$5:K28)>$G$2,\"\",INDEX(A$2:A$102,SMALL(IF($B$2:$B$102=$F$2,IF(YEAR($A$2:$A$102)=$E$2,ROW($B$2:$B$102)-ROW($B$2)+1)),ROWS(K$5:K28))))","v":""},{"$f":"IF(ROWS(L$5:L28)>$G$2,\"\",INDEX(B$2:B$102,SMALL(IF($B$2:$B$102=$F$2,IF(YEAR($A$2:$A$102)=$E$2,ROW($B$2:$B$102)-ROW($B$2)+1)),ROWS(L$5:L28))))","v":""},{"$f":"IF(ROWS(M$5:M28)>$G$2,\"\",INDEX(C$2:C$102,SMALL(IF($B$2:$B$102=$F$2,IF(YEAR($A$2:$A$102)=$E$2,ROW($B$2:$B$102)-ROW($B$2)+1)),ROWS(M$5:M28))))","v":""}]
["2010-01-04","Franks",104.35,null,null,null,null,null,null,null,{"$f":"IF(ROWS(K$5:K29)>$G$2,\"\",INDEX(A$2:A$102,SMALL(IF($B$2:$B$102=$F$2,IF(YEAR($A$2:$A$102)=$E$2,ROW($B$2:$B$102)-ROW($B$2)+1)),ROWS(K$5:K29))))","v":""},{"$f":"IF(ROWS(L$5:L29)>$G$2,\"\",INDEX(B$2:B$102,SMALL(IF($B$2:$B$102=$F$2,IF(YEAR($A$2:$A$102)=$E$2,ROW($B$2:$B$102)-ROW($B$2)+1)),ROWS(L$5:L29))))","v":""},{"$f":"IF(ROWS(M$5:M29)>$G$2,\"\",INDEX(C$2:C$102,SMALL(IF($B$2:$B$102=$F$2,IF(YEAR($A$2:$A$102)=$E$2,ROW($B$2:$B$102)-ROW($B$2)+1)),ROWS(M$5:M29))))","v":""}]
["2009-12-14","Gault",88.51,null,null,null,null,null,null,null,{"$f":"IF(ROWS(K$5:K30)>$G$2,\"\",INDEX(A$2:A$102,SMALL(IF($B$2:$B$102=$F$2,IF(YEAR($A$2:$A$102)=$E$2,ROW($B$2:$B$102)-ROW($B$2)+1)),ROWS(K$5:K30))))","v":""},{"$f":"IF(ROWS(L$5:L30)>$G$2,\"\",INDEX(B$2:B$102,SMALL(IF($B$2:$B$102=$F$2,IF(YEAR($A$2:$A$102)=$E$2,ROW($B$2:$B$102)-ROW($B$2)+1)),ROWS(L$5:L30))))","v":""},{"$f":"IF(ROWS(M$5:M30)>$G$2,\"\",INDEX(C$2:C$102,SMALL(IF($B$2:$B$102=$F$2,IF(YEAR($A$2:$A$102)=$E$2,ROW($B$2:$B$102)-ROW($B$2)+1)),ROWS(M$5:M30))))","v":""}]
["2010-02-01","Gault",136.76,null,null,null,null,null,null,null,{"$f":"IF(ROWS(K$5:K31)>$G$2,\"\",INDEX(A$2:A$102,SMALL(IF($B$2:$B$102=$F$2,IF(YEAR($A$2:$A$102)=$E$2,ROW($B$2:$B$102)-ROW($B$2)+1)),ROWS(K$5:K31))))","v":""},{"$f":"IF(ROWS(L$5:L31)>$G$2,\"\",INDEX(B$2:B$102,SMALL(IF($B$2:$B$102=$F$2,IF(YEAR($A$2:$A$102)=$E$2,ROW($B$2:$B$102)-ROW($B$2)+1)),ROWS(L$5:L31))))","v":""},{"$f":"IF(ROWS(M$5:M31)>$G$2,\"\",INDEX(C$2:C$102,SMALL(IF($B$2:$B$102=$F$2,IF(YEAR($A$2:$A$102)=$E$2,ROW($B$2:$B$102)-ROW($B$2)+1)),ROWS(M$5:M31))))","v":""}]
["2009-11-25","Pham",109.57,null,null,null,null,null,null,null,{"$f":"IF(ROWS(K$5:K32)>$G$2,\"\",INDEX(A$2:A$102,SMALL(IF($B$2:$B$102=$F$2,IF(YEAR($A$2:$A$102)=$E$2,ROW($B$2:$B$102)-ROW($B$2)+1)),ROWS(K$5:K32))))","v":""},{"$f":"IF(ROWS(L$5:L32)>$G$2,\"\",INDEX(B$2:B$102,SMALL(IF($B$2:$B$102=$F$2,IF(YEAR($A$2:$A$102)=$E$2,ROW($B$2:$B$102)-ROW($B$2)+1)),ROWS(L$5:L32))))","v":""},{"$f":"IF(ROWS(M$5:M32)>$G$2,\"\",INDEX(C$2:C$102,SMALL(IF($B$2:$B$102=$F$2,IF(YEAR($A$2:$A$102)=$E$2,ROW($B$2:$B$102)-ROW($B$2)+1)),ROWS(M$5:M32))))","v":""}]
["2010-02-07","Franks",125.81,null,null,null,null,null,null,null,{"$f":"IF(ROWS(K$5:K33)>$G$2,\"\",INDEX(A$2:A$102,SMALL(IF($B$2:$B$102=$F$2,IF(YEAR($A$2:$A$102)=$E$2,ROW($B$2:$B$102)-ROW($B$2)+1)),ROWS(K$5:K33))))","v":""},{"$f":"IF(ROWS(L$5:L33)>$G$2,\"\",INDEX(B$2:B$102,SMALL(IF($B$2:$B$102=$F$2,IF(YEAR($A$2:$A$102)=$E$2,ROW($B$2:$B$102)-ROW($B$2)+1)),ROWS(L$5:L33))))","v":""},{"$f":"IF(ROWS(M$5:M33)>$G$2,\"\",INDEX(C$2:C$102,SMALL(IF($B$2:$B$102=$F$2,IF(YEAR($A$2:$A$102)=$E$2,ROW($B$2:$B$102)-ROW($B$2)+1)),ROWS(M$5:M33))))","v":""}]
["2009-12-22","Pham",150.09,null,null,null,null,null,null,null,{"$f":"IF(ROWS(K$5:K34)>$G$2,\"\",INDEX(A$2:A$102,SMALL(IF($B$2:$B$102=$F$2,IF(YEAR($A$2:$A$102)=$E$2,ROW($B$2:$B$102)-ROW($B$2)+1)),ROWS(K$5:K34))))","v":""},{"$f":"IF(ROWS(L$5:L34)>$G$2,\"\",INDEX(B$2:B$102,SMALL(IF($B$2:$B$102=$F$2,IF(YEAR($A$2:$A$102)=$E$2,ROW($B$2:$B$102)-ROW($B$2)+1)),ROWS(L$5:L34))))","v":""},{"$f":"IF(ROWS(M$5:M34)>$G$2,\"\",INDEX(C$2:C$102,SMALL(IF($B$2:$B$102=$F$2,IF(YEAR($A$2:$A$102)=$E$2,ROW($B$2:$B$102)-ROW($B$2)+1)),ROWS(M$5:M34))))","v":""}]
["2009-12-07","Sioux",147.53,null,null,null,null,null,null,null,{"$f":"IF(ROWS(K$5:K35)>$G$2,\"\",INDEX(A$2:A$102,SMALL(IF($B$2:$B$102=$F$2,IF(YEAR($A$2:$A$102)=$E$2,ROW($B$2:$B$102)-ROW($B$2)+1)),ROWS(K$5:K35))))","v":""},{"$f":"IF(ROWS(L$5:L35)>$G$2,\"\",INDEX(B$2:B$102,SMALL(IF($B$2:$B$102=$F$2,IF(YEAR($A$2:$A$102)=$E$2,ROW($B$2:$B$102)-ROW($B$2)+1)),ROWS(L$5:L35))))","v":""},{"$f":"IF(ROWS(M$5:M35)>$G$2,\"\",INDEX(C$2:C$102,SMALL(IF($B$2:$B$102=$F$2,IF(YEAR($A$2:$A$102)=$E$2,ROW($B$2:$B$102)-ROW($B$2)+1)),ROWS(M$5:M35))))","v":""}]
["2009-12-12","Chin",102.17,null,null,null,null,null,null,null,{"$f":"IF(ROWS(K$5:K36)>$G$2,\"\",INDEX(A$2:A$102,SMALL(IF($B$2:$B$102=$F$2,IF(YEAR($A$2:$A$102)=$E$2,ROW($B$2:$B$102)-ROW($B$2)+1)),ROWS(K$5:K36))))","v":""},{"$f":"IF(ROWS(L$5:L36)>$G$2,\"\",INDEX(B$2:B$102,SMALL(IF($B$2:$B$102=$F$2,IF(YEAR($A$2:$A$102)=$E$2,ROW($B$2:$B$102)-ROW($B$2)+1)),ROWS(L$5:L36))))","v":""},{"$f":"IF(ROWS(M$5:M36)>$G$2,\"\",INDEX(C$2:C$102,SMALL(IF($B$2:$B$102=$F$2,IF(YEAR($A$2:$A$102)=$E$2,ROW($B$2:$B$102)-ROW($B$2)+1)),ROWS(M$5:M36))))","v":""}]
["2009-12-30","Smith",114.4,null,null,null,null,null,null,null,{"$f":"IF(ROWS(K$5:K37)>$G$2,\"\",INDEX(A$2:A$102,SMALL(IF($B$2:$B$102=$F$2,IF(YEAR($A$2:$A$102)=$E$2,ROW($B$2:$B$102)-ROW($B$2)+1)),ROWS(K$5:K37))))","v":""},{"$f":"IF(ROWS(L$5:L37)>$G$2,\"\",INDEX(B$2:B$102,SMALL(IF($B$2:$B$102=$F$2,IF(YEAR($A$2:$A$102)=$E$2,ROW($B$2:$B$102)-ROW($B$2)+1)),ROWS(L$5:L37))))","v":""},{"$f":"IF(ROWS(M$5:M37)>$G$2,\"\",INDEX(C$2:C$102,SMALL(IF($B$2:$B$102=$F$2,IF(YEAR($A$2:$A$102)=$E$2,ROW($B$2:$B$102)-ROW($B$2)+1)),ROWS(M$5:M37))))","v":""}]
["2009-12-27","Chin",129.65,null,null,null,null,null,null,null,{"$f":"IF(ROWS(K$5:K38)>$G$2,\"\",INDEX(A$2:A$102,SMALL(IF($B$2:$B$102=$F$2,IF(YEAR($A$2:$A$102)=$E$2,ROW($B$2:$B$102)-ROW($B$2)+1)),ROWS(K$5:K38))))","v":""},{"$f":"IF(ROWS(L$5:L38)>$G$2,\"\",INDEX(B$2:B$102,SMALL(IF($B$2:$B$102=$F$2,IF(YEAR($A$2:$A$102)=$E$2,ROW($B$2:$B$102)-ROW($B$2)+1)),ROWS(L$5:L38))))","v":""},{"$f":"IF(ROWS(M$5:M38)>$G$2,\"\",INDEX(C$2:C$102,SMALL(IF($B$2:$B$102=$F$2,IF(YEAR($A$2:$A$102)=$E$2,ROW($B$2:$B$102)-ROW($B$2)+1)),ROWS(M$5:M38))))","v":""}]
["2009-12-29","Chin",128.94999999999999,null,null,null,null,null,null,null,{"$f":"IF(ROWS(K$5:K39)>$G$2,\"\",INDEX(A$2:A$102,SMALL(IF($B$2:$B$102=$F$2,IF(YEAR($A$2:$A$102)=$E$2,ROW($B$2:$B$102)-ROW($B$2)+1)),ROWS(K$5:K39))))","v":""},{"$f":"IF(ROWS(L$5:L39)>$G$2,\"\",INDEX(B$2:B$102,SMALL(IF($B$2:$B$102=$F$2,IF(YEAR($A$2:$A$102)=$E$2,ROW($B$2:$B$102)-ROW($B$2)+1)),ROWS(L$5:L39))))","v":""},{"$f":"IF(ROWS(M$5:M39)>$G$2,\"\",INDEX(C$2:C$102,SMALL(IF($B$2:$B$102=$F$2,IF(YEAR($A$2:$A$102)=$E$2,ROW($B$2:$B$102)-ROW($B$2)+1)),ROWS(M$5:M39))))","v":""}]
["2010-01-05","Gault",121.33,null,null,null,null,null,null,null,{"$f":"IF(ROWS(K$5:K40)>$G$2,\"\",INDEX(A$2:A$102,SMALL(IF($B$2:$B$102=$F$2,IF(YEAR($A$2:$A$102)=$E$2,ROW($B$2:$B$102)-ROW($B$2)+1)),ROWS(K$5:K40))))","v":""},{"$f":"IF(ROWS(L$5:L40)>$G$2,\"\",INDEX(B$2:B$102,SMALL(IF($B$2:$B$102=$F$2,IF(YEAR($A$2:$A$102)=$E$2,ROW($B$2:$B$102)-ROW($B$2)+1)),ROWS(L$5:L40))))","v":""},{"$f":"IF(ROWS(M$5:M40)>$G$2,\"\",INDEX(C$2:C$102,SMALL(IF($B$2:$B$102=$F$2,IF(YEAR($A$2:$A$102)=$E$2,ROW($B$2:$B$102)-ROW($B$2)+1)),ROWS(M$5:M40))))","v":""}]
["2009-12-15","Pham",102.64,null,null,null,null,null,null,null,{"$f":"IF(ROWS(K$5:K41)>$G$2,\"\",INDEX(A$2:A$102,SMALL(IF($B$2:$B$102=$F$2,IF(YEAR($A$2:$A$102)=$E$2,ROW($B$2:$B$102)-ROW($B$2)+1)),ROWS(K$5:K41))))","v":""},{"$f":"IF(ROWS(L$5:L41)>$G$2,\"\",INDEX(B$2:B$102,SMALL(IF($B$2:$B$102=$F$2,IF(YEAR($A$2:$A$102)=$E$2,ROW($B$2:$B$102)-ROW($B$2)+1)),ROWS(L$5:L41))))","v":""},{"$f":"IF(ROWS(M$5:M41)>$G$2,\"\",INDEX(C$2:C$102,SMALL(IF($B$2:$B$102=$F$2,IF(YEAR($A$2:$A$102)=$E$2,ROW($B$2:$B$102)-ROW($B$2)+1)),ROWS(M$5:M41))))","v":""}]
["2009-12-01","Pham",132.12,null,null,null,null,null,null,null,{"$f":"IF(ROWS(K$5:K42)>$G$2,\"\",INDEX(A$2:A$102,SMALL(IF($B$2:$B$102=$F$2,IF(YEAR($A$2:$A$102)=$E$2,ROW($B$2:$B$102)-ROW($B$2)+1)),ROWS(K$5:K42))))","v":""},{"$f":"IF(ROWS(L$5:L42)>$G$2,\"\",INDEX(B$2:B$102,SMALL(IF($B$2:$B$102=$F$2,IF(YEAR($A$2:$A$102)=$E$2,ROW($B$2:$B$102)-ROW($B$2)+1)),ROWS(L$5:L42))))","v":""},{"$f":"IF(ROWS(M$5:M42)>$G$2,\"\",INDEX(C$2:C$102,SMALL(IF($B$2:$B$102=$F$2,IF(YEAR($A$2:$A$102)=$E$2,ROW($B$2:$B$102)-ROW($B$2)+1)),ROWS(M$5:M42))))","v":""}]
["2010-02-07","Franks",100.83,null,null,null,null,null,null,null,{"$f":"IF(ROWS(K$5:K43)>$G$2,\"\",INDEX(A$2:A$102,SMALL(IF($B$2:$B$102=$F$2,IF(YEAR($A$2:$A$102)=$E$2,ROW($B$2:$B$102)-ROW($B$2)+1)),ROWS(K$5:K43))))","v":""},{"$f":"IF(ROWS(L$5:L43)>$G$2,\"\",INDEX(B$2:B$102,SMALL(IF($B$2:$B$102=$F$2,IF(YEAR($A$2:$A$102)=$E$2,ROW($B$2:$B$102)-ROW($B$2)+1)),ROWS(L$5:L43))))","v":""},{"$f":"IF(ROWS(M$5:M43)>$G$2,\"\",INDEX(C$2:C$102,SMALL(IF($B$2:$B$102=$F$2,IF(YEAR($A$2:$A$102)=$E$2,ROW($B$2:$B$102)-ROW($B$2)+1)),ROWS(M$5:M43))))","v":""}]
["2009-11-26","Sioux",79.42,null,null,null,null,null,null,null,{"$f":"IF(ROWS(K$5:K44)>$G$2,\"\",INDEX(A$2:A$102,SMALL(IF($B$2:$B$102=$F$2,IF(YEAR($A$2:$A$102)=$E$2,ROW($B$2:$B$102)-ROW($B$2)+1)),ROWS(K$5:K44))))","v":""},{"$f":"IF(ROWS(L$5:L44)>$G$2,\"\",INDEX(B$2:B$102,SMALL(IF($B$2:$B$102=$F$2,IF(YEAR($A$2:$A$102)=$E$2,ROW($B$2:$B$102)-ROW($B$2)+1)),ROWS(L$5:L44))))","v":""},{"$f":"IF(ROWS(M$5:M44)>$G$2,\"\",INDEX(C$2:C$102,SMALL(IF($B$2:$B$102=$F$2,IF(YEAR($A$2:$A$102)=$E$2,ROW($B$2:$B$102)-ROW($B$2)+1)),ROWS(M$5:M44))))","v":""}]
["2010-01-04","Pham",100.09,null,null,null,null,null,null,null,{"$f":"IF(ROWS(K$5:K45)>$G$2,\"\",INDEX(A$2:A$102,SMALL(IF($B$2:$B$102=$F$2,IF(YEAR($A$2:$A$102)=$E$2,ROW($B$2:$B$102)-ROW($B$2)+1)),ROWS(K$5:K45))))","v":""},{"$f":"IF(ROWS(L$5:L45)>$G$2,\"\",INDEX(B$2:B$102,SMALL(IF($B$2:$B$102=$F$2,IF(YEAR($A$2:$A$102)=$E$2,ROW($B$2:$B$102)-ROW($B$2)+1)),ROWS(L$5:L45))))","v":""},{"$f":"IF(ROWS(M$5:M45)>$G$2,\"\",INDEX(C$2:C$102,SMALL(IF($B$2:$B$102=$F$2,IF(YEAR($A$2:$A$102)=$E$2,ROW($B$2:$B$102)-ROW($B$2)+1)),ROWS(M$5:M45))))","v":""}]
["2010-01-29","Franks",83.37,null,null,null,null,null,null,null,{"$f":"IF(ROWS(K$5:K46)>$G$2,\"\",INDEX(A$2:A$102,SMALL(IF($B$2:$B$102=$F$2,IF(YEAR($A$2:$A$102)=$E$2,ROW($B$2:$B$102)-ROW($B$2)+1)),ROWS(K$5:K46))))","v":""},{"$f":"IF(ROWS(L$5:L46)>$G$2,\"\",INDEX(B$2:B$102,SMALL(IF($B$2:$B$102=$F$2,IF(YEAR($A$2:$A$102)=$E$2,ROW($B$2:$B$102)-ROW($B$2)+1)),ROWS(L$5:L46))))","v":""},{"$f":"IF(ROWS(M$5:M46)>$G$2,\"\",INDEX(C$2:C$102,SMALL(IF($B$2:$B$102=$F$2,IF(YEAR($A$2:$A$102)=$E$2,ROW($B$2:$B$102)-ROW($B$2)+1)),ROWS(M$5:M46))))","v":""}]
["2010-01-19","Franks",89.11,null,null,null,null,null,null,null,{"$f":"IF(ROWS(K$5:K47)>$G$2,\"\",INDEX(A$2:A$102,SMALL(IF($B$2:$B$102=$F$2,IF(YEAR($A$2:$A$102)=$E$2,ROW($B$2:$B$102)-ROW($B$2)+1)),ROWS(K$5:K47))))","v":""},{"$f":"IF(ROWS(L$5:L47)>$G$2,\"\",INDEX(B$2:B$102,SMALL(IF($B$2:$B$102=$F$2,IF(YEAR($A$2:$A$102)=$E$2,ROW($B$2:$B$102)-ROW($B$2)+1)),ROWS(L$5:L47))))","v":""},{"$f":"IF(ROWS(M$5:M47)>$G$2,\"\",INDEX(C$2:C$102,SMALL(IF($B$2:$B$102=$F$2,IF(YEAR($A$2:$A$102)=$E$2,ROW($B$2:$B$102)-ROW($B$2)+1)),ROWS(M$5:M47))))","v":""}]
["2010-02-14","Smith",126.97,null,null,null,null,null,null,null,{"$f":"IF(ROWS(K$5:K48)>$G$2,\"\",INDEX(A$2:A$102,SMALL(IF($B$2:$B$102=$F$2,IF(YEAR($A$2:$A$102)=$E$2,ROW($B$2:$B$102)-ROW($B$2)+1)),ROWS(K$5:K48))))","v":""},{"$f":"IF(ROWS(L$5:L48)>$G$2,\"\",INDEX(B$2:B$102,SMALL(IF($B$2:$B$102=$F$2,IF(YEAR($A$2:$A$102)=$E$2,ROW($B$2:$B$102)-ROW($B$2)+1)),ROWS(L$5:L48))))","v":""},{"$f":"IF(ROWS(M$5:M48)>$G$2,\"\",INDEX(C$2:C$102,SMALL(IF($B$2:$B$102=$F$2,IF(YEAR($A$2:$A$102)=$E$2,ROW($B$2:$B$102)-ROW($B$2)+1)),ROWS(M$5:M48))))","v":""}]
["2009-12-03","Smith",154.31,null,null,null,null,null,null,null,{"$f":"IF(ROWS(K$5:K49)>$G$2,\"\",INDEX(A$2:A$102,SMALL(IF($B$2:$B$102=$F$2,IF(YEAR($A$2:$A$102)=$E$2,ROW($B$2:$B$102)-ROW($B$2)+1)),ROWS(K$5:K49))))","v":""},{"$f":"IF(ROWS(L$5:L49)>$G$2,\"\",INDEX(B$2:B$102,SMALL(IF($B$2:$B$102=$F$2,IF(YEAR($A$2:$A$102)=$E$2,ROW($B$2:$B$102)-ROW($B$2)+1)),ROWS(L$5:L49))))","v":""},{"$f":"IF(ROWS(M$5:M49)>$G$2,\"\",INDEX(C$2:C$102,SMALL(IF($B$2:$B$102=$F$2,IF(YEAR($A$2:$A$102)=$E$2,ROW($B$2:$B$102)-ROW($B$2)+1)),ROWS(M$5:M49))))","v":""}]
["2010-01-02","Sioux",76.59,null,null,null,null,null,null,null,{"$f":"IF(ROWS(K$5:K50)>$G$2,\"\",INDEX(A$2:A$102,SMALL(IF($B$2:$B$102=$F$2,IF(YEAR($A$2:$A$102)=$E$2,ROW($B$2:$B$102)-ROW($B$2)+1)),ROWS(K$5:K50))))","v":""},{"$f":"IF(ROWS(L$5:L50)>$G$2,\"\",INDEX(B$2:B$102,SMALL(IF($B$2:$B$102=$F$2,IF(YEAR($A$2:$A$102)=$E$2,ROW($B$2:$B$102)-ROW($B$2)+1)),ROWS(L$5:L50))))","v":""},{"$f":"IF(ROWS(M$5:M50)>$G$2,\"\",INDEX(C$2:C$102,SMALL(IF($B$2:$B$102=$F$2,IF(YEAR($A$2:$A$102)=$E$2,ROW($B$2:$B$102)-ROW($B$2)+1)),ROWS(M$5:M50))))","v":""}]
["2009-12-29","Gault",106.94,null,null,null,null,null,null,null,{"$f":"IF(ROWS(K$5:K51)>$G$2,\"\",INDEX(A$2:A$102,SMALL(IF($B$2:$B$102=$F$2,IF(YEAR($A$2:$A$102)=$E$2,ROW($B$2:$B$102)-ROW($B$2)+1)),ROWS(K$5:K51))))","v":""},{"$f":"IF(ROWS(L$5:L51)>$G$2,\"\",INDEX(B$2:B$102,SMALL(IF($B$2:$B$102=$F$2,IF(YEAR($A$2:$A$102)=$E$2,ROW($B$2:$B$102)-ROW($B$2)+1)),ROWS(L$5:L51))))","v":""},{"$f":"IF(ROWS(M$5:M51)>$G$2,\"\",INDEX(C$2:C$102,SMALL(IF($B$2:$B$102=$F$2,IF(YEAR($A$2:$A$102)=$E$2,ROW($B$2:$B$102)-ROW($B$2)+1)),ROWS(M$5:M51))))","v":""}]
["2009-11-26","Chin",129.86000000000001,null,null,null,null,null,null,null,{"$f":"IF(ROWS(K$5:K52)>$G$2,\"\",INDEX(A$2:A$102,SMALL(IF($B$2:$B$102=$F$2,IF(YEAR($A$2:$A$102)=$E$2,ROW($B$2:$B$102)-ROW($B$2)+1)),ROWS(K$5:K52))))","v":""},{"$f":"IF(ROWS(L$5:L52)>$G$2,\"\",INDEX(B$2:B$102,SMALL(IF($B$2:$B$102=$F$2,IF(YEAR($A$2:$A$102)=$E$2,ROW($B$2:$B$102)-ROW($B$2)+1)),ROWS(L$5:L52))))","v":""},{"$f":"IF(ROWS(M$5:M52)>$G$2,\"\",INDEX(C$2:C$102,SMALL(IF($B$2:$B$102=$F$2,IF(YEAR($A$2:$A$102)=$E$2,ROW($B$2:$B$102)-ROW($B$2)+1)),ROWS(M$5:M52))))","v":""}]
["2009-12-24","Pham",100.76,null,null,null,null,null,null,null,{"$f":"IF(ROWS(K$5:K53)>$G$2,\"\",INDEX(A$2:A$102,SMALL(IF($B$2:$B$102=$F$2,IF(YEAR($A$2:$A$102)=$E$2,ROW($B$2:$B$102)-ROW($B$2)+1)),ROWS(K$5:K53))))","v":""},{"$f":"IF(ROWS(L$5:L53)>$G$2,\"\",INDEX(B$2:B$102,SMALL(IF($B$2:$B$102=$F$2,IF(YEAR($A$2:$A$102)=$E$2,ROW($B$2:$B$102)-ROW($B$2)+1)),ROWS(L$5:L53))))","v":""},{"$f":"IF(ROWS(M$5:M53)>$G$2,\"\",INDEX(C$2:C$102,SMALL(IF($B$2:$B$102=$F$2,IF(YEAR($A$2:$A$102)=$E$2,ROW($B$2:$B$102)-ROW($B$2)+1)),ROWS(M$5:M53))))","v":""}]
["2009-12-10","Gault",124.59,null,null,null,null,null,null,null,{"$f":"IF(ROWS(K$5:K54)>$G$2,\"\",INDEX(A$2:A$102,SMALL(IF($B$2:$B$102=$F$2,IF(YEAR($A$2:$A$102)=$E$2,ROW($B$2:$B$102)-ROW($B$2)+1)),ROWS(K$5:K54))))","v":""},{"$f":"IF(ROWS(L$5:L54)>$G$2,\"\",INDEX(B$2:B$102,SMALL(IF($B$2:$B$102=$F$2,IF(YEAR($A$2:$A$102)=$E$2,ROW($B$2:$B$102)-ROW($B$2)+1)),ROWS(L$5:L54))))","v":""},{"$f":"IF(ROWS(M$5:M54)>$G$2,\"\",INDEX(C$2:C$102,SMALL(IF($B$2:$B$102=$F$2,IF(YEAR($A$2:$A$102)=$E$2,ROW($B$2:$B$102)-ROW($B$2)+1)),ROWS(M$5:M54))))","v":""}]
["2009-12-31","Smith",150.31,null,null,null,null,null,null,null,{"$f":"IF(ROWS(K$5:K55)>$G$2,\"\",INDEX(A$2:A$102,SMALL(IF($B$2:$B$102=$F$2,IF(YEAR($A$2:$A$102)=$E$2,ROW($B$2:$B$102)-ROW($B$2)+1)),ROWS(K$5:K55))))","v":""},{"$f":"IF(ROWS(L$5:L55)>$G$2,\"\",INDEX(B$2:B$102,SMALL(IF($B$2:$B$102=$F$2,IF(YEAR($A$2:$A$102)=$E$2,ROW($B$2:$B$102)-ROW($B$2)+1)),ROWS(L$5:L55))))","v":""},{"$f":"IF(ROWS(M$5:M55)>$G$2,\"\",INDEX(C$2:C$102,SMALL(IF($B$2:$B$102=$F$2,IF(YEAR($A$2:$A$102)=$E$2,ROW($B$2:$B$102)-ROW($B$2)+1)),ROWS(M$5:M55))))","v":""}]
["2009-12-16","Franks",119.78,null,null,null,null,null,null,null,{"$f":"IF(ROWS(K$5:K56)>$G$2,\"\",INDEX(A$2:A$102,SMALL(IF($B$2:$B$102=$F$2,IF(YEAR($A$2:$A$102)=$E$2,ROW($B$2:$B$102)-ROW($B$2)+1)),ROWS(K$5:K56))))","v":""},{"$f":"IF(ROWS(L$5:L56)>$G$2,\"\",INDEX(B$2:B$102,SMALL(IF($B$2:$B$102=$F$2,IF(YEAR($A$2:$A$102)=$E$2,ROW($B$2:$B$102)-ROW($B$2)+1)),ROWS(L$5:L56))))","v":""},{"$f":"IF(ROWS(M$5:M56)>$G$2,\"\",INDEX(C$2:C$102,SMALL(IF($B$2:$B$102=$F$2,IF(YEAR($A$2:$A$102)=$E$2,ROW($B$2:$B$102)-ROW($B$2)+1)),ROWS(M$5:M56))))","v":""}]
["2010-01-03","Pham",93.37,null,null,null,null,null,null,null,{"$f":"IF(ROWS(K$5:K57)>$G$2,\"\",INDEX(A$2:A$102,SMALL(IF($B$2:$B$102=$F$2,IF(YEAR($A$2:$A$102)=$E$2,ROW($B$2:$B$102)-ROW($B$2)+1)),ROWS(K$5:K57))))","v":""},{"$f":"IF(ROWS(L$5:L57)>$G$2,\"\",INDEX(B$2:B$102,SMALL(IF($B$2:$B$102=$F$2,IF(YEAR($A$2:$A$102)=$E$2,ROW($B$2:$B$102)-ROW($B$2)+1)),ROWS(L$5:L57))))","v":""},{"$f":"IF(ROWS(M$5:M57)>$G$2,\"\",INDEX(C$2:C$102,SMALL(IF($B$2:$B$102=$F$2,IF(YEAR($A$2:$A$102)=$E$2,ROW($B$2:$B$102)-ROW($B$2)+1)),ROWS(M$5:M57))))","v":""}]
["2009-12-26","Chin",87.06,null,null,null,null,null,null,null,{"$f":"IF(ROWS(K$5:K58)>$G$2,\"\",INDEX(A$2:A$102,SMALL(IF($B$2:$B$102=$F$2,IF(YEAR($A$2:$A$102)=$E$2,ROW($B$2:$B$102)-ROW($B$2)+1)),ROWS(K$5:K58))))","v":""},{"$f":"IF(ROWS(L$5:L58)>$G$2,\"\",INDEX(B$2:B$102,SMALL(IF($B$2:$B$102=$F$2,IF(YEAR($A$2:$A$102)=$E$2,ROW($B$2:$B$102)-ROW($B$2)+1)),ROWS(L$5:L58))))","v":""},{"$f":"IF(ROWS(M$5:M58)>$G$2,\"\",INDEX(C$2:C$102,SMALL(IF($B$2:$B$102=$F$2,IF(YEAR($A$2:$A$102)=$E$2,ROW($B$2:$B$102)-ROW($B$2)+1)),ROWS(M$5:M58))))","v":""}]
["2010-01-05","Smith",147.49,null,null,null,null,null,null,null,{"$f":"IF(ROWS(K$5:K59)>$G$2,\"\",INDEX(A$2:A$102,SMALL(IF($B$2:$B$102=$F$2,IF(YEAR($A$2:$A$102)=$E$2,ROW($B$2:$B$102)-ROW($B$2)+1)),ROWS(K$5:K59))))","v":""},{"$f":"IF(ROWS(L$5:L59)>$G$2,\"\",INDEX(B$2:B$102,SMALL(IF($B$2:$B$102=$F$2,IF(YEAR($A$2:$A$102)=$E$2,ROW($B$2:$B$102)-ROW($B$2)+1)),ROWS(L$5:L59))))","v":""},{"$f":"IF(ROWS(M$5:M59)>$G$2,\"\",INDEX(C$2:C$102,SMALL(IF($B$2:$B$102=$F$2,IF(YEAR($A$2:$A$102)=$E$2,ROW($B$2:$B$102)-ROW($B$2)+1)),ROWS(M$5:M59))))","v":""}]
["2009-12-19","Smith",136.94,null,null,null,null,null,null,null,{"$f":"IF(ROWS(K$5:K60)>$G$2,\"\",INDEX(A$2:A$102,SMALL(IF($B$2:$B$102=$F$2,IF(YEAR($A$2:$A$102)=$E$2,ROW($B$2:$B$102)-ROW($B$2)+1)),ROWS(K$5:K60))))","v":""},{"$f":"IF(ROWS(L$5:L60)>$G$2,\"\",INDEX(B$2:B$102,SMALL(IF($B$2:$B$102=$F$2,IF(YEAR($A$2:$A$102)=$E$2,ROW($B$2:$B$102)-ROW($B$2)+1)),ROWS(L$5:L60))))","v":""},{"$f":"IF(ROWS(M$5:M60)>$G$2,\"\",INDEX(C$2:C$102,SMALL(IF($B$2:$B$102=$F$2,IF(YEAR($A$2:$A$102)=$E$2,ROW($B$2:$B$102)-ROW($B$2)+1)),ROWS(M$5:M60))))","v":""}]
["2009-11-20","Gault",93.33,null,null,null,null,null,null,null,{"$f":"IF(ROWS(K$5:K61)>$G$2,\"\",INDEX(A$2:A$102,SMALL(IF($B$2:$B$102=$F$2,IF(YEAR($A$2:$A$102)=$E$2,ROW($B$2:$B$102)-ROW($B$2)+1)),ROWS(K$5:K61))))","v":""},{"$f":"IF(ROWS(L$5:L61)>$G$2,\"\",INDEX(B$2:B$102,SMALL(IF($B$2:$B$102=$F$2,IF(YEAR($A$2:$A$102)=$E$2,ROW($B$2:$B$102)-ROW($B$2)+1)),ROWS(L$5:L61))))","v":""},{"$f":"IF(ROWS(M$5:M61)>$G$2,\"\",INDEX(C$2:C$102,SMALL(IF($B$2:$B$102=$F$2,IF(YEAR($A$2:$A$102)=$E$2,ROW($B$2:$B$102)-ROW($B$2)+1)),ROWS(M$5:M61))))","v":""}]
["2010-01-03","Smith",128.97,null,null,null,null,null,null,null,{"$f":"IF(ROWS(K$5:K62)>$G$2,\"\",INDEX(A$2:A$102,SMALL(IF($B$2:$B$102=$F$2,IF(YEAR($A$2:$A$102)=$E$2,ROW($B$2:$B$102)-ROW($B$2)+1)),ROWS(K$5:K62))))","v":""},{"$f":"IF(ROWS(L$5:L62)>$G$2,\"\",INDEX(B$2:B$102,SMALL(IF($B$2:$B$102=$F$2,IF(YEAR($A$2:$A$102)=$E$2,ROW($B$2:$B$102)-ROW($B$2)+1)),ROWS(L$5:L62))))","v":""},{"$f":"IF(ROWS(M$5:M62)>$G$2,\"\",INDEX(C$2:C$102,SMALL(IF($B$2:$B$102=$F$2,IF(YEAR($A$2:$A$102)=$E$2,ROW($B$2:$B$102)-ROW($B$2)+1)),ROWS(M$5:M62))))","v":""}]
["2009-12-14","Smith",114.93,null,null,null,null,null,null,null,{"$f":"IF(ROWS(K$5:K63)>$G$2,\"\",INDEX(A$2:A$102,SMALL(IF($B$2:$B$102=$F$2,IF(YEAR($A$2:$A$102)=$E$2,ROW($B$2:$B$102)-ROW($B$2)+1)),ROWS(K$5:K63))))","v":""},{"$f":"IF(ROWS(L$5:L63)>$G$2,\"\",INDEX(B$2:B$102,SMALL(IF($B$2:$B$102=$F$2,IF(YEAR($A$2:$A$102)=$E$2,ROW($B$2:$B$102)-ROW($B$2)+1)),ROWS(L$5:L63))))","v":""},{"$f":"IF(ROWS(M$5:M63)>$G$2,\"\",INDEX(C$2:C$102,SMALL(IF($B$2:$B$102=$F$2,IF(YEAR($A$2:$A$102)=$E$2,ROW($B$2:$B$102)-ROW($B$2)+1)),ROWS(M$5:M63))))","v":""}]
["2010-01-01","Sioux",104.57,null,null,null,null,null,null,null,{"$f":"IF(ROWS(K$5:K64)>$G$2,\"\",INDEX(A$2:A$102,SMALL(IF($B$2:$B$102=$F$2,IF(YEAR($A$2:$A$102)=$E$2,ROW($B$2:$B$102)-ROW($B$2)+1)),ROWS(K$5:K64))))","v":""},{"$f":"IF(ROWS(L$5:L64)>$G$2,\"\",INDEX(B$2:B$102,SMALL(IF($B$2:$B$102=$F$2,IF(YEAR($A$2:$A$102)=$E$2,ROW($B$2:$B$102)-ROW($B$2)+1)),ROWS(L$5:L64))))","v":""},{"$f":"IF(ROWS(M$5:M64)>$G$2,\"\",INDEX(C$2:C$102,SMALL(IF($B$2:$B$102=$F$2,IF(YEAR($A$2:$A$102)=$E$2,ROW($B$2:$B$102)-ROW($B$2)+1)),ROWS(M$5:M64))))","v":""}]
["2009-11-27","Sioux",119.53,null,null,null,null,null,null,null,{"$f":"IF(ROWS(K$5:K65)>$G$2,\"\",INDEX(A$2:A$102,SMALL(IF($B$2:$B$102=$F$2,IF(YEAR($A$2:$A$102)=$E$2,ROW($B$2:$B$102)-ROW($B$2)+1)),ROWS(K$5:K65))))","v":""},{"$f":"IF(ROWS(L$5:L65)>$G$2,\"\",INDEX(B$2:B$102,SMALL(IF($B$2:$B$102=$F$2,IF(YEAR($A$2:$A$102)=$E$2,ROW($B$2:$B$102)-ROW($B$2)+1)),ROWS(L$5:L65))))","v":""},{"$f":"IF(ROWS(M$5:M65)>$G$2,\"\",INDEX(C$2:C$102,SMALL(IF($B$2:$B$102=$F$2,IF(YEAR($A$2:$A$102)=$E$2,ROW($B$2:$B$102)-ROW($B$2)+1)),ROWS(M$5:M65))))","v":""}]
["2010-01-01","Pham",127.99,null,null,null,null,null,null,null,{"$f":"IF(ROWS(K$5:K66)>$G$2,\"\",INDEX(A$2:A$102,SMALL(IF($B$2:$B$102=$F$2,IF(YEAR($A$2:$A$102)=$E$2,ROW($B$2:$B$102)-ROW($B$2)+1)),ROWS(K$5:K66))))","v":""},{"$f":"IF(ROWS(L$5:L66)>$G$2,\"\",INDEX(B$2:B$102,SMALL(IF($B$2:$B$102=$F$2,IF(YEAR($A$2:$A$102)=$E$2,ROW($B$2:$B$102)-ROW($B$2)+1)),ROWS(L$5:L66))))","v":""},{"$f":"IF(ROWS(M$5:M66)>$G$2,\"\",INDEX(C$2:C$102,SMALL(IF($B$2:$B$102=$F$2,IF(YEAR($A$2:$A$102)=$E$2,ROW($B$2:$B$102)-ROW($B$2)+1)),ROWS(M$5:M66))))","v":""}]
["2009-12-03","Smith",88.69]
["2009-11-25","Smith",115.67]
["2010-01-07","Pham",114.54]
["2010-02-02","Smith",128.15]
["2010-02-08","Gault",126.33]
["2010-01-13","Smith",112.03]
["2009-11-20","Smith",145.33000000000001]
["2009-12-23","Gault",109.7]
["2009-11-26","Sioux",139.13]
["2009-12-01","Sioux",112.5]
["2009-11-29","Pham",122.21]
["2010-01-13","Smith",135.77000000000001]
["2010-01-09","Pham",75.17]
["2010-01-30","Sioux",104.5]
["2010-02-04","Gault",86.1]
["2010-01-02","Sioux",143.85]
["2010-01-16","Gault",104.36]
["2009-12-28","Smith",135.02000000000001]
["2009-12-26","Pham",83.26]
["2009-11-28","Sioux",114.53]
["2010-02-02","Smith",117.63]
["2009-12-27","Gault",102.24]
["2010-02-01","Chin",139.21]
["2009-12-25","Smith",119.09]
["2010-01-17","Pham",134.11000000000001]
["2010-01-15","Sioux",96.17]
["2010-01-10","Smith",108.54]
["2010-01-05","Gault",78.89]
["2010-01-20","Pham",130.37]
["2009-12-08","Chin",130.5]
["2010-01-16","Franks",123.13]
["2009-12-19","Gault",131.04]
["2009-12-17","Pham",76.260000000000005]
["2010-01-19","Pham",78.459999999999994]
["2009-11-21","Gault",79.11]
["2010-02-18","Gault",75.349999999999994]

{"sheet":"671an","index":25,"n_rows":102,"n_cols":13,"rows_kept":102,"cut":false,"hidden":false,"merged":[]}
["Date","SalesRep","Sales ",null,"Year","SalesRep","Count",null,"SalesRep"]
["2009-12-25","Gault",94.69,null,2010,"Smith",{"$f":"SUMPRODUCT(--(YEAR($A$2:$A$102)=E2),--($B$2:$B$102=F2))","v":10},null,"Gault"]
["2009-12-15","Smith",130.19999999999999,null,null,null,null,null,"Smith"]
["2009-12-11","Franks",149.94999999999999,null,"Date","SalesRep","Sales ",null,"Franks",null,"Date","SalesRep","Sales "]
["2009-12-01","Gault",94.11,null,{"$f":"IF(ROWS(E$5:E5)>$G$2,\"\",INDEX(A$2:A$102,_xlfn.AGGREGATE(15,6,(ROW($A$2:$A$102)-ROW($A$2)+1)/(($B$2:$B$102=$F$2)*(YEAR($A$2:$A$102)=$E$2)),ROWS(E$5:E5))))","v":"2010-01-23"},{"$f":"IF(ROWS(F$5:F5)>$G$2,\"\",INDEX(B$2:B$102,_xlfn.AGGREGATE(15,6,(ROW($A$2:$A$102)-ROW($A$2)+1)/(($B$2:$B$102=$F$2)*(YEAR($A$2:$A$102)=$E$2)),ROWS(F$5:F5))))","v":"Smith"},{"$f":"IF(ROWS(G$5:G5)>$G$2,\"\",INDEX(C$2:C$102,_xlfn.AGGREGATE(15,6,(ROW($A$2:$A$102)-ROW($A$2)+1)/(($B$2:$B$102=$F$2)*(YEAR($A$2:$A$102)=$E$2)),ROWS(G$5:G5))))","v":113.86},null,"Pham",null,{"$f":"IF(ROWS(K$5:K5)>$G$2,\"\",INDEX(A$2:A$102,SMALL(IF($B$2:$B$102=$F$2,IF(YEAR($A$2:$A$102)=$E$2,ROW($B$2:$B$102)-ROW($B$2)+1)),ROWS(K$5:K5))))","v":"2010-01-23"},{"$f":"IF(ROWS(L$5:L5)>$G$2,\"\",INDEX(B$2:B$102,SMALL(IF($B$2:$B$102=$F$2,IF(YEAR($A$2:$A$102)=$E$2,ROW($B$2:$B$102)-ROW($B$2)+1)),ROWS(L$5:L5))))","v":"Smith"},{"$f":"IF(ROWS(M$5:M5)>$G$2,\"\",INDEX(C$2:C$102,SMALL(IF($B$2:$B$102=$F$2,IF(YEAR($A$2:$A$102)=$E$2,ROW($B$2:$B$102)-ROW($B$2)+1)),ROWS(M$5:M5))))","v":113.86}]
["2009-12-11","Franks",136.13999999999999,null,{"$f":"IF(ROWS(E$5:E6)>$G$2,\"\",INDEX(A$2:A$102,_xlfn.AGGREGATE(15,6,(ROW($A$2:$A$102)-ROW($A$2)+1)/(($B$2:$B$102=$F$2)*(YEAR($A$2:$A$102)=$E$2)),ROWS(E$5:E6))))","v":"2010-02-12"},{"$f":"IF(ROWS(F$5:F6)>$G$2,\"\",INDEX(B$2:B$102,_xlfn.AGGREGATE(15,6,(ROW($A$2:$A$102)-ROW($A$2)+1)/(($B$2:$B$102=$F$2)*(YEAR($A$2:$A$102)=$E$2)),ROWS(F$5:F6))))","v":"Smith"},{"$f":"IF(ROWS(G$5:G6)>$G$2,\"\",INDEX(C$2:C$102,_xlfn.AGGREGATE(15,6,(ROW($A$2:$A$102)-ROW($A$2)+1)/(($B$2:$B$102=$F$2)*(YEAR($A$2:$A$102)=$E$2)),ROWS(G$5:G6))))","v":140.54},null,"Sioux",null,{"$f":"IF(ROWS(K$5:K6)>$G$2,\"\",INDEX(A$2:A$102,SMALL(IF($B$2:$B$102=$F$2,IF(YEAR($A$2:$A$102)=$E$2,ROW($B$2:$B$102)-ROW($B$2)+1)),ROWS(K$5:K6))))","v":"2010-02-12"},{"$f":"IF(ROWS(L$5:L6)>$G$2,\"\",INDEX(B$2:B$102,SMALL(IF($B$2:$B$102=$F$2,IF(YEAR($A$2:$A$102)=$E$2,ROW($B$2:$B$102)-ROW($B$2)+1)),ROWS(L$5:L6))))","v":"Smith"},{"$f":"IF(ROWS(M$5:M6)>$G$2,\"\",INDEX(C$2:C$102,SMALL(IF($B$2:$B$102=$F$2,IF(YEAR($A$2:$A$102)=$E$2,ROW($B$2:$B$102)-ROW($B$2)+1)),ROWS(M$5:M6))))","v":140.54}]
["2010-02-12","Pham",133.16999999999999,null,{"$f":"IF(ROWS(E$5:E7)>$G$2,\"\",INDEX(A$2:A$102,_xlfn.AGGREGATE(15,6,(ROW($A$2:$A$102)-ROW($A$2)+1)/(($B$2:$B$102=$F$2)*(YEAR($A$2:$A$102)=$E$2)),ROWS(E$5:E7))))","v":"2010-02-14"},{"$f":"IF(ROWS(F$5:F7)>$G$2,\"\",INDEX(B$2:B$102,_xlfn.AGGREGATE(15,6,(ROW($A$2:$A$102)-ROW($A$2)+1)/(($B$2:$B$102=$F$2)*(YEAR($A$2:$A$102)=$E$2)),ROWS(F$5:F7))))","v":"Smith"},{"$f":"IF(ROWS(G$5:G7)>$G$2,\"\",INDEX(C$2:C$102,_xlfn.AGGREGATE(15,6,(ROW($A$2:$A$102)-ROW($A$2)+1)/(($B$2:$B$102=$F$2)*(YEAR($A$2:$A$102)=$E$2)),ROWS(G$5:G7))))","v":126.97},null,"Chin",null,{"$f":"IF(ROWS(K$5:K7)>$G$2,\"\",INDEX(A$2:A$102,SMALL(IF($B$2:$B$102=$F$2,IF(YEAR($A$2:$A$102)=$E$2,ROW($B$2:$B$102)-ROW($B$2)+1)),ROWS(K$5:K7))))","v":"2010-02-14"},{"$f":"IF(ROWS(L$5:L7)>$G$2,\"\",INDEX(B$2:B$102,SMALL(IF($B$2:$B$102=$F$2,IF(YEAR($A$2:$A$102)=$E$2,ROW($B$2:$B$102)-ROW($B$2)+1)),ROWS(L$5:L7))))","v":"Smith"},{"$f":"IF(ROWS(M$5:M7)>$G$2,\"\",INDEX(C$2:C$102,SMALL(IF($B$2:$B$102=$F$2,IF(YEAR($A$2:$A$102)=$E$2,ROW($B$2:$B$102)-ROW($B$2)+1)),ROWS(M$5:M7))))","v":126.97}]
["2009-12-07","Smith",80.81,null,{"$f":"IF(ROWS(E$5:E8)>$G$2,\"\",INDEX(A$2:A$102,_xlfn.AGGREGATE(15,6,(ROW($A$2:$A$102)-ROW($A$2)+1)/(($B$2:$B$102=$F$2)*(YEAR($A$2:$A$102)=$E$2)),ROWS(E$5:E8))))","v":"2010-01-05"},{"$f":"IF(ROWS(F$5:F8)>$G$2,\"\",INDEX(B$2:B$102,_xlfn.AGGREGATE(15,6,(ROW($A$2:$A$102)-ROW($A$2)+1)/(($B$2:$B$102=$F$2)*(YEAR($A$2:$A$102)=$E$2)),ROWS(F$5:F8))))","v":"Smith"},{"$f":"IF(ROWS(G$5:G8)>$G$2,\"\",INDEX(C$2:C$102,_xlfn.AGGREGATE(15,6,(ROW($A$2:$A$102)-ROW($A$2)+1)/(($B$2:$B$102=$F$2)*(YEAR($A$2:$A$102)=$E$2)),ROWS(G$5:G8))))","v":147.49},null,null,null,{"$f":"IF(ROWS(K$5:K8)>$G$2,\"\",INDEX(A$2:A$102,SMALL(IF($B$2:$B$102=$F$2,IF(YEAR($A$2:$A$102)=$E$2,ROW($B$2:$B$102)-ROW($B$2)+1)),ROWS(K$5:K8))))","v":"2010-01-05"},{"$f":"IF(ROWS(L$5:L8)>$G$2,\"\",INDEX(B$2:B$102,SMALL(IF($B$2:$B$102=$F$2,IF(YEAR($A$2:$A$102)=$E$2,ROW($B$2:$B$102)-ROW($B$2)+1)),ROWS(L$5:L8))))","v":"Smith"},{"$f":"IF(ROWS(M$5:M8)>$G$2,\"\",INDEX(C$2:C$102,SMALL(IF($B$2:$B$102=$F$2,IF(YEAR($A$2:$A$102)=$E$2,ROW($B$2:$B$102)-ROW($B$2)+1)),ROWS(M$5:M8))))","v":147.49}]
["2009-11-23","Smith",125.38,null,{"$f":"IF(ROWS(E$5:E9)>$G$2,\"\",INDEX(A$2:A$102,_xlfn.AGGREGATE(15,6,(ROW($A$2:$A$102)-ROW($A$2)+1)/(($B$2:$B$102=$F$2)*(YEAR($A$2:$A$102)=$E$2)),ROWS(E$5:E9))))","v":"2010-01-03"},{"$f":"IF(ROWS(F$5:F9)>$G$2,\"\",INDEX(B$2:B$102,_xlfn.AGGREGATE(15,6,(ROW($A$2:$A$102)-ROW($A$2)+1)/(($B$2:$B$102=$F$2)*(YEAR($A$2:$A$102)=$E$2)),ROWS(F$5:F9))))","v":"Smith"},{"$f":"IF(ROWS(G$5:G9)>$G$2,\"\",INDEX(C$2:C$102,_xlfn.AGGREGATE(15,6,(ROW($A$2:$A$102)-ROW($A$2)+1)/(($B$2:$B$102=$F$2)*(YEAR($A$2:$A$102)=$E$2)),ROWS(G$5:G9))))","v":128.97},null,null,null,{"$f":"IF(ROWS(K$5:K9)>$G$2,\"\",INDEX(A$2:A$102,SMALL(IF($B$2:$B$102=$F$2,IF(YEAR($A$2:$A$102)=$E$2,ROW($B$2:$B$102)-ROW($B$2)+1)),ROWS(K$5:K9))))","v":"2010-01-03"},{"$f":"IF(ROWS(L$5:L9)>$G$2,\"\",INDEX(B$2:B$102,SMALL(IF($B$2:$B$102=$F$2,IF(YEAR($A$2:$A$102)=$E$2,ROW($B$2:$B$102)-ROW($B$2)+1)),ROWS(L$5:L9))))","v":"Smith"},{"$f":"IF(ROWS(M$5:M9)>$G$2,\"\",INDEX(C$2:C$102,SMALL(IF($B$2:$B$102=$F$2,IF(YEAR($A$2:$A$102)=$E$2,ROW($B$2:$B$102)-ROW($B$2)+1)),ROWS(M$5:M9))))","v":128.97}]
["2009-11-23","Gault",78.95,null,{"$f":"IF(ROWS(E$5:E10)>$G$2,\"\",INDEX(A$2:A$102,_xlfn.AGGREGATE(15,6,(ROW($A$2:$A$102)-ROW($A$2)+1)/(($B$2:$B$102=$F$2)*(YEAR($A$2:$A$102)=$E$2)),ROWS(E$5:E10))))","v":"2010-02-02"},{"$f":"IF(ROWS(F$5:F10)>$G$2,\"\",INDEX(B$2:B$102,_xlfn.AGGREGATE(15,6,(ROW($A$2:$A$102)-ROW($A$2)+1)/(($B$2:$B$102=$F$2)*(YEAR($A$2:$A$102)=$E$2)),ROWS(F$5:F10))))","v":"Smith"},{"$f":"IF(ROWS(G$5:G10)>$G$2,\"\",INDEX(C$2:C$102,_xlfn.AGGREGATE(15,6,(ROW($A$2:$A$102)-ROW($A$2)+1)/(($B$2:$B$102=$F$2)*(YEAR($A$2:$A$102)=$E$2)),ROWS(G$5:G10))))","v":128.15},null,null,null,{"$f":"IF(ROWS(K$5:K10)>$G$2,\"\",INDEX(A$2:A$102,SMALL(IF($B$2:$B$102=$F$2,IF(YEAR($A$2:$A$102)=$E$2,ROW($B$2:$B$102)-ROW($B$2)+1)),ROWS(K$5:K10))))","v":"2010-02-02"},{"$f":"IF(ROWS(L$5:L10)>$G$2,\"\",INDEX(B$2:B$102,SMALL(IF($B$2:$B$102=$F$2,IF(YEAR($A$2:$A$102)=$E$2,ROW($B$2:$B$102)-ROW($B$2)+1)),ROWS(L$5:L10))))","v":"Smith"},{"$f":"IF(ROWS(M$5:M10)>$G$2,\"\",INDEX(C$2:C$102,SMALL(IF($B$2:$B$102=$F$2,IF(YEAR($A$2:$A$102)=$E$2,ROW($B$2:$B$102)-ROW($B$2)+1)),ROWS(M$5:M10))))","v":128.15}]
["2010-01-23","Smith",113.86,null,{"$f":"IF(ROWS(E$5:E11)>$G$2,\"\",INDEX(A$2:A$102,_xlfn.AGGREGATE(15,6,(ROW($A$2:$A$102)-ROW($A$2)+1)/(($B$2:$B$102=$F$2)*(YEAR($A$2:$A$102)=$E$2)),ROWS(E$5:E11))))","v":"2010-01-13"},{"$f":"IF(ROWS(F$5:F11)>$G$2,\"\",INDEX(B$2:B$102,_xlfn.AGGREGATE(15,6,(ROW($A$2:$A$102)-ROW($A$2)+1)/(($B$2:$B$102=$F$2)*(YEAR($A$2:$A$102)=$E$2)),ROWS(F$5:F11))))","v":"Smith"},{"$f":"IF(ROWS(G$5:G11)>$G$2,\"\",INDEX(C$2:C$102,_xlfn.AGGREGATE(15,6,(ROW($A$2:$A$102)-ROW($A$2)+1)/(($B$2:$B$102=$F$2)*(YEAR($A$2:$A$102)=$E$2)),ROWS(G$5:G11))))","v":112.03},null,null,null,{"$f":"IF(ROWS(K$5:K11)>$G$2,\"\",INDEX(A$2:A$102,SMALL(IF($B$2:$B$102=$F$2,IF(YEAR($A$2:$A$102)=$E$2,ROW($B$2:$B$102)-ROW($B$2)+1)),ROWS(K$5:K11))))","v":"2010-01-13"},{"$f":"IF(ROWS(L$5:L11)>$G$2,\"\",INDEX(B$2:B$102,SMALL(IF($B$2:$B$102=$F$2,IF(YEAR($A$2:$A$102)=$E$2,ROW($B$2:$B$102)-ROW($B$2)+1)),ROWS(L$5:L11))))","v":"Smith"},{"$f":"IF(ROWS(M$5:M11)>$G$2,\"\",INDEX(C$2:C$102,SMALL(IF($B$2:$B$102=$F$2,IF(YEAR($A$2:$A$102)=$E$2,ROW($B$2:$B$102)-ROW($B$2)+1)),ROWS(M$5:M11))))","v":112.03}]
["2010-01-21","Pham",139.38,null,{"$f":"IF(ROWS(E$5:E12)>$G$2,\"\",INDEX(A$2:A$102,_xlfn.AGGREGATE(15,6,(ROW($A$2:$A$102)-ROW($A$2)+1)/(($B$2:$B$102=$F$2)*(YEAR($A$2:$A$102)=$E$2)),ROWS(E$5:E12))))","v":"2010-01-13"},{"$f":"IF(ROWS(F$5:F12)>$G$2,\"\",INDEX(B$2:B$102,_xlfn.AGGREGATE(15,6,(ROW($A$2:$A$102)-ROW($A$2)+1)/(($B$2:$B$102=$F$2)*(YEAR($A$2:$A$102)=$E$2)),ROWS(F$5:F12))))","v":"Smith"},{"$f":"IF(ROWS(G$5:G12)>$G$2,\"\",INDEX(C$2:C$102,_xlfn.AGGREGATE(15,6,(ROW($A$2:$A$102)-ROW($A$2)+1)/(($B$2:$B$102=$F$2)*(YEAR($A$2:$A$102)=$E$2)),ROWS(G$5:G12))))","v":135.77000000000001},null,null,null,{"$f":"IF(ROWS(K$5:K12)>$G$2,\"\",INDEX(A$2:A$102,SMALL(IF($B$2:$B$102=$F$2,IF(YEAR($A$2:$A$102)=$E$2,ROW($B$2:$B$102)-ROW($B$2)+1)),ROWS(K$5:K12))))","v":"2010-01-13"},{"$f":"IF(ROWS(L$5:L12)>$G$2,\"\",INDEX(B$2:B$102,SMALL(IF($B$2:$B$102=$F$2,IF(YEAR($A$2:$A$102)=$E$2,ROW($B$2:$B$102)-ROW($B$2)+1)),ROWS(L$5:L12))))","v":"Smith"},{"$f":"IF(ROWS(M$5:M12)>$G$2,\"\",INDEX(C$2:C$102,SMALL(IF($B$2:$B$102=$F$2,IF(YEAR($A$2:$A$102)=$E$2,ROW($B$2:$B$102)-ROW($B$2)+1)),ROWS(M$5:M12))))","v":135.77000000000001}]
["2009-12-20","Gault",98.71,null,{"$f":"IF(ROWS(E$5:E13)>$G$2,\"\",INDEX(A$2:A$102,_xlfn.AGGREGATE(15,6,(ROW($A$2:$A$102)-ROW($A$2)+1)/(($B$2:$B$102=$F$2)*(YEAR($A$2:$A$102)=$E$2)),ROWS(E$5:E13))))","v":"2010-02-02"},{"$f":"IF(ROWS(F$5:F13)>$G$2,\"\",INDEX(B$2:B$102,_xlfn.AGGREGATE(15,6,(ROW($A$2:$A$102)-ROW($A$2)+1)/(($B$2:$B$102=$F$2)*(YEAR($A$2:$A$102)=$E$2)),ROWS(F$5:F13))))","v":"Smith"},{"$f":"IF(ROWS(G$5:G13)>$G$2,\"\",INDEX(C$2:C$102,_xlfn.AGGREGATE(15,6,(ROW($A$2:$A$102)-ROW($A$2)+1)/(($B$2:$B$102=$F$2)*(YEAR($A$2:$A$102)=$E$2)),ROWS(G$5:G13))))","v":117.63},null,null,null,{"$f":"IF(ROWS(K$5:K13)>$G$2,\"\",INDEX(A$2:A$102,SMALL(IF($B$2:$B$102=$F$2,IF(YEAR($A$2:$A$102)=$E$2,ROW($B$2:$B$102)-ROW($B$2)+1)),ROWS(K$5:K13))))","v":"2010-02-02"},{"$f":"IF(ROWS(L$5:L13)>$G$2,\"\",INDEX(B$2:B$102,SMALL(IF($B$2:$B$102=$F$2,IF(YEAR($A$2:$A$102)=$E$2,ROW($B$2:$B$102)-ROW($B$2)+1)),ROWS(L$5:L13))))","v":"Smith"},{"$f":"IF(ROWS(M$5:M13)>$G$2,\"\",INDEX(C$2:C$102,SMALL(IF($B$2:$B$102=$F$2,IF(YEAR($A$2:$A$102)=$E$2,ROW($B$2:$B$102)-ROW($B$2)+1)),ROWS(M$5:M13))))","v":117.63}]
["2009-12-07","Pham",76.650000000000006,null,{"$f":"IF(ROWS(E$5:E14)>$G$2,\"\",INDEX(A$2:A$102,_xlfn.AGGREGATE(15,6,(ROW($A$2:$A$102)-ROW($A$2)+1)/(($B$2:$B$102=$F$2)*(YEAR($A$2:$A$102)=$E$2)),ROWS(E$5:E14))))","v":"2010-01-10"},{"$f":"IF(ROWS(F$5:F14)>$G$2,\"\",INDEX(B$2:B$102,_xlfn.AGGREGATE(15,6,(ROW($A$2:$A$102)-ROW($A$2)+1)/(($B$2:$B$102=$F$2)*(YEAR($A$2:$A$102)=$E$2)),ROWS(F$5:F14))))","v":"Smith"},{"$f":"IF(ROWS(G$5:G14)>$G$2,\"\",INDEX(C$2:C$102,_xlfn.AGGREGATE(15,6,(ROW($A$2:$A$102)-ROW($A$2)+1)/(($B$2:$B$102=$F$2)*(YEAR($A$2:$A$102)=$E$2)),ROWS(G$5:G14))))","v":108.54},null,null,null,{"$f":"IF(ROWS(K$5:K14)>$G$2,\"\",INDEX(A$2:A$102,SMALL(IF($B$2:$B$102=$F$2,IF(YEAR($A$2:$A$102)=$E$2,ROW($B$2:$B$102)-ROW($B$2)+1)),ROWS(K$5:K14))))","v":"2010-01-10"},{"$f":"IF(ROWS(L$5:L14)>$G$2,\"\",INDEX(B$2:B$102,SMALL(IF($B$2:$B$102=$F$2,IF(YEAR($A$2:$A$102)=$E$2,ROW($B$2:$B$102)-ROW($B$2)+1)),ROWS(L$5:L14))))","v":"Smith"},{"$f":"IF(ROWS(M$5:M14)>$G$2,\"\",INDEX(C$2:C$102,SMALL(IF($B$2:$B$102=$F$2,IF(YEAR($A$2:$A$102)=$E$2,ROW($B$2:$B$102)-ROW($B$2)+1)),ROWS(M$5:M14))))","v":108.54}]
["2010-02-11","Gault",126.62,null,{"$f":"IF(ROWS(E$5:E15)>$G$2,\"\",INDEX(A$2:A$102,_xlfn.AGGREGATE(15,6,(ROW($A$2:$A$102)-ROW($A$2)+1)/(($B$2:$B$102=$F$2)*(YEAR($A$2:$A$102)=$E$2)),ROWS(E$5:E15))))","v":""},{"$f":"IF(ROWS(F$5:F15)>$G$2,\"\",INDEX(B$2:B$102,_xlfn.AGGREGATE(15,6,(ROW($A$2:$A$102)-ROW($A$2)+1)/(($B$2:$B$102=$F$2)*(YEAR($A$2:$A$102)=$E$2)),ROWS(F$5:F15))))","v":""},{"$f":"IF(ROWS(G$5:G15)>$G$2,\"\",INDEX(C$2:C$102,_xlfn.AGGREGATE(15,6,(ROW($A$2:$A$102)-ROW($A$2)+1)/(($B$2:$B$102=$F$2)*(YEAR($A$2:$A$102)=$E$2)),ROWS(G$5:G15))))","v":""},null,null,null,{"$f":"IF(ROWS(K$5:K15)>$G$2,\"\",INDEX(A$2:A$102,SMALL(IF($B$2:$B$102=$F$2,IF(YEAR($A$2:$A$102)=$E$2,ROW($B$2:$B$102)-ROW($B$2)+1)),ROWS(K$5:K15))))","v":""},{"$f":"IF(ROWS(L$5:L15)>$G$2,\"\",INDEX(B$2:B$102,SMALL(IF($B$2:$B$102=$F$2,IF(YEAR($A$2:$A$102)=$E$2,ROW($B$2:$B$102)-ROW($B$2)+1)),ROWS(L$5:L15))))","v":""},{"$f":"IF(ROWS(M$5:M15)>$G$2,\"\",INDEX(C$2:C$102,SMALL(IF($B$2:$B$102=$F$2,IF(YEAR($A$2:$A$102)=$E$2,ROW($B$2:$B$102)-ROW($B$2)+1)),ROWS(M$5:M15))))","v":""}]
["2010-01-13","Franks",107.9,null,{"$f":"IF(ROWS(E$5:E16)>$G$2,\"\",INDEX(A$2:A$102,_xlfn.AGGREGATE(15,6,(ROW($A$2:$A$102)-ROW($A$2)+1)/(($B$2:$B$102=$F$2)*(YEAR($A$2:$A$102)=$E$2)),ROWS(E$5:E16))))","v":""},{"$f":"IF(ROWS(F$5:F16)>$G$2,\"\",INDEX(B$2:B$102,_xlfn.AGGREGATE(15,6,(ROW($A$2:$A$102)-ROW($A$2)+1)/(($B$2:$B$102=$F$2)*(YEAR($A$2:$A$102)=$E$2)),ROWS(F$5:F16))))","v":""},{"$f":"IF(ROWS(G$5:G16)>$G$2,\"\",INDEX(C$2:C$102,_xlfn.AGGREGATE(15,6,(ROW($A$2:$A$102)-ROW($A$2)+1)/(($B$2:$B$102=$F$2)*(YEAR($A$2:$A$102)=$E$2)),ROWS(G$5:G16))))","v":""},null,null,null,{"$f":"IF(ROWS(K$5:K16)>$G$2,\"\",INDEX(A$2:A$102,SMALL(IF($B$2:$B$102=$F$2,IF(YEAR($A$2:$A$102)=$E$2,ROW($B$2:$B$102)-ROW($B$2)+1)),ROWS(K$5:K16))))","v":""},{"$f":"IF(ROWS(L$5:L16)>$G$2,\"\",INDEX(B$2:B$102,SMALL(IF($B$2:$B$102=$F$2,IF(YEAR($A$2:$A$102)=$E$2,ROW($B$2:$B$102)-ROW($B$2)+1)),ROWS(L$5:L16))))","v":""},{"$f":"IF(ROWS(M$5:M16)>$G$2,\"\",INDEX(C$2:C$102,SMALL(IF($B$2:$B$102=$F$2,IF(YEAR($A$2:$A$102)=$E$2,ROW($B$2:$B$102)-ROW($B$2)+1)),ROWS(M$5:M16))))","v":""}]
["2010-01-28","Gault",130.54,null,{"$f":"IF(ROWS(E$5:E17)>$G$2,\"\",INDEX(A$2:A$102,_xlfn.AGGREGATE(15,6,(ROW($A$2:$A$102)-ROW($A$2)+1)/(($B$2:$B$102=$F$2)*(YEAR($A$2:$A$102)=$E$2)),ROWS(E$5:E17))))","v":""},{"$f":"IF(ROWS(F$5:F17)>$G$2,\"\",INDEX(B$2:B$102,_xlfn.AGGREGATE(15,6,(ROW($A$2:$A$102)-ROW($A$2)+1)/(($B$2:$B$102=$F$2)*(YEAR($A$2:$A$102)=$E$2)),ROWS(F$5:F17))))","v":""},{"$f":"IF(ROWS(G$5:G17)>$G$2,\"\",INDEX(C$2:C$102,_xlfn.AGGREGATE(15,6,(ROW($A$2:$A$102)-ROW($A$2)+1)/(($B$2:$B$102=$F$2)*(YEAR($A$2:$A$102)=$E$2)),ROWS(G$5:G17))))","v":""},null,null,null,{"$f":"IF(ROWS(K$5:K17)>$G$2,\"\",INDEX(A$2:A$102,SMALL(IF($B$2:$B$102=$F$2,IF(YEAR($A$2:$A$102)=$E$2,ROW($B$2:$B$102)-ROW($B$2)+1)),ROWS(K$5:K17))))","v":""},{"$f":"IF(ROWS(L$5:L17)>$G$2,\"\",INDEX(B$2:B$102,SMALL(IF($B$2:$B$102=$F$2,IF(YEAR($A$2:$A$102)=$E$2,ROW($B$2:$B$102)-ROW($B$2)+1)),ROWS(L$5:L17))))","v":""},{"$f":"IF(ROWS(M$5:M17)>$G$2,\"\",INDEX(C$2:C$102,SMALL(IF($B$2:$B$102=$F$2,IF(YEAR($A$2:$A$102)=$E$2,ROW($B$2:$B$102)-ROW($B$2)+1)),ROWS(M$5:M17))))","v":""}]
["2010-01-25","Gault",140.71,null,{"$f":"IF(ROWS(E$5:E18)>$G$2,\"\",INDEX(A$2:A$102,_xlfn.AGGREGATE(15,6,(ROW($A$2:$A$102)-ROW($A$2)+1)/(($B$2:$B$102=$F$2)*(YEAR($A$2:$A$102)=$E$2)),ROWS(E$5:E18))))","v":""},{"$f":"IF(ROWS(F$5:F18)>$G$2,\"\",INDEX(B$2:B$102,_xlfn.AGGREGATE(15,6,(ROW($A$2:$A$102)-ROW($A$2)+1)/(($B$2:$B$102=$F$2)*(YEAR($A$2:$A$102)=$E$2)),ROWS(F$5:F18))))","v":""},{"$f":"IF(ROWS(G$5:G18)>$G$2,\"\",INDEX(C$2:C$102,_xlfn.AGGREGATE(15,6,(ROW($A$2:$A$102)-ROW($A$2)+1)/(($B$2:$B$102=$F$2)*(YEAR($A$2:$A$102)=$E$2)),ROWS(G$5:G18))))","v":""},null,null,null,{"$f":"IF(ROWS(K$5:K18)>$G$2,\"\",INDEX(A$2:A$102,SMALL(IF($B$2:$B$102=$F$2,IF(YEAR($A$2:$A$102)=$E$2,ROW($B$2:$B$102)-ROW($B$2)+1)),ROWS(K$5:K18))))","v":""},{"$f":"IF(ROWS(L$5:L18)>$G$2,\"\",INDEX(B$2:B$102,SMALL(IF($B$2:$B$102=$F$2,IF(YEAR($A$2:$A$102)=$E$2,ROW($B$2:$B$102)-ROW($B$2)+1)),ROWS(L$5:L18))))","v":""},{"$f":"IF(ROWS(M$5:M18)>$G$2,\"\",INDEX(C$2:C$102,SMALL(IF($B$2:$B$102=$F$2,IF(YEAR($A$2:$A$102)=$E$2,ROW($B$2:$B$102)-ROW($B$2)+1)),ROWS(M$5:M18))))","v":""}]
["2010-02-10","Sioux",108.72,null,{"$f":"IF(ROWS(E$5:E19)>$G$2,\"\",INDEX(A$2:A$102,_xlfn.AGGREGATE(15,6,(ROW($A$2:$A$102)-ROW($A$2)+1)/(($B$2:$B$102=$F$2)*(YEAR($A$2:$A$102)=$E$2)),ROWS(E$5:E19))))","v":""},{"$f":"IF(ROWS(F$5:F19)>$G$2,\"\",INDEX(B$2:B$102,_xlfn.AGGREGATE(15,6,(ROW($A$2:$A$102)-ROW($A$2)+1)/(($B$2:$B$102=$F$2)*(YEAR($A$2:$A$102)=$E$2)),ROWS(F$5:F19))))","v":""},{"$f":"IF(ROWS(G$5:G19)>$G$2,\"\",INDEX(C$2:C$102,_xlfn.AGGREGATE(15,6,(ROW($A$2:$A$102)-ROW($A$2)+1)/(($B$2:$B$102=$F$2)*(YEAR($A$2:$A$102)=$E$2)),ROWS(G$5:G19))))","v":""},null,null,null,{"$f":"IF(ROWS(K$5:K19)>$G$2,\"\",INDEX(A$2:A$102,SMALL(IF($B$2:$B$102=$F$2,IF(YEAR($A$2:$A$102)=$E$2,ROW($B$2:$B$102)-ROW($B$2)+1)),ROWS(K$5:K19))))","v":""},{"$f":"IF(ROWS(L$5:L19)>$G$2,\"\",INDEX(B$2:B$102,SMALL(IF($B$2:$B$102=$F$2,IF(YEAR($A$2:$A$102)=$E$2,ROW($B$2:$B$102)-ROW($B$2)+1)),ROWS(L$5:L19))))","v":""},{"$f":"IF(ROWS(M$5:M19)>$G$2,\"\",INDEX(C$2:C$102,SMALL(IF($B$2:$B$102=$F$2,IF(YEAR($A$2:$A$102)=$E$2,ROW($B$2:$B$102)-ROW($B$2)+1)),ROWS(M$5:M19))))","v":""}]
["2009-12-26","Smith",135.18,null,{"$f":"IF(ROWS(E$5:E20)>$G$2,\"\",INDEX(A$2:A$102,_xlfn.AGGREGATE(15,6,(ROW($A$2:$A$102)-ROW($A$2)+1)/(($B$2:$B$102=$F$2)*(YEAR($A$2:$A$102)=$E$2)),ROWS(E$5:E20))))","v":""},{"$f":"IF(ROWS(F$5:F20)>$G$2,\"\",INDEX(B$2:B$102,_xlfn.AGGREGATE(15,6,(ROW($A$2:$A$102)-ROW($A$2)+1)/(($B$2:$B$102=$F$2)*(YEAR($A$2:$A$102)=$E$2)),ROWS(F$5:F20))))","v":""},{"$f":"IF(ROWS(G$5:G20)>$G$2,\"\",INDEX(C$2:C$102,_xlfn.AGGREGATE(15,6,(ROW($A$2:$A$102)-ROW($A$2)+1)/(($B$2:$B$102=$F$2)*(YEAR($A$2:$A$102)=$E$2)),ROWS(G$5:G20))))","v":""},null,null,null,{"$f":"IF(ROWS(K$5:K20)>$G$2,\"\",INDEX(A$2:A$102,SMALL(IF($B$2:$B$102=$F$2,IF(YEAR($A$2:$A$102)=$E$2,ROW($B$2:$B$102)-ROW($B$2)+1)),ROWS(K$5:K20))))","v":""},{"$f":"IF(ROWS(L$5:L20)>$G$2,\"\",INDEX(B$2:B$102,SMALL(IF($B$2:$B$102=$F$2,IF(YEAR($A$2:$A$102)=$E$2,ROW($B$2:$B$102)-ROW($B$2)+1)),ROWS(L$5:L20))))","v":""},{"$f":"IF(ROWS(M$5:M20)>$G$2,\"\",INDEX(C$2:C$102,SMALL(IF($B$2:$B$102=$F$2,IF(YEAR($A$2:$A$102)=$E$2,ROW($B$2:$B$102)-ROW($B$2)+1)),ROWS(M$5:M20))))","v":""}]
["2009-12-14","Gault",142.55000000000001,null,{"$f":"IF(ROWS(E$5:E21)>$G$2,\"\",INDEX(A$2:A$102,_xlfn.AGGREGATE(15,6,(ROW($A$2:$A$102)-ROW($A$2)+1)/(($B$2:$B$102=$F$2)*(YEAR($A$2:$A$102)=$E$2)),ROWS(E$5:E21))))","v":""},{"$f":"IF(ROWS(F$5:F21)>$G$2,\"\",INDEX(B$2:B$102,_xlfn.AGGREGATE(15,6,(ROW($A$2:$A$102)-ROW($A$2)+1)/(($B$2:$B$102=$F$2)*(YEAR($A$2:$A$102)=$E$2)),ROWS(F$5:F21))))","v":""},{"$f":"IF(ROWS(G$5:G21)>$G$2,\"\",INDEX(C$2:C$102,_xlfn.AGGREGATE(15,6,(ROW($A$2:$A$102)-ROW($A$2)+1)/(($B$2:$B$102=$F$2)*(YEAR($A$2:$A$102)=$E$2)),ROWS(G$5:G21))))","v":""},null,null,null,{"$f":"IF(ROWS(K$5:K21)>$G$2,\"\",INDEX(A$2:A$102,SMALL(IF($B$2:$B$102=$F$2,IF(YEAR($A$2:$A$102)=$E$2,ROW($B$2:$B$102)-ROW($B$2)+1)),ROWS(K$5:K21))))","v":""},{"$f":"IF(ROWS(L$5:L21)>$G$2,\"\",INDEX(B$2:B$102,SMALL(IF($B$2:$B$102=$F$2,IF(YEAR($A$2:$A$102)=$E$2,ROW($B$2:$B$102)-ROW($B$2)+1)),ROWS(L$5:L21))))","v":""},{"$f":"IF(ROWS(M$5:M21)>$G$2,\"\",INDEX(C$2:C$102,SMALL(IF($B$2:$B$102=$F$2,IF(YEAR($A$2:$A$102)=$E$2,ROW($B$2:$B$102)-ROW($B$2)+1)),ROWS(M$5:M21))))","v":""}]
["2010-02-12","Smith",140.54,null,{"$f":"IF(ROWS(E$5:E22)>$G$2,\"\",INDEX(A$2:A$102,_xlfn.AGGREGATE(15,6,(ROW($A$2:$A$102)-ROW($A$2)+1)/(($B$2:$B$102=$F$2)*(YEAR($A$2:$A$102)=$E$2)),ROWS(E$5:E22))))","v":""},{"$f":"IF(ROWS(F$5:F22)>$G$2,\"\",INDEX(B$2:B$102,_xlfn.AGGREGATE(15,6,(ROW($A$2:$A$102)-ROW($A$2)+1)/(($B$2:$B$102=$F$2)*(YEAR($A$2:$A$102)=$E$2)),ROWS(F$5:F22))))","v":""},{"$f":"IF(ROWS(G$5:G22)>$G$2,\"\",INDEX(C$2:C$102,_xlfn.AGGREGATE(15,6,(ROW($A$2:$A$102)-ROW($A$2)+1)/(($B$2:$B$102=$F$2)*(YEAR($A$2:$A$102)=$E$2)),ROWS(G$5:G22))))","v":""},null,null,null,{"$f":"IF(ROWS(K$5:K22)>$G$2,\"\",INDEX(A$2:A$102,SMALL(IF($B$2:$B$102=$F$2,IF(YEAR($A$2:$A$102)=$E$2,ROW($B$2:$B$102)-ROW($B$2)+1)),ROWS(K$5:K22))))","v":""},{"$f":"IF(ROWS(L$5:L22)>$G$2,\"\",INDEX(B$2:B$102,SMALL(IF($B$2:$B$102=$F$2,IF(YEAR($A$2:$A$102)=$E$2,ROW($B$2:$B$102)-ROW($B$2)+1)),ROWS(L$5:L22))))","v":""},{"$f":"IF(ROWS(M$5:M22)>$G$2,\"\",INDEX(C$2:C$102,SMALL(IF($B$2:$B$102=$F$2,IF(YEAR($A$2:$A$102)=$E$2,ROW($B$2:$B$102)-ROW($B$2)+1)),ROWS(M$5:M22))))","v":""}]
["2010-01-19","Franks",75.040000000000006,null,{"$f":"IF(ROWS(E$5:E23)>$G$2,\"\",INDEX(A$2:A$102,_xlfn.AGGREGATE(15,6,(ROW($A$2:$A$102)-ROW($A$2)+1)/(($B$2:$B$102=$F$2)*(YEAR($A$2:$A$102)=$E$2)),ROWS(E$5:E23))))","v":""},{"$f":"IF(ROWS(F$5:F23)>$G$2,\"\",INDEX(B$2:B$102,_xlfn.AGGREGATE(15,6,(ROW($A$2:$A$102)-ROW($A$2)+1)/(($B$2:$B$102=$F$2)*(YEAR($A$2:$A$102)=$E$2)),ROWS(F$5:F23))))","v":""},{"$f":"IF(ROWS(G$5:G23)>$G$2,\"\",INDEX(C$2:C$102,_xlfn.AGGREGATE(15,6,(ROW($A$2:$A$102)-ROW($A$2)+1)/(($B$2:$B$102=$F$2)*(YEAR($A$2:$A$102)=$E$2)),ROWS(G$5:G23))))","v":""},null,null,null,{"$f":"IF(ROWS(K$5:K23)>$G$2,\"\",INDEX(A$2:A$102,SMALL(IF($B$2:$B$102=$F$2,IF(YEAR($A$2:$A$102)=$E$2,ROW($B$2:$B$102)-ROW($B$2)+1)),ROWS(K$5:K23))))","v":""},{"$f":"IF(ROWS(L$5:L23)>$G$2,\"\",INDEX(B$2:B$102,SMALL(IF($B$2:$B$102=$F$2,IF(YEAR($A$2:$A$102)=$E$2,ROW($B$2:$B$102)-ROW($B$2)+1)),ROWS(L$5:L23))))","v":""},{"$f":"IF(ROWS(M$5:M23)>$G$2,\"\",INDEX(C$2:C$102,SMALL(IF($B$2:$B$102=$F$2,IF(YEAR($A$2:$A$102)=$E$2,ROW($B$2:$B$102)-ROW($B$2)+1)),ROWS(M$5:M23))))","v":""}]
["2010-02-16","Pham",93.15,null,{"$f":"IF(ROWS(E$5:E24)>$G$2,\"\",INDEX(A$2:A$102,_xlfn.AGGREGATE(15,6,(ROW($A$2:$A$102)-ROW($A$2)+1)/(($B$2:$B$102=$F$2)*(YEAR($A$2:$A$102)=$E$2)),ROWS(E$5:E24))))","v":""},{"$f":"IF(ROWS(F$5:F24)>$G$2,\"\",INDEX(B$2:B$102,_xlfn.AGGREGATE(15,6,(ROW($A$2:$A$102)-ROW($A$2)+1)/(($B$2:$B$102=$F$2)*(YEAR($A$2:$A$102)=$E$2)),ROWS(F$5:F24))))","v":""},{"$f":"IF(ROWS(G$5:G24)>$G$2,\"\",INDEX(C$2:C$102,_xlfn.AGGREGATE(15,6,(ROW($A$2:$A$102)-ROW($A$2)+1)/(($B$2:$B$102=$F$2)*(YEAR($A$2:$A$102)=$E$2)),ROWS(G$5:G24))))","v":""},null,null,null,{"$f":"IF(ROWS(K$5:K24)>$G$2,\"\",INDEX(A$2:A$102,SMALL(IF($B$2:$B$102=$F$2,IF(YEAR($A$2:$A$102)=$E$2,ROW($B$2:$B$102)-ROW($B$2)+1)),ROWS(K$5:K24))))","v":""},{"$f":"IF(ROWS(L$5:L24)>$G$2,\"\",INDEX(B$2:B$102,SMALL(IF($B$2:$B$102=$F$2,IF(YEAR($A$2:$A$102)=$E$2,ROW($B$2:$B$102)-ROW($B$2)+1)),ROWS(L$5:L24))))","v":""},{"$f":"IF(ROWS(M$5:M24)>$G$2,\"\",INDEX(C$2:C$102,SMALL(IF($B$2:$B$102=$F$2,IF(YEAR($A$2:$A$102)=$E$2,ROW($B$2:$B$102)-ROW($B$2)+1)),ROWS(M$5:M24))))","v":""}]
["2010-01-07","Sioux",132.51,null,{"$f":"IF(ROWS(E$5:E25)>$G$2,\"\",INDEX(A$2:A$102,_xlfn.AGGREGATE(15,6,(ROW($A$2:$A$102)-ROW($A$2)+1)/(($B$2:$B$102=$F$2)*(YEAR($A$2:$A$102)=$E$2)),ROWS(E$5:E25))))","v":""},{"$f":"IF(ROWS(F$5:F25)>$G$2,\"\",INDEX(B$2:B$102,_xlfn.AGGREGATE(15,6,(ROW($A$2:$A$102)-ROW($A$2)+1)/(($B$2:$B$102=$F$2)*(YEAR($A$2:$A$102)=$E$2)),ROWS(F$5:F25))))","v":""},{"$f":"IF(ROWS(G$5:G25)>$G$2,\"\",INDEX(C$2:C$102,_xlfn.AGGREGATE(15,6,(ROW($A$2:$A$102)-ROW($A$2)+1)/(($B$2:$B$102=$F$2)*(YEAR($A$2:$A$102)=$E$2)),ROWS(G$5:G25))))","v":""},null,null,null,{"$f":"IF(ROWS(K$5:K25)>$G$2,\"\",INDEX(A$2:A$102,SMALL(IF($B$2:$B$102=$F$2,IF(YEAR($A$2:$A$102)=$E$2,ROW($B$2:$B$102)-ROW($B$2)+1)),ROWS(K$5:K25))))","v":""},{"$f":"IF(ROWS(L$5:L25)>$G$2,\"\",INDEX(B$2:B$102,SMALL(IF($B$2:$B$102=$F$2,IF(YEAR($A$2:$A$102)=$E$2,ROW($B$2:$B$102)-ROW($B$2)+1)),ROWS(L$5:L25))))","v":""},{"$f":"IF(ROWS(M$5:M25)>$G$2,\"\",INDEX(C$2:C$102,SMALL(IF($B$2:$B$102=$F$2,IF(YEAR($A$2:$A$102)=$E$2,ROW($B$2:$B$102)-ROW($B$2)+1)),ROWS(M$5:M25))))","v":""}]
["2010-01-16","Chin",85.14,null,{"$f":"IF(ROWS(E$5:E26)>$G$2,\"\",INDEX(A$2:A$102,_xlfn.AGGREGATE(15,6,(ROW($A$2:$A$102)-ROW($A$2)+1)/(($B$2:$B$102=$F$2)*(YEAR($A$2:$A$102)=$E$2)),ROWS(E$5:E26))))","v":""},{"$f":"IF(ROWS(F$5:F26)>$G$2,\"\",INDEX(B$2:B$102,_xlfn.AGGREGATE(15,6,(ROW($A$2:$A$102)-ROW($A$2)+1)/(($B$2:$B$102=$F$2)*(YEAR($A$2:$A$102)=$E$2)),ROWS(F$5:F26))))","v":""},{"$f":"IF(ROWS(G$5:G26)>$G$2,\"\",INDEX(C$2:C$102,_xlfn.AGGREGATE(15,6,(ROW($A$2:$A$102)-ROW($A$2)+1)/(($B$2:$B$102=$F$2)*(YEAR($A$2:$A$102)=$E$2)),ROWS(G$5:G26))))","v":""},null,null,null,{"$f":"IF(ROWS(K$5:K26)>$G$2,\"\",INDEX(A$2:A$102,SMALL(IF($B$2:$B$102=$F$2,IF(YEAR($A$2:$A$102)=$E$2,ROW($B$2:$B$102)-ROW($B$2)+1)),ROWS(K$5:K26))))","v":""},{"$f":"IF(ROWS(L$5:L26)>$G$2,\"\",INDEX(B$2:B$102,SMALL(IF($B$2:$B$102=$F$2,IF(YEAR($A$2:$A$102)=$E$2,ROW($B$2:$B$102)-ROW($B$2)+1)),ROWS(L$5:L26))))","v":""},{"$f":"IF(ROWS(M$5:M26)>$G$2,\"\",INDEX(C$2:C$102,SMALL(IF($B$2:$B$102=$F$2,IF(YEAR($A$2:$A$102)=$E$2,ROW($B$2:$B$102)-ROW($B$2)+1)),ROWS(M$5:M26))))","v":""}]
["2010-02-15","Franks",108.85,null,{"$f":"IF(ROWS(E$5:E27)>$G$2,\"\",INDEX(A$2:A$102,_xlfn.AGGREGATE(15,6,(ROW($A$2:$A$102)-ROW($A$2)+1)/(($B$2:$B$102=$F$2)*(YEAR($A$2:$A$102)=$E$2)),ROWS(E$5:E27))))","v":""},{"$f":"IF(ROWS(F$5:F27)>$G$2,\"\",INDEX(B$2:B$102,_xlfn.AGGREGATE(15,6,(ROW($A$2:$A$102)-ROW($A$2)+1)/(($B$2:$B$102=$F$2)*(YEAR($A$2:$A$102)=$E$2)),ROWS(F$5:F27))))","v":""},{"$f":"IF(ROWS(G$5:G27)>$G$2,\"\",INDEX(C$2:C$102,_xlfn.AGGREGATE(15,6,(ROW($A$2:$A$102)-ROW($A$2)+1)/(($B$2:$B$102=$F$2)*(YEAR($A$2:$A$102)=$E$2)),ROWS(G$5:G27))))","v":""},null,null,null,{"$f":"IF(ROWS(K$5:K27)>$G$2,\"\",INDEX(A$2:A$102,SMALL(IF($B$2:$B$102=$F$2,IF(YEAR($A$2:$A$102)=$E$2,ROW($B$2:$B$102)-ROW($B$2)+1)),ROWS(K$5:K27))))","v":""},{"$f":"IF(ROWS(L$5:L27)>$G$2,\"\",INDEX(B$2:B$102,SMALL(IF($B$2:$B$102=$F$2,IF(YEAR($A$2:$A$102)=$E$2,ROW($B$2:$B$102)-ROW($B$2)+1)),ROWS(L$5:L27))))","v":""},{"$f":"IF(ROWS(M$5:M27)>$G$2,\"\",INDEX(C$2:C$102,SMALL(IF($B$2:$B$102=$F$2,IF(YEAR($A$2:$A$102)=$E$2,ROW($B$2:$B$102)-ROW($B$2)+1)),ROWS(M$5:M27))))","v":""}]
["2009-12-13","Sioux",139.91999999999999,null,{"$f":"IF(ROWS(E$5:E28)>$G$2,\"\",INDEX(A$2:A$102,_xlfn.AGGREGATE(15,6,(ROW($A$2:$A$102)-ROW($A$2)+1)/(($B$2:$B$102=$F$2)*(YEAR($A$2:$A$102)=$E$2)),ROWS(E$5:E28))))","v":""},{"$f":"IF(ROWS(F$5:F28)>$G$2,\"\",INDEX(B$2:B$102,_xlfn.AGGREGATE(15,6,(ROW($A$2:$A$102)-ROW($A$2)+1)/(($B$2:$B$102=$F$2)*(YEAR($A$2:$A$102)=$E$2)),ROWS(F$5:F28))))","v":""},{"$f":"IF(ROWS(G$5:G28)>$G$2,\"\",INDEX(C$2:C$102,_xlfn.AGGREGATE(15,6,(ROW($A$2:$A$102)-ROW($A$2)+1)/(($B$2:$B$102=$F$2)*(YEAR($A$2:$A$102)=$E$2)),ROWS(G$5:G28))))","v":""},null,null,null,{"$f":"IF(ROWS(K$5:K28)>$G$2,\"\",INDEX(A$2:A$102,SMALL(IF($B$2:$B$102=$F$2,IF(YEAR($A$2:$A$102)=$E$2,ROW($B$2:$B$102)-ROW($B$2)+1)),ROWS(K$5:K28))))","v":""},{"$f":"IF(ROWS(L$5:L28)>$G$2,\"\",INDEX(B$2:B$102,SMALL(IF($B$2:$B$102=$F$2,IF(YEAR($A$2:$A$102)=$E$2,ROW($B$2:$B$102)-ROW($B$2)+1)),ROWS(L$5:L28))))","v":""},{"$f":"IF(ROWS(M$5:M28)>$G$2,\"\",INDEX(C$2:C$102,SMALL(IF($B$2:$B$102=$F$2,IF(YEAR($A$2:$A$102)=$E$2,ROW($B$2:$B$102)-ROW($B$2)+1)),ROWS(M$5:M28))))","v":""}]
["2010-01-04","Franks",104.35,null,{"$f":"IF(ROWS(E$5:E29)>$G$2,\"\",INDEX(A$2:A$102,_xlfn.AGGREGATE(15,6,(ROW($A$2:$A$102)-ROW($A$2)+1)/(($B$2:$B$102=$F$2)*(YEAR($A$2:$A$102)=$E$2)),ROWS(E$5:E29))))","v":""},{"$f":"IF(ROWS(F$5:F29)>$G$2,\"\",INDEX(B$2:B$102,_xlfn.AGGREGATE(15,6,(ROW($A$2:$A$102)-ROW($A$2)+1)/(($B$2:$B$102=$F$2)*(YEAR($A$2:$A$102)=$E$2)),ROWS(F$5:F29))))","v":""},{"$f":"IF(ROWS(G$5:G29)>$G$2,\"\",INDEX(C$2:C$102,_xlfn.AGGREGATE(15,6,(ROW($A$2:$A$102)-ROW($A$2)+1)/(($B$2:$B$102=$F$2)*(YEAR($A$2:$A$102)=$E$2)),ROWS(G$5:G29))))","v":""},null,null,null,{"$f":"IF(ROWS(K$5:K29)>$G$2,\"\",INDEX(A$2:A$102,SMALL(IF($B$2:$B$102=$F$2,IF(YEAR($A$2:$A$102)=$E$2,ROW($B$2:$B$102)-ROW($B$2)+1)),ROWS(K$5:K29))))","v":""},{"$f":"IF(ROWS(L$5:L29)>$G$2,\"\",INDEX(B$2:B$102,SMALL(IF($B$2:$B$102=$F$2,IF(YEAR($A$2:$A$102)=$E$2,ROW($B$2:$B$102)-ROW($B$2)+1)),ROWS(L$5:L29))))","v":""},{"$f":"IF(ROWS(M$5:M29)>$G$2,\"\",INDEX(C$2:C$102,SMALL(IF($B$2:$B$102=$F$2,IF(YEAR($A$2:$A$102)=$E$2,ROW($B$2:$B$102)-ROW($B$2)+1)),ROWS(M$5:M29))))","v":""}]
["2009-12-14","Gault",88.51,null,{"$f":"IF(ROWS(E$5:E30)>$G$2,\"\",INDEX(A$2:A$102,_xlfn.AGGREGATE(15,6,(ROW($A$2:$A$102)-ROW($A$2)+1)/(($B$2:$B$102=$F$2)*(YEAR($A$2:$A$102)=$E$2)),ROWS(E$5:E30))))","v":""},{"$f":"IF(ROWS(F$5:F30)>$G$2,\"\",INDEX(B$2:B$102,_xlfn.AGGREGATE(15,6,(ROW($A$2:$A$102)-ROW($A$2)+1)/(($B$2:$B$102=$F$2)*(YEAR($A$2:$A$102)=$E$2)),ROWS(F$5:F30))))","v":""},{"$f":"IF(ROWS(G$5:G30)>$G$2,\"\",INDEX(C$2:C$102,_xlfn.AGGREGATE(15,6,(ROW($A$2:$A$102)-ROW($A$2)+1)/(($B$2:$B$102=$F$2)*(YEAR($A$2:$A$102)=$E$2)),ROWS(G$5:G30))))","v":""},null,null,null,{"$f":"IF(ROWS(K$5:K30)>$G$2,\"\",INDEX(A$2:A$102,SMALL(IF($B$2:$B$102=$F$2,IF(YEAR($A$2:$A$102)=$E$2,ROW($B$2:$B$102)-ROW($B$2)+1)),ROWS(K$5:K30))))","v":""},{"$f":"IF(ROWS(L$5:L30)>$G$2,\"\",INDEX(B$2:B$102,SMALL(IF($B$2:$B$102=$F$2,IF(YEAR($A$2:$A$102)=$E$2,ROW($B$2:$B$102)-ROW($B$2)+1)),ROWS(L$5:L30))))","v":""},{"$f":"IF(ROWS(M$5:M30)>$G$2,\"\",INDEX(C$2:C$102,SMALL(IF($B$2:$B$102=$F$2,IF(YEAR($A$2:$A$102)=$E$2,ROW($B$2:$B$102)-ROW($B$2)+1)),ROWS(M$5:M30))))","v":""}]
["2010-02-01","Gault",136.76,null,{"$f":"IF(ROWS(E$5:E31)>$G$2,\"\",INDEX(A$2:A$102,_xlfn.AGGREGATE(15,6,(ROW($A$2:$A$102)-ROW($A$2)+1)/(($B$2:$B$102=$F$2)*(YEAR($A$2:$A$102)=$E$2)),ROWS(E$5:E31))))","v":""},{"$f":"IF(ROWS(F$5:F31)>$G$2,\"\",INDEX(B$2:B$102,_xlfn.AGGREGATE(15,6,(ROW($A$2:$A$102)-ROW($A$2)+1)/(($B$2:$B$102=$F$2)*(YEAR($A$2:$A$102)=$E$2)),ROWS(F$5:F31))))","v":""},{"$f":"IF(ROWS(G$5:G31)>$G$2,\"\",INDEX(C$2:C$102,_xlfn.AGGREGATE(15,6,(ROW($A$2:$A$102)-ROW($A$2)+1)/(($B$2:$B$102=$F$2)*(YEAR($A$2:$A$102)=$E$2)),ROWS(G$5:G31))))","v":""},null,null,null,{"$f":"IF(ROWS(K$5:K31)>$G$2,\"\",INDEX(A$2:A$102,SMALL(IF($B$2:$B$102=$F$2,IF(YEAR($A$2:$A$102)=$E$2,ROW($B$2:$B$102)-ROW($B$2)+1)),ROWS(K$5:K31))))","v":""},{"$f":"IF(ROWS(L$5:L31)>$G$2,\"\",INDEX(B$2:B$102,SMALL(IF($B$2:$B$102=$F$2,IF(YEAR($A$2:$A$102)=$E$2,ROW($B$2:$B$102)-ROW($B$2)+1)),ROWS(L$5:L31))))","v":""},{"$f":"IF(ROWS(M$5:M31)>$G$2,\"\",INDEX(C$2:C$102,SMALL(IF($B$2:$B$102=$F$2,IF(YEAR($A$2:$A$102)=$E$2,ROW($B$2:$B$102)-ROW($B$2)+1)),ROWS(M$5:M31))))","v":""}]
["2009-11-25","Pham",109.57,null,{"$f":"IF(ROWS(E$5:E32)>$G$2,\"\",INDEX(A$2:A$102,_xlfn.AGGREGATE(15,6,(ROW($A$2:$A$102)-ROW($A$2)+1)/(($B$2:$B$102=$F$2)*(YEAR($A$2:$A$102)=$E$2)),ROWS(E$5:E32))))","v":""},{"$f":"IF(ROWS(F$5:F32)>$G$2,\"\",INDEX(B$2:B$102,_xlfn.AGGREGATE(15,6,(ROW($A$2:$A$102)-ROW($A$2)+1)/(($B$2:$B$102=$F$2)*(YEAR($A$2:$A$102)=$E$2)),ROWS(F$5:F32))))","v":""},{"$f":"IF(ROWS(G$5:G32)>$G$2,\"\",INDEX(C$2:C$102,_xlfn.AGGREGATE(15,6,(ROW($A$2:$A$102)-ROW($A$2)+1)/(($B$2:$B$102=$F$2)*(YEAR($A$2:$A$102)=$E$2)),ROWS(G$5:G32))))","v":""},null,null,null,{"$f":"IF(ROWS(K$5:K32)>$G$2,\"\",INDEX(A$2:A$102,SMALL(IF($B$2:$B$102=$F$2,IF(YEAR($A$2:$A$102)=$E$2,ROW($B$2:$B$102)-ROW($B$2)+1)),ROWS(K$5:K32))))","v":""},{"$f":"IF(ROWS(L$5:L32)>$G$2,\"\",INDEX(B$2:B$102,SMALL(IF($B$2:$B$102=$F$2,IF(YEAR($A$2:$A$102)=$E$2,ROW($B$2:$B$102)-ROW($B$2)+1)),ROWS(L$5:L32))))","v":""},{"$f":"IF(ROWS(M$5:M32)>$G$2,\"\",INDEX(C$2:C$102,SMALL(IF($B$2:$B$102=$F$2,IF(YEAR($A$2:$A$102)=$E$2,ROW($B$2:$B$102)-ROW($B$2)+1)),ROWS(M$5:M32))))","v":""}]
["2010-02-07","Franks",125.81,null,{"$f":"IF(ROWS(E$5:E33)>$G$2,\"\",INDEX(A$2:A$102,_xlfn.AGGREGATE(15,6,(ROW($A$2:$A$102)-ROW($A$2)+1)/(($B$2:$B$102=$F$2)*(YEAR($A$2:$A$102)=$E$2)),ROWS(E$5:E33))))","v":""},{"$f":"IF(ROWS(F$5:F33)>$G$2,\"\",INDEX(B$2:B$102,_xlfn.AGGREGATE(15,6,(ROW($A$2:$A$102)-ROW($A$2)+1)/(($B$2:$B$102=$F$2)*(YEAR($A$2:$A$102)=$E$2)),ROWS(F$5:F33))))","v":""},{"$f":"IF(ROWS(G$5:G33)>$G$2,\"\",INDEX(C$2:C$102,_xlfn.AGGREGATE(15,6,(ROW($A$2:$A$102)-ROW($A$2)+1)/(($B$2:$B$102=$F$2)*(YEAR($A$2:$A$102)=$E$2)),ROWS(G$5:G33))))","v":""},null,null,null,{"$f":"IF(ROWS(K$5:K33)>$G$2,\"\",INDEX(A$2:A$102,SMALL(IF($B$2:$B$102=$F$2,IF(YEAR($A$2:$A$102)=$E$2,ROW($B$2:$B$102)-ROW($B$2)+1)),ROWS(K$5:K33))))","v":""},{"$f":"IF(ROWS(L$5:L33)>$G$2,\"\",INDEX(B$2:B$102,SMALL(IF($B$2:$B$102=$F$2,IF(YEAR($A$2:$A$102)=$E$2,ROW($B$2:$B$102)-ROW($B$2)+1)),ROWS(L$5:L33))))","v":""},{"$f":"IF(ROWS(M$5:M33)>$G$2,\"\",INDEX(C$2:C$102,SMALL(IF($B$2:$B$102=$F$2,IF(YEAR($A$2:$A$102)=$E$2,ROW($B$2:$B$102)-ROW($B$2)+1)),ROWS(M$5:M33))))","v":""}]
["2009-12-22","Pham",150.09,null,{"$f":"IF(ROWS(E$5:E34)>$G$2,\"\",INDEX(A$2:A$102,_xlfn.AGGREGATE(15,6,(ROW($A$2:$A$102)-ROW($A$2)+1)/(($B$2:$B$102=$F$2)*(YEAR($A$2:$A$102)=$E$2)),ROWS(E$5:E34))))","v":""},{"$f":"IF(ROWS(F$5:F34)>$G$2,\"\",INDEX(B$2:B$102,_xlfn.AGGREGATE(15,6,(ROW($A$2:$A$102)-ROW($A$2)+1)/(($B$2:$B$102=$F$2)*(YEAR($A$2:$A$102)=$E$2)),ROWS(F$5:F34))))","v":""},{"$f":"IF(ROWS(G$5:G34)>$G$2,\"\",INDEX(C$2:C$102,_xlfn.AGGREGATE(15,6,(ROW($A$2:$A$102)-ROW($A$2)+1)/(($B$2:$B$102=$F$2)*(YEAR($A$2:$A$102)=$E$2)),ROWS(G$5:G34))))","v":""},null,null,null,{"$f":"IF(ROWS(K$5:K34)>$G$2,\"\",INDEX(A$2:A$102,SMALL(IF($B$2:$B$102=$F$2,IF(YEAR($A$2:$A$102)=$E$2,ROW($B$2:$B$102)-ROW($B$2)+1)),ROWS(K$5:K34))))","v":""},{"$f":"IF(ROWS(L$5:L34)>$G$2,\"\",INDEX(B$2:B$102,SMALL(IF($B$2:$B$102=$F$2,IF(YEAR($A$2:$A$102)=$E$2,ROW($B$2:$B$102)-ROW($B$2)+1)),ROWS(L$5:L34))))","v":""},{"$f":"IF(ROWS(M$5:M34)>$G$2,\"\",INDEX(C$2:C$102,SMALL(IF($B$2:$B$102=$F$2,IF(YEAR($A$2:$A$102)=$E$2,ROW($B$2:$B$102)-ROW($B$2)+1)),ROWS(M$5:M34))))","v":""}]
["2009-12-07","Sioux",147.53,null,{"$f":"IF(ROWS(E$5:E35)>$G$2,\"\",INDEX(A$2:A$102,_xlfn.AGGREGATE(15,6,(ROW($A$2:$A$102)-ROW($A$2)+1)/(($B$2:$B$102=$F$2)*(YEAR($A$2:$A$102)=$E$2)),ROWS(E$5:E35))))","v":""},{"$f":"IF(ROWS(F$5:F35)>$G$2,\"\",INDEX(B$2:B$102,_xlfn.AGGREGATE(15,6,(ROW($A$2:$A$102)-ROW($A$2)+1)/(($B$2:$B$102=$F$2)*(YEAR($A$2:$A$102)=$E$2)),ROWS(F$5:F35))))","v":""},{"$f":"IF(ROWS(G$5:G35)>$G$2,\"\",INDEX(C$2:C$102,_xlfn.AGGREGATE(15,6,(ROW($A$2:$A$102)-ROW($A$2)+1)/(($B$2:$B$102=$F$2)*(YEAR($A$2:$A$102)=$E$2)),ROWS(G$5:G35))))","v":""},null,null,null,{"$f":"IF(ROWS(K$5:K35)>$G$2,\"\",INDEX(A$2:A$102,SMALL(IF($B$2:$B$102=$F$2,IF(YEAR($A$2:$A$102)=$E$2,ROW($B$2:$B$102)-ROW($B$2)+1)),ROWS(K$5:K35))))","v":""},{"$f":"IF(ROWS(L$5:L35)>$G$2,\"\",INDEX(B$2:B$102,SMALL(IF($B$2:$B$102=$F$2,IF(YEAR($A$2:$A$102)=$E$2,ROW($B$2:$B$102)-ROW($B$2)+1)),ROWS(L$5:L35))))","v":""},{"$f":"IF(ROWS(M$5:M35)>$G$2,\"\",INDEX(C$2:C$102,SMALL(IF($B$2:$B$102=$F$2,IF(YEAR($A$2:$A$102)=$E$2,ROW($B$2:$B$102)-ROW($B$2)+1)),ROWS(M$5:M35))))","v":""}]
["2009-12-12","Chin",102.17,null,{"$f":"IF(ROWS(E$5:E36)>$G$2,\"\",INDEX(A$2:A$102,_xlfn.AGGREGATE(15,6,(ROW($A$2:$A$102)-ROW($A$2)+1)/(($B$2:$B$102=$F$2)*(YEAR($A$2:$A$102)=$E$2)),ROWS(E$5:E36))))","v":""},{"$f":"IF(ROWS(F$5:F36)>$G$2,\"\",INDEX(B$2:B$102,_xlfn.AGGREGATE(15,6,(ROW($A$2:$A$102)-ROW($A$2)+1)/(($B$2:$B$102=$F$2)*(YEAR($A$2:$A$102)=$E$2)),ROWS(F$5:F36))))","v":""},{"$f":"IF(ROWS(G$5:G36)>$G$2,\"\",INDEX(C$2:C$102,_xlfn.AGGREGATE(15,6,(ROW($A$2:$A$102)-ROW($A$2)+1)/(($B$2:$B$102=$F$2)*(YEAR($A$2:$A$102)=$E$2)),ROWS(G$5:G36))))","v":""},null,null,null,{"$f":"IF(ROWS(K$5:K36)>$G$2,\"\",INDEX(A$2:A$102,SMALL(IF($B$2:$B$102=$F$2,IF(YEAR($A$2:$A$102)=$E$2,ROW($B$2:$B$102)-ROW($B$2)+1)),ROWS(K$5:K36))))","v":""},{"$f":"IF(ROWS(L$5:L36)>$G$2,\"\",INDEX(B$2:B$102,SMALL(IF($B$2:$B$102=$F$2,IF(YEAR($A$2:$A$102)=$E$2,ROW($B$2:$B$102)-ROW($B$2)+1)),ROWS(L$5:L36))))","v":""},{"$f":"IF(ROWS(M$5:M36)>$G$2,\"\",INDEX(C$2:C$102,SMALL(IF($B$2:$B$102=$F$2,IF(YEAR($A$2:$A$102)=$E$2,ROW($B$2:$B$102)-ROW($B$2)+1)),ROWS(M$5:M36))))","v":""}]
["2009-12-30","Smith",114.4,null,{"$f":"IF(ROWS(E$5:E37)>$G$2,\"\",INDEX(A$2:A$102,_xlfn.AGGREGATE(15,6,(ROW($A$2:$A$102)-ROW($A$2)+1)/(($B$2:$B$102=$F$2)*(YEAR($A$2:$A$102)=$E$2)),ROWS(E$5:E37))))","v":""},{"$f":"IF(ROWS(F$5:F37)>$G$2,\"\",INDEX(B$2:B$102,_xlfn.AGGREGATE(15,6,(ROW($A$2:$A$102)-ROW($A$2)+1)/(($B$2:$B$102=$F$2)*(YEAR($A$2:$A$102)=$E$2)),ROWS(F$5:F37))))","v":""},{"$f":"IF(ROWS(G$5:G37)>$G$2,\"\",INDEX(C$2:C$102,_xlfn.AGGREGATE(15,6,(ROW($A$2:$A$102)-ROW($A$2)+1)/(($B$2:$B$102=$F$2)*(YEAR($A$2:$A$102)=$E$2)),ROWS(G$5:G37))))","v":""},null,null,null,{"$f":"IF(ROWS(K$5:K37)>$G$2,\"\",INDEX(A$2:A$102,SMALL(IF($B$2:$B$102=$F$2,IF(YEAR($A$2:$A$102)=$E$2,ROW($B$2:$B$102)-ROW($B$2)+1)),ROWS(K$5:K37))))","v":""},{"$f":"IF(ROWS(L$5:L37)>$G$2,\"\",INDEX(B$2:B$102,SMALL(IF($B$2:$B$102=$F$2,IF(YEAR($A$2:$A$102)=$E$2,ROW($B$2:$B$102)-ROW($B$2)+1)),ROWS(L$5:L37))))","v":""},{"$f":"IF(ROWS(M$5:M37)>$G$2,\"\",INDEX(C$2:C$102,SMALL(IF($B$2:$B$102=$F$2,IF(YEAR($A$2:$A$102)=$E$2,ROW($B$2:$B$102)-ROW($B$2)+1)),ROWS(M$5:M37))))","v":""}]
["2009-12-27","Chin",129.65,null,{"$f":"IF(ROWS(E$5:E38)>$G$2,\"\",INDEX(A$2:A$102,_xlfn.AGGREGATE(15,6,(ROW($A$2:$A$102)-ROW($A$2)+1)/(($B$2:$B$102=$F$2)*(YEAR($A$2:$A$102)=$E$2)),ROWS(E$5:E38))))","v":""},{"$f":"IF(ROWS(F$5:F38)>$G$2,\"\",INDEX(B$2:B$102,_xlfn.AGGREGATE(15,6,(ROW($A$2:$A$102)-ROW($A$2)+1)/(($B$2:$B$102=$F$2)*(YEAR($A$2:$A$102)=$E$2)),ROWS(F$5:F38))))","v":""},{"$f":"IF(ROWS(G$5:G38)>$G$2,\"\",INDEX(C$2:C$102,_xlfn.AGGREGATE(15,6,(ROW($A$2:$A$102)-ROW($A$2)+1)/(($B$2:$B$102=$F$2)*(YEAR($A$2:$A$102)=$E$2)),ROWS(G$5:G38))))","v":""},null,null,null,{"$f":"IF(ROWS(K$5:K38)>$G$2,\"\",INDEX(A$2:A$102,SMALL(IF($B$2:$B$102=$F$2,IF(YEAR($A$2:$A$102)=$E$2,ROW($B$2:$B$102)-ROW($B$2)+1)),ROWS(K$5:K38))))","v":""},{"$f":"IF(ROWS(L$5:L38)>$G$2,\"\",INDEX(B$2:B$102,SMALL(IF($B$2:$B$102=$F$2,IF(YEAR($A$2:$A$102)=$E$2,ROW($B$2:$B$102)-ROW($B$2)+1)),ROWS(L$5:L38))))","v":""},{"$f":"IF(ROWS(M$5:M38)>$G$2,\"\",INDEX(C$2:C$102,SMALL(IF($B$2:$B$102=$F$2,IF(YEAR($A$2:$A$102)=$E$2,ROW($B$2:$B$102)-ROW($B$2)+1)),ROWS(M$5:M38))))","v":""}]
["2009-12-29","Chin",128.94999999999999,null,{"$f":"IF(ROWS(E$5:E39)>$G$2,\"\",INDEX(A$2:A$102,_xlfn.AGGREGATE(15,6,(ROW($A$2:$A$102)-ROW($A$2)+1)/(($B$2:$B$102=$F$2)*(YEAR($A$2:$A$102)=$E$2)),ROWS(E$5:E39))))","v":""},{"$f":"IF(ROWS(F$5:F39)>$G$2,\"\",INDEX(B$2:B$102,_xlfn.AGGREGATE(15,6,(ROW($A$2:$A$102)-ROW($A$2)+1)/(($B$2:$B$102=$F$2)*(YEAR($A$2:$A$102)=$E$2)),ROWS(F$5:F39))))","v":""},{"$f":"IF(ROWS(G$5:G39)>$G$2,\"\",INDEX(C$2:C$102,_xlfn.AGGREGATE(15,6,(ROW($A$2:$A$102)-ROW($A$2)+1)/(($B$2:$B$102=$F$2)*(YEAR($A$2:$A$102)=$E$2)),ROWS(G$5:G39))))","v":""},null,null,null,{"$f":"IF(ROWS(K$5:K39)>$G$2,\"\",INDEX(A$2:A$102,SMALL(IF($B$2:$B$102=$F$2,IF(YEAR($A$2:$A$102)=$E$2,ROW($B$2:$B$102)-ROW($B$2)+1)),ROWS(K$5:K39))))","v":""},{"$f":"IF(ROWS(L$5:L39)>$G$2,\"\",INDEX(B$2:B$102,SMALL(IF($B$2:$B$102=$F$2,IF(YEAR($A$2:$A$102)=$E$2,ROW($B$2:$B$102)-ROW($B$2)+1)),ROWS(L$5:L39))))","v":""},{"$f":"IF(ROWS(M$5:M39)>$G$2,\"\",INDEX(C$2:C$102,SMALL(IF($B$2:$B$102=$F$2,IF(YEAR($A$2:$A$102)=$E$2,ROW($B$2:$B$102)-ROW($B$2)+1)),ROWS(M$5:M39))))","v":""}]
["2010-01-05","Gault",121.33,null,{"$f":"IF(ROWS(E$5:E40)>$G$2,\"\",INDEX(A$2:A$102,_xlfn.AGGREGATE(15,6,(ROW($A$2:$A$102)-ROW($A$2)+1)/(($B$2:$B$102=$F$2)*(YEAR($A$2:$A$102)=$E$2)),ROWS(E$5:E40))))","v":""},{"$f":"IF(ROWS(F$5:F40)>$G$2,\"\",INDEX(B$2:B$102,_xlfn.AGGREGATE(15,6,(ROW($A$2:$A$102)-ROW($A$2)+1)/(($B$2:$B$102=$F$2)*(YEAR($A$2:$A$102)=$E$2)),ROWS(F$5:F40))))","v":""},{"$f":"IF(ROWS(G$5:G40)>$G$2,\"\",INDEX(C$2:C$102,_xlfn.AGGREGATE(15,6,(ROW($A$2:$A$102)-ROW($A$2)+1)/(($B$2:$B$102=$F$2)*(YEAR($A$2:$A$102)=$E$2)),ROWS(G$5:G40))))","v":""},null,null,null,{"$f":"IF(ROWS(K$5:K40)>$G$2,\"\",INDEX(A$2:A$102,SMALL(IF($B$2:$B$102=$F$2,IF(YEAR($A$2:$A$102)=$E$2,ROW($B$2:$B$102)-ROW($B$2)+1)),ROWS(K$5:K40))))","v":""},{"$f":"IF(ROWS(L$5:L40)>$G$2,\"\",INDEX(B$2:B$102,SMALL(IF($B$2:$B$102=$F$2,IF(YEAR($A$2:$A$102)=$E$2,ROW($B$2:$B$102)-ROW($B$2)+1)),ROWS(L$5:L40))))","v":""},{"$f":"IF(ROWS(M$5:M40)>$G$2,\"\",INDEX(C$2:C$102,SMALL(IF($B$2:$B$102=$F$2,IF(YEAR($A$2:$A$102)=$E$2,ROW($B$2:$B$102)-ROW($B$2)+1)),ROWS(M$5:M40))))","v":""}]
["2009-12-15","Pham",102.64,null,{"$f":"IF(ROWS(E$5:E41)>$G$2,\"\",INDEX(A$2:A$102,_xlfn.AGGREGATE(15,6,(ROW($A$2:$A$102)-ROW($A$2)+1)/(($B$2:$B$102=$F$2)*(YEAR($A$2:$A$102)=$E$2)),ROWS(E$5:E41))))","v":""},{"$f":"IF(ROWS(F$5:F41)>$G$2,\"\",INDEX(B$2:B$102,_xlfn.AGGREGATE(15,6,(ROW($A$2:$A$102)-ROW($A$2)+1)/(($B$2:$B$102=$F$2)*(YEAR($A$2:$A$102)=$E$2)),ROWS(F$5:F41))))","v":""},{"$f":"IF(ROWS(G$5:G41)>$G$2,\"\",INDEX(C$2:C$102,_xlfn.AGGREGATE(15,6,(ROW($A$2:$A$102)-ROW($A$2)+1)/(($B$2:$B$102=$F$2)*(YEAR($A$2:$A$102)=$E$2)),ROWS(G$5:G41))))","v":""},null,null,null,{"$f":"IF(ROWS(K$5:K41)>$G$2,\"\",INDEX(A$2:A$102,SMALL(IF($B$2:$B$102=$F$2,IF(YEAR($A$2:$A$102)=$E$2,ROW($B$2:$B$102)-ROW($B$2)+1)),ROWS(K$5:K41))))","v":""},{"$f":"IF(ROWS(L$5:L41)>$G$2,\"\",INDEX(B$2:B$102,SMALL(IF($B$2:$B$102=$F$2,IF(YEAR($A$2:$A$102)=$E$2,ROW($B$2:$B$102)-ROW($B$2)+1)),ROWS(L$5:L41))))","v":""},{"$f":"IF(ROWS(M$5:M41)>$G$2,\"\",INDEX(C$2:C$102,SMALL(IF($B$2:$B$102=$F$2,IF(YEAR($A$2:$A$102)=$E$2,ROW($B$2:$B$102)-ROW($B$2)+1)),ROWS(M$5:M41))))","v":""}]
["2009-12-01","Pham",132.12,null,{"$f":"IF(ROWS(E$5:E42)>$G$2,\"\",INDEX(A$2:A$102,_xlfn.AGGREGATE(15,6,(ROW($A$2:$A$102)-ROW($A$2)+1)/(($B$2:$B$102=$F$2)*(YEAR($A$2:$A$102)=$E$2)),ROWS(E$5:E42))))","v":""},{"$f":"IF(ROWS(F$5:F42)>$G$2,\"\",INDEX(B$2:B$102,_xlfn.AGGREGATE(15,6,(ROW($A$2:$A$102)-ROW($A$2)+1)/(($B$2:$B$102=$F$2)*(YEAR($A$2:$A$102)=$E$2)),ROWS(F$5:F42))))","v":""},{"$f":"IF(ROWS(G$5:G42)>$G$2,\"\",INDEX(C$2:C$102,_xlfn.AGGREGATE(15,6,(ROW($A$2:$A$102)-ROW($A$2)+1)/(($B$2:$B$102=$F$2)*(YEAR($A$2:$A$102)=$E$2)),ROWS(G$5:G42))))","v":""},null,null,null,{"$f":"IF(ROWS(K$5:K42)>$G$2,\"\",INDEX(A$2:A$102,SMALL(IF($B$2:$B$102=$F$2,IF(YEAR($A$2:$A$102)=$E$2,ROW($B$2:$B$102)-ROW($B$2)+1)),ROWS(K$5:K42))))","v":""},{"$f":"IF(ROWS(L$5:L42)>$G$2,\"\",INDEX(B$2:B$102,SMALL(IF($B$2:$B$102=$F$2,IF(YEAR($A$2:$A$102)=$E$2,ROW($B$2:$B$102)-ROW($B$2)+1)),ROWS(L$5:L42))))","v":""},{"$f":"IF(ROWS(M$5:M42)>$G$2,\"\",INDEX(C$2:C$102,SMALL(IF($B$2:$B$102=$F$2,IF(YEAR($A$2:$A$102)=$E$2,ROW($B$2:$B$102)-ROW($B$2)+1)),ROWS(M$5:M42))))","v":""}]
["2010-02-07","Franks",100.83,null,{"$f":"IF(ROWS(E$5:E43)>$G$2,\"\",INDEX(A$2:A$102,_xlfn.AGGREGATE(15,6,(ROW($A$2:$A$102)-ROW($A$2)+1)/(($B$2:$B$102=$F$2)*(YEAR($A$2:$A$102)=$E$2)),ROWS(E$5:E43))))","v":""},{"$f":"IF(ROWS(F$5:F43)>$G$2,\"\",INDEX(B$2:B$102,_xlfn.AGGREGATE(15,6,(ROW($A$2:$A$102)-ROW($A$2)+1)/(($B$2:$B$102=$F$2)*(YEAR($A$2:$A$102)=$E$2)),ROWS(F$5:F43))))","v":""},{"$f":"IF(ROWS(G$5:G43)>$G$2,\"\",INDEX(C$2:C$102,_xlfn.AGGREGATE(15,6,(ROW($A$2:$A$102)-ROW($A$2)+1)/(($B$2:$B$102=$F$2)*(YEAR($A$2:$A$102)=$E$2)),ROWS(G$5:G43))))","v":""},null,null,null,{"$f":"IF(ROWS(K$5:K43)>$G$2,\"\",INDEX(A$2:A$102,SMALL(IF($B$2:$B$102=$F$2,IF(YEAR($A$2:$A$102)=$E$2,ROW($B$2:$B$102)-ROW($B$2)+1)),ROWS(K$5:K43))))","v":""},{"$f":"IF(ROWS(L$5:L43)>$G$2,\"\",INDEX(B$2:B$102,SMALL(IF($B$2:$B$102=$F$2,IF(YEAR($A$2:$A$102)=$E$2,ROW($B$2:$B$102)-ROW($B$2)+1)),ROWS(L$5:L43))))","v":""},{"$f":"IF(ROWS(M$5:M43)>$G$2,\"\",INDEX(C$2:C$102,SMALL(IF($B$2:$B$102=$F$2,IF(YEAR($A$2:$A$102)=$E$2,ROW($B$2:$B$102)-ROW($B$2)+1)),ROWS(M$5:M43))))","v":""}]
["2009-11-26","Sioux",79.42,null,{"$f":"IF(ROWS(E$5:E44)>$G$2,\"\",INDEX(A$2:A$102,_xlfn.AGGREGATE(15,6,(ROW($A$2:$A$102)-ROW($A$2)+1)/(($B$2:$B$102=$F$2)*(YEAR($A$2:$A$102)=$E$2)),ROWS(E$5:E44))))","v":""},{"$f":"IF(ROWS(F$5:F44)>$G$2,\"\",INDEX(B$2:B$102,_xlfn.AGGREGATE(15,6,(ROW($A$2:$A$102)-ROW($A$2)+1)/(($B$2:$B$102=$F$2)*(YEAR($A$2:$A$102)=$E$2)),ROWS(F$5:F44))))","v":""},{"$f":"IF(ROWS(G$5:G44)>$G$2,\"\",INDEX(C$2:C$102,_xlfn.AGGREGATE(15,6,(ROW($A$2:$A$102)-ROW($A$2)+1)/(($B$2:$B$102=$F$2)*(YEAR($A$2:$A$102)=$E$2)),ROWS(G$5:G44))))","v":""},null,null,null,{"$f":"IF(ROWS(K$5:K44)>$G$2,\"\",INDEX(A$2:A$102,SMALL(IF($B$2:$B$102=$F$2,IF(YEAR($A$2:$A$102)=$E$2,ROW($B$2:$B$102)-ROW($B$2)+1)),ROWS(K$5:K44))))","v":""},{"$f":"IF(ROWS(L$5:L44)>$G$2,\"\",INDEX(B$2:B$102,SMALL(IF($B$2:$B$102=$F$2,IF(YEAR($A$2:$A$102)=$E$2,ROW($B$2:$B$102)-ROW($B$2)+1)),ROWS(L$5:L44))))","v":""},{"$f":"IF(ROWS(M$5:M44)>$G$2,\"\",INDEX(C$2:C$102,SMALL(IF($B$2:$B$102=$F$2,IF(YEAR($A$2:$A$102)=$E$2,ROW($B$2:$B$102)-ROW($B$2)+1)),ROWS(M$5:M44))))","v":""}]
["2010-01-04","Pham",100.09,null,{"$f":"IF(ROWS(E$5:E45)>$G$2,\"\",INDEX(A$2:A$102,_xlfn.AGGREGATE(15,6,(ROW($A$2:$A$102)-ROW($A$2)+1)/(($B$2:$B$102=$F$2)*(YEAR($A$2:$A$102)=$E$2)),ROWS(E$5:E45))))","v":""},{"$f":"IF(ROWS(F$5:F45)>$G$2,\"\",INDEX(B$2:B$102,_xlfn.AGGREGATE(15,6,(ROW($A$2:$A$102)-ROW($A$2)+1)/(($B$2:$B$102=$F$2)*(YEAR($A$2:$A$102)=$E$2)),ROWS(F$5:F45))))","v":""},{"$f":"IF(ROWS(G$5:G45)>$G$2,\"\",INDEX(C$2:C$102,_xlfn.AGGREGATE(15,6,(ROW($A$2:$A$102)-ROW($A$2)+1)/(($B$2:$B$102=$F$2)*(YEAR($A$2:$A$102)=$E$2)),ROWS(G$5:G45))))","v":""},null,null,null,{"$f":"IF(ROWS(K$5:K45)>$G$2,\"\",INDEX(A$2:A$102,SMALL(IF($B$2:$B$102=$F$2,IF(YEAR($A$2:$A$102)=$E$2,ROW($B$2:$B$102)-ROW($B$2)+1)),ROWS(K$5:K45))))","v":""},{"$f":"IF(ROWS(L$5:L45)>$G$2,\"\",INDEX(B$2:B$102,SMALL(IF($B$2:$B$102=$F$2,IF(YEAR($A$2:$A$102)=$E$2,ROW($B$2:$B$102)-ROW($B$2)+1)),ROWS(L$5:L45))))","v":""},{"$f":"IF(ROWS(M$5:M45)>$G$2,\"\",INDEX(C$2:C$102,SMALL(IF($B$2:$B$102=$F$2,IF(YEAR($A$2:$A$102)=$E$2,ROW($B$2:$B$102)-ROW($B$2)+1)),ROWS(M$5:M45))))","v":""}]
["2010-01-29","Franks",83.37,null,{"$f":"IF(ROWS(E$5:E46)>$G$2,\"\",INDEX(A$2:A$102,_xlfn.AGGREGATE(15,6,(ROW($A$2:$A$102)-ROW($A$2)+1)/(($B$2:$B$102=$F$2)*(YEAR($A$2:$A$102)=$E$2)),ROWS(E$5:E46))))","v":""},{"$f":"IF(ROWS(F$5:F46)>$G$2,\"\",INDEX(B$2:B$102,_xlfn.AGGREGATE(15,6,(ROW($A$2:$A$102)-ROW($A$2)+1)/(($B$2:$B$102=$F$2)*(YEAR($A$2:$A$102)=$E$2)),ROWS(F$5:F46))))","v":""},{"$f":"IF(ROWS(G$5:G46)>$G$2,\"\",INDEX(C$2:C$102,_xlfn.AGGREGATE(15,6,(ROW($A$2:$A$102)-ROW($A$2)+1)/(($B$2:$B$102=$F$2)*(YEAR($A$2:$A$102)=$E$2)),ROWS(G$5:G46))))","v":""},null,null,null,{"$f":"IF(ROWS(K$5:K46)>$G$2,\"\",INDEX(A$2:A$102,SMALL(IF($B$2:$B$102=$F$2,IF(YEAR($A$2:$A$102)=$E$2,ROW($B$2:$B$102)-ROW($B$2)+1)),ROWS(K$5:K46))))","v":""},{"$f":"IF(ROWS(L$5:L46)>$G$2,\"\",INDEX(B$2:B$102,SMALL(IF($B$2:$B$102=$F$2,IF(YEAR($A$2:$A$102)=$E$2,ROW($B$2:$B$102)-ROW($B$2)+1)),ROWS(L$5:L46))))","v":""},{"$f":"IF(ROWS(M$5:M46)>$G$2,\"\",INDEX(C$2:C$102,SMALL(IF($B$2:$B$102=$F$2,IF(YEAR($A$2:$A$102)=$E$2,ROW($B$2:$B$102)-ROW($B$2)+1)),ROWS(M$5:M46))))","v":""}]
["2010-01-19","Franks",89.11,null,{"$f":"IF(ROWS(E$5:E47)>$G$2,\"\",INDEX(A$2:A$102,_xlfn.AGGREGATE(15,6,(ROW($A$2:$A$102)-ROW($A$2)+1)/(($B$2:$B$102=$F$2)*(YEAR($A$2:$A$102)=$E$2)),ROWS(E$5:E47))))","v":""},{"$f":"IF(ROWS(F$5:F47)>$G$2,\"\",INDEX(B$2:B$102,_xlfn.AGGREGATE(15,6,(ROW($A$2:$A$102)-ROW($A$2)+1)/(($B$2:$B$102=$F$2)*(YEAR($A$2:$A$102)=$E$2)),ROWS(F$5:F47))))","v":""},{"$f":"IF(ROWS(G$5:G47)>$G$2,\"\",INDEX(C$2:C$102,_xlfn.AGGREGATE(15,6,(ROW($A$2:$A$102)-ROW($A$2)+1)/(($B$2:$B$102=$F$2)*(YEAR($A$2:$A$102)=$E$2)),ROWS(G$5:G47))))","v":""},null,null,null,{"$f":"IF(ROWS(K$5:K47)>$G$2,\"\",INDEX(A$2:A$102,SMALL(IF($B$2:$B$102=$F$2,IF(YEAR($A$2:$A$102)=$E$2,ROW($B$2:$B$102)-ROW($B$2)+1)),ROWS(K$5:K47))))","v":""},{"$f":"IF(ROWS(L$5:L47)>$G$2,\"\",INDEX(B$2:B$102,SMALL(IF($B$2:$B$102=$F$2,IF(YEAR($A$2:$A$102)=$E$2,ROW($B$2:$B$102)-ROW($B$2)+1)),ROWS(L$5:L47))))","v":""},{"$f":"IF(ROWS(M$5:M47)>$G$2,\"\",INDEX(C$2:C$102,SMALL(IF($B$2:$B$102=$F$2,IF(YEAR($A$2:$A$102)=$E$2,ROW($B$2:$B$102)-ROW($B$2)+1)),ROWS(M$5:M47))))","v":""}]
["2010-02-14","Smith",126.97,null,{"$f":"IF(ROWS(E$5:E48)>$G$2,\"\",INDEX(A$2:A$102,_xlfn.AGGREGATE(15,6,(ROW($A$2:$A$102)-ROW($A$2)+1)/(($B$2:$B$102=$F$2)*(YEAR($A$2:$A$102)=$E$2)),ROWS(E$5:E48))))","v":""},{"$f":"IF(ROWS(F$5:F48)>$G$2,\"\",INDEX(B$2:B$102,_xlfn.AGGREGATE(15,6,(ROW($A$2:$A$102)-ROW($A$2)+1)/(($B$2:$B$102=$F$2)*(YEAR($A$2:$A$102)=$E$2)),ROWS(F$5:F48))))","v":""},{"$f":"IF(ROWS(G$5:G48)>$G$2,\"\",INDEX(C$2:C$102,_xlfn.AGGREGATE(15,6,(ROW($A$2:$A$102)-ROW($A$2)+1)/(($B$2:$B$102=$F$2)*(YEAR($A$2:$A$102)=$E$2)),ROWS(G$5:G48))))","v":""},null,null,null,{"$f":"IF(ROWS(K$5:K48)>$G$2,\"\",INDEX(A$2:A$102,SMALL(IF($B$2:$B$102=$F$2,IF(YEAR($A$2:$A$102)=$E$2,ROW($B$2:$B$102)-ROW($B$2)+1)),ROWS(K$5:K48))))","v":""},{"$f":"IF(ROWS(L$5:L48)>$G$2,\"\",INDEX(B$2:B$102,SMALL(IF($B$2:$B$102=$F$2,IF(YEAR($A$2:$A$102)=$E$2,ROW($B$2:$B$102)-ROW($B$2)+1)),ROWS(L$5:L48))))","v":""},{"$f":"IF(ROWS(M$5:M48)>$G$2,\"\",INDEX(C$2:C$102,SMALL(IF($B$2:$B$102=$F$2,IF(YEAR($A$2:$A$102)=$E$2,ROW($B$2:$B$102)-ROW($B$2)+1)),ROWS(M$5:M48))))","v":""}]
["2009-12-03","Smith",154.31,null,{"$f":"IF(ROWS(E$5:E49)>$G$2,\"\",INDEX(A$2:A$102,_xlfn.AGGREGATE(15,6,(ROW($A$2:$A$102)-ROW($A$2)+1)/(($B$2:$B$102=$F$2)*(YEAR($A$2:$A$102)=$E$2)),ROWS(E$5:E49))))","v":""},{"$f":"IF(ROWS(F$5:F49)>$G$2,\"\",INDEX(B$2:B$102,_xlfn.AGGREGATE(15,6,(ROW($A$2:$A$102)-ROW($A$2)+1)/(($B$2:$B$102=$F$2)*(YEAR($A$2:$A$102)=$E$2)),ROWS(F$5:F49))))","v":""},{"$f":"IF(ROWS(G$5:G49)>$G$2,\"\",INDEX(C$2:C$102,_xlfn.AGGREGATE(15,6,(ROW($A$2:$A$102)-ROW($A$2)+1)/(($B$2:$B$102=$F$2)*(YEAR($A$2:$A$102)=$E$2)),ROWS(G$5:G49))))","v":""},null,null,null,{"$f":"IF(ROWS(K$5:K49)>$G$2,\"\",INDEX(A$2:A$102,SMALL(IF($B$2:$B$102=$F$2,IF(YEAR($A$2:$A$102)=$E$2,ROW($B$2:$B$102)-ROW($B$2)+1)),ROWS(K$5:K49))))","v":""},{"$f":"IF(ROWS(L$5:L49)>$G$2,\"\",INDEX(B$2:B$102,SMALL(IF($B$2:$B$102=$F$2,IF(YEAR($A$2:$A$102)=$E$2,ROW($B$2:$B$102)-ROW($B$2)+1)),ROWS(L$5:L49))))","v":""},{"$f":"IF(ROWS(M$5:M49)>$G$2,\"\",INDEX(C$2:C$102,SMALL(IF($B$2:$B$102=$F$2,IF(YEAR($A$2:$A$102)=$E$2,ROW($B$2:$B$102)-ROW($B$2)+1)),ROWS(M$5:M49))))","v":""}]
["2010-01-02","Sioux",76.59,null,{"$f":"IF(ROWS(E$5:E50)>$G$2,\"\",INDEX(A$2:A$102,_xlfn.AGGREGATE(15,6,(ROW($A$2:$A$102)-ROW($A$2)+1)/(($B$2:$B$102=$F$2)*(YEAR($A$2:$A$102)=$E$2)),ROWS(E$5:E50))))","v":""},{"$f":"IF(ROWS(F$5:F50)>$G$2,\"\",INDEX(B$2:B$102,_xlfn.AGGREGATE(15,6,(ROW($A$2:$A$102)-ROW($A$2)+1)/(($B$2:$B$102=$F$2)*(YEAR($A$2:$A$102)=$E$2)),ROWS(F$5:F50))))","v":""},{"$f":"IF(ROWS(G$5:G50)>$G$2,\"\",INDEX(C$2:C$102,_xlfn.AGGREGATE(15,6,(ROW($A$2:$A$102)-ROW($A$2)+1)/(($B$2:$B$102=$F$2)*(YEAR($A$2:$A$102)=$E$2)),ROWS(G$5:G50))))","v":""},null,null,null,{"$f":"IF(ROWS(K$5:K50)>$G$2,\"\",INDEX(A$2:A$102,SMALL(IF($B$2:$B$102=$F$2,IF(YEAR($A$2:$A$102)=$E$2,ROW($B$2:$B$102)-ROW($B$2)+1)),ROWS(K$5:K50))))","v":""},{"$f":"IF(ROWS(L$5:L50)>$G$2,\"\",INDEX(B$2:B$102,SMALL(IF($B$2:$B$102=$F$2,IF(YEAR($A$2:$A$102)=$E$2,ROW($B$2:$B$102)-ROW($B$2)+1)),ROWS(L$5:L50))))","v":""},{"$f":"IF(ROWS(M$5:M50)>$G$2,\"\",INDEX(C$2:C$102,SMALL(IF($B$2:$B$102=$F$2,IF(YEAR($A$2:$A$102)=$E$2,ROW($B$2:$B$102)-ROW($B$2)+1)),ROWS(M$5:M50))))","v":""}]
["2009-12-29","Gault",106.94,null,{"$f":"IF(ROWS(E$5:E51)>$G$2,\"\",INDEX(A$2:A$102,_xlfn.AGGREGATE(15,6,(ROW($A$2:$A$102)-ROW($A$2)+1)/(($B$2:$B$102=$F$2)*(YEAR($A$2:$A$102)=$E$2)),ROWS(E$5:E51))))","v":""},{"$f":"IF(ROWS(F$5:F51)>$G$2,\"\",INDEX(B$2:B$102,_xlfn.AGGREGATE(15,6,(ROW($A$2:$A$102)-ROW($A$2)+1)/(($B$2:$B$102=$F$2)*(YEAR($A$2:$A$102)=$E$2)),ROWS(F$5:F51))))","v":""},{"$f":"IF(ROWS(G$5:G51)>$G$2,\"\",INDEX(C$2:C$102,_xlfn.AGGREGATE(15,6,(ROW($A$2:$A$102)-ROW($A$2)+1)/(($B$2:$B$102=$F$2)*(YEAR($A$2:$A$102)=$E$2)),ROWS(G$5:G51))))","v":""},null,null,null,{"$f":"IF(ROWS(K$5:K51)>$G$2,\"\",INDEX(A$2:A$102,SMALL(IF($B$2:$B$102=$F$2,IF(YEAR($A$2:$A$102)=$E$2,ROW($B$2:$B$102)-ROW($B$2)+1)),ROWS(K$5:K51))))","v":""},{"$f":"IF(ROWS(L$5:L51)>$G$2,\"\",INDEX(B$2:B$102,SMALL(IF($B$2:$B$102=$F$2,IF(YEAR($A$2:$A$102)=$E$2,ROW($B$2:$B$102)-ROW($B$2)+1)),ROWS(L$5:L51))))","v":""},{"$f":"IF(ROWS(M$5:M51)>$G$2,\"\",INDEX(C$2:C$102,SMALL(IF($B$2:$B$102=$F$2,IF(YEAR($A$2:$A$102)=$E$2,ROW($B$2:$B$102)-ROW($B$2)+1)),ROWS(M$5:M51))))","v":""}]
["2009-11-26","Chin",129.86000000000001,null,{"$f":"IF(ROWS(E$5:E52)>$G$2,\"\",INDEX(A$2:A$102,_xlfn.AGGREGATE(15,6,(ROW($A$2:$A$102)-ROW($A$2)+1)/(($B$2:$B$102=$F$2)*(YEAR($A$2:$A$102)=$E$2)),ROWS(E$5:E52))))","v":""},{"$f":"IF(ROWS(F$5:F52)>$G$2,\"\",INDEX(B$2:B$102,_xlfn.AGGREGATE(15,6,(ROW($A$2:$A$102)-ROW($A$2)+1)/(($B$2:$B$102=$F$2)*(YEAR($A$2:$A$102)=$E$2)),ROWS(F$5:F52))))","v":""},{"$f":"IF(ROWS(G$5:G52)>$G$2,\"\",INDEX(C$2:C$102,_xlfn.AGGREGATE(15,6,(ROW($A$2:$A$102)-ROW($A$2)+1)/(($B$2:$B$102=$F$2)*(YEAR($A$2:$A$102)=$E$2)),ROWS(G$5:G52))))","v":""},null,null,null,{"$f":"IF(ROWS(K$5:K52)>$G$2,\"\",INDEX(A$2:A$102,SMALL(IF($B$2:$B$102=$F$2,IF(YEAR($A$2:$A$102)=$E$2,ROW($B$2:$B$102)-ROW($B$2)+1)),ROWS(K$5:K52))))","v":""},{"$f":"IF(ROWS(L$5:L52)>$G$2,\"\",INDEX(B$2:B$102,SMALL(IF($B$2:$B$102=$F$2,IF(YEAR($A$2:$A$102)=$E$2,ROW($B$2:$B$102)-ROW($B$2)+1)),ROWS(L$5:L52))))","v":""},{"$f":"IF(ROWS(M$5:M52)>$G$2,\"\",INDEX(C$2:C$102,SMALL(IF($B$2:$B$102=$F$2,IF(YEAR($A$2:$A$102)=$E$2,ROW($B$2:$B$102)-ROW($B$2)+1)),ROWS(M$5:M52))))","v":""}]
["2009-12-24","Pham",100.76,null,{"$f":"IF(ROWS(E$5:E53)>$G$2,\"\",INDEX(A$2:A$102,_xlfn.AGGREGATE(15,6,(ROW($A$2:$A$102)-ROW($A$2)+1)/(($B$2:$B$102=$F$2)*(YEAR($A$2:$A$102)=$E$2)),ROWS(E$5:E53))))","v":""},{"$f":"IF(ROWS(F$5:F53)>$G$2,\"\",INDEX(B$2:B$102,_xlfn.AGGREGATE(15,6,(ROW($A$2:$A$102)-ROW($A$2)+1)/(($B$2:$B$102=$F$2)*(YEAR($A$2:$A$102)=$E$2)),ROWS(F$5:F53))))","v":""},{"$f":"IF(ROWS(G$5:G53)>$G$2,\"\",INDEX(C$2:C$102,_xlfn.AGGREGATE(15,6,(ROW($A$2:$A$102)-ROW($A$2)+1)/(($B$2:$B$102=$F$2)*(YEAR($A$2:$A$102)=$E$2)),ROWS(G$5:G53))))","v":""},null,null,null,{"$f":"IF(ROWS(K$5:K53)>$G$2,\"\",INDEX(A$2:A$102,SMALL(IF($B$2:$B$102=$F$2,IF(YEAR($A$2:$A$102)=$E$2,ROW($B$2:$B$102)-ROW($B$2)+1)),ROWS(K$5:K53))))","v":""},{"$f":"IF(ROWS(L$5:L53)>$G$2,\"\",INDEX(B$2:B$102,SMALL(IF($B$2:$B$102=$F$2,IF(YEAR($A$2:$A$102)=$E$2,ROW($B$2:$B$102)-ROW($B$2)+1)),ROWS(L$5:L53))))","v":""},{"$f":"IF(ROWS(M$5:M53)>$G$2,\"\",INDEX(C$2:C$102,SMALL(IF($B$2:$B$102=$F$2,IF(YEAR($A$2:$A$102)=$E$2,ROW($B$2:$B$102)-ROW($B$2)+1)),ROWS(M$5:M53))))","v":""}]
["2009-12-10","Gault",124.59,null,{"$f":"IF(ROWS(E$5:E54)>$G$2,\"\",INDEX(A$2:A$102,_xlfn.AGGREGATE(15,6,(ROW($A$2:$A$102)-ROW($A$2)+1)/(($B$2:$B$102=$F$2)*(YEAR($A$2:$A$102)=$E$2)),ROWS(E$5:E54))))","v":""},{"$f":"IF(ROWS(F$5:F54)>$G$2,\"\",INDEX(B$2:B$102,_xlfn.AGGREGATE(15,6,(ROW($A$2:$A$102)-ROW($A$2)+1)/(($B$2:$B$102=$F$2)*(YEAR($A$2:$A$102)=$E$2)),ROWS(F$5:F54))))","v":""},{"$f":"IF(ROWS(G$5:G54)>$G$2,\"\",INDEX(C$2:C$102,_xlfn.AGGREGATE(15,6,(ROW($A$2:$A$102)-ROW($A$2)+1)/(($B$2:$B$102=$F$2)*(YEAR($A$2:$A$102)=$E$2)),ROWS(G$5:G54))))","v":""},null,null,null,{"$f":"IF(ROWS(K$5:K54)>$G$2,\"\",INDEX(A$2:A$102,SMALL(IF($B$2:$B$102=$F$2,IF(YEAR($A$2:$A$102)=$E$2,ROW($B$2:$B$102)-ROW($B$2)+1)),ROWS(K$5:K54))))","v":""},{"$f":"IF(ROWS(L$5:L54)>$G$2,\"\",INDEX(B$2:B$102,SMALL(IF($B$2:$B$102=$F$2,IF(YEAR($A$2:$A$102)=$E$2,ROW($B$2:$B$102)-ROW($B$2)+1)),ROWS(L$5:L54))))","v":""},{"$f":"IF(ROWS(M$5:M54)>$G$2,\"\",INDEX(C$2:C$102,SMALL(IF($B$2:$B$102=$F$2,IF(YEAR($A$2:$A$102)=$E$2,ROW($B$2:$B$102)-ROW($B$2)+1)),ROWS(M$5:M54))))","v":""}]
["2009-12-31","Smith",150.31,null,{"$f":"IF(ROWS(E$5:E55)>$G$2,\"\",INDEX(A$2:A$102,_xlfn.AGGREGATE(15,6,(ROW($A$2:$A$102)-ROW($A$2)+1)/(($B$2:$B$102=$F$2)*(YEAR($A$2:$A$102)=$E$2)),ROWS(E$5:E55))))","v":""},{"$f":"IF(ROWS(F$5:F55)>$G$2,\"\",INDEX(B$2:B$102,_xlfn.AGGREGATE(15,6,(ROW($A$2:$A$102)-ROW($A$2)+1)/(($B$2:$B$102=$F$2)*(YEAR($A$2:$A$102)=$E$2)),ROWS(F$5:F55))))","v":""},{"$f":"IF(ROWS(G$5:G55)>$G$2,\"\",INDEX(C$2:C$102,_xlfn.AGGREGATE(15,6,(ROW($A$2:$A$102)-ROW($A$2)+1)/(($B$2:$B$102=$F$2)*(YEAR($A$2:$A$102)=$E$2)),ROWS(G$5:G55))))","v":""},null,null,null,{"$f":"IF(ROWS(K$5:K55)>$G$2,\"\",INDEX(A$2:A$102,SMALL(IF($B$2:$B$102=$F$2,IF(YEAR($A$2:$A$102)=$E$2,ROW($B$2:$B$102)-ROW($B$2)+1)),ROWS(K$5:K55))))","v":""},{"$f":"IF(ROWS(L$5:L55)>$G$2,\"\",INDEX(B$2:B$102,SMALL(IF($B$2:$B$102=$F$2,IF(YEAR($A$2:$A$102)=$E$2,ROW($B$2:$B$102)-ROW($B$2)+1)),ROWS(L$5:L55))))","v":""},{"$f":"IF(ROWS(M$5:M55)>$G$2,\"\",INDEX(C$2:C$102,SMALL(IF($B$2:$B$102=$F$2,IF(YEAR($A$2:$A$102)=$E$2,ROW($B$2:$B$102)-ROW($B$2)+1)),ROWS(M$5:M55))))","v":""}]
["2009-12-16","Franks",119.78,null,{"$f":"IF(ROWS(E$5:E56)>$G$2,\"\",INDEX(A$2:A$102,_xlfn.AGGREGATE(15,6,(ROW($A$2:$A$102)-ROW($A$2)+1)/(($B$2:$B$102=$F$2)*(YEAR($A$2:$A$102)=$E$2)),ROWS(E$5:E56))))","v":""},{"$f":"IF(ROWS(F$5:F56)>$G$2,\"\",INDEX(B$2:B$102,_xlfn.AGGREGATE(15,6,(ROW($A$2:$A$102)-ROW($A$2)+1)/(($B$2:$B$102=$F$2)*(YEAR($A$2:$A$102)=$E$2)),ROWS(F$5:F56))))","v":""},{"$f":"IF(ROWS(G$5:G56)>$G$2,\"\",INDEX(C$2:C$102,_xlfn.AGGREGATE(15,6,(ROW($A$2:$A$102)-ROW($A$2)+1)/(($B$2:$B$102=$F$2)*(YEAR($A$2:$A$102)=$E$2)),ROWS(G$5:G56))))","v":""},null,null,null,{"$f":"IF(ROWS(K$5:K56)>$G$2,\"\",INDEX(A$2:A$102,SMALL(IF($B$2:$B$102=$F$2,IF(YEAR($A$2:$A$102)=$E$2,ROW($B$2:$B$102)-ROW($B$2)+1)),ROWS(K$5:K56))))","v":""},{"$f":"IF(ROWS(L$5:L56)>$G$2,\"\",INDEX(B$2:B$102,SMALL(IF($B$2:$B$102=$F$2,IF(YEAR($A$2:$A$102)=$E$2,ROW($B$2:$B$102)-ROW($B$2)+1)),ROWS(L$5:L56))))","v":""},{"$f":"IF(ROWS(M$5:M56)>$G$2,\"\",INDEX(C$2:C$102,SMALL(IF($B$2:$B$102=$F$2,IF(YEAR($A$2:$A$102)=$E$2,ROW($B$2:$B$102)-ROW($B$2)+1)),ROWS(M$5:M56))))","v":""}]
["2010-01-03","Pham",93.37,null,{"$f":"IF(ROWS(E$5:E57)>$G$2,\"\",INDEX(A$2:A$102,_xlfn.AGGREGATE(15,6,(ROW($A$2:$A$102)-ROW($A$2)+1)/(($B$2:$B$102=$F$2)*(YEAR($A$2:$A$102)=$E$2)),ROWS(E$5:E57))))","v":""},{"$f":"IF(ROWS(F$5:F57)>$G$2,\"\",INDEX(B$2:B$102,_xlfn.AGGREGATE(15,6,(ROW($A$2:$A$102)-ROW($A$2)+1)/(($B$2:$B$102=$F$2)*(YEAR($A$2:$A$102)=$E$2)),ROWS(F$5:F57))))","v":""},{"$f":"IF(ROWS(G$5:G57)>$G$2,\"\",INDEX(C$2:C$102,_xlfn.AGGREGATE(15,6,(ROW($A$2:$A$102)-ROW($A$2)+1)/(($B$2:$B$102=$F$2)*(YEAR($A$2:$A$102)=$E$2)),ROWS(G$5:G57))))","v":""},null,null,null,{"$f":"IF(ROWS(K$5:K57)>$G$2,\"\",INDEX(A$2:A$102,SMALL(IF($B$2:$B$102=$F$2,IF(YEAR($A$2:$A$102)=$E$2,ROW($B$2:$B$102)-ROW($B$2)+1)),ROWS(K$5:K57))))","v":""},{"$f":"IF(ROWS(L$5:L57)>$G$2,\"\",INDEX(B$2:B$102,SMALL(IF($B$2:$B$102=$F$2,IF(YEAR($A$2:$A$102)=$E$2,ROW($B$2:$B$102)-ROW($B$2)+1)),ROWS(L$5:L57))))","v":""},{"$f":"IF(ROWS(M$5:M57)>$G$2,\"\",INDEX(C$2:C$102,SMALL(IF($B$2:$B$102=$F$2,IF(YEAR($A$2:$A$102)=$E$2,ROW($B$2:$B$102)-ROW($B$2)+1)),ROWS(M$5:M57))))","v":""}]
["2009-12-26","Chin",87.06,null,{"$f":"IF(ROWS(E$5:E58)>$G$2,\"\",INDEX(A$2:A$102,_xlfn.AGGREGATE(15,6,(ROW($A$2:$A$102)-ROW($A$2)+1)/(($B$2:$B$102=$F$2)*(YEAR($A$2:$A$102)=$E$2)),ROWS(E$5:E58))))","v":""},{"$f":"IF(ROWS(F$5:F58)>$G$2,\"\",INDEX(B$2:B$102,_xlfn.AGGREGATE(15,6,(ROW($A$2:$A$102)-ROW($A$2)+1)/(($B$2:$B$102=$F$2)*(YEAR($A$2:$A$102)=$E$2)),ROWS(F$5:F58))))","v":""},{"$f":"IF(ROWS(G$5:G58)>$G$2,\"\",INDEX(C$2:C$102,_xlfn.AGGREGATE(15,6,(ROW($A$2:$A$102)-ROW($A$2)+1)/(($B$2:$B$102=$F$2)*(YEAR($A$2:$A$102)=$E$2)),ROWS(G$5:G58))))","v":""},null,null,null,{"$f":"IF(ROWS(K$5:K58)>$G$2,\"\",INDEX(A$2:A$102,SMALL(IF($B$2:$B$102=$F$2,IF(YEAR($A$2:$A$102)=$E$2,ROW($B$2:$B$102)-ROW($B$2)+1)),ROWS(K$5:K58))))","v":""},{"$f":"IF(ROWS(L$5:L58)>$G$2,\"\",INDEX(B$2:B$102,SMALL(IF($B$2:$B$102=$F$2,IF(YEAR($A$2:$A$102)=$E$2,ROW($B$2:$B$102)-ROW($B$2)+1)),ROWS(L$5:L58))))","v":""},{"$f":"IF(ROWS(M$5:M58)>$G$2,\"\",INDEX(C$2:C$102,SMALL(IF($B$2:$B$102=$F$2,IF(YEAR($A$2:$A$102)=$E$2,ROW($B$2:$B$102)-ROW($B$2)+1)),ROWS(M$5:M58))))","v":""}]
["2010-01-05","Smith",147.49,null,{"$f":"IF(ROWS(E$5:E59)>$G$2,\"\",INDEX(A$2:A$102,_xlfn.AGGREGATE(15,6,(ROW($A$2:$A$102)-ROW($A$2)+1)/(($B$2:$B$102=$F$2)*(YEAR($A$2:$A$102)=$E$2)),ROWS(E$5:E59))))","v":""},{"$f":"IF(ROWS(F$5:F59)>$G$2,\"\",INDEX(B$2:B$102,_xlfn.AGGREGATE(15,6,(ROW($A$2:$A$102)-ROW($A$2)+1)/(($B$2:$B$102=$F$2)*(YEAR($A$2:$A$102)=$E$2)),ROWS(F$5:F59))))","v":""},{"$f":"IF(ROWS(G$5:G59)>$G$2,\"\",INDEX(C$2:C$102,_xlfn.AGGREGATE(15,6,(ROW($A$2:$A$102)-ROW($A$2)+1)/(($B$2:$B$102=$F$2)*(YEAR($A$2:$A$102)=$E$2)),ROWS(G$5:G59))))","v":""},null,null,null,{"$f":"IF(ROWS(K$5:K59)>$G$2,\"\",INDEX(A$2:A$102,SMALL(IF($B$2:$B$102=$F$2,IF(YEAR($A$2:$A$102)=$E$2,ROW($B$2:$B$102)-ROW($B$2)+1)),ROWS(K$5:K59))))","v":""},{"$f":"IF(ROWS(L$5:L59)>$G$2,\"\",INDEX(B$2:B$102,SMALL(IF($B$2:$B$102=$F$2,IF(YEAR($A$2:$A$102)=$E$2,ROW($B$2:$B$102)-ROW($B$2)+1)),ROWS(L$5:L59))))","v":""},{"$f":"IF(ROWS(M$5:M59)>$G$2,\"\",INDEX(C$2:C$102,SMALL(IF($B$2:$B$102=$F$2,IF(YEAR($A$2:$A$102)=$E$2,ROW($B$2:$B$102)-ROW($B$2)+1)),ROWS(M$5:M59))))","v":""}]
["2009-12-19","Smith",136.94,null,{"$f":"IF(ROWS(E$5:E60)>$G$2,\"\",INDEX(A$2:A$102,_xlfn.AGGREGATE(15,6,(ROW($A$2:$A$102)-ROW($A$2)+1)/(($B$2:$B$102=$F$2)*(YEAR($A$2:$A$102)=$E$2)),ROWS(E$5:E60))))","v":""},{"$f":"IF(ROWS(F$5:F60)>$G$2,\"\",INDEX(B$2:B$102,_xlfn.AGGREGATE(15,6,(ROW($A$2:$A$102)-ROW($A$2)+1)/(($B$2:$B$102=$F$2)*(YEAR($A$2:$A$102)=$E$2)),ROWS(F$5:F60))))","v":""},{"$f":"IF(ROWS(G$5:G60)>$G$2,\"\",INDEX(C$2:C$102,_xlfn.AGGREGATE(15,6,(ROW($A$2:$A$102)-ROW($A$2)+1)/(($B$2:$B$102=$F$2)*(YEAR($A$2:$A$102)=$E$2)),ROWS(G$5:G60))))","v":""},null,null,null,{"$f":"IF(ROWS(K$5:K60)>$G$2,\"\",INDEX(A$2:A$102,SMALL(IF($B$2:$B$102=$F$2,IF(YEAR($A$2:$A$102)=$E$2,ROW($B$2:$B$102)-ROW($B$2)+1)),ROWS(K$5:K60))))","v":""},{"$f":"IF(ROWS(L$5:L60)>$G$2,\"\",INDEX(B$2:B$102,SMALL(IF($B$2:$B$102=$F$2,IF(YEAR($A$2:$A$102)=$E$2,ROW($B$2:$B$102)-ROW($B$2)+1)),ROWS(L$5:L60))))","v":""},{"$f":"IF(ROWS(M$5:M60)>$G$2,\"\",INDEX(C$2:C$102,SMALL(IF($B$2:$B$102=$F$2,IF(YEAR($A$2:$A$102)=$E$2,ROW($B$2:$B$102)-ROW($B$2)+1)),ROWS(M$5:M60))))","v":""}]
["2009-11-20","Gault",93.33,null,{"$f":"IF(ROWS(E$5:E61)>$G$2,\"\",INDEX(A$2:A$102,_xlfn.AGGREGATE(15,6,(ROW($A$2:$A$102)-ROW($A$2)+1)/(($B$2:$B$102=$F$2)*(YEAR($A$2:$A$102)=$E$2)),ROWS(E$5:E61))))","v":""},{"$f":"IF(ROWS(F$5:F61)>$G$2,\"\",INDEX(B$2:B$102,_xlfn.AGGREGATE(15,6,(ROW($A$2:$A$102)-ROW($A$2)+1)/(($B$2:$B$102=$F$2)*(YEAR($A$2:$A$102)=$E$2)),ROWS(F$5:F61))))","v":""},{"$f":"IF(ROWS(G$5:G61)>$G$2,\"\",INDEX(C$2:C$102,_xlfn.AGGREGATE(15,6,(ROW($A$2:$A$102)-ROW($A$2)+1)/(($B$2:$B$102=$F$2)*(YEAR($A$2:$A$102)=$E$2)),ROWS(G$5:G61))))","v":""},null,null,null,{"$f":"IF(ROWS(K$5:K61)>$G$2,\"\",INDEX(A$2:A$102,SMALL(IF($B$2:$B$102=$F$2,IF(YEAR($A$2:$A$102)=$E$2,ROW($B$2:$B$102)-ROW($B$2)+1)),ROWS(K$5:K61))))","v":""},{"$f":"IF(ROWS(L$5:L61)>$G$2,\"\",INDEX(B$2:B$102,SMALL(IF($B$2:$B$102=$F$2,IF(YEAR($A$2:$A$102)=$E$2,ROW($B$2:$B$102)-ROW($B$2)+1)),ROWS(L$5:L61))))","v":""},{"$f":"IF(ROWS(M$5:M61)>$G$2,\"\",INDEX(C$2:C$102,SMALL(IF($B$2:$B$102=$F$2,IF(YEAR($A$2:$A$102)=$E$2,ROW($B$2:$B$102)-ROW($B$2)+1)),ROWS(M$5:M61))))","v":""}]
["2010-01-03","Smith",128.97,null,{"$f":"IF(ROWS(E$5:E62)>$G$2,\"\",INDEX(A$2:A$102,_xlfn.AGGREGATE(15,6,(ROW($A$2:$A$102)-ROW($A$2)+1)/(($B$2:$B$102=$F$2)*(YEAR($A$2:$A$102)=$E$2)),ROWS(E$5:E62))))","v":""},{"$f":"IF(ROWS(F$5:F62)>$G$2,\"\",INDEX(B$2:B$102,_xlfn.AGGREGATE(15,6,(ROW($A$2:$A$102)-ROW($A$2)+1)/(($B$2:$B$102=$F$2)*(YEAR($A$2:$A$102)=$E$2)),ROWS(F$5:F62))))","v":""},{"$f":"IF(ROWS(G$5:G62)>$G$2,\"\",INDEX(C$2:C$102,_xlfn.AGGREGATE(15,6,(ROW($A$2:$A$102)-ROW($A$2)+1)/(($B$2:$B$102=$F$2)*(YEAR($A$2:$A$102)=$E$2)),ROWS(G$5:G62))))","v":""},null,null,null,{"$f":"IF(ROWS(K$5:K62)>$G$2,\"\",INDEX(A$2:A$102,SMALL(IF($B$2:$B$102=$F$2,IF(YEAR($A$2:$A$102)=$E$2,ROW($B$2:$B$102)-ROW($B$2)+1)),ROWS(K$5:K62))))","v":""},{"$f":"IF(ROWS(L$5:L62)>$G$2,\"\",INDEX(B$2:B$102,SMALL(IF($B$2:$B$102=$F$2,IF(YEAR($A$2:$A$102)=$E$2,ROW($B$2:$B$102)-ROW($B$2)+1)),ROWS(L$5:L62))))","v":""},{"$f":"IF(ROWS(M$5:M62)>$G$2,\"\",INDEX(C$2:C$102,SMALL(IF($B$2:$B$102=$F$2,IF(YEAR($A$2:$A$102)=$E$2,ROW($B$2:$B$102)-ROW($B$2)+1)),ROWS(M$5:M62))))","v":""}]
["2009-12-14","Smith",114.93,null,{"$f":"IF(ROWS(E$5:E63)>$G$2,\"\",INDEX(A$2:A$102,_xlfn.AGGREGATE(15,6,(ROW($A$2:$A$102)-ROW($A$2)+1)/(($B$2:$B$102=$F$2)*(YEAR($A$2:$A$102)=$E$2)),ROWS(E$5:E63))))","v":""},{"$f":"IF(ROWS(F$5:F63)>$G$2,\"\",INDEX(B$2:B$102,_xlfn.AGGREGATE(15,6,(ROW($A$2:$A$102)-ROW($A$2)+1)/(($B$2:$B$102=$F$2)*(YEAR($A$2:$A$102)=$E$2)),ROWS(F$5:F63))))","v":""},{"$f":"IF(ROWS(G$5:G63)>$G$2,\"\",INDEX(C$2:C$102,_xlfn.AGGREGATE(15,6,(ROW($A$2:$A$102)-ROW($A$2)+1)/(($B$2:$B$102=$F$2)*(YEAR($A$2:$A$102)=$E$2)),ROWS(G$5:G63))))","v":""},null,null,null,{"$f":"IF(ROWS(K$5:K63)>$G$2,\"\",INDEX(A$2:A$102,SMALL(IF($B$2:$B$102=$F$2,IF(YEAR($A$2:$A$102)=$E$2,ROW($B$2:$B$102)-ROW($B$2)+1)),ROWS(K$5:K63))))","v":""},{"$f":"IF(ROWS(L$5:L63)>$G$2,\"\",INDEX(B$2:B$102,SMALL(IF($B$2:$B$102=$F$2,IF(YEAR($A$2:$A$102)=$E$2,ROW($B$2:$B$102)-ROW($B$2)+1)),ROWS(L$5:L63))))","v":""},{"$f":"IF(ROWS(M$5:M63)>$G$2,\"\",INDEX(C$2:C$102,SMALL(IF($B$2:$B$102=$F$2,IF(YEAR($A$2:$A$102)=$E$2,ROW($B$2:$B$102)-ROW($B$2)+1)),ROWS(M$5:M63))))","v":""}]
["2010-01-01","Sioux",104.57,null,{"$f":"IF(ROWS(E$5:E64)>$G$2,\"\",INDEX(A$2:A$102,_xlfn.AGGREGATE(15,6,(ROW($A$2:$A$102)-ROW($A$2)+1)/(($B$2:$B$102=$F$2)*(YEAR($A$2:$A$102)=$E$2)),ROWS(E$5:E64))))","v":""},{"$f":"IF(ROWS(F$5:F64)>$G$2,\"\",INDEX(B$2:B$102,_xlfn.AGGREGATE(15,6,(ROW($A$2:$A$102)-ROW($A$2)+1)/(($B$2:$B$102=$F$2)*(YEAR($A$2:$A$102)=$E$2)),ROWS(F$5:F64))))","v":""},{"$f":"IF(ROWS(G$5:G64)>$G$2,\"\",INDEX(C$2:C$102,_xlfn.AGGREGATE(15,6,(ROW($A$2:$A$102)-ROW($A$2)+1)/(($B$2:$B$102=$F$2)*(YEAR($A$2:$A$102)=$E$2)),ROWS(G$5:G64))))","v":""},null,null,null,{"$f":"IF(ROWS(K$5:K64)>$G$2,\"\",INDEX(A$2:A$102,SMALL(IF($B$2:$B$102=$F$2,IF(YEAR($A$2:$A$102)=$E$2,ROW($B$2:$B$102)-ROW($B$2)+1)),ROWS(K$5:K64))))","v":""},{"$f":"IF(ROWS(L$5:L64)>$G$2,\"\",INDEX(B$2:B$102,SMALL(IF($B$2:$B$102=$F$2,IF(YEAR($A$2:$A$102)=$E$2,ROW($B$2:$B$102)-ROW($B$2)+1)),ROWS(L$5:L64))))","v":""},{"$f":"IF(ROWS(M$5:M64)>$G$2,\"\",INDEX(C$2:C$102,SMALL(IF($B$2:$B$102=$F$2,IF(YEAR($A$2:$A$102)=$E$2,ROW($B$2:$B$102)-ROW($B$2)+1)),ROWS(M$5:M64))))","v":""}]
["2009-11-27","Sioux",119.53,null,{"$f":"IF(ROWS(E$5:E65)>$G$2,\"\",INDEX(A$2:A$102,_xlfn.AGGREGATE(15,6,(ROW($A$2:$A$102)-ROW($A$2)+1)/(($B$2:$B$102=$F$2)*(YEAR($A$2:$A$102)=$E$2)),ROWS(E$5:E65))))","v":""},{"$f":"IF(ROWS(F$5:F65)>$G$2,\"\",INDEX(B$2:B$102,_xlfn.AGGREGATE(15,6,(ROW($A$2:$A$102)-ROW($A$2)+1)/(($B$2:$B$102=$F$2)*(YEAR($A$2:$A$102)=$E$2)),ROWS(F$5:F65))))","v":""},{"$f":"IF(ROWS(G$5:G65)>$G$2,\"\",INDEX(C$2:C$102,_xlfn.AGGREGATE(15,6,(ROW($A$2:$A$102)-ROW($A$2)+1)/(($B$2:$B$102=$F$2)*(YEAR($A$2:$A$102)=$E$2)),ROWS(G$5:G65))))","v":""},null,null,null,{"$f":"IF(ROWS(K$5:K65)>$G$2,\"\",INDEX(A$2:A$102,SMALL(IF($B$2:$B$102=$F$2,IF(YEAR($A$2:$A$102)=$E$2,ROW($B$2:$B$102)-ROW($B$2)+1)),ROWS(K$5:K65))))","v":""},{"$f":"IF(ROWS(L$5:L65)>$G$2,\"\",INDEX(B$2:B$102,SMALL(IF($B$2:$B$102=$F$2,IF(YEAR($A$2:$A$102)=$E$2,ROW($B$2:$B$102)-ROW($B$2)+1)),ROWS(L$5:L65))))","v":""},{"$f":"IF(ROWS(M$5:M65)>$G$2,\"\",INDEX(C$2:C$102,SMALL(IF($B$2:$B$102=$F$2,IF(YEAR($A$2:$A$102)=$E$2,ROW($B$2:$B$102)-ROW($B$2)+1)),ROWS(M$5:M65))))","v":""}]
["2010-01-01","Pham",127.99,null,{"$f":"IF(ROWS(E$5:E66)>$G$2,\"\",INDEX(A$2:A$102,_xlfn.AGGREGATE(15,6,(ROW($A$2:$A$102)-ROW($A$2)+1)/(($B$2:$B$102=$F$2)*(YEAR($A$2:$A$102)=$E$2)),ROWS(E$5:E66))))","v":""},{"$f":"IF(ROWS(F$5:F66)>$G$2,\"\",INDEX(B$2:B$102,_xlfn.AGGREGATE(15,6,(ROW($A$2:$A$102)-ROW($A$2)+1)/(($B$2:$B$102=$F$2)*(YEAR($A$2:$A$102)=$E$2)),ROWS(F$5:F66))))","v":""},{"$f":"IF(ROWS(G$5:G66)>$G$2,\"\",INDEX(C$2:C$102,_xlfn.AGGREGATE(15,6,(ROW($A$2:$A$102)-ROW($A$2)+1)/(($B$2:$B$102=$F$2)*(YEAR($A$2:$A$102)=$E$2)),ROWS(G$5:G66))))","v":""},null,null,null,{"$f":"IF(ROWS(K$5:K66)>$G$2,\"\",INDEX(A$2:A$102,SMALL(IF($B$2:$B$102=$F$2,IF(YEAR($A$2:$A$102)=$E$2,ROW($B$2:$B$102)-ROW($B$2)+1)),ROWS(K$5:K66))))","v":""},{"$f":"IF(ROWS(L$5:L66)>$G$2,\"\",INDEX(B$2:B$102,SMALL(IF($B$2:$B$102=$F$2,IF(YEAR($A$2:$A$102)=$E$2,ROW($B$2:$B$102)-ROW($B$2)+1)),ROWS(L$5:L66))))","v":""},{"$f":"IF(ROWS(M$5:M66)>$G$2,\"\",INDEX(C$2:C$102,SMALL(IF($B$2:$B$102=$F$2,IF(YEAR($A$2:$A$102)=$E$2,ROW($B$2:$B$102)-ROW($B$2)+1)),ROWS(M$5:M66))))","v":""}]
["2009-12-03","Smith",88.69]
["2009-11-25","Smith",115.67]
["2010-01-07","Pham",114.54]
["2010-02-02","Smith",128.15]
["2010-02-08","Gault",126.33]
["2010-01-13","Smith",112.03]
["2009-11-20","Smith",145.33000000000001]
["2009-12-23","Gault",109.7]
["2009-11-26","Sioux",139.13]
["2009-12-01","Sioux",112.5]
["2009-11-29","Pham",122.21]
["2010-01-13","Smith",135.77000000000001]
["2010-01-09","Pham",75.17]
["2010-01-30","Sioux",104.5]
["2010-02-04","Gault",86.1]
["2010-01-02","Sioux",143.85]
["2010-01-16","Gault",104.36]
["2009-12-28","Smith",135.02000000000001]
["2009-12-26","Pham",83.26]
["2009-11-28","Sioux",114.53]
["2010-02-02","Smith",117.63]
["2009-12-27","Gault",102.24]
["2010-02-01","Chin",139.21]
["2009-12-25","Smith",119.09]
["2010-01-17","Pham",134.11000000000001]
["2010-01-15","Sioux",96.17]
["2010-01-10","Smith",108.54]
["2010-01-05","Gault",78.89]
["2010-01-20","Pham",130.37]
["2009-12-08","Chin",130.5]
["2010-01-16","Franks",123.13]
["2009-12-19","Gault",131.04]
["2009-12-17","Pham",76.260000000000005]
["2010-01-19","Pham",78.459999999999994]
["2009-11-21","Gault",79.11]
["2010-02-18","Gault",75.349999999999994]