{"text_format":"1","workbook":"xlsx","n_sheets":16,"sheets":["All","(608)","(608an)","(609)","(609an)","(610)","PT(Y o Y)an","(611)","(611an)","(612)","(612an)","(613)","(613an)","(614)","(614an)","PT(% Change Month)"],"not_rendered":{"charts":0,"images":0,"macros":0,"external_links":0,"defined_names":1,"comments":0,"pivot_tables":3},"unopened":[],"bounds":{"document_bytes":16777216,"sheet_cells":100000,"rows_first":2000,"rows_last":500,"rows_between":2000,"halvings":0,"cell_chars":16384,"cell_head_chars":4096},"cells_cut":0,"cells_raw":0,"read":"whole","date_system":"1900"}

{"sheet":"All","index":0,"n_rows":143,"n_cols":24,"rows_kept":143,"cut":false,"hidden":false,"merged":[]}
["MONDAY",1,2,3,4,"Lunch",5,6,"TEA",7,8,"MONDAY"]
[null,"09:05:00","10:05:00","11:05:00","12:05:00","13:00:00","14:30:00","15:30:00","16:30:00","17:00:00","18:15:00",null,null,null,"Student","# Free Periods","Free Period #1","Free Period #2","Free Period #3","Free Period #4","Free Period #5","Free Period #6","Free Period #7","Free Period #8"]
["Student 1",null,"ASEngLang3","MathsIGCM3","ASPsychology3",null,null,null,null,"DramaAS5","SchoolMtg","Student 1",{"$f":"COUNTA(B3:K3)","v":5},null,{"$f":"L3","v":"Student 1"},{"$f":"COUNTIF(B3:K3,\"\")","v":5},{"$f":"IF(COLUMNS($Q3:Q3)>$P3,\"\",INDEX($B$1:$K$1&\"-\"&TEXT($B$2:$K$2,\"hh:mm\"),SMALL(IF($B3:$K3=\"\",COLUMN($B3:$K3)-COLUMN($B3)+1),COLUMNS($Q3:Q3))))","v":"1-09:05"},{"$f":"IF(COLUMNS($Q3:R3)>$P3,\"\",INDEX($B$1:$K$1&\"-\"&TEXT($B$2:$K$2,\"hh:mm\"),SMALL(IF($B3:$K3=\"\",COLUMN($B3:$K3)-COLUMN($B3)+1),COLUMNS($Q3:R3))))","v":"Lunch-13:00"},{"$f":"IF(COLUMNS($Q3:S3)>$P3,\"\",INDEX($B$1:$K$1&\"-\"&TEXT($B$2:$K$2,\"hh:mm\"),SMALL(IF($B3:$K3=\"\",COLUMN($B3:$K3)-COLUMN($B3)+1),COLUMNS($Q3:S3))))","v":"5-14:30"},{"$f":"IF(COLUMNS($Q3:T3)>$P3,\"\",INDEX($B$1:$K$1&\"-\"&TEXT($B$2:$K$2,\"hh:mm\"),SMALL(IF($B3:$K3=\"\",COLUMN($B3:$K3)-COLUMN($B3)+1),COLUMNS($Q3:T3))))","v":"6-15:30"},{"$f":"IF(COLUMNS($Q3:U3)>$P3,\"\",INDEX($B$1:$K$1&\"-\"&TEXT($B$2:$K$2,\"hh:mm\"),SMALL(IF($B3:$K3=\"\",COLUMN($B3:$K3)-COLUMN($B3)+1),COLUMNS($Q3:U3))))","v":"TEA-16:30"},{"$f":"IF(COLUMNS($Q3:V3)>$P3,\"\",INDEX($B$1:$K$1&\"-\"&TEXT($B$2:$K$2,\"hh:mm\"),SMALL(IF($B3:$K3=\"\",COLUMN($B3:$K3)-COLUMN($B3)+1),COLUMNS($Q3:V3))))","v":""},{"$f":"IF(COLUMNS($Q3:W3)>$P3,\"\",INDEX($B$1:$K$1&\"-\"&TEXT($B$2:$K$2,\"hh:mm\"),SMALL(IF($B3:$K3=\"\",COLUMN($B3:$K3)-COLUMN($B3)+1),COLUMNS($Q3:W3))))","v":""},{"$f":"IF(COLUMNS($Q3:X3)>$P3,\"\",INDEX($B$1:$K$1&\"-\"&TEXT($B$2:$K$2,\"hh:mm\"),SMALL(IF($B3:$K3=\"\",COLUMN($B3:$K3)-COLUMN($B3)+1),COLUMNS($Q3:X3))))","v":""}]
["Student 2","ASPMaths1c","SMechanics3","StatisticsS1b",null,"13.45A2Maths4",null,null,null,"CinemaStuJ2","SchoolMtg","Student 2",{"$f":"COUNTA(B4:K4)","v":6},null,{"$f":"L4","v":"Student 2"},{"$f":"COUNTIF(B4:K4,\"\")","v":4},{"$f":"IF(COLUMNS($Q4:Q4)>$P4,\"\",INDEX($B$1:$K$1&\"-\"&TEXT($B$2:$K$2,\"hh:mm\"),SMALL(IF($B4:$K4=\"\",COLUMN($B4:$K4)-COLUMN($B4)+1),COLUMNS($Q4:Q4))))","v":"4-12:05"},{"$f":"IF(COLUMNS($Q4:R4)>$P4,\"\",INDEX($B$1:$K$1&\"-\"&TEXT($B$2:$K$2,\"hh:mm\"),SMALL(IF($B4:$K4=\"\",COLUMN($B4:$K4)-COLUMN($B4)+1),COLUMNS($Q4:R4))))","v":"5-14:30"},{"$f":"IF(COLUMNS($Q4:S4)>$P4,\"\",INDEX($B$1:$K$1&\"-\"&TEXT($B$2:$K$2,\"hh:mm\"),SMALL(IF($B4:$K4=\"\",COLUMN($B4:$K4)-COLUMN($B4)+1),COLUMNS($Q4:S4))))","v":"6-15:30"},{"$f":"IF(COLUMNS($Q4:T4)>$P4,\"\",INDEX($B$1:$K$1&\"-\"&TEXT($B$2:$K$2,\"hh:mm\"),SMALL(IF($B4:$K4=\"\",COLUMN($B4:$K4)-COLUMN($B4)+1),COLUMNS($Q4:T4))))","v":"TEA-16:30"},{"$f":"IF(COLUMNS($Q4:U4)>$P4,\"\",INDEX($B$1:$K$1&\"-\"&TEXT($B$2:$K$2,\"hh:mm\"),SMALL(IF($B4:$K4=\"\",COLUMN($B4:$K4)-COLUMN($B4)+1),COLUMNS($Q4:U4))))","v":""},{"$f":"IF(COLUMNS($Q4:V4)>$P4,\"\",INDEX($B$1:$K$1&\"-\"&TEXT($B$2:$K$2,\"hh:mm\"),SMALL(IF($B4:$K4=\"\",COLUMN($B4:$K4)-COLUMN($B4)+1),COLUMNS($Q4:V4))))","v":""},{"$f":"IF(COLUMNS($Q4:W4)>$P4,\"\",INDEX($B$1:$K$1&\"-\"&TEXT($B$2:$K$2,\"hh:mm\"),SMALL(IF($B4:$K4=\"\",COLUMN($B4:$K4)-COLUMN($B4)+1),COLUMNS($Q4:W4))))","v":""},{"$f":"IF(COLUMNS($Q4:X4)>$P4,\"\",INDEX($B$1:$K$1&\"-\"&TEXT($B$2:$K$2,\"hh:mm\"),SMALL(IF($B4:$K4=\"\",COLUMN($B4:$K4)-COLUMN($B4)+1),COLUMNS($Q4:X4))))","v":""}]
["Student 3","EnglishPAS4","MathsG2G2","CCriminology3",null,null,null,null,null,null,"SchoolMtg","Student 3",{"$f":"COUNTA(B5:K5)","v":4},null,"Student 3",6,{"$f":"IF(COLUMNS($Q5:Q5)>$P5,\"\",INDEX($B$1:$K$1&\"-\"&TEXT($B$2:$K$2,\"hh:mm\"),SMALL(IF($B5:$K5=\"\",COLUMN($B5:$K5)-COLUMN($B5)+1),COLUMNS($Q5:Q5))))","v":"4-12:05"},{"$f":"IF(COLUMNS($Q5:R5)>$P5,\"\",INDEX($B$1:$K$1&\"-\"&TEXT($B$2:$K$2,\"hh:mm\"),SMALL(IF($B5:$K5=\"\",COLUMN($B5:$K5)-COLUMN($B5)+1),COLUMNS($Q5:R5))))","v":"Lunch-13:00"},{"$f":"IF(COLUMNS($Q5:S5)>$P5,\"\",INDEX($B$1:$K$1&\"-\"&TEXT($B$2:$K$2,\"hh:mm\"),SMALL(IF($B5:$K5=\"\",COLUMN($B5:$K5)-COLUMN($B5)+1),COLUMNS($Q5:S5))))","v":"5-14:30"},{"$f":"IF(COLUMNS($Q5:T5)>$P5,\"\",INDEX($B$1:$K$1&\"-\"&TEXT($B$2:$K$2,\"hh:mm\"),SMALL(IF($B5:$K5=\"\",COLUMN($B5:$K5)-COLUMN($B5)+1),COLUMNS($Q5:T5))))","v":"6-15:30"},{"$f":"IF(COLUMNS($Q5:U5)>$P5,\"\",INDEX($B$1:$K$1&\"-\"&TEXT($B$2:$K$2,\"hh:mm\"),SMALL(IF($B5:$K5=\"\",COLUMN($B5:$K5)-COLUMN($B5)+1),COLUMNS($Q5:U5))))","v":"TEA-16:30"},{"$f":"IF(COLUMNS($Q5:V5)>$P5,\"\",INDEX($B$1:$K$1&\"-\"&TEXT($B$2:$K$2,\"hh:mm\"),SMALL(IF($B5:$K5=\"\",COLUMN($B5:$K5)-COLUMN($B5)+1),COLUMNS($Q5:V5))))","v":"7-17:00"},{"$f":"IF(COLUMNS($Q5:W5)>$P5,\"\",INDEX($B$1:$K$1&\"-\"&TEXT($B$2:$K$2,\"hh:mm\"),SMALL(IF($B5:$K5=\"\",COLUMN($B5:$K5)-COLUMN($B5)+1),COLUMNS($Q5:W5))))","v":""},{"$f":"IF(COLUMNS($Q5:X5)>$P5,\"\",INDEX($B$1:$K$1&\"-\"&TEXT($B$2:$K$2,\"hh:mm\"),SMALL(IF($B5:$K5=\"\",COLUMN($B5:$K5)-COLUMN($B5)+1),COLUMNS($Q5:X5))))","v":""}]
["Student 4","EnglishPAS4","MathsG2G2",null,"Japanese1",null,null,null,null,"EnglishGPAS3","SchoolMtg","Student 4",{"$f":"COUNTA(B6:K6)","v":5},null,"Student 4",5,{"$f":"IF(COLUMNS($Q6:Q6)>$P6,\"\",INDEX($B$1:$K$1&\"-\"&TEXT($B$2:$K$2,\"hh:mm\"),SMALL(IF($B6:$K6=\"\",COLUMN($B6:$K6)-COLUMN($B6)+1),COLUMNS($Q6:Q6))))","v":"3-11:05"},{"$f":"IF(COLUMNS($Q6:R6)>$P6,\"\",INDEX($B$1:$K$1&\"-\"&TEXT($B$2:$K$2,\"hh:mm\"),SMALL(IF($B6:$K6=\"\",COLUMN($B6:$K6)-COLUMN($B6)+1),COLUMNS($Q6:R6))))","v":"Lunch-13:00"},{"$f":"IF(COLUMNS($Q6:S6)>$P6,\"\",INDEX($B$1:$K$1&\"-\"&TEXT($B$2:$K$2,\"hh:mm\"),SMALL(IF($B6:$K6=\"\",COLUMN($B6:$K6)-COLUMN($B6)+1),COLUMNS($Q6:S6))))","v":"5-14:30"},{"$f":"IF(COLUMNS($Q6:T6)>$P6,\"\",INDEX($B$1:$K$1&\"-\"&TEXT($B$2:$K$2,\"hh:mm\"),SMALL(IF($B6:$K6=\"\",COLUMN($B6:$K6)-COLUMN($B6)+1),COLUMNS($Q6:T6))))","v":"6-15:30"},{"$f":"IF(COLUMNS($Q6:U6)>$P6,\"\",INDEX($B$1:$K$1&\"-\"&TEXT($B$2:$K$2,\"hh:mm\"),SMALL(IF($B6:$K6=\"\",COLUMN($B6:$K6)-COLUMN($B6)+1),COLUMNS($Q6:U6))))","v":"TEA-16:30"},{"$f":"IF(COLUMNS($Q6:V6)>$P6,\"\",INDEX($B$1:$K$1&\"-\"&TEXT($B$2:$K$2,\"hh:mm\"),SMALL(IF($B6:$K6=\"\",COLUMN($B6:$K6)-COLUMN($B6)+1),COLUMNS($Q6:V6))))","v":""},{"$f":"IF(COLUMNS($Q6:W6)>$P6,\"\",INDEX($B$1:$K$1&\"-\"&TEXT($B$2:$K$2,\"hh:mm\"),SMALL(IF($B6:$K6=\"\",COLUMN($B6:$K6)-COLUMN($B6)+1),COLUMNS($Q6:W6))))","v":""},{"$f":"IF(COLUMNS($Q6:X6)>$P6,\"\",INDEX($B$1:$K$1&\"-\"&TEXT($B$2:$K$2,\"hh:mm\"),SMALL(IF($B6:$K6=\"\",COLUMN($B6:$K6)-COLUMN($B6)+1),COLUMNS($Q6:X6))))","v":""}]
["Student 5",null,"YogaC2","CareforEarthM3","CareforEarthM3",null,null,null,null,"Philosophy2","SchoolMtg","Student 5",5,null,"Student 5",5,{"$f":"IF(COLUMNS($Q7:Q7)>$P7,\"\",INDEX($B$1:$K$1&\"-\"&TEXT($B$2:$K$2,\"hh:mm\"),SMALL(IF($B7:$K7=\"\",COLUMN($B7:$K7)-COLUMN($B7)+1),COLUMNS($Q7:Q7))))","v":"1-09:05"},{"$f":"IF(COLUMNS($Q7:R7)>$P7,\"\",INDEX($B$1:$K$1&\"-\"&TEXT($B$2:$K$2,\"hh:mm\"),SMALL(IF($B7:$K7=\"\",COLUMN($B7:$K7)-COLUMN($B7)+1),COLUMNS($Q7:R7))))","v":"Lunch-13:00"},{"$f":"IF(COLUMNS($Q7:S7)>$P7,\"\",INDEX($B$1:$K$1&\"-\"&TEXT($B$2:$K$2,\"hh:mm\"),SMALL(IF($B7:$K7=\"\",COLUMN($B7:$K7)-COLUMN($B7)+1),COLUMNS($Q7:S7))))","v":"5-14:30"},{"$f":"IF(COLUMNS($Q7:T7)>$P7,\"\",INDEX($B$1:$K$1&\"-\"&TEXT($B$2:$K$2,\"hh:mm\"),SMALL(IF($B7:$K7=\"\",COLUMN($B7:$K7)-COLUMN($B7)+1),COLUMNS($Q7:T7))))","v":"6-15:30"},{"$f":"IF(COLUMNS($Q7:U7)>$P7,\"\",INDEX($B$1:$K$1&\"-\"&TEXT($B$2:$K$2,\"hh:mm\"),SMALL(IF($B7:$K7=\"\",COLUMN($B7:$K7)-COLUMN($B7)+1),COLUMNS($Q7:U7))))","v":"TEA-16:30"},{"$f":"IF(COLUMNS($Q7:V7)>$P7,\"\",INDEX($B$1:$K$1&\"-\"&TEXT($B$2:$K$2,\"hh:mm\"),SMALL(IF($B7:$K7=\"\",COLUMN($B7:$K7)-COLUMN($B7)+1),COLUMNS($Q7:V7))))","v":""},{"$f":"IF(COLUMNS($Q7:W7)>$P7,\"\",INDEX($B$1:$K$1&\"-\"&TEXT($B$2:$K$2,\"hh:mm\"),SMALL(IF($B7:$K7=\"\",COLUMN($B7:$K7)-COLUMN($B7)+1),COLUMNS($Q7:W7))))","v":""},{"$f":"IF(COLUMNS($Q7:X7)>$P7,\"\",INDEX($B$1:$K$1&\"-\"&TEXT($B$2:$K$2,\"hh:mm\"),SMALL(IF($B7:$K7=\"\",COLUMN($B7:$K7)-COLUMN($B7)+1),COLUMNS($Q7:X7))))","v":""}]
["Student 6","ESLIGC3","SMechanics3","ASPhysics4",null,"13.45A2Maths4",null,null,null,null,"SchoolMtg","Student 6",5,null,"Student 6",5,{"$f":"IF(COLUMNS($Q8:Q8)>$P8,\"\",INDEX($B$1:$K$1&\"-\"&TEXT($B$2:$K$2,\"hh:mm\"),SMALL(IF($B8:$K8=\"\",COLUMN($B8:$K8)-COLUMN($B8)+1),COLUMNS($Q8:Q8))))","v":"4-12:05"},{"$f":"IF(COLUMNS($Q8:R8)>$P8,\"\",INDEX($B$1:$K$1&\"-\"&TEXT($B$2:$K$2,\"hh:mm\"),SMALL(IF($B8:$K8=\"\",COLUMN($B8:$K8)-COLUMN($B8)+1),COLUMNS($Q8:R8))))","v":"5-14:30"},{"$f":"IF(COLUMNS($Q8:S8)>$P8,\"\",INDEX($B$1:$K$1&\"-\"&TEXT($B$2:$K$2,\"hh:mm\"),SMALL(IF($B8:$K8=\"\",COLUMN($B8:$K8)-COLUMN($B8)+1),COLUMNS($Q8:S8))))","v":"6-15:30"},{"$f":"IF(COLUMNS($Q8:T8)>$P8,\"\",INDEX($B$1:$K$1&\"-\"&TEXT($B$2:$K$2,\"hh:mm\"),SMALL(IF($B8:$K8=\"\",COLUMN($B8:$K8)-COLUMN($B8)+1),COLUMNS($Q8:T8))))","v":"TEA-16:30"},{"$f":"IF(COLUMNS($Q8:U8)>$P8,\"\",INDEX($B$1:$K$1&\"-\"&TEXT($B$2:$K$2,\"hh:mm\"),SMALL(IF($B8:$K8=\"\",COLUMN($B8:$K8)-COLUMN($B8)+1),COLUMNS($Q8:U8))))","v":"7-17:00"},{"$f":"IF(COLUMNS($Q8:V8)>$P8,\"\",INDEX($B$1:$K$1&\"-\"&TEXT($B$2:$K$2,\"hh:mm\"),SMALL(IF($B8:$K8=\"\",COLUMN($B8:$K8)-COLUMN($B8)+1),COLUMNS($Q8:V8))))","v":""},{"$f":"IF(COLUMNS($Q8:W8)>$P8,\"\",INDEX($B$1:$K$1&\"-\"&TEXT($B$2:$K$2,\"hh:mm\"),SMALL(IF($B8:$K8=\"\",COLUMN($B8:$K8)-COLUMN($B8)+1),COLUMNS($Q8:W8))))","v":""},{"$f":"IF(COLUMNS($Q8:X8)>$P8,\"\",INDEX($B$1:$K$1&\"-\"&TEXT($B$2:$K$2,\"hh:mm\"),SMALL(IF($B8:$K8=\"\",COLUMN($B8:$K8)-COLUMN($B8)+1),COLUMNS($Q8:X8))))","v":""}]
["Student 7",null,"MathsG1A3","CCriminology3","Japanese1",null,null,null,null,"EnglishGPAS3","SchoolMtg","Student 7",5,null,"Student 7",5,{"$f":"IF(COLUMNS($Q9:Q9)>$P9,\"\",INDEX($B$1:$K$1&\"-\"&TEXT($B$2:$K$2,\"hh:mm\"),SMALL(IF($B9:$K9=\"\",COLUMN($B9:$K9)-COLUMN($B9)+1),COLUMNS($Q9:Q9))))","v":"1-09:05"},{"$f":"IF(COLUMNS($Q9:R9)>$P9,\"\",INDEX($B$1:$K$1&\"-\"&TEXT($B$2:$K$2,\"hh:mm\"),SMALL(IF($B9:$K9=\"\",COLUMN($B9:$K9)-COLUMN($B9)+1),COLUMNS($Q9:R9))))","v":"Lunch-13:00"},{"$f":"IF(COLUMNS($Q9:S9)>$P9,\"\",INDEX($B$1:$K$1&\"-\"&TEXT($B$2:$K$2,\"hh:mm\"),SMALL(IF($B9:$K9=\"\",COLUMN($B9:$K9)-COLUMN($B9)+1),COLUMNS($Q9:S9))))","v":"5-14:30"},{"$f":"IF(COLUMNS($Q9:T9)>$P9,\"\",INDEX($B$1:$K$1&\"-\"&TEXT($B$2:$K$2,\"hh:mm\"),SMALL(IF($B9:$K9=\"\",COLUMN($B9:$K9)-COLUMN($B9)+1),COLUMNS($Q9:T9))))","v":"6-15:30"},{"$f":"IF(COLUMNS($Q9:U9)>$P9,\"\",INDEX($B$1:$K$1&\"-\"&TEXT($B$2:$K$2,\"hh:mm\"),SMALL(IF($B9:$K9=\"\",COLUMN($B9:$K9)-COLUMN($B9)+1),COLUMNS($Q9:U9))))","v":"TEA-16:30"},{"$f":"IF(COLUMNS($Q9:V9)>$P9,\"\",INDEX($B$1:$K$1&\"-\"&TEXT($B$2:$K$2,\"hh:mm\"),SMALL(IF($B9:$K9=\"\",COLUMN($B9:$K9)-COLUMN($B9)+1),COLUMNS($Q9:V9))))","v":""},{"$f":"IF(COLUMNS($Q9:W9)>$P9,\"\",INDEX($B$1:$K$1&\"-\"&TEXT($B$2:$K$2,\"hh:mm\"),SMALL(IF($B9:$K9=\"\",COLUMN($B9:$K9)-COLUMN($B9)+1),COLUMNS($Q9:W9))))","v":""},{"$f":"IF(COLUMNS($Q9:X9)>$P9,\"\",INDEX($B$1:$K$1&\"-\"&TEXT($B$2:$K$2,\"hh:mm\"),SMALL(IF($B9:$K9=\"\",COLUMN($B9:$K9)-COLUMN($B9)+1),COLUMNS($Q9:X9))))","v":""}]
["Student 8","YogaB1","ASPhotoM","FitnessFran2",null,null,"A2Psychology2",null,null,"Philosophy2","SchoolMtg","Student 8",6,null,"Student 8",4,{"$f":"IF(COLUMNS($Q10:Q10)>$P10,\"\",INDEX($B$1:$K$1&\"-\"&TEXT($B$2:$K$2,\"hh:mm\"),SMALL(IF($B10:$K10=\"\",COLUMN($B10:$K10)-COLUMN($B10)+1),COLUMNS($Q10:Q10))))","v":"4-12:05"},{"$f":"IF(COLUMNS($Q10:R10)>$P10,\"\",INDEX($B$1:$K$1&\"-\"&TEXT($B$2:$K$2,\"hh:mm\"),SMALL(IF($B10:$K10=\"\",COLUMN($B10:$K10)-COLUMN($B10)+1),COLUMNS($Q10:R10))))","v":"Lunch-13:00"},{"$f":"IF(COLUMNS($Q10:S10)>$P10,\"\",INDEX($B$1:$K$1&\"-\"&TEXT($B$2:$K$2,\"hh:mm\"),SMALL(IF($B10:$K10=\"\",COLUMN($B10:$K10)-COLUMN($B10)+1),COLUMNS($Q10:S10))))","v":"6-15:30"},{"$f":"IF(COLUMNS($Q10:T10)>$P10,\"\",INDEX($B$1:$K$1&\"-\"&TEXT($B$2:$K$2,\"hh:mm\"),SMALL(IF($B10:$K10=\"\",COLUMN($B10:$K10)-COLUMN($B10)+1),COLUMNS($Q10:T10))))","v":"TEA-16:30"},{"$f":"IF(COLUMNS($Q10:U10)>$P10,\"\",INDEX($B$1:$K$1&\"-\"&TEXT($B$2:$K$2,\"hh:mm\"),SMALL(IF($B10:$K10=\"\",COLUMN($B10:$K10)-COLUMN($B10)+1),COLUMNS($Q10:U10))))","v":""},{"$f":"IF(COLUMNS($Q10:V10)>$P10,\"\",INDEX($B$1:$K$1&\"-\"&TEXT($B$2:$K$2,\"hh:mm\"),SMALL(IF($B10:$K10=\"\",COLUMN($B10:$K10)-COLUMN($B10)+1),COLUMNS($Q10:V10))))","v":""},{"$f":"IF(COLUMNS($Q10:W10)>$P10,\"\",INDEX($B$1:$K$1&\"-\"&TEXT($B$2:$K$2,\"hh:mm\"),SMALL(IF($B10:$K10=\"\",COLUMN($B10:$K10)-COLUMN($B10)+1),COLUMNS($Q10:W10))))","v":""},{"$f":"IF(COLUMNS($Q10:X10)>$P10,\"\",INDEX($B$1:$K$1&\"-\"&TEXT($B$2:$K$2,\"hh:mm\"),SMALL(IF($B10:$K10=\"\",COLUMN($B10:$K10)-COLUMN($B10)+1),COLUMNS($Q10:X10))))","v":""}]
["Student 9",null,"FitnessOrlando2",null,"Japanese1",null,null,null,null,"DramaAS5","SchoolMtg","Student 9",4,null,"Student 9",6,{"$f":"IF(COLUMNS($Q11:Q11)>$P11,\"\",INDEX($B$1:$K$1&\"-\"&TEXT($B$2:$K$2,\"hh:mm\"),SMALL(IF($B11:$K11=\"\",COLUMN($B11:$K11)-COLUMN($B11)+1),COLUMNS($Q11:Q11))))","v":"1-09:05"},{"$f":"IF(COLUMNS($Q11:R11)>$P11,\"\",INDEX($B$1:$K$1&\"-\"&TEXT($B$2:$K$2,\"hh:mm\"),SMALL(IF($B11:$K11=\"\",COLUMN($B11:$K11)-COLUMN($B11)+1),COLUMNS($Q11:R11))))","v":"3-11:05"},{"$f":"IF(COLUMNS($Q11:S11)>$P11,\"\",INDEX($B$1:$K$1&\"-\"&TEXT($B$2:$K$2,\"hh:mm\"),SMALL(IF($B11:$K11=\"\",COLUMN($B11:$K11)-COLUMN($B11)+1),COLUMNS($Q11:S11))))","v":"Lunch-13:00"},{"$f":"IF(COLUMNS($Q11:T11)>$P11,\"\",INDEX($B$1:$K$1&\"-\"&TEXT($B$2:$K$2,\"hh:mm\"),SMALL(IF($B11:$K11=\"\",COLUMN($B11:$K11)-COLUMN($B11)+1),COLUMNS($Q11:T11))))","v":"5-14:30"},{"$f":"IF(COLUMNS($Q11:U11)>$P11,\"\",INDEX($B$1:$K$1&\"-\"&TEXT($B$2:$K$2,\"hh:mm\"),SMALL(IF($B11:$K11=\"\",COLUMN($B11:$K11)-COLUMN($B11)+1),COLUMNS($Q11:U11))))","v":"6-15:30"},{"$f":"IF(COLUMNS($Q11:V11)>$P11,\"\",INDEX($B$1:$K$1&\"-\"&TEXT($B$2:$K$2,\"hh:mm\"),SMALL(IF($B11:$K11=\"\",COLUMN($B11:$K11)-COLUMN($B11)+1),COLUMNS($Q11:V11))))","v":"TEA-16:30"},{"$f":"IF(COLUMNS($Q11:W11)>$P11,\"\",INDEX($B$1:$K$1&\"-\"&TEXT($B$2:$K$2,\"hh:mm\"),SMALL(IF($B11:$K11=\"\",COLUMN($B11:$K11)-COLUMN($B11)+1),COLUMNS($Q11:W11))))","v":""},{"$f":"IF(COLUMNS($Q11:X11)>$P11,\"\",INDEX($B$1:$K$1&\"-\"&TEXT($B$2:$K$2,\"hh:mm\"),SMALL(IF($B11:$K11=\"\",COLUMN($B11:$K11)-COLUMN($B11)+1),COLUMNS($Q11:X11))))","v":""}]
["Student 10",null,null,null,null,null,null,null,null,"CinemaStuJ2","SchoolMtg","Student 10",2,null,"Student 10",8,{"$f":"IF(COLUMNS($Q12:Q12)>$P12,\"\",INDEX($B$1:$K$1&\"-\"&TEXT($B$2:$K$2,\"hh:mm\"),SMALL(IF($B12:$K12=\"\",COLUMN($B12:$K12)-COLUMN($B12)+1),COLUMNS($Q12:Q12))))","v":"1-09:05"},{"$f":"IF(COLUMNS($Q12:R12)>$P12,\"\",INDEX($B$1:$K$1&\"-\"&TEXT($B$2:$K$2,\"hh:mm\"),SMALL(IF($B12:$K12=\"\",COLUMN($B12:$K12)-COLUMN($B12)+1),COLUMNS($Q12:R12))))","v":"2-10:05"},{"$f":"IF(COLUMNS($Q12:S12)>$P12,\"\",INDEX($B$1:$K$1&\"-\"&TEXT($B$2:$K$2,\"hh:mm\"),SMALL(IF($B12:$K12=\"\",COLUMN($B12:$K12)-COLUMN($B12)+1),COLUMNS($Q12:S12))))","v":"3-11:05"},{"$f":"IF(COLUMNS($Q12:T12)>$P12,\"\",INDEX($B$1:$K$1&\"-\"&TEXT($B$2:$K$2,\"hh:mm\"),SMALL(IF($B12:$K12=\"\",COLUMN($B12:$K12)-COLUMN($B12)+1),COLUMNS($Q12:T12))))","v":"4-12:05"},{"$f":"IF(COLUMNS($Q12:U12)>$P12,\"\",INDEX($B$1:$K$1&\"-\"&TEXT($B$2:$K$2,\"hh:mm\"),SMALL(IF($B12:$K12=\"\",COLUMN($B12:$K12)-COLUMN($B12)+1),COLUMNS($Q12:U12))))","v":"Lunch-13:00"},{"$f":"IF(COLUMNS($Q12:V12)>$P12,\"\",INDEX($B$1:$K$1&\"-\"&TEXT($B$2:$K$2,\"hh:mm\"),SMALL(IF($B12:$K12=\"\",COLUMN($B12:$K12)-COLUMN($B12)+1),COLUMNS($Q12:V12))))","v":"5-14:30"},{"$f":"IF(COLUMNS($Q12:W12)>$P12,\"\",INDEX($B$1:$K$1&\"-\"&TEXT($B$2:$K$2,\"hh:mm\"),SMALL(IF($B12:$K12=\"\",COLUMN($B12:$K12)-COLUMN($B12)+1),COLUMNS($Q12:W12))))","v":"6-15:30"},{"$f":"IF(COLUMNS($Q12:X12)>$P12,\"\",INDEX($B$1:$K$1&\"-\"&TEXT($B$2:$K$2,\"hh:mm\"),SMALL(IF($B12:$K12=\"\",COLUMN($B12:$K12)-COLUMN($B12)+1),COLUMNS($Q12:X12))))","v":"TEA-16:30"}]
["Student 11",null,"AdvESLY1","MathsIGCM3",null,null,null,null,null,"DramaAS5","SchoolMtg","Student 11",4,null,"Student 11",6,{"$f":"IF(COLUMNS($Q13:Q13)>$P13,\"\",INDEX($B$1:$K$1&\"-\"&TEXT($B$2:$K$2,\"hh:mm\"),SMALL(IF($B13:$K13=\"\",COLUMN($B13:$K13)-COLUMN($B13)+1),COLUMNS($Q13:Q13))))","v":"1-09:05"},{"$f":"IF(COLUMNS($Q13:R13)>$P13,\"\",INDEX($B$1:$K$1&\"-\"&TEXT($B$2:$K$2,\"hh:mm\"),SMALL(IF($B13:$K13=\"\",COLUMN($B13:$K13)-COLUMN($B13)+1),COLUMNS($Q13:R13))))","v":"4-12:05"},{"$f":"IF(COLUMNS($Q13:S13)>$P13,\"\",INDEX($B$1:$K$1&\"-\"&TEXT($B$2:$K$2,\"hh:mm\"),SMALL(IF($B13:$K13=\"\",COLUMN($B13:$K13)-COLUMN($B13)+1),COLUMNS($Q13:S13))))","v":"Lunch-13:00"},{"$f":"IF(COLUMNS($Q13:T13)>$P13,\"\",INDEX($B$1:$K$1&\"-\"&TEXT($B$2:$K$2,\"hh:mm\"),SMALL(IF($B13:$K13=\"\",COLUMN($B13:$K13)-COLUMN($B13)+1),COLUMNS($Q13:T13))))","v":"5-14:30"},{"$f":"IF(COLUMNS($Q13:U13)>$P13,\"\",INDEX($B$1:$K$1&\"-\"&TEXT($B$2:$K$2,\"hh:mm\"),SMALL(IF($B13:$K13=\"\",COLUMN($B13:$K13)-COLUMN($B13)+1),COLUMNS($Q13:U13))))","v":"6-15:30"},{"$f":"IF(COLUMNS($Q13:V13)>$P13,\"\",INDEX($B$1:$K$1&\"-\"&TEXT($B$2:$K$2,\"hh:mm\"),SMALL(IF($B13:$K13=\"\",COLUMN($B13:$K13)-COLUMN($B13)+1),COLUMNS($Q13:V13))))","v":"TEA-16:30"},{"$f":"IF(COLUMNS($Q13:W13)>$P13,\"\",INDEX($B$1:$K$1&\"-\"&TEXT($B$2:$K$2,\"hh:mm\"),SMALL(IF($B13:$K13=\"\",COLUMN($B13:$K13)-COLUMN($B13)+1),COLUMNS($Q13:W13))))","v":""},{"$f":"IF(COLUMNS($Q13:X13)>$P13,\"\",INDEX($B$1:$K$1&\"-\"&TEXT($B$2:$K$2,\"hh:mm\"),SMALL(IF($B13:$K13=\"\",COLUMN($B13:$K13)-COLUMN($B13)+1),COLUMNS($Q13:X13))))","v":""}]
["Student 12","YogaB1","AdvESLY1","StatisticsS1b","CGeography2",null,null,null,null,null,"SchoolMtg","Student 12",5,null,"Student 12",5,{"$f":"IF(COLUMNS($Q14:Q14)>$P14,\"\",INDEX($B$1:$K$1&\"-\"&TEXT($B$2:$K$2,\"hh:mm\"),SMALL(IF($B14:$K14=\"\",COLUMN($B14:$K14)-COLUMN($B14)+1),COLUMNS($Q14:Q14))))","v":"Lunch-13:00"},{"$f":"IF(COLUMNS($Q14:R14)>$P14,\"\",INDEX($B$1:$K$1&\"-\"&TEXT($B$2:$K$2,\"hh:mm\"),SMALL(IF($B14:$K14=\"\",COLUMN($B14:$K14)-COLUMN($B14)+1),COLUMNS($Q14:R14))))","v":"5-14:30"},{"$f":"IF(COLUMNS($Q14:S14)>$P14,\"\",INDEX($B$1:$K$1&\"-\"&TEXT($B$2:$K$2,\"hh:mm\"),SMALL(IF($B14:$K14=\"\",COLUMN($B14:$K14)-COLUMN($B14)+1),COLUMNS($Q14:S14))))","v":"6-15:30"},{"$f":"IF(COLUMNS($Q14:T14)>$P14,\"\",INDEX($B$1:$K$1&\"-\"&TEXT($B$2:$K$2,\"hh:mm\"),SMALL(IF($B14:$K14=\"\",COLUMN($B14:$K14)-COLUMN($B14)+1),COLUMNS($Q14:T14))))","v":"TEA-16:30"},{"$f":"IF(COLUMNS($Q14:U14)>$P14,\"\",INDEX($B$1:$K$1&\"-\"&TEXT($B$2:$K$2,\"hh:mm\"),SMALL(IF($B14:$K14=\"\",COLUMN($B14:$K14)-COLUMN($B14)+1),COLUMNS($Q14:U14))))","v":"7-17:00"},{"$f":"IF(COLUMNS($Q14:V14)>$P14,\"\",INDEX($B$1:$K$1&\"-\"&TEXT($B$2:$K$2,\"hh:mm\"),SMALL(IF($B14:$K14=\"\",COLUMN($B14:$K14)-COLUMN($B14)+1),COLUMNS($Q14:V14))))","v":""},{"$f":"IF(COLUMNS($Q14:W14)>$P14,\"\",INDEX($B$1:$K$1&\"-\"&TEXT($B$2:$K$2,\"hh:mm\"),SMALL(IF($B14:$K14=\"\",COLUMN($B14:$K14)-COLUMN($B14)+1),COLUMNS($Q14:W14))))","v":""},{"$f":"IF(COLUMNS($Q14:X14)>$P14,\"\",INDEX($B$1:$K$1&\"-\"&TEXT($B$2:$K$2,\"hh:mm\"),SMALL(IF($B14:$K14=\"\",COLUMN($B14:$K14)-COLUMN($B14)+1),COLUMNS($Q14:X14))))","v":""}]
["Student 13","MathsIGCN3","AdvESLY1",null,null,null,null,null,null,"CinemaStuJ2","SchoolMtg","Student 13",4,null,"Student 13",6,{"$f":"IF(COLUMNS($Q15:Q15)>$P15,\"\",INDEX($B$1:$K$1&\"-\"&TEXT($B$2:$K$2,\"hh:mm\"),SMALL(IF($B15:$K15=\"\",COLUMN($B15:$K15)-COLUMN($B15)+1),COLUMNS($Q15:Q15))))","v":"3-11:05"},{"$f":"IF(COLUMNS($Q15:R15)>$P15,\"\",INDEX($B$1:$K$1&\"-\"&TEXT($B$2:$K$2,\"hh:mm\"),SMALL(IF($B15:$K15=\"\",COLUMN($B15:$K15)-COLUMN($B15)+1),COLUMNS($Q15:R15))))","v":"4-12:05"},{"$f":"IF(COLUMNS($Q15:S15)>$P15,\"\",INDEX($B$1:$K$1&\"-\"&TEXT($B$2:$K$2,\"hh:mm\"),SMALL(IF($B15:$K15=\"\",COLUMN($B15:$K15)-COLUMN($B15)+1),COLUMNS($Q15:S15))))","v":"Lunch-13:00"},{"$f":"IF(COLUMNS($Q15:T15)>$P15,\"\",INDEX($B$1:$K$1&\"-\"&TEXT($B$2:$K$2,\"hh:mm\"),SMALL(IF($B15:$K15=\"\",COLUMN($B15:$K15)-COLUMN($B15)+1),COLUMNS($Q15:T15))))","v":"5-14:30"},{"$f":"IF(COLUMNS($Q15:U15)>$P15,\"\",INDEX($B$1:$K$1&\"-\"&TEXT($B$2:$K$2,\"hh:mm\"),SMALL(IF($B15:$K15=\"\",COLUMN($B15:$K15)-COLUMN($B15)+1),COLUMNS($Q15:U15))))","v":"6-15:30"},{"$f":"IF(COLUMNS($Q15:V15)>$P15,\"\",INDEX($B$1:$K$1&\"-\"&TEXT($B$2:$K$2,\"hh:mm\"),SMALL(IF($B15:$K15=\"\",COLUMN($B15:$K15)-COLUMN($B15)+1),COLUMNS($Q15:V15))))","v":"TEA-16:30"},{"$f":"IF(COLUMNS($Q15:W15)>$P15,\"\",INDEX($B$1:$K$1&\"-\"&TEXT($B$2:$K$2,\"hh:mm\"),SMALL(IF($B15:$K15=\"\",COLUMN($B15:$K15)-COLUMN($B15)+1),COLUMNS($Q15:W15))))","v":""},{"$f":"IF(COLUMNS($Q15:X15)>$P15,\"\",INDEX($B$1:$K$1&\"-\"&TEXT($B$2:$K$2,\"hh:mm\"),SMALL(IF($B15:$K15=\"\",COLUMN($B15:$K15)-COLUMN($B15)+1),COLUMNS($Q15:X15))))","v":""}]
["Student 14","EnglishPAS4",null,"11.30-12.15LS","BiologyPractical2",null,null,null,null,"DramaAS5","SchoolMtg","Student 14",5,null,"Student 14",5,{"$f":"IF(COLUMNS($Q16:Q16)>$P16,\"\",INDEX($B$1:$K$1&\"-\"&TEXT($B$2:$K$2,\"hh:mm\"),SMALL(IF($B16:$K16=\"\",COLUMN($B16:$K16)-COLUMN($B16)+1),COLUMNS($Q16:Q16))))","v":"2-10:05"},{"$f":"IF(COLUMNS($Q16:R16)>$P16,\"\",INDEX($B$1:$K$1&\"-\"&TEXT($B$2:$K$2,\"hh:mm\"),SMALL(IF($B16:$K16=\"\",COLUMN($B16:$K16)-COLUMN($B16)+1),COLUMNS($Q16:R16))))","v":"Lunch-13:00"},{"$f":"IF(COLUMNS($Q16:S16)>$P16,\"\",INDEX($B$1:$K$1&\"-\"&TEXT($B$2:$K$2,\"hh:mm\"),SMALL(IF($B16:$K16=\"\",COLUMN($B16:$K16)-COLUMN($B16)+1),COLUMNS($Q16:S16))))","v":"5-14:30"},{"$f":"IF(COLUMNS($Q16:T16)>$P16,\"\",INDEX($B$1:$K$1&\"-\"&TEXT($B$2:$K$2,\"hh:mm\"),SMALL(IF($B16:$K16=\"\",COLUMN($B16:$K16)-COLUMN($B16)+1),COLUMNS($Q16:T16))))","v":"6-15:30"},{"$f":"IF(COLUMNS($Q16:U16)>$P16,\"\",INDEX($B$1:$K$1&\"-\"&TEXT($B$2:$K$2,\"hh:mm\"),SMALL(IF($B16:$K16=\"\",COLUMN($B16:$K16)-COLUMN($B16)+1),COLUMNS($Q16:U16))))","v":"TEA-16:30"},{"$f":"IF(COLUMNS($Q16:V16)>$P16,\"\",INDEX($B$1:$K$1&\"-\"&TEXT($B$2:$K$2,\"hh:mm\"),SMALL(IF($B16:$K16=\"\",COLUMN($B16:$K16)-COLUMN($B16)+1),COLUMNS($Q16:V16))))","v":""},{"$f":"IF(COLUMNS($Q16:W16)>$P16,\"\",INDEX($B$1:$K$1&\"-\"&TEXT($B$2:$K$2,\"hh:mm\"),SMALL(IF($B16:$K16=\"\",COLUMN($B16:$K16)-COLUMN($B16)+1),COLUMNS($Q16:W16))))","v":""},{"$f":"IF(COLUMNS($Q16:X16)>$P16,\"\",INDEX($B$1:$K$1&\"-\"&TEXT($B$2:$K$2,\"hh:mm\"),SMALL(IF($B16:$K16=\"\",COLUMN($B16:$K16)-COLUMN($B16)+1),COLUMNS($Q16:X16))))","v":""}]
["Student 15","ASPMaths1c","AdvESLY1","StatisticsS1b","ASPsychology3",null,null,null,null,null,"SchoolMtg","Student 15",5,null,"Student 15",5,{"$f":"IF(COLUMNS($Q17:Q17)>$P17,\"\",INDEX($B$1:$K$1&\"-\"&TEXT($B$2:$K$2,\"hh:mm\"),SMALL(IF($B17:$K17=\"\",COLUMN($B17:$K17)-COLUMN($B17)+1),COLUMNS($Q17:Q17))))","v":"Lunch-13:00"},{"$f":"IF(COLUMNS($Q17:R17)>$P17,\"\",INDEX($B$1:$K$1&\"-\"&TEXT($B$2:$K$2,\"hh:mm\"),SMALL(IF($B17:$K17=\"\",COLUMN($B17:$K17)-COLUMN($B17)+1),COLUMNS($Q17:R17))))","v":"5-14:30"},{"$f":"IF(COLUMNS($Q17:S17)>$P17,\"\",INDEX($B$1:$K$1&\"-\"&TEXT($B$2:$K$2,\"hh:mm\"),SMALL(IF($B17:$K17=\"\",COLUMN($B17:$K17)-COLUMN($B17)+1),COLUMNS($Q17:S17))))","v":"6-15:30"},{"$f":"IF(COLUMNS($Q17:T17)>$P17,\"\",INDEX($B$1:$K$1&\"-\"&TEXT($B$2:$K$2,\"hh:mm\"),SMALL(IF($B17:$K17=\"\",COLUMN($B17:$K17)-COLUMN($B17)+1),COLUMNS($Q17:T17))))","v":"TEA-16:30"},{"$f":"IF(COLUMNS($Q17:U17)>$P17,\"\",INDEX($B$1:$K$1&\"-\"&TEXT($B$2:$K$2,\"hh:mm\"),SMALL(IF($B17:$K17=\"\",COLUMN($B17:$K17)-COLUMN($B17)+1),COLUMNS($Q17:U17))))","v":"7-17:00"},{"$f":"IF(COLUMNS($Q17:V17)>$P17,\"\",INDEX($B$1:$K$1&\"-\"&TEXT($B$2:$K$2,\"hh:mm\"),SMALL(IF($B17:$K17=\"\",COLUMN($B17:$K17)-COLUMN($B17)+1),COLUMNS($Q17:V17))))","v":""},{"$f":"IF(COLUMNS($Q17:W17)>$P17,\"\",INDEX($B$1:$K$1&\"-\"&TEXT($B$2:$K$2,\"hh:mm\"),SMALL(IF($B17:$K17=\"\",COLUMN($B17:$K17)-COLUMN($B17)+1),COLUMNS($Q17:W17))))","v":""},{"$f":"IF(COLUMNS($Q17:X17)>$P17,\"\",INDEX($B$1:$K$1&\"-\"&TEXT($B$2:$K$2,\"hh:mm\"),SMALL(IF($B17:$K17=\"\",COLUMN($B17:$K17)-COLUMN($B17)+1),COLUMNS($Q17:X17))))","v":""}]
["Student 16","A2GraphicD1","A2GraphicD2","ESLIELTST2",null,null,null,null,null,"DramaAS5","SchoolMtg","Student 16",5,null,"Student 16",5,{"$f":"IF(COLUMNS($Q18:Q18)>$P18,\"\",INDEX($B$1:$K$1&\"-\"&TEXT($B$2:$K$2,\"hh:mm\"),SMALL(IF($B18:$K18=\"\",COLUMN($B18:$K18)-COLUMN($B18)+1),COLUMNS($Q18:Q18))))","v":"4-12:05"},{"$f":"IF(COLUMNS($Q18:R18)>$P18,\"\",INDEX($B$1:$K$1&\"-\"&TEXT($B$2:$K$2,\"hh:mm\"),SMALL(IF($B18:$K18=\"\",COLUMN($B18:$K18)-COLUMN($B18)+1),COLUMNS($Q18:R18))))","v":"Lunch-13:00"},{"$f":"IF(COLUMNS($Q18:S18)>$P18,\"\",INDEX($B$1:$K$1&\"-\"&TEXT($B$2:$K$2,\"hh:mm\"),SMALL(IF($B18:$K18=\"\",COLUMN($B18:$K18)-COLUMN($B18)+1),COLUMNS($Q18:S18))))","v":"5-14:30"},{"$f":"IF(COLUMNS($Q18:T18)>$P18,\"\",INDEX($B$1:$K$1&\"-\"&TEXT($B$2:$K$2,\"hh:mm\"),SMALL(IF($B18:$K18=\"\",COLUMN($B18:$K18)-COLUMN($B18)+1),COLUMNS($Q18:T18))))","v":"6-15:30"},{"$f":"IF(COLUMNS($Q18:U18)>$P18,\"\",INDEX($B$1:$K$1&\"-\"&TEXT($B$2:$K$2,\"hh:mm\"),SMALL(IF($B18:$K18=\"\",COLUMN($B18:$K18)-COLUMN($B18)+1),COLUMNS($Q18:U18))))","v":"TEA-16:30"},{"$f":"IF(COLUMNS($Q18:V18)>$P18,\"\",INDEX($B$1:$K$1&\"-\"&TEXT($B$2:$K$2,\"hh:mm\"),SMALL(IF($B18:$K18=\"\",COLUMN($B18:$K18)-COLUMN($B18)+1),COLUMNS($Q18:V18))))","v":""},{"$f":"IF(COLUMNS($Q18:W18)>$P18,\"\",INDEX($B$1:$K$1&\"-\"&TEXT($B$2:$K$2,\"hh:mm\"),SMALL(IF($B18:$K18=\"\",COLUMN($B18:$K18)-COLUMN($B18)+1),COLUMNS($Q18:W18))))","v":""},{"$f":"IF(COLUMNS($Q18:X18)>$P18,\"\",INDEX($B$1:$K$1&\"-\"&TEXT($B$2:$K$2,\"hh:mm\"),SMALL(IF($B18:$K18=\"\",COLUMN($B18:$K18)-COLUMN($B18)+1),COLUMNS($Q18:X18))))","v":""}]
["Student 17","MathsIGCN3","AdvESLY1","CareforEarthM3","CareforEarthM3",null,null,null,null,null,"SchoolMtg","Student 17",5,null,"Student 17",5,{"$f":"IF(COLUMNS($Q19:Q19)>$P19,\"\",INDEX($B$1:$K$1&\"-\"&TEXT($B$2:$K$2,\"hh:mm\"),SMALL(IF($B19:$K19=\"\",COLUMN($B19:$K19)-COLUMN($B19)+1),COLUMNS($Q19:Q19))))","v":"Lunch-13:00"},{"$f":"IF(COLUMNS($Q19:R19)>$P19,\"\",INDEX($B$1:$K$1&\"-\"&TEXT($B$2:$K$2,\"hh:mm\"),SMALL(IF($B19:$K19=\"\",COLUMN($B19:$K19)-COLUMN($B19)+1),COLUMNS($Q19:R19))))","v":"5-14:30"},{"$f":"IF(COLUMNS($Q19:S19)>$P19,\"\",INDEX($B$1:$K$1&\"-\"&TEXT($B$2:$K$2,\"hh:mm\"),SMALL(IF($B19:$K19=\"\",COLUMN($B19:$K19)-COLUMN($B19)+1),COLUMNS($Q19:S19))))","v":"6-15:30"},{"$f":"IF(COLUMNS($Q19:T19)>$P19,\"\",INDEX($B$1:$K$1&\"-\"&TEXT($B$2:$K$2,\"hh:mm\"),SMALL(IF($B19:$K19=\"\",COLUMN($B19:$K19)-COLUMN($B19)+1),COLUMNS($Q19:T19))))","v":"TEA-16:30"},{"$f":"IF(COLUMNS($Q19:U19)>$P19,\"\",INDEX($B$1:$K$1&\"-\"&TEXT($B$2:$K$2,\"hh:mm\"),SMALL(IF($B19:$K19=\"\",COLUMN($B19:$K19)-COLUMN($B19)+1),COLUMNS($Q19:U19))))","v":"7-17:00"},{"$f":"IF(COLUMNS($Q19:V19)>$P19,\"\",INDEX($B$1:$K$1&\"-\"&TEXT($B$2:$K$2,\"hh:mm\"),SMALL(IF($B19:$K19=\"\",COLUMN($B19:$K19)-COLUMN($B19)+1),COLUMNS($Q19:V19))))","v":""},{"$f":"IF(COLUMNS($Q19:W19)>$P19,\"\",INDEX($B$1:$K$1&\"-\"&TEXT($B$2:$K$2,\"hh:mm\"),SMALL(IF($B19:$K19=\"\",COLUMN($B19:$K19)-COLUMN($B19)+1),COLUMNS($Q19:W19))))","v":""},{"$f":"IF(COLUMNS($Q19:X19)>$P19,\"\",INDEX($B$1:$K$1&\"-\"&TEXT($B$2:$K$2,\"hh:mm\"),SMALL(IF($B19:$K19=\"\",COLUMN($B19:$K19)-COLUMN($B19)+1),COLUMNS($Q19:X19))))","v":""}]
["Student 18","IGC2Her2","ASEngLang3",null,null,null,"A2Psychology2",null,null,null,"SchoolMtg","Student 18",4,null,"Student 18",6,{"$f":"IF(COLUMNS($Q20:Q20)>$P20,\"\",INDEX($B$1:$K$1&\"-\"&TEXT($B$2:$K$2,\"hh:mm\"),SMALL(IF($B20:$K20=\"\",COLUMN($B20:$K20)-COLUMN($B20)+1),COLUMNS($Q20:Q20))))","v":"3-11:05"},{"$f":"IF(COLUMNS($Q20:R20)>$P20,\"\",INDEX($B$1:$K$1&\"-\"&TEXT($B$2:$K$2,\"hh:mm\"),SMALL(IF($B20:$K20=\"\",COLUMN($B20:$K20)-COLUMN($B20)+1),COLUMNS($Q20:R20))))","v":"4-12:05"},{"$f":"IF(COLUMNS($Q20:S20)>$P20,\"\",INDEX($B$1:$K$1&\"-\"&TEXT($B$2:$K$2,\"hh:mm\"),SMALL(IF($B20:$K20=\"\",COLUMN($B20:$K20)-COLUMN($B20)+1),COLUMNS($Q20:S20))))","v":"Lunch-13:00"},{"$f":"IF(COLUMNS($Q20:T20)>$P20,\"\",INDEX($B$1:$K$1&\"-\"&TEXT($B$2:$K$2,\"hh:mm\"),SMALL(IF($B20:$K20=\"\",COLUMN($B20:$K20)-COLUMN($B20)+1),COLUMNS($Q20:T20))))","v":"6-15:30"},{"$f":"IF(COLUMNS($Q20:U20)>$P20,\"\",INDEX($B$1:$K$1&\"-\"&TEXT($B$2:$K$2,\"hh:mm\"),SMALL(IF($B20:$K20=\"\",COLUMN($B20:$K20)-COLUMN($B20)+1),COLUMNS($Q20:U20))))","v":"TEA-16:30"},{"$f":"IF(COLUMNS($Q20:V20)>$P20,\"\",INDEX($B$1:$K$1&\"-\"&TEXT($B$2:$K$2,\"hh:mm\"),SMALL(IF($B20:$K20=\"\",COLUMN($B20:$K20)-COLUMN($B20)+1),COLUMNS($Q20:V20))))","v":"7-17:00"},{"$f":"IF(COLUMNS($Q20:W20)>$P20,\"\",INDEX($B$1:$K$1&\"-\"&TEXT($B$2:$K$2,\"hh:mm\"),SMALL(IF($B20:$K20=\"\",COLUMN($B20:$K20)-COLUMN($B20)+1),COLUMNS($Q20:W20))))","v":""},{"$f":"IF(COLUMNS($Q20:X20)>$P20,\"\",INDEX($B$1:$K$1&\"-\"&TEXT($B$2:$K$2,\"hh:mm\"),SMALL(IF($B20:$K20=\"\",COLUMN($B20:$K20)-COLUMN($B20)+1),COLUMNS($Q20:X20))))","v":""}]
["Student 19",null,"ASPhotoM",null,null,null,null,null,null,"Philosophy2","SchoolMtg","Student 19",3,null,"Student 19",7,{"$f":"IF(COLUMNS($Q21:Q21)>$P21,\"\",INDEX($B$1:$K$1&\"-\"&TEXT($B$2:$K$2,\"hh:mm\"),SMALL(IF($B21:$K21=\"\",COLUMN($B21:$K21)-COLUMN($B21)+1),COLUMNS($Q21:Q21))))","v":"1-09:05"},{"$f":"IF(COLUMNS($Q21:R21)>$P21,\"\",INDEX($B$1:$K$1&\"-\"&TEXT($B$2:$K$2,\"hh:mm\"),SMALL(IF($B21:$K21=\"\",COLUMN($B21:$K21)-COLUMN($B21)+1),COLUMNS($Q21:R21))))","v":"3-11:05"},{"$f":"IF(COLUMNS($Q21:S21)>$P21,\"\",INDEX($B$1:$K$1&\"-\"&TEXT($B$2:$K$2,\"hh:mm\"),SMALL(IF($B21:$K21=\"\",COLUMN($B21:$K21)-COLUMN($B21)+1),COLUMNS($Q21:S21))))","v":"4-12:05"},{"$f":"IF(COLUMNS($Q21:T21)>$P21,\"\",INDEX($B$1:$K$1&\"-\"&TEXT($B$2:$K$2,\"hh:mm\"),SMALL(IF($B21:$K21=\"\",COLUMN($B21:$K21)-COLUMN($B21)+1),COLUMNS($Q21:T21))))","v":"Lunch-13:00"},{"$f":"IF(COLUMNS($Q21:U21)>$P21,\"\",INDEX($B$1:$K$1&\"-\"&TEXT($B$2:$K$2,\"hh:mm\"),SMALL(IF($B21:$K21=\"\",COLUMN($B21:$K21)-COLUMN($B21)+1),COLUMNS($Q21:U21))))","v":"5-14:30"},{"$f":"IF(COLUMNS($Q21:V21)>$P21,\"\",INDEX($B$1:$K$1&\"-\"&TEXT($B$2:$K$2,\"hh:mm\"),SMALL(IF($B21:$K21=\"\",COLUMN($B21:$K21)-COLUMN($B21)+1),COLUMNS($Q21:V21))))","v":"6-15:30"},{"$f":"IF(COLUMNS($Q21:W21)>$P21,\"\",INDEX($B$1:$K$1&\"-\"&TEXT($B$2:$K$2,\"hh:mm\"),SMALL(IF($B21:$K21=\"\",COLUMN($B21:$K21)-COLUMN($B21)+1),COLUMNS($Q21:W21))))","v":"TEA-16:30"},{"$f":"IF(COLUMNS($Q21:X21)>$P21,\"\",INDEX($B$1:$K$1&\"-\"&TEXT($B$2:$K$2,\"hh:mm\"),SMALL(IF($B21:$K21=\"\",COLUMN($B21:$K21)-COLUMN($B21)+1),COLUMNS($Q21:X21))))","v":""}]
["Student 20",null,"MathsG1A3","CCriminology3",null,null,"14.15-14.45LS",null,null,"EnglishGPAS3","SchoolMtg","Student 20",5,null,"Student 20",5,{"$f":"IF(COLUMNS($Q22:Q22)>$P22,\"\",INDEX($B$1:$K$1&\"-\"&TEXT($B$2:$K$2,\"hh:mm\"),SMALL(IF($B22:$K22=\"\",COLUMN($B22:$K22)-COLUMN($B22)+1),COLUMNS($Q22:Q22))))","v":"1-09:05"},{"$f":"IF(COLUMNS($Q22:R22)>$P22,\"\",INDEX($B$1:$K$1&\"-\"&TEXT($B$2:$K$2,\"hh:mm\"),SMALL(IF($B22:$K22=\"\",COLUMN($B22:$K22)-COLUMN($B22)+1),COLUMNS($Q22:R22))))","v":"4-12:05"},{"$f":"IF(COLUMNS($Q22:S22)>$P22,\"\",INDEX($B$1:$K$1&\"-\"&TEXT($B$2:$K$2,\"hh:mm\"),SMALL(IF($B22:$K22=\"\",COLUMN($B22:$K22)-COLUMN($B22)+1),COLUMNS($Q22:S22))))","v":"Lunch-13:00"},{"$f":"IF(COLUMNS($Q22:T22)>$P22,\"\",INDEX($B$1:$K$1&\"-\"&TEXT($B$2:$K$2,\"hh:mm\"),SMALL(IF($B22:$K22=\"\",COLUMN($B22:$K22)-COLUMN($B22)+1),COLUMNS($Q22:T22))))","v":"6-15:30"},{"$f":"IF(COLUMNS($Q22:U22)>$P22,\"\",INDEX($B$1:$K$1&\"-\"&TEXT($B$2:$K$2,\"hh:mm\"),SMALL(IF($B22:$K22=\"\",COLUMN($B22:$K22)-COLUMN($B22)+1),COLUMNS($Q22:U22))))","v":"TEA-16:30"},{"$f":"IF(COLUMNS($Q22:V22)>$P22,\"\",INDEX($B$1:$K$1&\"-\"&TEXT($B$2:$K$2,\"hh:mm\"),SMALL(IF($B22:$K22=\"\",COLUMN($B22:$K22)-COLUMN($B22)+1),COLUMNS($Q22:V22))))","v":""},{"$f":"IF(COLUMNS($Q22:W22)>$P22,\"\",INDEX($B$1:$K$1&\"-\"&TEXT($B$2:$K$2,\"hh:mm\"),SMALL(IF($B22:$K22=\"\",COLUMN($B22:$K22)-COLUMN($B22)+1),COLUMNS($Q22:W22))))","v":""},{"$f":"IF(COLUMNS($Q22:X22)>$P22,\"\",INDEX($B$1:$K$1&\"-\"&TEXT($B$2:$K$2,\"hh:mm\"),SMALL(IF($B22:$K22=\"\",COLUMN($B22:$K22)-COLUMN($B22)+1),COLUMNS($Q22:X22))))","v":""}]
["Student 21","YogaB1","10.30-11.25LS","CCriminology3","ASHistory1",null,null,null,null,null,"SchoolMtg","Student 21",5,null,"Student 21",5,{"$f":"IF(COLUMNS($Q23:Q23)>$P23,\"\",INDEX($B$1:$K$1&\"-\"&TEXT($B$2:$K$2,\"hh:mm\"),SMALL(IF($B23:$K23=\"\",COLUMN($B23:$K23)-COLUMN($B23)+1),COLUMNS($Q23:Q23))))","v":"Lunch-13:00"},{"$f":"IF(COLUMNS($Q23:R23)>$P23,\"\",INDEX($B$1:$K$1&\"-\"&TEXT($B$2:$K$2,\"hh:mm\"),SMALL(IF($B23:$K23=\"\",COLUMN($B23:$K23)-COLUMN($B23)+1),COLUMNS($Q23:R23))))","v":"5-14:30"},{"$f":"IF(COLUMNS($Q23:S23)>$P23,\"\",INDEX($B$1:$K$1&\"-\"&TEXT($B$2:$K$2,\"hh:mm\"),SMALL(IF($B23:$K23=\"\",COLUMN($B23:$K23)-COLUMN($B23)+1),COLUMNS($Q23:S23))))","v":"6-15:30"},{"$f":"IF(COLUMNS($Q23:T23)>$P23,\"\",INDEX($B$1:$K$1&\"-\"&TEXT($B$2:$K$2,\"hh:mm\"),SMALL(IF($B23:$K23=\"\",COLUMN($B23:$K23)-COLUMN($B23)+1),COLUMNS($Q23:T23))))","v":"TEA-16:30"},{"$f":"IF(COLUMNS($Q23:U23)>$P23,\"\",INDEX($B$1:$K$1&\"-\"&TEXT($B$2:$K$2,\"hh:mm\"),SMALL(IF($B23:$K23=\"\",COLUMN($B23:$K23)-COLUMN($B23)+1),COLUMNS($Q23:U23))))","v":"7-17:00"},{"$f":"IF(COLUMNS($Q23:V23)>$P23,\"\",INDEX($B$1:$K$1&\"-\"&TEXT($B$2:$K$2,\"hh:mm\"),SMALL(IF($B23:$K23=\"\",COLUMN($B23:$K23)-COLUMN($B23)+1),COLUMNS($Q23:V23))))","v":""},{"$f":"IF(COLUMNS($Q23:W23)>$P23,\"\",INDEX($B$1:$K$1&\"-\"&TEXT($B$2:$K$2,\"hh:mm\"),SMALL(IF($B23:$K23=\"\",COLUMN($B23:$K23)-COLUMN($B23)+1),COLUMNS($Q23:W23))))","v":""},{"$f":"IF(COLUMNS($Q23:X23)>$P23,\"\",INDEX($B$1:$K$1&\"-\"&TEXT($B$2:$K$2,\"hh:mm\"),SMALL(IF($B23:$K23=\"\",COLUMN($B23:$K23)-COLUMN($B23)+1),COLUMNS($Q23:X23))))","v":""}]
["Student 22","A2Physics1","SMechanics3",null,null,"13.45A2Maths4",null,null,null,null,"SchoolMtg","Student 22",4,null,"Student 22",6,{"$f":"IF(COLUMNS($Q24:Q24)>$P24,\"\",INDEX($B$1:$K$1&\"-\"&TEXT($B$2:$K$2,\"hh:mm\"),SMALL(IF($B24:$K24=\"\",COLUMN($B24:$K24)-COLUMN($B24)+1),COLUMNS($Q24:Q24))))","v":"3-11:05"},{"$f":"IF(COLUMNS($Q24:R24)>$P24,\"\",INDEX($B$1:$K$1&\"-\"&TEXT($B$2:$K$2,\"hh:mm\"),SMALL(IF($B24:$K24=\"\",COLUMN($B24:$K24)-COLUMN($B24)+1),COLUMNS($Q24:R24))))","v":"4-12:05"},{"$f":"IF(COLUMNS($Q24:S24)>$P24,\"\",INDEX($B$1:$K$1&\"-\"&TEXT($B$2:$K$2,\"hh:mm\"),SMALL(IF($B24:$K24=\"\",COLUMN($B24:$K24)-COLUMN($B24)+1),COLUMNS($Q24:S24))))","v":"5-14:30"},{"$f":"IF(COLUMNS($Q24:T24)>$P24,\"\",INDEX($B$1:$K$1&\"-\"&TEXT($B$2:$K$2,\"hh:mm\"),SMALL(IF($B24:$K24=\"\",COLUMN($B24:$K24)-COLUMN($B24)+1),COLUMNS($Q24:T24))))","v":"6-15:30"},{"$f":"IF(COLUMNS($Q24:U24)>$P24,\"\",INDEX($B$1:$K$1&\"-\"&TEXT($B$2:$K$2,\"hh:mm\"),SMALL(IF($B24:$K24=\"\",COLUMN($B24:$K24)-COLUMN($B24)+1),COLUMNS($Q24:U24))))","v":"TEA-16:30"},{"$f":"IF(COLUMNS($Q24:V24)>$P24,\"\",INDEX($B$1:$K$1&\"-\"&TEXT($B$2:$K$2,\"hh:mm\"),SMALL(IF($B24:$K24=\"\",COLUMN($B24:$K24)-COLUMN($B24)+1),COLUMNS($Q24:V24))))","v":"7-17:00"},{"$f":"IF(COLUMNS($Q24:W24)>$P24,\"\",INDEX($B$1:$K$1&\"-\"&TEXT($B$2:$K$2,\"hh:mm\"),SMALL(IF($B24:$K24=\"\",COLUMN($B24:$K24)-COLUMN($B24)+1),COLUMNS($Q24:W24))))","v":""},{"$f":"IF(COLUMNS($Q24:X24)>$P24,\"\",INDEX($B$1:$K$1&\"-\"&TEXT($B$2:$K$2,\"hh:mm\"),SMALL(IF($B24:$K24=\"\",COLUMN($B24:$K24)-COLUMN($B24)+1),COLUMNS($Q24:X24))))","v":""}]
["Student 23","EnglishPAS4","MathsG1A3","CCriminology3",null,null,null,null,null,null,"SchoolMtg","Student 23",4,null,"Student 23",6,{"$f":"IF(COLUMNS($Q25:Q25)>$P25,\"\",INDEX($B$1:$K$1&\"-\"&TEXT($B$2:$K$2,\"hh:mm\"),SMALL(IF($B25:$K25=\"\",COLUMN($B25:$K25)-COLUMN($B25)+1),COLUMNS($Q25:Q25))))","v":"4-12:05"},{"$f":"IF(COLUMNS($Q25:R25)>$P25,\"\",INDEX($B$1:$K$1&\"-\"&TEXT($B$2:$K$2,\"hh:mm\"),SMALL(IF($B25:$K25=\"\",COLUMN($B25:$K25)-COLUMN($B25)+1),COLUMNS($Q25:R25))))","v":"Lunch-13:00"},{"$f":"IF(COLUMNS($Q25:S25)>$P25,\"\",INDEX($B$1:$K$1&\"-\"&TEXT($B$2:$K$2,\"hh:mm\"),SMALL(IF($B25:$K25=\"\",COLUMN($B25:$K25)-COLUMN($B25)+1),COLUMNS($Q25:S25))))","v":"5-14:30"},{"$f":"IF(COLUMNS($Q25:T25)>$P25,\"\",INDEX($B$1:$K$1&\"-\"&TEXT($B$2:$K$2,\"hh:mm\"),SMALL(IF($B25:$K25=\"\",COLUMN($B25:$K25)-COLUMN($B25)+1),COLUMNS($Q25:T25))))","v":"6-15:30"},{"$f":"IF(COLUMNS($Q25:U25)>$P25,\"\",INDEX($B$1:$K$1&\"-\"&TEXT($B$2:$K$2,\"hh:mm\"),SMALL(IF($B25:$K25=\"\",COLUMN($B25:$K25)-COLUMN($B25)+1),COLUMNS($Q25:U25))))","v":"TEA-16:30"},{"$f":"IF(COLUMNS($Q25:V25)>$P25,\"\",INDEX($B$1:$K$1&\"-\"&TEXT($B$2:$K$2,\"hh:mm\"),SMALL(IF($B25:$K25=\"\",COLUMN($B25:$K25)-COLUMN($B25)+1),COLUMNS($Q25:V25))))","v":"7-17:00"},{"$f":"IF(COLUMNS($Q25:W25)>$P25,\"\",INDEX($B$1:$K$1&\"-\"&TEXT($B$2:$K$2,\"hh:mm\"),SMALL(IF($B25:$K25=\"\",COLUMN($B25:$K25)-COLUMN($B25)+1),COLUMNS($Q25:W25))))","v":""},{"$f":"IF(COLUMNS($Q25:X25)>$P25,\"\",INDEX($B$1:$K$1&\"-\"&TEXT($B$2:$K$2,\"hh:mm\"),SMALL(IF($B25:$K25=\"\",COLUMN($B25:$K25)-COLUMN($B25)+1),COLUMNS($Q25:X25))))","v":""}]
["Student 24","YogaB1","AdvESLY1","CareforEarthM3","CareforEarthM3",null,null,null,null,"ASGraphicD3","SchoolMtg","Student 24",6,null,"Student 24",4,{"$f":"IF(COLUMNS($Q26:Q26)>$P26,\"\",INDEX($B$1:$K$1&\"-\"&TEXT($B$2:$K$2,\"hh:mm\"),SMALL(IF($B26:$K26=\"\",COLUMN($B26:$K26)-COLUMN($B26)+1),COLUMNS($Q26:Q26))))","v":"Lunch-13:00"},{"$f":"IF(COLUMNS($Q26:R26)>$P26,\"\",INDEX($B$1:$K$1&\"-\"&TEXT($B$2:$K$2,\"hh:mm\"),SMALL(IF($B26:$K26=\"\",COLUMN($B26:$K26)-COLUMN($B26)+1),COLUMNS($Q26:R26))))","v":"5-14:30"},{"$f":"IF(COLUMNS($Q26:S26)>$P26,\"\",INDEX($B$1:$K$1&\"-\"&TEXT($B$2:$K$2,\"hh:mm\"),SMALL(IF($B26:$K26=\"\",COLUMN($B26:$K26)-COLUMN($B26)+1),COLUMNS($Q26:S26))))","v":"6-15:30"},{"$f":"IF(COLUMNS($Q26:T26)>$P26,\"\",INDEX($B$1:$K$1&\"-\"&TEXT($B$2:$K$2,\"hh:mm\"),SMALL(IF($B26:$K26=\"\",COLUMN($B26:$K26)-COLUMN($B26)+1),COLUMNS($Q26:T26))))","v":"TEA-16:30"},{"$f":"IF(COLUMNS($Q26:U26)>$P26,\"\",INDEX($B$1:$K$1&\"-\"&TEXT($B$2:$K$2,\"hh:mm\"),SMALL(IF($B26:$K26=\"\",COLUMN($B26:$K26)-COLUMN($B26)+1),COLUMNS($Q26:U26))))","v":""},{"$f":"IF(COLUMNS($Q26:V26)>$P26,\"\",INDEX($B$1:$K$1&\"-\"&TEXT($B$2:$K$2,\"hh:mm\"),SMALL(IF($B26:$K26=\"\",COLUMN($B26:$K26)-COLUMN($B26)+1),COLUMNS($Q26:V26))))","v":""},{"$f":"IF(COLUMNS($Q26:W26)>$P26,\"\",INDEX($B$1:$K$1&\"-\"&TEXT($B$2:$K$2,\"hh:mm\"),SMALL(IF($B26:$K26=\"\",COLUMN($B26:$K26)-COLUMN($B26)+1),COLUMNS($Q26:W26))))","v":""},{"$f":"IF(COLUMNS($Q26:X26)>$P26,\"\",INDEX($B$1:$K$1&\"-\"&TEXT($B$2:$K$2,\"hh:mm\"),SMALL(IF($B26:$K26=\"\",COLUMN($B26:$K26)-COLUMN($B26)+1),COLUMNS($Q26:X26))))","v":""}]
["Student 25","YogaB1","PhysicsPAS3","StatisticsS1b","BiologyPractical2",null,null,null,null,"ASGraphicD3","SchoolMtg","Student 25",6,null,"Student 25",4,{"$f":"IF(COLUMNS($Q27:Q27)>$P27,\"\",INDEX($B$1:$K$1&\"-\"&TEXT($B$2:$K$2,\"hh:mm\"),SMALL(IF($B27:$K27=\"\",COLUMN($B27:$K27)-COLUMN($B27)+1),COLUMNS($Q27:Q27))))","v":"Lunch-13:00"},{"$f":"IF(COLUMNS($Q27:R27)>$P27,\"\",INDEX($B$1:$K$1&\"-\"&TEXT($B$2:$K$2,\"hh:mm\"),SMALL(IF($B27:$K27=\"\",COLUMN($B27:$K27)-COLUMN($B27)+1),COLUMNS($Q27:R27))))","v":"5-14:30"},{"$f":"IF(COLUMNS($Q27:S27)>$P27,\"\",INDEX($B$1:$K$1&\"-\"&TEXT($B$2:$K$2,\"hh:mm\"),SMALL(IF($B27:$K27=\"\",COLUMN($B27:$K27)-COLUMN($B27)+1),COLUMNS($Q27:S27))))","v":"6-15:30"},{"$f":"IF(COLUMNS($Q27:T27)>$P27,\"\",INDEX($B$1:$K$1&\"-\"&TEXT($B$2:$K$2,\"hh:mm\"),SMALL(IF($B27:$K27=\"\",COLUMN($B27:$K27)-COLUMN($B27)+1),COLUMNS($Q27:T27))))","v":"TEA-16:30"},{"$f":"IF(COLUMNS($Q27:U27)>$P27,\"\",INDEX($B$1:$K$1&\"-\"&TEXT($B$2:$K$2,\"hh:mm\"),SMALL(IF($B27:$K27=\"\",COLUMN($B27:$K27)-COLUMN($B27)+1),COLUMNS($Q27:U27))))","v":""},{"$f":"IF(COLUMNS($Q27:V27)>$P27,\"\",INDEX($B$1:$K$1&\"-\"&TEXT($B$2:$K$2,\"hh:mm\"),SMALL(IF($B27:$K27=\"\",COLUMN($B27:$K27)-COLUMN($B27)+1),COLUMNS($Q27:V27))))","v":""},{"$f":"IF(COLUMNS($Q27:W27)>$P27,\"\",INDEX($B$1:$K$1&\"-\"&TEXT($B$2:$K$2,\"hh:mm\"),SMALL(IF($B27:$K27=\"\",COLUMN($B27:$K27)-COLUMN($B27)+1),COLUMNS($Q27:W27))))","v":""},{"$f":"IF(COLUMNS($Q27:X27)>$P27,\"\",INDEX($B$1:$K$1&\"-\"&TEXT($B$2:$K$2,\"hh:mm\"),SMALL(IF($B27:$K27=\"\",COLUMN($B27:$K27)-COLUMN($B27)+1),COLUMNS($Q27:X27))))","v":""}]
["Student 26","IGC2Her2","ASEngLang3","FitnessFran2","BiologyPractical2",null,"A2Psychology2",null,null,null,"SchoolMtg","Student 26",6,null,"Student 26",4,{"$f":"IF(COLUMNS($Q28:Q28)>$P28,\"\",INDEX($B$1:$K$1&\"-\"&TEXT($B$2:$K$2,\"hh:mm\"),SMALL(IF($B28:$K28=\"\",COLUMN($B28:$K28)-COLUMN($B28)+1),COLUMNS($Q28:Q28))))","v":"Lunch-13:00"},{"$f":"IF(COLUMNS($Q28:R28)>$P28,\"\",INDEX($B$1:$K$1&\"-\"&TEXT($B$2:$K$2,\"hh:mm\"),SMALL(IF($B28:$K28=\"\",COLUMN($B28:$K28)-COLUMN($B28)+1),COLUMNS($Q28:R28))))","v":"6-15:30"},{"$f":"IF(COLUMNS($Q28:S28)>$P28,\"\",INDEX($B$1:$K$1&\"-\"&TEXT($B$2:$K$2,\"hh:mm\"),SMALL(IF($B28:$K28=\"\",COLUMN($B28:$K28)-COLUMN($B28)+1),COLUMNS($Q28:S28))))","v":"TEA-16:30"},{"$f":"IF(COLUMNS($Q28:T28)>$P28,\"\",INDEX($B$1:$K$1&\"-\"&TEXT($B$2:$K$2,\"hh:mm\"),SMALL(IF($B28:$K28=\"\",COLUMN($B28:$K28)-COLUMN($B28)+1),COLUMNS($Q28:T28))))","v":"7-17:00"},{"$f":"IF(COLUMNS($Q28:U28)>$P28,\"\",INDEX($B$1:$K$1&\"-\"&TEXT($B$2:$K$2,\"hh:mm\"),SMALL(IF($B28:$K28=\"\",COLUMN($B28:$K28)-COLUMN($B28)+1),COLUMNS($Q28:U28))))","v":""},{"$f":"IF(COLUMNS($Q28:V28)>$P28,\"\",INDEX($B$1:$K$1&\"-\"&TEXT($B$2:$K$2,\"hh:mm\"),SMALL(IF($B28:$K28=\"\",COLUMN($B28:$K28)-COLUMN($B28)+1),COLUMNS($Q28:V28))))","v":""},{"$f":"IF(COLUMNS($Q28:W28)>$P28,\"\",INDEX($B$1:$K$1&\"-\"&TEXT($B$2:$K$2,\"hh:mm\"),SMALL(IF($B28:$K28=\"\",COLUMN($B28:$K28)-COLUMN($B28)+1),COLUMNS($Q28:W28))))","v":""},{"$f":"IF(COLUMNS($Q28:X28)>$P28,\"\",INDEX($B$1:$K$1&\"-\"&TEXT($B$2:$K$2,\"hh:mm\"),SMALL(IF($B28:$K28=\"\",COLUMN($B28:$K28)-COLUMN($B28)+1),COLUMNS($Q28:X28))))","v":""}]
["Student 27","A2Physics1","StatisticsS23",null,null,"13.45A2Maths4",null,null,null,null,"SchoolMtg","Student 27",4,null,"Student 27",6,{"$f":"IF(COLUMNS($Q29:Q29)>$P29,\"\",INDEX($B$1:$K$1&\"-\"&TEXT($B$2:$K$2,\"hh:mm\"),SMALL(IF($B29:$K29=\"\",COLUMN($B29:$K29)-COLUMN($B29)+1),COLUMNS($Q29:Q29))))","v":"3-11:05"},{"$f":"IF(COLUMNS($Q29:R29)>$P29,\"\",INDEX($B$1:$K$1&\"-\"&TEXT($B$2:$K$2,\"hh:mm\"),SMALL(IF($B29:$K29=\"\",COLUMN($B29:$K29)-COLUMN($B29)+1),COLUMNS($Q29:R29))))","v":"4-12:05"},{"$f":"IF(COLUMNS($Q29:S29)>$P29,\"\",INDEX($B$1:$K$1&\"-\"&TEXT($B$2:$K$2,\"hh:mm\"),SMALL(IF($B29:$K29=\"\",COLUMN($B29:$K29)-COLUMN($B29)+1),COLUMNS($Q29:S29))))","v":"5-14:30"},{"$f":"IF(COLUMNS($Q29:T29)>$P29,\"\",INDEX($B$1:$K$1&\"-\"&TEXT($B$2:$K$2,\"hh:mm\"),SMALL(IF($B29:$K29=\"\",COLUMN($B29:$K29)-COLUMN($B29)+1),COLUMNS($Q29:T29))))","v":"6-15:30"},{"$f":"IF(COLUMNS($Q29:U29)>$P29,\"\",INDEX($B$1:$K$1&\"-\"&TEXT($B$2:$K$2,\"hh:mm\"),SMALL(IF($B29:$K29=\"\",COLUMN($B29:$K29)-COLUMN($B29)+1),COLUMNS($Q29:U29))))","v":"TEA-16:30"},{"$f":"IF(COLUMNS($Q29:V29)>$P29,\"\",INDEX($B$1:$K$1&\"-\"&TEXT($B$2:$K$2,\"hh:mm\"),SMALL(IF($B29:$K29=\"\",COLUMN($B29:$K29)-COLUMN($B29)+1),COLUMNS($Q29:V29))))","v":"7-17:00"},{"$f":"IF(COLUMNS($Q29:W29)>$P29,\"\",INDEX($B$1:$K$1&\"-\"&TEXT($B$2:$K$2,\"hh:mm\"),SMALL(IF($B29:$K29=\"\",COLUMN($B29:$K29)-COLUMN($B29)+1),COLUMNS($Q29:W29))))","v":""},{"$f":"IF(COLUMNS($Q29:X29)>$P29,\"\",INDEX($B$1:$K$1&\"-\"&TEXT($B$2:$K$2,\"hh:mm\"),SMALL(IF($B29:$K29=\"\",COLUMN($B29:$K29)-COLUMN($B29)+1),COLUMNS($Q29:X29))))","v":""}]
["Student 28","FitnessOrlando1","MusicAdv","IELTSM1",null,"13.25-14.10LS",null,null,null,null,"SchoolMtg","Student 28",5,null,"Student 28",5,{"$f":"IF(COLUMNS($Q30:Q30)>$P30,\"\",INDEX($B$1:$K$1&\"-\"&TEXT($B$2:$K$2,\"hh:mm\"),SMALL(IF($B30:$K30=\"\",COLUMN($B30:$K30)-COLUMN($B30)+1),COLUMNS($Q30:Q30))))","v":"4-12:05"},{"$f":"IF(COLUMNS($Q30:R30)>$P30,\"\",INDEX($B$1:$K$1&\"-\"&TEXT($B$2:$K$2,\"hh:mm\"),SMALL(IF($B30:$K30=\"\",COLUMN($B30:$K30)-COLUMN($B30)+1),COLUMNS($Q30:R30))))","v":"5-14:30"},{"$f":"IF(COLUMNS($Q30:S30)>$P30,\"\",INDEX($B$1:$K$1&\"-\"&TEXT($B$2:$K$2,\"hh:mm\"),SMALL(IF($B30:$K30=\"\",COLUMN($B30:$K30)-COLUMN($B30)+1),COLUMNS($Q30:S30))))","v":"6-15:30"},{"$f":"IF(COLUMNS($Q30:T30)>$P30,\"\",INDEX($B$1:$K$1&\"-\"&TEXT($B$2:$K$2,\"hh:mm\"),SMALL(IF($B30:$K30=\"\",COLUMN($B30:$K30)-COLUMN($B30)+1),COLUMNS($Q30:T30))))","v":"TEA-16:30"},{"$f":"IF(COLUMNS($Q30:U30)>$P30,\"\",INDEX($B$1:$K$1&\"-\"&TEXT($B$2:$K$2,\"hh:mm\"),SMALL(IF($B30:$K30=\"\",COLUMN($B30:$K30)-COLUMN($B30)+1),COLUMNS($Q30:U30))))","v":"7-17:00"},{"$f":"IF(COLUMNS($Q30:V30)>$P30,\"\",INDEX($B$1:$K$1&\"-\"&TEXT($B$2:$K$2,\"hh:mm\"),SMALL(IF($B30:$K30=\"\",COLUMN($B30:$K30)-COLUMN($B30)+1),COLUMNS($Q30:V30))))","v":""},{"$f":"IF(COLUMNS($Q30:W30)>$P30,\"\",INDEX($B$1:$K$1&\"-\"&TEXT($B$2:$K$2,\"hh:mm\"),SMALL(IF($B30:$K30=\"\",COLUMN($B30:$K30)-COLUMN($B30)+1),COLUMNS($Q30:W30))))","v":""},{"$f":"IF(COLUMNS($Q30:X30)>$P30,\"\",INDEX($B$1:$K$1&\"-\"&TEXT($B$2:$K$2,\"hh:mm\"),SMALL(IF($B30:$K30=\"\",COLUMN($B30:$K30)-COLUMN($B30)+1),COLUMNS($Q30:X30))))","v":""}]
["Student 29","A2Physics1","StatisticsS23",null,null,"13.45A2Maths4",null,null,null,"Philosophy2","SchoolMtg","Student 29",5,null,"Student 29",5,{"$f":"IF(COLUMNS($Q31:Q31)>$P31,\"\",INDEX($B$1:$K$1&\"-\"&TEXT($B$2:$K$2,\"hh:mm\"),SMALL(IF($B31:$K31=\"\",COLUMN($B31:$K31)-COLUMN($B31)+1),COLUMNS($Q31:Q31))))","v":"3-11:05"},{"$f":"IF(COLUMNS($Q31:R31)>$P31,\"\",INDEX($B$1:$K$1&\"-\"&TEXT($B$2:$K$2,\"hh:mm\"),SMALL(IF($B31:$K31=\"\",COLUMN($B31:$K31)-COLUMN($B31)+1),COLUMNS($Q31:R31))))","v":"4-12:05"},{"$f":"IF(COLUMNS($Q31:S31)>$P31,\"\",INDEX($B$1:$K$1&\"-\"&TEXT($B$2:$K$2,\"hh:mm\"),SMALL(IF($B31:$K31=\"\",COLUMN($B31:$K31)-COLUMN($B31)+1),COLUMNS($Q31:S31))))","v":"5-14:30"},{"$f":"IF(COLUMNS($Q31:T31)>$P31,\"\",INDEX($B$1:$K$1&\"-\"&TEXT($B$2:$K$2,\"hh:mm\"),SMALL(IF($B31:$K31=\"\",COLUMN($B31:$K31)-COLUMN($B31)+1),COLUMNS($Q31:T31))))","v":"6-15:30"},{"$f":"IF(COLUMNS($Q31:U31)>$P31,\"\",INDEX($B$1:$K$1&\"-\"&TEXT($B$2:$K$2,\"hh:mm\"),SMALL(IF($B31:$K31=\"\",COLUMN($B31:$K31)-COLUMN($B31)+1),COLUMNS($Q31:U31))))","v":"TEA-16:30"},{"$f":"IF(COLUMNS($Q31:V31)>$P31,\"\",INDEX($B$1:$K$1&\"-\"&TEXT($B$2:$K$2,\"hh:mm\"),SMALL(IF($B31:$K31=\"\",COLUMN($B31:$K31)-COLUMN($B31)+1),COLUMNS($Q31:V31))))","v":""},{"$f":"IF(COLUMNS($Q31:W31)>$P31,\"\",INDEX($B$1:$K$1&\"-\"&TEXT($B$2:$K$2,\"hh:mm\"),SMALL(IF($B31:$K31=\"\",COLUMN($B31:$K31)-COLUMN($B31)+1),COLUMNS($Q31:W31))))","v":""},{"$f":"IF(COLUMNS($Q31:X31)>$P31,\"\",INDEX($B$1:$K$1&\"-\"&TEXT($B$2:$K$2,\"hh:mm\"),SMALL(IF($B31:$K31=\"\",COLUMN($B31:$K31)-COLUMN($B31)+1),COLUMNS($Q31:X31))))","v":""}]
["Student 30",null,"ASEngLang3","MathsIGCM3","ASPsychology3",null,null,null,null,"DramaAS5","SchoolMtg","Student 30",5,null,"Student 30",5,{"$f":"IF(COLUMNS($Q32:Q32)>$P32,\"\",INDEX($B$1:$K$1&\"-\"&TEXT($B$2:$K$2,\"hh:mm\"),SMALL(IF($B32:$K32=\"\",COLUMN($B32:$K32)-COLUMN($B32)+1),COLUMNS($Q32:Q32))))","v":"1-09:05"},{"$f":"IF(COLUMNS($Q32:R32)>$P32,\"\",INDEX($B$1:$K$1&\"-\"&TEXT($B$2:$K$2,\"hh:mm\"),SMALL(IF($B32:$K32=\"\",COLUMN($B32:$K32)-COLUMN($B32)+1),COLUMNS($Q32:R32))))","v":"Lunch-13:00"},{"$f":"IF(COLUMNS($Q32:S32)>$P32,\"\",INDEX($B$1:$K$1&\"-\"&TEXT($B$2:$K$2,\"hh:mm\"),SMALL(IF($B32:$K32=\"\",COLUMN($B32:$K32)-COLUMN($B32)+1),COLUMNS($Q32:S32))))","v":"5-14:30"},{"$f":"IF(COLUMNS($Q32:T32)>$P32,\"\",INDEX($B$1:$K$1&\"-\"&TEXT($B$2:$K$2,\"hh:mm\"),SMALL(IF($B32:$K32=\"\",COLUMN($B32:$K32)-COLUMN($B32)+1),COLUMNS($Q32:T32))))","v":"6-15:30"},{"$f":"IF(COLUMNS($Q32:U32)>$P32,\"\",INDEX($B$1:$K$1&\"-\"&TEXT($B$2:$K$2,\"hh:mm\"),SMALL(IF($B32:$K32=\"\",COLUMN($B32:$K32)-COLUMN($B32)+1),COLUMNS($Q32:U32))))","v":"TEA-16:30"},{"$f":"IF(COLUMNS($Q32:V32)>$P32,\"\",INDEX($B$1:$K$1&\"-\"&TEXT($B$2:$K$2,\"hh:mm\"),SMALL(IF($B32:$K32=\"\",COLUMN($B32:$K32)-COLUMN($B32)+1),COLUMNS($Q32:V32))))","v":""},{"$f":"IF(COLUMNS($Q32:W32)>$P32,\"\",INDEX($B$1:$K$1&\"-\"&TEXT($B$2:$K$2,\"hh:mm\"),SMALL(IF($B32:$K32=\"\",COLUMN($B32:$K32)-COLUMN($B32)+1),COLUMNS($Q32:W32))))","v":""},{"$f":"IF(COLUMNS($Q32:X32)>$P32,\"\",INDEX($B$1:$K$1&\"-\"&TEXT($B$2:$K$2,\"hh:mm\"),SMALL(IF($B32:$K32=\"\",COLUMN($B32:$K32)-COLUMN($B32)+1),COLUMNS($Q32:X32))))","v":""}]
["Student 31","A2Biology1","A2Biology2","ASChemistry3",null,null,null,null,null,"Philosophy2","SchoolMtg","Student 31",5,null,"Student 31",5,{"$f":"IF(COLUMNS($Q33:Q33)>$P33,\"\",INDEX($B$1:$K$1&\"-\"&TEXT($B$2:$K$2,\"hh:mm\"),SMALL(IF($B33:$K33=\"\",COLUMN($B33:$K33)-COLUMN($B33)+1),COLUMNS($Q33:Q33))))","v":"4-12:05"},{"$f":"IF(COLUMNS($Q33:R33)>$P33,\"\",INDEX($B$1:$K$1&\"-\"&TEXT($B$2:$K$2,\"hh:mm\"),SMALL(IF($B33:$K33=\"\",COLUMN($B33:$K33)-COLUMN($B33)+1),COLUMNS($Q33:R33))))","v":"Lunch-13:00"},{"$f":"IF(COLUMNS($Q33:S33)>$P33,\"\",INDEX($B$1:$K$1&\"-\"&TEXT($B$2:$K$2,\"hh:mm\"),SMALL(IF($B33:$K33=\"\",COLUMN($B33:$K33)-COLUMN($B33)+1),COLUMNS($Q33:S33))))","v":"5-14:30"},{"$f":"IF(COLUMNS($Q33:T33)>$P33,\"\",INDEX($B$1:$K$1&\"-\"&TEXT($B$2:$K$2,\"hh:mm\"),SMALL(IF($B33:$K33=\"\",COLUMN($B33:$K33)-COLUMN($B33)+1),COLUMNS($Q33:T33))))","v":"6-15:30"},{"$f":"IF(COLUMNS($Q33:U33)>$P33,\"\",INDEX($B$1:$K$1&\"-\"&TEXT($B$2:$K$2,\"hh:mm\"),SMALL(IF($B33:$K33=\"\",COLUMN($B33:$K33)-COLUMN($B33)+1),COLUMNS($Q33:U33))))","v":"TEA-16:30"},{"$f":"IF(COLUMNS($Q33:V33)>$P33,\"\",INDEX($B$1:$K$1&\"-\"&TEXT($B$2:$K$2,\"hh:mm\"),SMALL(IF($B33:$K33=\"\",COLUMN($B33:$K33)-COLUMN($B33)+1),COLUMNS($Q33:V33))))","v":""},{"$f":"IF(COLUMNS($Q33:W33)>$P33,\"\",INDEX($B$1:$K$1&\"-\"&TEXT($B$2:$K$2,\"hh:mm\"),SMALL(IF($B33:$K33=\"\",COLUMN($B33:$K33)-COLUMN($B33)+1),COLUMNS($Q33:W33))))","v":""},{"$f":"IF(COLUMNS($Q33:X33)>$P33,\"\",INDEX($B$1:$K$1&\"-\"&TEXT($B$2:$K$2,\"hh:mm\"),SMALL(IF($B33:$K33=\"\",COLUMN($B33:$K33)-COLUMN($B33)+1),COLUMNS($Q33:X33))))","v":""}]
["Student 32","ASPMaths1c",null,"StatisticsS1b",null,null,null,null,null,null,"SchoolMtg","Student 32",3,null,"Student 32",7,{"$f":"IF(COLUMNS($Q34:Q34)>$P34,\"\",INDEX($B$1:$K$1&\"-\"&TEXT($B$2:$K$2,\"hh:mm\"),SMALL(IF($B34:$K34=\"\",COLUMN($B34:$K34)-COLUMN($B34)+1),COLUMNS($Q34:Q34))))","v":"2-10:05"},{"$f":"IF(COLUMNS($Q34:R34)>$P34,\"\",INDEX($B$1:$K$1&\"-\"&TEXT($B$2:$K$2,\"hh:mm\"),SMALL(IF($B34:$K34=\"\",COLUMN($B34:$K34)-COLUMN($B34)+1),COLUMNS($Q34:R34))))","v":"4-12:05"},{"$f":"IF(COLUMNS($Q34:S34)>$P34,\"\",INDEX($B$1:$K$1&\"-\"&TEXT($B$2:$K$2,\"hh:mm\"),SMALL(IF($B34:$K34=\"\",COLUMN($B34:$K34)-COLUMN($B34)+1),COLUMNS($Q34:S34))))","v":"Lunch-13:00"},{"$f":"IF(COLUMNS($Q34:T34)>$P34,\"\",INDEX($B$1:$K$1&\"-\"&TEXT($B$2:$K$2,\"hh:mm\"),SMALL(IF($B34:$K34=\"\",COLUMN($B34:$K34)-COLUMN($B34)+1),COLUMNS($Q34:T34))))","v":"5-14:30"},{"$f":"IF(COLUMNS($Q34:U34)>$P34,\"\",INDEX($B$1:$K$1&\"-\"&TEXT($B$2:$K$2,\"hh:mm\"),SMALL(IF($B34:$K34=\"\",COLUMN($B34:$K34)-COLUMN($B34)+1),COLUMNS($Q34:U34))))","v":"6-15:30"},{"$f":"IF(COLUMNS($Q34:V34)>$P34,\"\",INDEX($B$1:$K$1&\"-\"&TEXT($B$2:$K$2,\"hh:mm\"),SMALL(IF($B34:$K34=\"\",COLUMN($B34:$K34)-COLUMN($B34)+1),COLUMNS($Q34:V34))))","v":"TEA-16:30"},{"$f":"IF(COLUMNS($Q34:W34)>$P34,\"\",INDEX($B$1:$K$1&\"-\"&TEXT($B$2:$K$2,\"hh:mm\"),SMALL(IF($B34:$K34=\"\",COLUMN($B34:$K34)-COLUMN($B34)+1),COLUMNS($Q34:W34))))","v":"7-17:00"},{"$f":"IF(COLUMNS($Q34:X34)>$P34,\"\",INDEX($B$1:$K$1&\"-\"&TEXT($B$2:$K$2,\"hh:mm\"),SMALL(IF($B34:$K34=\"\",COLUMN($B34:$K34)-COLUMN($B34)+1),COLUMNS($Q34:X34))))","v":""}]
["Student 33","IGC2Her2",null,null,"12.15-12.45LS",null,null,null,null,null,"SchoolMtg","Student 33",3,null,"Student 33",7,{"$f":"IF(COLUMNS($Q35:Q35)>$P35,\"\",INDEX($B$1:$K$1&\"-\"&TEXT($B$2:$K$2,\"hh:mm\"),SMALL(IF($B35:$K35=\"\",COLUMN($B35:$K35)-COLUMN($B35)+1),COLUMNS($Q35:Q35))))","v":"2-10:05"},{"$f":"IF(COLUMNS($Q35:R35)>$P35,\"\",INDEX($B$1:$K$1&\"-\"&TEXT($B$2:$K$2,\"hh:mm\"),SMALL(IF($B35:$K35=\"\",COLUMN($B35:$K35)-COLUMN($B35)+1),COLUMNS($Q35:R35))))","v":"3-11:05"},{"$f":"IF(COLUMNS($Q35:S35)>$P35,\"\",INDEX($B$1:$K$1&\"-\"&TEXT($B$2:$K$2,\"hh:mm\"),SMALL(IF($B35:$K35=\"\",COLUMN($B35:$K35)-COLUMN($B35)+1),COLUMNS($Q35:S35))))","v":"Lunch-13:00"},{"$f":"IF(COLUMNS($Q35:T35)>$P35,\"\",INDEX($B$1:$K$1&\"-\"&TEXT($B$2:$K$2,\"hh:mm\"),SMALL(IF($B35:$K35=\"\",COLUMN($B35:$K35)-COLUMN($B35)+1),COLUMNS($Q35:T35))))","v":"5-14:30"},{"$f":"IF(COLUMNS($Q35:U35)>$P35,\"\",INDEX($B$1:$K$1&\"-\"&TEXT($B$2:$K$2,\"hh:mm\"),SMALL(IF($B35:$K35=\"\",COLUMN($B35:$K35)-COLUMN($B35)+1),COLUMNS($Q35:U35))))","v":"6-15:30"},{"$f":"IF(COLUMNS($Q35:V35)>$P35,\"\",INDEX($B$1:$K$1&\"-\"&TEXT($B$2:$K$2,\"hh:mm\"),SMALL(IF($B35:$K35=\"\",COLUMN($B35:$K35)-COLUMN($B35)+1),COLUMNS($Q35:V35))))","v":"TEA-16:30"},{"$f":"IF(COLUMNS($Q35:W35)>$P35,\"\",INDEX($B$1:$K$1&\"-\"&TEXT($B$2:$K$2,\"hh:mm\"),SMALL(IF($B35:$K35=\"\",COLUMN($B35:$K35)-COLUMN($B35)+1),COLUMNS($Q35:W35))))","v":"7-17:00"},{"$f":"IF(COLUMNS($Q35:X35)>$P35,\"\",INDEX($B$1:$K$1&\"-\"&TEXT($B$2:$K$2,\"hh:mm\"),SMALL(IF($B35:$K35=\"\",COLUMN($B35:$K35)-COLUMN($B35)+1),COLUMNS($Q35:X35))))","v":""}]
["Student 34","IGC2Her2",null,"ESLIELTST2",null,null,"Maintenance","Maintenance",null,null,"SchoolMtg","Student 34",5,null,"Student 34",5,{"$f":"IF(COLUMNS($Q36:Q36)>$P36,\"\",INDEX($B$1:$K$1&\"-\"&TEXT($B$2:$K$2,\"hh:mm\"),SMALL(IF($B36:$K36=\"\",COLUMN($B36:$K36)-COLUMN($B36)+1),COLUMNS($Q36:Q36))))","v":"2-10:05"},{"$f":"IF(COLUMNS($Q36:R36)>$P36,\"\",INDEX($B$1:$K$1&\"-\"&TEXT($B$2:$K$2,\"hh:mm\"),SMALL(IF($B36:$K36=\"\",COLUMN($B36:$K36)-COLUMN($B36)+1),COLUMNS($Q36:R36))))","v":"4-12:05"},{"$f":"IF(COLUMNS($Q36:S36)>$P36,\"\",INDEX($B$1:$K$1&\"-\"&TEXT($B$2:$K$2,\"hh:mm\"),SMALL(IF($B36:$K36=\"\",COLUMN($B36:$K36)-COLUMN($B36)+1),COLUMNS($Q36:S36))))","v":"Lunch-13:00"},{"$f":"IF(COLUMNS($Q36:T36)>$P36,\"\",INDEX($B$1:$K$1&\"-\"&TEXT($B$2:$K$2,\"hh:mm\"),SMALL(IF($B36:$K36=\"\",COLUMN($B36:$K36)-COLUMN($B36)+1),COLUMNS($Q36:T36))))","v":"TEA-16:30"},{"$f":"IF(COLUMNS($Q36:U36)>$P36,\"\",INDEX($B$1:$K$1&\"-\"&TEXT($B$2:$K$2,\"hh:mm\"),SMALL(IF($B36:$K36=\"\",COLUMN($B36:$K36)-COLUMN($B36)+1),COLUMNS($Q36:U36))))","v":"7-17:00"},{"$f":"IF(COLUMNS($Q36:V36)>$P36,\"\",INDEX($B$1:$K$1&\"-\"&TEXT($B$2:$K$2,\"hh:mm\"),SMALL(IF($B36:$K36=\"\",COLUMN($B36:$K36)-COLUMN($B36)+1),COLUMNS($Q36:V36))))","v":""},{"$f":"IF(COLUMNS($Q36:W36)>$P36,\"\",INDEX($B$1:$K$1&\"-\"&TEXT($B$2:$K$2,\"hh:mm\"),SMALL(IF($B36:$K36=\"\",COLUMN($B36:$K36)-COLUMN($B36)+1),COLUMNS($Q36:W36))))","v":""},{"$f":"IF(COLUMNS($Q36:X36)>$P36,\"\",INDEX($B$1:$K$1&\"-\"&TEXT($B$2:$K$2,\"hh:mm\"),SMALL(IF($B36:$K36=\"\",COLUMN($B36:$K36)-COLUMN($B36)+1),COLUMNS($Q36:X36))))","v":""}]
["Student 35",null,"ASEngLang3","MathsIGCS-Study","ASHistory1",null,null,null,null,null,"SchoolMtg","Student 35",4,null,"Student 35",6,{"$f":"IF(COLUMNS($Q37:Q37)>$P37,\"\",INDEX($B$1:$K$1&\"-\"&TEXT($B$2:$K$2,\"hh:mm\"),SMALL(IF($B37:$K37=\"\",COLUMN($B37:$K37)-COLUMN($B37)+1),COLUMNS($Q37:Q37))))","v":"1-09:05"},{"$f":"IF(COLUMNS($Q37:R37)>$P37,\"\",INDEX($B$1:$K$1&\"-\"&TEXT($B$2:$K$2,\"hh:mm\"),SMALL(IF($B37:$K37=\"\",COLUMN($B37:$K37)-COLUMN($B37)+1),COLUMNS($Q37:R37))))","v":"Lunch-13:00"},{"$f":"IF(COLUMNS($Q37:S37)>$P37,\"\",INDEX($B$1:$K$1&\"-\"&TEXT($B$2:$K$2,\"hh:mm\"),SMALL(IF($B37:$K37=\"\",COLUMN($B37:$K37)-COLUMN($B37)+1),COLUMNS($Q37:S37))))","v":"5-14:30"},{"$f":"IF(COLUMNS($Q37:T37)>$P37,\"\",INDEX($B$1:$K$1&\"-\"&TEXT($B$2:$K$2,\"hh:mm\"),SMALL(IF($B37:$K37=\"\",COLUMN($B37:$K37)-COLUMN($B37)+1),COLUMNS($Q37:T37))))","v":"6-15:30"},{"$f":"IF(COLUMNS($Q37:U37)>$P37,\"\",INDEX($B$1:$K$1&\"-\"&TEXT($B$2:$K$2,\"hh:mm\"),SMALL(IF($B37:$K37=\"\",COLUMN($B37:$K37)-COLUMN($B37)+1),COLUMNS($Q37:U37))))","v":"TEA-16:30"},{"$f":"IF(COLUMNS($Q37:V37)>$P37,\"\",INDEX($B$1:$K$1&\"-\"&TEXT($B$2:$K$2,\"hh:mm\"),SMALL(IF($B37:$K37=\"\",COLUMN($B37:$K37)-COLUMN($B37)+1),COLUMNS($Q37:V37))))","v":"7-17:00"},{"$f":"IF(COLUMNS($Q37:W37)>$P37,\"\",INDEX($B$1:$K$1&\"-\"&TEXT($B$2:$K$2,\"hh:mm\"),SMALL(IF($B37:$K37=\"\",COLUMN($B37:$K37)-COLUMN($B37)+1),COLUMNS($Q37:W37))))","v":""},{"$f":"IF(COLUMNS($Q37:X37)>$P37,\"\",INDEX($B$1:$K$1&\"-\"&TEXT($B$2:$K$2,\"hh:mm\"),SMALL(IF($B37:$K37=\"\",COLUMN($B37:$K37)-COLUMN($B37)+1),COLUMNS($Q37:X37))))","v":""}]
["Student 36","ASPMaths1c",null,"StatisticsS1b","ASHistory1",null,"A2Psychology2",null,null,null,"SchoolMtg","Student 36",5,null,"Student 36",5,{"$f":"IF(COLUMNS($Q38:Q38)>$P38,\"\",INDEX($B$1:$K$1&\"-\"&TEXT($B$2:$K$2,\"hh:mm\"),SMALL(IF($B38:$K38=\"\",COLUMN($B38:$K38)-COLUMN($B38)+1),COLUMNS($Q38:Q38))))","v":"2-10:05"},{"$f":"IF(COLUMNS($Q38:R38)>$P38,\"\",INDEX($B$1:$K$1&\"-\"&TEXT($B$2:$K$2,\"hh:mm\"),SMALL(IF($B38:$K38=\"\",COLUMN($B38:$K38)-COLUMN($B38)+1),COLUMNS($Q38:R38))))","v":"Lunch-13:00"},{"$f":"IF(COLUMNS($Q38:S38)>$P38,\"\",INDEX($B$1:$K$1&\"-\"&TEXT($B$2:$K$2,\"hh:mm\"),SMALL(IF($B38:$K38=\"\",COLUMN($B38:$K38)-COLUMN($B38)+1),COLUMNS($Q38:S38))))","v":"6-15:30"},{"$f":"IF(COLUMNS($Q38:T38)>$P38,\"\",INDEX($B$1:$K$1&\"-\"&TEXT($B$2:$K$2,\"hh:mm\"),SMALL(IF($B38:$K38=\"\",COLUMN($B38:$K38)-COLUMN($B38)+1),COLUMNS($Q38:T38))))","v":"TEA-16:30"},{"$f":"IF(COLUMNS($Q38:U38)>$P38,\"\",INDEX($B$1:$K$1&\"-\"&TEXT($B$2:$K$2,\"hh:mm\"),SMALL(IF($B38:$K38=\"\",COLUMN($B38:$K38)-COLUMN($B38)+1),COLUMNS($Q38:U38))))","v":"7-17:00"},{"$f":"IF(COLUMNS($Q38:V38)>$P38,\"\",INDEX($B$1:$K$1&\"-\"&TEXT($B$2:$K$2,\"hh:mm\"),SMALL(IF($B38:$K38=\"\",COLUMN($B38:$K38)-COLUMN($B38)+1),COLUMNS($Q38:V38))))","v":""},{"$f":"IF(COLUMNS($Q38:W38)>$P38,\"\",INDEX($B$1:$K$1&\"-\"&TEXT($B$2:$K$2,\"hh:mm\"),SMALL(IF($B38:$K38=\"\",COLUMN($B38:$K38)-COLUMN($B38)+1),COLUMNS($Q38:W38))))","v":""},{"$f":"IF(COLUMNS($Q38:X38)>$P38,\"\",INDEX($B$1:$K$1&\"-\"&TEXT($B$2:$K$2,\"hh:mm\"),SMALL(IF($B38:$K38=\"\",COLUMN($B38:$K38)-COLUMN($B38)+1),COLUMNS($Q38:X38))))","v":""}]
["Student 37",null,"MathsG2G2","CareforEarthM3","CareforEarthM3",null,null,null,null,"Philosophy2","SchoolMtg","Student 37",5,null,"Student 37",5,{"$f":"IF(COLUMNS($Q39:Q39)>$P39,\"\",INDEX($B$1:$K$1&\"-\"&TEXT($B$2:$K$2,\"hh:mm\"),SMALL(IF($B39:$K39=\"\",COLUMN($B39:$K39)-COLUMN($B39)+1),COLUMNS($Q39:Q39))))","v":"1-09:05"},{"$f":"IF(COLUMNS($Q39:R39)>$P39,\"\",INDEX($B$1:$K$1&\"-\"&TEXT($B$2:$K$2,\"hh:mm\"),SMALL(IF($B39:$K39=\"\",COLUMN($B39:$K39)-COLUMN($B39)+1),COLUMNS($Q39:R39))))","v":"Lunch-13:00"},{"$f":"IF(COLUMNS($Q39:S39)>$P39,\"\",INDEX($B$1:$K$1&\"-\"&TEXT($B$2:$K$2,\"hh:mm\"),SMALL(IF($B39:$K39=\"\",COLUMN($B39:$K39)-COLUMN($B39)+1),COLUMNS($Q39:S39))))","v":"5-14:30"},{"$f":"IF(COLUMNS($Q39:T39)>$P39,\"\",INDEX($B$1:$K$1&\"-\"&TEXT($B$2:$K$2,\"hh:mm\"),SMALL(IF($B39:$K39=\"\",COLUMN($B39:$K39)-COLUMN($B39)+1),COLUMNS($Q39:T39))))","v":"6-15:30"},{"$f":"IF(COLUMNS($Q39:U39)>$P39,\"\",INDEX($B$1:$K$1&\"-\"&TEXT($B$2:$K$2,\"hh:mm\"),SMALL(IF($B39:$K39=\"\",COLUMN($B39:$K39)-COLUMN($B39)+1),COLUMNS($Q39:U39))))","v":"TEA-16:30"},{"$f":"IF(COLUMNS($Q39:V39)>$P39,\"\",INDEX($B$1:$K$1&\"-\"&TEXT($B$2:$K$2,\"hh:mm\"),SMALL(IF($B39:$K39=\"\",COLUMN($B39:$K39)-COLUMN($B39)+1),COLUMNS($Q39:V39))))","v":""},{"$f":"IF(COLUMNS($Q39:W39)>$P39,\"\",INDEX($B$1:$K$1&\"-\"&TEXT($B$2:$K$2,\"hh:mm\"),SMALL(IF($B39:$K39=\"\",COLUMN($B39:$K39)-COLUMN($B39)+1),COLUMNS($Q39:W39))))","v":""},{"$f":"IF(COLUMNS($Q39:X39)>$P39,\"\",INDEX($B$1:$K$1&\"-\"&TEXT($B$2:$K$2,\"hh:mm\"),SMALL(IF($B39:$K39=\"\",COLUMN($B39:$K39)-COLUMN($B39)+1),COLUMNS($Q39:X39))))","v":""}]
["Student 38","IGC2Her2",null,"BiologyAS2A3",null,null,null,null,null,null,"SchoolMtg","Student 38",3,null,"Student 38",7,{"$f":"IF(COLUMNS($Q40:Q40)>$P40,\"\",INDEX($B$1:$K$1&\"-\"&TEXT($B$2:$K$2,\"hh:mm\"),SMALL(IF($B40:$K40=\"\",COLUMN($B40:$K40)-COLUMN($B40)+1),COLUMNS($Q40:Q40))))","v":"2-10:05"},{"$f":"IF(COLUMNS($Q40:R40)>$P40,\"\",INDEX($B$1:$K$1&\"-\"&TEXT($B$2:$K$2,\"hh:mm\"),SMALL(IF($B40:$K40=\"\",COLUMN($B40:$K40)-COLUMN($B40)+1),COLUMNS($Q40:R40))))","v":"4-12:05"},{"$f":"IF(COLUMNS($Q40:S40)>$P40,\"\",INDEX($B$1:$K$1&\"-\"&TEXT($B$2:$K$2,\"hh:mm\"),SMALL(IF($B40:$K40=\"\",COLUMN($B40:$K40)-COLUMN($B40)+1),COLUMNS($Q40:S40))))","v":"Lunch-13:00"},{"$f":"IF(COLUMNS($Q40:T40)>$P40,\"\",INDEX($B$1:$K$1&\"-\"&TEXT($B$2:$K$2,\"hh:mm\"),SMALL(IF($B40:$K40=\"\",COLUMN($B40:$K40)-COLUMN($B40)+1),COLUMNS($Q40:T40))))","v":"5-14:30"},{"$f":"IF(COLUMNS($Q40:U40)>$P40,\"\",INDEX($B$1:$K$1&\"-\"&TEXT($B$2:$K$2,\"hh:mm\"),SMALL(IF($B40:$K40=\"\",COLUMN($B40:$K40)-COLUMN($B40)+1),COLUMNS($Q40:U40))))","v":"6-15:30"},{"$f":"IF(COLUMNS($Q40:V40)>$P40,\"\",INDEX($B$1:$K$1&\"-\"&TEXT($B$2:$K$2,\"hh:mm\"),SMALL(IF($B40:$K40=\"\",COLUMN($B40:$K40)-COLUMN($B40)+1),COLUMNS($Q40:V40))))","v":"TEA-16:30"},{"$f":"IF(COLUMNS($Q40:W40)>$P40,\"\",INDEX($B$1:$K$1&\"-\"&TEXT($B$2:$K$2,\"hh:mm\"),SMALL(IF($B40:$K40=\"\",COLUMN($B40:$K40)-COLUMN($B40)+1),COLUMNS($Q40:W40))))","v":"7-17:00"},{"$f":"IF(COLUMNS($Q40:X40)>$P40,\"\",INDEX($B$1:$K$1&\"-\"&TEXT($B$2:$K$2,\"hh:mm\"),SMALL(IF($B40:$K40=\"\",COLUMN($B40:$K40)-COLUMN($B40)+1),COLUMNS($Q40:X40))))","v":""}]
["Student 39","ASPMaths1c","PhysicsPAS3",null,"CGeography2",null,null,null,null,"Philosophy2","SchoolMtg","Student 39",5,null,"Student 39",5,{"$f":"IF(COLUMNS($Q41:Q41)>$P41,\"\",INDEX($B$1:$K$1&\"-\"&TEXT($B$2:$K$2,\"hh:mm\"),SMALL(IF($B41:$K41=\"\",COLUMN($B41:$K41)-COLUMN($B41)+1),COLUMNS($Q41:Q41))))","v":"3-11:05"},{"$f":"IF(COLUMNS($Q41:R41)>$P41,\"\",INDEX($B$1:$K$1&\"-\"&TEXT($B$2:$K$2,\"hh:mm\"),SMALL(IF($B41:$K41=\"\",COLUMN($B41:$K41)-COLUMN($B41)+1),COLUMNS($Q41:R41))))","v":"Lunch-13:00"},{"$f":"IF(COLUMNS($Q41:S41)>$P41,\"\",INDEX($B$1:$K$1&\"-\"&TEXT($B$2:$K$2,\"hh:mm\"),SMALL(IF($B41:$K41=\"\",COLUMN($B41:$K41)-COLUMN($B41)+1),COLUMNS($Q41:S41))))","v":"5-14:30"},{"$f":"IF(COLUMNS($Q41:T41)>$P41,\"\",INDEX($B$1:$K$1&\"-\"&TEXT($B$2:$K$2,\"hh:mm\"),SMALL(IF($B41:$K41=\"\",COLUMN($B41:$K41)-COLUMN($B41)+1),COLUMNS($Q41:T41))))","v":"6-15:30"},{"$f":"IF(COLUMNS($Q41:U41)>$P41,\"\",INDEX($B$1:$K$1&\"-\"&TEXT($B$2:$K$2,\"hh:mm\"),SMALL(IF($B41:$K41=\"\",COLUMN($B41:$K41)-COLUMN($B41)+1),COLUMNS($Q41:U41))))","v":"TEA-16:30"},{"$f":"IF(COLUMNS($Q41:V41)>$P41,\"\",INDEX($B$1:$K$1&\"-\"&TEXT($B$2:$K$2,\"hh:mm\"),SMALL(IF($B41:$K41=\"\",COLUMN($B41:$K41)-COLUMN($B41)+1),COLUMNS($Q41:V41))))","v":""},{"$f":"IF(COLUMNS($Q41:W41)>$P41,\"\",INDEX($B$1:$K$1&\"-\"&TEXT($B$2:$K$2,\"hh:mm\"),SMALL(IF($B41:$K41=\"\",COLUMN($B41:$K41)-COLUMN($B41)+1),COLUMNS($Q41:W41))))","v":""},{"$f":"IF(COLUMNS($Q41:X41)>$P41,\"\",INDEX($B$1:$K$1&\"-\"&TEXT($B$2:$K$2,\"hh:mm\"),SMALL(IF($B41:$K41=\"\",COLUMN($B41:$K41)-COLUMN($B41)+1),COLUMNS($Q41:X41))))","v":""}]
["Student 40",null,"ASPhotoM","BiologyAS2A3","CGeography2",null,null,null,null,null,"SchoolMtg","Student 40",4,null,"Student 40",6,{"$f":"IF(COLUMNS($Q42:Q42)>$P42,\"\",INDEX($B$1:$K$1&\"-\"&TEXT($B$2:$K$2,\"hh:mm\"),SMALL(IF($B42:$K42=\"\",COLUMN($B42:$K42)-COLUMN($B42)+1),COLUMNS($Q42:Q42))))","v":"1-09:05"},{"$f":"IF(COLUMNS($Q42:R42)>$P42,\"\",INDEX($B$1:$K$1&\"-\"&TEXT($B$2:$K$2,\"hh:mm\"),SMALL(IF($B42:$K42=\"\",COLUMN($B42:$K42)-COLUMN($B42)+1),COLUMNS($Q42:R42))))","v":"Lunch-13:00"},{"$f":"IF(COLUMNS($Q42:S42)>$P42,\"\",INDEX($B$1:$K$1&\"-\"&TEXT($B$2:$K$2,\"hh:mm\"),SMALL(IF($B42:$K42=\"\",COLUMN($B42:$K42)-COLUMN($B42)+1),COLUMNS($Q42:S42))))","v":"5-14:30"},{"$f":"IF(COLUMNS($Q42:T42)>$P42,\"\",INDEX($B$1:$K$1&\"-\"&TEXT($B$2:$K$2,\"hh:mm\"),SMALL(IF($B42:$K42=\"\",COLUMN($B42:$K42)-COLUMN($B42)+1),COLUMNS($Q42:T42))))","v":"6-15:30"},{"$f":"IF(COLUMNS($Q42:U42)>$P42,\"\",INDEX($B$1:$K$1&\"-\"&TEXT($B$2:$K$2,\"hh:mm\"),SMALL(IF($B42:$K42=\"\",COLUMN($B42:$K42)-COLUMN($B42)+1),COLUMNS($Q42:U42))))","v":"TEA-16:30"},{"$f":"IF(COLUMNS($Q42:V42)>$P42,\"\",INDEX($B$1:$K$1&\"-\"&TEXT($B$2:$K$2,\"hh:mm\"),SMALL(IF($B42:$K42=\"\",COLUMN($B42:$K42)-COLUMN($B42)+1),COLUMNS($Q42:V42))))","v":"7-17:00"},{"$f":"IF(COLUMNS($Q42:W42)>$P42,\"\",INDEX($B$1:$K$1&\"-\"&TEXT($B$2:$K$2,\"hh:mm\"),SMALL(IF($B42:$K42=\"\",COLUMN($B42:$K42)-COLUMN($B42)+1),COLUMNS($Q42:W42))))","v":""},{"$f":"IF(COLUMNS($Q42:X42)>$P42,\"\",INDEX($B$1:$K$1&\"-\"&TEXT($B$2:$K$2,\"hh:mm\"),SMALL(IF($B42:$K42=\"\",COLUMN($B42:$K42)-COLUMN($B42)+1),COLUMNS($Q42:X42))))","v":""}]
["Student 41","MathsIGCN3","AdvESLY1","BiologyAS2A3+","ASHistory1",null,null,null,null,null,"SchoolMtg","Student 41",5,null,{"$f":"L43","v":"Student 41"},5,{"$f":"IF(COLUMNS($Q43:Q43)>$P43,\"\",INDEX($B$1:$K$1&\"-\"&TEXT($B$2:$K$2,\"hh:mm\"),SMALL(IF($B43:$K43=\"\",COLUMN($B43:$K43)-COLUMN($B43)+1),COLUMNS($Q43:Q43))))","v":"Lunch-13:00"},{"$f":"IF(COLUMNS($Q43:R43)>$P43,\"\",INDEX($B$1:$K$1&\"-\"&TEXT($B$2:$K$2,\"hh:mm\"),SMALL(IF($B43:$K43=\"\",COLUMN($B43:$K43)-COLUMN($B43)+1),COLUMNS($Q43:R43))))","v":"5-14:30"},{"$f":"IF(COLUMNS($Q43:S43)>$P43,\"\",INDEX($B$1:$K$1&\"-\"&TEXT($B$2:$K$2,\"hh:mm\"),SMALL(IF($B43:$K43=\"\",COLUMN($B43:$K43)-COLUMN($B43)+1),COLUMNS($Q43:S43))))","v":"6-15:30"},{"$f":"IF(COLUMNS($Q43:T43)>$P43,\"\",INDEX($B$1:$K$1&\"-\"&TEXT($B$2:$K$2,\"hh:mm\"),SMALL(IF($B43:$K43=\"\",COLUMN($B43:$K43)-COLUMN($B43)+1),COLUMNS($Q43:T43))))","v":"TEA-16:30"},{"$f":"IF(COLUMNS($Q43:U43)>$P43,\"\",INDEX($B$1:$K$1&\"-\"&TEXT($B$2:$K$2,\"hh:mm\"),SMALL(IF($B43:$K43=\"\",COLUMN($B43:$K43)-COLUMN($B43)+1),COLUMNS($Q43:U43))))","v":"7-17:00"},{"$f":"IF(COLUMNS($Q43:V43)>$P43,\"\",INDEX($B$1:$K$1&\"-\"&TEXT($B$2:$K$2,\"hh:mm\"),SMALL(IF($B43:$K43=\"\",COLUMN($B43:$K43)-COLUMN($B43)+1),COLUMNS($Q43:V43))))","v":""},{"$f":"IF(COLUMNS($Q43:W43)>$P43,\"\",INDEX($B$1:$K$1&\"-\"&TEXT($B$2:$K$2,\"hh:mm\"),SMALL(IF($B43:$K43=\"\",COLUMN($B43:$K43)-COLUMN($B43)+1),COLUMNS($Q43:W43))))","v":""},{"$f":"IF(COLUMNS($Q43:X43)>$P43,\"\",INDEX($B$1:$K$1&\"-\"&TEXT($B$2:$K$2,\"hh:mm\"),SMALL(IF($B43:$K43=\"\",COLUMN($B43:$K43)-COLUMN($B43)+1),COLUMNS($Q43:X43))))","v":""}]
["Student 42","ASPMaths1c","SMechanics3","ASPhysics4","CGeography2",null,null,null,null,null,"SchoolMtg","Student 42",5,null,{"$f":"L44","v":"Student 42"},5,{"$f":"IF(COLUMNS($Q44:Q44)>$P44,\"\",INDEX($B$1:$K$1&\"-\"&TEXT($B$2:$K$2,\"hh:mm\"),SMALL(IF($B44:$K44=\"\",COLUMN($B44:$K44)-COLUMN($B44)+1),COLUMNS($Q44:Q44))))","v":"Lunch-13:00"},{"$f":"IF(COLUMNS($Q44:R44)>$P44,\"\",INDEX($B$1:$K$1&\"-\"&TEXT($B$2:$K$2,\"hh:mm\"),SMALL(IF($B44:$K44=\"\",COLUMN($B44:$K44)-COLUMN($B44)+1),COLUMNS($Q44:R44))))","v":"5-14:30"},{"$f":"IF(COLUMNS($Q44:S44)>$P44,\"\",INDEX($B$1:$K$1&\"-\"&TEXT($B$2:$K$2,\"hh:mm\"),SMALL(IF($B44:$K44=\"\",COLUMN($B44:$K44)-COLUMN($B44)+1),COLUMNS($Q44:S44))))","v":"6-15:30"},{"$f":"IF(COLUMNS($Q44:T44)>$P44,\"\",INDEX($B$1:$K$1&\"-\"&TEXT($B$2:$K$2,\"hh:mm\"),SMALL(IF($B44:$K44=\"\",COLUMN($B44:$K44)-COLUMN($B44)+1),COLUMNS($Q44:T44))))","v":"TEA-16:30"},{"$f":"IF(COLUMNS($Q44:U44)>$P44,\"\",INDEX($B$1:$K$1&\"-\"&TEXT($B$2:$K$2,\"hh:mm\"),SMALL(IF($B44:$K44=\"\",COLUMN($B44:$K44)-COLUMN($B44)+1),COLUMNS($Q44:U44))))","v":"7-17:00"},{"$f":"IF(COLUMNS($Q44:V44)>$P44,\"\",INDEX($B$1:$K$1&\"-\"&TEXT($B$2:$K$2,\"hh:mm\"),SMALL(IF($B44:$K44=\"\",COLUMN($B44:$K44)-COLUMN($B44)+1),COLUMNS($Q44:V44))))","v":""},{"$f":"IF(COLUMNS($Q44:W44)>$P44,\"\",INDEX($B$1:$K$1&\"-\"&TEXT($B$2:$K$2,\"hh:mm\"),SMALL(IF($B44:$K44=\"\",COLUMN($B44:$K44)-COLUMN($B44)+1),COLUMNS($Q44:W44))))","v":""},{"$f":"IF(COLUMNS($Q44:X44)>$P44,\"\",INDEX($B$1:$K$1&\"-\"&TEXT($B$2:$K$2,\"hh:mm\"),SMALL(IF($B44:$K44=\"\",COLUMN($B44:$K44)-COLUMN($B44)+1),COLUMNS($Q44:X44))))","v":""}]
["Student 43","09.30-10.25LS",null,"BiologyAS2A3",null,null,"A2Psychology2",null,null,"Philosophy2","SchoolMtg","Student 43",5,null,"Student 43",5,{"$f":"IF(COLUMNS($Q45:Q45)>$P45,\"\",INDEX($B$1:$K$1&\"-\"&TEXT($B$2:$K$2,\"hh:mm\"),SMALL(IF($B45:$K45=\"\",COLUMN($B45:$K45)-COLUMN($B45)+1),COLUMNS($Q45:Q45))))","v":"2-10:05"},{"$f":"IF(COLUMNS($Q45:R45)>$P45,\"\",INDEX($B$1:$K$1&\"-\"&TEXT($B$2:$K$2,\"hh:mm\"),SMALL(IF($B45:$K45=\"\",COLUMN($B45:$K45)-COLUMN($B45)+1),COLUMNS($Q45:R45))))","v":"4-12:05"},{"$f":"IF(COLUMNS($Q45:S45)>$P45,\"\",INDEX($B$1:$K$1&\"-\"&TEXT($B$2:$K$2,\"hh:mm\"),SMALL(IF($B45:$K45=\"\",COLUMN($B45:$K45)-COLUMN($B45)+1),COLUMNS($Q45:S45))))","v":"Lunch-13:00"},{"$f":"IF(COLUMNS($Q45:T45)>$P45,\"\",INDEX($B$1:$K$1&\"-\"&TEXT($B$2:$K$2,\"hh:mm\"),SMALL(IF($B45:$K45=\"\",COLUMN($B45:$K45)-COLUMN($B45)+1),COLUMNS($Q45:T45))))","v":"6-15:30"},{"$f":"IF(COLUMNS($Q45:U45)>$P45,\"\",INDEX($B$1:$K$1&\"-\"&TEXT($B$2:$K$2,\"hh:mm\"),SMALL(IF($B45:$K45=\"\",COLUMN($B45:$K45)-COLUMN($B45)+1),COLUMNS($Q45:U45))))","v":"TEA-16:30"},{"$f":"IF(COLUMNS($Q45:V45)>$P45,\"\",INDEX($B$1:$K$1&\"-\"&TEXT($B$2:$K$2,\"hh:mm\"),SMALL(IF($B45:$K45=\"\",COLUMN($B45:$K45)-COLUMN($B45)+1),COLUMNS($Q45:V45))))","v":""},{"$f":"IF(COLUMNS($Q45:W45)>$P45,\"\",INDEX($B$1:$K$1&\"-\"&TEXT($B$2:$K$2,\"hh:mm\"),SMALL(IF($B45:$K45=\"\",COLUMN($B45:$K45)-COLUMN($B45)+1),COLUMNS($Q45:W45))))","v":""},{"$f":"IF(COLUMNS($Q45:X45)>$P45,\"\",INDEX($B$1:$K$1&\"-\"&TEXT($B$2:$K$2,\"hh:mm\"),SMALL(IF($B45:$K45=\"\",COLUMN($B45:$K45)-COLUMN($B45)+1),COLUMNS($Q45:X45))))","v":""}]
["Student 44","ASPMaths1c",null,"StatisticsS1b",null,null,null,null,null,null,"SchoolMtg","Student 44",3,null,"Student 44",7,{"$f":"IF(COLUMNS($Q46:Q46)>$P46,\"\",INDEX($B$1:$K$1&\"-\"&TEXT($B$2:$K$2,\"hh:mm\"),SMALL(IF($B46:$K46=\"\",COLUMN($B46:$K46)-COLUMN($B46)+1),COLUMNS($Q46:Q46))))","v":"2-10:05"},{"$f":"IF(COLUMNS($Q46:R46)>$P46,\"\",INDEX($B$1:$K$1&\"-\"&TEXT($B$2:$K$2,\"hh:mm\"),SMALL(IF($B46:$K46=\"\",COLUMN($B46:$K46)-COLUMN($B46)+1),COLUMNS($Q46:R46))))","v":"4-12:05"},{"$f":"IF(COLUMNS($Q46:S46)>$P46,\"\",INDEX($B$1:$K$1&\"-\"&TEXT($B$2:$K$2,\"hh:mm\"),SMALL(IF($B46:$K46=\"\",COLUMN($B46:$K46)-COLUMN($B46)+1),COLUMNS($Q46:S46))))","v":"Lunch-13:00"},{"$f":"IF(COLUMNS($Q46:T46)>$P46,\"\",INDEX($B$1:$K$1&\"-\"&TEXT($B$2:$K$2,\"hh:mm\"),SMALL(IF($B46:$K46=\"\",COLUMN($B46:$K46)-COLUMN($B46)+1),COLUMNS($Q46:T46))))","v":"5-14:30"},{"$f":"IF(COLUMNS($Q46:U46)>$P46,\"\",INDEX($B$1:$K$1&\"-\"&TEXT($B$2:$K$2,\"hh:mm\"),SMALL(IF($B46:$K46=\"\",COLUMN($B46:$K46)-COLUMN($B46)+1),COLUMNS($Q46:U46))))","v":"6-15:30"},{"$f":"IF(COLUMNS($Q46:V46)>$P46,\"\",INDEX($B$1:$K$1&\"-\"&TEXT($B$2:$K$2,\"hh:mm\"),SMALL(IF($B46:$K46=\"\",COLUMN($B46:$K46)-COLUMN($B46)+1),COLUMNS($Q46:V46))))","v":"TEA-16:30"},{"$f":"IF(COLUMNS($Q46:W46)>$P46,\"\",INDEX($B$1:$K$1&\"-\"&TEXT($B$2:$K$2,\"hh:mm\"),SMALL(IF($B46:$K46=\"\",COLUMN($B46:$K46)-COLUMN($B46)+1),COLUMNS($Q46:W46))))","v":"7-17:00"},{"$f":"IF(COLUMNS($Q46:X46)>$P46,\"\",INDEX($B$1:$K$1&\"-\"&TEXT($B$2:$K$2,\"hh:mm\"),SMALL(IF($B46:$K46=\"\",COLUMN($B46:$K46)-COLUMN($B46)+1),COLUMNS($Q46:X46))))","v":""}]
["Student 45","MathsIGCN3","PhysicsPAS3","CCriminology3","Japanese1",null,null,null,null,"ASGraphicD3","SchoolMtg","Student 45",6,null,"Student 45",4,{"$f":"IF(COLUMNS($Q47:Q47)>$P47,\"\",INDEX($B$1:$K$1&\"-\"&TEXT($B$2:$K$2,\"hh:mm\"),SMALL(IF($B47:$K47=\"\",COLUMN($B47:$K47)-COLUMN($B47)+1),COLUMNS($Q47:Q47))))","v":"Lunch-13:00"},{"$f":"IF(COLUMNS($Q47:R47)>$P47,\"\",INDEX($B$1:$K$1&\"-\"&TEXT($B$2:$K$2,\"hh:mm\"),SMALL(IF($B47:$K47=\"\",COLUMN($B47:$K47)-COLUMN($B47)+1),COLUMNS($Q47:R47))))","v":"5-14:30"},{"$f":"IF(COLUMNS($Q47:S47)>$P47,\"\",INDEX($B$1:$K$1&\"-\"&TEXT($B$2:$K$2,\"hh:mm\"),SMALL(IF($B47:$K47=\"\",COLUMN($B47:$K47)-COLUMN($B47)+1),COLUMNS($Q47:S47))))","v":"6-15:30"},{"$f":"IF(COLUMNS($Q47:T47)>$P47,\"\",INDEX($B$1:$K$1&\"-\"&TEXT($B$2:$K$2,\"hh:mm\"),SMALL(IF($B47:$K47=\"\",COLUMN($B47:$K47)-COLUMN($B47)+1),COLUMNS($Q47:T47))))","v":"TEA-16:30"},{"$f":"IF(COLUMNS($Q47:U47)>$P47,\"\",INDEX($B$1:$K$1&\"-\"&TEXT($B$2:$K$2,\"hh:mm\"),SMALL(IF($B47:$K47=\"\",COLUMN($B47:$K47)-COLUMN($B47)+1),COLUMNS($Q47:U47))))","v":""},{"$f":"IF(COLUMNS($Q47:V47)>$P47,\"\",INDEX($B$1:$K$1&\"-\"&TEXT($B$2:$K$2,\"hh:mm\"),SMALL(IF($B47:$K47=\"\",COLUMN($B47:$K47)-COLUMN($B47)+1),COLUMNS($Q47:V47))))","v":""},{"$f":"IF(COLUMNS($Q47:W47)>$P47,\"\",INDEX($B$1:$K$1&\"-\"&TEXT($B$2:$K$2,\"hh:mm\"),SMALL(IF($B47:$K47=\"\",COLUMN($B47:$K47)-COLUMN($B47)+1),COLUMNS($Q47:W47))))","v":""},{"$f":"IF(COLUMNS($Q47:X47)>$P47,\"\",INDEX($B$1:$K$1&\"-\"&TEXT($B$2:$K$2,\"hh:mm\"),SMALL(IF($B47:$K47=\"\",COLUMN($B47:$K47)-COLUMN($B47)+1),COLUMNS($Q47:X47))))","v":""}]
["Student 46","MathsIGCN3",null,"BiologyAS2A3","ASHistory1",null,null,null,null,null,"SchoolMtg","Student 46",4,null,"Student 46",6,{"$f":"IF(COLUMNS($Q48:Q48)>$P48,\"\",INDEX($B$1:$K$1&\"-\"&TEXT($B$2:$K$2,\"hh:mm\"),SMALL(IF($B48:$K48=\"\",COLUMN($B48:$K48)-COLUMN($B48)+1),COLUMNS($Q48:Q48))))","v":"2-10:05"},{"$f":"IF(COLUMNS($Q48:R48)>$P48,\"\",INDEX($B$1:$K$1&\"-\"&TEXT($B$2:$K$2,\"hh:mm\"),SMALL(IF($B48:$K48=\"\",COLUMN($B48:$K48)-COLUMN($B48)+1),COLUMNS($Q48:R48))))","v":"Lunch-13:00"},{"$f":"IF(COLUMNS($Q48:S48)>$P48,\"\",INDEX($B$1:$K$1&\"-\"&TEXT($B$2:$K$2,\"hh:mm\"),SMALL(IF($B48:$K48=\"\",COLUMN($B48:$K48)-COLUMN($B48)+1),COLUMNS($Q48:S48))))","v":"5-14:30"},{"$f":"IF(COLUMNS($Q48:T48)>$P48,\"\",INDEX($B$1:$K$1&\"-\"&TEXT($B$2:$K$2,\"hh:mm\"),SMALL(IF($B48:$K48=\"\",COLUMN($B48:$K48)-COLUMN($B48)+1),COLUMNS($Q48:T48))))","v":"6-15:30"},{"$f":"IF(COLUMNS($Q48:U48)>$P48,\"\",INDEX($B$1:$K$1&\"-\"&TEXT($B$2:$K$2,\"hh:mm\"),SMALL(IF($B48:$K48=\"\",COLUMN($B48:$K48)-COLUMN($B48)+1),COLUMNS($Q48:U48))))","v":"TEA-16:30"},{"$f":"IF(COLUMNS($Q48:V48)>$P48,\"\",INDEX($B$1:$K$1&\"-\"&TEXT($B$2:$K$2,\"hh:mm\"),SMALL(IF($B48:$K48=\"\",COLUMN($B48:$K48)-COLUMN($B48)+1),COLUMNS($Q48:V48))))","v":"7-17:00"},{"$f":"IF(COLUMNS($Q48:W48)>$P48,\"\",INDEX($B$1:$K$1&\"-\"&TEXT($B$2:$K$2,\"hh:mm\"),SMALL(IF($B48:$K48=\"\",COLUMN($B48:$K48)-COLUMN($B48)+1),COLUMNS($Q48:W48))))","v":""},{"$f":"IF(COLUMNS($Q48:X48)>$P48,\"\",INDEX($B$1:$K$1&\"-\"&TEXT($B$2:$K$2,\"hh:mm\"),SMALL(IF($B48:$K48=\"\",COLUMN($B48:$K48)-COLUMN($B48)+1),COLUMNS($Q48:X48))))","v":""}]
["Student 47","A2GraphicD1","A2GraphicD2",null,null,null,null,null,null,null,"SchoolMtg","Student 47",3,null,"Student 47",7,{"$f":"IF(COLUMNS($Q49:Q49)>$P49,\"\",INDEX($B$1:$K$1&\"-\"&TEXT($B$2:$K$2,\"hh:mm\"),SMALL(IF($B49:$K49=\"\",COLUMN($B49:$K49)-COLUMN($B49)+1),COLUMNS($Q49:Q49))))","v":"3-11:05"},{"$f":"IF(COLUMNS($Q49:R49)>$P49,\"\",INDEX($B$1:$K$1&\"-\"&TEXT($B$2:$K$2,\"hh:mm\"),SMALL(IF($B49:$K49=\"\",COLUMN($B49:$K49)-COLUMN($B49)+1),COLUMNS($Q49:R49))))","v":"4-12:05"},{"$f":"IF(COLUMNS($Q49:S49)>$P49,\"\",INDEX($B$1:$K$1&\"-\"&TEXT($B$2:$K$2,\"hh:mm\"),SMALL(IF($B49:$K49=\"\",COLUMN($B49:$K49)-COLUMN($B49)+1),COLUMNS($Q49:S49))))","v":"Lunch-13:00"},{"$f":"IF(COLUMNS($Q49:T49)>$P49,\"\",INDEX($B$1:$K$1&\"-\"&TEXT($B$2:$K$2,\"hh:mm\"),SMALL(IF($B49:$K49=\"\",COLUMN($B49:$K49)-COLUMN($B49)+1),COLUMNS($Q49:T49))))","v":"5-14:30"},{"$f":"IF(COLUMNS($Q49:U49)>$P49,\"\",INDEX($B$1:$K$1&\"-\"&TEXT($B$2:$K$2,\"hh:mm\"),SMALL(IF($B49:$K49=\"\",COLUMN($B49:$K49)-COLUMN($B49)+1),COLUMNS($Q49:U49))))","v":"6-15:30"},{"$f":"IF(COLUMNS($Q49:V49)>$P49,\"\",INDEX($B$1:$K$1&\"-\"&TEXT($B$2:$K$2,\"hh:mm\"),SMALL(IF($B49:$K49=\"\",COLUMN($B49:$K49)-COLUMN($B49)+1),COLUMNS($Q49:V49))))","v":"TEA-16:30"},{"$f":"IF(COLUMNS($Q49:W49)>$P49,\"\",INDEX($B$1:$K$1&\"-\"&TEXT($B$2:$K$2,\"hh:mm\"),SMALL(IF($B49:$K49=\"\",COLUMN($B49:$K49)-COLUMN($B49)+1),COLUMNS($Q49:W49))))","v":"7-17:00"},{"$f":"IF(COLUMNS($Q49:X49)>$P49,\"\",INDEX($B$1:$K$1&\"-\"&TEXT($B$2:$K$2,\"hh:mm\"),SMALL(IF($B49:$K49=\"\",COLUMN($B49:$K49)-COLUMN($B49)+1),COLUMNS($Q49:X49))))","v":""}]
["Student 48","MathsIGCN3",null,"CareforEarthM3","CareforEarthM3","14.45-15.00LS",null,null,null,"CinemaStuJ2","SchoolMtg","Student 48",6,null,"Student 48",4,{"$f":"IF(COLUMNS($Q50:Q50)>$P50,\"\",INDEX($B$1:$K$1&\"-\"&TEXT($B$2:$K$2,\"hh:mm\"),SMALL(IF($B50:$K50=\"\",COLUMN($B50:$K50)-COLUMN($B50)+1),COLUMNS($Q50:Q50))))","v":"2-10:05"},{"$f":"IF(COLUMNS($Q50:R50)>$P50,\"\",INDEX($B$1:$K$1&\"-\"&TEXT($B$2:$K$2,\"hh:mm\"),SMALL(IF($B50:$K50=\"\",COLUMN($B50:$K50)-COLUMN($B50)+1),COLUMNS($Q50:R50))))","v":"5-14:30"},{"$f":"IF(COLUMNS($Q50:S50)>$P50,\"\",INDEX($B$1:$K$1&\"-\"&TEXT($B$2:$K$2,\"hh:mm\"),SMALL(IF($B50:$K50=\"\",COLUMN($B50:$K50)-COLUMN($B50)+1),COLUMNS($Q50:S50))))","v":"6-15:30"},{"$f":"IF(COLUMNS($Q50:T50)>$P50,\"\",INDEX($B$1:$K$1&\"-\"&TEXT($B$2:$K$2,\"hh:mm\"),SMALL(IF($B50:$K50=\"\",COLUMN($B50:$K50)-COLUMN($B50)+1),COLUMNS($Q50:T50))))","v":"TEA-16:30"},{"$f":"IF(COLUMNS($Q50:U50)>$P50,\"\",INDEX($B$1:$K$1&\"-\"&TEXT($B$2:$K$2,\"hh:mm\"),SMALL(IF($B50:$K50=\"\",COLUMN($B50:$K50)-COLUMN($B50)+1),COLUMNS($Q50:U50))))","v":""},{"$f":"IF(COLUMNS($Q50:V50)>$P50,\"\",INDEX($B$1:$K$1&\"-\"&TEXT($B$2:$K$2,\"hh:mm\"),SMALL(IF($B50:$K50=\"\",COLUMN($B50:$K50)-COLUMN($B50)+1),COLUMNS($Q50:V50))))","v":""},{"$f":"IF(COLUMNS($Q50:W50)>$P50,\"\",INDEX($B$1:$K$1&\"-\"&TEXT($B$2:$K$2,\"hh:mm\"),SMALL(IF($B50:$K50=\"\",COLUMN($B50:$K50)-COLUMN($B50)+1),COLUMNS($Q50:W50))))","v":""},{"$f":"IF(COLUMNS($Q50:X50)>$P50,\"\",INDEX($B$1:$K$1&\"-\"&TEXT($B$2:$K$2,\"hh:mm\"),SMALL(IF($B50:$K50=\"\",COLUMN($B50:$K50)-COLUMN($B50)+1),COLUMNS($Q50:X50))))","v":""}]
["Student 49",null,null,null,"ASHistory1",null,null,null,null,"CinemaStuJ2","SchoolMtg","Student 49",3,null,"Student 49",7,{"$f":"IF(COLUMNS($Q51:Q51)>$P51,\"\",INDEX($B$1:$K$1&\"-\"&TEXT($B$2:$K$2,\"hh:mm\"),SMALL(IF($B51:$K51=\"\",COLUMN($B51:$K51)-COLUMN($B51)+1),COLUMNS($Q51:Q51))))","v":"1-09:05"},{"$f":"IF(COLUMNS($Q51:R51)>$P51,\"\",INDEX($B$1:$K$1&\"-\"&TEXT($B$2:$K$2,\"hh:mm\"),SMALL(IF($B51:$K51=\"\",COLUMN($B51:$K51)-COLUMN($B51)+1),COLUMNS($Q51:R51))))","v":"2-10:05"},{"$f":"IF(COLUMNS($Q51:S51)>$P51,\"\",INDEX($B$1:$K$1&\"-\"&TEXT($B$2:$K$2,\"hh:mm\"),SMALL(IF($B51:$K51=\"\",COLUMN($B51:$K51)-COLUMN($B51)+1),COLUMNS($Q51:S51))))","v":"3-11:05"},{"$f":"IF(COLUMNS($Q51:T51)>$P51,\"\",INDEX($B$1:$K$1&\"-\"&TEXT($B$2:$K$2,\"hh:mm\"),SMALL(IF($B51:$K51=\"\",COLUMN($B51:$K51)-COLUMN($B51)+1),COLUMNS($Q51:T51))))","v":"Lunch-13:00"},{"$f":"IF(COLUMNS($Q51:U51)>$P51,\"\",INDEX($B$1:$K$1&\"-\"&TEXT($B$2:$K$2,\"hh:mm\"),SMALL(IF($B51:$K51=\"\",COLUMN($B51:$K51)-COLUMN($B51)+1),COLUMNS($Q51:U51))))","v":"5-14:30"},{"$f":"IF(COLUMNS($Q51:V51)>$P51,\"\",INDEX($B$1:$K$1&\"-\"&TEXT($B$2:$K$2,\"hh:mm\"),SMALL(IF($B51:$K51=\"\",COLUMN($B51:$K51)-COLUMN($B51)+1),COLUMNS($Q51:V51))))","v":"6-15:30"},{"$f":"IF(COLUMNS($Q51:W51)>$P51,\"\",INDEX($B$1:$K$1&\"-\"&TEXT($B$2:$K$2,\"hh:mm\"),SMALL(IF($B51:$K51=\"\",COLUMN($B51:$K51)-COLUMN($B51)+1),COLUMNS($Q51:W51))))","v":"TEA-16:30"},{"$f":"IF(COLUMNS($Q51:X51)>$P51,\"\",INDEX($B$1:$K$1&\"-\"&TEXT($B$2:$K$2,\"hh:mm\"),SMALL(IF($B51:$K51=\"\",COLUMN($B51:$K51)-COLUMN($B51)+1),COLUMNS($Q51:X51))))","v":""}]
["Student 50","MathsIGC2P3","ASEngLang3","BiologyAS2A3","ASPsychology3",null,null,"15.05-15.50LS",null,"CinemaStuJ2","SchoolMtg","Student 50",7,null,"Student 50",3,{"$f":"IF(COLUMNS($Q52:Q52)>$P52,\"\",INDEX($B$1:$K$1&\"-\"&TEXT($B$2:$K$2,\"hh:mm\"),SMALL(IF($B52:$K52=\"\",COLUMN($B52:$K52)-COLUMN($B52)+1),COLUMNS($Q52:Q52))))","v":"Lunch-13:00"},{"$f":"IF(COLUMNS($Q52:R52)>$P52,\"\",INDEX($B$1:$K$1&\"-\"&TEXT($B$2:$K$2,\"hh:mm\"),SMALL(IF($B52:$K52=\"\",COLUMN($B52:$K52)-COLUMN($B52)+1),COLUMNS($Q52:R52))))","v":"5-14:30"},{"$f":"IF(COLUMNS($Q52:S52)>$P52,\"\",INDEX($B$1:$K$1&\"-\"&TEXT($B$2:$K$2,\"hh:mm\"),SMALL(IF($B52:$K52=\"\",COLUMN($B52:$K52)-COLUMN($B52)+1),COLUMNS($Q52:S52))))","v":"TEA-16:30"},{"$f":"IF(COLUMNS($Q52:T52)>$P52,\"\",INDEX($B$1:$K$1&\"-\"&TEXT($B$2:$K$2,\"hh:mm\"),SMALL(IF($B52:$K52=\"\",COLUMN($B52:$K52)-COLUMN($B52)+1),COLUMNS($Q52:T52))))","v":""},{"$f":"IF(COLUMNS($Q52:U52)>$P52,\"\",INDEX($B$1:$K$1&\"-\"&TEXT($B$2:$K$2,\"hh:mm\"),SMALL(IF($B52:$K52=\"\",COLUMN($B52:$K52)-COLUMN($B52)+1),COLUMNS($Q52:U52))))","v":""},{"$f":"IF(COLUMNS($Q52:V52)>$P52,\"\",INDEX($B$1:$K$1&\"-\"&TEXT($B$2:$K$2,\"hh:mm\"),SMALL(IF($B52:$K52=\"\",COLUMN($B52:$K52)-COLUMN($B52)+1),COLUMNS($Q52:V52))))","v":""},{"$f":"IF(COLUMNS($Q52:W52)>$P52,\"\",INDEX($B$1:$K$1&\"-\"&TEXT($B$2:$K$2,\"hh:mm\"),SMALL(IF($B52:$K52=\"\",COLUMN($B52:$K52)-COLUMN($B52)+1),COLUMNS($Q52:W52))))","v":""},{"$f":"IF(COLUMNS($Q52:X52)>$P52,\"\",INDEX($B$1:$K$1&\"-\"&TEXT($B$2:$K$2,\"hh:mm\"),SMALL(IF($B52:$K52=\"\",COLUMN($B52:$K52)-COLUMN($B52)+1),COLUMNS($Q52:X52))))","v":""}]
["Student 51","EnglishPAS4","MathsG2G2","CareforEarthM3","CareforEarthM3",null,null,null,null,"DramaAS5","SchoolMtg","Student 51",6,null,"Student 51",4,{"$f":"IF(COLUMNS($Q53:Q53)>$P53,\"\",INDEX($B$1:$K$1&\"-\"&TEXT($B$2:$K$2,\"hh:mm\"),SMALL(IF($B53:$K53=\"\",COLUMN($B53:$K53)-COLUMN($B53)+1),COLUMNS($Q53:Q53))))","v":"Lunch-13:00"},{"$f":"IF(COLUMNS($Q53:R53)>$P53,\"\",INDEX($B$1:$K$1&\"-\"&TEXT($B$2:$K$2,\"hh:mm\"),SMALL(IF($B53:$K53=\"\",COLUMN($B53:$K53)-COLUMN($B53)+1),COLUMNS($Q53:R53))))","v":"5-14:30"},{"$f":"IF(COLUMNS($Q53:S53)>$P53,\"\",INDEX($B$1:$K$1&\"-\"&TEXT($B$2:$K$2,\"hh:mm\"),SMALL(IF($B53:$K53=\"\",COLUMN($B53:$K53)-COLUMN($B53)+1),COLUMNS($Q53:S53))))","v":"6-15:30"},{"$f":"IF(COLUMNS($Q53:T53)>$P53,\"\",INDEX($B$1:$K$1&\"-\"&TEXT($B$2:$K$2,\"hh:mm\"),SMALL(IF($B53:$K53=\"\",COLUMN($B53:$K53)-COLUMN($B53)+1),COLUMNS($Q53:T53))))","v":"TEA-16:30"},{"$f":"IF(COLUMNS($Q53:U53)>$P53,\"\",INDEX($B$1:$K$1&\"-\"&TEXT($B$2:$K$2,\"hh:mm\"),SMALL(IF($B53:$K53=\"\",COLUMN($B53:$K53)-COLUMN($B53)+1),COLUMNS($Q53:U53))))","v":""},{"$f":"IF(COLUMNS($Q53:V53)>$P53,\"\",INDEX($B$1:$K$1&\"-\"&TEXT($B$2:$K$2,\"hh:mm\"),SMALL(IF($B53:$K53=\"\",COLUMN($B53:$K53)-COLUMN($B53)+1),COLUMNS($Q53:V53))))","v":""},{"$f":"IF(COLUMNS($Q53:W53)>$P53,\"\",INDEX($B$1:$K$1&\"-\"&TEXT($B$2:$K$2,\"hh:mm\"),SMALL(IF($B53:$K53=\"\",COLUMN($B53:$K53)-COLUMN($B53)+1),COLUMNS($Q53:W53))))","v":""},{"$f":"IF(COLUMNS($Q53:X53)>$P53,\"\",INDEX($B$1:$K$1&\"-\"&TEXT($B$2:$K$2,\"hh:mm\"),SMALL(IF($B53:$K53=\"\",COLUMN($B53:$K53)-COLUMN($B53)+1),COLUMNS($Q53:X53))))","v":""}]
["Student 52","YogaB1",null,"MathsIGCM3","ASPsychology3",null,null,null,null,null,"SchoolMtg","Student 52",4,null,"Student 52",6,{"$f":"IF(COLUMNS($Q54:Q54)>$P54,\"\",INDEX($B$1:$K$1&\"-\"&TEXT($B$2:$K$2,\"hh:mm\"),SMALL(IF($B54:$K54=\"\",COLUMN($B54:$K54)-COLUMN($B54)+1),COLUMNS($Q54:Q54))))","v":"2-10:05"},{"$f":"IF(COLUMNS($Q54:R54)>$P54,\"\",INDEX($B$1:$K$1&\"-\"&TEXT($B$2:$K$2,\"hh:mm\"),SMALL(IF($B54:$K54=\"\",COLUMN($B54:$K54)-COLUMN($B54)+1),COLUMNS($Q54:R54))))","v":"Lunch-13:00"},{"$f":"IF(COLUMNS($Q54:S54)>$P54,\"\",INDEX($B$1:$K$1&\"-\"&TEXT($B$2:$K$2,\"hh:mm\"),SMALL(IF($B54:$K54=\"\",COLUMN($B54:$K54)-COLUMN($B54)+1),COLUMNS($Q54:S54))))","v":"5-14:30"},{"$f":"IF(COLUMNS($Q54:T54)>$P54,\"\",INDEX($B$1:$K$1&\"-\"&TEXT($B$2:$K$2,\"hh:mm\"),SMALL(IF($B54:$K54=\"\",COLUMN($B54:$K54)-COLUMN($B54)+1),COLUMNS($Q54:T54))))","v":"6-15:30"},{"$f":"IF(COLUMNS($Q54:U54)>$P54,\"\",INDEX($B$1:$K$1&\"-\"&TEXT($B$2:$K$2,\"hh:mm\"),SMALL(IF($B54:$K54=\"\",COLUMN($B54:$K54)-COLUMN($B54)+1),COLUMNS($Q54:U54))))","v":"TEA-16:30"},{"$f":"IF(COLUMNS($Q54:V54)>$P54,\"\",INDEX($B$1:$K$1&\"-\"&TEXT($B$2:$K$2,\"hh:mm\"),SMALL(IF($B54:$K54=\"\",COLUMN($B54:$K54)-COLUMN($B54)+1),COLUMNS($Q54:V54))))","v":"7-17:00"},{"$f":"IF(COLUMNS($Q54:W54)>$P54,\"\",INDEX($B$1:$K$1&\"-\"&TEXT($B$2:$K$2,\"hh:mm\"),SMALL(IF($B54:$K54=\"\",COLUMN($B54:$K54)-COLUMN($B54)+1),COLUMNS($Q54:W54))))","v":""},{"$f":"IF(COLUMNS($Q54:X54)>$P54,\"\",INDEX($B$1:$K$1&\"-\"&TEXT($B$2:$K$2,\"hh:mm\"),SMALL(IF($B54:$K54=\"\",COLUMN($B54:$K54)-COLUMN($B54)+1),COLUMNS($Q54:X54))))","v":""}]
["Student 53","MathsIGC2P3","YogaC2","MusicAdvV","ASPsychology3",null,null,"15.50-16.30LS",null,"DramaAS5","SchoolMtg","Student 53",7,null,"Student 53",3,{"$f":"IF(COLUMNS($Q55:Q55)>$P55,\"\",INDEX($B$1:$K$1&\"-\"&TEXT($B$2:$K$2,\"hh:mm\"),SMALL(IF($B55:$K55=\"\",COLUMN($B55:$K55)-COLUMN($B55)+1),COLUMNS($Q55:Q55))))","v":"Lunch-13:00"},{"$f":"IF(COLUMNS($Q55:R55)>$P55,\"\",INDEX($B$1:$K$1&\"-\"&TEXT($B$2:$K$2,\"hh:mm\"),SMALL(IF($B55:$K55=\"\",COLUMN($B55:$K55)-COLUMN($B55)+1),COLUMNS($Q55:R55))))","v":"5-14:30"},{"$f":"IF(COLUMNS($Q55:S55)>$P55,\"\",INDEX($B$1:$K$1&\"-\"&TEXT($B$2:$K$2,\"hh:mm\"),SMALL(IF($B55:$K55=\"\",COLUMN($B55:$K55)-COLUMN($B55)+1),COLUMNS($Q55:S55))))","v":"TEA-16:30"},{"$f":"IF(COLUMNS($Q55:T55)>$P55,\"\",INDEX($B$1:$K$1&\"-\"&TEXT($B$2:$K$2,\"hh:mm\"),SMALL(IF($B55:$K55=\"\",COLUMN($B55:$K55)-COLUMN($B55)+1),COLUMNS($Q55:T55))))","v":""},{"$f":"IF(COLUMNS($Q55:U55)>$P55,\"\",INDEX($B$1:$K$1&\"-\"&TEXT($B$2:$K$2,\"hh:mm\"),SMALL(IF($B55:$K55=\"\",COLUMN($B55:$K55)-COLUMN($B55)+1),COLUMNS($Q55:U55))))","v":""},{"$f":"IF(COLUMNS($Q55:V55)>$P55,\"\",INDEX($B$1:$K$1&\"-\"&TEXT($B$2:$K$2,\"hh:mm\"),SMALL(IF($B55:$K55=\"\",COLUMN($B55:$K55)-COLUMN($B55)+1),COLUMNS($Q55:V55))))","v":""},{"$f":"IF(COLUMNS($Q55:W55)>$P55,\"\",INDEX($B$1:$K$1&\"-\"&TEXT($B$2:$K$2,\"hh:mm\"),SMALL(IF($B55:$K55=\"\",COLUMN($B55:$K55)-COLUMN($B55)+1),COLUMNS($Q55:W55))))","v":""},{"$f":"IF(COLUMNS($Q55:X55)>$P55,\"\",INDEX($B$1:$K$1&\"-\"&TEXT($B$2:$K$2,\"hh:mm\"),SMALL(IF($B55:$K55=\"\",COLUMN($B55:$K55)-COLUMN($B55)+1),COLUMNS($Q55:X55))))","v":""}]
["Student 54","A2ReligStud3",null,null,"GuitarAdv3",null,null,null,null,"CinemaStuJ2","SchoolMtg","Student 54",4,null,"Student 54",6,{"$f":"IF(COLUMNS($Q56:Q56)>$P56,\"\",INDEX($B$1:$K$1&\"-\"&TEXT($B$2:$K$2,\"hh:mm\"),SMALL(IF($B56:$K56=\"\",COLUMN($B56:$K56)-COLUMN($B56)+1),COLUMNS($Q56:Q56))))","v":"2-10:05"},{"$f":"IF(COLUMNS($Q56:R56)>$P56,\"\",INDEX($B$1:$K$1&\"-\"&TEXT($B$2:$K$2,\"hh:mm\"),SMALL(IF($B56:$K56=\"\",COLUMN($B56:$K56)-COLUMN($B56)+1),COLUMNS($Q56:R56))))","v":"3-11:05"},{"$f":"IF(COLUMNS($Q56:S56)>$P56,\"\",INDEX($B$1:$K$1&\"-\"&TEXT($B$2:$K$2,\"hh:mm\"),SMALL(IF($B56:$K56=\"\",COLUMN($B56:$K56)-COLUMN($B56)+1),COLUMNS($Q56:S56))))","v":"Lunch-13:00"},{"$f":"IF(COLUMNS($Q56:T56)>$P56,\"\",INDEX($B$1:$K$1&\"-\"&TEXT($B$2:$K$2,\"hh:mm\"),SMALL(IF($B56:$K56=\"\",COLUMN($B56:$K56)-COLUMN($B56)+1),COLUMNS($Q56:T56))))","v":"5-14:30"},{"$f":"IF(COLUMNS($Q56:U56)>$P56,\"\",INDEX($B$1:$K$1&\"-\"&TEXT($B$2:$K$2,\"hh:mm\"),SMALL(IF($B56:$K56=\"\",COLUMN($B56:$K56)-COLUMN($B56)+1),COLUMNS($Q56:U56))))","v":"6-15:30"},{"$f":"IF(COLUMNS($Q56:V56)>$P56,\"\",INDEX($B$1:$K$1&\"-\"&TEXT($B$2:$K$2,\"hh:mm\"),SMALL(IF($B56:$K56=\"\",COLUMN($B56:$K56)-COLUMN($B56)+1),COLUMNS($Q56:V56))))","v":"TEA-16:30"},{"$f":"IF(COLUMNS($Q56:W56)>$P56,\"\",INDEX($B$1:$K$1&\"-\"&TEXT($B$2:$K$2,\"hh:mm\"),SMALL(IF($B56:$K56=\"\",COLUMN($B56:$K56)-COLUMN($B56)+1),COLUMNS($Q56:W56))))","v":""},{"$f":"IF(COLUMNS($Q56:X56)>$P56,\"\",INDEX($B$1:$K$1&\"-\"&TEXT($B$2:$K$2,\"hh:mm\"),SMALL(IF($B56:$K56=\"\",COLUMN($B56:$K56)-COLUMN($B56)+1),COLUMNS($Q56:X56))))","v":""}]
["Student 55","A2Physics1","StatisticsS23","FitnessOrlando",null,null,null,null,null,null,"SchoolMtg","Student 55",4,null,"Student 55",6,{"$f":"IF(COLUMNS($Q57:Q57)>$P57,\"\",INDEX($B$1:$K$1&\"-\"&TEXT($B$2:$K$2,\"hh:mm\"),SMALL(IF($B57:$K57=\"\",COLUMN($B57:$K57)-COLUMN($B57)+1),COLUMNS($Q57:Q57))))","v":"4-12:05"},{"$f":"IF(COLUMNS($Q57:R57)>$P57,\"\",INDEX($B$1:$K$1&\"-\"&TEXT($B$2:$K$2,\"hh:mm\"),SMALL(IF($B57:$K57=\"\",COLUMN($B57:$K57)-COLUMN($B57)+1),COLUMNS($Q57:R57))))","v":"Lunch-13:00"},{"$f":"IF(COLUMNS($Q57:S57)>$P57,\"\",INDEX($B$1:$K$1&\"-\"&TEXT($B$2:$K$2,\"hh:mm\"),SMALL(IF($B57:$K57=\"\",COLUMN($B57:$K57)-COLUMN($B57)+1),COLUMNS($Q57:S57))))","v":"5-14:30"},{"$f":"IF(COLUMNS($Q57:T57)>$P57,\"\",INDEX($B$1:$K$1&\"-\"&TEXT($B$2:$K$2,\"hh:mm\"),SMALL(IF($B57:$K57=\"\",COLUMN($B57:$K57)-COLUMN($B57)+1),COLUMNS($Q57:T57))))","v":"6-15:30"},{"$f":"IF(COLUMNS($Q57:U57)>$P57,\"\",INDEX($B$1:$K$1&\"-\"&TEXT($B$2:$K$2,\"hh:mm\"),SMALL(IF($B57:$K57=\"\",COLUMN($B57:$K57)-COLUMN($B57)+1),COLUMNS($Q57:U57))))","v":"TEA-16:30"},{"$f":"IF(COLUMNS($Q57:V57)>$P57,\"\",INDEX($B$1:$K$1&\"-\"&TEXT($B$2:$K$2,\"hh:mm\"),SMALL(IF($B57:$K57=\"\",COLUMN($B57:$K57)-COLUMN($B57)+1),COLUMNS($Q57:V57))))","v":"7-17:00"},{"$f":"IF(COLUMNS($Q57:W57)>$P57,\"\",INDEX($B$1:$K$1&\"-\"&TEXT($B$2:$K$2,\"hh:mm\"),SMALL(IF($B57:$K57=\"\",COLUMN($B57:$K57)-COLUMN($B57)+1),COLUMNS($Q57:W57))))","v":""},{"$f":"IF(COLUMNS($Q57:X57)>$P57,\"\",INDEX($B$1:$K$1&\"-\"&TEXT($B$2:$K$2,\"hh:mm\"),SMALL(IF($B57:$K57=\"\",COLUMN($B57:$K57)-COLUMN($B57)+1),COLUMNS($Q57:X57))))","v":""}]
["Student 56","EnglishPAS4","MathsG2G2","CCriminology3",null,null,null,null,null,"DramaAS5","SchoolMtg","Student 56",5,null,"Student 56",5,{"$f":"IF(COLUMNS($Q58:Q58)>$P58,\"\",INDEX($B$1:$K$1&\"-\"&TEXT($B$2:$K$2,\"hh:mm\"),SMALL(IF($B58:$K58=\"\",COLUMN($B58:$K58)-COLUMN($B58)+1),COLUMNS($Q58:Q58))))","v":"4-12:05"},{"$f":"IF(COLUMNS($Q58:R58)>$P58,\"\",INDEX($B$1:$K$1&\"-\"&TEXT($B$2:$K$2,\"hh:mm\"),SMALL(IF($B58:$K58=\"\",COLUMN($B58:$K58)-COLUMN($B58)+1),COLUMNS($Q58:R58))))","v":"Lunch-13:00"},{"$f":"IF(COLUMNS($Q58:S58)>$P58,\"\",INDEX($B$1:$K$1&\"-\"&TEXT($B$2:$K$2,\"hh:mm\"),SMALL(IF($B58:$K58=\"\",COLUMN($B58:$K58)-COLUMN($B58)+1),COLUMNS($Q58:S58))))","v":"5-14:30"},{"$f":"IF(COLUMNS($Q58:T58)>$P58,\"\",INDEX($B$1:$K$1&\"-\"&TEXT($B$2:$K$2,\"hh:mm\"),SMALL(IF($B58:$K58=\"\",COLUMN($B58:$K58)-COLUMN($B58)+1),COLUMNS($Q58:T58))))","v":"6-15:30"},{"$f":"IF(COLUMNS($Q58:U58)>$P58,\"\",INDEX($B$1:$K$1&\"-\"&TEXT($B$2:$K$2,\"hh:mm\"),SMALL(IF($B58:$K58=\"\",COLUMN($B58:$K58)-COLUMN($B58)+1),COLUMNS($Q58:U58))))","v":"TEA-16:30"},{"$f":"IF(COLUMNS($Q58:V58)>$P58,\"\",INDEX($B$1:$K$1&\"-\"&TEXT($B$2:$K$2,\"hh:mm\"),SMALL(IF($B58:$K58=\"\",COLUMN($B58:$K58)-COLUMN($B58)+1),COLUMNS($Q58:V58))))","v":""},{"$f":"IF(COLUMNS($Q58:W58)>$P58,\"\",INDEX($B$1:$K$1&\"-\"&TEXT($B$2:$K$2,\"hh:mm\"),SMALL(IF($B58:$K58=\"\",COLUMN($B58:$K58)-COLUMN($B58)+1),COLUMNS($Q58:W58))))","v":""},{"$f":"IF(COLUMNS($Q58:X58)>$P58,\"\",INDEX($B$1:$K$1&\"-\"&TEXT($B$2:$K$2,\"hh:mm\"),SMALL(IF($B58:$K58=\"\",COLUMN($B58:$K58)-COLUMN($B58)+1),COLUMNS($Q58:X58))))","v":""}]
["Student 57","MathsIGCN3","AdvESLY1",null,"ASPsychology3",null,null,null,null,"Philosophy2","SchoolMtg","Student 57",5,null,"Student 57",5,{"$f":"IF(COLUMNS($Q59:Q59)>$P59,\"\",INDEX($B$1:$K$1&\"-\"&TEXT($B$2:$K$2,\"hh:mm\"),SMALL(IF($B59:$K59=\"\",COLUMN($B59:$K59)-COLUMN($B59)+1),COLUMNS($Q59:Q59))))","v":"3-11:05"},{"$f":"IF(COLUMNS($Q59:R59)>$P59,\"\",INDEX($B$1:$K$1&\"-\"&TEXT($B$2:$K$2,\"hh:mm\"),SMALL(IF($B59:$K59=\"\",COLUMN($B59:$K59)-COLUMN($B59)+1),COLUMNS($Q59:R59))))","v":"Lunch-13:00"},{"$f":"IF(COLUMNS($Q59:S59)>$P59,\"\",INDEX($B$1:$K$1&\"-\"&TEXT($B$2:$K$2,\"hh:mm\"),SMALL(IF($B59:$K59=\"\",COLUMN($B59:$K59)-COLUMN($B59)+1),COLUMNS($Q59:S59))))","v":"5-14:30"},{"$f":"IF(COLUMNS($Q59:T59)>$P59,\"\",INDEX($B$1:$K$1&\"-\"&TEXT($B$2:$K$2,\"hh:mm\"),SMALL(IF($B59:$K59=\"\",COLUMN($B59:$K59)-COLUMN($B59)+1),COLUMNS($Q59:T59))))","v":"6-15:30"},{"$f":"IF(COLUMNS($Q59:U59)>$P59,\"\",INDEX($B$1:$K$1&\"-\"&TEXT($B$2:$K$2,\"hh:mm\"),SMALL(IF($B59:$K59=\"\",COLUMN($B59:$K59)-COLUMN($B59)+1),COLUMNS($Q59:U59))))","v":"TEA-16:30"},{"$f":"IF(COLUMNS($Q59:V59)>$P59,\"\",INDEX($B$1:$K$1&\"-\"&TEXT($B$2:$K$2,\"hh:mm\"),SMALL(IF($B59:$K59=\"\",COLUMN($B59:$K59)-COLUMN($B59)+1),COLUMNS($Q59:V59))))","v":""},{"$f":"IF(COLUMNS($Q59:W59)>$P59,\"\",INDEX($B$1:$K$1&\"-\"&TEXT($B$2:$K$2,\"hh:mm\"),SMALL(IF($B59:$K59=\"\",COLUMN($B59:$K59)-COLUMN($B59)+1),COLUMNS($Q59:W59))))","v":""},{"$f":"IF(COLUMNS($Q59:X59)>$P59,\"\",INDEX($B$1:$K$1&\"-\"&TEXT($B$2:$K$2,\"hh:mm\"),SMALL(IF($B59:$K59=\"\",COLUMN($B59:$K59)-COLUMN($B59)+1),COLUMNS($Q59:X59))))","v":""}]
["Student 58","A2GraphicD1","A2GraphicD2","IELTSM1",null,null,"A2Psychology2",null,null,"Cycling","SchoolMtg","Student 58",6,null,"Student 58",4,{"$f":"IF(COLUMNS($Q60:Q60)>$P60,\"\",INDEX($B$1:$K$1&\"-\"&TEXT($B$2:$K$2,\"hh:mm\"),SMALL(IF($B60:$K60=\"\",COLUMN($B60:$K60)-COLUMN($B60)+1),COLUMNS($Q60:Q60))))","v":"4-12:05"},{"$f":"IF(COLUMNS($Q60:R60)>$P60,\"\",INDEX($B$1:$K$1&\"-\"&TEXT($B$2:$K$2,\"hh:mm\"),SMALL(IF($B60:$K60=\"\",COLUMN($B60:$K60)-COLUMN($B60)+1),COLUMNS($Q60:R60))))","v":"Lunch-13:00"},{"$f":"IF(COLUMNS($Q60:S60)>$P60,\"\",INDEX($B$1:$K$1&\"-\"&TEXT($B$2:$K$2,\"hh:mm\"),SMALL(IF($B60:$K60=\"\",COLUMN($B60:$K60)-COLUMN($B60)+1),COLUMNS($Q60:S60))))","v":"6-15:30"},{"$f":"IF(COLUMNS($Q60:T60)>$P60,\"\",INDEX($B$1:$K$1&\"-\"&TEXT($B$2:$K$2,\"hh:mm\"),SMALL(IF($B60:$K60=\"\",COLUMN($B60:$K60)-COLUMN($B60)+1),COLUMNS($Q60:T60))))","v":"TEA-16:30"},{"$f":"IF(COLUMNS($Q60:U60)>$P60,\"\",INDEX($B$1:$K$1&\"-\"&TEXT($B$2:$K$2,\"hh:mm\"),SMALL(IF($B60:$K60=\"\",COLUMN($B60:$K60)-COLUMN($B60)+1),COLUMNS($Q60:U60))))","v":""},{"$f":"IF(COLUMNS($Q60:V60)>$P60,\"\",INDEX($B$1:$K$1&\"-\"&TEXT($B$2:$K$2,\"hh:mm\"),SMALL(IF($B60:$K60=\"\",COLUMN($B60:$K60)-COLUMN($B60)+1),COLUMNS($Q60:V60))))","v":""},{"$f":"IF(COLUMNS($Q60:W60)>$P60,\"\",INDEX($B$1:$K$1&\"-\"&TEXT($B$2:$K$2,\"hh:mm\"),SMALL(IF($B60:$K60=\"\",COLUMN($B60:$K60)-COLUMN($B60)+1),COLUMNS($Q60:W60))))","v":""},{"$f":"IF(COLUMNS($Q60:X60)>$P60,\"\",INDEX($B$1:$K$1&\"-\"&TEXT($B$2:$K$2,\"hh:mm\"),SMALL(IF($B60:$K60=\"\",COLUMN($B60:$K60)-COLUMN($B60)+1),COLUMNS($Q60:X60))))","v":""}]
["Student 59",null,null,"MathsIGCM3",null,null,null,null,null,"ASGraphicD3","SchoolMtg","Student 59",3,null,"Student 59",7,{"$f":"IF(COLUMNS($Q61:Q61)>$P61,\"\",INDEX($B$1:$K$1&\"-\"&TEXT($B$2:$K$2,\"hh:mm\"),SMALL(IF($B61:$K61=\"\",COLUMN($B61:$K61)-COLUMN($B61)+1),COLUMNS($Q61:Q61))))","v":"1-09:05"},{"$f":"IF(COLUMNS($Q61:R61)>$P61,\"\",INDEX($B$1:$K$1&\"-\"&TEXT($B$2:$K$2,\"hh:mm\"),SMALL(IF($B61:$K61=\"\",COLUMN($B61:$K61)-COLUMN($B61)+1),COLUMNS($Q61:R61))))","v":"2-10:05"},{"$f":"IF(COLUMNS($Q61:S61)>$P61,\"\",INDEX($B$1:$K$1&\"-\"&TEXT($B$2:$K$2,\"hh:mm\"),SMALL(IF($B61:$K61=\"\",COLUMN($B61:$K61)-COLUMN($B61)+1),COLUMNS($Q61:S61))))","v":"4-12:05"},{"$f":"IF(COLUMNS($Q61:T61)>$P61,\"\",INDEX($B$1:$K$1&\"-\"&TEXT($B$2:$K$2,\"hh:mm\"),SMALL(IF($B61:$K61=\"\",COLUMN($B61:$K61)-COLUMN($B61)+1),COLUMNS($Q61:T61))))","v":"Lunch-13:00"},{"$f":"IF(COLUMNS($Q61:U61)>$P61,\"\",INDEX($B$1:$K$1&\"-\"&TEXT($B$2:$K$2,\"hh:mm\"),SMALL(IF($B61:$K61=\"\",COLUMN($B61:$K61)-COLUMN($B61)+1),COLUMNS($Q61:U61))))","v":"5-14:30"},{"$f":"IF(COLUMNS($Q61:V61)>$P61,\"\",INDEX($B$1:$K$1&\"-\"&TEXT($B$2:$K$2,\"hh:mm\"),SMALL(IF($B61:$K61=\"\",COLUMN($B61:$K61)-COLUMN($B61)+1),COLUMNS($Q61:V61))))","v":"6-15:30"},{"$f":"IF(COLUMNS($Q61:W61)>$P61,\"\",INDEX($B$1:$K$1&\"-\"&TEXT($B$2:$K$2,\"hh:mm\"),SMALL(IF($B61:$K61=\"\",COLUMN($B61:$K61)-COLUMN($B61)+1),COLUMNS($Q61:W61))))","v":"TEA-16:30"},{"$f":"IF(COLUMNS($Q61:X61)>$P61,\"\",INDEX($B$1:$K$1&\"-\"&TEXT($B$2:$K$2,\"hh:mm\"),SMALL(IF($B61:$K61=\"\",COLUMN($B61:$K61)-COLUMN($B61)+1),COLUMNS($Q61:X61))))","v":""}]
["Student 60","ASPMaths1c","FitnessOrlando2","StatisticsS1b",null,null,null,null,null,"DramaAS5","SchoolMtg","Student 60",5,null,"Student 60",5,{"$f":"IF(COLUMNS($Q62:Q62)>$P62,\"\",INDEX($B$1:$K$1&\"-\"&TEXT($B$2:$K$2,\"hh:mm\"),SMALL(IF($B62:$K62=\"\",COLUMN($B62:$K62)-COLUMN($B62)+1),COLUMNS($Q62:Q62))))","v":"4-12:05"},{"$f":"IF(COLUMNS($Q62:R62)>$P62,\"\",INDEX($B$1:$K$1&\"-\"&TEXT($B$2:$K$2,\"hh:mm\"),SMALL(IF($B62:$K62=\"\",COLUMN($B62:$K62)-COLUMN($B62)+1),COLUMNS($Q62:R62))))","v":"Lunch-13:00"},{"$f":"IF(COLUMNS($Q62:S62)>$P62,\"\",INDEX($B$1:$K$1&\"-\"&TEXT($B$2:$K$2,\"hh:mm\"),SMALL(IF($B62:$K62=\"\",COLUMN($B62:$K62)-COLUMN($B62)+1),COLUMNS($Q62:S62))))","v":"5-14:30"},{"$f":"IF(COLUMNS($Q62:T62)>$P62,\"\",INDEX($B$1:$K$1&\"-\"&TEXT($B$2:$K$2,\"hh:mm\"),SMALL(IF($B62:$K62=\"\",COLUMN($B62:$K62)-COLUMN($B62)+1),COLUMNS($Q62:T62))))","v":"6-15:30"},{"$f":"IF(COLUMNS($Q62:U62)>$P62,\"\",INDEX($B$1:$K$1&\"-\"&TEXT($B$2:$K$2,\"hh:mm\"),SMALL(IF($B62:$K62=\"\",COLUMN($B62:$K62)-COLUMN($B62)+1),COLUMNS($Q62:U62))))","v":"TEA-16:30"},{"$f":"IF(COLUMNS($Q62:V62)>$P62,\"\",INDEX($B$1:$K$1&\"-\"&TEXT($B$2:$K$2,\"hh:mm\"),SMALL(IF($B62:$K62=\"\",COLUMN($B62:$K62)-COLUMN($B62)+1),COLUMNS($Q62:V62))))","v":""},{"$f":"IF(COLUMNS($Q62:W62)>$P62,\"\",INDEX($B$1:$K$1&\"-\"&TEXT($B$2:$K$2,\"hh:mm\"),SMALL(IF($B62:$K62=\"\",COLUMN($B62:$K62)-COLUMN($B62)+1),COLUMNS($Q62:W62))))","v":""},{"$f":"IF(COLUMNS($Q62:X62)>$P62,\"\",INDEX($B$1:$K$1&\"-\"&TEXT($B$2:$K$2,\"hh:mm\"),SMALL(IF($B62:$K62=\"\",COLUMN($B62:$K62)-COLUMN($B62)+1),COLUMNS($Q62:X62))))","v":""}]
["Student 61",null,"YogaC2","IELTSM1",null,null,null,null,null,"CinemaStuJ2","SchoolMtg","Student 61",4,null,"Student 61",6,{"$f":"IF(COLUMNS($Q63:Q63)>$P63,\"\",INDEX($B$1:$K$1&\"-\"&TEXT($B$2:$K$2,\"hh:mm\"),SMALL(IF($B63:$K63=\"\",COLUMN($B63:$K63)-COLUMN($B63)+1),COLUMNS($Q63:Q63))))","v":"1-09:05"},{"$f":"IF(COLUMNS($Q63:R63)>$P63,\"\",INDEX($B$1:$K$1&\"-\"&TEXT($B$2:$K$2,\"hh:mm\"),SMALL(IF($B63:$K63=\"\",COLUMN($B63:$K63)-COLUMN($B63)+1),COLUMNS($Q63:R63))))","v":"4-12:05"},{"$f":"IF(COLUMNS($Q63:S63)>$P63,\"\",INDEX($B$1:$K$1&\"-\"&TEXT($B$2:$K$2,\"hh:mm\"),SMALL(IF($B63:$K63=\"\",COLUMN($B63:$K63)-COLUMN($B63)+1),COLUMNS($Q63:S63))))","v":"Lunch-13:00"},{"$f":"IF(COLUMNS($Q63:T63)>$P63,\"\",INDEX($B$1:$K$1&\"-\"&TEXT($B$2:$K$2,\"hh:mm\"),SMALL(IF($B63:$K63=\"\",COLUMN($B63:$K63)-COLUMN($B63)+1),COLUMNS($Q63:T63))))","v":"5-14:30"},{"$f":"IF(COLUMNS($Q63:U63)>$P63,\"\",INDEX($B$1:$K$1&\"-\"&TEXT($B$2:$K$2,\"hh:mm\"),SMALL(IF($B63:$K63=\"\",COLUMN($B63:$K63)-COLUMN($B63)+1),COLUMNS($Q63:U63))))","v":"6-15:30"},{"$f":"IF(COLUMNS($Q63:V63)>$P63,\"\",INDEX($B$1:$K$1&\"-\"&TEXT($B$2:$K$2,\"hh:mm\"),SMALL(IF($B63:$K63=\"\",COLUMN($B63:$K63)-COLUMN($B63)+1),COLUMNS($Q63:V63))))","v":"TEA-16:30"},{"$f":"IF(COLUMNS($Q63:W63)>$P63,\"\",INDEX($B$1:$K$1&\"-\"&TEXT($B$2:$K$2,\"hh:mm\"),SMALL(IF($B63:$K63=\"\",COLUMN($B63:$K63)-COLUMN($B63)+1),COLUMNS($Q63:W63))))","v":""},{"$f":"IF(COLUMNS($Q63:X63)>$P63,\"\",INDEX($B$1:$K$1&\"-\"&TEXT($B$2:$K$2,\"hh:mm\"),SMALL(IF($B63:$K63=\"\",COLUMN($B63:$K63)-COLUMN($B63)+1),COLUMNS($Q63:X63))))","v":""}]
["Student 62","EnglishPAS4","PhysicsPAS3","StatisticsS1b",null,null,null,null,null,"ASGraphicD3","SchoolMtg","Student 62",5,null,"Student 62",5,{"$f":"IF(COLUMNS($Q64:Q64)>$P64,\"\",INDEX($B$1:$K$1&\"-\"&TEXT($B$2:$K$2,\"hh:mm\"),SMALL(IF($B64:$K64=\"\",COLUMN($B64:$K64)-COLUMN($B64)+1),COLUMNS($Q64:Q64))))","v":"4-12:05"},{"$f":"IF(COLUMNS($Q64:R64)>$P64,\"\",INDEX($B$1:$K$1&\"-\"&TEXT($B$2:$K$2,\"hh:mm\"),SMALL(IF($B64:$K64=\"\",COLUMN($B64:$K64)-COLUMN($B64)+1),COLUMNS($Q64:R64))))","v":"Lunch-13:00"},{"$f":"IF(COLUMNS($Q64:S64)>$P64,\"\",INDEX($B$1:$K$1&\"-\"&TEXT($B$2:$K$2,\"hh:mm\"),SMALL(IF($B64:$K64=\"\",COLUMN($B64:$K64)-COLUMN($B64)+1),COLUMNS($Q64:S64))))","v":"5-14:30"},{"$f":"IF(COLUMNS($Q64:T64)>$P64,\"\",INDEX($B$1:$K$1&\"-\"&TEXT($B$2:$K$2,\"hh:mm\"),SMALL(IF($B64:$K64=\"\",COLUMN($B64:$K64)-COLUMN($B64)+1),COLUMNS($Q64:T64))))","v":"6-15:30"},{"$f":"IF(COLUMNS($Q64:U64)>$P64,\"\",INDEX($B$1:$K$1&\"-\"&TEXT($B$2:$K$2,\"hh:mm\"),SMALL(IF($B64:$K64=\"\",COLUMN($B64:$K64)-COLUMN($B64)+1),COLUMNS($Q64:U64))))","v":"TEA-16:30"},{"$f":"IF(COLUMNS($Q64:V64)>$P64,\"\",INDEX($B$1:$K$1&\"-\"&TEXT($B$2:$K$2,\"hh:mm\"),SMALL(IF($B64:$K64=\"\",COLUMN($B64:$K64)-COLUMN($B64)+1),COLUMNS($Q64:V64))))","v":""},{"$f":"IF(COLUMNS($Q64:W64)>$P64,\"\",INDEX($B$1:$K$1&\"-\"&TEXT($B$2:$K$2,\"hh:mm\"),SMALL(IF($B64:$K64=\"\",COLUMN($B64:$K64)-COLUMN($B64)+1),COLUMNS($Q64:W64))))","v":""},{"$f":"IF(COLUMNS($Q64:X64)>$P64,\"\",INDEX($B$1:$K$1&\"-\"&TEXT($B$2:$K$2,\"hh:mm\"),SMALL(IF($B64:$K64=\"\",COLUMN($B64:$K64)-COLUMN($B64)+1),COLUMNS($Q64:X64))))","v":""}]
["Student 63","YogaB1","StatisticsS23","ASPhysics4",null,"13.45A2Maths4",null,null,null,null,"SchoolMtg","Student 63",5,null,"Student 63",5,{"$f":"IF(COLUMNS($Q65:Q65)>$P65,\"\",INDEX($B$1:$K$1&\"-\"&TEXT($B$2:$K$2,\"hh:mm\"),SMALL(IF($B65:$K65=\"\",COLUMN($B65:$K65)-COLUMN($B65)+1),COLUMNS($Q65:Q65))))","v":"4-12:05"},{"$f":"IF(COLUMNS($Q65:R65)>$P65,\"\",INDEX($B$1:$K$1&\"-\"&TEXT($B$2:$K$2,\"hh:mm\"),SMALL(IF($B65:$K65=\"\",COLUMN($B65:$K65)-COLUMN($B65)+1),COLUMNS($Q65:R65))))","v":"5-14:30"},{"$f":"IF(COLUMNS($Q65:S65)>$P65,\"\",INDEX($B$1:$K$1&\"-\"&TEXT($B$2:$K$2,\"hh:mm\"),SMALL(IF($B65:$K65=\"\",COLUMN($B65:$K65)-COLUMN($B65)+1),COLUMNS($Q65:S65))))","v":"6-15:30"},{"$f":"IF(COLUMNS($Q65:T65)>$P65,\"\",INDEX($B$1:$K$1&\"-\"&TEXT($B$2:$K$2,\"hh:mm\"),SMALL(IF($B65:$K65=\"\",COLUMN($B65:$K65)-COLUMN($B65)+1),COLUMNS($Q65:T65))))","v":"TEA-16:30"},{"$f":"IF(COLUMNS($Q65:U65)>$P65,\"\",INDEX($B$1:$K$1&\"-\"&TEXT($B$2:$K$2,\"hh:mm\"),SMALL(IF($B65:$K65=\"\",COLUMN($B65:$K65)-COLUMN($B65)+1),COLUMNS($Q65:U65))))","v":"7-17:00"},{"$f":"IF(COLUMNS($Q65:V65)>$P65,\"\",INDEX($B$1:$K$1&\"-\"&TEXT($B$2:$K$2,\"hh:mm\"),SMALL(IF($B65:$K65=\"\",COLUMN($B65:$K65)-COLUMN($B65)+1),COLUMNS($Q65:V65))))","v":""},{"$f":"IF(COLUMNS($Q65:W65)>$P65,\"\",INDEX($B$1:$K$1&\"-\"&TEXT($B$2:$K$2,\"hh:mm\"),SMALL(IF($B65:$K65=\"\",COLUMN($B65:$K65)-COLUMN($B65)+1),COLUMNS($Q65:W65))))","v":""},{"$f":"IF(COLUMNS($Q65:X65)>$P65,\"\",INDEX($B$1:$K$1&\"-\"&TEXT($B$2:$K$2,\"hh:mm\"),SMALL(IF($B65:$K65=\"\",COLUMN($B65:$K65)-COLUMN($B65)+1),COLUMNS($Q65:X65))))","v":""}]
["Student 64",null,"AdvESLY1","CareforEarthM3","CareforEarthM3",null,null,null,null,"Philosophy2","SchoolMtg","Student 64",5,null,"Student 64",5,{"$f":"IF(COLUMNS($Q66:Q66)>$P66,\"\",INDEX($B$1:$K$1&\"-\"&TEXT($B$2:$K$2,\"hh:mm\"),SMALL(IF($B66:$K66=\"\",COLUMN($B66:$K66)-COLUMN($B66)+1),COLUMNS($Q66:Q66))))","v":"1-09:05"},{"$f":"IF(COLUMNS($Q66:R66)>$P66,\"\",INDEX($B$1:$K$1&\"-\"&TEXT($B$2:$K$2,\"hh:mm\"),SMALL(IF($B66:$K66=\"\",COLUMN($B66:$K66)-COLUMN($B66)+1),COLUMNS($Q66:R66))))","v":"Lunch-13:00"},{"$f":"IF(COLUMNS($Q66:S66)>$P66,\"\",INDEX($B$1:$K$1&\"-\"&TEXT($B$2:$K$2,\"hh:mm\"),SMALL(IF($B66:$K66=\"\",COLUMN($B66:$K66)-COLUMN($B66)+1),COLUMNS($Q66:S66))))","v":"5-14:30"},{"$f":"IF(COLUMNS($Q66:T66)>$P66,\"\",INDEX($B$1:$K$1&\"-\"&TEXT($B$2:$K$2,\"hh:mm\"),SMALL(IF($B66:$K66=\"\",COLUMN($B66:$K66)-COLUMN($B66)+1),COLUMNS($Q66:T66))))","v":"6-15:30"},{"$f":"IF(COLUMNS($Q66:U66)>$P66,\"\",INDEX($B$1:$K$1&\"-\"&TEXT($B$2:$K$2,\"hh:mm\"),SMALL(IF($B66:$K66=\"\",COLUMN($B66:$K66)-COLUMN($B66)+1),COLUMNS($Q66:U66))))","v":"TEA-16:30"},{"$f":"IF(COLUMNS($Q66:V66)>$P66,\"\",INDEX($B$1:$K$1&\"-\"&TEXT($B$2:$K$2,\"hh:mm\"),SMALL(IF($B66:$K66=\"\",COLUMN($B66:$K66)-COLUMN($B66)+1),COLUMNS($Q66:V66))))","v":""},{"$f":"IF(COLUMNS($Q66:W66)>$P66,\"\",INDEX($B$1:$K$1&\"-\"&TEXT($B$2:$K$2,\"hh:mm\"),SMALL(IF($B66:$K66=\"\",COLUMN($B66:$K66)-COLUMN($B66)+1),COLUMNS($Q66:W66))))","v":""},{"$f":"IF(COLUMNS($Q66:X66)>$P66,\"\",INDEX($B$1:$K$1&\"-\"&TEXT($B$2:$K$2,\"hh:mm\"),SMALL(IF($B66:$K66=\"\",COLUMN($B66:$K66)-COLUMN($B66)+1),COLUMNS($Q66:X66))))","v":""}]
["Student 65","ASPMaths1c","ASPhotoM","StatisticsS1b",null,null,null,null,null,null,"SchoolMtg","Student 65",4,null,"Student 65",6,{"$f":"IF(COLUMNS($Q67:Q67)>$P67,\"\",INDEX($B$1:$K$1&\"-\"&TEXT($B$2:$K$2,\"hh:mm\"),SMALL(IF($B67:$K67=\"\",COLUMN($B67:$K67)-COLUMN($B67)+1),COLUMNS($Q67:Q67))))","v":"4-12:05"},{"$f":"IF(COLUMNS($Q67:R67)>$P67,\"\",INDEX($B$1:$K$1&\"-\"&TEXT($B$2:$K$2,\"hh:mm\"),SMALL(IF($B67:$K67=\"\",COLUMN($B67:$K67)-COLUMN($B67)+1),COLUMNS($Q67:R67))))","v":"Lunch-13:00"},{"$f":"IF(COLUMNS($Q67:S67)>$P67,\"\",INDEX($B$1:$K$1&\"-\"&TEXT($B$2:$K$2,\"hh:mm\"),SMALL(IF($B67:$K67=\"\",COLUMN($B67:$K67)-COLUMN($B67)+1),COLUMNS($Q67:S67))))","v":"5-14:30"},{"$f":"IF(COLUMNS($Q67:T67)>$P67,\"\",INDEX($B$1:$K$1&\"-\"&TEXT($B$2:$K$2,\"hh:mm\"),SMALL(IF($B67:$K67=\"\",COLUMN($B67:$K67)-COLUMN($B67)+1),COLUMNS($Q67:T67))))","v":"6-15:30"},{"$f":"IF(COLUMNS($Q67:U67)>$P67,\"\",INDEX($B$1:$K$1&\"-\"&TEXT($B$2:$K$2,\"hh:mm\"),SMALL(IF($B67:$K67=\"\",COLUMN($B67:$K67)-COLUMN($B67)+1),COLUMNS($Q67:U67))))","v":"TEA-16:30"},{"$f":"IF(COLUMNS($Q67:V67)>$P67,\"\",INDEX($B$1:$K$1&\"-\"&TEXT($B$2:$K$2,\"hh:mm\"),SMALL(IF($B67:$K67=\"\",COLUMN($B67:$K67)-COLUMN($B67)+1),COLUMNS($Q67:V67))))","v":"7-17:00"},{"$f":"IF(COLUMNS($Q67:W67)>$P67,\"\",INDEX($B$1:$K$1&\"-\"&TEXT($B$2:$K$2,\"hh:mm\"),SMALL(IF($B67:$K67=\"\",COLUMN($B67:$K67)-COLUMN($B67)+1),COLUMNS($Q67:W67))))","v":""},{"$f":"IF(COLUMNS($Q67:X67)>$P67,\"\",INDEX($B$1:$K$1&\"-\"&TEXT($B$2:$K$2,\"hh:mm\"),SMALL(IF($B67:$K67=\"\",COLUMN($B67:$K67)-COLUMN($B67)+1),COLUMNS($Q67:X67))))","v":""}]
["Student 66","YogaB1","SMechanics3","ASPhysics4",null,null,null,null,null,null,"SchoolMtg","Student 66",4,null,"Student 66",{"$f":"COUNTIF(B68:K68,\"\")","v":6},{"$f":"IF(COLUMNS($Q68:Q68)>$P68,\"\",INDEX($B$1:$K$1&\"-\"&TEXT($B$2:$K$2,\"hh:mm\"),SMALL(IF($B68:$K68=\"\",COLUMN($B68:$K68)-COLUMN($B68)+1),COLUMNS($Q68:Q68))))","v":"4-12:05"},{"$f":"IF(COLUMNS($Q68:R68)>$P68,\"\",INDEX($B$1:$K$1&\"-\"&TEXT($B$2:$K$2,\"hh:mm\"),SMALL(IF($B68:$K68=\"\",COLUMN($B68:$K68)-COLUMN($B68)+1),COLUMNS($Q68:R68))))","v":"Lunch-13:00"},{"$f":"IF(COLUMNS($Q68:S68)>$P68,\"\",INDEX($B$1:$K$1&\"-\"&TEXT($B$2:$K$2,\"hh:mm\"),SMALL(IF($B68:$K68=\"\",COLUMN($B68:$K68)-COLUMN($B68)+1),COLUMNS($Q68:S68))))","v":"5-14:30"},{"$f":"IF(COLUMNS($Q68:T68)>$P68,\"\",INDEX($B$1:$K$1&\"-\"&TEXT($B$2:$K$2,\"hh:mm\"),SMALL(IF($B68:$K68=\"\",COLUMN($B68:$K68)-COLUMN($B68)+1),COLUMNS($Q68:T68))))","v":"6-15:30"},{"$f":"IF(COLUMNS($Q68:U68)>$P68,\"\",INDEX($B$1:$K$1&\"-\"&TEXT($B$2:$K$2,\"hh:mm\"),SMALL(IF($B68:$K68=\"\",COLUMN($B68:$K68)-COLUMN($B68)+1),COLUMNS($Q68:U68))))","v":"TEA-16:30"},{"$f":"IF(COLUMNS($Q68:V68)>$P68,\"\",INDEX($B$1:$K$1&\"-\"&TEXT($B$2:$K$2,\"hh:mm\"),SMALL(IF($B68:$K68=\"\",COLUMN($B68:$K68)-COLUMN($B68)+1),COLUMNS($Q68:V68))))","v":"7-17:00"},{"$f":"IF(COLUMNS($Q68:W68)>$P68,\"\",INDEX($B$1:$K$1&\"-\"&TEXT($B$2:$K$2,\"hh:mm\"),SMALL(IF($B68:$K68=\"\",COLUMN($B68:$K68)-COLUMN($B68)+1),COLUMNS($Q68:W68))))","v":""},{"$f":"IF(COLUMNS($Q68:X68)>$P68,\"\",INDEX($B$1:$K$1&\"-\"&TEXT($B$2:$K$2,\"hh:mm\"),SMALL(IF($B68:$K68=\"\",COLUMN($B68:$K68)-COLUMN($B68)+1),COLUMNS($Q68:X68))))","v":""}]
["Student 67","ESLIGC3","StatisticsS23",null,null,"13.45A2Maths4","A2Psychology2",null,null,null,"SchoolMtg","Student 67",5,null,"Student 67",5,{"$f":"IF(COLUMNS($Q69:Q69)>$P69,\"\",INDEX($B$1:$K$1&\"-\"&TEXT($B$2:$K$2,\"hh:mm\"),SMALL(IF($B69:$K69=\"\",COLUMN($B69:$K69)-COLUMN($B69)+1),COLUMNS($Q69:Q69))))","v":"3-11:05"},{"$f":"IF(COLUMNS($Q69:R69)>$P69,\"\",INDEX($B$1:$K$1&\"-\"&TEXT($B$2:$K$2,\"hh:mm\"),SMALL(IF($B69:$K69=\"\",COLUMN($B69:$K69)-COLUMN($B69)+1),COLUMNS($Q69:R69))))","v":"4-12:05"},{"$f":"IF(COLUMNS($Q69:S69)>$P69,\"\",INDEX($B$1:$K$1&\"-\"&TEXT($B$2:$K$2,\"hh:mm\"),SMALL(IF($B69:$K69=\"\",COLUMN($B69:$K69)-COLUMN($B69)+1),COLUMNS($Q69:S69))))","v":"6-15:30"},{"$f":"IF(COLUMNS($Q69:T69)>$P69,\"\",INDEX($B$1:$K$1&\"-\"&TEXT($B$2:$K$2,\"hh:mm\"),SMALL(IF($B69:$K69=\"\",COLUMN($B69:$K69)-COLUMN($B69)+1),COLUMNS($Q69:T69))))","v":"TEA-16:30"},{"$f":"IF(COLUMNS($Q69:U69)>$P69,\"\",INDEX($B$1:$K$1&\"-\"&TEXT($B$2:$K$2,\"hh:mm\"),SMALL(IF($B69:$K69=\"\",COLUMN($B69:$K69)-COLUMN($B69)+1),COLUMNS($Q69:U69))))","v":"7-17:00"},{"$f":"IF(COLUMNS($Q69:V69)>$P69,\"\",INDEX($B$1:$K$1&\"-\"&TEXT($B$2:$K$2,\"hh:mm\"),SMALL(IF($B69:$K69=\"\",COLUMN($B69:$K69)-COLUMN($B69)+1),COLUMNS($Q69:V69))))","v":""},{"$f":"IF(COLUMNS($Q69:W69)>$P69,\"\",INDEX($B$1:$K$1&\"-\"&TEXT($B$2:$K$2,\"hh:mm\"),SMALL(IF($B69:$K69=\"\",COLUMN($B69:$K69)-COLUMN($B69)+1),COLUMNS($Q69:W69))))","v":""},{"$f":"IF(COLUMNS($Q69:X69)>$P69,\"\",INDEX($B$1:$K$1&\"-\"&TEXT($B$2:$K$2,\"hh:mm\"),SMALL(IF($B69:$K69=\"\",COLUMN($B69:$K69)-COLUMN($B69)+1),COLUMNS($Q69:X69))))","v":""}]
["Student 68","A2GraphicD1","A2GraphicD2","CCriminology3",null,null,null,null,null,null,"SchoolMtg","Student 68",{"$f":"COUNTA(B70:K70)","v":4},null,"Student 68",6,{"$f":"IF(COLUMNS($Q70:Q70)>$P70,\"\",INDEX($B$1:$K$1&\"-\"&TEXT($B$2:$K$2,\"hh:mm\"),SMALL(IF($B70:$K70=\"\",COLUMN($B70:$K70)-COLUMN($B70)+1),COLUMNS($Q70:Q70))))","v":"4-12:05"},{"$f":"IF(COLUMNS($Q70:R70)>$P70,\"\",INDEX($B$1:$K$1&\"-\"&TEXT($B$2:$K$2,\"hh:mm\"),SMALL(IF($B70:$K70=\"\",COLUMN($B70:$K70)-COLUMN($B70)+1),COLUMNS($Q70:R70))))","v":"Lunch-13:00"},{"$f":"IF(COLUMNS($Q70:S70)>$P70,\"\",INDEX($B$1:$K$1&\"-\"&TEXT($B$2:$K$2,\"hh:mm\"),SMALL(IF($B70:$K70=\"\",COLUMN($B70:$K70)-COLUMN($B70)+1),COLUMNS($Q70:S70))))","v":"5-14:30"},{"$f":"IF(COLUMNS($Q70:T70)>$P70,\"\",INDEX($B$1:$K$1&\"-\"&TEXT($B$2:$K$2,\"hh:mm\"),SMALL(IF($B70:$K70=\"\",COLUMN($B70:$K70)-COLUMN($B70)+1),COLUMNS($Q70:T70))))","v":"6-15:30"},{"$f":"IF(COLUMNS($Q70:U70)>$P70,\"\",INDEX($B$1:$K$1&\"-\"&TEXT($B$2:$K$2,\"hh:mm\"),SMALL(IF($B70:$K70=\"\",COLUMN($B70:$K70)-COLUMN($B70)+1),COLUMNS($Q70:U70))))","v":"TEA-16:30"},{"$f":"IF(COLUMNS($Q70:V70)>$P70,\"\",INDEX($B$1:$K$1&\"-\"&TEXT($B$2:$K$2,\"hh:mm\"),SMALL(IF($B70:$K70=\"\",COLUMN($B70:$K70)-COLUMN($B70)+1),COLUMNS($Q70:V70))))","v":"7-17:00"},{"$f":"IF(COLUMNS($Q70:W70)>$P70,\"\",INDEX($B$1:$K$1&\"-\"&TEXT($B$2:$K$2,\"hh:mm\"),SMALL(IF($B70:$K70=\"\",COLUMN($B70:$K70)-COLUMN($B70)+1),COLUMNS($Q70:W70))))","v":""},{"$f":"IF(COLUMNS($Q70:X70)>$P70,\"\",INDEX($B$1:$K$1&\"-\"&TEXT($B$2:$K$2,\"hh:mm\"),SMALL(IF($B70:$K70=\"\",COLUMN($B70:$K70)-COLUMN($B70)+1),COLUMNS($Q70:X70))))","v":""}]
[]
[]
[null,1,2,3,4,"Lunch",5,6,"TEA",7,8]
[null,"09:05:00","10:05:00","11:05:00","12:05:00","13:00:00","14:30:00","15:30:00","16:30:00","17:00:00","18:15:00"]
["# Free Periods",{"$f":"COUNTIF(B3:B70,\"\")","v":16},{"$f":"COUNTIF(C3:C70,\"\")","v":15},16,35,59,59,65,68,31,0]
[{"$f":"\"#\"&ROWS(A$76:A76)","v":"#1"},{"$f":"IF(ROWS(B$76:B76)>B$75,\"\",INDEX($A$3:$A$70,SMALL(IF(B$3:B$70=\"\",ROW(B$3:B$70)-ROW(B$3)+1),ROWS(B$76:B76))))","v":"Student 1"},{"$f":"IF(ROWS(C$76:C76)>C$75,\"\",INDEX($A$3:$A$70,SMALL(IF(C$3:C$70=\"\",ROW(C$3:C$70)-ROW(C$3)+1),ROWS(C$76:C76))))","v":"Student 10"},{"$f":"IF(ROWS(D$76:D76)>D$75,\"\",INDEX($A$3:$A$70,SMALL(IF(D$3:D$70=\"\",ROW(D$3:D$70)-ROW(D$3)+1),ROWS(D$76:D76))))","v":"Student 4"},{"$f":"IF(ROWS(E$76:E76)>E$75,\"\",INDEX($A$3:$A$70,SMALL(IF(E$3:E$70=\"\",ROW(E$3:E$70)-ROW(E$3)+1),ROWS(E$76:E76))))","v":"Student 2"},{"$f":"IF(ROWS(F$76:F76)>F$75,\"\",INDEX($A$3:$A$70,SMALL(IF(F$3:F$70=\"\",ROW(F$3:F$70)-ROW(F$3)+1),ROWS(F$76:F76))))","v":"Student 1"},{"$f":"IF(ROWS(G$76:G76)>G$75,\"\",INDEX($A$3:$A$70,SMALL(IF(G$3:G$70=\"\",ROW(G$3:G$70)-ROW(G$3)+1),ROWS(G$76:G76))))","v":"Student 1"},{"$f":"IF(ROWS(H$76:H76)>H$75,\"\",INDEX($A$3:$A$70,SMALL(IF(H$3:H$70=\"\",ROW(H$3:H$70)-ROW(H$3)+1),ROWS(H$76:H76))))","v":"Student 1"},{"$f":"IF(ROWS(I$76:I76)>I$75,\"\",INDEX($A$3:$A$70,SMALL(IF(I$3:I$70=\"\",ROW(I$3:I$70)-ROW(I$3)+1),ROWS(I$76:I76))))","v":"Student 1"},{"$f":"IF(ROWS(J$76:J76)>J$75,\"\",INDEX($A$3:$A$70,SMALL(IF(J$3:J$70=\"\",ROW(J$3:J$70)-ROW(J$3)+1),ROWS(J$76:J76))))","v":"Student 3"},{"$f":"IF(ROWS(K$76:K76)>K$75,\"\",INDEX($A$3:$A$70,SMALL(IF(K$3:K$70=\"\",ROW(K$3:K$70)-ROW(K$3)+1),ROWS(K$76:K76))))","v":""}]
[{"$f":"\"#\"&ROWS(A$76:A77)","v":"#2"},{"$f":"IF(ROWS(B$76:B77)>B$75,\"\",INDEX($A$3:$A$70,SMALL(IF(B$3:B$70=\"\",ROW(B$3:B$70)-ROW(B$3)+1),ROWS(B$76:B77))))","v":"Student 5"},{"$f":"IF(ROWS(C$76:C77)>C$75,\"\",INDEX($A$3:$A$70,SMALL(IF(C$3:C$70=\"\",ROW(C$3:C$70)-ROW(C$3)+1),ROWS(C$76:C77))))","v":"Student 14"},{"$f":"IF(ROWS(D$76:D77)>D$75,\"\",INDEX($A$3:$A$70,SMALL(IF(D$3:D$70=\"\",ROW(D$3:D$70)-ROW(D$3)+1),ROWS(D$76:D77))))","v":"Student 9"},{"$f":"IF(ROWS(E$76:E77)>E$75,\"\",INDEX($A$3:$A$70,SMALL(IF(E$3:E$70=\"\",ROW(E$3:E$70)-ROW(E$3)+1),ROWS(E$76:E77))))","v":"Student 3"},{"$f":"IF(ROWS(F$76:F77)>F$75,\"\",INDEX($A$3:$A$70,SMALL(IF(F$3:F$70=\"\",ROW(F$3:F$70)-ROW(F$3)+1),ROWS(F$76:F77))))","v":"Student 3"},{"$f":"IF(ROWS(G$76:G77)>G$75,\"\",INDEX($A$3:$A$70,SMALL(IF(G$3:G$70=\"\",ROW(G$3:G$70)-ROW(G$3)+1),ROWS(G$76:G77))))","v":"Student 2"},{"$f":"IF(ROWS(H$76:H77)>H$75,\"\",INDEX($A$3:$A$70,SMALL(IF(H$3:H$70=\"\",ROW(H$3:H$70)-ROW(H$3)+1),ROWS(H$76:H77))))","v":"Student 2"},{"$f":"IF(ROWS(I$76:I77)>I$75,\"\",INDEX($A$3:$A$70,SMALL(IF(I$3:I$70=\"\",ROW(I$3:I$70)-ROW(I$3)+1),ROWS(I$76:I77))))","v":"Student 2"},{"$f":"IF(ROWS(J$76:J77)>J$75,\"\",INDEX($A$3:$A$70,SMALL(IF(J$3:J$70=\"\",ROW(J$3:J$70)-ROW(J$3)+1),ROWS(J$76:J77))))","v":"Student 6"},{"$f":"IF(ROWS(K$76:K77)>K$75,\"\",INDEX($A$3:$A$70,SMALL(IF(K$3:K$70=\"\",ROW(K$3:K$70)-ROW(K$3)+1),ROWS(K$76:K77))))","v":""}]
[{"$f":"\"#\"&ROWS(A$76:A78)","v":"#3"},{"$f":"IF(ROWS(B$76:B78)>B$75,\"\",INDEX($A$3:$A$70,SMALL(IF(B$3:B$70=\"\",ROW(B$3:B$70)-ROW(B$3)+1),ROWS(B$76:B78))))","v":"Student 7"},{"$f":"IF(ROWS(C$76:C78)>C$75,\"\",INDEX($A$3:$A$70,SMALL(IF(C$3:C$70=\"\",ROW(C$3:C$70)-ROW(C$3)+1),ROWS(C$76:C78))))","v":"Student 32"},{"$f":"IF(ROWS(D$76:D78)>D$75,\"\",INDEX($A$3:$A$70,SMALL(IF(D$3:D$70=\"\",ROW(D$3:D$70)-ROW(D$3)+1),ROWS(D$76:D78))))","v":"Student 10"},{"$f":"IF(ROWS(E$76:E78)>E$75,\"\",INDEX($A$3:$A$70,SMALL(IF(E$3:E$70=\"\",ROW(E$3:E$70)-ROW(E$3)+1),ROWS(E$76:E78))))","v":"Student 6"},{"$f":"IF(ROWS(F$76:F78)>F$75,\"\",INDEX($A$3:$A$70,SMALL(IF(F$3:F$70=\"\",ROW(F$3:F$70)-ROW(F$3)+1),ROWS(F$76:F78))))","v":"Student 4"},{"$f":"IF(ROWS(G$76:G78)>G$75,\"\",INDEX($A$3:$A$70,SMALL(IF(G$3:G$70=\"\",ROW(G$3:G$70)-ROW(G$3)+1),ROWS(G$76:G78))))","v":"Student 3"},{"$f":"IF(ROWS(H$76:H78)>H$75,\"\",INDEX($A$3:$A$70,SMALL(IF(H$3:H$70=\"\",ROW(H$3:H$70)-ROW(H$3)+1),ROWS(H$76:H78))))","v":"Student 3"},{"$f":"IF(ROWS(I$76:I78)>I$75,\"\",INDEX($A$3:$A$70,SMALL(IF(I$3:I$70=\"\",ROW(I$3:I$70)-ROW(I$3)+1),ROWS(I$76:I78))))","v":"Student 3"},{"$f":"IF(ROWS(J$76:J78)>J$75,\"\",INDEX($A$3:$A$70,SMALL(IF(J$3:J$70=\"\",ROW(J$3:J$70)-ROW(J$3)+1),ROWS(J$76:J78))))","v":"Student 12"},{"$f":"IF(ROWS(K$76:K78)>K$75,\"\",INDEX($A$3:$A$70,SMALL(IF(K$3:K$70=\"\",ROW(K$3:K$70)-ROW(K$3)+1),ROWS(K$76:K78))))","v":""}]
[{"$f":"\"#\"&ROWS(A$76:A79)","v":"#4"},{"$f":"IF(ROWS(B$76:B79)>B$75,\"\",INDEX($A$3:$A$70,SMALL(IF(B$3:B$70=\"\",ROW(B$3:B$70)-ROW(B$3)+1),ROWS(B$76:B79))))","v":"Student 9"},{"$f":"IF(ROWS(C$76:C79)>C$75,\"\",INDEX($A$3:$A$70,SMALL(IF(C$3:C$70=\"\",ROW(C$3:C$70)-ROW(C$3)+1),ROWS(C$76:C79))))","v":"Student 33"},{"$f":"IF(ROWS(D$76:D79)>D$75,\"\",INDEX($A$3:$A$70,SMALL(IF(D$3:D$70=\"\",ROW(D$3:D$70)-ROW(D$3)+1),ROWS(D$76:D79))))","v":"Student 13"},{"$f":"IF(ROWS(E$76:E79)>E$75,\"\",INDEX($A$3:$A$70,SMALL(IF(E$3:E$70=\"\",ROW(E$3:E$70)-ROW(E$3)+1),ROWS(E$76:E79))))","v":"Student 8"},{"$f":"IF(ROWS(F$76:F79)>F$75,\"\",INDEX($A$3:$A$70,SMALL(IF(F$3:F$70=\"\",ROW(F$3:F$70)-ROW(F$3)+1),ROWS(F$76:F79))))","v":"Student 5"},{"$f":"IF(ROWS(G$76:G79)>G$75,\"\",INDEX($A$3:$A$70,SMALL(IF(G$3:G$70=\"\",ROW(G$3:G$70)-ROW(G$3)+1),ROWS(G$76:G79))))","v":"Student 4"},{"$f":"IF(ROWS(H$76:H79)>H$75,\"\",INDEX($A$3:$A$70,SMALL(IF(H$3:H$70=\"\",ROW(H$3:H$70)-ROW(H$3)+1),ROWS(H$76:H79))))","v":"Student 4"},{"$f":"IF(ROWS(I$76:I79)>I$75,\"\",INDEX($A$3:$A$70,SMALL(IF(I$3:I$70=\"\",ROW(I$3:I$70)-ROW(I$3)+1),ROWS(I$76:I79))))","v":"Student 4"},{"$f":"IF(ROWS(J$76:J79)>J$75,\"\",INDEX($A$3:$A$70,SMALL(IF(J$3:J$70=\"\",ROW(J$3:J$70)-ROW(J$3)+1),ROWS(J$76:J79))))","v":"Student 15"},{"$f":"IF(ROWS(K$76:K79)>K$75,\"\",INDEX($A$3:$A$70,SMALL(IF(K$3:K$70=\"\",ROW(K$3:K$70)-ROW(K$3)+1),ROWS(K$76:K79))))","v":""}]
[{"$f":"\"#\"&ROWS(A$76:A80)","v":"#5"},{"$f":"IF(ROWS(B$76:B80)>B$75,\"\",INDEX($A$3:$A$70,SMALL(IF(B$3:B$70=\"\",ROW(B$3:B$70)-ROW(B$3)+1),ROWS(B$76:B80))))","v":"Student 10"},{"$f":"IF(ROWS(C$76:C80)>C$75,\"\",INDEX($A$3:$A$70,SMALL(IF(C$3:C$70=\"\",ROW(C$3:C$70)-ROW(C$3)+1),ROWS(C$76:C80))))","v":"Student 34"},{"$f":"IF(ROWS(D$76:D80)>D$75,\"\",INDEX($A$3:$A$70,SMALL(IF(D$3:D$70=\"\",ROW(D$3:D$70)-ROW(D$3)+1),ROWS(D$76:D80))))","v":"Student 18"},{"$f":"IF(ROWS(E$76:E80)>E$75,\"\",INDEX($A$3:$A$70,SMALL(IF(E$3:E$70=\"\",ROW(E$3:E$70)-ROW(E$3)+1),ROWS(E$76:E80))))","v":"Student 10"},{"$f":"IF(ROWS(F$76:F80)>F$75,\"\",INDEX($A$3:$A$70,SMALL(IF(F$3:F$70=\"\",ROW(F$3:F$70)-ROW(F$3)+1),ROWS(F$76:F80))))","v":"Student 7"},{"$f":"IF(ROWS(G$76:G80)>G$75,\"\",INDEX($A$3:$A$70,SMALL(IF(G$3:G$70=\"\",ROW(G$3:G$70)-ROW(G$3)+1),ROWS(G$76:G80))))","v":"Student 5"},{"$f":"IF(ROWS(H$76:H80)>H$75,\"\",INDEX($A$3:$A$70,SMALL(IF(H$3:H$70=\"\",ROW(H$3:H$70)-ROW(H$3)+1),ROWS(H$76:H80))))","v":"Student 5"},{"$f":"IF(ROWS(I$76:I80)>I$75,\"\",INDEX($A$3:$A$70,SMALL(IF(I$3:I$70=\"\",ROW(I$3:I$70)-ROW(I$3)+1),ROWS(I$76:I80))))","v":"Student 5"},{"$f":"IF(ROWS(J$76:J80)>J$75,\"\",INDEX($A$3:$A$70,SMALL(IF(J$3:J$70=\"\",ROW(J$3:J$70)-ROW(J$3)+1),ROWS(J$76:J80))))","v":"Student 17"},{"$f":"IF(ROWS(K$76:K80)>K$75,\"\",INDEX($A$3:$A$70,SMALL(IF(K$3:K$70=\"\",ROW(K$3:K$70)-ROW(K$3)+1),ROWS(K$76:K80))))","v":""}]
[{"$f":"\"#\"&ROWS(A$76:A81)","v":"#6"},{"$f":"IF(ROWS(B$76:B81)>B$75,\"\",INDEX($A$3:$A$70,SMALL(IF(B$3:B$70=\"\",ROW(B$3:B$70)-ROW(B$3)+1),ROWS(B$76:B81))))","v":"Student 11"},{"$f":"IF(ROWS(C$76:C81)>C$75,\"\",INDEX($A$3:$A$70,SMALL(IF(C$3:C$70=\"\",ROW(C$3:C$70)-ROW(C$3)+1),ROWS(C$76:C81))))","v":"Student 36"},{"$f":"IF(ROWS(D$76:D81)>D$75,\"\",INDEX($A$3:$A$70,SMALL(IF(D$3:D$70=\"\",ROW(D$3:D$70)-ROW(D$3)+1),ROWS(D$76:D81))))","v":"Student 19"},{"$f":"IF(ROWS(E$76:E81)>E$75,\"\",INDEX($A$3:$A$70,SMALL(IF(E$3:E$70=\"\",ROW(E$3:E$70)-ROW(E$3)+1),ROWS(E$76:E81))))","v":"Student 11"},{"$f":"IF(ROWS(F$76:F81)>F$75,\"\",INDEX($A$3:$A$70,SMALL(IF(F$3:F$70=\"\",ROW(F$3:F$70)-ROW(F$3)+1),ROWS(F$76:F81))))","v":"Student 8"},{"$f":"IF(ROWS(G$76:G81)>G$75,\"\",INDEX($A$3:$A$70,SMALL(IF(G$3:G$70=\"\",ROW(G$3:G$70)-ROW(G$3)+1),ROWS(G$76:G81))))","v":"Student 6"},{"$f":"IF(ROWS(H$76:H81)>H$75,\"\",INDEX($A$3:$A$70,SMALL(IF(H$3:H$70=\"\",ROW(H$3:H$70)-ROW(H$3)+1),ROWS(H$76:H81))))","v":"Student 6"},{"$f":"IF(ROWS(I$76:I81)>I$75,\"\",INDEX($A$3:$A$70,SMALL(IF(I$3:I$70=\"\",ROW(I$3:I$70)-ROW(I$3)+1),ROWS(I$76:I81))))","v":"Student 6"},{"$f":"IF(ROWS(J$76:J81)>J$75,\"\",INDEX($A$3:$A$70,SMALL(IF(J$3:J$70=\"\",ROW(J$3:J$70)-ROW(J$3)+1),ROWS(J$76:J81))))","v":"Student 18"},{"$f":"IF(ROWS(K$76:K81)>K$75,\"\",INDEX($A$3:$A$70,SMALL(IF(K$3:K$70=\"\",ROW(K$3:K$70)-ROW(K$3)+1),ROWS(K$76:K81))))","v":""}]
[{"$f":"\"#\"&ROWS(A$76:A82)","v":"#7"},{"$f":"IF(ROWS(B$76:B82)>B$75,\"\",INDEX($A$3:$A$70,SMALL(IF(B$3:B$70=\"\",ROW(B$3:B$70)-ROW(B$3)+1),ROWS(B$76:B82))))","v":"Student 19"},{"$f":"IF(ROWS(C$76:C82)>C$75,\"\",INDEX($A$3:$A$70,SMALL(IF(C$3:C$70=\"\",ROW(C$3:C$70)-ROW(C$3)+1),ROWS(C$76:C82))))","v":"Student 38"},{"$f":"IF(ROWS(D$76:D82)>D$75,\"\",INDEX($A$3:$A$70,SMALL(IF(D$3:D$70=\"\",ROW(D$3:D$70)-ROW(D$3)+1),ROWS(D$76:D82))))","v":"Student 22"},{"$f":"IF(ROWS(E$76:E82)>E$75,\"\",INDEX($A$3:$A$70,SMALL(IF(E$3:E$70=\"\",ROW(E$3:E$70)-ROW(E$3)+1),ROWS(E$76:E82))))","v":"Student 13"},{"$f":"IF(ROWS(F$76:F82)>F$75,\"\",INDEX($A$3:$A$70,SMALL(IF(F$3:F$70=\"\",ROW(F$3:F$70)-ROW(F$3)+1),ROWS(F$76:F82))))","v":"Student 9"},{"$f":"IF(ROWS(G$76:G82)>G$75,\"\",INDEX($A$3:$A$70,SMALL(IF(G$3:G$70=\"\",ROW(G$3:G$70)-ROW(G$3)+1),ROWS(G$76:G82))))","v":"Student 7"},{"$f":"IF(ROWS(H$76:H82)>H$75,\"\",INDEX($A$3:$A$70,SMALL(IF(H$3:H$70=\"\",ROW(H$3:H$70)-ROW(H$3)+1),ROWS(H$76:H82))))","v":"Student 7"},{"$f":"IF(ROWS(I$76:I82)>I$75,\"\",INDEX($A$3:$A$70,SMALL(IF(I$3:I$70=\"\",ROW(I$3:I$70)-ROW(I$3)+1),ROWS(I$76:I82))))","v":"Student 7"},{"$f":"IF(ROWS(J$76:J82)>J$75,\"\",INDEX($A$3:$A$70,SMALL(IF(J$3:J$70=\"\",ROW(J$3:J$70)-ROW(J$3)+1),ROWS(J$76:J82))))","v":"Student 21"},{"$f":"IF(ROWS(K$76:K82)>K$75,\"\",INDEX($A$3:$A$70,SMALL(IF(K$3:K$70=\"\",ROW(K$3:K$70)-ROW(K$3)+1),ROWS(K$76:K82))))","v":""}]
[{"$f":"\"#\"&ROWS(A$76:A83)","v":"#8"},{"$f":"IF(ROWS(B$76:B83)>B$75,\"\",INDEX($A$3:$A$70,SMALL(IF(B$3:B$70=\"\",ROW(B$3:B$70)-ROW(B$3)+1),ROWS(B$76:B83))))","v":"Student 20"},{"$f":"IF(ROWS(C$76:C83)>C$75,\"\",INDEX($A$3:$A$70,SMALL(IF(C$3:C$70=\"\",ROW(C$3:C$70)-ROW(C$3)+1),ROWS(C$76:C83))))","v":"Student 43"},{"$f":"IF(ROWS(D$76:D83)>D$75,\"\",INDEX($A$3:$A$70,SMALL(IF(D$3:D$70=\"\",ROW(D$3:D$70)-ROW(D$3)+1),ROWS(D$76:D83))))","v":"Student 27"},{"$f":"IF(ROWS(E$76:E83)>E$75,\"\",INDEX($A$3:$A$70,SMALL(IF(E$3:E$70=\"\",ROW(E$3:E$70)-ROW(E$3)+1),ROWS(E$76:E83))))","v":"Student 16"},{"$f":"IF(ROWS(F$76:F83)>F$75,\"\",INDEX($A$3:$A$70,SMALL(IF(F$3:F$70=\"\",ROW(F$3:F$70)-ROW(F$3)+1),ROWS(F$76:F83))))","v":"Student 10"},{"$f":"IF(ROWS(G$76:G83)>G$75,\"\",INDEX($A$3:$A$70,SMALL(IF(G$3:G$70=\"\",ROW(G$3:G$70)-ROW(G$3)+1),ROWS(G$76:G83))))","v":"Student 9"},{"$f":"IF(ROWS(H$76:H83)>H$75,\"\",INDEX($A$3:$A$70,SMALL(IF(H$3:H$70=\"\",ROW(H$3:H$70)-ROW(H$3)+1),ROWS(H$76:H83))))","v":"Student 8"},{"$f":"IF(ROWS(I$76:I83)>I$75,\"\",INDEX($A$3:$A$70,SMALL(IF(I$3:I$70=\"\",ROW(I$3:I$70)-ROW(I$3)+1),ROWS(I$76:I83))))","v":"Student 8"},{"$f":"IF(ROWS(J$76:J83)>J$75,\"\",INDEX($A$3:$A$70,SMALL(IF(J$3:J$70=\"\",ROW(J$3:J$70)-ROW(J$3)+1),ROWS(J$76:J83))))","v":"Student 22"},{"$f":"IF(ROWS(K$76:K83)>K$75,\"\",INDEX($A$3:$A$70,SMALL(IF(K$3:K$70=\"\",ROW(K$3:K$70)-ROW(K$3)+1),ROWS(K$76:K83))))","v":""}]
[{"$f":"\"#\"&ROWS(A$76:A84)","v":"#9"},{"$f":"IF(ROWS(B$76:B84)>B$75,\"\",INDEX($A$3:$A$70,SMALL(IF(B$3:B$70=\"\",ROW(B$3:B$70)-ROW(B$3)+1),ROWS(B$76:B84))))","v":"Student 30"},{"$f":"IF(ROWS(C$76:C84)>C$75,\"\",INDEX($A$3:$A$70,SMALL(IF(C$3:C$70=\"\",ROW(C$3:C$70)-ROW(C$3)+1),ROWS(C$76:C84))))","v":"Student 44"},{"$f":"IF(ROWS(D$76:D84)>D$75,\"\",INDEX($A$3:$A$70,SMALL(IF(D$3:D$70=\"\",ROW(D$3:D$70)-ROW(D$3)+1),ROWS(D$76:D84))))","v":"Student 29"},{"$f":"IF(ROWS(E$76:E84)>E$75,\"\",INDEX($A$3:$A$70,SMALL(IF(E$3:E$70=\"\",ROW(E$3:E$70)-ROW(E$3)+1),ROWS(E$76:E84))))","v":"Student 18"},{"$f":"IF(ROWS(F$76:F84)>F$75,\"\",INDEX($A$3:$A$70,SMALL(IF(F$3:F$70=\"\",ROW(F$3:F$70)-ROW(F$3)+1),ROWS(F$76:F84))))","v":"Student 11"},{"$f":"IF(ROWS(G$76:G84)>G$75,\"\",INDEX($A$3:$A$70,SMALL(IF(G$3:G$70=\"\",ROW(G$3:G$70)-ROW(G$3)+1),ROWS(G$76:G84))))","v":"Student 10"},{"$f":"IF(ROWS(H$76:H84)>H$75,\"\",INDEX($A$3:$A$70,SMALL(IF(H$3:H$70=\"\",ROW(H$3:H$70)-ROW(H$3)+1),ROWS(H$76:H84))))","v":"Student 9"},{"$f":"IF(ROWS(I$76:I84)>I$75,\"\",INDEX($A$3:$A$70,SMALL(IF(I$3:I$70=\"\",ROW(I$3:I$70)-ROW(I$3)+1),ROWS(I$76:I84))))","v":"Student 9"},{"$f":"IF(ROWS(J$76:J84)>J$75,\"\",INDEX($A$3:$A$70,SMALL(IF(J$3:J$70=\"\",ROW(J$3:J$70)-ROW(J$3)+1),ROWS(J$76:J84))))","v":"Student 23"},{"$f":"IF(ROWS(K$76:K84)>K$75,\"\",INDEX($A$3:$A$70,SMALL(IF(K$3:K$70=\"\",ROW(K$3:K$70)-ROW(K$3)+1),ROWS(K$76:K84))))","v":""}]
[{"$f":"\"#\"&ROWS(A$76:A85)","v":"#10"},{"$f":"IF(ROWS(B$76:B85)>B$75,\"\",INDEX($A$3:$A$70,SMALL(IF(B$3:B$70=\"\",ROW(B$3:B$70)-ROW(B$3)+1),ROWS(B$76:B85))))","v":"Student 35"},{"$f":"IF(ROWS(C$76:C85)>C$75,\"\",INDEX($A$3:$A$70,SMALL(IF(C$3:C$70=\"\",ROW(C$3:C$70)-ROW(C$3)+1),ROWS(C$76:C85))))","v":"Student 46"},{"$f":"IF(ROWS(D$76:D85)>D$75,\"\",INDEX($A$3:$A$70,SMALL(IF(D$3:D$70=\"\",ROW(D$3:D$70)-ROW(D$3)+1),ROWS(D$76:D85))))","v":"Student 33"},{"$f":"IF(ROWS(E$76:E85)>E$75,\"\",INDEX($A$3:$A$70,SMALL(IF(E$3:E$70=\"\",ROW(E$3:E$70)-ROW(E$3)+1),ROWS(E$76:E85))))","v":"Student 19"},{"$f":"IF(ROWS(F$76:F85)>F$75,\"\",INDEX($A$3:$A$70,SMALL(IF(F$3:F$70=\"\",ROW(F$3:F$70)-ROW(F$3)+1),ROWS(F$76:F85))))","v":"Student 12"},{"$f":"IF(ROWS(G$76:G85)>G$75,\"\",INDEX($A$3:$A$70,SMALL(IF(G$3:G$70=\"\",ROW(G$3:G$70)-ROW(G$3)+1),ROWS(G$76:G85))))","v":"Student 11"},{"$f":"IF(ROWS(H$76:H85)>H$75,\"\",INDEX($A$3:$A$70,SMALL(IF(H$3:H$70=\"\",ROW(H$3:H$70)-ROW(H$3)+1),ROWS(H$76:H85))))","v":"Student 10"},{"$f":"IF(ROWS(I$76:I85)>I$75,\"\",INDEX($A$3:$A$70,SMALL(IF(I$3:I$70=\"\",ROW(I$3:I$70)-ROW(I$3)+1),ROWS(I$76:I85))))","v":"Student 10"},{"$f":"IF(ROWS(J$76:J85)>J$75,\"\",INDEX($A$3:$A$70,SMALL(IF(J$3:J$70=\"\",ROW(J$3:J$70)-ROW(J$3)+1),ROWS(J$76:J85))))","v":"Student 26"},{"$f":"IF(ROWS(K$76:K85)>K$75,\"\",INDEX($A$3:$A$70,SMALL(IF(K$3:K$70=\"\",ROW(K$3:K$70)-ROW(K$3)+1),ROWS(K$76:K85))))","v":""}]
[{"$f":"\"#\"&ROWS(A$76:A86)","v":"#11"},{"$f":"IF(ROWS(B$76:B86)>B$75,\"\",INDEX($A$3:$A$70,SMALL(IF(B$3:B$70=\"\",ROW(B$3:B$70)-ROW(B$3)+1),ROWS(B$76:B86))))","v":"Student 37"},{"$f":"IF(ROWS(C$76:C86)>C$75,\"\",INDEX($A$3:$A$70,SMALL(IF(C$3:C$70=\"\",ROW(C$3:C$70)-ROW(C$3)+1),ROWS(C$76:C86))))","v":"Student 48"},{"$f":"IF(ROWS(D$76:D86)>D$75,\"\",INDEX($A$3:$A$70,SMALL(IF(D$3:D$70=\"\",ROW(D$3:D$70)-ROW(D$3)+1),ROWS(D$76:D86))))","v":"Student 39"},{"$f":"IF(ROWS(E$76:E86)>E$75,\"\",INDEX($A$3:$A$70,SMALL(IF(E$3:E$70=\"\",ROW(E$3:E$70)-ROW(E$3)+1),ROWS(E$76:E86))))","v":"Student 20"},{"$f":"IF(ROWS(F$76:F86)>F$75,\"\",INDEX($A$3:$A$70,SMALL(IF(F$3:F$70=\"\",ROW(F$3:F$70)-ROW(F$3)+1),ROWS(F$76:F86))))","v":"Student 13"},{"$f":"IF(ROWS(G$76:G86)>G$75,\"\",INDEX($A$3:$A$70,SMALL(IF(G$3:G$70=\"\",ROW(G$3:G$70)-ROW(G$3)+1),ROWS(G$76:G86))))","v":"Student 12"},{"$f":"IF(ROWS(H$76:H86)>H$75,\"\",INDEX($A$3:$A$70,SMALL(IF(H$3:H$70=\"\",ROW(H$3:H$70)-ROW(H$3)+1),ROWS(H$76:H86))))","v":"Student 11"},{"$f":"IF(ROWS(I$76:I86)>I$75,\"\",INDEX($A$3:$A$70,SMALL(IF(I$3:I$70=\"\",ROW(I$3:I$70)-ROW(I$3)+1),ROWS(I$76:I86))))","v":"Student 11"},{"$f":"IF(ROWS(J$76:J86)>J$75,\"\",INDEX($A$3:$A$70,SMALL(IF(J$3:J$70=\"\",ROW(J$3:J$70)-ROW(J$3)+1),ROWS(J$76:J86))))","v":"Student 27"},{"$f":"IF(ROWS(K$76:K86)>K$75,\"\",INDEX($A$3:$A$70,SMALL(IF(K$3:K$70=\"\",ROW(K$3:K$70)-ROW(K$3)+1),ROWS(K$76:K86))))","v":""}]
[{"$f":"\"#\"&ROWS(A$76:A87)","v":"#12"},{"$f":"IF(ROWS(B$76:B87)>B$75,\"\",INDEX($A$3:$A$70,SMALL(IF(B$3:B$70=\"\",ROW(B$3:B$70)-ROW(B$3)+1),ROWS(B$76:B87))))","v":"Student 40"},{"$f":"IF(ROWS(C$76:C87)>C$75,\"\",INDEX($A$3:$A$70,SMALL(IF(C$3:C$70=\"\",ROW(C$3:C$70)-ROW(C$3)+1),ROWS(C$76:C87))))","v":"Student 49"},{"$f":"IF(ROWS(D$76:D87)>D$75,\"\",INDEX($A$3:$A$70,SMALL(IF(D$3:D$70=\"\",ROW(D$3:D$70)-ROW(D$3)+1),ROWS(D$76:D87))))","v":"Student 47"},{"$f":"IF(ROWS(E$76:E87)>E$75,\"\",INDEX($A$3:$A$70,SMALL(IF(E$3:E$70=\"\",ROW(E$3:E$70)-ROW(E$3)+1),ROWS(E$76:E87))))","v":"Student 22"},{"$f":"IF(ROWS(F$76:F87)>F$75,\"\",INDEX($A$3:$A$70,SMALL(IF(F$3:F$70=\"\",ROW(F$3:F$70)-ROW(F$3)+1),ROWS(F$76:F87))))","v":"Student 14"},{"$f":"IF(ROWS(G$76:G87)>G$75,\"\",INDEX($A$3:$A$70,SMALL(IF(G$3:G$70=\"\",ROW(G$3:G$70)-ROW(G$3)+1),ROWS(G$76:G87))))","v":"Student 13"},{"$f":"IF(ROWS(H$76:H87)>H$75,\"\",INDEX($A$3:$A$70,SMALL(IF(H$3:H$70=\"\",ROW(H$3:H$70)-ROW(H$3)+1),ROWS(H$76:H87))))","v":"Student 12"},{"$f":"IF(ROWS(I$76:I87)>I$75,\"\",INDEX($A$3:$A$70,SMALL(IF(I$3:I$70=\"\",ROW(I$3:I$70)-ROW(I$3)+1),ROWS(I$76:I87))))","v":"Student 12"},{"$f":"IF(ROWS(J$76:J87)>J$75,\"\",INDEX($A$3:$A$70,SMALL(IF(J$3:J$70=\"\",ROW(J$3:J$70)-ROW(J$3)+1),ROWS(J$76:J87))))","v":"Student 28"},{"$f":"IF(ROWS(K$76:K87)>K$75,\"\",INDEX($A$3:$A$70,SMALL(IF(K$3:K$70=\"\",ROW(K$3:K$70)-ROW(K$3)+1),ROWS(K$76:K87))))","v":""}]
[{"$f":"\"#\"&ROWS(A$76:A88)","v":"#13"},{"$f":"IF(ROWS(B$76:B88)>B$75,\"\",INDEX($A$3:$A$70,SMALL(IF(B$3:B$70=\"\",ROW(B$3:B$70)-ROW(B$3)+1),ROWS(B$76:B88))))","v":"Student 49"},{"$f":"IF(ROWS(C$76:C88)>C$75,\"\",INDEX($A$3:$A$70,SMALL(IF(C$3:C$70=\"\",ROW(C$3:C$70)-ROW(C$3)+1),ROWS(C$76:C88))))","v":"Student 52"},{"$f":"IF(ROWS(D$76:D88)>D$75,\"\",INDEX($A$3:$A$70,SMALL(IF(D$3:D$70=\"\",ROW(D$3:D$70)-ROW(D$3)+1),ROWS(D$76:D88))))","v":"Student 49"},{"$f":"IF(ROWS(E$76:E88)>E$75,\"\",INDEX($A$3:$A$70,SMALL(IF(E$3:E$70=\"\",ROW(E$3:E$70)-ROW(E$3)+1),ROWS(E$76:E88))))","v":"Student 23"},{"$f":"IF(ROWS(F$76:F88)>F$75,\"\",INDEX($A$3:$A$70,SMALL(IF(F$3:F$70=\"\",ROW(F$3:F$70)-ROW(F$3)+1),ROWS(F$76:F88))))","v":"Student 15"},{"$f":"IF(ROWS(G$76:G88)>G$75,\"\",INDEX($A$3:$A$70,SMALL(IF(G$3:G$70=\"\",ROW(G$3:G$70)-ROW(G$3)+1),ROWS(G$76:G88))))","v":"Student 14"},{"$f":"IF(ROWS(H$76:H88)>H$75,\"\",INDEX($A$3:$A$70,SMALL(IF(H$3:H$70=\"\",ROW(H$3:H$70)-ROW(H$3)+1),ROWS(H$76:H88))))","v":"Student 13"},{"$f":"IF(ROWS(I$76:I88)>I$75,\"\",INDEX($A$3:$A$70,SMALL(IF(I$3:I$70=\"\",ROW(I$3:I$70)-ROW(I$3)+1),ROWS(I$76:I88))))","v":"Student 13"},{"$f":"IF(ROWS(J$76:J88)>J$75,\"\",INDEX($A$3:$A$70,SMALL(IF(J$3:J$70=\"\",ROW(J$3:J$70)-ROW(J$3)+1),ROWS(J$76:J88))))","v":"Student 32"},{"$f":"IF(ROWS(K$76:K88)>K$75,\"\",INDEX($A$3:$A$70,SMALL(IF(K$3:K$70=\"\",ROW(K$3:K$70)-ROW(K$3)+1),ROWS(K$76:K88))))","v":""}]
[{"$f":"\"#\"&ROWS(A$76:A89)","v":"#14"},{"$f":"IF(ROWS(B$76:B89)>B$75,\"\",INDEX($A$3:$A$70,SMALL(IF(B$3:B$70=\"\",ROW(B$3:B$70)-ROW(B$3)+1),ROWS(B$76:B89))))","v":"Student 59"},{"$f":"IF(ROWS(C$76:C89)>C$75,\"\",INDEX($A$3:$A$70,SMALL(IF(C$3:C$70=\"\",ROW(C$3:C$70)-ROW(C$3)+1),ROWS(C$76:C89))))","v":"Student 54"},{"$f":"IF(ROWS(D$76:D89)>D$75,\"\",INDEX($A$3:$A$70,SMALL(IF(D$3:D$70=\"\",ROW(D$3:D$70)-ROW(D$3)+1),ROWS(D$76:D89))))","v":"Student 54"},{"$f":"IF(ROWS(E$76:E89)>E$75,\"\",INDEX($A$3:$A$70,SMALL(IF(E$3:E$70=\"\",ROW(E$3:E$70)-ROW(E$3)+1),ROWS(E$76:E89))))","v":"Student 27"},{"$f":"IF(ROWS(F$76:F89)>F$75,\"\",INDEX($A$3:$A$70,SMALL(IF(F$3:F$70=\"\",ROW(F$3:F$70)-ROW(F$3)+1),ROWS(F$76:F89))))","v":"Student 16"},{"$f":"IF(ROWS(G$76:G89)>G$75,\"\",INDEX($A$3:$A$70,SMALL(IF(G$3:G$70=\"\",ROW(G$3:G$70)-ROW(G$3)+1),ROWS(G$76:G89))))","v":"Student 15"},{"$f":"IF(ROWS(H$76:H89)>H$75,\"\",INDEX($A$3:$A$70,SMALL(IF(H$3:H$70=\"\",ROW(H$3:H$70)-ROW(H$3)+1),ROWS(H$76:H89))))","v":"Student 14"},{"$f":"IF(ROWS(I$76:I89)>I$75,\"\",INDEX($A$3:$A$70,SMALL(IF(I$3:I$70=\"\",ROW(I$3:I$70)-ROW(I$3)+1),ROWS(I$76:I89))))","v":"Student 14"},{"$f":"IF(ROWS(J$76:J89)>J$75,\"\",INDEX($A$3:$A$70,SMALL(IF(J$3:J$70=\"\",ROW(J$3:J$70)-ROW(J$3)+1),ROWS(J$76:J89))))","v":"Student 33"},{"$f":"IF(ROWS(K$76:K89)>K$75,\"\",INDEX($A$3:$A$70,SMALL(IF(K$3:K$70=\"\",ROW(K$3:K$70)-ROW(K$3)+1),ROWS(K$76:K89))))","v":""}]
[{"$f":"\"#\"&ROWS(A$76:A90)","v":"#15"},{"$f":"IF(ROWS(B$76:B90)>B$75,\"\",INDEX($A$3:$A$70,SMALL(IF(B$3:B$70=\"\",ROW(B$3:B$70)-ROW(B$3)+1),ROWS(B$76:B90))))","v":"Student 61"},{"$f":"IF(ROWS(C$76:C90)>C$75,\"\",INDEX($A$3:$A$70,SMALL(IF(C$3:C$70=\"\",ROW(C$3:C$70)-ROW(C$3)+1),ROWS(C$76:C90))))","v":"Student 59"},{"$f":"IF(ROWS(D$76:D90)>D$75,\"\",INDEX($A$3:$A$70,SMALL(IF(D$3:D$70=\"\",ROW(D$3:D$70)-ROW(D$3)+1),ROWS(D$76:D90))))","v":"Student 57"},{"$f":"IF(ROWS(E$76:E90)>E$75,\"\",INDEX($A$3:$A$70,SMALL(IF(E$3:E$70=\"\",ROW(E$3:E$70)-ROW(E$3)+1),ROWS(E$76:E90))))","v":"Student 28"},{"$f":"IF(ROWS(F$76:F90)>F$75,\"\",INDEX($A$3:$A$70,SMALL(IF(F$3:F$70=\"\",ROW(F$3:F$70)-ROW(F$3)+1),ROWS(F$76:F90))))","v":"Student 17"},{"$f":"IF(ROWS(G$76:G90)>G$75,\"\",INDEX($A$3:$A$70,SMALL(IF(G$3:G$70=\"\",ROW(G$3:G$70)-ROW(G$3)+1),ROWS(G$76:G90))))","v":"Student 16"},{"$f":"IF(ROWS(H$76:H90)>H$75,\"\",INDEX($A$3:$A$70,SMALL(IF(H$3:H$70=\"\",ROW(H$3:H$70)-ROW(H$3)+1),ROWS(H$76:H90))))","v":"Student 15"},{"$f":"IF(ROWS(I$76:I90)>I$75,\"\",INDEX($A$3:$A$70,SMALL(IF(I$3:I$70=\"\",ROW(I$3:I$70)-ROW(I$3)+1),ROWS(I$76:I90))))","v":"Student 15"},{"$f":"IF(ROWS(J$76:J90)>J$75,\"\",INDEX($A$3:$A$70,SMALL(IF(J$3:J$70=\"\",ROW(J$3:J$70)-ROW(J$3)+1),ROWS(J$76:J90))))","v":"Student 34"},{"$f":"IF(ROWS(K$76:K90)>K$75,\"\",INDEX($A$3:$A$70,SMALL(IF(K$3:K$70=\"\",ROW(K$3:K$70)-ROW(K$3)+1),ROWS(K$76:K90))))","v":""}]
[{"$f":"\"#\"&ROWS(A$76:A91)","v":"#16"},{"$f":"IF(ROWS(B$76:B91)>B$75,\"\",INDEX($A$3:$A$70,SMALL(IF(B$3:B$70=\"\",ROW(B$3:B$70)-ROW(B$3)+1),ROWS(B$76:B91))))","v":"Student 64"},{"$f":"IF(ROWS(C$76:C91)>C$75,\"\",INDEX($A$3:$A$70,SMALL(IF(C$3:C$70=\"\",ROW(C$3:C$70)-ROW(C$3)+1),ROWS(C$76:C91))))","v":""},{"$f":"IF(ROWS(D$76:D91)>D$75,\"\",INDEX($A$3:$A$70,SMALL(IF(D$3:D$70=\"\",ROW(D$3:D$70)-ROW(D$3)+1),ROWS(D$76:D91))))","v":"Student 67"},{"$f":"IF(ROWS(E$76:E91)>E$75,\"\",INDEX($A$3:$A$70,SMALL(IF(E$3:E$70=\"\",ROW(E$3:E$70)-ROW(E$3)+1),ROWS(E$76:E91))))","v":"Student 29"},{"$f":"IF(ROWS(F$76:F91)>F$75,\"\",INDEX($A$3:$A$70,SMALL(IF(F$3:F$70=\"\",ROW(F$3:F$70)-ROW(F$3)+1),ROWS(F$76:F91))))","v":"Student 18"},{"$f":"IF(ROWS(G$76:G91)>G$75,\"\",INDEX($A$3:$A$70,SMALL(IF(G$3:G$70=\"\",ROW(G$3:G$70)-ROW(G$3)+1),ROWS(G$76:G91))))","v":"Student 17"},{"$f":"IF(ROWS(H$76:H91)>H$75,\"\",INDEX($A$3:$A$70,SMALL(IF(H$3:H$70=\"\",ROW(H$3:H$70)-ROW(H$3)+1),ROWS(H$76:H91))))","v":"Student 16"},{"$f":"IF(ROWS(I$76:I91)>I$75,\"\",INDEX($A$3:$A$70,SMALL(IF(I$3:I$70=\"\",ROW(I$3:I$70)-ROW(I$3)+1),ROWS(I$76:I91))))","v":"Student 16"},{"$f":"IF(ROWS(J$76:J91)>J$75,\"\",INDEX($A$3:$A$70,SMALL(IF(J$3:J$70=\"\",ROW(J$3:J$70)-ROW(J$3)+1),ROWS(J$76:J91))))","v":"Student 35"},{"$f":"IF(ROWS(K$76:K91)>K$75,\"\",INDEX($A$3:$A$70,SMALL(IF(K$3:K$70=\"\",ROW(K$3:K$70)-ROW(K$3)+1),ROWS(K$76:K91))))","v":""}]
[{"$f":"\"#\"&ROWS(A$76:A92)","v":"#17"},{"$f":"IF(ROWS(B$76:B92)>B$75,\"\",INDEX($A$3:$A$70,SMALL(IF(B$3:B$70=\"\",ROW(B$3:B$70)-ROW(B$3)+1),ROWS(B$76:B92))))","v":""},{"$f":"IF(ROWS(C$76:C92)>C$75,\"\",INDEX($A$3:$A$70,SMALL(IF(C$3:C$70=\"\",ROW(C$3:C$70)-ROW(C$3)+1),ROWS(C$76:C92))))","v":""},{"$f":"IF(ROWS(D$76:D92)>D$75,\"\",INDEX($A$3:$A$70,SMALL(IF(D$3:D$70=\"\",ROW(D$3:D$70)-ROW(D$3)+1),ROWS(D$76:D92))))","v":""},{"$f":"IF(ROWS(E$76:E92)>E$75,\"\",INDEX($A$3:$A$70,SMALL(IF(E$3:E$70=\"\",ROW(E$3:E$70)-ROW(E$3)+1),ROWS(E$76:E92))))","v":"Student 31"},{"$f":"IF(ROWS(F$76:F92)>F$75,\"\",INDEX($A$3:$A$70,SMALL(IF(F$3:F$70=\"\",ROW(F$3:F$70)-ROW(F$3)+1),ROWS(F$76:F92))))","v":"Student 19"},{"$f":"IF(ROWS(G$76:G92)>G$75,\"\",INDEX($A$3:$A$70,SMALL(IF(G$3:G$70=\"\",ROW(G$3:G$70)-ROW(G$3)+1),ROWS(G$76:G92))))","v":"Student 19"},{"$f":"IF(ROWS(H$76:H92)>H$75,\"\",INDEX($A$3:$A$70,SMALL(IF(H$3:H$70=\"\",ROW(H$3:H$70)-ROW(H$3)+1),ROWS(H$76:H92))))","v":"Student 17"},{"$f":"IF(ROWS(I$76:I92)>I$75,\"\",INDEX($A$3:$A$70,SMALL(IF(I$3:I$70=\"\",ROW(I$3:I$70)-ROW(I$3)+1),ROWS(I$76:I92))))","v":"Student 17"},{"$f":"IF(ROWS(J$76:J92)>J$75,\"\",INDEX($A$3:$A$70,SMALL(IF(J$3:J$70=\"\",ROW(J$3:J$70)-ROW(J$3)+1),ROWS(J$76:J92))))","v":"Student 36"},{"$f":"IF(ROWS(K$76:K92)>K$75,\"\",INDEX($A$3:$A$70,SMALL(IF(K$3:K$70=\"\",ROW(K$3:K$70)-ROW(K$3)+1),ROWS(K$76:K92))))","v":""}]
[{"$f":"\"#\"&ROWS(A$76:A93)","v":"#18"},{"$f":"IF(ROWS(B$76:B93)>B$75,\"\",INDEX($A$3:$A$70,SMALL(IF(B$3:B$70=\"\",ROW(B$3:B$70)-ROW(B$3)+1),ROWS(B$76:B93))))","v":""},{"$f":"IF(ROWS(C$76:C93)>C$75,\"\",INDEX($A$3:$A$70,SMALL(IF(C$3:C$70=\"\",ROW(C$3:C$70)-ROW(C$3)+1),ROWS(C$76:C93))))","v":""},{"$f":"IF(ROWS(D$76:D93)>D$75,\"\",INDEX($A$3:$A$70,SMALL(IF(D$3:D$70=\"\",ROW(D$3:D$70)-ROW(D$3)+1),ROWS(D$76:D93))))","v":""},{"$f":"IF(ROWS(E$76:E93)>E$75,\"\",INDEX($A$3:$A$70,SMALL(IF(E$3:E$70=\"\",ROW(E$3:E$70)-ROW(E$3)+1),ROWS(E$76:E93))))","v":"Student 32"},{"$f":"IF(ROWS(F$76:F93)>F$75,\"\",INDEX($A$3:$A$70,SMALL(IF(F$3:F$70=\"\",ROW(F$3:F$70)-ROW(F$3)+1),ROWS(F$76:F93))))","v":"Student 20"},{"$f":"IF(ROWS(G$76:G93)>G$75,\"\",INDEX($A$3:$A$70,SMALL(IF(G$3:G$70=\"\",ROW(G$3:G$70)-ROW(G$3)+1),ROWS(G$76:G93))))","v":"Student 21"},{"$f":"IF(ROWS(H$76:H93)>H$75,\"\",INDEX($A$3:$A$70,SMALL(IF(H$3:H$70=\"\",ROW(H$3:H$70)-ROW(H$3)+1),ROWS(H$76:H93))))","v":"Student 18"},{"$f":"IF(ROWS(I$76:I93)>I$75,\"\",INDEX($A$3:$A$70,SMALL(IF(I$3:I$70=\"\",ROW(I$3:I$70)-ROW(I$3)+1),ROWS(I$76:I93))))","v":"Student 18"},{"$f":"IF(ROWS(J$76:J93)>J$75,\"\",INDEX($A$3:$A$70,SMALL(IF(J$3:J$70=\"\",ROW(J$3:J$70)-ROW(J$3)+1),ROWS(J$76:J93))))","v":"Student 38"},{"$f":"IF(ROWS(K$76:K93)>K$75,\"\",INDEX($A$3:$A$70,SMALL(IF(K$3:K$70=\"\",ROW(K$3:K$70)-ROW(K$3)+1),ROWS(K$76:K93))))","v":""}]
[{"$f":"\"#\"&ROWS(A$76:A94)","v":"#19"},{"$f":"IF(ROWS(B$76:B94)>B$75,\"\",INDEX($A$3:$A$70,SMALL(IF(B$3:B$70=\"\",ROW(B$3:B$70)-ROW(B$3)+1),ROWS(B$76:B94))))","v":""},{"$f":"IF(ROWS(C$76:C94)>C$75,\"\",INDEX($A$3:$A$70,SMALL(IF(C$3:C$70=\"\",ROW(C$3:C$70)-ROW(C$3)+1),ROWS(C$76:C94))))","v":""},{"$f":"IF(ROWS(D$76:D94)>D$75,\"\",INDEX($A$3:$A$70,SMALL(IF(D$3:D$70=\"\",ROW(D$3:D$70)-ROW(D$3)+1),ROWS(D$76:D94))))","v":""},{"$f":"IF(ROWS(E$76:E94)>E$75,\"\",INDEX($A$3:$A$70,SMALL(IF(E$3:E$70=\"\",ROW(E$3:E$70)-ROW(E$3)+1),ROWS(E$76:E94))))","v":"Student 34"},{"$f":"IF(ROWS(F$76:F94)>F$75,\"\",INDEX($A$3:$A$70,SMALL(IF(F$3:F$70=\"\",ROW(F$3:F$70)-ROW(F$3)+1),ROWS(F$76:F94))))","v":"Student 21"},{"$f":"IF(ROWS(G$76:G94)>G$75,\"\",INDEX($A$3:$A$70,SMALL(IF(G$3:G$70=\"\",ROW(G$3:G$70)-ROW(G$3)+1),ROWS(G$76:G94))))","v":"Student 22"},{"$f":"IF(ROWS(H$76:H94)>H$75,\"\",INDEX($A$3:$A$70,SMALL(IF(H$3:H$70=\"\",ROW(H$3:H$70)-ROW(H$3)+1),ROWS(H$76:H94))))","v":"Student 19"},{"$f":"IF(ROWS(I$76:I94)>I$75,\"\",INDEX($A$3:$A$70,SMALL(IF(I$3:I$70=\"\",ROW(I$3:I$70)-ROW(I$3)+1),ROWS(I$76:I94))))","v":"Student 19"},{"$f":"IF(ROWS(J$76:J94)>J$75,\"\",INDEX($A$3:$A$70,SMALL(IF(J$3:J$70=\"\",ROW(J$3:J$70)-ROW(J$3)+1),ROWS(J$76:J94))))","v":"Student 40"},{"$f":"IF(ROWS(K$76:K94)>K$75,\"\",INDEX($A$3:$A$70,SMALL(IF(K$3:K$70=\"\",ROW(K$3:K$70)-ROW(K$3)+1),ROWS(K$76:K94))))","v":""}]
[{"$f":"\"#\"&ROWS(A$76:A95)","v":"#20"},{"$f":"IF(ROWS(B$76:B95)>B$75,\"\",INDEX($A$3:$A$70,SMALL(IF(B$3:B$70=\"\",ROW(B$3:B$70)-ROW(B$3)+1),ROWS(B$76:B95))))","v":""},{"$f":"IF(ROWS(C$76:C95)>C$75,\"\",INDEX($A$3:$A$70,SMALL(IF(C$3:C$70=\"\",ROW(C$3:C$70)-ROW(C$3)+1),ROWS(C$76:C95))))","v":""},{"$f":"IF(ROWS(D$76:D95)>D$75,\"\",INDEX($A$3:$A$70,SMALL(IF(D$3:D$70=\"\",ROW(D$3:D$70)-ROW(D$3)+1),ROWS(D$76:D95))))","v":""},{"$f":"IF(ROWS(E$76:E95)>E$75,\"\",INDEX($A$3:$A$70,SMALL(IF(E$3:E$70=\"\",ROW(E$3:E$70)-ROW(E$3)+1),ROWS(E$76:E95))))","v":"Student 38"},{"$f":"IF(ROWS(F$76:F95)>F$75,\"\",INDEX($A$3:$A$70,SMALL(IF(F$3:F$70=\"\",ROW(F$3:F$70)-ROW(F$3)+1),ROWS(F$76:F95))))","v":"Student 23"},{"$f":"IF(ROWS(G$76:G95)>G$75,\"\",INDEX($A$3:$A$70,SMALL(IF(G$3:G$70=\"\",ROW(G$3:G$70)-ROW(G$3)+1),ROWS(G$76:G95))))","v":"Student 23"},{"$f":"IF(ROWS(H$76:H95)>H$75,\"\",INDEX($A$3:$A$70,SMALL(IF(H$3:H$70=\"\",ROW(H$3:H$70)-ROW(H$3)+1),ROWS(H$76:H95))))","v":"Student 20"},{"$f":"IF(ROWS(I$76:I95)>I$75,\"\",INDEX($A$3:$A$70,SMALL(IF(I$3:I$70=\"\",ROW(I$3:I$70)-ROW(I$3)+1),ROWS(I$76:I95))))","v":"Student 20"},{"$f":"IF(ROWS(J$76:J95)>J$75,\"\",INDEX($A$3:$A$70,SMALL(IF(J$3:J$70=\"\",ROW(J$3:J$70)-ROW(J$3)+1),ROWS(J$76:J95))))","v":"Student 41"},{"$f":"IF(ROWS(K$76:K95)>K$75,\"\",INDEX($A$3:$A$70,SMALL(IF(K$3:K$70=\"\",ROW(K$3:K$70)-ROW(K$3)+1),ROWS(K$76:K95))))","v":""}]
[{"$f":"\"#\"&ROWS(A$76:A96)","v":"#21"},{"$f":"IF(ROWS(B$76:B96)>B$75,\"\",INDEX($A$3:$A$70,SMALL(IF(B$3:B$70=\"\",ROW(B$3:B$70)-ROW(B$3)+1),ROWS(B$76:B96))))","v":""},{"$f":"IF(ROWS(C$76:C96)>C$75,\"\",INDEX($A$3:$A$70,SMALL(IF(C$3:C$70=\"\",ROW(C$3:C$70)-ROW(C$3)+1),ROWS(C$76:C96))))","v":""},{"$f":"IF(ROWS(D$76:D96)>D$75,\"\",INDEX($A$3:$A$70,SMALL(IF(D$3:D$70=\"\",ROW(D$3:D$70)-ROW(D$3)+1),ROWS(D$76:D96))))","v":""},{"$f":"IF(ROWS(E$76:E96)>E$75,\"\",INDEX($A$3:$A$70,SMALL(IF(E$3:E$70=\"\",ROW(E$3:E$70)-ROW(E$3)+1),ROWS(E$76:E96))))","v":"Student 43"},{"$f":"IF(ROWS(F$76:F96)>F$75,\"\",INDEX($A$3:$A$70,SMALL(IF(F$3:F$70=\"\",ROW(F$3:F$70)-ROW(F$3)+1),ROWS(F$76:F96))))","v":"Student 24"},{"$f":"IF(ROWS(G$76:G96)>G$75,\"\",INDEX($A$3:$A$70,SMALL(IF(G$3:G$70=\"\",ROW(G$3:G$70)-ROW(G$3)+1),ROWS(G$76:G96))))","v":"Student 24"},{"$f":"IF(ROWS(H$76:H96)>H$75,\"\",INDEX($A$3:$A$70,SMALL(IF(H$3:H$70=\"\",ROW(H$3:H$70)-ROW(H$3)+1),ROWS(H$76:H96))))","v":"Student 21"},{"$f":"IF(ROWS(I$76:I96)>I$75,\"\",INDEX($A$3:$A$70,SMALL(IF(I$3:I$70=\"\",ROW(I$3:I$70)-ROW(I$3)+1),ROWS(I$76:I96))))","v":"Student 21"},{"$f":"IF(ROWS(J$76:J96)>J$75,\"\",INDEX($A$3:$A$70,SMALL(IF(J$3:J$70=\"\",ROW(J$3:J$70)-ROW(J$3)+1),ROWS(J$76:J96))))","v":"Student 42"},{"$f":"IF(ROWS(K$76:K96)>K$75,\"\",INDEX($A$3:$A$70,SMALL(IF(K$3:K$70=\"\",ROW(K$3:K$70)-ROW(K$3)+1),ROWS(K$76:K96))))","v":""}]
[{"$f":"\"#\"&ROWS(A$76:A97)","v":"#22"},{"$f":"IF(ROWS(B$76:B97)>B$75,\"\",INDEX($A$3:$A$70,SMALL(IF(B$3:B$70=\"\",ROW(B$3:B$70)-ROW(B$3)+1),ROWS(B$76:B97))))","v":""},{"$f":"IF(ROWS(C$76:C97)>C$75,\"\",INDEX($A$3:$A$70,SMALL(IF(C$3:C$70=\"\",ROW(C$3:C$70)-ROW(C$3)+1),ROWS(C$76:C97))))","v":""},{"$f":"IF(ROWS(D$76:D97)>D$75,\"\",INDEX($A$3:$A$70,SMALL(IF(D$3:D$70=\"\",ROW(D$3:D$70)-ROW(D$3)+1),ROWS(D$76:D97))))","v":""},{"$f":"IF(ROWS(E$76:E97)>E$75,\"\",INDEX($A$3:$A$70,SMALL(IF(E$3:E$70=\"\",ROW(E$3:E$70)-ROW(E$3)+1),ROWS(E$76:E97))))","v":"Student 44"},{"$f":"IF(ROWS(F$76:F97)>F$75,\"\",INDEX($A$3:$A$70,SMALL(IF(F$3:F$70=\"\",ROW(F$3:F$70)-ROW(F$3)+1),ROWS(F$76:F97))))","v":"Student 25"},{"$f":"IF(ROWS(G$76:G97)>G$75,\"\",INDEX($A$3:$A$70,SMALL(IF(G$3:G$70=\"\",ROW(G$3:G$70)-ROW(G$3)+1),ROWS(G$76:G97))))","v":"Student 25"},{"$f":"IF(ROWS(H$76:H97)>H$75,\"\",INDEX($A$3:$A$70,SMALL(IF(H$3:H$70=\"\",ROW(H$3:H$70)-ROW(H$3)+1),ROWS(H$76:H97))))","v":"Student 22"},{"$f":"IF(ROWS(I$76:I97)>I$75,\"\",INDEX($A$3:$A$70,SMALL(IF(I$3:I$70=\"\",ROW(I$3:I$70)-ROW(I$3)+1),ROWS(I$76:I97))))","v":"Student 22"},{"$f":"IF(ROWS(J$76:J97)>J$75,\"\",INDEX($A$3:$A$70,SMALL(IF(J$3:J$70=\"\",ROW(J$3:J$70)-ROW(J$3)+1),ROWS(J$76:J97))))","v":"Student 44"},{"$f":"IF(ROWS(K$76:K97)>K$75,\"\",INDEX($A$3:$A$70,SMALL(IF(K$3:K$70=\"\",ROW(K$3:K$70)-ROW(K$3)+1),ROWS(K$76:K97))))","v":""}]
[{"$f":"\"#\"&ROWS(A$76:A98)","v":"#23"},{"$f":"IF(ROWS(B$76:B98)>B$75,\"\",INDEX($A$3:$A$70,SMALL(IF(B$3:B$70=\"\",ROW(B$3:B$70)-ROW(B$3)+1),ROWS(B$76:B98))))","v":""},{"$f":"IF(ROWS(C$76:C98)>C$75,\"\",INDEX($A$3:$A$70,SMALL(IF(C$3:C$70=\"\",ROW(C$3:C$70)-ROW(C$3)+1),ROWS(C$76:C98))))","v":""},{"$f":"IF(ROWS(D$76:D98)>D$75,\"\",INDEX($A$3:$A$70,SMALL(IF(D$3:D$70=\"\",ROW(D$3:D$70)-ROW(D$3)+1),ROWS(D$76:D98))))","v":""},{"$f":"IF(ROWS(E$76:E98)>E$75,\"\",INDEX($A$3:$A$70,SMALL(IF(E$3:E$70=\"\",ROW(E$3:E$70)-ROW(E$3)+1),ROWS(E$76:E98))))","v":"Student 47"},{"$f":"IF(ROWS(F$76:F98)>F$75,\"\",INDEX($A$3:$A$70,SMALL(IF(F$3:F$70=\"\",ROW(F$3:F$70)-ROW(F$3)+1),ROWS(F$76:F98))))","v":"Student 26"},{"$f":"IF(ROWS(G$76:G98)>G$75,\"\",INDEX($A$3:$A$70,SMALL(IF(G$3:G$70=\"\",ROW(G$3:G$70)-ROW(G$3)+1),ROWS(G$76:G98))))","v":"Student 27"},{"$f":"IF(ROWS(H$76:H98)>H$75,\"\",INDEX($A$3:$A$70,SMALL(IF(H$3:H$70=\"\",ROW(H$3:H$70)-ROW(H$3)+1),ROWS(H$76:H98))))","v":"Student 23"},{"$f":"IF(ROWS(I$76:I98)>I$75,\"\",INDEX($A$3:$A$70,SMALL(IF(I$3:I$70=\"\",ROW(I$3:I$70)-ROW(I$3)+1),ROWS(I$76:I98))))","v":"Student 23"},{"$f":"IF(ROWS(J$76:J98)>J$75,\"\",INDEX($A$3:$A$70,SMALL(IF(J$3:J$70=\"\",ROW(J$3:J$70)-ROW(J$3)+1),ROWS(J$76:J98))))","v":"Student 46"},{"$f":"IF(ROWS(K$76:K98)>K$75,\"\",INDEX($A$3:$A$70,SMALL(IF(K$3:K$70=\"\",ROW(K$3:K$70)-ROW(K$3)+1),ROWS(K$76:K98))))","v":""}]
[{"$f":"\"#\"&ROWS(A$76:A99)","v":"#24"},{"$f":"IF(ROWS(B$76:B99)>B$75,\"\",INDEX($A$3:$A$70,SMALL(IF(B$3:B$70=\"\",ROW(B$3:B$70)-ROW(B$3)+1),ROWS(B$76:B99))))","v":""},{"$f":"IF(ROWS(C$76:C99)>C$75,\"\",INDEX($A$3:$A$70,SMALL(IF(C$3:C$70=\"\",ROW(C$3:C$70)-ROW(C$3)+1),ROWS(C$76:C99))))","v":""},{"$f":"IF(ROWS(D$76:D99)>D$75,\"\",INDEX($A$3:$A$70,SMALL(IF(D$3:D$70=\"\",ROW(D$3:D$70)-ROW(D$3)+1),ROWS(D$76:D99))))","v":""},{"$f":"IF(ROWS(E$76:E99)>E$75,\"\",INDEX($A$3:$A$70,SMALL(IF(E$3:E$70=\"\",ROW(E$3:E$70)-ROW(E$3)+1),ROWS(E$76:E99))))","v":"Student 55"},{"$f":"IF(ROWS(F$76:F99)>F$75,\"\",INDEX($A$3:$A$70,SMALL(IF(F$3:F$70=\"\",ROW(F$3:F$70)-ROW(F$3)+1),ROWS(F$76:F99))))","v":"Student 30"},{"$f":"IF(ROWS(G$76:G99)>G$75,\"\",INDEX($A$3:$A$70,SMALL(IF(G$3:G$70=\"\",ROW(G$3:G$70)-ROW(G$3)+1),ROWS(G$76:G99))))","v":"Student 28"},{"$f":"IF(ROWS(H$76:H99)>H$75,\"\",INDEX($A$3:$A$70,SMALL(IF(H$3:H$70=\"\",ROW(H$3:H$70)-ROW(H$3)+1),ROWS(H$76:H99))))","v":"Student 24"},{"$f":"IF(ROWS(I$76:I99)>I$75,\"\",INDEX($A$3:$A$70,SMALL(IF(I$3:I$70=\"\",ROW(I$3:I$70)-ROW(I$3)+1),ROWS(I$76:I99))))","v":"Student 24"},{"$f":"IF(ROWS(J$76:J99)>J$75,\"\",INDEX($A$3:$A$70,SMALL(IF(J$3:J$70=\"\",ROW(J$3:J$70)-ROW(J$3)+1),ROWS(J$76:J99))))","v":"Student 47"},{"$f":"IF(ROWS(K$76:K99)>K$75,\"\",INDEX($A$3:$A$70,SMALL(IF(K$3:K$70=\"\",ROW(K$3:K$70)-ROW(K$3)+1),ROWS(K$76:K99))))","v":""}]
[{"$f":"\"#\"&ROWS(A$76:A100)","v":"#25"},{"$f":"IF(ROWS(B$76:B100)>B$75,\"\",INDEX($A$3:$A$70,SMALL(IF(B$3:B$70=\"\",ROW(B$3:B$70)-ROW(B$3)+1),ROWS(B$76:B100))))","v":""},{"$f":"IF(ROWS(C$76:C100)>C$75,\"\",INDEX($A$3:$A$70,SMALL(IF(C$3:C$70=\"\",ROW(C$3:C$70)-ROW(C$3)+1),ROWS(C$76:C100))))","v":""},{"$f":"IF(ROWS(D$76:D100)>D$75,\"\",INDEX($A$3:$A$70,SMALL(IF(D$3:D$70=\"\",ROW(D$3:D$70)-ROW(D$3)+1),ROWS(D$76:D100))))","v":""},{"$f":"IF(ROWS(E$76:E100)>E$75,\"\",INDEX($A$3:$A$70,SMALL(IF(E$3:E$70=\"\",ROW(E$3:E$70)-ROW(E$3)+1),ROWS(E$76:E100))))","v":"Student 56"},{"$f":"IF(ROWS(F$76:F100)>F$75,\"\",INDEX($A$3:$A$70,SMALL(IF(F$3:F$70=\"\",ROW(F$3:F$70)-ROW(F$3)+1),ROWS(F$76:F100))))","v":"Student 31"},{"$f":"IF(ROWS(G$76:G100)>G$75,\"\",INDEX($A$3:$A$70,SMALL(IF(G$3:G$70=\"\",ROW(G$3:G$70)-ROW(G$3)+1),ROWS(G$76:G100))))","v":"Student 29"},{"$f":"IF(ROWS(H$76:H100)>H$75,\"\",INDEX($A$3:$A$70,SMALL(IF(H$3:H$70=\"\",ROW(H$3:H$70)-ROW(H$3)+1),ROWS(H$76:H100))))","v":"Student 25"},{"$f":"IF(ROWS(I$76:I100)>I$75,\"\",INDEX($A$3:$A$70,SMALL(IF(I$3:I$70=\"\",ROW(I$3:I$70)-ROW(I$3)+1),ROWS(I$76:I100))))","v":"Student 25"},{"$f":"IF(ROWS(J$76:J100)>J$75,\"\",INDEX($A$3:$A$70,SMALL(IF(J$3:J$70=\"\",ROW(J$3:J$70)-ROW(J$3)+1),ROWS(J$76:J100))))","v":"Student 52"},{"$f":"IF(ROWS(K$76:K100)>K$75,\"\",INDEX($A$3:$A$70,SMALL(IF(K$3:K$70=\"\",ROW(K$3:K$70)-ROW(K$3)+1),ROWS(K$76:K100))))","v":""}]
[{"$f":"\"#\"&ROWS(A$76:A101)","v":"#26"},{"$f":"IF(ROWS(B$76:B101)>B$75,\"\",INDEX($A$3:$A$70,SMALL(IF(B$3:B$70=\"\",ROW(B$3:B$70)-ROW(B$3)+1),ROWS(B$76:B101))))","v":""},{"$f":"IF(ROWS(C$76:C101)>C$75,\"\",INDEX($A$3:$A$70,SMALL(IF(C$3:C$70=\"\",ROW(C$3:C$70)-ROW(C$3)+1),ROWS(C$76:C101))))","v":""},{"$f":"IF(ROWS(D$76:D101)>D$75,\"\",INDEX($A$3:$A$70,SMALL(IF(D$3:D$70=\"\",ROW(D$3:D$70)-ROW(D$3)+1),ROWS(D$76:D101))))","v":""},{"$f":"IF(ROWS(E$76:E101)>E$75,\"\",INDEX($A$3:$A$70,SMALL(IF(E$3:E$70=\"\",ROW(E$3:E$70)-ROW(E$3)+1),ROWS(E$76:E101))))","v":"Student 58"},{"$f":"IF(ROWS(F$76:F101)>F$75,\"\",INDEX($A$3:$A$70,SMALL(IF(F$3:F$70=\"\",ROW(F$3:F$70)-ROW(F$3)+1),ROWS(F$76:F101))))","v":"Student 32"},{"$f":"IF(ROWS(G$76:G101)>G$75,\"\",INDEX($A$3:$A$70,SMALL(IF(G$3:G$70=\"\",ROW(G$3:G$70)-ROW(G$3)+1),ROWS(G$76:G101))))","v":"Student 30"},{"$f":"IF(ROWS(H$76:H101)>H$75,\"\",INDEX($A$3:$A$70,SMALL(IF(H$3:H$70=\"\",ROW(H$3:H$70)-ROW(H$3)+1),ROWS(H$76:H101))))","v":"Student 26"},{"$f":"IF(ROWS(I$76:I101)>I$75,\"\",INDEX($A$3:$A$70,SMALL(IF(I$3:I$70=\"\",ROW(I$3:I$70)-ROW(I$3)+1),ROWS(I$76:I101))))","v":"Student 26"},{"$f":"IF(ROWS(J$76:J101)>J$75,\"\",INDEX($A$3:$A$70,SMALL(IF(J$3:J$70=\"\",ROW(J$3:J$70)-ROW(J$3)+1),ROWS(J$76:J101))))","v":"Student 55"},{"$f":"IF(ROWS(K$76:K101)>K$75,\"\",INDEX($A$3:$A$70,SMALL(IF(K$3:K$70=\"\",ROW(K$3:K$70)-ROW(K$3)+1),ROWS(K$76:K101))))","v":""}]
[{"$f":"\"#\"&ROWS(A$76:A102)","v":"#27"},{"$f":"IF(ROWS(B$76:B102)>B$75,\"\",INDEX($A$3:$A$70,SMALL(IF(B$3:B$70=\"\",ROW(B$3:B$70)-ROW(B$3)+1),ROWS(B$76:B102))))","v":""},{"$f":"IF(ROWS(C$76:C102)>C$75,\"\",INDEX($A$3:$A$70,SMALL(IF(C$3:C$70=\"\",ROW(C$3:C$70)-ROW(C$3)+1),ROWS(C$76:C102))))","v":""},{"$f":"IF(ROWS(D$76:D102)>D$75,\"\",INDEX($A$3:$A$70,SMALL(IF(D$3:D$70=\"\",ROW(D$3:D$70)-ROW(D$3)+1),ROWS(D$76:D102))))","v":""},{"$f":"IF(ROWS(E$76:E102)>E$75,\"\",INDEX($A$3:$A$70,SMALL(IF(E$3:E$70=\"\",ROW(E$3:E$70)-ROW(E$3)+1),ROWS(E$76:E102))))","v":"Student 59"},{"$f":"IF(ROWS(F$76:F102)>F$75,\"\",INDEX($A$3:$A$70,SMALL(IF(F$3:F$70=\"\",ROW(F$3:F$70)-ROW(F$3)+1),ROWS(F$76:F102))))","v":"Student 33"},{"$f":"IF(ROWS(G$76:G102)>G$75,\"\",INDEX($A$3:$A$70,SMALL(IF(G$3:G$70=\"\",ROW(G$3:G$70)-ROW(G$3)+1),ROWS(G$76:G102))))","v":"Student 31"},{"$f":"IF(ROWS(H$76:H102)>H$75,\"\",INDEX($A$3:$A$70,SMALL(IF(H$3:H$70=\"\",ROW(H$3:H$70)-ROW(H$3)+1),ROWS(H$76:H102))))","v":"Student 27"},{"$f":"IF(ROWS(I$76:I102)>I$75,\"\",INDEX($A$3:$A$70,SMALL(IF(I$3:I$70=\"\",ROW(I$3:I$70)-ROW(I$3)+1),ROWS(I$76:I102))))","v":"Student 27"},{"$f":"IF(ROWS(J$76:J102)>J$75,\"\",INDEX($A$3:$A$70,SMALL(IF(J$3:J$70=\"\",ROW(J$3:J$70)-ROW(J$3)+1),ROWS(J$76:J102))))","v":"Student 63"},{"$f":"IF(ROWS(K$76:K102)>K$75,\"\",INDEX($A$3:$A$70,SMALL(IF(K$3:K$70=\"\",ROW(K$3:K$70)-ROW(K$3)+1),ROWS(K$76:K102))))","v":""}]
[{"$f":"\"#\"&ROWS(A$76:A103)","v":"#28"},{"$f":"IF(ROWS(B$76:B103)>B$75,\"\",INDEX($A$3:$A$70,SMALL(IF(B$3:B$70=\"\",ROW(B$3:B$70)-ROW(B$3)+1),ROWS(B$76:B103))))","v":""},{"$f":"IF(ROWS(C$76:C103)>C$75,\"\",INDEX($A$3:$A$70,SMALL(IF(C$3:C$70=\"\",ROW(C$3:C$70)-ROW(C$3)+1),ROWS(C$76:C103))))","v":""},{"$f":"IF(ROWS(D$76:D103)>D$75,\"\",INDEX($A$3:$A$70,SMALL(IF(D$3:D$70=\"\",ROW(D$3:D$70)-ROW(D$3)+1),ROWS(D$76:D103))))","v":""},{"$f":"IF(ROWS(E$76:E103)>E$75,\"\",INDEX($A$3:$A$70,SMALL(IF(E$3:E$70=\"\",ROW(E$3:E$70)-ROW(E$3)+1),ROWS(E$76:E103))))","v":"Student 60"},{"$f":"IF(ROWS(F$76:F103)>F$75,\"\",INDEX($A$3:$A$70,SMALL(IF(F$3:F$70=\"\",ROW(F$3:F$70)-ROW(F$3)+1),ROWS(F$76:F103))))","v":"Student 34"},{"$f":"IF(ROWS(G$76:G103)>G$75,\"\",INDEX($A$3:$A$70,SMALL(IF(G$3:G$70=\"\",ROW(G$3:G$70)-ROW(G$3)+1),ROWS(G$76:G103))))","v":"Student 32"},{"$f":"IF(ROWS(H$76:H103)>H$75,\"\",INDEX($A$3:$A$70,SMALL(IF(H$3:H$70=\"\",ROW(H$3:H$70)-ROW(H$3)+1),ROWS(H$76:H103))))","v":"Student 28"},{"$f":"IF(ROWS(I$76:I103)>I$75,\"\",INDEX($A$3:$A$70,SMALL(IF(I$3:I$70=\"\",ROW(I$3:I$70)-ROW(I$3)+1),ROWS(I$76:I103))))","v":"Student 28"},{"$f":"IF(ROWS(J$76:J103)>J$75,\"\",INDEX($A$3:$A$70,SMALL(IF(J$3:J$70=\"\",ROW(J$3:J$70)-ROW(J$3)+1),ROWS(J$76:J103))))","v":"Student 65"},{"$f":"IF(ROWS(K$76:K103)>K$75,\"\",INDEX($A$3:$A$70,SMALL(IF(K$3:K$70=\"\",ROW(K$3:K$70)-ROW(K$3)+1),ROWS(K$76:K103))))","v":""}]
[{"$f":"\"#\"&ROWS(A$76:A104)","v":"#29"},{"$f":"IF(ROWS(B$76:B104)>B$75,\"\",INDEX($A$3:$A$70,SMALL(IF(B$3:B$70=\"\",ROW(B$3:B$70)-ROW(B$3)+1),ROWS(B$76:B104))))","v":""},{"$f":"IF(ROWS(C$76:C104)>C$75,\"\",INDEX($A$3:$A$70,SMALL(IF(C$3:C$70=\"\",ROW(C$3:C$70)-ROW(C$3)+1),ROWS(C$76:C104))))","v":""},{"$f":"IF(ROWS(D$76:D104)>D$75,\"\",INDEX($A$3:$A$70,SMALL(IF(D$3:D$70=\"\",ROW(D$3:D$70)-ROW(D$3)+1),ROWS(D$76:D104))))","v":""},{"$f":"IF(ROWS(E$76:E104)>E$75,\"\",INDEX($A$3:$A$70,SMALL(IF(E$3:E$70=\"\",ROW(E$3:E$70)-ROW(E$3)+1),ROWS(E$76:E104))))","v":"Student 61"},{"$f":"IF(ROWS(F$76:F104)>F$75,\"\",INDEX($A$3:$A$70,SMALL(IF(F$3:F$70=\"\",ROW(F$3:F$70)-ROW(F$3)+1),ROWS(F$76:F104))))","v":"Student 35"},{"$f":"IF(ROWS(G$76:G104)>G$75,\"\",INDEX($A$3:$A$70,SMALL(IF(G$3:G$70=\"\",ROW(G$3:G$70)-ROW(G$3)+1),ROWS(G$76:G104))))","v":"Student 33"},{"$f":"IF(ROWS(H$76:H104)>H$75,\"\",INDEX($A$3:$A$70,SMALL(IF(H$3:H$70=\"\",ROW(H$3:H$70)-ROW(H$3)+1),ROWS(H$76:H104))))","v":"Student 29"},{"$f":"IF(ROWS(I$76:I104)>I$75,\"\",INDEX($A$3:$A$70,SMALL(IF(I$3:I$70=\"\",ROW(I$3:I$70)-ROW(I$3)+1),ROWS(I$76:I104))))","v":"Student 29"},{"$f":"IF(ROWS(J$76:J104)>J$75,\"\",INDEX($A$3:$A$70,SMALL(IF(J$3:J$70=\"\",ROW(J$3:J$70)-ROW(J$3)+1),ROWS(J$76:J104))))","v":"Student 66"},{"$f":"IF(ROWS(K$76:K104)>K$75,\"\",INDEX($A$3:$A$70,SMALL(IF(K$3:K$70=\"\",ROW(K$3:K$70)-ROW(K$3)+1),ROWS(K$76:K104))))","v":""}]
[{"$f":"\"#\"&ROWS(A$76:A105)","v":"#30"},{"$f":"IF(ROWS(B$76:B105)>B$75,\"\",INDEX($A$3:$A$70,SMALL(IF(B$3:B$70=\"\",ROW(B$3:B$70)-ROW(B$3)+1),ROWS(B$76:B105))))","v":""},{"$f":"IF(ROWS(C$76:C105)>C$75,\"\",INDEX($A$3:$A$70,SMALL(IF(C$3:C$70=\"\",ROW(C$3:C$70)-ROW(C$3)+1),ROWS(C$76:C105))))","v":""},{"$f":"IF(ROWS(D$76:D105)>D$75,\"\",INDEX($A$3:$A$70,SMALL(IF(D$3:D$70=\"\",ROW(D$3:D$70)-ROW(D$3)+1),ROWS(D$76:D105))))","v":""},{"$f":"IF(ROWS(E$76:E105)>E$75,\"\",INDEX($A$3:$A$70,SMALL(IF(E$3:E$70=\"\",ROW(E$3:E$70)-ROW(E$3)+1),ROWS(E$76:E105))))","v":"Student 62"},{"$f":"IF(ROWS(F$76:F105)>F$75,\"\",INDEX($A$3:$A$70,SMALL(IF(F$3:F$70=\"\",ROW(F$3:F$70)-ROW(F$3)+1),ROWS(F$76:F105))))","v":"Student 36"},{"$f":"IF(ROWS(G$76:G105)>G$75,\"\",INDEX($A$3:$A$70,SMALL(IF(G$3:G$70=\"\",ROW(G$3:G$70)-ROW(G$3)+1),ROWS(G$76:G105))))","v":"Student 35"},{"$f":"IF(ROWS(H$76:H105)>H$75,\"\",INDEX($A$3:$A$70,SMALL(IF(H$3:H$70=\"\",ROW(H$3:H$70)-ROW(H$3)+1),ROWS(H$76:H105))))","v":"Student 30"},{"$f":"IF(ROWS(I$76:I105)>I$75,\"\",INDEX($A$3:$A$70,SMALL(IF(I$3:I$70=\"\",ROW(I$3:I$70)-ROW(I$3)+1),ROWS(I$76:I105))))","v":"Student 30"},{"$f":"IF(ROWS(J$76:J105)>J$75,\"\",INDEX($A$3:$A$70,SMALL(IF(J$3:J$70=\"\",ROW(J$3:J$70)-ROW(J$3)+1),ROWS(J$76:J105))))","v":"Student 67"},{"$f":"IF(ROWS(K$76:K105)>K$75,\"\",INDEX($A$3:$A$70,SMALL(IF(K$3:K$70=\"\",ROW(K$3:K$70)-ROW(K$3)+1),ROWS(K$76:K105))))","v":""}]
[{"$f":"\"#\"&ROWS(A$76:A106)","v":"#31"},{"$f":"IF(ROWS(B$76:B106)>B$75,\"\",INDEX($A$3:$A$70,SMALL(IF(B$3:B$70=\"\",ROW(B$3:B$70)-ROW(B$3)+1),ROWS(B$76:B106))))","v":""},{"$f":"IF(ROWS(C$76:C106)>C$75,\"\",INDEX($A$3:$A$70,SMALL(IF(C$3:C$70=\"\",ROW(C$3:C$70)-ROW(C$3)+1),ROWS(C$76:C106))))","v":""},{"$f":"IF(ROWS(D$76:D106)>D$75,\"\",INDEX($A$3:$A$70,SMALL(IF(D$3:D$70=\"\",ROW(D$3:D$70)-ROW(D$3)+1),ROWS(D$76:D106))))","v":""},{"$f":"IF(ROWS(E$76:E106)>E$75,\"\",INDEX($A$3:$A$70,SMALL(IF(E$3:E$70=\"\",ROW(E$3:E$70)-ROW(E$3)+1),ROWS(E$76:E106))))","v":"Student 63"},{"$f":"IF(ROWS(F$76:F106)>F$75,\"\",INDEX($A$3:$A$70,SMALL(IF(F$3:F$70=\"\",ROW(F$3:F$70)-ROW(F$3)+1),ROWS(F$76:F106))))","v":"Student 37"},{"$f":"IF(ROWS(G$76:G106)>G$75,\"\",INDEX($A$3:$A$70,SMALL(IF(G$3:G$70=\"\",ROW(G$3:G$70)-ROW(G$3)+1),ROWS(G$76:G106))))","v":"Student 37"},{"$f":"IF(ROWS(H$76:H106)>H$75,\"\",INDEX($A$3:$A$70,SMALL(IF(H$3:H$70=\"\",ROW(H$3:H$70)-ROW(H$3)+1),ROWS(H$76:H106))))","v":"Student 31"},{"$f":"IF(ROWS(I$76:I106)>I$75,\"\",INDEX($A$3:$A$70,SMALL(IF(I$3:I$70=\"\",ROW(I$3:I$70)-ROW(I$3)+1),ROWS(I$76:I106))))","v":"Student 31"},{"$f":"IF(ROWS(J$76:J106)>J$75,\"\",INDEX($A$3:$A$70,SMALL(IF(J$3:J$70=\"\",ROW(J$3:J$70)-ROW(J$3)+1),ROWS(J$76:J106))))","v":"Student 68"},{"$f":"IF(ROWS(K$76:K106)>K$75,\"\",INDEX($A$3:$A$70,SMALL(IF(K$3:K$70=\"\",ROW(K$3:K$70)-ROW(K$3)+1),ROWS(K$76:K106))))","v":""}]
[{"$f":"\"#\"&ROWS(A$76:A107)","v":"#32"},{"$f":"IF(ROWS(B$76:B107)>B$75,\"\",INDEX($A$3:$A$70,SMALL(IF(B$3:B$70=\"\",ROW(B$3:B$70)-ROW(B$3)+1),ROWS(B$76:B107))))","v":""},{"$f":"IF(ROWS(C$76:C107)>C$75,\"\",INDEX($A$3:$A$70,SMALL(IF(C$3:C$70=\"\",ROW(C$3:C$70)-ROW(C$3)+1),ROWS(C$76:C107))))","v":""},{"$f":"IF(ROWS(D$76:D107)>D$75,\"\",INDEX($A$3:$A$70,SMALL(IF(D$3:D$70=\"\",ROW(D$3:D$70)-ROW(D$3)+1),ROWS(D$76:D107))))","v":""},{"$f":"IF(ROWS(E$76:E107)>E$75,\"\",INDEX($A$3:$A$70,SMALL(IF(E$3:E$70=\"\",ROW(E$3:E$70)-ROW(E$3)+1),ROWS(E$76:E107))))","v":"Student 65"},{"$f":"IF(ROWS(F$76:F107)>F$75,\"\",INDEX($A$3:$A$70,SMALL(IF(F$3:F$70=\"\",ROW(F$3:F$70)-ROW(F$3)+1),ROWS(F$76:F107))))","v":"Student 38"},{"$f":"IF(ROWS(G$76:G107)>G$75,\"\",INDEX($A$3:$A$70,SMALL(IF(G$3:G$70=\"\",ROW(G$3:G$70)-ROW(G$3)+1),ROWS(G$76:G107))))","v":"Student 38"},{"$f":"IF(ROWS(H$76:H107)>H$75,\"\",INDEX($A$3:$A$70,SMALL(IF(H$3:H$70=\"\",ROW(H$3:H$70)-ROW(H$3)+1),ROWS(H$76:H107))))","v":"Student 32"},{"$f":"IF(ROWS(I$76:I107)>I$75,\"\",INDEX($A$3:$A$70,SMALL(IF(I$3:I$70=\"\",ROW(I$3:I$70)-ROW(I$3)+1),ROWS(I$76:I107))))","v":"Student 32"},{"$f":"IF(ROWS(J$76:J107)>J$75,\"\",INDEX($A$3:$A$70,SMALL(IF(J$3:J$70=\"\",ROW(J$3:J$70)-ROW(J$3)+1),ROWS(J$76:J107))))","v":""},{"$f":"IF(ROWS(K$76:K107)>K$75,\"\",INDEX($A$3:$A$70,SMALL(IF(K$3:K$70=\"\",ROW(K$3:K$70)-ROW(K$3)+1),ROWS(K$76:K107))))","v":""}]
[{"$f":"\"#\"&ROWS(A$76:A108)","v":"#33"},{"$f":"IF(ROWS(B$76:B108)>B$75,\"\",INDEX($A$3:$A$70,SMALL(IF(B$3:B$70=\"\",ROW(B$3:B$70)-ROW(B$3)+1),ROWS(B$76:B108))))","v":""},{"$f":"IF(ROWS(C$76:C108)>C$75,\"\",INDEX($A$3:$A$70,SMALL(IF(C$3:C$70=\"\",ROW(C$3:C$70)-ROW(C$3)+1),ROWS(C$76:C108))))","v":""},{"$f":"IF(ROWS(D$76:D108)>D$75,\"\",INDEX($A$3:$A$70,SMALL(IF(D$3:D$70=\"\",ROW(D$3:D$70)-ROW(D$3)+1),ROWS(D$76:D108))))","v":""},{"$f":"IF(ROWS(E$76:E108)>E$75,\"\",INDEX($A$3:$A$70,SMALL(IF(E$3:E$70=\"\",ROW(E$3:E$70)-ROW(E$3)+1),ROWS(E$76:E108))))","v":"Student 66"},{"$f":"IF(ROWS(F$76:F108)>F$75,\"\",INDEX($A$3:$A$70,SMALL(IF(F$3:F$70=\"\",ROW(F$3:F$70)-ROW(F$3)+1),ROWS(F$76:F108))))","v":"Student 39"},{"$f":"IF(ROWS(G$76:G108)>G$75,\"\",INDEX($A$3:$A$70,SMALL(IF(G$3:G$70=\"\",ROW(G$3:G$70)-ROW(G$3)+1),ROWS(G$76:G108))))","v":"Student 39"},{"$f":"IF(ROWS(H$76:H108)>H$75,\"\",INDEX($A$3:$A$70,SMALL(IF(H$3:H$70=\"\",ROW(H$3:H$70)-ROW(H$3)+1),ROWS(H$76:H108))))","v":"Student 33"},{"$f":"IF(ROWS(I$76:I108)>I$75,\"\",INDEX($A$3:$A$70,SMALL(IF(I$3:I$70=\"\",ROW(I$3:I$70)-ROW(I$3)+1),ROWS(I$76:I108))))","v":"Student 33"},{"$f":"IF(ROWS(J$76:J108)>J$75,\"\",INDEX($A$3:$A$70,SMALL(IF(J$3:J$70=\"\",ROW(J$3:J$70)-ROW(J$3)+1),ROWS(J$76:J108))))","v":""},{"$f":"IF(ROWS(K$76:K108)>K$75,\"\",INDEX($A$3:$A$70,SMALL(IF(K$3:K$70=\"\",ROW(K$3:K$70)-ROW(K$3)+1),ROWS(K$76:K108))))","v":""}]
[{"$f":"\"#\"&ROWS(A$76:A109)","v":"#34"},{"$f":"IF(ROWS(B$76:B109)>B$75,\"\",INDEX($A$3:$A$70,SMALL(IF(B$3:B$70=\"\",ROW(B$3:B$70)-ROW(B$3)+1),ROWS(B$76:B109))))","v":""},{"$f":"IF(ROWS(C$76:C109)>C$75,\"\",INDEX($A$3:$A$70,SMALL(IF(C$3:C$70=\"\",ROW(C$3:C$70)-ROW(C$3)+1),ROWS(C$76:C109))))","v":""},{"$f":"IF(ROWS(D$76:D109)>D$75,\"\",INDEX($A$3:$A$70,SMALL(IF(D$3:D$70=\"\",ROW(D$3:D$70)-ROW(D$3)+1),ROWS(D$76:D109))))","v":""},{"$f":"IF(ROWS(E$76:E109)>E$75,\"\",INDEX($A$3:$A$70,SMALL(IF(E$3:E$70=\"\",ROW(E$3:E$70)-ROW(E$3)+1),ROWS(E$76:E109))))","v":"Student 67"},{"$f":"IF(ROWS(F$76:F109)>F$75,\"\",INDEX($A$3:$A$70,SMALL(IF(F$3:F$70=\"\",ROW(F$3:F$70)-ROW(F$3)+1),ROWS(F$76:F109))))","v":"Student 40"},{"$f":"IF(ROWS(G$76:G109)>G$75,\"\",INDEX($A$3:$A$70,SMALL(IF(G$3:G$70=\"\",ROW(G$3:G$70)-ROW(G$3)+1),ROWS(G$76:G109))))","v":"Student 40"},{"$f":"IF(ROWS(H$76:H109)>H$75,\"\",INDEX($A$3:$A$70,SMALL(IF(H$3:H$70=\"\",ROW(H$3:H$70)-ROW(H$3)+1),ROWS(H$76:H109))))","v":"Student 35"},{"$f":"IF(ROWS(I$76:I109)>I$75,\"\",INDEX($A$3:$A$70,SMALL(IF(I$3:I$70=\"\",ROW(I$3:I$70)-ROW(I$3)+1),ROWS(I$76:I109))))","v":"Student 34"},{"$f":"IF(ROWS(J$76:J109)>J$75,\"\",INDEX($A$3:$A$70,SMALL(IF(J$3:J$70=\"\",ROW(J$3:J$70)-ROW(J$3)+1),ROWS(J$76:J109))))","v":""},{"$f":"IF(ROWS(K$76:K109)>K$75,\"\",INDEX($A$3:$A$70,SMALL(IF(K$3:K$70=\"\",ROW(K$3:K$70)-ROW(K$3)+1),ROWS(K$76:K109))))","v":""}]
[{"$f":"\"#\"&ROWS(A$76:A110)","v":"#35"},{"$f":"IF(ROWS(B$76:B110)>B$75,\"\",INDEX($A$3:$A$70,SMALL(IF(B$3:B$70=\"\",ROW(B$3:B$70)-ROW(B$3)+1),ROWS(B$76:B110))))","v":""},{"$f":"IF(ROWS(C$76:C110)>C$75,\"\",INDEX($A$3:$A$70,SMALL(IF(C$3:C$70=\"\",ROW(C$3:C$70)-ROW(C$3)+1),ROWS(C$76:C110))))","v":""},{"$f":"IF(ROWS(D$76:D110)>D$75,\"\",INDEX($A$3:$A$70,SMALL(IF(D$3:D$70=\"\",ROW(D$3:D$70)-ROW(D$3)+1),ROWS(D$76:D110))))","v":""},{"$f":"IF(ROWS(E$76:E110)>E$75,\"\",INDEX($A$3:$A$70,SMALL(IF(E$3:E$70=\"\",ROW(E$3:E$70)-ROW(E$3)+1),ROWS(E$76:E110))))","v":"Student 68"},{"$f":"IF(ROWS(F$76:F110)>F$75,\"\",INDEX($A$3:$A$70,SMALL(IF(F$3:F$70=\"\",ROW(F$3:F$70)-ROW(F$3)+1),ROWS(F$76:F110))))","v":"Student 41"},{"$f":"IF(ROWS(G$76:G110)>G$75,\"\",INDEX($A$3:$A$70,SMALL(IF(G$3:G$70=\"\",ROW(G$3:G$70)-ROW(G$3)+1),ROWS(G$76:G110))))","v":"Student 41"},{"$f":"IF(ROWS(H$76:H110)>H$75,\"\",INDEX($A$3:$A$70,SMALL(IF(H$3:H$70=\"\",ROW(H$3:H$70)-ROW(H$3)+1),ROWS(H$76:H110))))","v":"Student 36"},{"$f":"IF(ROWS(I$76:I110)>I$75,\"\",INDEX($A$3:$A$70,SMALL(IF(I$3:I$70=\"\",ROW(I$3:I$70)-ROW(I$3)+1),ROWS(I$76:I110))))","v":"Student 35"},{"$f":"IF(ROWS(J$76:J110)>J$75,\"\",INDEX($A$3:$A$70,SMALL(IF(J$3:J$70=\"\",ROW(J$3:J$70)-ROW(J$3)+1),ROWS(J$76:J110))))","v":""},{"$f":"IF(ROWS(K$76:K110)>K$75,\"\",INDEX($A$3:$A$70,SMALL(IF(K$3:K$70=\"\",ROW(K$3:K$70)-ROW(K$3)+1),ROWS(K$76:K110))))","v":""}]
[{"$f":"\"#\"&ROWS(A$76:A111)","v":"#36"},{"$f":"IF(ROWS(B$76:B111)>B$75,\"\",INDEX($A$3:$A$70,SMALL(IF(B$3:B$70=\"\",ROW(B$3:B$70)-ROW(B$3)+1),ROWS(B$76:B111))))","v":""},{"$f":"IF(ROWS(C$76:C111)>C$75,\"\",INDEX($A$3:$A$70,SMALL(IF(C$3:C$70=\"\",ROW(C$3:C$70)-ROW(C$3)+1),ROWS(C$76:C111))))","v":""},{"$f":"IF(ROWS(D$76:D111)>D$75,\"\",INDEX($A$3:$A$70,SMALL(IF(D$3:D$70=\"\",ROW(D$3:D$70)-ROW(D$3)+1),ROWS(D$76:D111))))","v":""},{"$f":"IF(ROWS(E$76:E111)>E$75,\"\",INDEX($A$3:$A$70,SMALL(IF(E$3:E$70=\"\",ROW(E$3:E$70)-ROW(E$3)+1),ROWS(E$76:E111))))","v":""},{"$f":"IF(ROWS(F$76:F111)>F$75,\"\",INDEX($A$3:$A$70,SMALL(IF(F$3:F$70=\"\",ROW(F$3:F$70)-ROW(F$3)+1),ROWS(F$76:F111))))","v":"Student 42"},{"$f":"IF(ROWS(G$76:G111)>G$75,\"\",INDEX($A$3:$A$70,SMALL(IF(G$3:G$70=\"\",ROW(G$3:G$70)-ROW(G$3)+1),ROWS(G$76:G111))))","v":"Student 42"},{"$f":"IF(ROWS(H$76:H111)>H$75,\"\",INDEX($A$3:$A$70,SMALL(IF(H$3:H$70=\"\",ROW(H$3:H$70)-ROW(H$3)+1),ROWS(H$76:H111))))","v":"Student 37"},{"$f":"IF(ROWS(I$76:I111)>I$75,\"\",INDEX($A$3:$A$70,SMALL(IF(I$3:I$70=\"\",ROW(I$3:I$70)-ROW(I$3)+1),ROWS(I$76:I111))))","v":"Student 36"},{"$f":"IF(ROWS(J$76:J111)>J$75,\"\",INDEX($A$3:$A$70,SMALL(IF(J$3:J$70=\"\",ROW(J$3:J$70)-ROW(J$3)+1),ROWS(J$76:J111))))","v":""},{"$f":"IF(ROWS(K$76:K111)>K$75,\"\",INDEX($A$3:$A$70,SMALL(IF(K$3:K$70=\"\",ROW(K$3:K$70)-ROW(K$3)+1),ROWS(K$76:K111))))","v":""}]
[{"$f":"\"#\"&ROWS(A$76:A112)","v":"#37"},{"$f":"IF(ROWS(B$76:B112)>B$75,\"\",INDEX($A$3:$A$70,SMALL(IF(B$3:B$70=\"\",ROW(B$3:B$70)-ROW(B$3)+1),ROWS(B$76:B112))))","v":""},{"$f":"IF(ROWS(C$76:C112)>C$75,\"\",INDEX($A$3:$A$70,SMALL(IF(C$3:C$70=\"\",ROW(C$3:C$70)-ROW(C$3)+1),ROWS(C$76:C112))))","v":""},{"$f":"IF(ROWS(D$76:D112)>D$75,\"\",INDEX($A$3:$A$70,SMALL(IF(D$3:D$70=\"\",ROW(D$3:D$70)-ROW(D$3)+1),ROWS(D$76:D112))))","v":""},{"$f":"IF(ROWS(E$76:E112)>E$75,\"\",INDEX($A$3:$A$70,SMALL(IF(E$3:E$70=\"\",ROW(E$3:E$70)-ROW(E$3)+1),ROWS(E$76:E112))))","v":""},{"$f":"IF(ROWS(F$76:F112)>F$75,\"\",INDEX($A$3:$A$70,SMALL(IF(F$3:F$70=\"\",ROW(F$3:F$70)-ROW(F$3)+1),ROWS(F$76:F112))))","v":"Student 43"},{"$f":"IF(ROWS(G$76:G112)>G$75,\"\",INDEX($A$3:$A$70,SMALL(IF(G$3:G$70=\"\",ROW(G$3:G$70)-ROW(G$3)+1),ROWS(G$76:G112))))","v":"Student 44"},{"$f":"IF(ROWS(H$76:H112)>H$75,\"\",INDEX($A$3:$A$70,SMALL(IF(H$3:H$70=\"\",ROW(H$3:H$70)-ROW(H$3)+1),ROWS(H$76:H112))))","v":"Student 38"},{"$f":"IF(ROWS(I$76:I112)>I$75,\"\",INDEX($A$3:$A$70,SMALL(IF(I$3:I$70=\"\",ROW(I$3:I$70)-ROW(I$3)+1),ROWS(I$76:I112))))","v":"Student 37"},{"$f":"IF(ROWS(J$76:J112)>J$75,\"\",INDEX($A$3:$A$70,SMALL(IF(J$3:J$70=\"\",ROW(J$3:J$70)-ROW(J$3)+1),ROWS(J$76:J112))))","v":""},{"$f":"IF(ROWS(K$76:K112)>K$75,\"\",INDEX($A$3:$A$70,SMALL(IF(K$3:K$70=\"\",ROW(K$3:K$70)-ROW(K$3)+1),ROWS(K$76:K112))))","v":""}]
[{"$f":"\"#\"&ROWS(A$76:A113)","v":"#38"},{"$f":"IF(ROWS(B$76:B113)>B$75,\"\",INDEX($A$3:$A$70,SMALL(IF(B$3:B$70=\"\",ROW(B$3:B$70)-ROW(B$3)+1),ROWS(B$76:B113))))","v":""},{"$f":"IF(ROWS(C$76:C113)>C$75,\"\",INDEX($A$3:$A$70,SMALL(IF(C$3:C$70=\"\",ROW(C$3:C$70)-ROW(C$3)+1),ROWS(C$76:C113))))","v":""},{"$f":"IF(ROWS(D$76:D113)>D$75,\"\",INDEX($A$3:$A$70,SMALL(IF(D$3:D$70=\"\",ROW(D$3:D$70)-ROW(D$3)+1),ROWS(D$76:D113))))","v":""},{"$f":"IF(ROWS(E$76:E113)>E$75,\"\",INDEX($A$3:$A$70,SMALL(IF(E$3:E$70=\"\",ROW(E$3:E$70)-ROW(E$3)+1),ROWS(E$76:E113))))","v":""},{"$f":"IF(ROWS(F$76:F113)>F$75,\"\",INDEX($A$3:$A$70,SMALL(IF(F$3:F$70=\"\",ROW(F$3:F$70)-ROW(F$3)+1),ROWS(F$76:F113))))","v":"Student 44"},{"$f":"IF(ROWS(G$76:G113)>G$75,\"\",INDEX($A$3:$A$70,SMALL(IF(G$3:G$70=\"\",ROW(G$3:G$70)-ROW(G$3)+1),ROWS(G$76:G113))))","v":"Student 45"},{"$f":"IF(ROWS(H$76:H113)>H$75,\"\",INDEX($A$3:$A$70,SMALL(IF(H$3:H$70=\"\",ROW(H$3:H$70)-ROW(H$3)+1),ROWS(H$76:H113))))","v":"Student 39"},{"$f":"IF(ROWS(I$76:I113)>I$75,\"\",INDEX($A$3:$A$70,SMALL(IF(I$3:I$70=\"\",ROW(I$3:I$70)-ROW(I$3)+1),ROWS(I$76:I113))))","v":"Student 38"},{"$f":"IF(ROWS(J$76:J113)>J$75,\"\",INDEX($A$3:$A$70,SMALL(IF(J$3:J$70=\"\",ROW(J$3:J$70)-ROW(J$3)+1),ROWS(J$76:J113))))","v":""},{"$f":"IF(ROWS(K$76:K113)>K$75,\"\",INDEX($A$3:$A$70,SMALL(IF(K$3:K$70=\"\",ROW(K$3:K$70)-ROW(K$3)+1),ROWS(K$76:K113))))","v":""}]
[{"$f":"\"#\"&ROWS(A$76:A114)","v":"#39"},{"$f":"IF(ROWS(B$76:B114)>B$75,\"\",INDEX($A$3:$A$70,SMALL(IF(B$3:B$70=\"\",ROW(B$3:B$70)-ROW(B$3)+1),ROWS(B$76:B114))))","v":""},{"$f":"IF(ROWS(C$76:C114)>C$75,\"\",INDEX($A$3:$A$70,SMALL(IF(C$3:C$70=\"\",ROW(C$3:C$70)-ROW(C$3)+1),ROWS(C$76:C114))))","v":""},{"$f":"IF(ROWS(D$76:D114)>D$75,\"\",INDEX($A$3:$A$70,SMALL(IF(D$3:D$70=\"\",ROW(D$3:D$70)-ROW(D$3)+1),ROWS(D$76:D114))))","v":""},{"$f":"IF(ROWS(E$76:E114)>E$75,\"\",INDEX($A$3:$A$70,SMALL(IF(E$3:E$70=\"\",ROW(E$3:E$70)-ROW(E$3)+1),ROWS(E$76:E114))))","v":""},{"$f":"IF(ROWS(F$76:F114)>F$75,\"\",INDEX($A$3:$A$70,SMALL(IF(F$3:F$70=\"\",ROW(F$3:F$70)-ROW(F$3)+1),ROWS(F$76:F114))))","v":"Student 45"},{"$f":"IF(ROWS(G$76:G114)>G$75,\"\",INDEX($A$3:$A$70,SMALL(IF(G$3:G$70=\"\",ROW(G$3:G$70)-ROW(G$3)+1),ROWS(G$76:G114))))","v":"Student 46"},{"$f":"IF(ROWS(H$76:H114)>H$75,\"\",INDEX($A$3:$A$70,SMALL(IF(H$3:H$70=\"\",ROW(H$3:H$70)-ROW(H$3)+1),ROWS(H$76:H114))))","v":"Student 40"},{"$f":"IF(ROWS(I$76:I114)>I$75,\"\",INDEX($A$3:$A$70,SMALL(IF(I$3:I$70=\"\",ROW(I$3:I$70)-ROW(I$3)+1),ROWS(I$76:I114))))","v":"Student 39"},{"$f":"IF(ROWS(J$76:J114)>J$75,\"\",INDEX($A$3:$A$70,SMALL(IF(J$3:J$70=\"\",ROW(J$3:J$70)-ROW(J$3)+1),ROWS(J$76:J114))))","v":""},{"$f":"IF(ROWS(K$76:K114)>K$75,\"\",INDEX($A$3:$A$70,SMALL(IF(K$3:K$70=\"\",ROW(K$3:K$70)-ROW(K$3)+1),ROWS(K$76:K114))))","v":""}]
[{"$f":"\"#\"&ROWS(A$76:A115)","v":"#40"},{"$f":"IF(ROWS(B$76:B115)>B$75,\"\",INDEX($A$3:$A$70,SMALL(IF(B$3:B$70=\"\",ROW(B$3:B$70)-ROW(B$3)+1),ROWS(B$76:B115))))","v":""},{"$f":"IF(ROWS(C$76:C115)>C$75,\"\",INDEX($A$3:$A$70,SMALL(IF(C$3:C$70=\"\",ROW(C$3:C$70)-ROW(C$3)+1),ROWS(C$76:C115))))","v":""},{"$f":"IF(ROWS(D$76:D115)>D$75,\"\",INDEX($A$3:$A$70,SMALL(IF(D$3:D$70=\"\",ROW(D$3:D$70)-ROW(D$3)+1),ROWS(D$76:D115))))","v":""},{"$f":"IF(ROWS(E$76:E115)>E$75,\"\",INDEX($A$3:$A$70,SMALL(IF(E$3:E$70=\"\",ROW(E$3:E$70)-ROW(E$3)+1),ROWS(E$76:E115))))","v":""},{"$f":"IF(ROWS(F$76:F115)>F$75,\"\",INDEX($A$3:$A$70,SMALL(IF(F$3:F$70=\"\",ROW(F$3:F$70)-ROW(F$3)+1),ROWS(F$76:F115))))","v":"Student 46"},{"$f":"IF(ROWS(G$76:G115)>G$75,\"\",INDEX($A$3:$A$70,SMALL(IF(G$3:G$70=\"\",ROW(G$3:G$70)-ROW(G$3)+1),ROWS(G$76:G115))))","v":"Student 47"},{"$f":"IF(ROWS(H$76:H115)>H$75,\"\",INDEX($A$3:$A$70,SMALL(IF(H$3:H$70=\"\",ROW(H$3:H$70)-ROW(H$3)+1),ROWS(H$76:H115))))","v":"Student 41"},{"$f":"IF(ROWS(I$76:I115)>I$75,\"\",INDEX($A$3:$A$70,SMALL(IF(I$3:I$70=\"\",ROW(I$3:I$70)-ROW(I$3)+1),ROWS(I$76:I115))))","v":"Student 40"},{"$f":"IF(ROWS(J$76:J115)>J$75,\"\",INDEX($A$3:$A$70,SMALL(IF(J$3:J$70=\"\",ROW(J$3:J$70)-ROW(J$3)+1),ROWS(J$76:J115))))","v":""},{"$f":"IF(ROWS(K$76:K115)>K$75,\"\",INDEX($A$3:$A$70,SMALL(IF(K$3:K$70=\"\",ROW(K$3:K$70)-ROW(K$3)+1),ROWS(K$76:K115))))","v":""}]
[{"$f":"\"#\"&ROWS(A$76:A116)","v":"#41"},{"$f":"IF(ROWS(B$76:B116)>B$75,\"\",INDEX($A$3:$A$70,SMALL(IF(B$3:B$70=\"\",ROW(B$3:B$70)-ROW(B$3)+1),ROWS(B$76:B116))))","v":""},{"$f":"IF(ROWS(C$76:C116)>C$75,\"\",INDEX($A$3:$A$70,SMALL(IF(C$3:C$70=\"\",ROW(C$3:C$70)-ROW(C$3)+1),ROWS(C$76:C116))))","v":""},{"$f":"IF(ROWS(D$76:D116)>D$75,\"\",INDEX($A$3:$A$70,SMALL(IF(D$3:D$70=\"\",ROW(D$3:D$70)-ROW(D$3)+1),ROWS(D$76:D116))))","v":""},{"$f":"IF(ROWS(E$76:E116)>E$75,\"\",INDEX($A$3:$A$70,SMALL(IF(E$3:E$70=\"\",ROW(E$3:E$70)-ROW(E$3)+1),ROWS(E$76:E116))))","v":""},{"$f":"IF(ROWS(F$76:F116)>F$75,\"\",INDEX($A$3:$A$70,SMALL(IF(F$3:F$70=\"\",ROW(F$3:F$70)-ROW(F$3)+1),ROWS(F$76:F116))))","v":"Student 47"},{"$f":"IF(ROWS(G$76:G116)>G$75,\"\",INDEX($A$3:$A$70,SMALL(IF(G$3:G$70=\"\",ROW(G$3:G$70)-ROW(G$3)+1),ROWS(G$76:G116))))","v":"Student 48"},{"$f":"IF(ROWS(H$76:H116)>H$75,\"\",INDEX($A$3:$A$70,SMALL(IF(H$3:H$70=\"\",ROW(H$3:H$70)-ROW(H$3)+1),ROWS(H$76:H116))))","v":"Student 42"},{"$f":"IF(ROWS(I$76:I116)>I$75,\"\",INDEX($A$3:$A$70,SMALL(IF(I$3:I$70=\"\",ROW(I$3:I$70)-ROW(I$3)+1),ROWS(I$76:I116))))","v":"Student 41"},{"$f":"IF(ROWS(J$76:J116)>J$75,\"\",INDEX($A$3:$A$70,SMALL(IF(J$3:J$70=\"\",ROW(J$3:J$70)-ROW(J$3)+1),ROWS(J$76:J116))))","v":""},{"$f":"IF(ROWS(K$76:K116)>K$75,\"\",INDEX($A$3:$A$70,SMALL(IF(K$3:K$70=\"\",ROW(K$3:K$70)-ROW(K$3)+1),ROWS(K$76:K116))))","v":""}]
[{"$f":"\"#\"&ROWS(A$76:A117)","v":"#42"},{"$f":"IF(ROWS(B$76:B117)>B$75,\"\",INDEX($A$3:$A$70,SMALL(IF(B$3:B$70=\"\",ROW(B$3:B$70)-ROW(B$3)+1),ROWS(B$76:B117))))","v":""},{"$f":"IF(ROWS(C$76:C117)>C$75,\"\",INDEX($A$3:$A$70,SMALL(IF(C$3:C$70=\"\",ROW(C$3:C$70)-ROW(C$3)+1),ROWS(C$76:C117))))","v":""},{"$f":"IF(ROWS(D$76:D117)>D$75,\"\",INDEX($A$3:$A$70,SMALL(IF(D$3:D$70=\"\",ROW(D$3:D$70)-ROW(D$3)+1),ROWS(D$76:D117))))","v":""},{"$f":"IF(ROWS(E$76:E117)>E$75,\"\",INDEX($A$3:$A$70,SMALL(IF(E$3:E$70=\"\",ROW(E$3:E$70)-ROW(E$3)+1),ROWS(E$76:E117))))","v":""},{"$f":"IF(ROWS(F$76:F117)>F$75,\"\",INDEX($A$3:$A$70,SMALL(IF(F$3:F$70=\"\",ROW(F$3:F$70)-ROW(F$3)+1),ROWS(F$76:F117))))","v":"Student 49"},{"$f":"IF(ROWS(G$76:G117)>G$75,\"\",INDEX($A$3:$A$70,SMALL(IF(G$3:G$70=\"\",ROW(G$3:G$70)-ROW(G$3)+1),ROWS(G$76:G117))))","v":"Student 49"},{"$f":"IF(ROWS(H$76:H117)>H$75,\"\",INDEX($A$3:$A$70,SMALL(IF(H$3:H$70=\"\",ROW(H$3:H$70)-ROW(H$3)+1),ROWS(H$76:H117))))","v":"Student 43"},{"$f":"IF(ROWS(I$76:I117)>I$75,\"\",INDEX($A$3:$A$70,SMALL(IF(I$3:I$70=\"\",ROW(I$3:I$70)-ROW(I$3)+1),ROWS(I$76:I117))))","v":"Student 42"},{"$f":"IF(ROWS(J$76:J117)>J$75,\"\",INDEX($A$3:$A$70,SMALL(IF(J$3:J$70=\"\",ROW(J$3:J$70)-ROW(J$3)+1),ROWS(J$76:J117))))","v":""},{"$f":"IF(ROWS(K$76:K117)>K$75,\"\",INDEX($A$3:$A$70,SMALL(IF(K$3:K$70=\"\",ROW(K$3:K$70)-ROW(K$3)+1),ROWS(K$76:K117))))","v":""}]
[{"$f":"\"#\"&ROWS(A$76:A118)","v":"#43"},{"$f":"IF(ROWS(B$76:B118)>B$75,\"\",INDEX($A$3:$A$70,SMALL(IF(B$3:B$70=\"\",ROW(B$3:B$70)-ROW(B$3)+1),ROWS(B$76:B118))))","v":""},{"$f":"IF(ROWS(C$76:C118)>C$75,\"\",INDEX($A$3:$A$70,SMALL(IF(C$3:C$70=\"\",ROW(C$3:C$70)-ROW(C$3)+1),ROWS(C$76:C118))))","v":""},{"$f":"IF(ROWS(D$76:D118)>D$75,\"\",INDEX($A$3:$A$70,SMALL(IF(D$3:D$70=\"\",ROW(D$3:D$70)-ROW(D$3)+1),ROWS(D$76:D118))))","v":""},{"$f":"IF(ROWS(E$76:E118)>E$75,\"\",INDEX($A$3:$A$70,SMALL(IF(E$3:E$70=\"\",ROW(E$3:E$70)-ROW(E$3)+1),ROWS(E$76:E118))))","v":""},{"$f":"IF(ROWS(F$76:F118)>F$75,\"\",INDEX($A$3:$A$70,SMALL(IF(F$3:F$70=\"\",ROW(F$3:F$70)-ROW(F$3)+1),ROWS(F$76:F118))))","v":"Student 50"},{"$f":"IF(ROWS(G$76:G118)>G$75,\"\",INDEX($A$3:$A$70,SMALL(IF(G$3:G$70=\"\",ROW(G$3:G$70)-ROW(G$3)+1),ROWS(G$76:G118))))","v":"Student 50"},{"$f":"IF(ROWS(H$76:H118)>H$75,\"\",INDEX($A$3:$A$70,SMALL(IF(H$3:H$70=\"\",ROW(H$3:H$70)-ROW(H$3)+1),ROWS(H$76:H118))))","v":"Student 44"},{"$f":"IF(ROWS(I$76:I118)>I$75,\"\",INDEX($A$3:$A$70,SMALL(IF(I$3:I$70=\"\",ROW(I$3:I$70)-ROW(I$3)+1),ROWS(I$76:I118))))","v":"Student 43"},{"$f":"IF(ROWS(J$76:J118)>J$75,\"\",INDEX($A$3:$A$70,SMALL(IF(J$3:J$70=\"\",ROW(J$3:J$70)-ROW(J$3)+1),ROWS(J$76:J118))))","v":""},{"$f":"IF(ROWS(K$76:K118)>K$75,\"\",INDEX($A$3:$A$70,SMALL(IF(K$3:K$70=\"\",ROW(K$3:K$70)-ROW(K$3)+1),ROWS(K$76:K118))))","v":""}]
[{"$f":"\"#\"&ROWS(A$76:A119)","v":"#44"},{"$f":"IF(ROWS(B$76:B119)>B$75,\"\",INDEX($A$3:$A$70,SMALL(IF(B$3:B$70=\"\",ROW(B$3:B$70)-ROW(B$3)+1),ROWS(B$76:B119))))","v":""},{"$f":"IF(ROWS(C$76:C119)>C$75,\"\",INDEX($A$3:$A$70,SMALL(IF(C$3:C$70=\"\",ROW(C$3:C$70)-ROW(C$3)+1),ROWS(C$76:C119))))","v":""},{"$f":"IF(ROWS(D$76:D119)>D$75,\"\",INDEX($A$3:$A$70,SMALL(IF(D$3:D$70=\"\",ROW(D$3:D$70)-ROW(D$3)+1),ROWS(D$76:D119))))","v":""},{"$f":"IF(ROWS(E$76:E119)>E$75,\"\",INDEX($A$3:$A$70,SMALL(IF(E$3:E$70=\"\",ROW(E$3:E$70)-ROW(E$3)+1),ROWS(E$76:E119))))","v":""},{"$f":"IF(ROWS(F$76:F119)>F$75,\"\",INDEX($A$3:$A$70,SMALL(IF(F$3:F$70=\"\",ROW(F$3:F$70)-ROW(F$3)+1),ROWS(F$76:F119))))","v":"Student 51"},{"$f":"IF(ROWS(G$76:G119)>G$75,\"\",INDEX($A$3:$A$70,SMALL(IF(G$3:G$70=\"\",ROW(G$3:G$70)-ROW(G$3)+1),ROWS(G$76:G119))))","v":"Student 51"},{"$f":"IF(ROWS(H$76:H119)>H$75,\"\",INDEX($A$3:$A$70,SMALL(IF(H$3:H$70=\"\",ROW(H$3:H$70)-ROW(H$3)+1),ROWS(H$76:H119))))","v":"Student 45"},{"$f":"IF(ROWS(I$76:I119)>I$75,\"\",INDEX($A$3:$A$70,SMALL(IF(I$3:I$70=\"\",ROW(I$3:I$70)-ROW(I$3)+1),ROWS(I$76:I119))))","v":"Student 44"},{"$f":"IF(ROWS(J$76:J119)>J$75,\"\",INDEX($A$3:$A$70,SMALL(IF(J$3:J$70=\"\",ROW(J$3:J$70)-ROW(J$3)+1),ROWS(J$76:J119))))","v":""},{"$f":"IF(ROWS(K$76:K119)>K$75,\"\",INDEX($A$3:$A$70,SMALL(IF(K$3:K$70=\"\",ROW(K$3:K$70)-ROW(K$3)+1),ROWS(K$76:K119))))","v":""}]
[{"$f":"\"#\"&ROWS(A$76:A120)","v":"#45"},{"$f":"IF(ROWS(B$76:B120)>B$75,\"\",INDEX($A$3:$A$70,SMALL(IF(B$3:B$70=\"\",ROW(B$3:B$70)-ROW(B$3)+1),ROWS(B$76:B120))))","v":""},{"$f":"IF(ROWS(C$76:C120)>C$75,\"\",INDEX($A$3:$A$70,SMALL(IF(C$3:C$70=\"\",ROW(C$3:C$70)-ROW(C$3)+1),ROWS(C$76:C120))))","v":""},{"$f":"IF(ROWS(D$76:D120)>D$75,\"\",INDEX($A$3:$A$70,SMALL(IF(D$3:D$70=\"\",ROW(D$3:D$70)-ROW(D$3)+1),ROWS(D$76:D120))))","v":""},{"$f":"IF(ROWS(E$76:E120)>E$75,\"\",INDEX($A$3:$A$70,SMALL(IF(E$3:E$70=\"\",ROW(E$3:E$70)-ROW(E$3)+1),ROWS(E$76:E120))))","v":""},{"$f":"IF(ROWS(F$76:F120)>F$75,\"\",INDEX($A$3:$A$70,SMALL(IF(F$3:F$70=\"\",ROW(F$3:F$70)-ROW(F$3)+1),ROWS(F$76:F120))))","v":"Student 52"},{"$f":"IF(ROWS(G$76:G120)>G$75,\"\",INDEX($A$3:$A$70,SMALL(IF(G$3:G$70=\"\",ROW(G$3:G$70)-ROW(G$3)+1),ROWS(G$76:G120))))","v":"Student 52"},{"$f":"IF(ROWS(H$76:H120)>H$75,\"\",INDEX($A$3:$A$70,SMALL(IF(H$3:H$70=\"\",ROW(H$3:H$70)-ROW(H$3)+1),ROWS(H$76:H120))))","v":"Student 46"},{"$f":"IF(ROWS(I$76:I120)>I$75,\"\",INDEX($A$3:$A$70,SMALL(IF(I$3:I$70=\"\",ROW(I$3:I$70)-ROW(I$3)+1),ROWS(I$76:I120))))","v":"Student 45"},{"$f":"IF(ROWS(J$76:J120)>J$75,\"\",INDEX($A$3:$A$70,SMALL(IF(J$3:J$70=\"\",ROW(J$3:J$70)-ROW(J$3)+1),ROWS(J$76:J120))))","v":""},{"$f":"IF(ROWS(K$76:K120)>K$75,\"\",INDEX($A$3:$A$70,SMALL(IF(K$3:K$70=\"\",ROW(K$3:K$70)-ROW(K$3)+1),ROWS(K$76:K120))))","v":""}]
[{"$f":"\"#\"&ROWS(A$76:A121)","v":"#46"},{"$f":"IF(ROWS(B$76:B121)>B$75,\"\",INDEX($A$3:$A$70,SMALL(IF(B$3:B$70=\"\",ROW(B$3:B$70)-ROW(B$3)+1),ROWS(B$76:B121))))","v":""},{"$f":"IF(ROWS(C$76:C121)>C$75,\"\",INDEX($A$3:$A$70,SMALL(IF(C$3:C$70=\"\",ROW(C$3:C$70)-ROW(C$3)+1),ROWS(C$76:C121))))","v":""},{"$f":"IF(ROWS(D$76:D121)>D$75,\"\",INDEX($A$3:$A$70,SMALL(IF(D$3:D$70=\"\",ROW(D$3:D$70)-ROW(D$3)+1),ROWS(D$76:D121))))","v":""},{"$f":"IF(ROWS(E$76:E121)>E$75,\"\",INDEX($A$3:$A$70,SMALL(IF(E$3:E$70=\"\",ROW(E$3:E$70)-ROW(E$3)+1),ROWS(E$76:E121))))","v":""},{"$f":"IF(ROWS(F$76:F121)>F$75,\"\",INDEX($A$3:$A$70,SMALL(IF(F$3:F$70=\"\",ROW(F$3:F$70)-ROW(F$3)+1),ROWS(F$76:F121))))","v":"Student 53"},{"$f":"IF(ROWS(G$76:G121)>G$75,\"\",INDEX($A$3:$A$70,SMALL(IF(G$3:G$70=\"\",ROW(G$3:G$70)-ROW(G$3)+1),ROWS(G$76:G121))))","v":"Student 53"},{"$f":"IF(ROWS(H$76:H121)>H$75,\"\",INDEX($A$3:$A$70,SMALL(IF(H$3:H$70=\"\",ROW(H$3:H$70)-ROW(H$3)+1),ROWS(H$76:H121))))","v":"Student 47"},{"$f":"IF(ROWS(I$76:I121)>I$75,\"\",INDEX($A$3:$A$70,SMALL(IF(I$3:I$70=\"\",ROW(I$3:I$70)-ROW(I$3)+1),ROWS(I$76:I121))))","v":"Student 46"},{"$f":"IF(ROWS(J$76:J121)>J$75,\"\",INDEX($A$3:$A$70,SMALL(IF(J$3:J$70=\"\",ROW(J$3:J$70)-ROW(J$3)+1),ROWS(J$76:J121))))","v":""},{"$f":"IF(ROWS(K$76:K121)>K$75,\"\",INDEX($A$3:$A$70,SMALL(IF(K$3:K$70=\"\",ROW(K$3:K$70)-ROW(K$3)+1),ROWS(K$76:K121))))","v":""}]
[{"$f":"\"#\"&ROWS(A$76:A122)","v":"#47"},{"$f":"IF(ROWS(B$76:B122)>B$75,\"\",INDEX($A$3:$A$70,SMALL(IF(B$3:B$70=\"\",ROW(B$3:B$70)-ROW(B$3)+1),ROWS(B$76:B122))))","v":""},{"$f":"IF(ROWS(C$76:C122)>C$75,\"\",INDEX($A$3:$A$70,SMALL(IF(C$3:C$70=\"\",ROW(C$3:C$70)-ROW(C$3)+1),ROWS(C$76:C122))))","v":""},{"$f":"IF(ROWS(D$76:D122)>D$75,\"\",INDEX($A$3:$A$70,SMALL(IF(D$3:D$70=\"\",ROW(D$3:D$70)-ROW(D$3)+1),ROWS(D$76:D122))))","v":""},{"$f":"IF(ROWS(E$76:E122)>E$75,\"\",INDEX($A$3:$A$70,SMALL(IF(E$3:E$70=\"\",ROW(E$3:E$70)-ROW(E$3)+1),ROWS(E$76:E122))))","v":""},{"$f":"IF(ROWS(F$76:F122)>F$75,\"\",INDEX($A$3:$A$70,SMALL(IF(F$3:F$70=\"\",ROW(F$3:F$70)-ROW(F$3)+1),ROWS(F$76:F122))))","v":"Student 54"},{"$f":"IF(ROWS(G$76:G122)>G$75,\"\",INDEX($A$3:$A$70,SMALL(IF(G$3:G$70=\"\",ROW(G$3:G$70)-ROW(G$3)+1),ROWS(G$76:G122))))","v":"Student 54"},{"$f":"IF(ROWS(H$76:H122)>H$75,\"\",INDEX($A$3:$A$70,SMALL(IF(H$3:H$70=\"\",ROW(H$3:H$70)-ROW(H$3)+1),ROWS(H$76:H122))))","v":"Student 48"},{"$f":"IF(ROWS(I$76:I122)>I$75,\"\",INDEX($A$3:$A$70,SMALL(IF(I$3:I$70=\"\",ROW(I$3:I$70)-ROW(I$3)+1),ROWS(I$76:I122))))","v":"Student 47"},{"$f":"IF(ROWS(J$76:J122)>J$75,\"\",INDEX($A$3:$A$70,SMALL(IF(J$3:J$70=\"\",ROW(J$3:J$70)-ROW(J$3)+1),ROWS(J$76:J122))))","v":""},{"$f":"IF(ROWS(K$76:K122)>K$75,\"\",INDEX($A$3:$A$70,SMALL(IF(K$3:K$70=\"\",ROW(K$3:K$70)-ROW(K$3)+1),ROWS(K$76:K122))))","v":""}]
[{"$f":"\"#\"&ROWS(A$76:A123)","v":"#48"},{"$f":"IF(ROWS(B$76:B123)>B$75,\"\",INDEX($A$3:$A$70,SMALL(IF(B$3:B$70=\"\",ROW(B$3:B$70)-ROW(B$3)+1),ROWS(B$76:B123))))","v":""},{"$f":"IF(ROWS(C$76:C123)>C$75,\"\",INDEX($A$3:$A$70,SMALL(IF(C$3:C$70=\"\",ROW(C$3:C$70)-ROW(C$3)+1),ROWS(C$76:C123))))","v":""},{"$f":"IF(ROWS(D$76:D123)>D$75,\"\",INDEX($A$3:$A$70,SMALL(IF(D$3:D$70=\"\",ROW(D$3:D$70)-ROW(D$3)+1),ROWS(D$76:D123))))","v":""},{"$f":"IF(ROWS(E$76:E123)>E$75,\"\",INDEX($A$3:$A$70,SMALL(IF(E$3:E$70=\"\",ROW(E$3:E$70)-ROW(E$3)+1),ROWS(E$76:E123))))","v":""},{"$f":"IF(ROWS(F$76:F123)>F$75,\"\",INDEX($A$3:$A$70,SMALL(IF(F$3:F$70=\"\",ROW(F$3:F$70)-ROW(F$3)+1),ROWS(F$76:F123))))","v":"Student 55"},{"$f":"IF(ROWS(G$76:G123)>G$75,\"\",INDEX($A$3:$A$70,SMALL(IF(G$3:G$70=\"\",ROW(G$3:G$70)-ROW(G$3)+1),ROWS(G$76:G123))))","v":"Student 55"},{"$f":"IF(ROWS(H$76:H123)>H$75,\"\",INDEX($A$3:$A$70,SMALL(IF(H$3:H$70=\"\",ROW(H$3:H$70)-ROW(H$3)+1),ROWS(H$76:H123))))","v":"Student 49"},{"$f":"IF(ROWS(I$76:I123)>I$75,\"\",INDEX($A$3:$A$70,SMALL(IF(I$3:I$70=\"\",ROW(I$3:I$70)-ROW(I$3)+1),ROWS(I$76:I123))))","v":"Student 48"},{"$f":"IF(ROWS(J$76:J123)>J$75,\"\",INDEX($A$3:$A$70,SMALL(IF(J$3:J$70=\"\",ROW(J$3:J$70)-ROW(J$3)+1),ROWS(J$76:J123))))","v":""},{"$f":"IF(ROWS(K$76:K123)>K$75,\"\",INDEX($A$3:$A$70,SMALL(IF(K$3:K$70=\"\",ROW(K$3:K$70)-ROW(K$3)+1),ROWS(K$76:K123))))","v":""}]
[{"$f":"\"#\"&ROWS(A$76:A124)","v":"#49"},{"$f":"IF(ROWS(B$76:B124)>B$75,\"\",INDEX($A$3:$A$70,SMALL(IF(B$3:B$70=\"\",ROW(B$3:B$70)-ROW(B$3)+1),ROWS(B$76:B124))))","v":""},{"$f":"IF(ROWS(C$76:C124)>C$75,\"\",INDEX($A$3:$A$70,SMALL(IF(C$3:C$70=\"\",ROW(C$3:C$70)-ROW(C$3)+1),ROWS(C$76:C124))))","v":""},{"$f":"IF(ROWS(D$76:D124)>D$75,\"\",INDEX($A$3:$A$70,SMALL(IF(D$3:D$70=\"\",ROW(D$3:D$70)-ROW(D$3)+1),ROWS(D$76:D124))))","v":""},{"$f":"IF(ROWS(E$76:E124)>E$75,\"\",INDEX($A$3:$A$70,SMALL(IF(E$3:E$70=\"\",ROW(E$3:E$70)-ROW(E$3)+1),ROWS(E$76:E124))))","v":""},{"$f":"IF(ROWS(F$76:F124)>F$75,\"\",INDEX($A$3:$A$70,SMALL(IF(F$3:F$70=\"\",ROW(F$3:F$70)-ROW(F$3)+1),ROWS(F$76:F124))))","v":"Student 56"},{"$f":"IF(ROWS(G$76:G124)>G$75,\"\",INDEX($A$3:$A$70,SMALL(IF(G$3:G$70=\"\",ROW(G$3:G$70)-ROW(G$3)+1),ROWS(G$76:G124))))","v":"Student 56"},{"$f":"IF(ROWS(H$76:H124)>H$75,\"\",INDEX($A$3:$A$70,SMALL(IF(H$3:H$70=\"\",ROW(H$3:H$70)-ROW(H$3)+1),ROWS(H$76:H124))))","v":"Student 51"},{"$f":"IF(ROWS(I$76:I124)>I$75,\"\",INDEX($A$3:$A$70,SMALL(IF(I$3:I$70=\"\",ROW(I$3:I$70)-ROW(I$3)+1),ROWS(I$76:I124))))","v":"Student 49"},{"$f":"IF(ROWS(J$76:J124)>J$75,\"\",INDEX($A$3:$A$70,SMALL(IF(J$3:J$70=\"\",ROW(J$3:J$70)-ROW(J$3)+1),ROWS(J$76:J124))))","v":""},{"$f":"IF(ROWS(K$76:K124)>K$75,\"\",INDEX($A$3:$A$70,SMALL(IF(K$3:K$70=\"\",ROW(K$3:K$70)-ROW(K$3)+1),ROWS(K$76:K124))))","v":""}]
[{"$f":"\"#\"&ROWS(A$76:A125)","v":"#50"},{"$f":"IF(ROWS(B$76:B125)>B$75,\"\",INDEX($A$3:$A$70,SMALL(IF(B$3:B$70=\"\",ROW(B$3:B$70)-ROW(B$3)+1),ROWS(B$76:B125))))","v":""},{"$f":"IF(ROWS(C$76:C125)>C$75,\"\",INDEX($A$3:$A$70,SMALL(IF(C$3:C$70=\"\",ROW(C$3:C$70)-ROW(C$3)+1),ROWS(C$76:C125))))","v":""},{"$f":"IF(ROWS(D$76:D125)>D$75,\"\",INDEX($A$3:$A$70,SMALL(IF(D$3:D$70=\"\",ROW(D$3:D$70)-ROW(D$3)+1),ROWS(D$76:D125))))","v":""},{"$f":"IF(ROWS(E$76:E125)>E$75,\"\",INDEX($A$3:$A$70,SMALL(IF(E$3:E$70=\"\",ROW(E$3:E$70)-ROW(E$3)+1),ROWS(E$76:E125))))","v":""},{"$f":"IF(ROWS(F$76:F125)>F$75,\"\",INDEX($A$3:$A$70,SMALL(IF(F$3:F$70=\"\",ROW(F$3:F$70)-ROW(F$3)+1),ROWS(F$76:F125))))","v":"Student 57"},{"$f":"IF(ROWS(G$76:G125)>G$75,\"\",INDEX($A$3:$A$70,SMALL(IF(G$3:G$70=\"\",ROW(G$3:G$70)-ROW(G$3)+1),ROWS(G$76:G125))))","v":"Student 57"},{"$f":"IF(ROWS(H$76:H125)>H$75,\"\",INDEX($A$3:$A$70,SMALL(IF(H$3:H$70=\"\",ROW(H$3:H$70)-ROW(H$3)+1),ROWS(H$76:H125))))","v":"Student 52"},{"$f":"IF(ROWS(I$76:I125)>I$75,\"\",INDEX($A$3:$A$70,SMALL(IF(I$3:I$70=\"\",ROW(I$3:I$70)-ROW(I$3)+1),ROWS(I$76:I125))))","v":"Student 50"},{"$f":"IF(ROWS(J$76:J125)>J$75,\"\",INDEX($A$3:$A$70,SMALL(IF(J$3:J$70=\"\",ROW(J$3:J$70)-ROW(J$3)+1),ROWS(J$76:J125))))","v":""},{"$f":"IF(ROWS(K$76:K125)>K$75,\"\",INDEX($A$3:$A$70,SMALL(IF(K$3:K$70=\"\",ROW(K$3:K$70)-ROW(K$3)+1),ROWS(K$76:K125))))","v":""}]
[{"$f":"\"#\"&ROWS(A$76:A126)","v":"#51"},{"$f":"IF(ROWS(B$76:B126)>B$75,\"\",INDEX($A$3:$A$70,SMALL(IF(B$3:B$70=\"\",ROW(B$3:B$70)-ROW(B$3)+1),ROWS(B$76:B126))))","v":""},{"$f":"IF(ROWS(C$76:C126)>C$75,\"\",INDEX($A$3:$A$70,SMALL(IF(C$3:C$70=\"\",ROW(C$3:C$70)-ROW(C$3)+1),ROWS(C$76:C126))))","v":""},{"$f":"IF(ROWS(D$76:D126)>D$75,\"\",INDEX($A$3:$A$70,SMALL(IF(D$3:D$70=\"\",ROW(D$3:D$70)-ROW(D$3)+1),ROWS(D$76:D126))))","v":""},{"$f":"IF(ROWS(E$76:E126)>E$75,\"\",INDEX($A$3:$A$70,SMALL(IF(E$3:E$70=\"\",ROW(E$3:E$70)-ROW(E$3)+1),ROWS(E$76:E126))))","v":""},{"$f":"IF(ROWS(F$76:F126)>F$75,\"\",INDEX($A$3:$A$70,SMALL(IF(F$3:F$70=\"\",ROW(F$3:F$70)-ROW(F$3)+1),ROWS(F$76:F126))))","v":"Student 58"},{"$f":"IF(ROWS(G$76:G126)>G$75,\"\",INDEX($A$3:$A$70,SMALL(IF(G$3:G$70=\"\",ROW(G$3:G$70)-ROW(G$3)+1),ROWS(G$76:G126))))","v":"Student 59"},{"$f":"IF(ROWS(H$76:H126)>H$75,\"\",INDEX($A$3:$A$70,SMALL(IF(H$3:H$70=\"\",ROW(H$3:H$70)-ROW(H$3)+1),ROWS(H$76:H126))))","v":"Student 54"},{"$f":"IF(ROWS(I$76:I126)>I$75,\"\",INDEX($A$3:$A$70,SMALL(IF(I$3:I$70=\"\",ROW(I$3:I$70)-ROW(I$3)+1),ROWS(I$76:I126))))","v":"Student 51"},{"$f":"IF(ROWS(J$76:J126)>J$75,\"\",INDEX($A$3:$A$70,SMALL(IF(J$3:J$70=\"\",ROW(J$3:J$70)-ROW(J$3)+1),ROWS(J$76:J126))))","v":""},{"$f":"IF(ROWS(K$76:K126)>K$75,\"\",INDEX($A$3:$A$70,SMALL(IF(K$3:K$70=\"\",ROW(K$3:K$70)-ROW(K$3)+1),ROWS(K$76:K126))))","v":""}]
[{"$f":"\"#\"&ROWS(A$76:A127)","v":"#52"},{"$f":"IF(ROWS(B$76:B127)>B$75,\"\",INDEX($A$3:$A$70,SMALL(IF(B$3:B$70=\"\",ROW(B$3:B$70)-ROW(B$3)+1),ROWS(B$76:B127))))","v":""},{"$f":"IF(ROWS(C$76:C127)>C$75,\"\",INDEX($A$3:$A$70,SMALL(IF(C$3:C$70=\"\",ROW(C$3:C$70)-ROW(C$3)+1),ROWS(C$76:C127))))","v":""},{"$f":"IF(ROWS(D$76:D127)>D$75,\"\",INDEX($A$3:$A$70,SMALL(IF(D$3:D$70=\"\",ROW(D$3:D$70)-ROW(D$3)+1),ROWS(D$76:D127))))","v":""},{"$f":"IF(ROWS(E$76:E127)>E$75,\"\",INDEX($A$3:$A$70,SMALL(IF(E$3:E$70=\"\",ROW(E$3:E$70)-ROW(E$3)+1),ROWS(E$76:E127))))","v":""},{"$f":"IF(ROWS(F$76:F127)>F$75,\"\",INDEX($A$3:$A$70,SMALL(IF(F$3:F$70=\"\",ROW(F$3:F$70)-ROW(F$3)+1),ROWS(F$76:F127))))","v":"Student 59"},{"$f":"IF(ROWS(G$76:G127)>G$75,\"\",INDEX($A$3:$A$70,SMALL(IF(G$3:G$70=\"\",ROW(G$3:G$70)-ROW(G$3)+1),ROWS(G$76:G127))))","v":"Student 60"},{"$f":"IF(ROWS(H$76:H127)>H$75,\"\",INDEX($A$3:$A$70,SMALL(IF(H$3:H$70=\"\",ROW(H$3:H$70)-ROW(H$3)+1),ROWS(H$76:H127))))","v":"Student 55"},{"$f":"IF(ROWS(I$76:I127)>I$75,\"\",INDEX($A$3:$A$70,SMALL(IF(I$3:I$70=\"\",ROW(I$3:I$70)-ROW(I$3)+1),ROWS(I$76:I127))))","v":"Student 52"},{"$f":"IF(ROWS(J$76:J127)>J$75,\"\",INDEX($A$3:$A$70,SMALL(IF(J$3:J$70=\"\",ROW(J$3:J$70)-ROW(J$3)+1),ROWS(J$76:J127))))","v":""},{"$f":"IF(ROWS(K$76:K127)>K$75,\"\",INDEX($A$3:$A$70,SMALL(IF(K$3:K$70=\"\",ROW(K$3:K$70)-ROW(K$3)+1),ROWS(K$76:K127))))","v":""}]
[{"$f":"\"#\"&ROWS(A$76:A128)","v":"#53"},{"$f":"IF(ROWS(B$76:B128)>B$75,\"\",INDEX($A$3:$A$70,SMALL(IF(B$3:B$70=\"\",ROW(B$3:B$70)-ROW(B$3)+1),ROWS(B$76:B128))))","v":""},{"$f":"IF(ROWS(C$76:C128)>C$75,\"\",INDEX($A$3:$A$70,SMALL(IF(C$3:C$70=\"\",ROW(C$3:C$70)-ROW(C$3)+1),ROWS(C$76:C128))))","v":""},{"$f":"IF(ROWS(D$76:D128)>D$75,\"\",INDEX($A$3:$A$70,SMALL(IF(D$3:D$70=\"\",ROW(D$3:D$70)-ROW(D$3)+1),ROWS(D$76:D128))))","v":""},{"$f":"IF(ROWS(E$76:E128)>E$75,\"\",INDEX($A$3:$A$70,SMALL(IF(E$3:E$70=\"\",ROW(E$3:E$70)-ROW(E$3)+1),ROWS(E$76:E128))))","v":""},{"$f":"IF(ROWS(F$76:F128)>F$75,\"\",INDEX($A$3:$A$70,SMALL(IF(F$3:F$70=\"\",ROW(F$3:F$70)-ROW(F$3)+1),ROWS(F$76:F128))))","v":"Student 60"},{"$f":"IF(ROWS(G$76:G128)>G$75,\"\",INDEX($A$3:$A$70,SMALL(IF(G$3:G$70=\"\",ROW(G$3:G$70)-ROW(G$3)+1),ROWS(G$76:G128))))","v":"Student 61"},{"$f":"IF(ROWS(H$76:H128)>H$75,\"\",INDEX($A$3:$A$70,SMALL(IF(H$3:H$70=\"\",ROW(H$3:H$70)-ROW(H$3)+1),ROWS(H$76:H128))))","v":"Student 56"},{"$f":"IF(ROWS(I$76:I128)>I$75,\"\",INDEX($A$3:$A$70,SMALL(IF(I$3:I$70=\"\",ROW(I$3:I$70)-ROW(I$3)+1),ROWS(I$76:I128))))","v":"Student 53"},{"$f":"IF(ROWS(J$76:J128)>J$75,\"\",INDEX($A$3:$A$70,SMALL(IF(J$3:J$70=\"\",ROW(J$3:J$70)-ROW(J$3)+1),ROWS(J$76:J128))))","v":""},{"$f":"IF(ROWS(K$76:K128)>K$75,\"\",INDEX($A$3:$A$70,SMALL(IF(K$3:K$70=\"\",ROW(K$3:K$70)-ROW(K$3)+1),ROWS(K$76:K128))))","v":""}]
[{"$f":"\"#\"&ROWS(A$76:A129)","v":"#54"},{"$f":"IF(ROWS(B$76:B129)>B$75,\"\",INDEX($A$3:$A$70,SMALL(IF(B$3:B$70=\"\",ROW(B$3:B$70)-ROW(B$3)+1),ROWS(B$76:B129))))","v":""},{"$f":"IF(ROWS(C$76:C129)>C$75,\"\",INDEX($A$3:$A$70,SMALL(IF(C$3:C$70=\"\",ROW(C$3:C$70)-ROW(C$3)+1),ROWS(C$76:C129))))","v":""},{"$f":"IF(ROWS(D$76:D129)>D$75,\"\",INDEX($A$3:$A$70,SMALL(IF(D$3:D$70=\"\",ROW(D$3:D$70)-ROW(D$3)+1),ROWS(D$76:D129))))","v":""},{"$f":"IF(ROWS(E$76:E129)>E$75,\"\",INDEX($A$3:$A$70,SMALL(IF(E$3:E$70=\"\",ROW(E$3:E$70)-ROW(E$3)+1),ROWS(E$76:E129))))","v":""},{"$f":"IF(ROWS(F$76:F129)>F$75,\"\",INDEX($A$3:$A$70,SMALL(IF(F$3:F$70=\"\",ROW(F$3:F$70)-ROW(F$3)+1),ROWS(F$76:F129))))","v":"Student 61"},{"$f":"IF(ROWS(G$76:G129)>G$75,\"\",INDEX($A$3:$A$70,SMALL(IF(G$3:G$70=\"\",ROW(G$3:G$70)-ROW(G$3)+1),ROWS(G$76:G129))))","v":"Student 62"},{"$f":"IF(ROWS(H$76:H129)>H$75,\"\",INDEX($A$3:$A$70,SMALL(IF(H$3:H$70=\"\",ROW(H$3:H$70)-ROW(H$3)+1),ROWS(H$76:H129))))","v":"Student 57"},{"$f":"IF(ROWS(I$76:I129)>I$75,\"\",INDEX($A$3:$A$70,SMALL(IF(I$3:I$70=\"\",ROW(I$3:I$70)-ROW(I$3)+1),ROWS(I$76:I129))))","v":"Student 54"},{"$f":"IF(ROWS(J$76:J129)>J$75,\"\",INDEX($A$3:$A$70,SMALL(IF(J$3:J$70=\"\",ROW(J$3:J$70)-ROW(J$3)+1),ROWS(J$76:J129))))","v":""},{"$f":"IF(ROWS(K$76:K129)>K$75,\"\",INDEX($A$3:$A$70,SMALL(IF(K$3:K$70=\"\",ROW(K$3:K$70)-ROW(K$3)+1),ROWS(K$76:K129))))","v":""}]
[{"$f":"\"#\"&ROWS(A$76:A130)","v":"#55"},{"$f":"IF(ROWS(B$76:B130)>B$75,\"\",INDEX($A$3:$A$70,SMALL(IF(B$3:B$70=\"\",ROW(B$3:B$70)-ROW(B$3)+1),ROWS(B$76:B130))))","v":""},{"$f":"IF(ROWS(C$76:C130)>C$75,\"\",INDEX($A$3:$A$70,SMALL(IF(C$3:C$70=\"\",ROW(C$3:C$70)-ROW(C$3)+1),ROWS(C$76:C130))))","v":""},{"$f":"IF(ROWS(D$76:D130)>D$75,\"\",INDEX($A$3:$A$70,SMALL(IF(D$3:D$70=\"\",ROW(D$3:D$70)-ROW(D$3)+1),ROWS(D$76:D130))))","v":""},{"$f":"IF(ROWS(E$76:E130)>E$75,\"\",INDEX($A$3:$A$70,SMALL(IF(E$3:E$70=\"\",ROW(E$3:E$70)-ROW(E$3)+1),ROWS(E$76:E130))))","v":""},{"$f":"IF(ROWS(F$76:F130)>F$75,\"\",INDEX($A$3:$A$70,SMALL(IF(F$3:F$70=\"\",ROW(F$3:F$70)-ROW(F$3)+1),ROWS(F$76:F130))))","v":"Student 62"},{"$f":"IF(ROWS(G$76:G130)>G$75,\"\",INDEX($A$3:$A$70,SMALL(IF(G$3:G$70=\"\",ROW(G$3:G$70)-ROW(G$3)+1),ROWS(G$76:G130))))","v":"Student 63"},{"$f":"IF(ROWS(H$76:H130)>H$75,\"\",INDEX($A$3:$A$70,SMALL(IF(H$3:H$70=\"\",ROW(H$3:H$70)-ROW(H$3)+1),ROWS(H$76:H130))))","v":"Student 58"},{"$f":"IF(ROWS(I$76:I130)>I$75,\"\",INDEX($A$3:$A$70,SMALL(IF(I$3:I$70=\"\",ROW(I$3:I$70)-ROW(I$3)+1),ROWS(I$76:I130))))","v":"Student 55"},{"$f":"IF(ROWS(J$76:J130)>J$75,\"\",INDEX($A$3:$A$70,SMALL(IF(J$3:J$70=\"\",ROW(J$3:J$70)-ROW(J$3)+1),ROWS(J$76:J130))))","v":""},{"$f":"IF(ROWS(K$76:K130)>K$75,\"\",INDEX($A$3:$A$70,SMALL(IF(K$3:K$70=\"\",ROW(K$3:K$70)-ROW(K$3)+1),ROWS(K$76:K130))))","v":""}]
[{"$f":"\"#\"&ROWS(A$76:A131)","v":"#56"},{"$f":"IF(ROWS(B$76:B131)>B$75,\"\",INDEX($A$3:$A$70,SMALL(IF(B$3:B$70=\"\",ROW(B$3:B$70)-ROW(B$3)+1),ROWS(B$76:B131))))","v":""},{"$f":"IF(ROWS(C$76:C131)>C$75,\"\",INDEX($A$3:$A$70,SMALL(IF(C$3:C$70=\"\",ROW(C$3:C$70)-ROW(C$3)+1),ROWS(C$76:C131))))","v":""},{"$f":"IF(ROWS(D$76:D131)>D$75,\"\",INDEX($A$3:$A$70,SMALL(IF(D$3:D$70=\"\",ROW(D$3:D$70)-ROW(D$3)+1),ROWS(D$76:D131))))","v":""},{"$f":"IF(ROWS(E$76:E131)>E$75,\"\",INDEX($A$3:$A$70,SMALL(IF(E$3:E$70=\"\",ROW(E$3:E$70)-ROW(E$3)+1),ROWS(E$76:E131))))","v":""},{"$f":"IF(ROWS(F$76:F131)>F$75,\"\",INDEX($A$3:$A$70,SMALL(IF(F$3:F$70=\"\",ROW(F$3:F$70)-ROW(F$3)+1),ROWS(F$76:F131))))","v":"Student 64"},{"$f":"IF(ROWS(G$76:G131)>G$75,\"\",INDEX($A$3:$A$70,SMALL(IF(G$3:G$70=\"\",ROW(G$3:G$70)-ROW(G$3)+1),ROWS(G$76:G131))))","v":"Student 64"},{"$f":"IF(ROWS(H$76:H131)>H$75,\"\",INDEX($A$3:$A$70,SMALL(IF(H$3:H$70=\"\",ROW(H$3:H$70)-ROW(H$3)+1),ROWS(H$76:H131))))","v":"Student 59"},{"$f":"IF(ROWS(I$76:I131)>I$75,\"\",INDEX($A$3:$A$70,SMALL(IF(I$3:I$70=\"\",ROW(I$3:I$70)-ROW(I$3)+1),ROWS(I$76:I131))))","v":"Student 56"},{"$f":"IF(ROWS(J$76:J131)>J$75,\"\",INDEX($A$3:$A$70,SMALL(IF(J$3:J$70=\"\",ROW(J$3:J$70)-ROW(J$3)+1),ROWS(J$76:J131))))","v":""},{"$f":"IF(ROWS(K$76:K131)>K$75,\"\",INDEX($A$3:$A$70,SMALL(IF(K$3:K$70=\"\",ROW(K$3:K$70)-ROW(K$3)+1),ROWS(K$76:K131))))","v":""}]
[{"$f":"\"#\"&ROWS(A$76:A132)","v":"#57"},{"$f":"IF(ROWS(B$76:B132)>B$75,\"\",INDEX($A$3:$A$70,SMALL(IF(B$3:B$70=\"\",ROW(B$3:B$70)-ROW(B$3)+1),ROWS(B$76:B132))))","v":""},{"$f":"IF(ROWS(C$76:C132)>C$75,\"\",INDEX($A$3:$A$70,SMALL(IF(C$3:C$70=\"\",ROW(C$3:C$70)-ROW(C$3)+1),ROWS(C$76:C132))))","v":""},{"$f":"IF(ROWS(D$76:D132)>D$75,\"\",INDEX($A$3:$A$70,SMALL(IF(D$3:D$70=\"\",ROW(D$3:D$70)-ROW(D$3)+1),ROWS(D$76:D132))))","v":""},{"$f":"IF(ROWS(E$76:E132)>E$75,\"\",INDEX($A$3:$A$70,SMALL(IF(E$3:E$70=\"\",ROW(E$3:E$70)-ROW(E$3)+1),ROWS(E$76:E132))))","v":""},{"$f":"IF(ROWS(F$76:F132)>F$75,\"\",INDEX($A$3:$A$70,SMALL(IF(F$3:F$70=\"\",ROW(F$3:F$70)-ROW(F$3)+1),ROWS(F$76:F132))))","v":"Student 65"},{"$f":"IF(ROWS(G$76:G132)>G$75,\"\",INDEX($A$3:$A$70,SMALL(IF(G$3:G$70=\"\",ROW(G$3:G$70)-ROW(G$3)+1),ROWS(G$76:G132))))","v":"Student 65"},{"$f":"IF(ROWS(H$76:H132)>H$75,\"\",INDEX($A$3:$A$70,SMALL(IF(H$3:H$70=\"\",ROW(H$3:H$70)-ROW(H$3)+1),ROWS(H$76:H132))))","v":"Student 60"},{"$f":"IF(ROWS(I$76:I132)>I$75,\"\",INDEX($A$3:$A$70,SMALL(IF(I$3:I$70=\"\",ROW(I$3:I$70)-ROW(I$3)+1),ROWS(I$76:I132))))","v":"Student 57"},{"$f":"IF(ROWS(J$76:J132)>J$75,\"\",INDEX($A$3:$A$70,SMALL(IF(J$3:J$70=\"\",ROW(J$3:J$70)-ROW(J$3)+1),ROWS(J$76:J132))))","v":""},{"$f":"IF(ROWS(K$76:K132)>K$75,\"\",INDEX($A$3:$A$70,SMALL(IF(K$3:K$70=\"\",ROW(K$3:K$70)-ROW(K$3)+1),ROWS(K$76:K132))))","v":""}]
[{"$f":"\"#\"&ROWS(A$76:A133)","v":"#58"},{"$f":"IF(ROWS(B$76:B133)>B$75,\"\",INDEX($A$3:$A$70,SMALL(IF(B$3:B$70=\"\",ROW(B$3:B$70)-ROW(B$3)+1),ROWS(B$76:B133))))","v":""},{"$f":"IF(ROWS(C$76:C133)>C$75,\"\",INDEX($A$3:$A$70,SMALL(IF(C$3:C$70=\"\",ROW(C$3:C$70)-ROW(C$3)+1),ROWS(C$76:C133))))","v":""},{"$f":"IF(ROWS(D$76:D133)>D$75,\"\",INDEX($A$3:$A$70,SMALL(IF(D$3:D$70=\"\",ROW(D$3:D$70)-ROW(D$3)+1),ROWS(D$76:D133))))","v":""},{"$f":"IF(ROWS(E$76:E133)>E$75,\"\",INDEX($A$3:$A$70,SMALL(IF(E$3:E$70=\"\",ROW(E$3:E$70)-ROW(E$3)+1),ROWS(E$76:E133))))","v":""},{"$f":"IF(ROWS(F$76:F133)>F$75,\"\",INDEX($A$3:$A$70,SMALL(IF(F$3:F$70=\"\",ROW(F$3:F$70)-ROW(F$3)+1),ROWS(F$76:F133))))","v":"Student 66"},{"$f":"IF(ROWS(G$76:G133)>G$75,\"\",INDEX($A$3:$A$70,SMALL(IF(G$3:G$70=\"\",ROW(G$3:G$70)-ROW(G$3)+1),ROWS(G$76:G133))))","v":"Student 66"},{"$f":"IF(ROWS(H$76:H133)>H$75,\"\",INDEX($A$3:$A$70,SMALL(IF(H$3:H$70=\"\",ROW(H$3:H$70)-ROW(H$3)+1),ROWS(H$76:H133))))","v":"Student 61"},{"$f":"IF(ROWS(I$76:I133)>I$75,\"\",INDEX($A$3:$A$70,SMALL(IF(I$3:I$70=\"\",ROW(I$3:I$70)-ROW(I$3)+1),ROWS(I$76:I133))))","v":"Student 58"},{"$f":"IF(ROWS(J$76:J133)>J$75,\"\",INDEX($A$3:$A$70,SMALL(IF(J$3:J$70=\"\",ROW(J$3:J$70)-ROW(J$3)+1),ROWS(J$76:J133))))","v":""},{"$f":"IF(ROWS(K$76:K133)>K$75,\"\",INDEX($A$3:$A$70,SMALL(IF(K$3:K$70=\"\",ROW(K$3:K$70)-ROW(K$3)+1),ROWS(K$76:K133))))","v":""}]
[{"$f":"\"#\"&ROWS(A$76:A134)","v":"#59"},{"$f":"IF(ROWS(B$76:B134)>B$75,\"\",INDEX($A$3:$A$70,SMALL(IF(B$3:B$70=\"\",ROW(B$3:B$70)-ROW(B$3)+1),ROWS(B$76:B134))))","v":""},{"$f":"IF(ROWS(C$76:C134)>C$75,\"\",INDEX($A$3:$A$70,SMALL(IF(C$3:C$70=\"\",ROW(C$3:C$70)-ROW(C$3)+1),ROWS(C$76:C134))))","v":""},{"$f":"IF(ROWS(D$76:D134)>D$75,\"\",INDEX($A$3:$A$70,SMALL(IF(D$3:D$70=\"\",ROW(D$3:D$70)-ROW(D$3)+1),ROWS(D$76:D134))))","v":""},{"$f":"IF(ROWS(E$76:E134)>E$75,\"\",INDEX($A$3:$A$70,SMALL(IF(E$3:E$70=\"\",ROW(E$3:E$70)-ROW(E$3)+1),ROWS(E$76:E134))))","v":""},{"$f":"IF(ROWS(F$76:F134)>F$75,\"\",INDEX($A$3:$A$70,SMALL(IF(F$3:F$70=\"\",ROW(F$3:F$70)-ROW(F$3)+1),ROWS(F$76:F134))))","v":"Student 68"},{"$f":"IF(ROWS(G$76:G134)>G$75,\"\",INDEX($A$3:$A$70,SMALL(IF(G$3:G$70=\"\",ROW(G$3:G$70)-ROW(G$3)+1),ROWS(G$76:G134))))","v":"Student 68"},{"$f":"IF(ROWS(H$76:H134)>H$75,\"\",INDEX($A$3:$A$70,SMALL(IF(H$3:H$70=\"\",ROW(H$3:H$70)-ROW(H$3)+1),ROWS(H$76:H134))))","v":"Student 62"},{"$f":"IF(ROWS(I$76:I134)>I$75,\"\",INDEX($A$3:$A$70,SMALL(IF(I$3:I$70=\"\",ROW(I$3:I$70)-ROW(I$3)+1),ROWS(I$76:I134))))","v":"Student 59"},{"$f":"IF(ROWS(J$76:J134)>J$75,\"\",INDEX($A$3:$A$70,SMALL(IF(J$3:J$70=\"\",ROW(J$3:J$70)-ROW(J$3)+1),ROWS(J$76:J134))))","v":""},{"$f":"IF(ROWS(K$76:K134)>K$75,\"\",INDEX($A$3:$A$70,SMALL(IF(K$3:K$70=\"\",ROW(K$3:K$70)-ROW(K$3)+1),ROWS(K$76:K134))))","v":""}]
[{"$f":"\"#\"&ROWS(A$76:A135)","v":"#60"},{"$f":"IF(ROWS(B$76:B135)>B$75,\"\",INDEX($A$3:$A$70,SMALL(IF(B$3:B$70=\"\",ROW(B$3:B$70)-ROW(B$3)+1),ROWS(B$76:B135))))","v":""},{"$f":"IF(ROWS(C$76:C135)>C$75,\"\",INDEX($A$3:$A$70,SMALL(IF(C$3:C$70=\"\",ROW(C$3:C$70)-ROW(C$3)+1),ROWS(C$76:C135))))","v":""},{"$f":"IF(ROWS(D$76:D135)>D$75,\"\",INDEX($A$3:$A$70,SMALL(IF(D$3:D$70=\"\",ROW(D$3:D$70)-ROW(D$3)+1),ROWS(D$76:D135))))","v":""},{"$f":"IF(ROWS(E$76:E135)>E$75,\"\",INDEX($A$3:$A$70,SMALL(IF(E$3:E$70=\"\",ROW(E$3:E$70)-ROW(E$3)+1),ROWS(E$76:E135))))","v":""},{"$f":"IF(ROWS(F$76:F135)>F$75,\"\",INDEX($A$3:$A$70,SMALL(IF(F$3:F$70=\"\",ROW(F$3:F$70)-ROW(F$3)+1),ROWS(F$76:F135))))","v":""},{"$f":"IF(ROWS(G$76:G135)>G$75,\"\",INDEX($A$3:$A$70,SMALL(IF(G$3:G$70=\"\",ROW(G$3:G$70)-ROW(G$3)+1),ROWS(G$76:G135))))","v":""},{"$f":"IF(ROWS(H$76:H135)>H$75,\"\",INDEX($A$3:$A$70,SMALL(IF(H$3:H$70=\"\",ROW(H$3:H$70)-ROW(H$3)+1),ROWS(H$76:H135))))","v":"Student 63"},{"$f":"IF(ROWS(I$76:I135)>I$75,\"\",INDEX($A$3:$A$70,SMALL(IF(I$3:I$70=\"\",ROW(I$3:I$70)-ROW(I$3)+1),ROWS(I$76:I135))))","v":"Student 60"},{"$f":"IF(ROWS(J$76:J135)>J$75,\"\",INDEX($A$3:$A$70,SMALL(IF(J$3:J$70=\"\",ROW(J$3:J$70)-ROW(J$3)+1),ROWS(J$76:J135))))","v":""},{"$f":"IF(ROWS(K$76:K135)>K$75,\"\",INDEX($A$3:$A$70,SMALL(IF(K$3:K$70=\"\",ROW(K$3:K$70)-ROW(K$3)+1),ROWS(K$76:K135))))","v":""}]
[{"$f":"\"#\"&ROWS(A$76:A136)","v":"#61"},{"$f":"IF(ROWS(B$76:B136)>B$75,\"\",INDEX($A$3:$A$70,SMALL(IF(B$3:B$70=\"\",ROW(B$3:B$70)-ROW(B$3)+1),ROWS(B$76:B136))))","v":""},{"$f":"IF(ROWS(C$76:C136)>C$75,\"\",INDEX($A$3:$A$70,SMALL(IF(C$3:C$70=\"\",ROW(C$3:C$70)-ROW(C$3)+1),ROWS(C$76:C136))))","v":""},{"$f":"IF(ROWS(D$76:D136)>D$75,\"\",INDEX($A$3:$A$70,SMALL(IF(D$3:D$70=\"\",ROW(D$3:D$70)-ROW(D$3)+1),ROWS(D$76:D136))))","v":""},{"$f":"IF(ROWS(E$76:E136)>E$75,\"\",INDEX($A$3:$A$70,SMALL(IF(E$3:E$70=\"\",ROW(E$3:E$70)-ROW(E$3)+1),ROWS(E$76:E136))))","v":""},{"$f":"IF(ROWS(F$76:F136)>F$75,\"\",INDEX($A$3:$A$70,SMALL(IF(F$3:F$70=\"\",ROW(F$3:F$70)-ROW(F$3)+1),ROWS(F$76:F136))))","v":""},{"$f":"IF(ROWS(G$76:G136)>G$75,\"\",INDEX($A$3:$A$70,SMALL(IF(G$3:G$70=\"\",ROW(G$3:G$70)-ROW(G$3)+1),ROWS(G$76:G136))))","v":""},{"$f":"IF(ROWS(H$76:H136)>H$75,\"\",INDEX($A$3:$A$70,SMALL(IF(H$3:H$70=\"\",ROW(H$3:H$70)-ROW(H$3)+1),ROWS(H$76:H136))))","v":"Student 64"},{"$f":"IF(ROWS(I$76:I136)>I$75,\"\",INDEX($A$3:$A$70,SMALL(IF(I$3:I$70=\"\",ROW(I$3:I$70)-ROW(I$3)+1),ROWS(I$76:I136))))","v":"Student 61"},{"$f":"IF(ROWS(J$76:J136)>J$75,\"\",INDEX($A$3:$A$70,SMALL(IF(J$3:J$70=\"\",ROW(J$3:J$70)-ROW(J$3)+1),ROWS(J$76:J136))))","v":""},{"$f":"IF(ROWS(K$76:K136)>K$75,\"\",INDEX($A$3:$A$70,SMALL(IF(K$3:K$70=\"\",ROW(K$3:K$70)-ROW(K$3)+1),ROWS(K$76:K136))))","v":""}]
[{"$f":"\"#\"&ROWS(A$76:A137)","v":"#62"},{"$f":"IF(ROWS(B$76:B137)>B$75,\"\",INDEX($A$3:$A$70,SMALL(IF(B$3:B$70=\"\",ROW(B$3:B$70)-ROW(B$3)+1),ROWS(B$76:B137))))","v":""},{"$f":"IF(ROWS(C$76:C137)>C$75,\"\",INDEX($A$3:$A$70,SMALL(IF(C$3:C$70=\"\",ROW(C$3:C$70)-ROW(C$3)+1),ROWS(C$76:C137))))","v":""},{"$f":"IF(ROWS(D$76:D137)>D$75,\"\",INDEX($A$3:$A$70,SMALL(IF(D$3:D$70=\"\",ROW(D$3:D$70)-ROW(D$3)+1),ROWS(D$76:D137))))","v":""},{"$f":"IF(ROWS(E$76:E137)>E$75,\"\",INDEX($A$3:$A$70,SMALL(IF(E$3:E$70=\"\",ROW(E$3:E$70)-ROW(E$3)+1),ROWS(E$76:E137))))","v":""},{"$f":"IF(ROWS(F$76:F137)>F$75,\"\",INDEX($A$3:$A$70,SMALL(IF(F$3:F$70=\"\",ROW(F$3:F$70)-ROW(F$3)+1),ROWS(F$76:F137))))","v":""},{"$f":"IF(ROWS(G$76:G137)>G$75,\"\",INDEX($A$3:$A$70,SMALL(IF(G$3:G$70=\"\",ROW(G$3:G$70)-ROW(G$3)+1),ROWS(G$76:G137))))","v":""},{"$f":"IF(ROWS(H$76:H137)>H$75,\"\",INDEX($A$3:$A$70,SMALL(IF(H$3:H$70=\"\",ROW(H$3:H$70)-ROW(H$3)+1),ROWS(H$76:H137))))","v":"Student 65"},{"$f":"IF(ROWS(I$76:I137)>I$75,\"\",INDEX($A$3:$A$70,SMALL(IF(I$3:I$70=\"\",ROW(I$3:I$70)-ROW(I$3)+1),ROWS(I$76:I137))))","v":"Student 62"},{"$f":"IF(ROWS(J$76:J137)>J$75,\"\",INDEX($A$3:$A$70,SMALL(IF(J$3:J$70=\"\",ROW(J$3:J$70)-ROW(J$3)+1),ROWS(J$76:J137))))","v":""},{"$f":"IF(ROWS(K$76:K137)>K$75,\"\",INDEX($A$3:$A$70,SMALL(IF(K$3:K$70=\"\",ROW(K$3:K$70)-ROW(K$3)+1),ROWS(K$76:K137))))","v":""}]
[{"$f":"\"#\"&ROWS(A$76:A138)","v":"#63"},{"$f":"IF(ROWS(B$76:B138)>B$75,\"\",INDEX($A$3:$A$70,SMALL(IF(B$3:B$70=\"\",ROW(B$3:B$70)-ROW(B$3)+1),ROWS(B$76:B138))))","v":""},{"$f":"IF(ROWS(C$76:C138)>C$75,\"\",INDEX($A$3:$A$70,SMALL(IF(C$3:C$70=\"\",ROW(C$3:C$70)-ROW(C$3)+1),ROWS(C$76:C138))))","v":""},{"$f":"IF(ROWS(D$76:D138)>D$75,\"\",INDEX($A$3:$A$70,SMALL(IF(D$3:D$70=\"\",ROW(D$3:D$70)-ROW(D$3)+1),ROWS(D$76:D138))))","v":""},{"$f":"IF(ROWS(E$76:E138)>E$75,\"\",INDEX($A$3:$A$70,SMALL(IF(E$3:E$70=\"\",ROW(E$3:E$70)-ROW(E$3)+1),ROWS(E$76:E138))))","v":""},{"$f":"IF(ROWS(F$76:F138)>F$75,\"\",INDEX($A$3:$A$70,SMALL(IF(F$3:F$70=\"\",ROW(F$3:F$70)-ROW(F$3)+1),ROWS(F$76:F138))))","v":""},{"$f":"IF(ROWS(G$76:G138)>G$75,\"\",INDEX($A$3:$A$70,SMALL(IF(G$3:G$70=\"\",ROW(G$3:G$70)-ROW(G$3)+1),ROWS(G$76:G138))))","v":""},{"$f":"IF(ROWS(H$76:H138)>H$75,\"\",INDEX($A$3:$A$70,SMALL(IF(H$3:H$70=\"\",ROW(H$3:H$70)-ROW(H$3)+1),ROWS(H$76:H138))))","v":"Student 66"},{"$f":"IF(ROWS(I$76:I138)>I$75,\"\",INDEX($A$3:$A$70,SMALL(IF(I$3:I$70=\"\",ROW(I$3:I$70)-ROW(I$3)+1),ROWS(I$76:I138))))","v":"Student 63"},{"$f":"IF(ROWS(J$76:J138)>J$75,\"\",INDEX($A$3:$A$70,SMALL(IF(J$3:J$70=\"\",ROW(J$3:J$70)-ROW(J$3)+1),ROWS(J$76:J138))))","v":""},{"$f":"IF(ROWS(K$76:K138)>K$75,\"\",INDEX($A$3:$A$70,SMALL(IF(K$3:K$70=\"\",ROW(K$3:K$70)-ROW(K$3)+1),ROWS(K$76:K138))))","v":""}]
[{"$f":"\"#\"&ROWS(A$76:A139)","v":"#64"},{"$f":"IF(ROWS(B$76:B139)>B$75,\"\",INDEX($A$3:$A$70,SMALL(IF(B$3:B$70=\"\",ROW(B$3:B$70)-ROW(B$3)+1),ROWS(B$76:B139))))","v":""},{"$f":"IF(ROWS(C$76:C139)>C$75,\"\",INDEX($A$3:$A$70,SMALL(IF(C$3:C$70=\"\",ROW(C$3:C$70)-ROW(C$3)+1),ROWS(C$76:C139))))","v":""},{"$f":"IF(ROWS(D$76:D139)>D$75,\"\",INDEX($A$3:$A$70,SMALL(IF(D$3:D$70=\"\",ROW(D$3:D$70)-ROW(D$3)+1),ROWS(D$76:D139))))","v":""},{"$f":"IF(ROWS(E$76:E139)>E$75,\"\",INDEX($A$3:$A$70,SMALL(IF(E$3:E$70=\"\",ROW(E$3:E$70)-ROW(E$3)+1),ROWS(E$76:E139))))","v":""},{"$f":"IF(ROWS(F$76:F139)>F$75,\"\",INDEX($A$3:$A$70,SMALL(IF(F$3:F$70=\"\",ROW(F$3:F$70)-ROW(F$3)+1),ROWS(F$76:F139))))","v":""},{"$f":"IF(ROWS(G$76:G139)>G$75,\"\",INDEX($A$3:$A$70,SMALL(IF(G$3:G$70=\"\",ROW(G$3:G$70)-ROW(G$3)+1),ROWS(G$76:G139))))","v":""},{"$f":"IF(ROWS(H$76:H139)>H$75,\"\",INDEX($A$3:$A$70,SMALL(IF(H$3:H$70=\"\",ROW(H$3:H$70)-ROW(H$3)+1),ROWS(H$76:H139))))","v":"Student 67"},{"$f":"IF(ROWS(I$76:I139)>I$75,\"\",INDEX($A$3:$A$70,SMALL(IF(I$3:I$70=\"\",ROW(I$3:I$70)-ROW(I$3)+1),ROWS(I$76:I139))))","v":"Student 64"},{"$f":"IF(ROWS(J$76:J139)>J$75,\"\",INDEX($A$3:$A$70,SMALL(IF(J$3:J$70=\"\",ROW(J$3:J$70)-ROW(J$3)+1),ROWS(J$76:J139))))","v":""},{"$f":"IF(ROWS(K$76:K139)>K$75,\"\",INDEX($A$3:$A$70,SMALL(IF(K$3:K$70=\"\",ROW(K$3:K$70)-ROW(K$3)+1),ROWS(K$76:K139))))","v":""}]
[{"$f":"\"#\"&ROWS(A$76:A140)","v":"#65"},{"$f":"IF(ROWS(B$76:B140)>B$75,\"\",INDEX($A$3:$A$70,SMALL(IF(B$3:B$70=\"\",ROW(B$3:B$70)-ROW(B$3)+1),ROWS(B$76:B140))))","v":""},{"$f":"IF(ROWS(C$76:C140)>C$75,\"\",INDEX($A$3:$A$70,SMALL(IF(C$3:C$70=\"\",ROW(C$3:C$70)-ROW(C$3)+1),ROWS(C$76:C140))))","v":""},{"$f":"IF(ROWS(D$76:D140)>D$75,\"\",INDEX($A$3:$A$70,SMALL(IF(D$3:D$70=\"\",ROW(D$3:D$70)-ROW(D$3)+1),ROWS(D$76:D140))))","v":""},{"$f":"IF(ROWS(E$76:E140)>E$75,\"\",INDEX($A$3:$A$70,SMALL(IF(E$3:E$70=\"\",ROW(E$3:E$70)-ROW(E$3)+1),ROWS(E$76:E140))))","v":""},{"$f":"IF(ROWS(F$76:F140)>F$75,\"\",INDEX($A$3:$A$70,SMALL(IF(F$3:F$70=\"\",ROW(F$3:F$70)-ROW(F$3)+1),ROWS(F$76:F140))))","v":""},{"$f":"IF(ROWS(G$76:G140)>G$75,\"\",INDEX($A$3:$A$70,SMALL(IF(G$3:G$70=\"\",ROW(G$3:G$70)-ROW(G$3)+1),ROWS(G$76:G140))))","v":""},{"$f":"IF(ROWS(H$76:H140)>H$75,\"\",INDEX($A$3:$A$70,SMALL(IF(H$3:H$70=\"\",ROW(H$3:H$70)-ROW(H$3)+1),ROWS(H$76:H140))))","v":"Student 68"},{"$f":"IF(ROWS(I$76:I140)>I$75,\"\",INDEX($A$3:$A$70,SMALL(IF(I$3:I$70=\"\",ROW(I$3:I$70)-ROW(I$3)+1),ROWS(I$76:I140))))","v":"Student 65"},{"$f":"IF(ROWS(J$76:J140)>J$75,\"\",INDEX($A$3:$A$70,SMALL(IF(J$3:J$70=\"\",ROW(J$3:J$70)-ROW(J$3)+1),ROWS(J$76:J140))))","v":""},{"$f":"IF(ROWS(K$76:K140)>K$75,\"\",INDEX($A$3:$A$70,SMALL(IF(K$3:K$70=\"\",ROW(K$3:K$70)-ROW(K$3)+1),ROWS(K$76:K140))))","v":""}]
[{"$f":"\"#\"&ROWS(A$76:A141)","v":"#66"},{"$f":"IF(ROWS(B$76:B141)>B$75,\"\",INDEX($A$3:$A$70,SMALL(IF(B$3:B$70=\"\",ROW(B$3:B$70)-ROW(B$3)+1),ROWS(B$76:B141))))","v":""},{"$f":"IF(ROWS(C$76:C141)>C$75,\"\",INDEX($A$3:$A$70,SMALL(IF(C$3:C$70=\"\",ROW(C$3:C$70)-ROW(C$3)+1),ROWS(C$76:C141))))","v":""},{"$f":"IF(ROWS(D$76:D141)>D$75,\"\",INDEX($A$3:$A$70,SMALL(IF(D$3:D$70=\"\",ROW(D$3:D$70)-ROW(D$3)+1),ROWS(D$76:D141))))","v":""},{"$f":"IF(ROWS(E$76:E141)>E$75,\"\",INDEX($A$3:$A$70,SMALL(IF(E$3:E$70=\"\",ROW(E$3:E$70)-ROW(E$3)+1),ROWS(E$76:E141))))","v":""},{"$f":"IF(ROWS(F$76:F141)>F$75,\"\",INDEX($A$3:$A$70,SMALL(IF(F$3:F$70=\"\",ROW(F$3:F$70)-ROW(F$3)+1),ROWS(F$76:F141))))","v":""},{"$f":"IF(ROWS(G$76:G141)>G$75,\"\",INDEX($A$3:$A$70,SMALL(IF(G$3:G$70=\"\",ROW(G$3:G$70)-ROW(G$3)+1),ROWS(G$76:G141))))","v":""},{"$f":"IF(ROWS(H$76:H141)>H$75,\"\",INDEX($A$3:$A$70,SMALL(IF(H$3:H$70=\"\",ROW(H$3:H$70)-ROW(H$3)+1),ROWS(H$76:H141))))","v":""},{"$f":"IF(ROWS(I$76:I141)>I$75,\"\",INDEX($A$3:$A$70,SMALL(IF(I$3:I$70=\"\",ROW(I$3:I$70)-ROW(I$3)+1),ROWS(I$76:I141))))","v":"Student 66"},{"$f":"IF(ROWS(J$76:J141)>J$75,\"\",INDEX($A$3:$A$70,SMALL(IF(J$3:J$70=\"\",ROW(J$3:J$70)-ROW(J$3)+1),ROWS(J$76:J141))))","v":""},{"$f":"IF(ROWS(K$76:K141)>K$75,\"\",INDEX($A$3:$A$70,SMALL(IF(K$3:K$70=\"\",ROW(K$3:K$70)-ROW(K$3)+1),ROWS(K$76:K141))))","v":""}]
[{"$f":"\"#\"&ROWS(A$76:A142)","v":"#67"},{"$f":"IF(ROWS(B$76:B142)>B$75,\"\",INDEX($A$3:$A$70,SMALL(IF(B$3:B$70=\"\",ROW(B$3:B$70)-ROW(B$3)+1),ROWS(B$76:B142))))","v":""},{"$f":"IF(ROWS(C$76:C142)>C$75,\"\",INDEX($A$3:$A$70,SMALL(IF(C$3:C$70=\"\",ROW(C$3:C$70)-ROW(C$3)+1),ROWS(C$76:C142))))","v":""},{"$f":"IF(ROWS(D$76:D142)>D$75,\"\",INDEX($A$3:$A$70,SMALL(IF(D$3:D$70=\"\",ROW(D$3:D$70)-ROW(D$3)+1),ROWS(D$76:D142))))","v":""},{"$f":"IF(ROWS(E$76:E142)>E$75,\"\",INDEX($A$3:$A$70,SMALL(IF(E$3:E$70=\"\",ROW(E$3:E$70)-ROW(E$3)+1),ROWS(E$76:E142))))","v":""},{"$f":"IF(ROWS(F$76:F142)>F$75,\"\",INDEX($A$3:$A$70,SMALL(IF(F$3:F$70=\"\",ROW(F$3:F$70)-ROW(F$3)+1),ROWS(F$76:F142))))","v":""},{"$f":"IF(ROWS(G$76:G142)>G$75,\"\",INDEX($A$3:$A$70,SMALL(IF(G$3:G$70=\"\",ROW(G$3:G$70)-ROW(G$3)+1),ROWS(G$76:G142))))","v":""},{"$f":"IF(ROWS(H$76:H142)>H$75,\"\",INDEX($A$3:$A$70,SMALL(IF(H$3:H$70=\"\",ROW(H$3:H$70)-ROW(H$3)+1),ROWS(H$76:H142))))","v":""},{"$f":"IF(ROWS(I$76:I142)>I$75,\"\",INDEX($A$3:$A$70,SMALL(IF(I$3:I$70=\"\",ROW(I$3:I$70)-ROW(I$3)+1),ROWS(I$76:I142))))","v":"Student 67"},{"$f":"IF(ROWS(J$76:J142)>J$75,\"\",INDEX($A$3:$A$70,SMALL(IF(J$3:J$70=\"\",ROW(J$3:J$70)-ROW(J$3)+1),ROWS(J$76:J142))))","v":""},{"$f":"IF(ROWS(K$76:K142)>K$75,\"\",INDEX($A$3:$A$70,SMALL(IF(K$3:K$70=\"\",ROW(K$3:K$70)-ROW(K$3)+1),ROWS(K$76:K142))))","v":""}]
[{"$f":"\"#\"&ROWS(A$76:A143)","v":"#68"},{"$f":"IF(ROWS(B$76:B143)>B$75,\"\",INDEX($A$3:$A$70,SMALL(IF(B$3:B$70=\"\",ROW(B$3:B$70)-ROW(B$3)+1),ROWS(B$76:B143))))","v":""},{"$f":"IF(ROWS(C$76:C143)>C$75,\"\",INDEX($A$3:$A$70,SMALL(IF(C$3:C$70=\"\",ROW(C$3:C$70)-ROW(C$3)+1),ROWS(C$76:C143))))","v":""},{"$f":"IF(ROWS(D$76:D143)>D$75,\"\",INDEX($A$3:$A$70,SMALL(IF(D$3:D$70=\"\",ROW(D$3:D$70)-ROW(D$3)+1),ROWS(D$76:D143))))","v":""},{"$f":"IF(ROWS(E$76:E143)>E$75,\"\",INDEX($A$3:$A$70,SMALL(IF(E$3:E$70=\"\",ROW(E$3:E$70)-ROW(E$3)+1),ROWS(E$76:E143))))","v":""},{"$f":"IF(ROWS(F$76:F143)>F$75,\"\",INDEX($A$3:$A$70,SMALL(IF(F$3:F$70=\"\",ROW(F$3:F$70)-ROW(F$3)+1),ROWS(F$76:F143))))","v":""},{"$f":"IF(ROWS(G$76:G143)>G$75,\"\",INDEX($A$3:$A$70,SMALL(IF(G$3:G$70=\"\",ROW(G$3:G$70)-ROW(G$3)+1),ROWS(G$76:G143))))","v":""},{"$f":"IF(ROWS(H$76:H143)>H$75,\"\",INDEX($A$3:$A$70,SMALL(IF(H$3:H$70=\"\",ROW(H$3:H$70)-ROW(H$3)+1),ROWS(H$76:H143))))","v":""},{"$f":"IF(ROWS(I$76:I143)>I$75,\"\",INDEX($A$3:$A$70,SMALL(IF(I$3:I$70=\"\",ROW(I$3:I$70)-ROW(I$3)+1),ROWS(I$76:I143))))","v":"Student 68"},{"$f":"IF(ROWS(J$76:J143)>J$75,\"\",INDEX($A$3:$A$70,SMALL(IF(J$3:J$70=\"\",ROW(J$3:J$70)-ROW(J$3)+1),ROWS(J$76:J143))))","v":""},{"$f":"IF(ROWS(K$76:K143)>K$75,\"\",INDEX($A$3:$A$70,SMALL(IF(K$3:K$70=\"\",ROW(K$3:K$70)-ROW(K$3)+1),ROWS(K$76:K143))))","v":""}]

{"sheet":"(608)","index":1,"n_rows":19,"n_cols":12,"rows_kept":19,"cut":false,"hidden":false,"merged":[]}
["Period","Per 1","Per 2","Per 3","Per 4",null,"Goal: List Periods that Students have free"]
["Name/Time","08:00:00","10:00:00","12:00:00","14:00:00",null,null,"# Free Periods","Per?","Per?","Per?","Per?"]
["Sioux","Busn 210",null,"Busn 210",null,null,{"$f":"A3","v":"Sioux"}]
["Sue",null,"Busn 216",null,"Acc 121",null,"Sue"]
["Jo","Acc 121","Busn 216","Busn 210","Busn 216",null,"Jo"]
["Joe",null,"Busn 101",null,null,null,"Joe"]
["Chin","Busn 214",null,"Acc 121",null,null,"Chin"]
["Loung",null,"Busn 101","Busn 216","Acc 121",null,"Loung"]
[]
["Goal: List Students With Free Periods"]
[null,"Per 1","Per 2","Per 3","Per 4",null,null,"To Enter Array Formula use: Ctrl = Shift + Enter"]
[null,{"$f":"B2","v":"08:00:00"},{"$f":"C2","v":"10:00:00"},{"$f":"D2","v":"12:00:00"},{"$f":"E2","v":"14:00:00"},null,null,"For more about array formulas see:"]
["# Free Periods",null,null,null,null,null,null,"Excel Magic Trick 358: Part 1: Return Multiple Items From One "]
[{"$f":"ROWS(A$14:A14)","v":1},null,null,null,null,null,null,"Excel Magic Trick 359: Part 2: Return Multiple Items From One "]
[{"$f":"ROWS(A$14:A15)","v":2},null,null,null,null,null,null,"Excel Magic Trick 360: Part 3: Return Multiple Items From One "]
[{"$f":"ROWS(A$14:A16)","v":3},null,null,null,null,null,null,"Excel Magic Trick 478: Reverse Two Way Lookup For Date and Time Column and Row Headers"]
[{"$f":"ROWS(A$14:A17)","v":4},null,null,null,null,null,null,"Excel Magic Trick 479: Reverse Two Way Lookup - Robust Formula for Duplicate Situations"]
[{"$f":"ROWS(A$14:A18)","v":5},null,null,null,null,null,null,"Playlist of how to do array formulas:"]
[{"$f":"ROWS(A$14:A19)","v":6},null,null,null,null,null,null,"Excel Array Formulas Beg - Advanced"]

{"sheet":"(608an)","index":2,"n_rows":19,"n_cols":12,"rows_kept":19,"cut":false,"hidden":false,"merged":[]}
["Period","Per 1","Per 2","Per 3","Per 4",null,"Goal: List Periods that Students have free"]
["Name/Time","08:00:00","10:00:00","12:00:00","14:00:00",null,null,"# Free Periods","Per?","Per?","Per?","Per?"]
["Sioux","Busn 210",null,"Busn 210",null,null,{"$f":"A3","v":"Sioux"},{"$f":"COUNTIF(B3:E3,\"\")","v":2},{"$f":"IF(COLUMNS($I3:I3)>$H3,\"\",INDEX($B$1:$E$1&\"-\"&TEXT($B$2:$E$2,\"h:mm AM/PM\"),SMALL(IF($B3:$E3=\"\",COLUMN($B3:$E3)-COLUMN($B3)+1),COLUMNS($I3:I3))))","v":"Per 2-10:00 AM"},{"$f":"IF(COLUMNS($I3:J3)>$H3,\"\",INDEX($B$1:$E$1&\"-\"&TEXT($B$2:$E$2,\"h:mm AM/PM\"),SMALL(IF($B3:$E3=\"\",COLUMN($B3:$E3)-COLUMN($B3)+1),COLUMNS($I3:J3))))","v":"Per 4-2:00 PM"},{"$f":"IF(COLUMNS($I3:K3)>$H3,\"\",INDEX($B$1:$E$1&\"-\"&TEXT($B$2:$E$2,\"h:mm AM/PM\"),SMALL(IF($B3:$E3=\"\",COLUMN($B3:$E3)-COLUMN($B3)+1),COLUMNS($I3:K3))))","v":""},{"$f":"IF(COLUMNS($I3:L3)>$H3,\"\",INDEX($B$1:$E$1&\"-\"&TEXT($B$2:$E$2,\"h:mm AM/PM\"),SMALL(IF($B3:$E3=\"\",COLUMN($B3:$E3)-COLUMN($B3)+1),COLUMNS($I3:L3))))","v":""}]
["Sue",null,"Busn 216",null,"Acc 121",null,"Sue",{"$f":"COUNTIF(B4:E4,\"\")","v":2},{"$f":"IF(COLUMNS($I4:I4)>$H4,\"\",INDEX($B$1:$E$1&\"-\"&TEXT($B$2:$E$2,\"h:mm AM/PM\"),SMALL(IF($B4:$E4=\"\",COLUMN($B4:$E4)-COLUMN($B4)+1),COLUMNS($I4:I4))))","v":"Per 1-8:00 AM"},{"$f":"IF(COLUMNS($I4:J4)>$H4,\"\",INDEX($B$1:$E$1&\"-\"&TEXT($B$2:$E$2,\"h:mm AM/PM\"),SMALL(IF($B4:$E4=\"\",COLUMN($B4:$E4)-COLUMN($B4)+1),COLUMNS($I4:J4))))","v":"Per 3-12:00 PM"},{"$f":"IF(COLUMNS($I4:K4)>$H4,\"\",INDEX($B$1:$E$1&\"-\"&TEXT($B$2:$E$2,\"h:mm AM/PM\"),SMALL(IF($B4:$E4=\"\",COLUMN($B4:$E4)-COLUMN($B4)+1),COLUMNS($I4:K4))))","v":""},{"$f":"IF(COLUMNS($I4:L4)>$H4,\"\",INDEX($B$1:$E$1&\"-\"&TEXT($B$2:$E$2,\"h:mm AM/PM\"),SMALL(IF($B4:$E4=\"\",COLUMN($B4:$E4)-COLUMN($B4)+1),COLUMNS($I4:L4))))","v":""}]
["Jo",null,"Busn 216","Busn 210","Busn 216",null,"Jo",1,{"$f":"IF(COLUMNS($I5:I5)>$H5,\"\",INDEX($B$1:$E$1&\"-\"&TEXT($B$2:$E$2,\"h:mm AM/PM\"),SMALL(IF($B5:$E5=\"\",COLUMN($B5:$E5)-COLUMN($B5)+1),COLUMNS($I5:I5))))","v":"Per 1-8:00 AM"},{"$f":"IF(COLUMNS($I5:J5)>$H5,\"\",INDEX($B$1:$E$1&\"-\"&TEXT($B$2:$E$2,\"h:mm AM/PM\"),SMALL(IF($B5:$E5=\"\",COLUMN($B5:$E5)-COLUMN($B5)+1),COLUMNS($I5:J5))))","v":""},{"$f":"IF(COLUMNS($I5:K5)>$H5,\"\",INDEX($B$1:$E$1&\"-\"&TEXT($B$2:$E$2,\"h:mm AM/PM\"),SMALL(IF($B5:$E5=\"\",COLUMN($B5:$E5)-COLUMN($B5)+1),COLUMNS($I5:K5))))","v":""},{"$f":"IF(COLUMNS($I5:L5)>$H5,\"\",INDEX($B$1:$E$1&\"-\"&TEXT($B$2:$E$2,\"h:mm AM/PM\"),SMALL(IF($B5:$E5=\"\",COLUMN($B5:$E5)-COLUMN($B5)+1),COLUMNS($I5:L5))))","v":""}]
["Joe",null,"Busn 101",null,null,null,"Joe",3,{"$f":"IF(COLUMNS($I6:I6)>$H6,\"\",INDEX($B$1:$E$1&\"-\"&TEXT($B$2:$E$2,\"h:mm AM/PM\"),SMALL(IF($B6:$E6=\"\",COLUMN($B6:$E6)-COLUMN($B6)+1),COLUMNS($I6:I6))))","v":"Per 1-8:00 AM"},{"$f":"IF(COLUMNS($I6:J6)>$H6,\"\",INDEX($B$1:$E$1&\"-\"&TEXT($B$2:$E$2,\"h:mm AM/PM\"),SMALL(IF($B6:$E6=\"\",COLUMN($B6:$E6)-COLUMN($B6)+1),COLUMNS($I6:J6))))","v":"Per 3-12:00 PM"},{"$f":"IF(COLUMNS($I6:K6)>$H6,\"\",INDEX($B$1:$E$1&\"-\"&TEXT($B$2:$E$2,\"h:mm AM/PM\"),SMALL(IF($B6:$E6=\"\",COLUMN($B6:$E6)-COLUMN($B6)+1),COLUMNS($I6:K6))))","v":"Per 4-2:00 PM"},{"$f":"IF(COLUMNS($I6:L6)>$H6,\"\",INDEX($B$1:$E$1&\"-\"&TEXT($B$2:$E$2,\"h:mm AM/PM\"),SMALL(IF($B6:$E6=\"\",COLUMN($B6:$E6)-COLUMN($B6)+1),COLUMNS($I6:L6))))","v":""}]
["Chin","Busn 214",null,"Acc 121","Busn 216",null,"Chin",1,{"$f":"IF(COLUMNS($I7:I7)>$H7,\"\",INDEX($B$1:$E$1&\"-\"&TEXT($B$2:$E$2,\"h:mm AM/PM\"),SMALL(IF($B7:$E7=\"\",COLUMN($B7:$E7)-COLUMN($B7)+1),COLUMNS($I7:I7))))","v":"Per 2-10:00 AM"},{"$f":"IF(COLUMNS($I7:J7)>$H7,\"\",INDEX($B$1:$E$1&\"-\"&TEXT($B$2:$E$2,\"h:mm AM/PM\"),SMALL(IF($B7:$E7=\"\",COLUMN($B7:$E7)-COLUMN($B7)+1),COLUMNS($I7:J7))))","v":""},{"$f":"IF(COLUMNS($I7:K7)>$H7,\"\",INDEX($B$1:$E$1&\"-\"&TEXT($B$2:$E$2,\"h:mm AM/PM\"),SMALL(IF($B7:$E7=\"\",COLUMN($B7:$E7)-COLUMN($B7)+1),COLUMNS($I7:K7))))","v":""},{"$f":"IF(COLUMNS($I7:L7)>$H7,\"\",INDEX($B$1:$E$1&\"-\"&TEXT($B$2:$E$2,\"h:mm AM/PM\"),SMALL(IF($B7:$E7=\"\",COLUMN($B7:$E7)-COLUMN($B7)+1),COLUMNS($I7:L7))))","v":""}]
["Loung","Busn 214","Busn 101","Busn 216","Acc 121",null,"Loung",0,{"$f":"IF(COLUMNS($I8:I8)>$H8,\"\",INDEX($B$1:$E$1&\"-\"&TEXT($B$2:$E$2,\"h:mm AM/PM\"),SMALL(IF($B8:$E8=\"\",COLUMN($B8:$E8)-COLUMN($B8)+1),COLUMNS($I8:I8))))","v":""},{"$f":"IF(COLUMNS($I8:J8)>$H8,\"\",INDEX($B$1:$E$1&\"-\"&TEXT($B$2:$E$2,\"h:mm AM/PM\"),SMALL(IF($B8:$E8=\"\",COLUMN($B8:$E8)-COLUMN($B8)+1),COLUMNS($I8:J8))))","v":""},{"$f":"IF(COLUMNS($I8:K8)>$H8,\"\",INDEX($B$1:$E$1&\"-\"&TEXT($B$2:$E$2,\"h:mm AM/PM\"),SMALL(IF($B8:$E8=\"\",COLUMN($B8:$E8)-COLUMN($B8)+1),COLUMNS($I8:K8))))","v":""},{"$f":"IF(COLUMNS($I8:L8)>$H8,\"\",INDEX($B$1:$E$1&\"-\"&TEXT($B$2:$E$2,\"h:mm AM/PM\"),SMALL(IF($B8:$E8=\"\",COLUMN($B8:$E8)-COLUMN($B8)+1),COLUMNS($I8:L8))))","v":""}]
[]
["Goal: List Students With Free Periods"]
[null,"Per 1","Per 2","Per 3","Per 4",null,null,"To Enter Array Formula use: Ctrl = Shift + Enter"]
[null,{"$f":"B2","v":"08:00:00"},{"$f":"C2","v":"10:00:00"},{"$f":"D2","v":"12:00:00"},{"$f":"E2","v":"14:00:00"},null,null,"For more about array formulas see:"]
["# Free Periods",{"$f":"COUNTIF(B3:B8,\"\")","v":3},2,2,2,null,null,"Excel Magic Trick 358: Part 1: Return Multiple Items From One "]
[{"$f":"ROWS(A$14:A14)","v":1},{"$f":"IF(ROWS(B$14:B14)>B$13,\"\",INDEX($A$3:$A$8,SMALL(IF(B$3:B$8=\"\",ROW(B$3:B$8)-ROW(B$3)+1),ROWS(B$14:B14))))","v":"Sue"},{"$f":"IF(ROWS(C$14:C14)>C$13,\"\",INDEX($A$3:$A$8,SMALL(IF(C$3:C$8=\"\",ROW(C$3:C$8)-ROW(C$3)+1),ROWS(C$14:C14))))","v":"Sioux"},{"$f":"IF(ROWS(D$14:D14)>D$13,\"\",INDEX($A$3:$A$8,SMALL(IF(D$3:D$8=\"\",ROW(D$3:D$8)-ROW(D$3)+1),ROWS(D$14:D14))))","v":"Sue"},{"$f":"IF(ROWS(E$14:E14)>E$13,\"\",INDEX($A$3:$A$8,SMALL(IF(E$3:E$8=\"\",ROW(E$3:E$8)-ROW(E$3)+1),ROWS(E$14:E14))))","v":"Sioux"},null,null,"Excel Magic Trick 359: Part 2: Return Multiple Items From One "]
[{"$f":"ROWS(A$14:A15)","v":2},{"$f":"IF(ROWS(B$14:B15)>B$13,\"\",INDEX($A$3:$A$8,SMALL(IF(B$3:B$8=\"\",ROW(B$3:B$8)-ROW(B$3)+1),ROWS(B$14:B15))))","v":"Jo"},{"$f":"IF(ROWS(C$14:C15)>C$13,\"\",INDEX($A$3:$A$8,SMALL(IF(C$3:C$8=\"\",ROW(C$3:C$8)-ROW(C$3)+1),ROWS(C$14:C15))))","v":"Chin"},{"$f":"IF(ROWS(D$14:D15)>D$13,\"\",INDEX($A$3:$A$8,SMALL(IF(D$3:D$8=\"\",ROW(D$3:D$8)-ROW(D$3)+1),ROWS(D$14:D15))))","v":"Joe"},{"$f":"IF(ROWS(E$14:E15)>E$13,\"\",INDEX($A$3:$A$8,SMALL(IF(E$3:E$8=\"\",ROW(E$3:E$8)-ROW(E$3)+1),ROWS(E$14:E15))))","v":"Joe"},null,null,"Excel Magic Trick 360: Part 3: Return Multiple Items From One "]
[{"$f":"ROWS(A$14:A16)","v":3},{"$f":"IF(ROWS(B$14:B16)>B$13,\"\",INDEX($A$3:$A$8,SMALL(IF(B$3:B$8=\"\",ROW(B$3:B$8)-ROW(B$3)+1),ROWS(B$14:B16))))","v":"Joe"},{"$f":"IF(ROWS(C$14:C16)>C$13,\"\",INDEX($A$3:$A$8,SMALL(IF(C$3:C$8=\"\",ROW(C$3:C$8)-ROW(C$3)+1),ROWS(C$14:C16))))","v":""},{"$f":"IF(ROWS(D$14:D16)>D$13,\"\",INDEX($A$3:$A$8,SMALL(IF(D$3:D$8=\"\",ROW(D$3:D$8)-ROW(D$3)+1),ROWS(D$14:D16))))","v":""},{"$f":"IF(ROWS(E$14:E16)>E$13,\"\",INDEX($A$3:$A$8,SMALL(IF(E$3:E$8=\"\",ROW(E$3:E$8)-ROW(E$3)+1),ROWS(E$14:E16))))","v":""},null,null,"Excel Magic Trick 478: Reverse Two Way Lookup For Date and Time Column and Row Headers"]
[{"$f":"ROWS(A$14:A17)","v":4},{"$f":"IF(ROWS(B$14:B17)>B$13,\"\",INDEX($A$3:$A$8,SMALL(IF(B$3:B$8=\"\",ROW(B$3:B$8)-ROW(B$3)+1),ROWS(B$14:B17))))","v":""},{"$f":"IF(ROWS(C$14:C17)>C$13,\"\",INDEX($A$3:$A$8,SMALL(IF(C$3:C$8=\"\",ROW(C$3:C$8)-ROW(C$3)+1),ROWS(C$14:C17))))","v":""},{"$f":"IF(ROWS(D$14:D17)>D$13,\"\",INDEX($A$3:$A$8,SMALL(IF(D$3:D$8=\"\",ROW(D$3:D$8)-ROW(D$3)+1),ROWS(D$14:D17))))","v":""},{"$f":"IF(ROWS(E$14:E17)>E$13,\"\",INDEX($A$3:$A$8,SMALL(IF(E$3:E$8=\"\",ROW(E$3:E$8)-ROW(E$3)+1),ROWS(E$14:E17))))","v":""},null,null,"Excel Magic Trick 479: Reverse Two Way Lookup - Robust Formula for Duplicate Situations"]
[{"$f":"ROWS(A$14:A18)","v":5},{"$f":"IF(ROWS(B$14:B18)>B$13,\"\",INDEX($A$3:$A$8,SMALL(IF(B$3:B$8=\"\",ROW(B$3:B$8)-ROW(B$3)+1),ROWS(B$14:B18))))","v":""},{"$f":"IF(ROWS(C$14:C18)>C$13,\"\",INDEX($A$3:$A$8,SMALL(IF(C$3:C$8=\"\",ROW(C$3:C$8)-ROW(C$3)+1),ROWS(C$14:C18))))","v":""},{"$f":"IF(ROWS(D$14:D18)>D$13,\"\",INDEX($A$3:$A$8,SMALL(IF(D$3:D$8=\"\",ROW(D$3:D$8)-ROW(D$3)+1),ROWS(D$14:D18))))","v":""},{"$f":"IF(ROWS(E$14:E18)>E$13,\"\",INDEX($A$3:$A$8,SMALL(IF(E$3:E$8=\"\",ROW(E$3:E$8)-ROW(E$3)+1),ROWS(E$14:E18))))","v":""},null,null,"Playlist of how to do array formulas:"]
[{"$f":"ROWS(A$14:A19)","v":6},{"$f":"IF(ROWS(B$14:B19)>B$13,\"\",INDEX($A$3:$A$8,SMALL(IF(B$3:B$8=\"\",ROW(B$3:B$8)-ROW(B$3)+1),ROWS(B$14:B19))))","v":""},{"$f":"IF(ROWS(C$14:C19)>C$13,\"\",INDEX($A$3:$A$8,SMALL(IF(C$3:C$8=\"\",ROW(C$3:C$8)-ROW(C$3)+1),ROWS(C$14:C19))))","v":""},{"$f":"IF(ROWS(D$14:D19)>D$13,\"\",INDEX($A$3:$A$8,SMALL(IF(D$3:D$8=\"\",ROW(D$3:D$8)-ROW(D$3)+1),ROWS(D$14:D19))))","v":""},{"$f":"IF(ROWS(E$14:E19)>E$13,\"\",INDEX($A$3:$A$8,SMALL(IF(E$3:E$8=\"\",ROW(E$3:E$8)-ROW(E$3)+1),ROWS(E$14:E19))))","v":""},null,null,"Excel Array Formulas Beg - Advanced"]

{"sheet":"(609)","index":3,"n_rows":19,"n_cols":12,"rows_kept":19,"cut":false,"hidden":false,"merged":[]}
["Period","Per 1","Per 2","Per 3","Per 4",null,"Goal: List Periods that Students have free"]
["Name/Time","08:00:00","10:00:00","12:00:00","14:00:00",null,null,"# Free Periods","Per?","Per?","Per?","Per?"]
["Sioux","Busn 210",null,"Busn 210",null,null,{"$f":"A3","v":"Sioux"}]
["Sue",null,"Busn 216",null,"Acc 121",null,"Sue"]
["Jo","Acc 121",null,"Busn 210","Busn 216",null,"Jo"]
["Joe","Busn 214","Busn 101",null,null,null,"Joe"]
["Chin","Busn 214",null,"Acc 121",null,null,"Chin"]
["Loung",null,"Busn 101","Busn 216","Acc 121",null,"Loung"]
[]
["Goal: List Students With Free Periods"]
[null,"Per 1","Per 2","Per 3","Per 4",null,null,"To Enter Array Formula use: Ctrl = Shift + Enter"]
[null,{"$f":"B2","v":"08:00:00"},{"$f":"C2","v":"10:00:00"},{"$f":"D2","v":"12:00:00"},{"$f":"E2","v":"14:00:00"},null,null,"For more about array formulas see:"]
["# Free Periods",{"$f":"COUNTIF(B3:B8,\"\")","v":2},3,2,3,null,null,"Excel Magic Trick 358: Part 1: Return Multiple Items From One "]
[{"$f":"ROWS(A$14:A14)","v":1},{"$f":"IF(ROWS(B$14:B14)>B$13,\"\",INDEX($A$3:$A$8,SMALL(IF(B$3:B$8=\"\",ROW(B$3:B$8)-ROW(B$3)+1),ROWS(B$14:B14))))","v":"Sue"},{"$f":"IF(ROWS(C$14:C14)>C$13,\"\",INDEX($A$3:$A$8,SMALL(IF(C$3:C$8=\"\",ROW(C$3:C$8)-ROW(C$3)+1),ROWS(C$14:C14))))","v":"Sioux"},{"$f":"IF(ROWS(D$14:D14)>D$13,\"\",INDEX($A$3:$A$8,SMALL(IF(D$3:D$8=\"\",ROW(D$3:D$8)-ROW(D$3)+1),ROWS(D$14:D14))))","v":"Sue"},{"$f":"IF(ROWS(E$14:E14)>E$13,\"\",INDEX($A$3:$A$8,SMALL(IF(E$3:E$8=\"\",ROW(E$3:E$8)-ROW(E$3)+1),ROWS(E$14:E14))))","v":"Sioux"},null,null,"Excel Magic Trick 359: Part 2: Return Multiple Items From One "]
[{"$f":"ROWS(A$14:A15)","v":2},{"$f":"IF(ROWS(B$14:B15)>B$13,\"\",INDEX($A$3:$A$8,SMALL(IF(B$3:B$8=\"\",ROW(B$3:B$8)-ROW(B$3)+1),ROWS(B$14:B15))))","v":"Loung"},{"$f":"IF(ROWS(C$14:C15)>C$13,\"\",INDEX($A$3:$A$8,SMALL(IF(C$3:C$8=\"\",ROW(C$3:C$8)-ROW(C$3)+1),ROWS(C$14:C15))))","v":"Jo"},{"$f":"IF(ROWS(D$14:D15)>D$13,\"\",INDEX($A$3:$A$8,SMALL(IF(D$3:D$8=\"\",ROW(D$3:D$8)-ROW(D$3)+1),ROWS(D$14:D15))))","v":"Joe"},{"$f":"IF(ROWS(E$14:E15)>E$13,\"\",INDEX($A$3:$A$8,SMALL(IF(E$3:E$8=\"\",ROW(E$3:E$8)-ROW(E$3)+1),ROWS(E$14:E15))))","v":"Joe"},null,null,"Excel Magic Trick 360: Part 3: Return Multiple Items From One "]
[{"$f":"ROWS(A$14:A16)","v":3},{"$f":"IF(ROWS(B$14:B16)>B$13,\"\",INDEX($A$3:$A$8,SMALL(IF(B$3:B$8=\"\",ROW(B$3:B$8)-ROW(B$3)+1),ROWS(B$14:B16))))","v":""},{"$f":"IF(ROWS(C$14:C16)>C$13,\"\",INDEX($A$3:$A$8,SMALL(IF(C$3:C$8=\"\",ROW(C$3:C$8)-ROW(C$3)+1),ROWS(C$14:C16))))","v":"Chin"},{"$f":"IF(ROWS(D$14:D16)>D$13,\"\",INDEX($A$3:$A$8,SMALL(IF(D$3:D$8=\"\",ROW(D$3:D$8)-ROW(D$3)+1),ROWS(D$14:D16))))","v":""},{"$f":"IF(ROWS(E$14:E16)>E$13,\"\",INDEX($A$3:$A$8,SMALL(IF(E$3:E$8=\"\",ROW(E$3:E$8)-ROW(E$3)+1),ROWS(E$14:E16))))","v":"Chin"},null,null,"Excel Magic Trick 478: Reverse Two Way Lookup For Date and Time Column and Row Headers"]
[{"$f":"ROWS(A$14:A17)","v":4},{"$f":"IF(ROWS(B$14:B17)>B$13,\"\",INDEX($A$3:$A$8,SMALL(IF(B$3:B$8=\"\",ROW(B$3:B$8)-ROW(B$3)+1),ROWS(B$14:B17))))","v":""},{"$f":"IF(ROWS(C$14:C17)>C$13,\"\",INDEX($A$3:$A$8,SMALL(IF(C$3:C$8=\"\",ROW(C$3:C$8)-ROW(C$3)+1),ROWS(C$14:C17))))","v":""},{"$f":"IF(ROWS(D$14:D17)>D$13,\"\",INDEX($A$3:$A$8,SMALL(IF(D$3:D$8=\"\",ROW(D$3:D$8)-ROW(D$3)+1),ROWS(D$14:D17))))","v":""},{"$f":"IF(ROWS(E$14:E17)>E$13,\"\",INDEX($A$3:$A$8,SMALL(IF(E$3:E$8=\"\",ROW(E$3:E$8)-ROW(E$3)+1),ROWS(E$14:E17))))","v":""},null,null,"Excel Magic Trick 479: Reverse Two Way Lookup - Robust Formula for Duplicate Situations"]
[{"$f":"ROWS(A$14:A18)","v":5},{"$f":"IF(ROWS(B$14:B18)>B$13,\"\",INDEX($A$3:$A$8,SMALL(IF(B$3:B$8=\"\",ROW(B$3:B$8)-ROW(B$3)+1),ROWS(B$14:B18))))","v":""},{"$f":"IF(ROWS(C$14:C18)>C$13,\"\",INDEX($A$3:$A$8,SMALL(IF(C$3:C$8=\"\",ROW(C$3:C$8)-ROW(C$3)+1),ROWS(C$14:C18))))","v":""},{"$f":"IF(ROWS(D$14:D18)>D$13,\"\",INDEX($A$3:$A$8,SMALL(IF(D$3:D$8=\"\",ROW(D$3:D$8)-ROW(D$3)+1),ROWS(D$14:D18))))","v":""},{"$f":"IF(ROWS(E$14:E18)>E$13,\"\",INDEX($A$3:$A$8,SMALL(IF(E$3:E$8=\"\",ROW(E$3:E$8)-ROW(E$3)+1),ROWS(E$14:E18))))","v":""},null,null,"Playlist of how to do array formulas:"]
[{"$f":"ROWS(A$14:A19)","v":6},{"$f":"IF(ROWS(B$14:B19)>B$13,\"\",INDEX($A$3:$A$8,SMALL(IF(B$3:B$8=\"\",ROW(B$3:B$8)-ROW(B$3)+1),ROWS(B$14:B19))))","v":""},{"$f":"IF(ROWS(C$14:C19)>C$13,\"\",INDEX($A$3:$A$8,SMALL(IF(C$3:C$8=\"\",ROW(C$3:C$8)-ROW(C$3)+1),ROWS(C$14:C19))))","v":""},{"$f":"IF(ROWS(D$14:D19)>D$13,\"\",INDEX($A$3:$A$8,SMALL(IF(D$3:D$8=\"\",ROW(D$3:D$8)-ROW(D$3)+1),ROWS(D$14:D19))))","v":""},{"$f":"IF(ROWS(E$14:E19)>E$13,\"\",INDEX($A$3:$A$8,SMALL(IF(E$3:E$8=\"\",ROW(E$3:E$8)-ROW(E$3)+1),ROWS(E$14:E19))))","v":""},null,null,"Excel Array Formulas Beg - Advanced"]

{"sheet":"(609an)","index":4,"n_rows":19,"n_cols":12,"rows_kept":19,"cut":false,"hidden":false,"merged":[]}
["Period","Per 1","Per 2","Per 3","Per 4",null,"Goal: List Periods that Students have free"]
["Name/Time","08:00:00","10:00:00","12:00:00","14:00:00",null,null,"# Free Periods","Per?","Per?","Per?","Per?"]
["Sioux","Busn 210",null,"Busn 210",null,null,{"$f":"A3","v":"Sioux"},{"$f":"COUNTIF(B3:E3,\"\")","v":2},{"$f":"IF(COLUMNS($I3:I3)>$H3,\"\",INDEX($B$1:$E$1&\"-\"&TEXT($B$2:$E$2,\"h:mm AM/PM\"),SMALL(IF($B3:$E3=\"\",COLUMN($B3:$E3)-COLUMN($B3)+1),COLUMNS($I3:I3))))","v":"Per 2-10:00 AM"},{"$f":"IF(COLUMNS($I3:J3)>$H3,\"\",INDEX($B$1:$E$1&\"-\"&TEXT($B$2:$E$2,\"h:mm AM/PM\"),SMALL(IF($B3:$E3=\"\",COLUMN($B3:$E3)-COLUMN($B3)+1),COLUMNS($I3:J3))))","v":"Per 4-2:00 PM"},{"$f":"IF(COLUMNS($I3:K3)>$H3,\"\",INDEX($B$1:$E$1&\"-\"&TEXT($B$2:$E$2,\"h:mm AM/PM\"),SMALL(IF($B3:$E3=\"\",COLUMN($B3:$E3)-COLUMN($B3)+1),COLUMNS($I3:K3))))","v":""},{"$f":"IF(COLUMNS($I3:L3)>$H3,\"\",INDEX($B$1:$E$1&\"-\"&TEXT($B$2:$E$2,\"h:mm AM/PM\"),SMALL(IF($B3:$E3=\"\",COLUMN($B3:$E3)-COLUMN($B3)+1),COLUMNS($I3:L3))))","v":""}]
["Sue",null,"Busn 216",null,"Acc 121",null,"Sue",{"$f":"COUNTIF(B4:E4,\"\")","v":2},{"$f":"IF(COLUMNS($I4:I4)>$H4,\"\",INDEX($B$1:$E$1&\"-\"&TEXT($B$2:$E$2,\"h:mm AM/PM\"),SMALL(IF($B4:$E4=\"\",COLUMN($B4:$E4)-COLUMN($B4)+1),COLUMNS($I4:I4))))","v":"Per 1-8:00 AM"},{"$f":"IF(COLUMNS($I4:J4)>$H4,\"\",INDEX($B$1:$E$1&\"-\"&TEXT($B$2:$E$2,\"h:mm AM/PM\"),SMALL(IF($B4:$E4=\"\",COLUMN($B4:$E4)-COLUMN($B4)+1),COLUMNS($I4:J4))))","v":"Per 3-12:00 PM"},{"$f":"IF(COLUMNS($I4:K4)>$H4,\"\",INDEX($B$1:$E$1&\"-\"&TEXT($B$2:$E$2,\"h:mm AM/PM\"),SMALL(IF($B4:$E4=\"\",COLUMN($B4:$E4)-COLUMN($B4)+1),COLUMNS($I4:K4))))","v":""},{"$f":"IF(COLUMNS($I4:L4)>$H4,\"\",INDEX($B$1:$E$1&\"-\"&TEXT($B$2:$E$2,\"h:mm AM/PM\"),SMALL(IF($B4:$E4=\"\",COLUMN($B4:$E4)-COLUMN($B4)+1),COLUMNS($I4:L4))))","v":""}]
["Jo","Acc 121",null,"Busn 210","Busn 216",null,"Jo",1,{"$f":"IF(COLUMNS($I5:I5)>$H5,\"\",INDEX($B$1:$E$1&\"-\"&TEXT($B$2:$E$2,\"h:mm AM/PM\"),SMALL(IF($B5:$E5=\"\",COLUMN($B5:$E5)-COLUMN($B5)+1),COLUMNS($I5:I5))))","v":"Per 2-10:00 AM"},{"$f":"IF(COLUMNS($I5:J5)>$H5,\"\",INDEX($B$1:$E$1&\"-\"&TEXT($B$2:$E$2,\"h:mm AM/PM\"),SMALL(IF($B5:$E5=\"\",COLUMN($B5:$E5)-COLUMN($B5)+1),COLUMNS($I5:J5))))","v":""},{"$f":"IF(COLUMNS($I5:K5)>$H5,\"\",INDEX($B$1:$E$1&\"-\"&TEXT($B$2:$E$2,\"h:mm AM/PM\"),SMALL(IF($B5:$E5=\"\",COLUMN($B5:$E5)-COLUMN($B5)+1),COLUMNS($I5:K5))))","v":""},{"$f":"IF(COLUMNS($I5:L5)>$H5,\"\",INDEX($B$1:$E$1&\"-\"&TEXT($B$2:$E$2,\"h:mm AM/PM\"),SMALL(IF($B5:$E5=\"\",COLUMN($B5:$E5)-COLUMN($B5)+1),COLUMNS($I5:L5))))","v":""}]
["Joe","Busn 214","Busn 101",null,null,null,"Joe",2,{"$f":"IF(COLUMNS($I6:I6)>$H6,\"\",INDEX($B$1:$E$1&\"-\"&TEXT($B$2:$E$2,\"h:mm AM/PM\"),SMALL(IF($B6:$E6=\"\",COLUMN($B6:$E6)-COLUMN($B6)+1),COLUMNS($I6:I6))))","v":"Per 3-12:00 PM"},{"$f":"IF(COLUMNS($I6:J6)>$H6,\"\",INDEX($B$1:$E$1&\"-\"&TEXT($B$2:$E$2,\"h:mm AM/PM\"),SMALL(IF($B6:$E6=\"\",COLUMN($B6:$E6)-COLUMN($B6)+1),COLUMNS($I6:J6))))","v":"Per 4-2:00 PM"},{"$f":"IF(COLUMNS($I6:K6)>$H6,\"\",INDEX($B$1:$E$1&\"-\"&TEXT($B$2:$E$2,\"h:mm AM/PM\"),SMALL(IF($B6:$E6=\"\",COLUMN($B6:$E6)-COLUMN($B6)+1),COLUMNS($I6:K6))))","v":""},{"$f":"IF(COLUMNS($I6:L6)>$H6,\"\",INDEX($B$1:$E$1&\"-\"&TEXT($B$2:$E$2,\"h:mm AM/PM\"),SMALL(IF($B6:$E6=\"\",COLUMN($B6:$E6)-COLUMN($B6)+1),COLUMNS($I6:L6))))","v":""}]
["Chin","Busn 214",null,"Acc 121",null,null,"Chin",2,{"$f":"IF(COLUMNS($I7:I7)>$H7,\"\",INDEX($B$1:$E$1&\"-\"&TEXT($B$2:$E$2,\"h:mm AM/PM\"),SMALL(IF($B7:$E7=\"\",COLUMN($B7:$E7)-COLUMN($B7)+1),COLUMNS($I7:I7))))","v":"Per 2-10:00 AM"},{"$f":"IF(COLUMNS($I7:J7)>$H7,\"\",INDEX($B$1:$E$1&\"-\"&TEXT($B$2:$E$2,\"h:mm AM/PM\"),SMALL(IF($B7:$E7=\"\",COLUMN($B7:$E7)-COLUMN($B7)+1),COLUMNS($I7:J7))))","v":"Per 4-2:00 PM"},{"$f":"IF(COLUMNS($I7:K7)>$H7,\"\",INDEX($B$1:$E$1&\"-\"&TEXT($B$2:$E$2,\"h:mm AM/PM\"),SMALL(IF($B7:$E7=\"\",COLUMN($B7:$E7)-COLUMN($B7)+1),COLUMNS($I7:K7))))","v":""},{"$f":"IF(COLUMNS($I7:L7)>$H7,\"\",INDEX($B$1:$E$1&\"-\"&TEXT($B$2:$E$2,\"h:mm AM/PM\"),SMALL(IF($B7:$E7=\"\",COLUMN($B7:$E7)-COLUMN($B7)+1),COLUMNS($I7:L7))))","v":""}]
["Loung",null,"Busn 101","Busn 216","Acc 121",null,"Loung",1,{"$f":"IF(COLUMNS($I8:I8)>$H8,\"\",INDEX($B$1:$E$1&\"-\"&TEXT($B$2:$E$2,\"h:mm AM/PM\"),SMALL(IF($B8:$E8=\"\",COLUMN($B8:$E8)-COLUMN($B8)+1),COLUMNS($I8:I8))))","v":"Per 1-8:00 AM"},{"$f":"IF(COLUMNS($I8:J8)>$H8,\"\",INDEX($B$1:$E$1&\"-\"&TEXT($B$2:$E$2,\"h:mm AM/PM\"),SMALL(IF($B8:$E8=\"\",COLUMN($B8:$E8)-COLUMN($B8)+1),COLUMNS($I8:J8))))","v":""},{"$f":"IF(COLUMNS($I8:K8)>$H8,\"\",INDEX($B$1:$E$1&\"-\"&TEXT($B$2:$E$2,\"h:mm AM/PM\"),SMALL(IF($B8:$E8=\"\",COLUMN($B8:$E8)-COLUMN($B8)+1),COLUMNS($I8:K8))))","v":""},{"$f":"IF(COLUMNS($I8:L8)>$H8,\"\",INDEX($B$1:$E$1&\"-\"&TEXT($B$2:$E$2,\"h:mm AM/PM\"),SMALL(IF($B8:$E8=\"\",COLUMN($B8:$E8)-COLUMN($B8)+1),COLUMNS($I8:L8))))","v":""}]
[]
["Goal: List Students With Free Periods"]
[null,"Per 1","Per 2","Per 3","Per 4",null,null,"To Enter Array Formula use: Ctrl = Shift + Enter"]
[null,{"$f":"B2","v":"08:00:00"},{"$f":"C2","v":"10:00:00"},{"$f":"D2","v":"12:00:00"},{"$f":"E2","v":"14:00:00"},null,null,"For more about array formulas see:"]
["# Free Periods",{"$f":"COUNTIF(B3:B8,\"\")","v":2},3,2,3,null,null,"Excel Magic Trick 358: Part 1: Return Multiple Items From One "]
[{"$f":"ROWS(A$14:A14)","v":1},{"$f":"IF(ROWS(B$14:B14)>B$13,\"\",INDEX($A$3:$A$8,SMALL(IF(B$3:B$8=\"\",ROW(B$3:B$8)-ROW(B$3)+1),ROWS(B$14:B14))))","v":"Sue"},{"$f":"IF(ROWS(C$14:C14)>C$13,\"\",INDEX($A$3:$A$8,SMALL(IF(C$3:C$8=\"\",ROW(C$3:C$8)-ROW(C$3)+1),ROWS(C$14:C14))))","v":"Sioux"},{"$f":"IF(ROWS(D$14:D14)>D$13,\"\",INDEX($A$3:$A$8,SMALL(IF(D$3:D$8=\"\",ROW(D$3:D$8)-ROW(D$3)+1),ROWS(D$14:D14))))","v":"Sue"},{"$f":"IF(ROWS(E$14:E14)>E$13,\"\",INDEX($A$3:$A$8,SMALL(IF(E$3:E$8=\"\",ROW(E$3:E$8)-ROW(E$3)+1),ROWS(E$14:E14))))","v":"Sioux"},null,null,"Excel Magic Trick 359: Part 2: Return Multiple Items From One "]
[{"$f":"ROWS(A$14:A15)","v":2},{"$f":"IF(ROWS(B$14:B15)>B$13,\"\",INDEX($A$3:$A$8,SMALL(IF(B$3:B$8=\"\",ROW(B$3:B$8)-ROW(B$3)+1),ROWS(B$14:B15))))","v":"Loung"},{"$f":"IF(ROWS(C$14:C15)>C$13,\"\",INDEX($A$3:$A$8,SMALL(IF(C$3:C$8=\"\",ROW(C$3:C$8)-ROW(C$3)+1),ROWS(C$14:C15))))","v":"Jo"},{"$f":"IF(ROWS(D$14:D15)>D$13,\"\",INDEX($A$3:$A$8,SMALL(IF(D$3:D$8=\"\",ROW(D$3:D$8)-ROW(D$3)+1),ROWS(D$14:D15))))","v":"Joe"},{"$f":"IF(ROWS(E$14:E15)>E$13,\"\",INDEX($A$3:$A$8,SMALL(IF(E$3:E$8=\"\",ROW(E$3:E$8)-ROW(E$3)+1),ROWS(E$14:E15))))","v":"Joe"},null,null,"Excel Magic Trick 360: Part 3: Return Multiple Items From One "]
[{"$f":"ROWS(A$14:A16)","v":3},{"$f":"IF(ROWS(B$14:B16)>B$13,\"\",INDEX($A$3:$A$8,SMALL(IF(B$3:B$8=\"\",ROW(B$3:B$8)-ROW(B$3)+1),ROWS(B$14:B16))))","v":""},{"$f":"IF(ROWS(C$14:C16)>C$13,\"\",INDEX($A$3:$A$8,SMALL(IF(C$3:C$8=\"\",ROW(C$3:C$8)-ROW(C$3)+1),ROWS(C$14:C16))))","v":"Chin"},{"$f":"IF(ROWS(D$14:D16)>D$13,\"\",INDEX($A$3:$A$8,SMALL(IF(D$3:D$8=\"\",ROW(D$3:D$8)-ROW(D$3)+1),ROWS(D$14:D16))))","v":""},{"$f":"IF(ROWS(E$14:E16)>E$13,\"\",INDEX($A$3:$A$8,SMALL(IF(E$3:E$8=\"\",ROW(E$3:E$8)-ROW(E$3)+1),ROWS(E$14:E16))))","v":"Chin"},null,null,"Excel Magic Trick 478: Reverse Two Way Lookup For Date and Time Column and Row Headers"]
[{"$f":"ROWS(A$14:A17)","v":4},{"$f":"IF(ROWS(B$14:B17)>B$13,\"\",INDEX($A$3:$A$8,SMALL(IF(B$3:B$8=\"\",ROW(B$3:B$8)-ROW(B$3)+1),ROWS(B$14:B17))))","v":""},{"$f":"IF(ROWS(C$14:C17)>C$13,\"\",INDEX($A$3:$A$8,SMALL(IF(C$3:C$8=\"\",ROW(C$3:C$8)-ROW(C$3)+1),ROWS(C$14:C17))))","v":""},{"$f":"IF(ROWS(D$14:D17)>D$13,\"\",INDEX($A$3:$A$8,SMALL(IF(D$3:D$8=\"\",ROW(D$3:D$8)-ROW(D$3)+1),ROWS(D$14:D17))))","v":""},{"$f":"IF(ROWS(E$14:E17)>E$13,\"\",INDEX($A$3:$A$8,SMALL(IF(E$3:E$8=\"\",ROW(E$3:E$8)-ROW(E$3)+1),ROWS(E$14:E17))))","v":""},null,null,"Excel Magic Trick 479: Reverse Two Way Lookup - Robust Formula for Duplicate Situations"]
[{"$f":"ROWS(A$14:A18)","v":5},{"$f":"IF(ROWS(B$14:B18)>B$13,\"\",INDEX($A$3:$A$8,SMALL(IF(B$3:B$8=\"\",ROW(B$3:B$8)-ROW(B$3)+1),ROWS(B$14:B18))))","v":""},{"$f":"IF(ROWS(C$14:C18)>C$13,\"\",INDEX($A$3:$A$8,SMALL(IF(C$3:C$8=\"\",ROW(C$3:C$8)-ROW(C$3)+1),ROWS(C$14:C18))))","v":""},{"$f":"IF(ROWS(D$14:D18)>D$13,\"\",INDEX($A$3:$A$8,SMALL(IF(D$3:D$8=\"\",ROW(D$3:D$8)-ROW(D$3)+1),ROWS(D$14:D18))))","v":""},{"$f":"IF(ROWS(E$14:E18)>E$13,\"\",INDEX($A$3:$A$8,SMALL(IF(E$3:E$8=\"\",ROW(E$3:E$8)-ROW(E$3)+1),ROWS(E$14:E18))))","v":""},null,null,"Playlist of how to do array formulas:"]
[{"$f":"ROWS(A$14:A19)","v":6},{"$f":"IF(ROWS(B$14:B19)>B$13,\"\",INDEX($A$3:$A$8,SMALL(IF(B$3:B$8=\"\",ROW(B$3:B$8)-ROW(B$3)+1),ROWS(B$14:B19))))","v":""},{"$f":"IF(ROWS(C$14:C19)>C$13,\"\",INDEX($A$3:$A$8,SMALL(IF(C$3:C$8=\"\",ROW(C$3:C$8)-ROW(C$3)+1),ROWS(C$14:C19))))","v":""},{"$f":"IF(ROWS(D$14:D19)>D$13,\"\",INDEX($A$3:$A$8,SMALL(IF(D$3:D$8=\"\",ROW(D$3:D$8)-ROW(D$3)+1),ROWS(D$14:D19))))","v":""},{"$f":"IF(ROWS(E$14:E19)>E$13,\"\",INDEX($A$3:$A$8,SMALL(IF(E$3:E$8=\"\",ROW(E$3:E$8)-ROW(E$3)+1),ROWS(E$14:E19))))","v":""},null,null,"Excel Array Formulas Beg - Advanced"]

{"sheet":"(610)","index":5,"n_rows":766,"n_cols":2,"rows_kept":766,"cut":false,"hidden":false,"merged":[]}
["Date","Sales"]
["2009-09-25",1484.11]
["2009-04-18",1029.21]
["2010-06-03",1077.93]
["2010-01-04",1344.06]
["2009-02-27",1343.07]
["2009-11-23",1328.64]
["2009-12-12",1256.8399999999999]
["2009-10-18",1468.17]
["2009-04-06",1018.08]
["2010-10-26",1404.33]
["2010-07-03",1176.8]
["2010-01-21",1403.06]
["2010-12-02",1144.6400000000001]
["2010-10-25",1434.94]
["2009-01-11",1149.21]
["2010-10-30",1135.27]
["2010-06-15",1430.07]
["2009-05-31",1421.83]
["2010-07-10",1114.3599999999999]
["2010-08-31",1345.83]
["2009-07-31",1426.25]
["2010-11-17",1076.94]
["2009-01-06",1225.3800000000001]
["2009-02-16",1150.2]
["2009-03-04",1309.98]
["2010-09-12",1092.9000000000001]
["2010-11-12",1315.41]
["2010-09-15",1162.97]
["2009-04-01",1188.03]
["2010-12-15",1093.42]
["2009-07-23",1008.96]
["2009-10-16",1201.1300000000001]
["2010-09-23",1285.74]
["2009-04-22",1182.73]
["2010-07-31",1449.03]
["2010-05-05",1065.29]
["2010-01-21",1253.43]
["2010-04-29",1458.87]
["2009-07-27",1115.8]
["2009-11-22",1363.07]
["2010-01-10",1373.69]
["2009-10-11",1030.53]
["2010-10-22",1035.01]
["2009-07-16",1113.08]
["2010-12-07",1410.74]
["2009-01-26",1353.8]
["2010-04-25",1187.8800000000001]
["2010-10-07",1497.58]
["2010-11-18",1285.6600000000001]
["2009-12-14",1476.17]
["2010-09-23",1034.6500000000001]
["2009-08-12",1200]
["2010-08-25",1202.8800000000001]
["2009-05-14",1205.79]
["2010-09-03",1307.1600000000001]
["2010-01-14",1286.47]
["2010-04-14",1406.21]
["2010-03-09",1498.53]
["2010-07-05",1266.43]
["2010-07-08",1438.71]
["2010-09-12",1394.95]
["2010-08-14",1459.57]
["2009-04-05",1309.81]
["2010-02-19",1045.4000000000001]
["2009-01-06",1169.56]
["2010-11-22",1113.71]
["2010-05-15",1417.28]
["2009-06-17",1307.76]
["2010-03-09",1421.27]
["2009-07-31",1478.13]
["2010-07-12",1393.58]
["2010-12-30",1241.58]
["2009-03-01",1251.75]
["2010-11-11",1133.8900000000001]
["2010-09-05",1235.19]
["2009-05-02",1218.6300000000001]
["2010-12-28",1195.48]
["2010-06-23",1016.89]
["2009-06-14",1173.1600000000001]
["2010-02-22",1313.73]
["2009-04-04",1210.8900000000001]
["2009-12-20",1357.3]
["2009-07-17",1483.01]
["2009-04-20",1495.33]
["2009-11-22",1494.23]
["2010-10-09",1219.24]
["2010-10-09",1311.87]
["2010-05-10",1004.04]
["2009-08-31",1088.21]
["2010-11-26",1111.05]
["2009-10-04",1465.81]
["2010-03-09",1297.3900000000001]
["2010-01-11",1477.75]
["2009-06-25",1011.21]
["2010-09-04",1355.51]
["2009-02-25",1364.28]
["2010-12-26",1375.5]
["2010-06-10",1340.52]
["2009-04-07",1439.88]
["2009-05-18",1179.43]
["2009-08-21",1342.56]
["2010-08-05",1410.8]
["2010-04-12",1002.77]
["2009-05-15",1409.3]
["2009-11-15",1281.8]
["2009-12-13",1463.15]
["2010-09-25",1094.71]
["2009-08-11",1489.43]
["2009-05-07",1105.5]
["2010-07-24",1127.67]
["2009-07-03",1231.5]
["2009-02-12",1201.75]
["2010-12-12",1246.26]
["2010-09-19",1272.81]
["2010-06-11",1439.15]
["2009-12-21",1231.19]
["2009-06-04",1083.08]
["2010-02-24",1096.1400000000001]
["2010-09-09",1054.57]
["2009-05-25",1432.55]
["2009-04-24",1354.99]
["2010-08-28",1091.1199999999999]
["2010-11-22",1467.02]
["2010-05-09",1416.75]
["2009-01-30",1102.3699999999999]
["2009-12-19",1298.21]
["2009-06-30",1057.4100000000001]
["2010-05-19",1016.07]
["2010-03-14",1259.42]
["2009-03-27",1382.05]
["2009-05-11",1184.8800000000001]
["2010-11-03",1235.97]
["2009-02-15",1107.54]
["2009-12-07",1383.51]
["2009-09-02",1198.48]
["2009-05-22",1358.78]
["2009-10-28",1449.49]
["2010-07-13",1185.45]
["2010-11-15",1149.42]
["2009-07-09",1142.5899999999999]
["2010-02-24",1380.14]
["2010-08-18",1139.97]
["2010-08-19",1270.1199999999999]
["2010-04-03",1074.7]
["2009-08-06",1277.75]
["2009-05-13",1366.77]
["2009-03-03",1437.63]
["2009-12-08",1303.6400000000001]
["2010-11-03",1351.39]
["2009-08-17",1455.57]
["2009-10-25",1437.11]
["2009-09-28",1210.42]
["2009-04-21",1129.93]
["2009-11-29",1386.26]
["2009-04-07",1150.83]
["2010-12-15",1357.2]
["2009-11-16",1011.41]
["2009-10-14",1347.52]
["2010-01-14",1086.33]
["2009-07-03",1179.1300000000001]
["2009-06-22",1355.71]
["2009-02-01",1062.44]
["2009-07-13",1115.48]
["2009-12-30",1051]
["2010-01-07",1411.12]
["2009-05-08",1178.5999999999999]
["2009-11-01",1179.7]
["2010-02-25",1323.42]
["2010-05-31",1283.07]
["2009-07-29",1008.35]
["2010-06-05",1444.06]
["2010-03-11",1127.72]
["2010-05-18",1114.55]
["2010-05-14",1349.46]
["2009-09-05",1432.41]
["2010-04-26",1276.0899999999999]
["2010-12-25",1021.29]
["2010-02-11",1313.14]
["2010-01-07",1281.3399999999999]
["2009-07-13",1120.5999999999999]
["2009-06-07",1398.44]
["2009-04-14",1212.55]
["2010-10-24",1291.31]
["2009-03-26",1151.8699999999999]
["2009-01-26",1207.3399999999999]
["2009-10-06",1288.6099999999999]
["2010-05-30",1127.49]
["2010-11-26",1499.86]
["2009-07-20",1090.8699999999999]
["2009-02-22",1006.72]
["2010-04-17",1422]
["2010-07-13",1121.8599999999999]
["2009-09-29",1465.98]
["2010-08-13",1190.3]
["2010-01-06",1044.94]
["2010-11-27",1030.47]
["2010-02-20",1118.81]
["2009-10-06",1232.23]
["2010-06-01",1412.09]
["2009-07-02",1335.73]
["2009-01-10",1473.89]
["2010-09-22",1242.6400000000001]
["2010-11-05",1042.54]
["2009-04-05",1277.19]
["2009-08-14",1238.95]
["2010-10-09",1491.39]
["2010-10-15",1088.6300000000001]
["2009-10-28",1039.43]
["2010-08-31",1149.4000000000001]
["2009-04-20",1042.1500000000001]
["2009-09-03",1213.56]
["2009-06-26",1473.55]
["2010-06-03",1357.66]
["2010-07-12",1008.04]
["2009-08-15",1391.54]
["2009-04-13",1289.22]
["2009-01-31",1403.19]
["2010-02-01",1202.92]
["2010-01-15",1013.25]
["2009-04-01",1321.07]
["2009-11-19",1296.73]
["2010-02-25",1176.25]
["2010-11-10",1174.6300000000001]
["2009-09-03",1397.67]
["2009-04-17",1374.1]
["2009-06-02",1042.0899999999999]
["2009-07-17",1017.49]
["2009-11-18",1130.7]
["2010-03-15",1371.05]
["2010-05-07",1057.6199999999999]
["2009-10-16",1108.6400000000001]
["2009-06-21",1484.27]
["2009-05-11",1386.36]
["2010-12-16",1393.29]
["2010-04-19",1109.8]
["2010-04-06",1360.91]
["2009-04-21",1359.46]
["2010-12-29",1142.99]
["2010-01-15",1233.6500000000001]
["2010-07-18",1027.8]
["2009-02-19",1215.3399999999999]
["2010-07-16",1284.75]
["2010-07-03",1297.8599999999999]
["2010-12-17",1322.09]
["2009-03-02",1388.51]
["2010-10-06",1044.27]
["2010-09-29",1268.01]
["2010-08-26",1170.0899999999999]
["2010-07-11",1198.69]
["2009-03-09",1333.53]
["2009-06-16",1325.09]
["2010-05-05",1253.73]
["2009-09-06",1087.9000000000001]
["2010-03-05",1472.31]
["2009-12-18",1313.49]
["2010-05-20",1421.7]
["2010-09-11",1332.2]
["2010-08-22",1426.11]
["2009-04-15",1284.77]
["2009-05-21",1262.22]
["2010-03-22",1190.0899999999999]
["2009-12-13",1245.44]
["2009-02-23",1383.5]
["2009-03-18",1002.69]
["2010-08-30",1431.34]
["2010-01-26",1308.05]
["2009-11-24",1452.59]
["2009-03-09",1351.97]
["2009-08-11",1482.88]
["2009-02-17",1336.81]
["2010-11-22",1371.6]
["2010-09-04",1449.96]
["2009-12-05",1459.01]
["2010-10-05",1065.8800000000001]
["2010-06-14",1157.3599999999999]
["2010-06-11",1422.8]
["2010-08-14",1405.81]
["2010-06-14",1087.24]
["2009-09-01",1178.1099999999999]
["2010-10-01",1028.76]
["2009-09-01",1033.28]
["2010-07-21",1084.0899999999999]
["2009-03-21",1278.6600000000001]
["2010-10-08",1480.97]
["2009-06-08",1286.05]
["2009-03-26",1337.73]
["2010-12-21",1268.04]
["2010-02-10",1021.57]
["2009-03-05",1064.07]
["2010-02-01",1162.8]
["2010-06-30",1351.16]
["2009-07-14",1038.0899999999999]
["2010-08-08",1317.74]
["2009-06-20",1168.32]
["2009-07-27",1446.4]
["2010-12-16",1440.66]
["2009-09-18",1211.73]
["2010-05-17",1048.5899999999999]
["2009-11-15",1198.8699999999999]
["2009-09-28",1069.06]
["2010-02-25",1408.4]
["2010-05-13",1267.68]
["2010-04-11",1366.94]
["2010-07-23",1180.1199999999999]
["2010-01-20",1290.49]
["2009-05-02",1390.33]
["2009-07-12",1210.02]
["2009-05-19",1256.08]
["2009-01-07",1104.57]
["2009-06-20",1294.48]
["2010-08-04",1455.32]
["2010-08-16",1224.75]
["2010-01-26",1310.72]
["2009-12-21",1257.96]
["2009-12-24",1445.97]
["2010-02-10",1263.6500000000001]
["2009-07-08",1182.57]
["2009-11-21",1170.05]
["2010-06-18",1255.83]
["2009-08-06",1295.4000000000001]
["2010-04-25",1209.54]
["2009-02-27",1437.35]
["2009-09-05",1115.26]
["2010-03-02",1436.35]
["2010-01-25",1384.8]
["2010-12-17",1276.5]
["2010-01-07",1248.42]
["2009-11-03",1423.3]
["2010-05-20",1329.81]
["2009-05-24",1118.1600000000001]
["2009-02-16",1350.97]
["2009-06-16",1097.18]
["2009-05-29",1476.87]
["2009-06-03",1000.88]
["2009-11-12",1003.41]
["2010-03-31",1070.57]
["2010-10-30",1230.6600000000001]
["2009-07-07",1098.98]
["2010-06-21",1360.03]
["2010-10-26",1337.06]
["2010-08-20",1153.8800000000001]
["2009-07-27",1490.55]
["2010-02-14",1091.92]
["2010-08-20",1436.3]
["2009-01-22",1130.69]
["2009-04-24",1454.21]
["2009-08-05",1333.88]
["2010-12-17",1098.94]
["2010-04-22",1244.07]
["2009-12-13",1391.16]
["2009-07-13",1201.6199999999999]
["2010-03-07",1238.6300000000001]
["2010-12-05",1051.5]
["2010-02-25",1387.96]
["2009-02-20",1257.03]
["2010-08-30",1257.81]
["2009-04-18",1022.65]
["2010-01-09",1114.6600000000001]
["2009-06-14",1106.8800000000001]
["2010-06-10",1341.14]
["2010-07-25",1147.4100000000001]
["2009-05-04",1333.94]
["2009-05-15",1470.17]
["2009-07-12",1110.27]
["2010-11-07",1419.64]
["2010-02-06",1256.8]
["2010-10-01",1264.95]
["2009-11-30",1195.8499999999999]
["2009-02-28",1346.73]
["2009-02-06",1016.41]
["2010-08-05",1088.75]
["2009-07-12",1022.54]
["2009-08-12",1463.3]
["2010-11-23",1344.04]
["2010-05-17",1194.56]
["2010-03-07",1076.3499999999999]
["2010-03-20",1240.97]
["2009-03-30",1127.51]
["2009-02-27",1383.77]
["2009-05-27",1166.8]
["2010-11-06",1188.5999999999999]
["2010-11-26",1396.06]
["2010-01-14",1095.6400000000001]
["2010-11-23",1013.58]
["2010-02-14",1328.26]
["2010-06-09",1264.5899999999999]
["2009-05-24",1263.69]
["2010-10-03",1131.77]
["2010-03-14",1298.3800000000001]
["2009-06-12",1228.21]
["2010-02-13",1294.8699999999999]
["2009-06-24",1484.78]
["2010-09-05",1123.07]
["2010-01-08",1194.18]
["2010-07-20",1359.39]
["2009-11-10",1363.04]
["2010-09-14",1011.4]
["2009-01-17",1348.25]
["2009-09-24",1212.8499999999999]
["2009-04-08",1140.44]
["2009-06-20",1168.71]
["2010-11-05",1145.08]
["2010-08-05",1145.18]
["2009-04-29",1378.7]
["2010-12-11",1373.67]
["2009-08-13",1081.58]
["2009-10-06",1174.1500000000001]
["2010-11-24",1154.17]
["2010-06-15",1110.47]
["2010-03-06",1153.82]
["2010-09-03",1220.94]
["2009-10-01",1466.77]
["2010-01-07",1115.72]
["2009-07-30",1120.92]
["2010-03-12",1125.8399999999999]
["2009-07-26",1187.83]
["2010-05-06",1334.09]
["2009-07-22",1052.1300000000001]
["2009-03-19",1392.76]
["2010-05-13",1084.3900000000001]
["2010-01-16",1389.3]
["2009-05-02",1277.17]
["2010-09-21",1052.8800000000001]
["2010-12-13",1108.9000000000001]
["2010-06-26",1451.54]
["2009-06-11",1277.06]
["2010-02-22",1461.69]
["2010-08-15",1432.28]
["2009-06-03",1112.18]
["2010-01-10",1343.93]
["2010-11-21",1342.12]
["2010-03-27",1056.5999999999999]
["2009-12-19",1483.86]
["2010-02-16",1114.73]
["2010-06-03",1233.19]
["2010-09-06",1366.84]
["2010-05-24",1400.75]
["2009-02-13",1033.79]
["2010-10-28",1320.23]
["2010-02-24",1078.31]
["2010-08-21",1446.89]
["2010-05-06",1442.3]
["2010-11-15",1278.4000000000001]
["2010-01-05",1328.45]
["2010-05-27",1263.01]
["2010-05-07",1222.45]
["2010-02-17",1191.04]
["2010-10-07",1320.02]
["2010-05-08",1034.28]
["2009-10-02",1061.99]
["2009-01-05",1383.84]
["2010-05-29",1456.38]
["2010-04-29",1104.6400000000001]
["2010-02-15",1054.97]
["2009-04-03",1458.24]
["2010-06-10",1180.17]
["2010-07-05",1058.74]
["2009-03-04",1061.75]
["2009-10-09",1438.84]
["2009-02-20",1116.25]
["2010-08-05",1409.01]
["2010-09-23",1457.96]
["2010-11-07",1136.3699999999999]
["2009-11-12",1295.98]
["2010-12-27",1361.89]
["2010-09-05",1085.0999999999999]
["2010-05-14",1411.62]
["2009-12-05",1021.26]
["2010-05-04",1486.17]
["2009-07-13",1070.29]
["2009-05-28",1385.4]
["2009-08-21",1469]
["2009-01-03",1250.74]
["2009-07-05",1313.72]
["2010-08-02",1416.86]
["2010-11-20",1238.05]
["2010-09-24",1387.85]
["2010-05-05",1032.0899999999999]
["2009-06-04",1373.32]
["2010-10-17",1089.26]
["2009-10-27",1285.82]
["2010-12-13",1489.31]
["2009-12-23",1196.01]
["2009-12-23",1295.1500000000001]
["2009-07-03",1213.69]
["2010-04-04",1019.41]
["2010-09-03",1207.53]
["2009-05-07",1280.95]
["2010-06-21",1383.12]
["2010-12-22",1053.58]
["2009-12-08",1341.64]
["2010-03-11",1403.7]
["2010-07-21",1040.32]
["2009-01-24",1235.96]
["2010-11-28",1269.19]
["2010-05-26",1408.04]
["2009-10-09",1383.05]
["2009-09-22",1342.3]
["2009-05-01",1046.57]
["2010-12-02",1453.25]
["2009-08-29",1209.96]
["2010-09-15",1483.34]
["2010-11-23",1158.43]
["2009-03-21",1164.8900000000001]
["2010-11-02",1268.54]
["2010-09-13",1094.5]
["2010-04-10",1178.56]
["2009-01-01",1158.6099999999999]
["2010-02-17",1445.86]
["2010-07-14",1045.83]
["2010-07-25",1164.29]
["2009-06-10",1411.11]
["2010-06-07",1173.54]
["2010-04-05",1202.8499999999999]
["2010-08-09",1255.8900000000001]
["2009-09-20",1270.9100000000001]
["2009-10-08",1443.55]
["2010-12-27",1438.18]
["2010-10-29",1120.24]
["2010-08-13",1221.8399999999999]
["2009-11-24",1361.57]
["2009-05-19",1284.77]
["2010-07-11",1102.3499999999999]
["2010-10-25",1374.13]
["2010-02-22",1061.3699999999999]
["2009-10-25",1369.77]
["2010-08-15",1351.41]
["2010-06-09",1171.56]
["2009-02-06",1314.32]
["2010-06-07",1324.74]
["2009-01-07",1255.8699999999999]
["2009-04-10",1434.39]
["2010-12-14",1354.12]
["2009-12-20",1067.3499999999999]
["2009-05-28",1367.9]
["2010-04-30",1476.91]
["2010-09-22",1188.71]
["2010-10-03",1489.41]
["2010-12-25",1189.74]
["2010-05-17",1218.71]
["2009-08-08",1148.48]
["2009-08-21",1286.72]
["2010-08-28",1219.7]
["2010-03-28",1179.73]
["2009-08-30",1257.94]
["2009-10-28",1134.8900000000001]
["2009-03-07",1092.43]
["2010-11-28",1150.6199999999999]
["2010-08-24",1341.8]
["2009-01-16",1196.1300000000001]
["2010-04-30",1481.01]
["2010-05-02",1252.53]
["2009-06-11",1186.9100000000001]
["2010-03-24",1172.95]
["2009-12-25",1065.68]
["2009-06-15",1449.11]
["2009-05-21",1304.45]
["2009-01-10",1379.96]
["2010-10-22",1325.29]
["2010-04-04",1031.25]
["2010-02-26",1488.42]
["2009-12-24",1019]
["2009-05-09",1385.94]
["2009-09-13",1058.8900000000001]
["2010-02-01",1252.28]
["2010-12-05",1472.83]
["2009-01-12",1263.8699999999999]
["2009-04-13",1415.89]
["2010-10-04",1106.81]
["2009-10-03",1380.54]
["2009-05-09",1412.63]
["2009-09-16",1352.24]
["2010-06-13",1399.23]
["2009-09-10",1041.94]
["2009-04-23",1036.99]
["2010-12-10",1457.97]
["2009-12-16",1024.56]
["2010-06-08",1020.41]
["2009-05-07",1092.6300000000001]
["2010-04-20",1139.29]
["2010-02-22",1135.19]
["2010-07-09",1439.75]
["2010-07-17",1127.77]
["2009-07-29",1057.3699999999999]
["2010-11-15",1153.24]
["2010-11-03",1407.87]
["2009-08-16",1100.25]
["2010-06-24",1446.59]
["2009-04-29",1327.5]
["2009-04-18",1386.41]
["2010-08-25",1167.96]
["2009-10-13",1494.9]
["2009-05-26",1461.54]
["2009-07-09",1490.01]
["2009-07-28",1436.53]
["2009-11-12",1052.1400000000001]
["2010-12-05",1439.78]
["2010-03-28",1326.05]
["2009-07-29",1011.56]
["2010-03-14",1136.04]
["2010-04-11",1466.19]
["2009-11-18",1245.2]
["2009-02-01",1273.21]
["2009-10-08",1260.3699999999999]
["2009-05-11",1145.1500000000001]
["2009-12-20",1032.6600000000001]
["2009-10-16",1346.24]
["2010-04-11",1097.67]
["2010-10-28",1174.8499999999999]
["2010-11-06",1474.21]
["2009-06-28",1053.4000000000001]
["2010-01-27",1153.8399999999999]
["2009-01-09",1230.1500000000001]
["2009-10-03",1043.82]
["2010-05-18",1436.96]
["2010-06-12",1366.6]
["2010-10-16",1464.18]
["2009-12-19",1494.3]
["2010-04-15",1122.83]
["2010-01-15",1128.57]
["2009-06-03",1083.58]
["2010-08-01",1419.62]
["2010-04-04",1265.1099999999999]
["2010-02-17",1144.3599999999999]
["2009-04-18",1470.95]
["2009-07-15",1180.69]
["2010-11-02",1417.17]
["2010-03-24",1101.0999999999999]
["2010-01-08",1229.72]
["2009-02-05",1298.75]
["2009-01-12",1110.27]
["2010-01-18",1276.48]
["2010-05-28",1407.82]
["2009-02-03",1339.08]
["2010-04-26",1248.79]
["2009-09-23",1245.1400000000001]
["2009-03-15",1117.73]
["2009-09-01",1100.4000000000001]
["2009-04-11",1472.45]
["2010-03-17",1116.99]
["2010-02-16",1457.7]
["2010-11-10",1062.3900000000001]
["2010-09-10",1041.3499999999999]
["2010-06-02",1032.27]
["2010-12-21",1349.05]
["2009-08-18",1122.6500000000001]
["2010-12-14",1104.69]
["2009-03-24",1191.78]
["2009-04-26",1472.01]
["2010-06-24",1114.56]
["2010-03-05",1093.95]
["2010-10-17",1347.33]
["2010-02-28",1135.49]
["2010-07-27",1388.24]
["2010-06-25",1311.28]
["2010-07-16",1243.27]
["2009-03-18",1064.3900000000001]
["2010-10-20",1394.63]
["2010-11-14",1043.19]
["2010-09-08",1411.09]
["2010-03-30",1402.07]
["2009-02-11",1068.44]
["2009-07-29",1155.1600000000001]
["2009-06-11",1341.74]
["2010-10-16",1182.96]
["2010-02-28",1166.3]
["2010-10-31",1037.08]
["2010-05-08",1287.94]
["2010-07-07",1075.45]
["2010-02-17",1409.64]
["2009-01-16",1312.67]
["2010-01-06",1391.77]
["2010-09-12",1117.93]
["2009-05-08",1484.56]
["2009-07-22",1472.99]
["2010-02-26",1201.42]
["2009-08-16",1077.97]
["2010-12-15",1153.1099999999999]
["2009-07-11",1181.7]
["2010-10-18",1380.89]
["2009-04-28",1424.42]
["2009-10-25",1089.8699999999999]
["2010-08-28",1209.97]
["2010-11-18",1318.87]
["2009-03-21",1211.46]
["2010-06-25",1161.52]
["2009-09-16",1096.57]
["2009-08-17",1392]
["2009-02-18",1171.45]
["2010-11-08",1196.23]
["2009-12-24",1390.95]
["2010-09-28",1176.2]
["2009-05-04",1112.23]
["2009-11-18",1004.68]
["2009-01-29",1166.42]
["2010-11-10",1487.54]
["2009-03-03",1280.53]
["2010-09-26",1007.21]
["2010-10-21",1472.09]
["2009-09-15",1162.96]
["2010-12-26",1226.51]
["2009-01-07",1050.1400000000001]
["2010-04-15",1381.51]
["2010-01-28",1477.33]
["2010-05-01",1152.47]
["2009-02-08",1467.27]
["2009-07-16",1330.62]
["2010-09-06",1109.6300000000001]
["2009-07-26",1450.7]
["2010-08-13",1314.56]
["2010-07-06",1331.31]
["2010-11-02",1439.57]
["2009-10-31",1292.1300000000001]
["2010-04-02",1050.3599999999999]
["2010-07-24",1250.9100000000001]
["2009-03-10",1323.02]
["2009-03-29",1074.57]
["2009-01-12",1089.3599999999999]
["2010-10-19",1230.1300000000001]
["2009-05-12",1469.3]
["2010-12-17",1114.5999999999999]
["2010-09-17",1419.66]
["2009-09-07",1436.33]
["2009-08-22",1270.05]
["2009-06-01",1091.42]
["2010-01-14",1414.11]
["2009-11-05",1258.17]
["2010-10-01",1468.03]
["2009-02-08",1337.46]
["2009-03-08",1354.47]
["2009-01-13",1483.7]
["2010-10-18",1486.33]
["2009-03-12",1117.8800000000001]
["2009-01-17",1003.4]
["2010-12-15",1111.57]
["2009-12-08",1021.29]
["2009-07-28",1308.01]
["2010-12-19",1250]
["2010-02-02",1486.5]
["2009-08-29",1173.54]
["2009-11-05",1071.67]
["2010-07-20",1141.8599999999999]
["2010-08-01",1264.01]
["2009-12-04",1000.49]
["2010-12-08",1384.3]
["2010-11-26",1190.67]
["2010-05-24",1313.71]
["2010-12-01",1063.53]
["2009-07-31",1123.98]
["2009-01-09",1341.37]
["2010-08-11",1336.68]
["2010-02-25",1085.8900000000001]
["2009-01-07",1475.39]
["2010-02-07",1170.99]
["2010-12-30",1330.53]
["2010-11-28",1054.1500000000001]
["2010-01-16",1189.51]
["2010-03-07",1255.6199999999999]
["2009-11-21",1360.89]
["2010-03-10",1347.46]
["2010-02-26",1446.15]
["2010-02-19",1496.21]
["2009-02-03",1362.35]
["2010-06-01",1079.5]
["2009-09-14",1497.34]

{"sheet":"PT(Y o Y)an","index":6,"n_rows":6,"n_cols":4,"rows_kept":6,"cut":false,"hidden":false,"merged":[]}
[]
[]
["Years","Values"]
["2009",null,"2010"]
["Sales ","% Change","Sales ","% Change"]
[441303.34000000026,1,517402.19000000006,1.1724411376537502]

{"sheet":"(611)","index":7,"n_rows":766,"n_cols":7,"rows_kept":766,"cut":false,"hidden":false,"merged":[]}
["Date","Sales",null,2009,"% Change",2010,"% Change"]
["2009-09-25",1484.11]
["2009-04-18",1029.21]
["2010-06-03",1077.93]
["2010-01-04",1344.06]
["2009-02-27",1343.07]
["2009-11-23",1328.64]
["2009-12-12",1256.8399999999999]
["2009-10-18",1468.17]
["2009-04-06",1018.08]
["2010-10-26",1404.33]
["2010-07-03",1176.8]
["2010-01-21",1403.06]
["2010-12-02",1144.6400000000001]
["2010-10-25",1434.94]
["2009-01-11",1149.21]
["2010-10-30",1135.27]
["2010-06-15",1430.07]
["2009-05-31",1421.83]
["2010-07-10",1114.3599999999999]
["2010-08-31",1345.83]
["2009-07-31",1426.25]
["2010-11-17",1076.94]
["2009-01-06",1225.3800000000001]
["2009-02-16",1150.2]
["2009-03-04",1309.98]
["2010-09-12",1092.9000000000001]
["2010-11-12",1315.41]
["2010-09-15",1162.97]
["2009-04-01",1188.03]
["2010-12-15",1093.42]
["2009-07-23",1008.96]
["2009-10-16",1201.1300000000001]
["2010-09-23",1285.74]
["2009-04-22",1182.73]
["2010-07-31",1449.03]
["2010-05-05",1065.29]
["2010-01-21",1253.43]
["2010-04-29",1458.87]
["2009-07-27",1115.8]
["2009-11-22",1363.07]
["2010-01-10",1373.69]
["2009-10-11",1030.53]
["2010-10-22",1035.01]
["2009-07-16",1113.08]
["2010-12-07",1410.74]
["2009-01-26",1353.8]
["2010-04-25",1187.8800000000001]
["2010-10-07",1497.58]
["2010-11-18",1285.6600000000001]
["2009-12-14",1476.17]
["2010-09-23",1034.6500000000001]
["2009-08-12",1200]
["2010-08-25",1202.8800000000001]
["2009-05-14",1205.79]
["2010-09-03",1307.1600000000001]
["2010-01-14",1286.47]
["2010-04-14",1406.21]
["2010-03-09",1498.53]
["2010-07-05",1266.43]
["2010-07-08",1438.71]
["2010-09-12",1394.95]
["2010-08-14",1459.57]
["2009-04-05",1309.81]
["2010-02-19",1045.4000000000001]
["2009-01-06",1169.56]
["2010-11-22",1113.71]
["2010-05-15",1417.28]
["2009-06-17",1307.76]
["2010-03-09",1421.27]
["2009-07-31",1478.13]
["2010-07-12",1393.58]
["2010-12-30",1241.58]
["2009-03-01",1251.75]
["2010-11-11",1133.8900000000001]
["2010-09-05",1235.19]
["2009-05-02",1218.6300000000001]
["2010-12-28",1195.48]
["2010-06-23",1016.89]
["2009-06-14",1173.1600000000001]
["2010-02-22",1313.73]
["2009-04-04",1210.8900000000001]
["2009-12-20",1357.3]
["2009-07-17",1483.01]
["2009-04-20",1495.33]
["2009-11-22",1494.23]
["2010-10-09",1219.24]
["2010-10-09",1311.87]
["2010-05-10",1004.04]
["2009-08-31",1088.21]
["2010-11-26",1111.05]
["2009-10-04",1465.81]
["2010-03-09",1297.3900000000001]
["2010-01-11",1477.75]
["2009-06-25",1011.21]
["2010-09-04",1355.51]
["2009-02-25",1364.28]
["2010-12-26",1375.5]
["2010-06-10",1340.52]
["2009-04-07",1439.88]
["2009-05-18",1179.43]
["2009-08-21",1342.56]
["2010-08-05",1410.8]
["2010-04-12",1002.77]
["2009-05-15",1409.3]
["2009-11-15",1281.8]
["2009-12-13",1463.15]
["2010-09-25",1094.71]
["2009-08-11",1489.43]
["2009-05-07",1105.5]
["2010-07-24",1127.67]
["2009-07-03",1231.5]
["2009-02-12",1201.75]
["2010-12-12",1246.26]
["2010-09-19",1272.81]
["2010-06-11",1439.15]
["2009-12-21",1231.19]
["2009-06-04",1083.08]
["2010-02-24",1096.1400000000001]
["2010-09-09",1054.57]
["2009-05-25",1432.55]
["2009-04-24",1354.99]
["2010-08-28",1091.1199999999999]
["2010-11-22",1467.02]
["2010-05-09",1416.75]
["2009-01-30",1102.3699999999999]
["2009-12-19",1298.21]
["2009-06-30",1057.4100000000001]
["2010-05-19",1016.07]
["2010-03-14",1259.42]
["2009-03-27",1382.05]
["2009-05-11",1184.8800000000001]
["2010-11-03",1235.97]
["2009-02-15",1107.54]
["2009-12-07",1383.51]
["2009-09-02",1198.48]
["2009-05-22",1358.78]
["2009-10-28",1449.49]
["2010-07-13",1185.45]
["2010-11-15",1149.42]
["2009-07-09",1142.5899999999999]
["2010-02-24",1380.14]
["2010-08-18",1139.97]
["2010-08-19",1270.1199999999999]
["2010-04-03",1074.7]
["2009-08-06",1277.75]
["2009-05-13",1366.77]
["2009-03-03",1437.63]
["2009-12-08",1303.6400000000001]
["2010-11-03",1351.39]
["2009-08-17",1455.57]
["2009-10-25",1437.11]
["2009-09-28",1210.42]
["2009-04-21",1129.93]
["2009-11-29",1386.26]
["2009-04-07",1150.83]
["2010-12-15",1357.2]
["2009-11-16",1011.41]
["2009-10-14",1347.52]
["2010-01-14",1086.33]
["2009-07-03",1179.1300000000001]
["2009-06-22",1355.71]
["2009-02-01",1062.44]
["2009-07-13",1115.48]
["2009-12-30",1051]
["2010-01-07",1411.12]
["2009-05-08",1178.5999999999999]
["2009-11-01",1179.7]
["2010-02-25",1323.42]
["2010-05-31",1283.07]
["2009-07-29",1008.35]
["2010-06-05",1444.06]
["2010-03-11",1127.72]
["2010-05-18",1114.55]
["2010-05-14",1349.46]
["2009-09-05",1432.41]
["2010-04-26",1276.0899999999999]
["2010-12-25",1021.29]
["2010-02-11",1313.14]
["2010-01-07",1281.3399999999999]
["2009-07-13",1120.5999999999999]
["2009-06-07",1398.44]
["2009-04-14",1212.55]
["2010-10-24",1291.31]
["2009-03-26",1151.8699999999999]
["2009-01-26",1207.3399999999999]
["2009-10-06",1288.6099999999999]
["2010-05-30",1127.49]
["2010-11-26",1499.86]
["2009-07-20",1090.8699999999999]
["2009-02-22",1006.72]
["2010-04-17",1422]
["2010-07-13",1121.8599999999999]
["2009-09-29",1465.98]
["2010-08-13",1190.3]
["2010-01-06",1044.94]
["2010-11-27",1030.47]
["2010-02-20",1118.81]
["2009-10-06",1232.23]
["2010-06-01",1412.09]
["2009-07-02",1335.73]
["2009-01-10",1473.89]
["2010-09-22",1242.6400000000001]
["2010-11-05",1042.54]
["2009-04-05",1277.19]
["2009-08-14",1238.95]
["2010-10-09",1491.39]
["2010-10-15",1088.6300000000001]
["2009-10-28",1039.43]
["2010-08-31",1149.4000000000001]
["2009-04-20",1042.1500000000001]
["2009-09-03",1213.56]
["2009-06-26",1473.55]
["2010-06-03",1357.66]
["2010-07-12",1008.04]
["2009-08-15",1391.54]
["2009-04-13",1289.22]
["2009-01-31",1403.19]
["2010-02-01",1202.92]
["2010-01-15",1013.25]
["2009-04-01",1321.07]
["2009-11-19",1296.73]
["2010-02-25",1176.25]
["2010-11-10",1174.6300000000001]
["2009-09-03",1397.67]
["2009-04-17",1374.1]
["2009-06-02",1042.0899999999999]
["2009-07-17",1017.49]
["2009-11-18",1130.7]
["2010-03-15",1371.05]
["2010-05-07",1057.6199999999999]
["2009-10-16",1108.6400000000001]
["2009-06-21",1484.27]
["2009-05-11",1386.36]
["2010-12-16",1393.29]
["2010-04-19",1109.8]
["2010-04-06",1360.91]
["2009-04-21",1359.46]
["2010-12-29",1142.99]
["2010-01-15",1233.6500000000001]
["2010-07-18",1027.8]
["2009-02-19",1215.3399999999999]
["2010-07-16",1284.75]
["2010-07-03",1297.8599999999999]
["2010-12-17",1322.09]
["2009-03-02",1388.51]
["2010-10-06",1044.27]
["2010-09-29",1268.01]
["2010-08-26",1170.0899999999999]
["2010-07-11",1198.69]
["2009-03-09",1333.53]
["2009-06-16",1325.09]
["2010-05-05",1253.73]
["2009-09-06",1087.9000000000001]
["2010-03-05",1472.31]
["2009-12-18",1313.49]
["2010-05-20",1421.7]
["2010-09-11",1332.2]
["2010-08-22",1426.11]
["2009-04-15",1284.77]
["2009-05-21",1262.22]
["2010-03-22",1190.0899999999999]
["2009-12-13",1245.44]
["2009-02-23",1383.5]
["2009-03-18",1002.69]
["2010-08-30",1431.34]
["2010-01-26",1308.05]
["2009-11-24",1452.59]
["2009-03-09",1351.97]
["2009-08-11",1482.88]
["2009-02-17",1336.81]
["2010-11-22",1371.6]
["2010-09-04",1449.96]
["2009-12-05",1459.01]
["2010-10-05",1065.8800000000001]
["2010-06-14",1157.3599999999999]
["2010-06-11",1422.8]
["2010-08-14",1405.81]
["2010-06-14",1087.24]
["2009-09-01",1178.1099999999999]
["2010-10-01",1028.76]
["2009-09-01",1033.28]
["2010-07-21",1084.0899999999999]
["2009-03-21",1278.6600000000001]
["2010-10-08",1480.97]
["2009-06-08",1286.05]
["2009-03-26",1337.73]
["2010-12-21",1268.04]
["2010-02-10",1021.57]
["2009-03-05",1064.07]
["2010-02-01",1162.8]
["2010-06-30",1351.16]
["2009-07-14",1038.0899999999999]
["2010-08-08",1317.74]
["2009-06-20",1168.32]
["2009-07-27",1446.4]
["2010-12-16",1440.66]
["2009-09-18",1211.73]
["2010-05-17",1048.5899999999999]
["2009-11-15",1198.8699999999999]
["2009-09-28",1069.06]
["2010-02-25",1408.4]
["2010-05-13",1267.68]
["2010-04-11",1366.94]
["2010-07-23",1180.1199999999999]
["2010-01-20",1290.49]
["2009-05-02",1390.33]
["2009-07-12",1210.02]
["2009-05-19",1256.08]
["2009-01-07",1104.57]
["2009-06-20",1294.48]
["2010-08-04",1455.32]
["2010-08-16",1224.75]
["2010-01-26",1310.72]
["2009-12-21",1257.96]
["2009-12-24",1445.97]
["2010-02-10",1263.6500000000001]
["2009-07-08",1182.57]
["2009-11-21",1170.05]
["2010-06-18",1255.83]
["2009-08-06",1295.4000000000001]
["2010-04-25",1209.54]
["2009-02-27",1437.35]
["2009-09-05",1115.26]
["2010-03-02",1436.35]
["2010-01-25",1384.8]
["2010-12-17",1276.5]
["2010-01-07",1248.42]
["2009-11-03",1423.3]
["2010-05-20",1329.81]
["2009-05-24",1118.1600000000001]
["2009-02-16",1350.97]
["2009-06-16",1097.18]
["2009-05-29",1476.87]
["2009-06-03",1000.88]
["2009-11-12",1003.41]
["2010-03-31",1070.57]
["2010-10-30",1230.6600000000001]
["2009-07-07",1098.98]
["2010-06-21",1360.03]
["2010-10-26",1337.06]
["2010-08-20",1153.8800000000001]
["2009-07-27",1490.55]
["2010-02-14",1091.92]
["2010-08-20",1436.3]
["2009-01-22",1130.69]
["2009-04-24",1454.21]
["2009-08-05",1333.88]
["2010-12-17",1098.94]
["2010-04-22",1244.07]
["2009-12-13",1391.16]
["2009-07-13",1201.6199999999999]
["2010-03-07",1238.6300000000001]
["2010-12-05",1051.5]
["2010-02-25",1387.96]
["2009-02-20",1257.03]
["2010-08-30",1257.81]
["2009-04-18",1022.65]
["2010-01-09",1114.6600000000001]
["2009-06-14",1106.8800000000001]
["2010-06-10",1341.14]
["2010-07-25",1147.4100000000001]
["2009-05-04",1333.94]
["2009-05-15",1470.17]
["2009-07-12",1110.27]
["2010-11-07",1419.64]
["2010-02-06",1256.8]
["2010-10-01",1264.95]
["2009-11-30",1195.8499999999999]
["2009-02-28",1346.73]
["2009-02-06",1016.41]
["2010-08-05",1088.75]
["2009-07-12",1022.54]
["2009-08-12",1463.3]
["2010-11-23",1344.04]
["2010-05-17",1194.56]
["2010-03-07",1076.3499999999999]
["2010-03-20",1240.97]
["2009-03-30",1127.51]
["2009-02-27",1383.77]
["2009-05-27",1166.8]
["2010-11-06",1188.5999999999999]
["2010-11-26",1396.06]
["2010-01-14",1095.6400000000001]
["2010-11-23",1013.58]
["2010-02-14",1328.26]
["2010-06-09",1264.5899999999999]
["2009-05-24",1263.69]
["2010-10-03",1131.77]
["2010-03-14",1298.3800000000001]
["2009-06-12",1228.21]
["2010-02-13",1294.8699999999999]
["2009-06-24",1484.78]
["2010-09-05",1123.07]
["2010-01-08",1194.18]
["2010-07-20",1359.39]
["2009-11-10",1363.04]
["2010-09-14",1011.4]
["2009-01-17",1348.25]
["2009-09-24",1212.8499999999999]
["2009-04-08",1140.44]
["2009-06-20",1168.71]
["2010-11-05",1145.08]
["2010-08-05",1145.18]
["2009-04-29",1378.7]
["2010-12-11",1373.67]
["2009-08-13",1081.58]
["2009-10-06",1174.1500000000001]
["2010-11-24",1154.17]
["2010-06-15",1110.47]
["2010-03-06",1153.82]
["2010-09-03",1220.94]
["2009-10-01",1466.77]
["2010-01-07",1115.72]
["2009-07-30",1120.92]
["2010-03-12",1125.8399999999999]
["2009-07-26",1187.83]
["2010-05-06",1334.09]
["2009-07-22",1052.1300000000001]
["2009-03-19",1392.76]
["2010-05-13",1084.3900000000001]
["2010-01-16",1389.3]
["2009-05-02",1277.17]
["2010-09-21",1052.8800000000001]
["2010-12-13",1108.9000000000001]
["2010-06-26",1451.54]
["2009-06-11",1277.06]
["2010-02-22",1461.69]
["2010-08-15",1432.28]
["2009-06-03",1112.18]
["2010-01-10",1343.93]
["2010-11-21",1342.12]
["2010-03-27",1056.5999999999999]
["2009-12-19",1483.86]
["2010-02-16",1114.73]
["2010-06-03",1233.19]
["2010-09-06",1366.84]
["2010-05-24",1400.75]
["2009-02-13",1033.79]
["2010-10-28",1320.23]
["2010-02-24",1078.31]
["2010-08-21",1446.89]
["2010-05-06",1442.3]
["2010-11-15",1278.4000000000001]
["2010-01-05",1328.45]
["2010-05-27",1263.01]
["2010-05-07",1222.45]
["2010-02-17",1191.04]
["2010-10-07",1320.02]
["2010-05-08",1034.28]
["2009-10-02",1061.99]
["2009-01-05",1383.84]
["2010-05-29",1456.38]
["2010-04-29",1104.6400000000001]
["2010-02-15",1054.97]
["2009-04-03",1458.24]
["2010-06-10",1180.17]
["2010-07-05",1058.74]
["2009-03-04",1061.75]
["2009-10-09",1438.84]
["2009-02-20",1116.25]
["2010-08-05",1409.01]
["2010-09-23",1457.96]
["2010-11-07",1136.3699999999999]
["2009-11-12",1295.98]
["2010-12-27",1361.89]
["2010-09-05",1085.0999999999999]
["2010-05-14",1411.62]
["2009-12-05",1021.26]
["2010-05-04",1486.17]
["2009-07-13",1070.29]
["2009-05-28",1385.4]
["2009-08-21",1469]
["2009-01-03",1250.74]
["2009-07-05",1313.72]
["2010-08-02",1416.86]
["2010-11-20",1238.05]
["2010-09-24",1387.85]
["2010-05-05",1032.0899999999999]
["2009-06-04",1373.32]
["2010-10-17",1089.26]
["2009-10-27",1285.82]
["2010-12-13",1489.31]
["2009-12-23",1196.01]
["2009-12-23",1295.1500000000001]
["2009-07-03",1213.69]
["2010-04-04",1019.41]
["2010-09-03",1207.53]
["2009-05-07",1280.95]
["2010-06-21",1383.12]
["2010-12-22",1053.58]
["2009-12-08",1341.64]
["2010-03-11",1403.7]
["2010-07-21",1040.32]
["2009-01-24",1235.96]
["2010-11-28",1269.19]
["2010-05-26",1408.04]
["2009-10-09",1383.05]
["2009-09-22",1342.3]
["2009-05-01",1046.57]
["2010-12-02",1453.25]
["2009-08-29",1209.96]
["2010-09-15",1483.34]
["2010-11-23",1158.43]
["2009-03-21",1164.8900000000001]
["2010-11-02",1268.54]
["2010-09-13",1094.5]
["2010-04-10",1178.56]
["2009-01-01",1158.6099999999999]
["2010-02-17",1445.86]
["2010-07-14",1045.83]
["2010-07-25",1164.29]
["2009-06-10",1411.11]
["2010-06-07",1173.54]
["2010-04-05",1202.8499999999999]
["2010-08-09",1255.8900000000001]
["2009-09-20",1270.9100000000001]
["2009-10-08",1443.55]
["2010-12-27",1438.18]
["2010-10-29",1120.24]
["2010-08-13",1221.8399999999999]
["2009-11-24",1361.57]
["2009-05-19",1284.77]
["2010-07-11",1102.3499999999999]
["2010-10-25",1374.13]
["2010-02-22",1061.3699999999999]
["2009-10-25",1369.77]
["2010-08-15",1351.41]
["2010-06-09",1171.56]
["2009-02-06",1314.32]
["2010-06-07",1324.74]
["2009-01-07",1255.8699999999999]
["2009-04-10",1434.39]
["2010-12-14",1354.12]
["2009-12-20",1067.3499999999999]
["2009-05-28",1367.9]
["2010-04-30",1476.91]
["2010-09-22",1188.71]
["2010-10-03",1489.41]
["2010-12-25",1189.74]
["2010-05-17",1218.71]
["2009-08-08",1148.48]
["2009-08-21",1286.72]
["2010-08-28",1219.7]
["2010-03-28",1179.73]
["2009-08-30",1257.94]
["2009-10-28",1134.8900000000001]
["2009-03-07",1092.43]
["2010-11-28",1150.6199999999999]
["2010-08-24",1341.8]
["2009-01-16",1196.1300000000001]
["2010-04-30",1481.01]
["2010-05-02",1252.53]
["2009-06-11",1186.9100000000001]
["2010-03-24",1172.95]
["2009-12-25",1065.68]
["2009-06-15",1449.11]
["2009-05-21",1304.45]
["2009-01-10",1379.96]
["2010-10-22",1325.29]
["2010-04-04",1031.25]
["2010-02-26",1488.42]
["2009-12-24",1019]
["2009-05-09",1385.94]
["2009-09-13",1058.8900000000001]
["2010-02-01",1252.28]
["2010-12-05",1472.83]
["2009-01-12",1263.8699999999999]
["2009-04-13",1415.89]
["2010-10-04",1106.81]
["2009-10-03",1380.54]
["2009-05-09",1412.63]
["2009-09-16",1352.24]
["2010-06-13",1399.23]
["2009-09-10",1041.94]
["2009-04-23",1036.99]
["2010-12-10",1457.97]
["2009-12-16",1024.56]
["2010-06-08",1020.41]
["2009-05-07",1092.6300000000001]
["2010-04-20",1139.29]
["2010-02-22",1135.19]
["2010-07-09",1439.75]
["2010-07-17",1127.77]
["2009-07-29",1057.3699999999999]
["2010-11-15",1153.24]
["2010-11-03",1407.87]
["2009-08-16",1100.25]
["2010-06-24",1446.59]
["2009-04-29",1327.5]
["2009-04-18",1386.41]
["2010-08-25",1167.96]
["2009-10-13",1494.9]
["2009-05-26",1461.54]
["2009-07-09",1490.01]
["2009-07-28",1436.53]
["2009-11-12",1052.1400000000001]
["2010-12-05",1439.78]
["2010-03-28",1326.05]
["2009-07-29",1011.56]
["2010-03-14",1136.04]
["2010-04-11",1466.19]
["2009-11-18",1245.2]
["2009-02-01",1273.21]
["2009-10-08",1260.3699999999999]
["2009-05-11",1145.1500000000001]
["2009-12-20",1032.6600000000001]
["2009-10-16",1346.24]
["2010-04-11",1097.67]
["2010-10-28",1174.8499999999999]
["2010-11-06",1474.21]
["2009-06-28",1053.4000000000001]
["2010-01-27",1153.8399999999999]
["2009-01-09",1230.1500000000001]
["2009-10-03",1043.82]
["2010-05-18",1436.96]
["2010-06-12",1366.6]
["2010-10-16",1464.18]
["2009-12-19",1494.3]
["2010-04-15",1122.83]
["2010-01-15",1128.57]
["2009-06-03",1083.58]
["2010-08-01",1419.62]
["2010-04-04",1265.1099999999999]
["2010-02-17",1144.3599999999999]
["2009-04-18",1470.95]
["2009-07-15",1180.69]
["2010-11-02",1417.17]
["2010-03-24",1101.0999999999999]
["2010-01-08",1229.72]
["2009-02-05",1298.75]
["2009-01-12",1110.27]
["2010-01-18",1276.48]
["2010-05-28",1407.82]
["2009-02-03",1339.08]
["2010-04-26",1248.79]
["2009-09-23",1245.1400000000001]
["2009-03-15",1117.73]
["2009-09-01",1100.4000000000001]
["2009-04-11",1472.45]
["2010-03-17",1116.99]
["2010-02-16",1457.7]
["2010-11-10",1062.3900000000001]
["2010-09-10",1041.3499999999999]
["2010-06-02",1032.27]
["2010-12-21",1349.05]
["2009-08-18",1122.6500000000001]
["2010-12-14",1104.69]
["2009-03-24",1191.78]
["2009-04-26",1472.01]
["2010-06-24",1114.56]
["2010-03-05",1093.95]
["2010-10-17",1347.33]
["2010-02-28",1135.49]
["2010-07-27",1388.24]
["2010-06-25",1311.28]
["2010-07-16",1243.27]
["2009-03-18",1064.3900000000001]
["2010-10-20",1394.63]
["2010-11-14",1043.19]
["2010-09-08",1411.09]
["2010-03-30",1402.07]
["2009-02-11",1068.44]
["2009-07-29",1155.1600000000001]
["2009-06-11",1341.74]
["2010-10-16",1182.96]
["2010-02-28",1166.3]
["2010-10-31",1037.08]
["2010-05-08",1287.94]
["2010-07-07",1075.45]
["2010-02-17",1409.64]
["2009-01-16",1312.67]
["2010-01-06",1391.77]
["2010-09-12",1117.93]
["2009-05-08",1484.56]
["2009-07-22",1472.99]
["2010-02-26",1201.42]
["2009-08-16",1077.97]
["2010-12-15",1153.1099999999999]
["2009-07-11",1181.7]
["2010-10-18",1380.89]
["2009-04-28",1424.42]
["2009-10-25",1089.8699999999999]
["2010-08-28",1209.97]
["2010-11-18",1318.87]
["2009-03-21",1211.46]
["2010-06-25",1161.52]
["2009-09-16",1096.57]
["2009-08-17",1392]
["2009-02-18",1171.45]
["2010-11-08",1196.23]
["2009-12-24",1390.95]
["2010-09-28",1176.2]
["2009-05-04",1112.23]
["2009-11-18",1004.68]
["2009-01-29",1166.42]
["2010-11-10",1487.54]
["2009-03-03",1280.53]
["2010-09-26",1007.21]
["2010-10-21",1472.09]
["2009-09-15",1162.96]
["2010-12-26",1226.51]
["2009-01-07",1050.1400000000001]
["2010-04-15",1381.51]
["2010-01-28",1477.33]
["2010-05-01",1152.47]
["2009-02-08",1467.27]
["2009-07-16",1330.62]
["2010-09-06",1109.6300000000001]
["2009-07-26",1450.7]
["2010-08-13",1314.56]
["2010-07-06",1331.31]
["2010-11-02",1439.57]
["2009-10-31",1292.1300000000001]
["2010-04-02",1050.3599999999999]
["2010-07-24",1250.9100000000001]
["2009-03-10",1323.02]
["2009-03-29",1074.57]
["2009-01-12",1089.3599999999999]
["2010-10-19",1230.1300000000001]
["2009-05-12",1469.3]
["2010-12-17",1114.5999999999999]
["2010-09-17",1419.66]
["2009-09-07",1436.33]
["2009-08-22",1270.05]
["2009-06-01",1091.42]
["2010-01-14",1414.11]
["2009-11-05",1258.17]
["2010-10-01",1468.03]
["2009-02-08",1337.46]
["2009-03-08",1354.47]
["2009-01-13",1483.7]
["2010-10-18",1486.33]
["2009-03-12",1117.8800000000001]
["2009-01-17",1003.4]
["2010-12-15",1111.57]
["2009-12-08",1021.29]
["2009-07-28",1308.01]
["2010-12-19",1250]
["2010-02-02",1486.5]
["2009-08-29",1173.54]
["2009-11-05",1071.67]
["2010-07-20",1141.8599999999999]
["2010-08-01",1264.01]
["2009-12-04",1000.49]
["2010-12-08",1384.3]
["2010-11-26",1190.67]
["2010-05-24",1313.71]
["2010-12-01",1063.53]
["2009-07-31",1123.98]
["2009-01-09",1341.37]
["2010-08-11",1336.68]
["2010-02-25",1085.8900000000001]
["2009-01-07",1475.39]
["2010-02-07",1170.99]
["2010-12-30",1330.53]
["2010-11-28",1054.1500000000001]
["2010-01-16",1189.51]
["2010-03-07",1255.6199999999999]
["2009-11-21",1360.89]
["2010-03-10",1347.46]
["2010-02-26",1446.15]
["2010-02-19",1496.21]
["2009-02-03",1362.35]
["2010-06-01",1079.5]
["2009-09-14",1497.34]

{"sheet":"(611an)","index":8,"n_rows":766,"n_cols":7,"rows_kept":766,"cut":false,"hidden":false,"merged":[]}
["Date","Sales",null,2009,"% Change",2010,"% Change"]
["2009-09-25",1484.11,null,{"$f":"SUMPRODUCT(--(YEAR($A$2:$A$766)=D1),$B$2:$B$766)","v":441303.34000000026},{"$f":"D2/$D$2-1","v":0},{"$f":"SUMPRODUCT(--(YEAR($A$2:$A$766)=F1),$B$2:$B$766)","v":517402.19000000006},{"$f":"F2/$D$2-1","v":0.17244113765375024}]
["2009-04-18",1029.21,null,null,{"$f":"C2/$D$2","v":0},null,{"$f":"F2/$D$2","v":1.1724411376537502}]
["2010-06-03",1077.93]
["2010-01-04",1344.06]
["2009-02-27",1343.07]
["2009-11-23",1328.64]
["2009-12-12",1256.8399999999999]
["2009-10-18",1468.17]
["2009-04-06",1018.08]
["2010-10-26",1404.33]
["2010-07-03",1176.8]
["2010-01-21",1403.06]
["2010-12-02",1144.6400000000001]
["2010-10-25",1434.94]
["2009-01-11",1149.21]
["2010-10-30",1135.27]
["2010-06-15",1430.07]
["2009-05-31",1421.83]
["2010-07-10",1114.3599999999999]
["2010-08-31",1345.83]
["2009-07-31",1426.25]
["2010-11-17",1076.94]
["2009-01-06",1225.3800000000001]
["2009-02-16",1150.2]
["2009-03-04",1309.98]
["2010-09-12",1092.9000000000001]
["2010-11-12",1315.41]
["2010-09-15",1162.97]
["2009-04-01",1188.03]
["2010-12-15",1093.42]
["2009-07-23",1008.96]
["2009-10-16",1201.1300000000001]
["2010-09-23",1285.74]
["2009-04-22",1182.73]
["2010-07-31",1449.03]
["2010-05-05",1065.29]
["2010-01-21",1253.43]
["2010-04-29",1458.87]
["2009-07-27",1115.8]
["2009-11-22",1363.07]
["2010-01-10",1373.69]
["2009-10-11",1030.53]
["2010-10-22",1035.01]
["2009-07-16",1113.08]
["2010-12-07",1410.74]
["2009-01-26",1353.8]
["2010-04-25",1187.8800000000001]
["2010-10-07",1497.58]
["2010-11-18",1285.6600000000001]
["2009-12-14",1476.17]
["2010-09-23",1034.6500000000001]
["2009-08-12",1200]
["2010-08-25",1202.8800000000001]
["2009-05-14",1205.79]
["2010-09-03",1307.1600000000001]
["2010-01-14",1286.47]
["2010-04-14",1406.21]
["2010-03-09",1498.53]
["2010-07-05",1266.43]
["2010-07-08",1438.71]
["2010-09-12",1394.95]
["2010-08-14",1459.57]
["2009-04-05",1309.81]
["2010-02-19",1045.4000000000001]
["2009-01-06",1169.56]
["2010-11-22",1113.71]
["2010-05-15",1417.28]
["2009-06-17",1307.76]
["2010-03-09",1421.27]
["2009-07-31",1478.13]
["2010-07-12",1393.58]
["2010-12-30",1241.58]
["2009-03-01",1251.75]
["2010-11-11",1133.8900000000001]
["2010-09-05",1235.19]
["2009-05-02",1218.6300000000001]
["2010-12-28",1195.48]
["2010-06-23",1016.89]
["2009-06-14",1173.1600000000001]
["2010-02-22",1313.73]
["2009-04-04",1210.8900000000001]
["2009-12-20",1357.3]
["2009-07-17",1483.01]
["2009-04-20",1495.33]
["2009-11-22",1494.23]
["2010-10-09",1219.24]
["2010-10-09",1311.87]
["2010-05-10",1004.04]
["2009-08-31",1088.21]
["2010-11-26",1111.05]
["2009-10-04",1465.81]
["2010-03-09",1297.3900000000001]
["2010-01-11",1477.75]
["2009-06-25",1011.21]
["2010-09-04",1355.51]
["2009-02-25",1364.28]
["2010-12-26",1375.5]
["2010-06-10",1340.52]
["2009-04-07",1439.88]
["2009-05-18",1179.43]
["2009-08-21",1342.56]
["2010-08-05",1410.8]
["2010-04-12",1002.77]
["2009-05-15",1409.3]
["2009-11-15",1281.8]
["2009-12-13",1463.15]
["2010-09-25",1094.71]
["2009-08-11",1489.43]
["2009-05-07",1105.5]
["2010-07-24",1127.67]
["2009-07-03",1231.5]
["2009-02-12",1201.75]
["2010-12-12",1246.26]
["2010-09-19",1272.81]
["2010-06-11",1439.15]
["2009-12-21",1231.19]
["2009-06-04",1083.08]
["2010-02-24",1096.1400000000001]
["2010-09-09",1054.57]
["2009-05-25",1432.55]
["2009-04-24",1354.99]
["2010-08-28",1091.1199999999999]
["2010-11-22",1467.02]
["2010-05-09",1416.75]
["2009-01-30",1102.3699999999999]
["2009-12-19",1298.21]
["2009-06-30",1057.4100000000001]
["2010-05-19",1016.07]
["2010-03-14",1259.42]
["2009-03-27",1382.05]
["2009-05-11",1184.8800000000001]
["2010-11-03",1235.97]
["2009-02-15",1107.54]
["2009-12-07",1383.51]
["2009-09-02",1198.48]
["2009-05-22",1358.78]
["2009-10-28",1449.49]
["2010-07-13",1185.45]
["2010-11-15",1149.42]
["2009-07-09",1142.5899999999999]
["2010-02-24",1380.14]
["2010-08-18",1139.97]
["2010-08-19",1270.1199999999999]
["2010-04-03",1074.7]
["2009-08-06",1277.75]
["2009-05-13",1366.77]
["2009-03-03",1437.63]
["2009-12-08",1303.6400000000001]
["2010-11-03",1351.39]
["2009-08-17",1455.57]
["2009-10-25",1437.11]
["2009-09-28",1210.42]
["2009-04-21",1129.93]
["2009-11-29",1386.26]
["2009-04-07",1150.83]
["2010-12-15",1357.2]
["2009-11-16",1011.41]
["2009-10-14",1347.52]
["2010-01-14",1086.33]
["2009-07-03",1179.1300000000001]
["2009-06-22",1355.71]
["2009-02-01",1062.44]
["2009-07-13",1115.48]
["2009-12-30",1051]
["2010-01-07",1411.12]
["2009-05-08",1178.5999999999999]
["2009-11-01",1179.7]
["2010-02-25",1323.42]
["2010-05-31",1283.07]
["2009-07-29",1008.35]
["2010-06-05",1444.06]
["2010-03-11",1127.72]
["2010-05-18",1114.55]
["2010-05-14",1349.46]
["2009-09-05",1432.41]
["2010-04-26",1276.0899999999999]
["2010-12-25",1021.29]
["2010-02-11",1313.14]
["2010-01-07",1281.3399999999999]
["2009-07-13",1120.5999999999999]
["2009-06-07",1398.44]
["2009-04-14",1212.55]
["2010-10-24",1291.31]
["2009-03-26",1151.8699999999999]
["2009-01-26",1207.3399999999999]
["2009-10-06",1288.6099999999999]
["2010-05-30",1127.49]
["2010-11-26",1499.86]
["2009-07-20",1090.8699999999999]
["2009-02-22",1006.72]
["2010-04-17",1422]
["2010-07-13",1121.8599999999999]
["2009-09-29",1465.98]
["2010-08-13",1190.3]
["2010-01-06",1044.94]
["2010-11-27",1030.47]
["2010-02-20",1118.81]
["2009-10-06",1232.23]
["2010-06-01",1412.09]
["2009-07-02",1335.73]
["2009-01-10",1473.89]
["2010-09-22",1242.6400000000001]
["2010-11-05",1042.54]
["2009-04-05",1277.19]
["2009-08-14",1238.95]
["2010-10-09",1491.39]
["2010-10-15",1088.6300000000001]
["2009-10-28",1039.43]
["2010-08-31",1149.4000000000001]
["2009-04-20",1042.1500000000001]
["2009-09-03",1213.56]
["2009-06-26",1473.55]
["2010-06-03",1357.66]
["2010-07-12",1008.04]
["2009-08-15",1391.54]
["2009-04-13",1289.22]
["2009-01-31",1403.19]
["2010-02-01",1202.92]
["2010-01-15",1013.25]
["2009-04-01",1321.07]
["2009-11-19",1296.73]
["2010-02-25",1176.25]
["2010-11-10",1174.6300000000001]
["2009-09-03",1397.67]
["2009-04-17",1374.1]
["2009-06-02",1042.0899999999999]
["2009-07-17",1017.49]
["2009-11-18",1130.7]
["2010-03-15",1371.05]
["2010-05-07",1057.6199999999999]
["2009-10-16",1108.6400000000001]
["2009-06-21",1484.27]
["2009-05-11",1386.36]
["2010-12-16",1393.29]
["2010-04-19",1109.8]
["2010-04-06",1360.91]
["2009-04-21",1359.46]
["2010-12-29",1142.99]
["2010-01-15",1233.6500000000001]
["2010-07-18",1027.8]
["2009-02-19",1215.3399999999999]
["2010-07-16",1284.75]
["2010-07-03",1297.8599999999999]
["2010-12-17",1322.09]
["2009-03-02",1388.51]
["2010-10-06",1044.27]
["2010-09-29",1268.01]
["2010-08-26",1170.0899999999999]
["2010-07-11",1198.69]
["2009-03-09",1333.53]
["2009-06-16",1325.09]
["2010-05-05",1253.73]
["2009-09-06",1087.9000000000001]
["2010-03-05",1472.31]
["2009-12-18",1313.49]
["2010-05-20",1421.7]
["2010-09-11",1332.2]
["2010-08-22",1426.11]
["2009-04-15",1284.77]
["2009-05-21",1262.22]
["2010-03-22",1190.0899999999999]
["2009-12-13",1245.44]
["2009-02-23",1383.5]
["2009-03-18",1002.69]
["2010-08-30",1431.34]
["2010-01-26",1308.05]
["2009-11-24",1452.59]
["2009-03-09",1351.97]
["2009-08-11",1482.88]
["2009-02-17",1336.81]
["2010-11-22",1371.6]
["2010-09-04",1449.96]
["2009-12-05",1459.01]
["2010-10-05",1065.8800000000001]
["2010-06-14",1157.3599999999999]
["2010-06-11",1422.8]
["2010-08-14",1405.81]
["2010-06-14",1087.24]
["2009-09-01",1178.1099999999999]
["2010-10-01",1028.76]
["2009-09-01",1033.28]
["2010-07-21",1084.0899999999999]
["2009-03-21",1278.6600000000001]
["2010-10-08",1480.97]
["2009-06-08",1286.05]
["2009-03-26",1337.73]
["2010-12-21",1268.04]
["2010-02-10",1021.57]
["2009-03-05",1064.07]
["2010-02-01",1162.8]
["2010-06-30",1351.16]
["2009-07-14",1038.0899999999999]
["2010-08-08",1317.74]
["2009-06-20",1168.32]
["2009-07-27",1446.4]
["2010-12-16",1440.66]
["2009-09-18",1211.73]
["2010-05-17",1048.5899999999999]
["2009-11-15",1198.8699999999999]
["2009-09-28",1069.06]
["2010-02-25",1408.4]
["2010-05-13",1267.68]
["2010-04-11",1366.94]
["2010-07-23",1180.1199999999999]
["2010-01-20",1290.49]
["2009-05-02",1390.33]
["2009-07-12",1210.02]
["2009-05-19",1256.08]
["2009-01-07",1104.57]
["2009-06-20",1294.48]
["2010-08-04",1455.32]
["2010-08-16",1224.75]
["2010-01-26",1310.72]
["2009-12-21",1257.96]
["2009-12-24",1445.97]
["2010-02-10",1263.6500000000001]
["2009-07-08",1182.57]
["2009-11-21",1170.05]
["2010-06-18",1255.83]
["2009-08-06",1295.4000000000001]
["2010-04-25",1209.54]
["2009-02-27",1437.35]
["2009-09-05",1115.26]
["2010-03-02",1436.35]
["2010-01-25",1384.8]
["2010-12-17",1276.5]
["2010-01-07",1248.42]
["2009-11-03",1423.3]
["2010-05-20",1329.81]
["2009-05-24",1118.1600000000001]
["2009-02-16",1350.97]
["2009-06-16",1097.18]
["2009-05-29",1476.87]
["2009-06-03",1000.88]
["2009-11-12",1003.41]
["2010-03-31",1070.57]
["2010-10-30",1230.6600000000001]
["2009-07-07",1098.98]
["2010-06-21",1360.03]
["2010-10-26",1337.06]
["2010-08-20",1153.8800000000001]
["2009-07-27",1490.55]
["2010-02-14",1091.92]
["2010-08-20",1436.3]
["2009-01-22",1130.69]
["2009-04-24",1454.21]
["2009-08-05",1333.88]
["2010-12-17",1098.94]
["2010-04-22",1244.07]
["2009-12-13",1391.16]
["2009-07-13",1201.6199999999999]
["2010-03-07",1238.6300000000001]
["2010-12-05",1051.5]
["2010-02-25",1387.96]
["2009-02-20",1257.03]
["2010-08-30",1257.81]
["2009-04-18",1022.65]
["2010-01-09",1114.6600000000001]
["2009-06-14",1106.8800000000001]
["2010-06-10",1341.14]
["2010-07-25",1147.4100000000001]
["2009-05-04",1333.94]
["2009-05-15",1470.17]
["2009-07-12",1110.27]
["2010-11-07",1419.64]
["2010-02-06",1256.8]
["2010-10-01",1264.95]
["2009-11-30",1195.8499999999999]
["2009-02-28",1346.73]
["2009-02-06",1016.41]
["2010-08-05",1088.75]
["2009-07-12",1022.54]
["2009-08-12",1463.3]
["2010-11-23",1344.04]
["2010-05-17",1194.56]
["2010-03-07",1076.3499999999999]
["2010-03-20",1240.97]
["2009-03-30",1127.51]
["2009-02-27",1383.77]
["2009-05-27",1166.8]
["2010-11-06",1188.5999999999999]
["2010-11-26",1396.06]
["2010-01-14",1095.6400000000001]
["2010-11-23",1013.58]
["2010-02-14",1328.26]
["2010-06-09",1264.5899999999999]
["2009-05-24",1263.69]
["2010-10-03",1131.77]
["2010-03-14",1298.3800000000001]
["2009-06-12",1228.21]
["2010-02-13",1294.8699999999999]
["2009-06-24",1484.78]
["2010-09-05",1123.07]
["2010-01-08",1194.18]
["2010-07-20",1359.39]
["2009-11-10",1363.04]
["2010-09-14",1011.4]
["2009-01-17",1348.25]
["2009-09-24",1212.8499999999999]
["2009-04-08",1140.44]
["2009-06-20",1168.71]
["2010-11-05",1145.08]
["2010-08-05",1145.18]
["2009-04-29",1378.7]
["2010-12-11",1373.67]
["2009-08-13",1081.58]
["2009-10-06",1174.1500000000001]
["2010-11-24",1154.17]
["2010-06-15",1110.47]
["2010-03-06",1153.82]
["2010-09-03",1220.94]
["2009-10-01",1466.77]
["2010-01-07",1115.72]
["2009-07-30",1120.92]
["2010-03-12",1125.8399999999999]
["2009-07-26",1187.83]
["2010-05-06",1334.09]
["2009-07-22",1052.1300000000001]
["2009-03-19",1392.76]
["2010-05-13",1084.3900000000001]
["2010-01-16",1389.3]
["2009-05-02",1277.17]
["2010-09-21",1052.8800000000001]
["2010-12-13",1108.9000000000001]
["2010-06-26",1451.54]
["2009-06-11",1277.06]
["2010-02-22",1461.69]
["2010-08-15",1432.28]
["2009-06-03",1112.18]
["2010-01-10",1343.93]
["2010-11-21",1342.12]
["2010-03-27",1056.5999999999999]
["2009-12-19",1483.86]
["2010-02-16",1114.73]
["2010-06-03",1233.19]
["2010-09-06",1366.84]
["2010-05-24",1400.75]
["2009-02-13",1033.79]
["2010-10-28",1320.23]
["2010-02-24",1078.31]
["2010-08-21",1446.89]
["2010-05-06",1442.3]
["2010-11-15",1278.4000000000001]
["2010-01-05",1328.45]
["2010-05-27",1263.01]
["2010-05-07",1222.45]
["2010-02-17",1191.04]
["2010-10-07",1320.02]
["2010-05-08",1034.28]
["2009-10-02",1061.99]
["2009-01-05",1383.84]
["2010-05-29",1456.38]
["2010-04-29",1104.6400000000001]
["2010-02-15",1054.97]
["2009-04-03",1458.24]
["2010-06-10",1180.17]
["2010-07-05",1058.74]
["2009-03-04",1061.75]
["2009-10-09",1438.84]
["2009-02-20",1116.25]
["2010-08-05",1409.01]
["2010-09-23",1457.96]
["2010-11-07",1136.3699999999999]
["2009-11-12",1295.98]
["2010-12-27",1361.89]
["2010-09-05",1085.0999999999999]
["2010-05-14",1411.62]
["2009-12-05",1021.26]
["2010-05-04",1486.17]
["2009-07-13",1070.29]
["2009-05-28",1385.4]
["2009-08-21",1469]
["2009-01-03",1250.74]
["2009-07-05",1313.72]
["2010-08-02",1416.86]
["2010-11-20",1238.05]
["2010-09-24",1387.85]
["2010-05-05",1032.0899999999999]
["2009-06-04",1373.32]
["2010-10-17",1089.26]
["2009-10-27",1285.82]
["2010-12-13",1489.31]
["2009-12-23",1196.01]
["2009-12-23",1295.1500000000001]
["2009-07-03",1213.69]
["2010-04-04",1019.41]
["2010-09-03",1207.53]
["2009-05-07",1280.95]
["2010-06-21",1383.12]
["2010-12-22",1053.58]
["2009-12-08",1341.64]
["2010-03-11",1403.7]
["2010-07-21",1040.32]
["2009-01-24",1235.96]
["2010-11-28",1269.19]
["2010-05-26",1408.04]
["2009-10-09",1383.05]
["2009-09-22",1342.3]
["2009-05-01",1046.57]
["2010-12-02",1453.25]
["2009-08-29",1209.96]
["2010-09-15",1483.34]
["2010-11-23",1158.43]
["2009-03-21",1164.8900000000001]
["2010-11-02",1268.54]
["2010-09-13",1094.5]
["2010-04-10",1178.56]
["2009-01-01",1158.6099999999999]
["2010-02-17",1445.86]
["2010-07-14",1045.83]
["2010-07-25",1164.29]
["2009-06-10",1411.11]
["2010-06-07",1173.54]
["2010-04-05",1202.8499999999999]
["2010-08-09",1255.8900000000001]
["2009-09-20",1270.9100000000001]
["2009-10-08",1443.55]
["2010-12-27",1438.18]
["2010-10-29",1120.24]
["2010-08-13",1221.8399999999999]
["2009-11-24",1361.57]
["2009-05-19",1284.77]
["2010-07-11",1102.3499999999999]
["2010-10-25",1374.13]
["2010-02-22",1061.3699999999999]
["2009-10-25",1369.77]
["2010-08-15",1351.41]
["2010-06-09",1171.56]
["2009-02-06",1314.32]
["2010-06-07",1324.74]
["2009-01-07",1255.8699999999999]
["2009-04-10",1434.39]
["2010-12-14",1354.12]
["2009-12-20",1067.3499999999999]
["2009-05-28",1367.9]
["2010-04-30",1476.91]
["2010-09-22",1188.71]
["2010-10-03",1489.41]
["2010-12-25",1189.74]
["2010-05-17",1218.71]
["2009-08-08",1148.48]
["2009-08-21",1286.72]
["2010-08-28",1219.7]
["2010-03-28",1179.73]
["2009-08-30",1257.94]
["2009-10-28",1134.8900000000001]
["2009-03-07",1092.43]
["2010-11-28",1150.6199999999999]
["2010-08-24",1341.8]
["2009-01-16",1196.1300000000001]
["2010-04-30",1481.01]
["2010-05-02",1252.53]
["2009-06-11",1186.9100000000001]
["2010-03-24",1172.95]
["2009-12-25",1065.68]
["2009-06-15",1449.11]
["2009-05-21",1304.45]
["2009-01-10",1379.96]
["2010-10-22",1325.29]
["2010-04-04",1031.25]
["2010-02-26",1488.42]
["2009-12-24",1019]
["2009-05-09",1385.94]
["2009-09-13",1058.8900000000001]
["2010-02-01",1252.28]
["2010-12-05",1472.83]
["2009-01-12",1263.8699999999999]
["2009-04-13",1415.89]
["2010-10-04",1106.81]
["2009-10-03",1380.54]
["2009-05-09",1412.63]
["2009-09-16",1352.24]
["2010-06-13",1399.23]
["2009-09-10",1041.94]
["2009-04-23",1036.99]
["2010-12-10",1457.97]
["2009-12-16",1024.56]
["2010-06-08",1020.41]
["2009-05-07",1092.6300000000001]
["2010-04-20",1139.29]
["2010-02-22",1135.19]
["2010-07-09",1439.75]
["2010-07-17",1127.77]
["2009-07-29",1057.3699999999999]
["2010-11-15",1153.24]
["2010-11-03",1407.87]
["2009-08-16",1100.25]
["2010-06-24",1446.59]
["2009-04-29",1327.5]
["2009-04-18",1386.41]
["2010-08-25",1167.96]
["2009-10-13",1494.9]
["2009-05-26",1461.54]
["2009-07-09",1490.01]
["2009-07-28",1436.53]
["2009-11-12",1052.1400000000001]
["2010-12-05",1439.78]
["2010-03-28",1326.05]
["2009-07-29",1011.56]
["2010-03-14",1136.04]
["2010-04-11",1466.19]
["2009-11-18",1245.2]
["2009-02-01",1273.21]
["2009-10-08",1260.3699999999999]
["2009-05-11",1145.1500000000001]
["2009-12-20",1032.6600000000001]
["2009-10-16",1346.24]
["2010-04-11",1097.67]
["2010-10-28",1174.8499999999999]
["2010-11-06",1474.21]
["2009-06-28",1053.4000000000001]
["2010-01-27",1153.8399999999999]
["2009-01-09",1230.1500000000001]
["2009-10-03",1043.82]
["2010-05-18",1436.96]
["2010-06-12",1366.6]
["2010-10-16",1464.18]
["2009-12-19",1494.3]
["2010-04-15",1122.83]
["2010-01-15",1128.57]
["2009-06-03",1083.58]
["2010-08-01",1419.62]
["2010-04-04",1265.1099999999999]
["2010-02-17",1144.3599999999999]
["2009-04-18",1470.95]
["2009-07-15",1180.69]
["2010-11-02",1417.17]
["2010-03-24",1101.0999999999999]
["2010-01-08",1229.72]
["2009-02-05",1298.75]
["2009-01-12",1110.27]
["2010-01-18",1276.48]
["2010-05-28",1407.82]
["2009-02-03",1339.08]
["2010-04-26",1248.79]
["2009-09-23",1245.1400000000001]
["2009-03-15",1117.73]
["2009-09-01",1100.4000000000001]
["2009-04-11",1472.45]
["2010-03-17",1116.99]
["2010-02-16",1457.7]
["2010-11-10",1062.3900000000001]
["2010-09-10",1041.3499999999999]
["2010-06-02",1032.27]
["2010-12-21",1349.05]
["2009-08-18",1122.6500000000001]
["2010-12-14",1104.69]
["2009-03-24",1191.78]
["2009-04-26",1472.01]
["2010-06-24",1114.56]
["2010-03-05",1093.95]
["2010-10-17",1347.33]
["2010-02-28",1135.49]
["2010-07-27",1388.24]
["2010-06-25",1311.28]
["2010-07-16",1243.27]
["2009-03-18",1064.3900000000001]
["2010-10-20",1394.63]
["2010-11-14",1043.19]
["2010-09-08",1411.09]
["2010-03-30",1402.07]
["2009-02-11",1068.44]
["2009-07-29",1155.1600000000001]
["2009-06-11",1341.74]
["2010-10-16",1182.96]
["2010-02-28",1166.3]
["2010-10-31",1037.08]
["2010-05-08",1287.94]
["2010-07-07",1075.45]
["2010-02-17",1409.64]
["2009-01-16",1312.67]
["2010-01-06",1391.77]
["2010-09-12",1117.93]
["2009-05-08",1484.56]
["2009-07-22",1472.99]
["2010-02-26",1201.42]
["2009-08-16",1077.97]
["2010-12-15",1153.1099999999999]
["2009-07-11",1181.7]
["2010-10-18",1380.89]
["2009-04-28",1424.42]
["2009-10-25",1089.8699999999999]
["2010-08-28",1209.97]
["2010-11-18",1318.87]
["2009-03-21",1211.46]
["2010-06-25",1161.52]
["2009-09-16",1096.57]
["2009-08-17",1392]
["2009-02-18",1171.45]
["2010-11-08",1196.23]
["2009-12-24",1390.95]
["2010-09-28",1176.2]
["2009-05-04",1112.23]
["2009-11-18",1004.68]
["2009-01-29",1166.42]
["2010-11-10",1487.54]
["2009-03-03",1280.53]
["2010-09-26",1007.21]
["2010-10-21",1472.09]
["2009-09-15",1162.96]
["2010-12-26",1226.51]
["2009-01-07",1050.1400000000001]
["2010-04-15",1381.51]
["2010-01-28",1477.33]
["2010-05-01",1152.47]
["2009-02-08",1467.27]
["2009-07-16",1330.62]
["2010-09-06",1109.6300000000001]
["2009-07-26",1450.7]
["2010-08-13",1314.56]
["2010-07-06",1331.31]
["2010-11-02",1439.57]
["2009-10-31",1292.1300000000001]
["2010-04-02",1050.3599999999999]
["2010-07-24",1250.9100000000001]
["2009-03-10",1323.02]
["2009-03-29",1074.57]
["2009-01-12",1089.3599999999999]
["2010-10-19",1230.1300000000001]
["2009-05-12",1469.3]
["2010-12-17",1114.5999999999999]
["2010-09-17",1419.66]
["2009-09-07",1436.33]
["2009-08-22",1270.05]
["2009-06-01",1091.42]
["2010-01-14",1414.11]
["2009-11-05",1258.17]
["2010-10-01",1468.03]
["2009-02-08",1337.46]
["2009-03-08",1354.47]
["2009-01-13",1483.7]
["2010-10-18",1486.33]
["2009-03-12",1117.8800000000001]
["2009-01-17",1003.4]
["2010-12-15",1111.57]
["2009-12-08",1021.29]
["2009-07-28",1308.01]
["2010-12-19",1250]
["2010-02-02",1486.5]
["2009-08-29",1173.54]
["2009-11-05",1071.67]
["2010-07-20",1141.8599999999999]
["2010-08-01",1264.01]
["2009-12-04",1000.49]
["2010-12-08",1384.3]
["2010-11-26",1190.67]
["2010-05-24",1313.71]
["2010-12-01",1063.53]
["2009-07-31",1123.98]
["2009-01-09",1341.37]
["2010-08-11",1336.68]
["2010-02-25",1085.8900000000001]
["2009-01-07",1475.39]
["2010-02-07",1170.99]
["2010-12-30",1330.53]
["2010-11-28",1054.1500000000001]
["2010-01-16",1189.51]
["2010-03-07",1255.6199999999999]
["2009-11-21",1360.89]
["2010-03-10",1347.46]
["2010-02-26",1446.15]
["2010-02-19",1496.21]
["2009-02-03",1362.35]
["2010-06-01",1079.5]
["2009-09-14",1497.34]

{"sheet":"(612)","index":9,"n_rows":29,"n_cols":2,"rows_kept":29,"cut":false,"hidden":false,"merged":[]}
["Year Over Year Sales"]
["Dates are Text"]
["1) Pivot Table with new column"]
[]
["Month","Sales"]
["Jan, 09",36056.1]
["Feb, 09",33746.28]
["Mar, 09",31865.609999999993]
["Apr, 09",42565.469999999994]
["May, 09",46697.87]
["Jun, 09",36927.089999999997]
["Jul, 09",50825.910000000011]
["Aug, 09",30649.609999999997]
["Sep, 09",30915.84]
["Oct, 09",34735.369999999995]
["Nov, 09",29929.949999999997]
["Dec, 09",36388.239999999998]
["Jan, 10",40594.780000000006]
["Feb, 10",48670.689999999995]
["Mar, 10",34870.950000000004]
["Apr, 10",33386.159999999996]
["May, 10",44013.399999999994]
["Jun, 10",41718.80999999999]
["Jul, 10",37272.130000000005]
["Aug, 10",46581.55]
["Sep, 10",41547.159999999989]
["Oct, 10",47277.78]
["Nov, 10",52107.55]
["Dec, 10",49361.23000000001]

{"sheet":"(612an)","index":10,"n_rows":29,"n_cols":8,"rows_kept":29,"cut":false,"hidden":false,"merged":[]}
["Year Over Year Sales"]
["Dates are Text"]
["1) Pivot Table with new column"]
[]
["Month","Sales","Year"]
["Jan, 09",36056.1,{"$f":"20&RIGHT(A6,2)","v":"2009"},null,"Year","Values"]
["Feb, 09",33746.28,"2009",null,"2009",null,"2010"]
["Mar, 09",31865.609999999993,"2009",null,"Sales ","% Change","Sales ","% Change"]
["Apr, 09",42565.469999999994,"2009",null,441303.34,1,517402.19000000006,1.1724411376537509]
["May, 09",46697.87,"2009"]
["Jun, 09",36927.089999999997,"2009"]
["Jul, 09",50825.910000000011,"2009"]
["Aug, 09",30649.609999999997,"2009"]
["Sep, 09",30915.84,"2009"]
["Oct, 09",34735.369999999995,"2009"]
["Nov, 09",29929.949999999997,"2009"]
["Dec, 09",36388.239999999998,"2009"]
["Jan, 10",40594.780000000006,"2010"]
["Feb, 10",48670.689999999995,"2010"]
["Mar, 10",34870.950000000004,"2010"]
["Apr, 10",33386.159999999996,"2010"]
["May, 10",44013.399999999994,"2010"]
["Jun, 10",41718.80999999999,"2010"]
["Jul, 10",37272.130000000005,"2010"]
["Aug, 10",46581.55,"2010"]
["Sep, 10",41547.159999999989,"2010"]
["Oct, 10",47277.78,"2010"]
["Nov, 10",52107.55,"2010"]
["Dec, 10",49361.23000000001,"2010"]

{"sheet":"(613)","index":11,"n_rows":29,"n_cols":7,"rows_kept":29,"cut":false,"hidden":false,"merged":[]}
["Year Over Year Sales"]
["Dates are Text"]
["2) Array Formula"]
[]
["Month","Sales",null,2009,"% Change","2010","% Change"]
["Jan, 09",36056.1]
["Feb, 09",33746.28]
["Mar, 09",31865.609999999993]
["Apr, 09",42565.469999999994]
["May, 09",46697.87]
["Jun, 09",36927.089999999997]
["Jul, 09",50825.910000000011]
["Aug, 09",30649.609999999997]
["Sep, 09",30915.84]
["Oct, 09",34735.369999999995]
["Nov, 09",29929.949999999997]
["Dec, 09",36388.239999999998]
["Jan, 10",40594.780000000006]
["Feb, 10",48670.689999999995]
["Mar, 10",34870.950000000004]
["Apr, 10",33386.159999999996]
["May, 10",44013.399999999994]
["Jun, 10",41718.80999999999]
["Jul, 10",37272.130000000005]
["Aug, 10",46581.55]
["Sep, 10",41547.159999999989]
["Oct, 10",47277.78]
["Nov, 10",52107.55]
["Dec, 10",49361.23000000001]

{"sheet":"(613an)","index":12,"n_rows":29,"n_cols":7,"rows_kept":29,"cut":false,"hidden":false,"merged":[]}
["Year Over Year Sales"]
["Dates are Text"]
["2) Array Formula"]
[]
["Month","Sales",null,2009,"% Change","2010","% Change"]
["Jan, 09",36056.1,null,{"$f":"SUMPRODUCT(--(20&RIGHT($A$6:$A$29,2)=D5&\"\"),$B$6:$B$29)","v":441303.34},{"$f":"D6/$D$6","v":1},{"$f":"SUMPRODUCT(--(20&RIGHT($A$6:$A$29,2)=F5),$B$6:$B$29)","v":517402.19000000006},{"$f":"F6/$D$6","v":1.1724411376537509}]
["Feb, 09",33746.28]
["Mar, 09",31865.609999999993]
["Apr, 09",42565.469999999994]
["May, 09",46697.87]
["Jun, 09",36927.089999999997]
["Jul, 09",50825.910000000011]
["Aug, 09",30649.609999999997]
["Sep, 09",30915.84]
["Oct, 09",34735.369999999995]
["Nov, 09",29929.949999999997]
["Dec, 09",36388.239999999998]
["Jan, 10",40594.780000000006]
["Feb, 10",48670.689999999995]
["Mar, 10",34870.950000000004]
["Apr, 10",33386.159999999996]
["May, 10",44013.399999999994]
["Jun, 10",41718.80999999999]
["Jul, 10",37272.130000000005]
["Aug, 10",46581.55]
["Sep, 10",41547.159999999989]
["Oct, 10",47277.78]
["Nov, 10",52107.55]
["Dec, 10",49361.23000000001]

{"sheet":"(614)","index":13,"n_rows":29,"n_cols":3,"rows_kept":29,"cut":false,"hidden":false,"merged":[]}
["Year Over Year Sales"]
["Dates are Text"]
["3) REPLACE function to get full date"]
[]
["Month","Sales","Full Date"]
["Jan, 09",36056.1]
["Feb, 09",33746.28]
["Mar, 09",31865.609999999993]
["Apr, 09",42565.469999999994]
["May, 09",46697.87]
["Jun, 09",36927.089999999997]
["Jul, 09",50825.910000000011]
["Aug, 09",30649.609999999997]
["Sep, 09",30915.84]
["Oct, 09",34735.369999999995]
["Nov, 09",29929.949999999997]
["Dec, 09",36388.239999999998]
["Jan, 10",40594.780000000006]
["Feb, 10",48670.689999999995]
["Mar, 10",34870.950000000004]
["Apr, 10",33386.159999999996]
["May, 10",44013.399999999994]
["Jun, 10",41718.80999999999]
["Jul, 10",37272.130000000005]
["Aug, 10",46581.55]
["Sep, 10",41547.159999999989]
["Oct, 10",47277.78]
["Nov, 10",52107.55]
["Dec, 10",49361.23000000001]

{"sheet":"(614an)","index":14,"n_rows":29,"n_cols":3,"rows_kept":29,"cut":false,"hidden":false,"merged":[]}
["Year Over Year Sales"]
["Dates are Text"]
["3) REPLACE function to get full date"]
[]
["Month","Sales","Full Date"]
["Jan, 09",36056.1,{"$f":"--REPLACE(A6,6,0,\"1, 20\")","v":"2009-01-01"}]
["Feb, 09",33746.28,"2009-02-01"]
["Mar, 09",31865.609999999993,"2009-03-01"]
["Apr, 09",42565.469999999994,"2009-04-01"]
["May, 09",46697.87,"2009-05-01"]
["Jun, 09",36927.089999999997,"2009-06-01"]
["Jul, 09",50825.910000000011,"2009-07-01"]
["Aug, 09",30649.609999999997,"2009-08-01"]
["Sep, 09",30915.84,"2009-09-01"]
["Oct, 09",34735.369999999995,"2009-10-01"]
["Nov, 09",29929.949999999997,"2009-11-01"]
["Dec, 09",36388.239999999998,"2009-12-01"]
["Jan, 10",40594.780000000006,"2010-01-01"]
["Feb, 10",48670.689999999995,"2010-02-01"]
["Mar, 10",34870.950000000004,"2010-03-01"]
["Apr, 10",33386.159999999996,"2010-04-01"]
["May, 10",44013.399999999994,"2010-05-01"]
["Jun, 10",41718.80999999999,"2010-06-01"]
["Jul, 10",37272.130000000005,"2010-07-01"]
["Aug, 10",46581.55,"2010-08-01"]
["Sep, 10",41547.159999999989,"2010-09-01"]
["Oct, 10",47277.78,"2010-10-01"]
["Nov, 10",52107.55,"2010-11-01"]
["Dec, 10",49361.23000000001,"2010-12-01"]

{"sheet":"PT(% Change Month)","index":15,"n_rows":17,"n_cols":17,"rows_kept":17,"cut":false,"hidden":false,"merged":[]}
[]
[]
[null,"Years","Values",null,null,null,null,"Check:"]
[null,"2009",null,"2010"]
["Full Date","Sales ","% Change","Sales ","% Change",null,null,null,2009,"% Change",2010,"% Change"]
["Jan",36056.1,null,40594.780000000006,0.12587828411836022,null,null,{"$f":"MONTH('(614an)'!C6)","v":1},{"$f":"SUMPRODUCT(--(MONTH('(614an)'!$C$6:$C$29)=$H6),--(YEAR('(614an)'!$C$6:$C$29)=I$5),'(614an)'!$B$6:$B$29)","v":36056.1},{"$f":"I6/$I6-1","v":0},{"$f":"SUMPRODUCT(--(MONTH('(614an)'!$C$6:$C$29)=$H6),--(YEAR('(614an)'!$C$6:$C$29)=K$5),'(614an)'!$B$6:$B$29)","v":40594.780000000006},{"$f":"K6/$I6-1","v":0.12587828411836011},null,{"$f":"I6=B6","v":true},{"$f":"J6=C6","v":true},{"$f":"K6=D6","v":true},{"$f":"L6=E6","v":true}]
["Feb",33746.28,null,48670.689999999995,0.4422534869028526,null,null,{"$f":"MONTH('(614an)'!C7)","v":2},{"$f":"SUMPRODUCT(--(MONTH('(614an)'!$C$6:$C$29)=$H7),--(YEAR('(614an)'!$C$6:$C$29)=I$5),'(614an)'!$B$6:$B$29)","v":33746.28},{"$f":"I7/$I7-1","v":0},{"$f":"SUMPRODUCT(--(MONTH('(614an)'!$C$6:$C$29)=$H7),--(YEAR('(614an)'!$C$6:$C$29)=K$5),'(614an)'!$B$6:$B$29)","v":48670.689999999995},{"$f":"K7/$I7-1","v":0.44225348690285271},null,true,true,true,true]
["Mar",31865.609999999993,null,34870.950000000004,9.4312959959028303E-2,null,null,{"$f":"MONTH('(614an)'!C8)","v":3},{"$f":"SUMPRODUCT(--(MONTH('(614an)'!$C$6:$C$29)=$H8),--(YEAR('(614an)'!$C$6:$C$29)=I$5),'(614an)'!$B$6:$B$29)","v":31865.609999999993},{"$f":"I8/$I8-1","v":0},{"$f":"SUMPRODUCT(--(MONTH('(614an)'!$C$6:$C$29)=$H8),--(YEAR('(614an)'!$C$6:$C$29)=K$5),'(614an)'!$B$6:$B$29)","v":34870.950000000004},{"$f":"K8/$I8-1","v":9.431295995902822E-2},null,true,true,true,false]
["Apr",42565.469999999994,null,33386.159999999996,-0.21565155982067152,null,null,{"$f":"MONTH('(614an)'!C9)","v":4},{"$f":"SUMPRODUCT(--(MONTH('(614an)'!$C$6:$C$29)=$H9),--(YEAR('(614an)'!$C$6:$C$29)=I$5),'(614an)'!$B$6:$B$29)","v":42565.469999999994},{"$f":"I9/$I9-1","v":0},{"$f":"SUMPRODUCT(--(MONTH('(614an)'!$C$6:$C$29)=$H9),--(YEAR('(614an)'!$C$6:$C$29)=K$5),'(614an)'!$B$6:$B$29)","v":33386.159999999996},{"$f":"K9/$I9-1","v":-0.21565155982067152},null,true,true,true,true]
["May",46697.87,null,44013.399999999994,-5.7485919593334947E-2,null,null,{"$f":"MONTH('(614an)'!C10)","v":5},{"$f":"SUMPRODUCT(--(MONTH('(614an)'!$C$6:$C$29)=$H10),--(YEAR('(614an)'!$C$6:$C$29)=I$5),'(614an)'!$B$6:$B$29)","v":46697.87},{"$f":"I10/$I10-1","v":0},{"$f":"SUMPRODUCT(--(MONTH('(614an)'!$C$6:$C$29)=$H10),--(YEAR('(614an)'!$C$6:$C$29)=K$5),'(614an)'!$B$6:$B$29)","v":44013.399999999994},{"$f":"K10/$I10-1","v":-5.7485919593334933E-2},null,true,true,true,true]
["Jun",36927.089999999997,null,41718.80999999999,0.1297616465310425,null,null,{"$f":"MONTH('(614an)'!C11)","v":6},{"$f":"SUMPRODUCT(--(MONTH('(614an)'!$C$6:$C$29)=$H11),--(YEAR('(614an)'!$C$6:$C$29)=I$5),'(614an)'!$B$6:$B$29)","v":36927.089999999997},{"$f":"I11/$I11-1","v":0},{"$f":"SUMPRODUCT(--(MONTH('(614an)'!$C$6:$C$29)=$H11),--(YEAR('(614an)'!$C$6:$C$29)=K$5),'(614an)'!$B$6:$B$29)","v":41718.80999999999},{"$f":"K11/$I11-1","v":0.1297616465310425},null,true,true,true,true]
["Jul",50825.910000000011,null,37272.130000000005,-0.26667068036755276,null,null,{"$f":"MONTH('(614an)'!C12)","v":7},{"$f":"SUMPRODUCT(--(MONTH('(614an)'!$C$6:$C$29)=$H12),--(YEAR('(614an)'!$C$6:$C$29)=I$5),'(614an)'!$B$6:$B$29)","v":50825.910000000011},{"$f":"I12/$I12-1","v":0},{"$f":"SUMPRODUCT(--(MONTH('(614an)'!$C$6:$C$29)=$H12),--(YEAR('(614an)'!$C$6:$C$29)=K$5),'(614an)'!$B$6:$B$29)","v":37272.130000000005},{"$f":"K12/$I12-1","v":-0.2666706803675527},null,true,true,true,true]
["Aug",30649.609999999997,null,46581.55,0.51980889805775699,null,null,{"$f":"MONTH('(614an)'!C13)","v":8},{"$f":"SUMPRODUCT(--(MONTH('(614an)'!$C$6:$C$29)=$H13),--(YEAR('(614an)'!$C$6:$C$29)=I$5),'(614an)'!$B$6:$B$29)","v":30649.609999999997},{"$f":"I13/$I13-1","v":0},{"$f":"SUMPRODUCT(--(MONTH('(614an)'!$C$6:$C$29)=$H13),--(YEAR('(614an)'!$C$6:$C$29)=K$5),'(614an)'!$B$6:$B$29)","v":46581.55},{"$f":"K13/$I13-1","v":0.51980889805775687},null,true,true,true,true]
["Sep",30915.84,null,41547.159999999989,0.34387938351343483,null,null,{"$f":"MONTH('(614an)'!C14)","v":9},{"$f":"SUMPRODUCT(--(MONTH('(614an)'!$C$6:$C$29)=$H14),--(YEAR('(614an)'!$C$6:$C$29)=I$5),'(614an)'!$B$6:$B$29)","v":30915.84},{"$f":"I14/$I14-1","v":0},{"$f":"SUMPRODUCT(--(MONTH('(614an)'!$C$6:$C$29)=$H14),--(YEAR('(614an)'!$C$6:$C$29)=K$5),'(614an)'!$B$6:$B$29)","v":41547.159999999989},{"$f":"K14/$I14-1","v":0.34387938351343483},null,true,true,true,true]
["Oct",34735.369999999995,null,47277.78,0.36108468111898634,null,null,{"$f":"MONTH('(614an)'!C15)","v":10},{"$f":"SUMPRODUCT(--(MONTH('(614an)'!$C$6:$C$29)=$H15),--(YEAR('(614an)'!$C$6:$C$29)=I$5),'(614an)'!$B$6:$B$29)","v":34735.369999999995},{"$f":"I15/$I15-1","v":0},{"$f":"SUMPRODUCT(--(MONTH('(614an)'!$C$6:$C$29)=$H15),--(YEAR('(614an)'!$C$6:$C$29)=K$5),'(614an)'!$B$6:$B$29)","v":47277.78},{"$f":"K15/$I15-1","v":0.36108468111898628},null,true,true,true,true]
["Nov",29929.949999999997,null,52107.55,0.74098352987559313,null,null,{"$f":"MONTH('(614an)'!C16)","v":11},{"$f":"SUMPRODUCT(--(MONTH('(614an)'!$C$6:$C$29)=$H16),--(YEAR('(614an)'!$C$6:$C$29)=I$5),'(614an)'!$B$6:$B$29)","v":29929.949999999997},{"$f":"I16/$I16-1","v":0},{"$f":"SUMPRODUCT(--(MONTH('(614an)'!$C$6:$C$29)=$H16),--(YEAR('(614an)'!$C$6:$C$29)=K$5),'(614an)'!$B$6:$B$29)","v":52107.55},{"$f":"K16/$I16-1","v":0.74098352987559313},null,true,true,true,true]
["Dec",36388.239999999998,null,49361.23000000001,0.35651600627015795,null,null,{"$f":"MONTH('(614an)'!C17)","v":12},{"$f":"SUMPRODUCT(--(MONTH('(614an)'!$C$6:$C$29)=$H17),--(YEAR('(614an)'!$C$6:$C$29)=I$5),'(614an)'!$B$6:$B$29)","v":36388.239999999998},{"$f":"I17/$I17-1","v":0},{"$f":"SUMPRODUCT(--(MONTH('(614an)'!$C$6:$C$29)=$H17),--(YEAR('(614an)'!$C$6:$C$29)=K$5),'(614an)'!$B$6:$B$29)","v":49361.23000000001},{"$f":"K17/$I17-1","v":0.356516006270158},null,true,true,true,true]