{"text_format":"1","workbook":"xlsx","n_sheets":13,"sheets":["(604)","(604an)","(605)","(605an)","(398)","(606)","(606an)","(607) PO","REC","INV","(607) PO (an)","REC(an)","INV(an)"],"not_rendered":{"charts":0,"images":1,"macros":0,"external_links":0,"defined_names":0,"comments":0,"pivot_tables":0},"unopened":[],"bounds":{"document_bytes":16777216,"sheet_cells":100000,"rows_first":2000,"rows_last":500,"rows_between":2000,"halvings":0,"cell_chars":16384,"cell_head_chars":4096},"cells_cut":0,"cells_raw":0,"read":"whole","date_system":"1900"}

{"sheet":"(604)","index":0,"n_rows":22,"n_cols":6,"rows_kept":22,"cut":false,"hidden":false,"merged":[]}
[null,"Jan","Feb","Mar","Apr","Total"]
["Sales"]
[{"$f":"A11","v":"COGS"}]
[{"$f":"A12","v":"Operating Expenses"}]
[{"$f":"A13","v":"Administrative Expenses"}]
[{"$f":"A14","v":"Other Expenses"}]
["Total Expenses"]
["Net Income"]
[]
["Assumptions - Formula Inputs"]
["COGS"]
["Operating Expenses"]
["Administrative Expenses"]
["Other Expenses"]
[]
{"$rows_left_out":8}
{"sheet":"(604an)","index":1,"n_rows":22,"n_cols":6,"rows_kept":22,"cut":false,"hidden":false,"merged":[]}
[null,"Jan","Feb","Mar","Apr","Total"]
["Sales",1000,1500,1700,2000,{"$f":"SUM(B2:E2)","v":6200}]
[{"$f":"A11","v":"COGS"},{"$f":"B$2*$B11","v":450},{"$f":"C$2*$B11","v":675},{"$f":"D$2*$B11","v":765},{"$f":"E$2*$B11","v":900},2790]
[{"$f":"A12","v":"Operating Expenses"},{"$f":"B$2*$B12","v":100},150,170,200,620]
[{"$f":"A13","v":"Administrative Expenses"},25,37.5,42.5,50,155]
[{"$f":"A14","v":"Other Expenses"},50,75,85,{"$f":"E$2*$B14","v":100},310]
["Total Expenses",{"$f":"SUM(B3:B6)","v":625},{"$f":"SUM(C3:C6)","v":937.5},{"$f":"SUM(D3:D6)","v":1062.5},{"$f":"SUM(E3:E6)","v":1250},3875]
["Net Income",{"$f":"B2-B7","v":375},{"$f":"C2-C7","v":562.5},{"$f":"D2-D7","v":637.5},{"$f":"E2-E7","v":750},2325]
[]
["Assumptions - Formula Inputs"]
["COGS",0.45]
["Operating Expenses",0.1]
["Administrative Expenses",2.5000000000000001E-2]
["Other Expenses",0.05]
[]
{"$rows_left_out":8}
{"sheet":"(605)","index":2,"n_rows":6,"n_cols":9,"rows_kept":6,"cut":false,"hidden":false,"merged":[]}
[1,null,2,null,"A1 = 1",null,"B1 = 2",null,"A1 = 1"]
[2,null,3,null,"A2 = 2",null,"B2 = 3",null,"A2 = 2"]
[null,null,4,null,"A3 =",null,"B3 = 4",null,"A3 = 4"]
[4,null,5,null,"A4 = 4",null,"B4 = 5",null,"A4 = 4 "]
[null,null,8,null,"A5 = ",null,"B5 = 8",null,"A5 = 8"]
[3,null,9,null,"A6 = 3",null,"B6 = 9",null,"A6 = 3"]

{"sheet":"(605an)","index":3,"n_rows":6,"n_cols":11,"rows_kept":6,"cut":false,"hidden":false,"merged":[]}
[1,null,2,null,"A1 = 1",null,"B1 = 2",null,"A1 = 1",null,{"$f":"IF(A1=\"\",C1,A1)","v":1}]
[2,null,3,null,"A2 = 2",null,"B2 = 3",null,"A2 = 2",null,2]
[4,null,4,null,"A3 =",null,"B3 = 4",null,"A3 = 4",null,4]
[4,null,5,null,"A4 = 4",null,"B4 = 5",null,"A4 = 4 ",null,4]
[8,null,8,null,"A5 = ",null,"B5 = 8",null,"A5 = 8",null,8]
[3,null,9,null,"A6 = 3",null,"B6 = 9",null,"A6 = 3",null,3]

{"sheet":"(398)","index":4,"n_rows":28,"n_cols":10,"rows_kept":28,"cut":false,"hidden":false,"merged":[]}
["For more info on the VLOOKUP function ,see this video:",null,null,null,null,null,"03 Excel Series: Lookup functions"]
["For more info on the IFERROR function ,see this video:",null,null,null,null,null,"Excel Magic Trick #32: New 2007 IFERROR function"]
[null,null,null,null,null,null,"Excel Magic Trick 333: #DIV/0! Error IF & ISERROR or ..."]
["For more info on the  join symbol ,see this video:",null,null,null,null,null,"Excel Magic Trick # 166: CONCATENATE function & Ampersand"]
["Goal:\n1) There are duplicates (like ABC) in List 1\n2) Lookup all ABC and Cities in List 1\n3) but only return ID from List 2 for Company-City match (like ABC-NY)\n4) End result is shown in column C."]
[]
["Excel Magic Trick 398: VLOOKUP with Two Lookup Values (IFERROR function also) 2 lookup values ",null,null,null,null,null,null,null,null,"<== Original Video"]
[]
["List 1",null,null,null,null,"List 2",null,null,null,"2003 solution"]
[]
["Company","City","Returned ID",null,"Join","Company","City","ID",null,"Returned ID"]
["ABC","NY",{"$f":"IFERROR(VLOOKUP(A12&\"-\"&B12,$E$12:$H$22,4,0),\"\")","v":1734},null,{"$f":"F12&\"-\"&G12","v":"ABC-NY"},"ABC","NY",1734,null,{"$f":"IF(ISERROR(VLOOKUP(A12&\"-\"&B12,$E$12:$H$22,4,0)),\"\",VLOOKUP(A12&\"-\"&B12,$E$12:$H$22,4,0))","v":1734}]
["GEL","GIG",{"$f":"IFERROR(VLOOKUP(A13&\"-\"&B13,$E$12:$H$22,4,0),\"\")","v":11916},null,{"$f":"F13&\"-\"&G13","v":"CBB-LAA"},"CBB","LAA",2260,null,{"$f":"IF(ISERROR(VLOOKUP(A13&\"-\"&B13,$E$12:$H$22,4,0)),\"\",VLOOKUP(A13&\"-\"&B13,$E$12:$H$22,4,0))","v":11916}]
["ABC","CHI","",null,"ACME-LAA","ACME","LAA",4119,null,""]
["ACME","PHE","",null,"BBB-NY","BBB","NY",6480,null,""]
{"$rows_left_out":14}
{"sheet":"(606)","index":5,"n_rows":28,"n_cols":9,"rows_kept":28,"cut":false,"hidden":false,"merged":[]}
[]
[]
[]
[]
[]
["Goal:\n1) There are duplicates (like ABC) in List 1\n2) Lookup all ABC and Cities in List 1\n3) but only return ID from List 2 for Company-City match (like ABC-NY)\n4) End result is shown in column C."]
[]
["Excel Magic Trick 398: VLOOKUP with Two Lookup Values (IFERROR function also) 2 lookup values "]
["List 1",null,null,null,"List 2",null,null,null,"2003 solution"]
[]
["Company","City","Returned ID",null,"Company","City","ID",null,"Returned ID"]
["ABC","NY",null,null,"ABC","NY",1734,null,{"$f":"IF(ISERROR(INDEX($G$12:$G$22,MATCH(A12&B12,$E$12:$E$22&$F$12:$F$22,0))),\"\",INDEX($G$12:$G$22,MATCH(A12&B12,$E$12:$E$22&$F$12:$F$22,0)))","v":1734}]
["GEL","GIG",null,null,"CBB","LAA",2260,null,{"$f":"IF(ISERROR(INDEX($G$12:$G$22,MATCH(A13&B13,$E$12:$E$22&$F$12:$F$22,0))),\"\",INDEX($G$12:$G$22,MATCH(A13&B13,$E$12:$E$22&$F$12:$F$22,0)))","v":11916}]
["ABC","CHI",null,null,"ACME","LAA",4119,null,{"$f":"IF(ISERROR(INDEX($G$12:$G$22,MATCH(A14&B14,$E$12:$E$22&$F$12:$F$22,0))),\"\",INDEX($G$12:$G$22,MATCH(A14&B14,$E$12:$E$22&$F$12:$F$22,0)))","v":""}]
["ACME","PHE",null,null,"BBB","NY",6480,null,{"$f":"IF(ISERROR(INDEX($G$12:$G$22,MATCH(A15&B15,$E$12:$E$22&$F$12:$F$22,0))),\"\",INDEX($G$12:$G$22,MATCH(A15&B15,$E$12:$E$22&$F$12:$F$22,0)))","v":""}]
{"$rows_left_out":14}
{"sheet":"(606an)","index":6,"n_rows":28,"n_cols":9,"rows_kept":28,"cut":false,"hidden":false,"merged":[]}
[]
[]
[]
[]
[]
["Goal:\n1) There are duplicates (like ABC) in List 1\n2) Lookup all ABC and Cities in List 1\n3) but only return ID from List 2 for Company-City match (like ABC-NY)\n4) End result is shown in column C."]
[]
["Excel Magic Trick 398: VLOOKUP with Two Lookup Values (IFERROR function also) 2 lookup values "]
["List 1",null,null,null,"List 2",null,null,null,"2003 solution"]
[]
["Company","City","Returned ID",null,"Company","City","ID",null,"Returned ID"]
["ABC","NY",{"$f":"IFERROR(INDEX($G$12:$G$22,MATCH(A12&B12,$E$12:$E$22&$F$12:$F$22,0)),\"\")","v":1734},null,"ABC","NY",1734,null,{"$f":"IF(ISERROR(INDEX($G$12:$G$22,MATCH(A12&B12,$E$12:$E$22&$F$12:$F$22,0))),\"\",INDEX($G$12:$G$22,MATCH(A12&B12,$E$12:$E$22&$F$12:$F$22,0)))","v":1734}]
["GEL","GIG",{"$f":"IFERROR(INDEX($G$12:$G$22,MATCH(A13&B13,$E$12:$E$22&$F$12:$F$22,0)),\"\")","v":11916},null,"CBB","LAA",2260,null,{"$f":"IF(ISERROR(INDEX($G$12:$G$22,MATCH(A13&B13,$E$12:$E$22&$F$12:$F$22,0))),\"\",INDEX($G$12:$G$22,MATCH(A13&B13,$E$12:$E$22&$F$12:$F$22,0)))","v":11916}]
["ABC","CHI",{"$f":"IFERROR(INDEX($G$12:$G$22,MATCH(A14&B14,$E$12:$E$22&$F$12:$F$22,0)),\"\")","v":""},null,"ACME","LAA",4119,null,{"$f":"IF(ISERROR(INDEX($G$12:$G$22,MATCH(A14&B14,$E$12:$E$22&$F$12:$F$22,0))),\"\",INDEX($G$12:$G$22,MATCH(A14&B14,$E$12:$E$22&$F$12:$F$22,0)))","v":""}]
["ACME","PHE",{"$f":"IFERROR(INDEX($G$12:$G$22,MATCH(A15&B15,$E$12:$E$22&$F$12:$F$22,0)),\"\")","v":""},null,"BBB","NY",6480,null,{"$f":"IF(ISERROR(INDEX($G$12:$G$22,MATCH(A15&B15,$E$12:$E$22&$F$12:$F$22,0))),\"\",INDEX($G$12:$G$22,MATCH(A15&B15,$E$12:$E$22&$F$12:$F$22,0)))","v":""}]
{"$rows_left_out":14}
{"sheet":"(607) PO","index":7,"n_rows":66,"n_cols":8,"rows_kept":66,"cut":false,"hidden":false,"merged":[]}
["PO","DATE","PO = REC = INV\nall three?",null,null,null,null,"2003 solution"]
[25010,"2009-05-20",null,null,{"$f":"VLOOKUP($A2,'REC(an)'!$B$2:$B$33,1,0)","v":25010},{"$f":"VLOOKUP($A2,'INV(an)'!$B$2:$B$16,1,0)","v":25010},null,{"$f":"IF(ISNA(AND(A2=VLOOKUP($A2,'REC(an)'!$B$2:$B$33,1,0),A2=VLOOKUP($A2,'INV(an)'!$B$2:$B$16,1,0))),\"\",AND(A2=VLOOKUP($A2,'REC(an)'!$B$2:$B$33,1,0),A2=VLOOKUP($A2,'INV(an)'!$B$2:$B$16,1,0)))","v":true}]
[25011,"2009-05-21",null,null,null,null,null,{"$f":"IF(ISNA(AND(A3=VLOOKUP($A3,'REC(an)'!$B$2:$B$33,1,0),A3=VLOOKUP($A3,'INV(an)'!$B$2:$B$16,1,0))),\"\",AND(A3=VLOOKUP($A3,'REC(an)'!$B$2:$B$33,1,0),A3=VLOOKUP($A3,'INV(an)'!$B$2:$B$16,1,0)))","v":true}]
[25012,"2009-05-22",null,null,null,null,null,{"$f":"IF(ISNA(AND(A4=VLOOKUP($A4,'REC(an)'!$B$2:$B$33,1,0),A4=VLOOKUP($A4,'INV(an)'!$B$2:$B$16,1,0))),\"\",AND(A4=VLOOKUP($A4,'REC(an)'!$B$2:$B$33,1,0),A4=VLOOKUP($A4,'INV(an)'!$B$2:$B$16,1,0)))","v":true}]
[25013,"2009-05-23",null,null,null,null,null,{"$f":"IF(ISNA(AND(A5=VLOOKUP($A5,'REC(an)'!$B$2:$B$33,1,0),A5=VLOOKUP($A5,'INV(an)'!$B$2:$B$16,1,0))),\"\",AND(A5=VLOOKUP($A5,'REC(an)'!$B$2:$B$33,1,0),A5=VLOOKUP($A5,'INV(an)'!$B$2:$B$16,1,0)))","v":true}]
[25014,"2009-05-24",null,null,null,null,null,{"$f":"IF(ISNA(AND(A6=VLOOKUP($A6,'REC(an)'!$B$2:$B$33,1,0),A6=VLOOKUP($A6,'INV(an)'!$B$2:$B$16,1,0))),\"\",AND(A6=VLOOKUP($A6,'REC(an)'!$B$2:$B$33,1,0),A6=VLOOKUP($A6,'INV(an)'!$B$2:$B$16,1,0)))","v":true}]
[25015,"2009-05-25",null,null,null,null,null,{"$f":"IF(ISNA(AND(A7=VLOOKUP($A7,'REC(an)'!$B$2:$B$33,1,0),A7=VLOOKUP($A7,'INV(an)'!$B$2:$B$16,1,0))),\"\",AND(A7=VLOOKUP($A7,'REC(an)'!$B$2:$B$33,1,0),A7=VLOOKUP($A7,'INV(an)'!$B$2:$B$16,1,0)))","v":""}]
[25016,"2009-05-26",null,null,null,null,null,{"$f":"IF(ISNA(AND(A8=VLOOKUP($A8,'REC(an)'!$B$2:$B$33,1,0),A8=VLOOKUP($A8,'INV(an)'!$B$2:$B$16,1,0))),\"\",AND(A8=VLOOKUP($A8,'REC(an)'!$B$2:$B$33,1,0),A8=VLOOKUP($A8,'INV(an)'!$B$2:$B$16,1,0)))","v":""}]
[25017,"2009-05-27",null,null,null,null,null,{"$f":"IF(ISNA(AND(A9=VLOOKUP($A9,'REC(an)'!$B$2:$B$33,1,0),A9=VLOOKUP($A9,'INV(an)'!$B$2:$B$16,1,0))),\"\",AND(A9=VLOOKUP($A9,'REC(an)'!$B$2:$B$33,1,0),A9=VLOOKUP($A9,'INV(an)'!$B$2:$B$16,1,0)))","v":""}]
[25018,"2009-05-28",null,null,null,null,null,{"$f":"IF(ISNA(AND(A10=VLOOKUP($A10,'REC(an)'!$B$2:$B$33,1,0),A10=VLOOKUP($A10,'INV(an)'!$B$2:$B$16,1,0))),\"\",AND(A10=VLOOKUP($A10,'REC(an)'!$B$2:$B$33,1,0),A10=VLOOKUP($A10,'INV(an)'!$B$2:$B$16,1,0)))","v":""}]
[25019,"2009-05-29",null,null,null,null,null,{"$f":"IF(ISNA(AND(A11=VLOOKUP($A11,'REC(an)'!$B$2:$B$33,1,0),A11=VLOOKUP($A11,'INV(an)'!$B$2:$B$16,1,0))),\"\",AND(A11=VLOOKUP($A11,'REC(an)'!$B$2:$B$33,1,0),A11=VLOOKUP($A11,'INV(an)'!$B$2:$B$16,1,0)))","v":""}]
[25020,"2009-05-30",null,null,null,null,null,{"$f":"IF(ISNA(AND(A12=VLOOKUP($A12,'REC(an)'!$B$2:$B$33,1,0),A12=VLOOKUP($A12,'INV(an)'!$B$2:$B$16,1,0))),\"\",AND(A12=VLOOKUP($A12,'REC(an)'!$B$2:$B$33,1,0),A12=VLOOKUP($A12,'INV(an)'!$B$2:$B$16,1,0)))","v":""}]
[25021,"2009-05-31",null,null,null,null,null,{"$f":"IF(ISNA(AND(A13=VLOOKUP($A13,'REC(an)'!$B$2:$B$33,1,0),A13=VLOOKUP($A13,'INV(an)'!$B$2:$B$16,1,0))),\"\",AND(A13=VLOOKUP($A13,'REC(an)'!$B$2:$B$33,1,0),A13=VLOOKUP($A13,'INV(an)'!$B$2:$B$16,1,0)))","v":""}]
[25022,"2009-06-01",null,null,null,null,null,{"$f":"IF(ISNA(AND(A14=VLOOKUP($A14,'REC(an)'!$B$2:$B$33,1,0),A14=VLOOKUP($A14,'INV(an)'!$B$2:$B$16,1,0))),\"\",AND(A14=VLOOKUP($A14,'REC(an)'!$B$2:$B$33,1,0),A14=VLOOKUP($A14,'INV(an)'!$B$2:$B$16,1,0)))","v":""}]
[25023,"2009-06-02",null,null,null,null,null,{"$f":"IF(ISNA(AND(A15=VLOOKUP($A15,'REC(an)'!$B$2:$B$33,1,0),A15=VLOOKUP($A15,'INV(an)'!$B$2:$B$16,1,0))),\"\",AND(A15=VLOOKUP($A15,'REC(an)'!$B$2:$B$33,1,0),A15=VLOOKUP($A15,'INV(an)'!$B$2:$B$16,1,0)))","v":""}]
{"$rows_left_out":52}
{"sheet":"REC","index":8,"n_rows":33,"n_cols":3,"rows_kept":33,"cut":false,"hidden":false,"merged":[]}
["Rec#","PO","Date"]
[22620,25010,"2009-05-24"]
[62480,25012,"2010-05-25"]
[71029,25014,"2011-05-26"]
[30367,25011,"2012-05-26"]
[82163,25013,"2013-05-27"]
[96494,25027,"2014-05-28"]
[21960,25028,"2015-05-29"]
[13496,25024,"2016-05-29"]
[47852,25026,"2017-05-30"]
[82319,25028,"2018-05-31"]
[85104,25030,"2019-06-01"]
[27775,25032,"2020-06-01"]
[47124,25034,"2021-06-02"]
[95387,25036,"2022-06-03"]
{"$rows_left_out":19}
{"sheet":"INV","index":9,"n_rows":16,"n_cols":3,"rows_kept":16,"cut":false,"hidden":false,"merged":[]}
["Inv#","PO","Date"]
["G33398",25010,"2010-05-27"]
["Y96346",25014,"2010-05-28"]
["G15281",25011,"2010-05-28"]
["E66862",25013,"2010-05-29"]
["N13722",25026,"2010-05-30"]
["J84276",25030,"2010-05-31"]
["M14834",25034,"2010-06-01"]
["D58891",25038,"2010-06-02"]
["L50179",25042,"2010-06-03"]
["Z79465",25046,"2010-06-04"]
["J78185",25050,"2010-06-05"]
["P87275",25027,"2010-06-06"]
["J84477",25028,"2010-06-07"]
["rtdtrdrt",25012,"2010-06-08"]
{"$rows_left_out":2}
{"sheet":"(607) PO (an)","index":10,"n_rows":66,"n_cols":8,"rows_kept":66,"cut":false,"hidden":false,"merged":[]}
["PO","DATE","PO = REC = INV\nall three?",null,null,null,null,"2003 solution"]
[25010,"2009-05-20",{"$f":"IFERROR(AND(A2=VLOOKUP($A2,'REC(an)'!$B$2:$B$33,1,0),A2=VLOOKUP($A2,'INV(an)'!$B$2:$B$16,1,0)),\"\")","v":true},null,{"$f":"VLOOKUP($A2,'REC(an)'!$B$2:$B$33,1,0)","v":25010},{"$f":"VLOOKUP($A2,'INV(an)'!$B$2:$B$16,1,0)","v":25010},null,{"$f":"IF(ISNA(AND(A2=VLOOKUP($A2,'REC(an)'!$B$2:$B$33,1,0),A2=VLOOKUP($A2,'INV(an)'!$B$2:$B$16,1,0))),\"\",AND(A2=VLOOKUP($A2,'REC(an)'!$B$2:$B$33,1,0),A2=VLOOKUP($A2,'INV(an)'!$B$2:$B$16,1,0)))","v":true}]
[25011,"2009-05-21",{"$f":"IFERROR(AND(A3=VLOOKUP($A3,'REC(an)'!$B$2:$B$33,1,0),A3=VLOOKUP($A3,'INV(an)'!$B$2:$B$16,1,0)),\"\")","v":true},null,null,null,null,{"$f":"IF(ISNA(AND(A3=VLOOKUP($A3,'REC(an)'!$B$2:$B$33,1,0),A3=VLOOKUP($A3,'INV(an)'!$B$2:$B$16,1,0))),\"\",AND(A3=VLOOKUP($A3,'REC(an)'!$B$2:$B$33,1,0),A3=VLOOKUP($A3,'INV(an)'!$B$2:$B$16,1,0)))","v":true}]
[25012,"2009-05-22",{"$f":"IFERROR(AND(A4=VLOOKUP($A4,'REC(an)'!$B$2:$B$33,1,0),A4=VLOOKUP($A4,'INV(an)'!$B$2:$B$16,1,0)),\"\")","v":true},null,null,null,null,{"$f":"IF(ISNA(AND(A4=VLOOKUP($A4,'REC(an)'!$B$2:$B$33,1,0),A4=VLOOKUP($A4,'INV(an)'!$B$2:$B$16,1,0))),\"\",AND(A4=VLOOKUP($A4,'REC(an)'!$B$2:$B$33,1,0),A4=VLOOKUP($A4,'INV(an)'!$B$2:$B$16,1,0)))","v":true}]
[25013,"2009-05-23",{"$f":"IFERROR(AND(A5=VLOOKUP($A5,'REC(an)'!$B$2:$B$33,1,0),A5=VLOOKUP($A5,'INV(an)'!$B$2:$B$16,1,0)),\"\")","v":true},null,null,null,null,{"$f":"IF(ISNA(AND(A5=VLOOKUP($A5,'REC(an)'!$B$2:$B$33,1,0),A5=VLOOKUP($A5,'INV(an)'!$B$2:$B$16,1,0))),\"\",AND(A5=VLOOKUP($A5,'REC(an)'!$B$2:$B$33,1,0),A5=VLOOKUP($A5,'INV(an)'!$B$2:$B$16,1,0)))","v":true}]
[25014,"2009-05-24",{"$f":"IFERROR(AND(A6=VLOOKUP($A6,'REC(an)'!$B$2:$B$33,1,0),A6=VLOOKUP($A6,'INV(an)'!$B$2:$B$16,1,0)),\"\")","v":true},null,null,null,null,{"$f":"IF(ISNA(AND(A6=VLOOKUP($A6,'REC(an)'!$B$2:$B$33,1,0),A6=VLOOKUP($A6,'INV(an)'!$B$2:$B$16,1,0))),\"\",AND(A6=VLOOKUP($A6,'REC(an)'!$B$2:$B$33,1,0),A6=VLOOKUP($A6,'INV(an)'!$B$2:$B$16,1,0)))","v":true}]
[25015,"2009-05-25",{"$f":"IFERROR(AND(A7=VLOOKUP($A7,'REC(an)'!$B$2:$B$33,1,0),A7=VLOOKUP($A7,'INV(an)'!$B$2:$B$16,1,0)),\"\")","v":""},null,null,null,null,{"$f":"IF(ISNA(AND(A7=VLOOKUP($A7,'REC(an)'!$B$2:$B$33,1,0),A7=VLOOKUP($A7,'INV(an)'!$B$2:$B$16,1,0))),\"\",AND(A7=VLOOKUP($A7,'REC(an)'!$B$2:$B$33,1,0),A7=VLOOKUP($A7,'INV(an)'!$B$2:$B$16,1,0)))","v":""}]
[25016,"2009-05-26",{"$f":"IFERROR(AND(A8=VLOOKUP($A8,'REC(an)'!$B$2:$B$33,1,0),A8=VLOOKUP($A8,'INV(an)'!$B$2:$B$16,1,0)),\"\")","v":""},null,null,null,null,{"$f":"IF(ISNA(AND(A8=VLOOKUP($A8,'REC(an)'!$B$2:$B$33,1,0),A8=VLOOKUP($A8,'INV(an)'!$B$2:$B$16,1,0))),\"\",AND(A8=VLOOKUP($A8,'REC(an)'!$B$2:$B$33,1,0),A8=VLOOKUP($A8,'INV(an)'!$B$2:$B$16,1,0)))","v":""}]
[25017,"2009-05-27",{"$f":"IFERROR(AND(A9=VLOOKUP($A9,'REC(an)'!$B$2:$B$33,1,0),A9=VLOOKUP($A9,'INV(an)'!$B$2:$B$16,1,0)),\"\")","v":""},null,null,null,null,{"$f":"IF(ISNA(AND(A9=VLOOKUP($A9,'REC(an)'!$B$2:$B$33,1,0),A9=VLOOKUP($A9,'INV(an)'!$B$2:$B$16,1,0))),\"\",AND(A9=VLOOKUP($A9,'REC(an)'!$B$2:$B$33,1,0),A9=VLOOKUP($A9,'INV(an)'!$B$2:$B$16,1,0)))","v":""}]
[25018,"2009-05-28",{"$f":"IFERROR(AND(A10=VLOOKUP($A10,'REC(an)'!$B$2:$B$33,1,0),A10=VLOOKUP($A10,'INV(an)'!$B$2:$B$16,1,0)),\"\")","v":""},null,null,null,null,{"$f":"IF(ISNA(AND(A10=VLOOKUP($A10,'REC(an)'!$B$2:$B$33,1,0),A10=VLOOKUP($A10,'INV(an)'!$B$2:$B$16,1,0))),\"\",AND(A10=VLOOKUP($A10,'REC(an)'!$B$2:$B$33,1,0),A10=VLOOKUP($A10,'INV(an)'!$B$2:$B$16,1,0)))","v":""}]
[25019,"2009-05-29",{"$f":"IFERROR(AND(A11=VLOOKUP($A11,'REC(an)'!$B$2:$B$33,1,0),A11=VLOOKUP($A11,'INV(an)'!$B$2:$B$16,1,0)),\"\")","v":""},null,null,null,null,{"$f":"IF(ISNA(AND(A11=VLOOKUP($A11,'REC(an)'!$B$2:$B$33,1,0),A11=VLOOKUP($A11,'INV(an)'!$B$2:$B$16,1,0))),\"\",AND(A11=VLOOKUP($A11,'REC(an)'!$B$2:$B$33,1,0),A11=VLOOKUP($A11,'INV(an)'!$B$2:$B$16,1,0)))","v":""}]
[25020,"2009-05-30",{"$f":"IFERROR(AND(A12=VLOOKUP($A12,'REC(an)'!$B$2:$B$33,1,0),A12=VLOOKUP($A12,'INV(an)'!$B$2:$B$16,1,0)),\"\")","v":""},null,null,null,null,{"$f":"IF(ISNA(AND(A12=VLOOKUP($A12,'REC(an)'!$B$2:$B$33,1,0),A12=VLOOKUP($A12,'INV(an)'!$B$2:$B$16,1,0))),\"\",AND(A12=VLOOKUP($A12,'REC(an)'!$B$2:$B$33,1,0),A12=VLOOKUP($A12,'INV(an)'!$B$2:$B$16,1,0)))","v":""}]
[25021,"2009-05-31",{"$f":"IFERROR(AND(A13=VLOOKUP($A13,'REC(an)'!$B$2:$B$33,1,0),A13=VLOOKUP($A13,'INV(an)'!$B$2:$B$16,1,0)),\"\")","v":""},null,null,null,null,{"$f":"IF(ISNA(AND(A13=VLOOKUP($A13,'REC(an)'!$B$2:$B$33,1,0),A13=VLOOKUP($A13,'INV(an)'!$B$2:$B$16,1,0))),\"\",AND(A13=VLOOKUP($A13,'REC(an)'!$B$2:$B$33,1,0),A13=VLOOKUP($A13,'INV(an)'!$B$2:$B$16,1,0)))","v":""}]
[25022,"2009-06-01",{"$f":"IFERROR(AND(A14=VLOOKUP($A14,'REC(an)'!$B$2:$B$33,1,0),A14=VLOOKUP($A14,'INV(an)'!$B$2:$B$16,1,0)),\"\")","v":""},null,null,null,null,{"$f":"IF(ISNA(AND(A14=VLOOKUP($A14,'REC(an)'!$B$2:$B$33,1,0),A14=VLOOKUP($A14,'INV(an)'!$B$2:$B$16,1,0))),\"\",AND(A14=VLOOKUP($A14,'REC(an)'!$B$2:$B$33,1,0),A14=VLOOKUP($A14,'INV(an)'!$B$2:$B$16,1,0)))","v":""}]
[25023,"2009-06-02",{"$f":"IFERROR(AND(A15=VLOOKUP($A15,'REC(an)'!$B$2:$B$33,1,0),A15=VLOOKUP($A15,'INV(an)'!$B$2:$B$16,1,0)),\"\")","v":""},null,null,null,null,{"$f":"IF(ISNA(AND(A15=VLOOKUP($A15,'REC(an)'!$B$2:$B$33,1,0),A15=VLOOKUP($A15,'INV(an)'!$B$2:$B$16,1,0))),\"\",AND(A15=VLOOKUP($A15,'REC(an)'!$B$2:$B$33,1,0),A15=VLOOKUP($A15,'INV(an)'!$B$2:$B$16,1,0)))","v":""}]
{"$rows_left_out":52}
{"sheet":"REC(an)","index":11,"n_rows":33,"n_cols":3,"rows_kept":33,"cut":false,"hidden":false,"merged":[]}
["Rec#","PO","Date"]
[22620,25010,"2009-05-24"]
[62480,25012,"2010-05-25"]
[71029,25014,"2011-05-26"]
[30367,25011,"2012-05-26"]
[82163,25013,"2013-05-27"]
[96494,25027,"2014-05-28"]
[21960,25028,"2015-05-29"]
[13496,25024,"2016-05-29"]
[47852,25026,"2017-05-30"]
[82319,25028,"2018-05-31"]
[85104,25030,"2019-06-01"]
[27775,25032,"2020-06-01"]
[47124,25034,"2021-06-02"]
[95387,25036,"2022-06-03"]
{"$rows_left_out":19}
{"sheet":"INV(an)","index":12,"n_rows":16,"n_cols":3,"rows_kept":16,"cut":false,"hidden":false,"merged":[]}
["Inv#","PO","Date"]
["G33398",25010,"2010-05-27"]
["Y96346",25014,"2010-05-28"]
["G15281",25011,"2010-05-28"]
["E66862",25013,"2010-05-29"]
["N13722",25026,"2010-05-30"]
["J84276",25030,"2010-05-31"]
["M14834",25034,"2010-06-01"]
["D58891",25038,"2010-06-02"]
["L50179",25042,"2010-06-03"]
["Z79465",25046,"2010-06-04"]
["J78185",25050,"2010-06-05"]
["P87275",25027,"2010-06-06"]
["J84477",25028,"2010-06-07"]
["rtdtrdrt",25012,"2010-06-08"]
{"$rows_left_out":1}