{"text_format":"1","workbook":"xlsx","n_sheets":5,"sheets":["Timing","3 VLOOKUP Exact","VLOOKUP Array Aprox","INDEX Aprox","3 LOOKUP Aprox"],"not_rendered":{"charts":0,"images":0,"macros":1,"external_links":0,"defined_names":0,"comments":0,"pivot_tables":0},"unopened":[],"bounds":{"document_bytes":16777216,"sheet_cells":100000,"rows_first":2000,"rows_last":500,"rows_between":2000,"halvings":0,"cell_chars":16384,"cell_head_chars":4096},"cells_cut":0,"cells_raw":0,"read":"whole","date_system":"1900"}

{"sheet":"Timing","index":0,"n_rows":5,"n_cols":8,"rows_kept":5,"cut":false,"hidden":false,"merged":[]}
["Formula","Time 1","Time 2","Time 3","#","Formula Name","Average","% Increase as Compared to Fastest"]
[{"$f":"IFERROR(\" \"&_xlfn.FORMULATEXT(INDIRECT(\"'\"&F2&\"'!D4\")),\"\")","v":""},1.9499999999999999E-3,1.97E-3,2.0100000000000001E-3,"[4]","3 LOOKUP Aprox",{"$f":"AVERAGE(B2:D2)","v":1.9766666666666665E-3},{"$f":"G2/$G$2-1","v":0}]
[{"$f":"IFERROR(\" \"&_xlfn.FORMULATEXT(INDIRECT(\"'\"&F3&\"'!D4\")),\"\")","v":""},2.33E-3,2.2699999999999999E-3,2.3400000000000001E-3,"[1]","3 VLOOKUP Exact",{"$f":"AVERAGE(B3:D3)","v":2.3133333333333335E-3},{"$f":"G3/$G$2-1","v":0.17032040472175392}]
["",4.5700000000000003E-3,4.5399999999999998E-3,4.5799999999999999E-3,"[3]","INDEX Aprox",{"$f":"AVERAGE(B4:D4)","v":4.5633333333333333E-3},1.3086003372681283]
["",9.2599999999999991E-3,1.269E-2,1.473E-2,"[2]","VLOOKUP Array Aprox",{"$f":"AVERAGE(B5:D5)","v":1.2226666666666665E-2},5.1854974704890386]

{"sheet":"3 VLOOKUP Exact","index":1,"n_rows":815,"n_cols":25,"rows_kept":815,"cut":false,"hidden":false,"merged":[]}
["Excel Magic Trick 1352: Lookup 3 Items & Return to Single Cell VLOOKUP, INDEX or LOOKUP functions?"]
[]
["Date","Product","Units","Company-ZipCode-ID",null,"4 Formula Examples",null,null,null,null,null,null,null,null,null,null,null,null,null,null,null,null,"Date","Product","Units"]
["2017-03-16","Aspen",47,null,null,"[1]","3 VLOOKUP Exact Match functions",null,null,null,null,null,null,null,null,null,null,null,null,null,null,null,{"$f":"RANDBETWEEN(\"1/1/2017\",\"3/31/2017\")","v":"2017-03-03"},{"$f":"INDEX($F$10:$F$18,RANDBETWEEN(1,ROWS($F$10:$F$18)))","v":"Eagle"},{"$f":"INT(ABS(_xlfn.NORM.INV(RAND(),75,25)))","v":55}]
["2017-03-29","Sunbell",90,null,null,"[2]","1 VLOOKUP Approximate Match function with Array Operation, Ctrl + Shift + Enter"]
["2017-03-02","Eagle",83,null,null,"[3]","1 INDEX & MATCH Approximate Match with Array Operation"]
["2017-03-25","Aspen",83,null,null,"[4]","3 LOOKUP Approximate Match functions"]
["2017-01-11","Bellen",59]
["2017-01-15","TriBoom",45,null,null,"Product","Company","PlantZipCode","ID","RetailPrice","StandardCost"]
["2017-03-15","Sunbell",99,null,null,"Eagle","Colorado Booms",81231,"E9634/2386",19.95,8.9774999999999991]
["2017-02-17","Carlota",114,null,null,"Aspen","Colorado Booms",81231,"A9634/2650",21.95,11.6335]
["2017-02-03","Carlota",91,null,null,"Sunshine","Gel Booms",94618,"S4369/2297",22.95,12.163499999999999]
["2017-03-24","Sunbell",87,null,null,"Bellen","Gel Booms",94618,"B4369/2593",23.95,11.975]
["2017-02-25","Bellen",71,null,null,"TriBoom","Colorado Booms",90009,"T9634/2372",23.95,11.256499999999999]
["2017-03-08","Aspen",67,null,null,"Yanaki","Colorado Booms",81231,"Y9634/2072",24.95,13.472999999999999]
["2017-01-05","Yanaki",63,null,null,"Sunbell","Gel Booms",94618,"S4369/2241",27.95,15.3725]
["2017-02-06","Quad",15,null,null,"Carlota","Gel Booms",94608,"C4369/2213",28.95,14.185499999999999]
["2017-01-06","Yanaki",32,null,null,"Quad","Gel Booms",94608,"Q4369/2290",43.95,21.535500000000003]
["2017-03-14","Aspen",88]
["2017-02-05","Quad",50]
["2017-02-10","Aspen",69]
["2017-02-22","Eagle",98]
["2017-02-28","Sunbell",87]
["2017-02-13","Yanaki",61]
["2017-03-22","Yanaki",51]
["2017-03-26","Carlota",62]
["2017-01-26","Aspen",78]
["2017-01-07","Aspen",32]
["2017-02-04","Carlota",93]
["2017-02-12","Aspen",115]
["2017-03-19","Bellen",56]
["2017-03-11","Eagle",68]
["2017-03-09","Carlota",71]
["2017-01-30","Carlota",73]
["2017-02-16","Carlota",47]
["2017-02-10","Carlota",82]
["2017-02-21","Sunshine",61]
["2017-02-21","Quad",83]
["2017-02-02","TriBoom",47]
["2017-02-10","Yanaki",83]
["2017-01-04","Carlota",74]
["2017-01-25","Quad",65]
["2017-03-01","Bellen",109]
["2017-02-20","Aspen",78]
["2017-01-02","Aspen",64]
["2017-03-30","Yanaki",109]
["2017-01-16","TriBoom",58]
["2017-01-12","Carlota",60]
["2017-02-05","Sunshine",102]
["2017-02-14","Bellen",65]
["2017-03-13","Sunbell",31]
["2017-01-27","Aspen",102]
["2017-01-26","Quad",52]
["2017-03-08","Sunbell",95]
["2017-01-08","Aspen",68]
["2017-03-11","Bellen",85]
["2017-03-02","Yanaki",22]
["2017-01-13","Sunshine",79]
["2017-03-27","Aspen",62]
["2017-02-09","Eagle",70]
["2017-01-17","TriBoom",60]
["2017-03-11","Aspen",65]
["2017-03-07","TriBoom",84]
["2017-03-03","Carlota",67]
["2017-03-13","Eagle",104]
["2017-01-18","Bellen",93]
["2017-03-28","Carlota",82]
["2017-03-10","Bellen",71]
["2017-01-01","Eagle",71]
["2017-03-30","TriBoom",68]
["2017-01-15","Bellen",120]
["2017-01-06","Sunbell",46]
["2017-01-04","Carlota",96]
["2017-02-03","Aspen",86]
["2017-03-28","Sunbell",79]
["2017-02-22","Bellen",100]
["2017-01-23","Yanaki",77]
["2017-01-04","Sunbell",49]
["2017-03-05","Eagle",92]
["2017-01-25","Sunshine",49]
["2017-01-23","Aspen",9]
["2017-03-22","Bellen",44]
["2017-02-27","Carlota",72]
["2017-03-02","Carlota",59]
["2017-01-17","Sunbell",90]
["2017-02-25","Eagle",54]
["2017-01-31","Quad",71]
["2017-01-27","Eagle",90]
["2017-03-17","Quad",58]
["2017-01-29","Bellen",73]
["2017-03-02","TriBoom",69]
["2017-01-11","Eagle",59]
["2017-03-06","Yanaki",71]
["2017-02-06","Eagle",111]
["2017-03-24","TriBoom",59]
["2017-02-20","Carlota",103]
["2017-02-22","TriBoom",59]
["2017-01-28","TriBoom",96]
["2017-01-24","TriBoom",53]
["2017-01-23","Eagle",43]
["2017-02-23","Bellen",67]
["2017-02-16","Aspen",115]
["2017-02-07","TriBoom",93]
["2017-03-13","Yanaki",44]
["2017-02-09","Yanaki",82]
["2017-01-24","Aspen",96]
["2017-03-03","Eagle",115]
["2017-03-15","Carlota",58]
["2017-02-13","Eagle",100]
["2017-03-29","TriBoom",80]
["2017-02-25","Sunshine",105]
["2017-03-19","Sunshine",84]
["2017-01-03","Bellen",62]
["2017-03-13","Quad",92]
["2017-02-16","Sunshine",49]
["2017-02-11","Aspen",119]
["2017-02-20","Bellen",41]
["2017-01-13","Aspen",115]
["2017-01-04","Quad",103]
["2017-01-13","Bellen",79]
{"$rows_left_out":696}
{"sheet":"VLOOKUP Array Aprox","index":2,"n_rows":815,"n_cols":25,"rows_kept":815,"cut":false,"hidden":false,"merged":[]}
["Excel Magic Trick 1352: Lookup 3 Items & Return to Single Cell VLOOKUP, INDEX or LOOKUP functions?"]
[]
["Date","Product","Units","Company-ZipCode-ID",null,null,null,null,null,null,null,null,null,null,null,null,null,null,null,null,null,null,"Date","Product","Units"]
["2017-03-16","Aspen",47,null,null,null,null,null,null,null,null,null,null,null,null,null,null,null,null,null,null,null,{"$f":"RANDBETWEEN(\"1/1/2017\",\"3/31/2017\")","v":"2017-03-29"},{"$f":"INDEX($F$10:$F$18,RANDBETWEEN(1,ROWS($F$10:$F$18)))","v":"Sunbell"},{"$f":"INT(ABS(_xlfn.NORM.INV(RAND(),75,25)))","v":85}]
["2017-03-29","Sunbell",90]
["2017-03-02","Eagle",83]
["2017-03-25","Aspen",83]
["2017-01-11","Bellen",59]
["2017-01-15","TriBoom",45,null,null,"Product","Company","PlantZipCode","ID","RetailPrice","StandardCost"]
["2017-03-15","Sunbell",99,null,null,"Aspen","Colorado Booms",81231,"A9634/2650",21.95,11.6335]
["2017-02-17","Carlota",114,null,null,"Bellen","Gel Booms",94618,"B4369/2593",23.95,11.975]
["2017-02-03","Carlota",91,null,null,"Carlota","Gel Booms",94608,"C4369/2213",28.95,14.185499999999999]
["2017-03-24","Sunbell",87,null,null,"Eagle","Colorado Booms",81231,"E9634/2386",19.95,8.9774999999999991]
["2017-02-25","Bellen",71,null,null,"Quad","Gel Booms",94608,"Q4369/2290",43.95,21.535500000000003]
["2017-03-08","Aspen",67,null,null,"Sunbell","Gel Booms",94618,"S4369/2241",27.95,15.3725]
["2017-01-05","Yanaki",63,null,null,"Sunshine","Gel Booms",94618,"S4369/2297",22.95,12.163499999999999]
["2017-02-06","Quad",15,null,null,"TriBoom","Colorado Booms",90009,"T9634/2372",23.95,11.256499999999999]
["2017-01-06","Yanaki",32,null,null,"Yanaki","Colorado Booms",81231,"Y9634/2072",24.95,13.472999999999999]
["2017-03-14","Aspen",88]
["2017-02-05","Quad",50]
["2017-02-10","Aspen",69]
["2017-02-22","Eagle",98]
["2017-02-28","Sunbell",87]
["2017-02-13","Yanaki",61]
["2017-03-22","Yanaki",51]
["2017-03-26","Carlota",62]
["2017-01-26","Aspen",78]
["2017-01-07","Aspen",32]
["2017-02-04","Carlota",93]
["2017-02-12","Aspen",115]
["2017-03-19","Bellen",56]
["2017-03-11","Eagle",68]
["2017-03-09","Carlota",71]
["2017-01-30","Carlota",73]
["2017-02-16","Carlota",47]
["2017-02-10","Carlota",82]
["2017-02-21","Sunshine",61]
["2017-02-21","Quad",83]
["2017-02-02","TriBoom",47]
["2017-02-10","Yanaki",83]
["2017-01-04","Carlota",74]
["2017-01-25","Quad",65]
["2017-03-01","Bellen",109]
["2017-02-20","Aspen",78]
["2017-01-02","Aspen",64]
["2017-03-30","Yanaki",109]
["2017-01-16","TriBoom",58]
["2017-01-12","Carlota",60]
["2017-02-05","Sunshine",102]
["2017-02-14","Bellen",65]
["2017-03-13","Sunbell",31]
["2017-01-27","Aspen",102]
["2017-01-26","Quad",52]
["2017-03-08","Sunbell",95]
["2017-01-08","Aspen",68]
["2017-03-11","Bellen",85]
["2017-03-02","Yanaki",22]
["2017-01-13","Sunshine",79]
["2017-03-27","Aspen",62]
["2017-02-09","Eagle",70]
["2017-01-17","TriBoom",60]
["2017-03-11","Aspen",65]
["2017-03-07","TriBoom",84]
["2017-03-03","Carlota",67]
["2017-03-13","Eagle",104]
["2017-01-18","Bellen",93]
["2017-03-28","Carlota",82]
["2017-03-10","Bellen",71]
["2017-01-01","Eagle",71]
["2017-03-30","TriBoom",68]
["2017-01-15","Bellen",120]
["2017-01-06","Sunbell",46]
["2017-01-04","Carlota",96]
["2017-02-03","Aspen",86]
["2017-03-28","Sunbell",79]
["2017-02-22","Bellen",100]
["2017-01-23","Yanaki",77]
["2017-01-04","Sunbell",49]
["2017-03-05","Eagle",92]
["2017-01-25","Sunshine",49]
["2017-01-23","Aspen",9]
["2017-03-22","Bellen",44]
["2017-02-27","Carlota",72]
["2017-03-02","Carlota",59]
["2017-01-17","Sunbell",90]
["2017-02-25","Eagle",54]
["2017-01-31","Quad",71]
["2017-01-27","Eagle",90]
["2017-03-17","Quad",58]
["2017-01-29","Bellen",73]
["2017-03-02","TriBoom",69]
["2017-01-11","Eagle",59]
["2017-03-06","Yanaki",71]
["2017-02-06","Eagle",111]
["2017-03-24","TriBoom",59]
["2017-02-20","Carlota",103]
["2017-02-22","TriBoom",59]
["2017-01-28","TriBoom",96]
["2017-01-24","TriBoom",53]
["2017-01-23","Eagle",43]
["2017-02-23","Bellen",67]
["2017-02-16","Aspen",115]
["2017-02-07","TriBoom",93]
["2017-03-13","Yanaki",44]
["2017-02-09","Yanaki",82]
["2017-01-24","Aspen",96]
["2017-03-03","Eagle",115]
["2017-03-15","Carlota",58]
["2017-02-13","Eagle",100]
["2017-03-29","TriBoom",80]
["2017-02-25","Sunshine",105]
["2017-03-19","Sunshine",84]
["2017-01-03","Bellen",62]
["2017-03-13","Quad",92]
["2017-02-16","Sunshine",49]
["2017-02-11","Aspen",119]
["2017-02-20","Bellen",41]
["2017-01-13","Aspen",115]
["2017-01-04","Quad",103]
["2017-01-13","Bellen",79]
{"$rows_left_out":696}
{"sheet":"INDEX Aprox","index":3,"n_rows":815,"n_cols":25,"rows_kept":815,"cut":false,"hidden":false,"merged":[]}
["Excel Magic Trick 1352: Lookup 3 Items & Return to Single Cell VLOOKUP, INDEX or LOOKUP functions?"]
[]
["Date","Product","Units","Company-ZipCode-ID",null,null,null,null,null,null,null,null,null,null,null,null,null,null,null,null,null,null,"Date","Product","Units"]
["2017-03-16","Aspen",47,null,null,null,null,null,null,null,null,null,null,null,null,null,null,null,null,null,null,null,{"$f":"RANDBETWEEN(\"1/1/2017\",\"3/31/2017\")","v":"2017-01-08"},{"$f":"INDEX($F$10:$F$18,RANDBETWEEN(1,ROWS($F$10:$F$18)))","v":"Yanaki"},{"$f":"INT(ABS(_xlfn.NORM.INV(RAND(),75,25)))","v":64}]
["2017-03-29","Sunbell",90]
["2017-03-02","Eagle",83]
["2017-03-25","Aspen",83]
["2017-01-11","Bellen",59]
["2017-01-15","TriBoom",45,null,null,"Product","Company","PlantZipCode","ID","RetailPrice","StandardCost"]
["2017-03-15","Sunbell",99,null,null,"Aspen","Colorado Booms",81231,"A9634/2650",21.95,11.6335]
["2017-02-17","Carlota",114,null,null,"Bellen","Gel Booms",94618,"B4369/2593",23.95,11.975]
["2017-02-03","Carlota",91,null,null,"Carlota","Gel Booms",94608,"C4369/2213",28.95,14.185499999999999]
["2017-03-24","Sunbell",87,null,null,"Eagle","Colorado Booms",81231,"E9634/2386",19.95,8.9774999999999991]
["2017-02-25","Bellen",71,null,null,"Quad","Gel Booms",94608,"Q4369/2290",43.95,21.535500000000003]
["2017-03-08","Aspen",67,null,null,"Sunbell","Gel Booms",94618,"S4369/2241",27.95,15.3725]
["2017-01-05","Yanaki",63,null,null,"Sunshine","Gel Booms",94618,"S4369/2297",22.95,12.163499999999999]
["2017-02-06","Quad",15,null,null,"TriBoom","Colorado Booms",90009,"T9634/2372",23.95,11.256499999999999]
["2017-01-06","Yanaki",32,null,null,"Yanaki","Colorado Booms",81231,"Y9634/2072",24.95,13.472999999999999]
["2017-03-14","Aspen",88]
["2017-02-05","Quad",50]
["2017-02-10","Aspen",69]
["2017-02-22","Eagle",98]
["2017-02-28","Sunbell",87]
["2017-02-13","Yanaki",61]
["2017-03-22","Yanaki",51]
["2017-03-26","Carlota",62]
["2017-01-26","Aspen",78]
["2017-01-07","Aspen",32]
["2017-02-04","Carlota",93]
["2017-02-12","Aspen",115]
["2017-03-19","Bellen",56]
["2017-03-11","Eagle",68]
["2017-03-09","Carlota",71]
["2017-01-30","Carlota",73]
["2017-02-16","Carlota",47]
["2017-02-10","Carlota",82]
["2017-02-21","Sunshine",61]
["2017-02-21","Quad",83]
["2017-02-02","TriBoom",47]
["2017-02-10","Yanaki",83]
["2017-01-04","Carlota",74]
["2017-01-25","Quad",65]
["2017-03-01","Bellen",109]
["2017-02-20","Aspen",78]
["2017-01-02","Aspen",64]
["2017-03-30","Yanaki",109]
["2017-01-16","TriBoom",58]
["2017-01-12","Carlota",60]
["2017-02-05","Sunshine",102]
["2017-02-14","Bellen",65]
["2017-03-13","Sunbell",31]
["2017-01-27","Aspen",102]
["2017-01-26","Quad",52]
["2017-03-08","Sunbell",95]
["2017-01-08","Aspen",68]
["2017-03-11","Bellen",85]
["2017-03-02","Yanaki",22]
["2017-01-13","Sunshine",79]
["2017-03-27","Aspen",62]
["2017-02-09","Eagle",70]
["2017-01-17","TriBoom",60]
["2017-03-11","Aspen",65]
["2017-03-07","TriBoom",84]
["2017-03-03","Carlota",67]
["2017-03-13","Eagle",104]
["2017-01-18","Bellen",93]
["2017-03-28","Carlota",82]
["2017-03-10","Bellen",71]
["2017-01-01","Eagle",71]
["2017-03-30","TriBoom",68]
["2017-01-15","Bellen",120]
["2017-01-06","Sunbell",46]
["2017-01-04","Carlota",96]
["2017-02-03","Aspen",86]
["2017-03-28","Sunbell",79]
["2017-02-22","Bellen",100]
["2017-01-23","Yanaki",77]
["2017-01-04","Sunbell",49]
["2017-03-05","Eagle",92]
["2017-01-25","Sunshine",49]
["2017-01-23","Aspen",9]
["2017-03-22","Bellen",44]
["2017-02-27","Carlota",72]
["2017-03-02","Carlota",59]
["2017-01-17","Sunbell",90]
["2017-02-25","Eagle",54]
["2017-01-31","Quad",71]
["2017-01-27","Eagle",90]
["2017-03-17","Quad",58]
["2017-01-29","Bellen",73]
["2017-03-02","TriBoom",69]
["2017-01-11","Eagle",59]
["2017-03-06","Yanaki",71]
["2017-02-06","Eagle",111]
["2017-03-24","TriBoom",59]
["2017-02-20","Carlota",103]
["2017-02-22","TriBoom",59]
["2017-01-28","TriBoom",96]
["2017-01-24","TriBoom",53]
["2017-01-23","Eagle",43]
["2017-02-23","Bellen",67]
["2017-02-16","Aspen",115]
["2017-02-07","TriBoom",93]
["2017-03-13","Yanaki",44]
["2017-02-09","Yanaki",82]
["2017-01-24","Aspen",96]
["2017-03-03","Eagle",115]
["2017-03-15","Carlota",58]
["2017-02-13","Eagle",100]
["2017-03-29","TriBoom",80]
["2017-02-25","Sunshine",105]
["2017-03-19","Sunshine",84]
["2017-01-03","Bellen",62]
["2017-03-13","Quad",92]
["2017-02-16","Sunshine",49]
["2017-02-11","Aspen",119]
["2017-02-20","Bellen",41]
["2017-01-13","Aspen",115]
["2017-01-04","Quad",103]
["2017-01-13","Bellen",79]
{"$rows_left_out":696}
{"sheet":"3 LOOKUP Aprox","index":4,"n_rows":815,"n_cols":25,"rows_kept":815,"cut":false,"hidden":false,"merged":[]}
["Excel Magic Trick 1352: Lookup 3 Items & Return to Single Cell VLOOKUP, INDEX or LOOKUP functions?"]
[]
["Date","Product","Units","Company-ZipCode-ID",null,null,null,null,null,null,null,null,null,null,null,null,null,null,null,null,null,null,"Date","Product","Units"]
["2017-03-16","Aspen",47,null,null,null,null,null,null,null,null,null,null,null,null,null,null,null,null,null,null,null,{"$f":"RANDBETWEEN(\"1/1/2017\",\"3/31/2017\")","v":"2017-01-15"},{"$f":"INDEX($F$10:$F$18,RANDBETWEEN(1,ROWS($F$10:$F$18)))","v":"Quad"},{"$f":"INT(ABS(_xlfn.NORM.INV(RAND(),75,25)))","v":48}]
["2017-03-29","Sunbell",90]
["2017-03-02","Eagle",83]
["2017-03-25","Aspen",83]
["2017-01-11","Bellen",59]
["2017-01-15","TriBoom",45,null,null,"Product","Company","PlantZipCode","ID","RetailPrice","StandardCost"]
["2017-03-15","Sunbell",99,null,null,"Aspen","Colorado Booms",81231,"A9634/2650",21.95,11.6335]
["2017-02-17","Carlota",114,null,null,"Bellen","Gel Booms",94618,"B4369/2593",23.95,11.975]
["2017-02-03","Carlota",91,null,null,"Carlota","Gel Booms",94608,"C4369/2213",28.95,14.185499999999999]
["2017-03-24","Sunbell",87,null,null,"Eagle","Colorado Booms",81231,"E9634/2386",19.95,8.9774999999999991]
["2017-02-25","Bellen",71,null,null,"Quad","Gel Booms",94608,"Q4369/2290",43.95,21.535500000000003]
["2017-03-08","Aspen",67,null,null,"Sunbell","Gel Booms",94618,"S4369/2241",27.95,15.3725]
["2017-01-05","Yanaki",63,null,null,"Sunshine","Gel Booms",94618,"S4369/2297",22.95,12.163499999999999]
["2017-02-06","Quad",15,null,null,"TriBoom","Colorado Booms",90009,"T9634/2372",23.95,11.256499999999999]
["2017-01-06","Yanaki",32,null,null,"Yanaki","Colorado Booms",81231,"Y9634/2072",24.95,13.472999999999999]
["2017-03-14","Aspen",88]
["2017-02-05","Quad",50]
["2017-02-10","Aspen",69]
["2017-02-22","Eagle",98]
["2017-02-28","Sunbell",87]
["2017-02-13","Yanaki",61]
["2017-03-22","Yanaki",51]
["2017-03-26","Carlota",62]
["2017-01-26","Aspen",78]
["2017-01-07","Aspen",32]
["2017-02-04","Carlota",93]
["2017-02-12","Aspen",115]
["2017-03-19","Bellen",56]
["2017-03-11","Eagle",68]
["2017-03-09","Carlota",71]
["2017-01-30","Carlota",73]
["2017-02-16","Carlota",47]
["2017-02-10","Carlota",82]
["2017-02-21","Sunshine",61]
["2017-02-21","Quad",83]
["2017-02-02","TriBoom",47]
["2017-02-10","Yanaki",83]
["2017-01-04","Carlota",74]
["2017-01-25","Quad",65]
["2017-03-01","Bellen",109]
["2017-02-20","Aspen",78]
["2017-01-02","Aspen",64]
["2017-03-30","Yanaki",109]
["2017-01-16","TriBoom",58]
["2017-01-12","Carlota",60]
["2017-02-05","Sunshine",102]
["2017-02-14","Bellen",65]
["2017-03-13","Sunbell",31]
["2017-01-27","Aspen",102]
["2017-01-26","Quad",52]
["2017-03-08","Sunbell",95]
["2017-01-08","Aspen",68]
["2017-03-11","Bellen",85]
["2017-03-02","Yanaki",22]
["2017-01-13","Sunshine",79]
["2017-03-27","Aspen",62]
["2017-02-09","Eagle",70]
["2017-01-17","TriBoom",60]
["2017-03-11","Aspen",65]
["2017-03-07","TriBoom",84]
["2017-03-03","Carlota",67]
["2017-03-13","Eagle",104]
["2017-01-18","Bellen",93]
["2017-03-28","Carlota",82]
["2017-03-10","Bellen",71]
["2017-01-01","Eagle",71]
["2017-03-30","TriBoom",68]
["2017-01-15","Bellen",120]
["2017-01-06","Sunbell",46]
["2017-01-04","Carlota",96]
["2017-02-03","Aspen",86]
["2017-03-28","Sunbell",79]
["2017-02-22","Bellen",100]
["2017-01-23","Yanaki",77]
["2017-01-04","Sunbell",49]
["2017-03-05","Eagle",92]
["2017-01-25","Sunshine",49]
["2017-01-23","Aspen",9]
["2017-03-22","Bellen",44]
["2017-02-27","Carlota",72]
["2017-03-02","Carlota",59]
["2017-01-17","Sunbell",90]
["2017-02-25","Eagle",54]
["2017-01-31","Quad",71]
["2017-01-27","Eagle",90]
["2017-03-17","Quad",58]
["2017-01-29","Bellen",73]
["2017-03-02","TriBoom",69]
["2017-01-11","Eagle",59]
["2017-03-06","Yanaki",71]
["2017-02-06","Eagle",111]
["2017-03-24","TriBoom",59]
["2017-02-20","Carlota",103]
["2017-02-22","TriBoom",59]
["2017-01-28","TriBoom",96]
["2017-01-24","TriBoom",53]
["2017-01-23","Eagle",43]
["2017-02-23","Bellen",67]
["2017-02-16","Aspen",115]
["2017-02-07","TriBoom",93]
["2017-03-13","Yanaki",44]
["2017-02-09","Yanaki",82]
["2017-01-24","Aspen",96]
["2017-03-03","Eagle",115]
["2017-03-15","Carlota",58]
["2017-02-13","Eagle",100]
["2017-03-29","TriBoom",80]
["2017-02-25","Sunshine",105]
["2017-03-19","Sunshine",84]
["2017-01-03","Bellen",62]
["2017-03-13","Quad",92]
["2017-02-16","Sunshine",49]
["2017-02-11","Aspen",119]
["2017-02-20","Bellen",41]
["2017-01-13","Aspen",115]
["2017-01-04","Quad",103]
["2017-01-13","Bellen",79]
{"$rows_left_out":695}