{"text_format":"1","workbook":"xlsx","n_sheets":7,"sheets":["Timing","3 VLOOKUP Exact","VLOOKUP Array Aprox","INDEX Aprox","3 LOOKUP Aprox","Bill Szysz (1)","Bill Szysz (2)"],"not_rendered":{"charts":0,"images":0,"macros":1,"external_links":0,"defined_names":0,"comments":0,"pivot_tables":0},"unopened":[],"bounds":{"document_bytes":16777216,"sheet_cells":100000,"rows_first":2000,"rows_last":500,"rows_between":2000,"halvings":0,"cell_chars":16384,"cell_head_chars":4096},"cells_cut":0,"cells_raw":0,"read":"whole","date_system":"1900"}

{"sheet":"Timing","index":0,"n_rows":9,"n_cols":10,"rows_kept":9,"cut":false,"hidden":false,"merged":[]}
["Formula","Time 1","Time 2","Time 3","#","Formula Name","Average","% Increase as Compared to Fastest"]
[{"$f":"IFERROR(\" \"&_xlfn.FORMULATEXT(INDIRECT(\"'\"&F2&\"'!D4\")),\"\")","v":" =LOOKUP(B4,$F$10:$G$18)&\"-\"&LOOKUP(B4,$F$10:$H$18)&\"-\"&LOOKUP(B4,$F$10:$I$18)"},1.9499999999999999E-3,1.97E-3,2.0100000000000001E-3,"[4]","3 LOOKUP Aprox",{"$f":"AVERAGE(B2:D2)","v":1.9766666666666665E-3},{"$f":"G2/$G$2-1","v":0}]
[{"$f":"IFERROR(\" \"&_xlfn.FORMULATEXT(INDIRECT(\"'\"&F3&\"'!D4\")),\"\")","v":" =VLOOKUP(B4,$F$10:$I$18,2,0)&\"-\"&VLOOKUP(B4,$F$10:$I$18,3,0)&\"-\"&VLOOKUP(B4,$F$10:$I$18,4,0)"},2.33E-3,2.2699999999999999E-3,2.3400000000000001E-3,"[1]","3 VLOOKUP Exact",{"$f":"AVERAGE(B3:D3)","v":2.3133333333333335E-3},{"$f":"G3/$G$2-1","v":0.17032040472175392}]
[" =INDEX($G$10:$G$18&\"-\"&$H$10:$H$18&\"-\"&$I$10:$I$18,MATCH(B4,$F$10:$F$18))",4.5700000000000003E-3,4.5399999999999998E-3,4.5799999999999999E-3,"[3]","INDEX Aprox",{"$f":"AVERAGE(B4:D4)","v":4.5633333333333333E-3},1.3086003372681283]
[" {=TEXTJOIN(\"-\",,VLOOKUP(B4,$F$10:$I$18,{2,3,4}))}",9.2599999999999991E-3,1.269E-2,1.473E-2,"[2]","VLOOKUP Array Aprox",{"$f":"AVERAGE(B5:D5)","v":1.2226666666666665E-2},5.1854974704890386]
[]
["Added after video filmed:"]
[{"$f":"IFERROR(\" \"&_xlfn.FORMULATEXT(INDIRECT(\"'\"&F8&\"'!D4\")),\"\")","v":" =TEXTJOIN(\"-\",,INDEX($G$10:$I$18,MATCH(B4,$F$10:$F$18),))"},9.8600000000000007E-3,9.9299999999999996E-3,1.001E-2,null,"Bill Szysz (1)",{"$f":"AVERAGE(B8:D8)","v":9.9333333333333339E-3},{"$f":"G8/$G$2-1","v":4.0252951096121423},null,"From Bill Szysz at YouTube"]
[{"$f":"IFERROR(\" \"&_xlfn.FORMULATEXT(INDIRECT(\"'\"&F9&\"'!D4\")),\"\")","v":" =TEXTJOIN(\"-\",,INDEX(($G$10:$G$18,$H$10:$H$18,$I$10:$I$18),MATCH(B4,$F$10:$F$18),,N(IF(1,{1,2,3}))))"},1.061E-2,1.04E-2,1.0449999999999999E-2,null,"Bill Szysz (2)",{"$f":"AVERAGE(B9:D9)","v":1.0486666666666667E-2},{"$f":"G9/$G$2-1","v":4.3052276559865099},null,"From Bill Szysz at YouTube"]

{"sheet":"3 VLOOKUP Exact","index":1,"n_rows":815,"n_cols":25,"rows_kept":815,"cut":false,"hidden":false,"merged":[]}
["Excel Magic Trick 1352: Lookup 3 Items & Return to Single Cell VLOOKUP, INDEX or LOOKUP functions?"]
[]
["Date","Product","Units","Company-ZipCode-ID",null,"4 Formula Examples",null,null,null,null,null,null,null,null,null,null,null,null,null,null,null,null,"Date","Product","Units"]
["2017-03-16","Aspen",47,{"$f":"VLOOKUP(B4,$F$10:$I$18,2,0)&\"-\"&VLOOKUP(B4,$F$10:$I$18,3,0)&\"-\"&VLOOKUP(B4,$F$10:$I$18,4,0)","v":"Colorado Booms-81231-A9634/2650"},null,"[1]","3 VLOOKUP Exact Match functions",null,null,null,null,null,null,null,null,null,null,null,null,null,null,null,{"$f":"RANDBETWEEN(\"1/1/2017\",\"3/31/2017\")","v":"2017-01-03"},{"$f":"INDEX($F$10:$F$18,RANDBETWEEN(1,ROWS($F$10:$F$18)))","v":"TriBoom"},{"$f":"INT(ABS(_xlfn.NORM.INV(RAND(),75,25)))","v":79}]
["2017-03-29","Sunbell",90,{"$f":"VLOOKUP(B5,$F$10:$I$18,2,0)&\"-\"&VLOOKUP(B5,$F$10:$I$18,3,0)&\"-\"&VLOOKUP(B5,$F$10:$I$18,4,0)","v":"Gel Booms-94618-S4369/2241"},null,"[2]","1 VLOOKUP Approximate Match function with Array Operation, Ctrl + Shift + Enter"]
["2017-03-02","Eagle",83,"Colorado Booms-81231-E9634/2386",null,"[3]","1 INDEX & MATCH Approximate Match with Array Operation"]
["2017-03-25","Aspen",83,"Colorado Booms-81231-A9634/2650",null,"[4]","3 LOOKUP Approximate Match functions"]
["2017-01-11","Bellen",59,"Gel Booms-94618-B4369/2593"]
["2017-01-15","TriBoom",45,"Colorado Booms-90009-T9634/2372",null,"Product","Company","PlantZipCode","ID","RetailPrice","StandardCost"]
["2017-03-15","Sunbell",99,"Gel Booms-94618-S4369/2241",null,"Eagle","Colorado Booms",81231,"E9634/2386",19.95,8.9774999999999991]
["2017-02-17","Carlota",114,"Gel Booms-94608-C4369/2213",null,"Aspen","Colorado Booms",81231,"A9634/2650",21.95,11.6335]
["2017-02-03","Carlota",91,"Gel Booms-94608-C4369/2213",null,"Sunshine","Gel Booms",94618,"S4369/2297",22.95,12.163499999999999]
["2017-03-24","Sunbell",87,"Gel Booms-94618-S4369/2241",null,"Bellen","Gel Booms",94618,"B4369/2593",23.95,11.975]
["2017-02-25","Bellen",71,"Gel Booms-94618-B4369/2593",null,"TriBoom","Colorado Booms",90009,"T9634/2372",23.95,11.256499999999999]
["2017-03-08","Aspen",67,"Colorado Booms-81231-A9634/2650",null,"Yanaki","Colorado Booms",81231,"Y9634/2072",24.95,13.472999999999999]
["2017-01-05","Yanaki",63,"Colorado Booms-81231-Y9634/2072",null,"Sunbell","Gel Booms",94618,"S4369/2241",27.95,15.3725]
["2017-02-06","Quad",15,"Gel Booms-94608-Q4369/2290",null,"Carlota","Gel Booms",94608,"C4369/2213",28.95,14.185499999999999]
["2017-01-06","Yanaki",32,"Colorado Booms-81231-Y9634/2072",null,"Quad","Gel Booms",94608,"Q4369/2290",43.95,21.535500000000003]
["2017-03-14","Aspen",88,"Colorado Booms-81231-A9634/2650"]
["2017-02-05","Quad",50,"Gel Booms-94608-Q4369/2290"]
["2017-02-10","Aspen",69,"Colorado Booms-81231-A9634/2650"]
["2017-02-22","Eagle",98,"Colorado Booms-81231-E9634/2386"]
["2017-02-28","Sunbell",87,"Gel Booms-94618-S4369/2241"]
["2017-02-13","Yanaki",61,"Colorado Booms-81231-Y9634/2072"]
["2017-03-22","Yanaki",51,"Colorado Booms-81231-Y9634/2072"]
["2017-03-26","Carlota",62,"Gel Booms-94608-C4369/2213"]
["2017-01-26","Aspen",78,"Colorado Booms-81231-A9634/2650"]
["2017-01-07","Aspen",32,"Colorado Booms-81231-A9634/2650"]
["2017-02-04","Carlota",93,"Gel Booms-94608-C4369/2213"]
["2017-02-12","Aspen",115,"Colorado Booms-81231-A9634/2650"]
{"$rows_left_out":786}
{"sheet":"VLOOKUP Array Aprox","index":2,"n_rows":815,"n_cols":25,"rows_kept":815,"cut":false,"hidden":false,"merged":[]}
["Excel Magic Trick 1352: Lookup 3 Items & Return to Single Cell VLOOKUP, INDEX or LOOKUP functions?"]
[]
["Date","Product","Units","Company-ZipCode-ID",null,null,null,null,null,null,null,null,null,null,null,null,null,null,null,null,null,null,"Date","Product","Units"]
["2017-03-16","Aspen",47,{"$f":"_xlfn.TEXTJOIN(\"-\",,VLOOKUP(B4,$F$10:$I$18,{2,3,4}))","v":"Colorado Booms-81231-A9634/2650"},null,null,null,null,null,null,null,null,null,null,null,null,null,null,null,null,null,null,{"$f":"RANDBETWEEN(\"1/1/2017\",\"3/31/2017\")","v":"2017-01-15"},{"$f":"INDEX($F$10:$F$18,RANDBETWEEN(1,ROWS($F$10:$F$18)))","v":"Yanaki"},{"$f":"INT(ABS(_xlfn.NORM.INV(RAND(),75,25)))","v":64}]
["2017-03-29","Sunbell",90,{"$f":"_xlfn.TEXTJOIN(\"-\",,VLOOKUP(B5,$F$10:$I$18,{2,3,4}))","v":"Gel Booms-94618-S4369/2241"}]
["2017-03-02","Eagle",83,{"$f":"_xlfn.TEXTJOIN(\"-\",,VLOOKUP(B6,$F$10:$I$18,{2,3,4}))","v":"Colorado Booms-81231-E9634/2386"}]
["2017-03-25","Aspen",83,{"$f":"_xlfn.TEXTJOIN(\"-\",,VLOOKUP(B7,$F$10:$I$18,{2,3,4}))","v":"Colorado Booms-81231-A9634/2650"}]
["2017-01-11","Bellen",59,{"$f":"_xlfn.TEXTJOIN(\"-\",,VLOOKUP(B8,$F$10:$I$18,{2,3,4}))","v":"Gel Booms-94618-B4369/2593"}]
["2017-01-15","TriBoom",45,{"$f":"_xlfn.TEXTJOIN(\"-\",,VLOOKUP(B9,$F$10:$I$18,{2,3,4}))","v":"Colorado Booms-90009-T9634/2372"},null,"Product","Company","PlantZipCode","ID","RetailPrice","StandardCost"]
["2017-03-15","Sunbell",99,{"$f":"_xlfn.TEXTJOIN(\"-\",,VLOOKUP(B10,$F$10:$I$18,{2,3,4}))","v":"Gel Booms-94618-S4369/2241"},null,"Aspen","Colorado Booms",81231,"A9634/2650",21.95,11.6335]
["2017-02-17","Carlota",114,{"$f":"_xlfn.TEXTJOIN(\"-\",,VLOOKUP(B11,$F$10:$I$18,{2,3,4}))","v":"Gel Booms-94608-C4369/2213"},null,"Bellen","Gel Booms",94618,"B4369/2593",23.95,11.975]
["2017-02-03","Carlota",91,{"$f":"_xlfn.TEXTJOIN(\"-\",,VLOOKUP(B12,$F$10:$I$18,{2,3,4}))","v":"Gel Booms-94608-C4369/2213"},null,"Carlota","Gel Booms",94608,"C4369/2213",28.95,14.185499999999999]
["2017-03-24","Sunbell",87,{"$f":"_xlfn.TEXTJOIN(\"-\",,VLOOKUP(B13,$F$10:$I$18,{2,3,4}))","v":"Gel Booms-94618-S4369/2241"},null,"Eagle","Colorado Booms",81231,"E9634/2386",19.95,8.9774999999999991]
["2017-02-25","Bellen",71,{"$f":"_xlfn.TEXTJOIN(\"-\",,VLOOKUP(B14,$F$10:$I$18,{2,3,4}))","v":"Gel Booms-94618-B4369/2593"},null,"Quad","Gel Booms",94608,"Q4369/2290",43.95,21.535500000000003]
["2017-03-08","Aspen",67,{"$f":"_xlfn.TEXTJOIN(\"-\",,VLOOKUP(B15,$F$10:$I$18,{2,3,4}))","v":"Colorado Booms-81231-A9634/2650"},null,"Sunbell","Gel Booms",94618,"S4369/2241",27.95,15.3725]
["2017-01-05","Yanaki",63,{"$f":"_xlfn.TEXTJOIN(\"-\",,VLOOKUP(B16,$F$10:$I$18,{2,3,4}))","v":"Colorado Booms-81231-Y9634/2072"},null,"Sunshine","Gel Booms",94618,"S4369/2297",22.95,12.163499999999999]
["2017-02-06","Quad",15,{"$f":"_xlfn.TEXTJOIN(\"-\",,VLOOKUP(B17,$F$10:$I$18,{2,3,4}))","v":"Gel Booms-94608-Q4369/2290"},null,"TriBoom","Colorado Booms",90009,"T9634/2372",23.95,11.256499999999999]
["2017-01-06","Yanaki",32,{"$f":"_xlfn.TEXTJOIN(\"-\",,VLOOKUP(B18,$F$10:$I$18,{2,3,4}))","v":"Colorado Booms-81231-Y9634/2072"},null,"Yanaki","Colorado Booms",81231,"Y9634/2072",24.95,13.472999999999999]
["2017-03-14","Aspen",88,{"$f":"_xlfn.TEXTJOIN(\"-\",,VLOOKUP(B19,$F$10:$I$18,{2,3,4}))","v":"Colorado Booms-81231-A9634/2650"}]
["2017-02-05","Quad",50,{"$f":"_xlfn.TEXTJOIN(\"-\",,VLOOKUP(B20,$F$10:$I$18,{2,3,4}))","v":"Gel Booms-94608-Q4369/2290"}]
["2017-02-10","Aspen",69,{"$f":"_xlfn.TEXTJOIN(\"-\",,VLOOKUP(B21,$F$10:$I$18,{2,3,4}))","v":"Colorado Booms-81231-A9634/2650"}]
["2017-02-22","Eagle",98,{"$f":"_xlfn.TEXTJOIN(\"-\",,VLOOKUP(B22,$F$10:$I$18,{2,3,4}))","v":"Colorado Booms-81231-E9634/2386"}]
["2017-02-28","Sunbell",87,{"$f":"_xlfn.TEXTJOIN(\"-\",,VLOOKUP(B23,$F$10:$I$18,{2,3,4}))","v":"Gel Booms-94618-S4369/2241"}]
["2017-02-13","Yanaki",61,{"$f":"_xlfn.TEXTJOIN(\"-\",,VLOOKUP(B24,$F$10:$I$18,{2,3,4}))","v":"Colorado Booms-81231-Y9634/2072"}]
["2017-03-22","Yanaki",51,{"$f":"_xlfn.TEXTJOIN(\"-\",,VLOOKUP(B25,$F$10:$I$18,{2,3,4}))","v":"Colorado Booms-81231-Y9634/2072"}]
["2017-03-26","Carlota",62,{"$f":"_xlfn.TEXTJOIN(\"-\",,VLOOKUP(B26,$F$10:$I$18,{2,3,4}))","v":"Gel Booms-94608-C4369/2213"}]
["2017-01-26","Aspen",78,{"$f":"_xlfn.TEXTJOIN(\"-\",,VLOOKUP(B27,$F$10:$I$18,{2,3,4}))","v":"Colorado Booms-81231-A9634/2650"}]
["2017-01-07","Aspen",32,{"$f":"_xlfn.TEXTJOIN(\"-\",,VLOOKUP(B28,$F$10:$I$18,{2,3,4}))","v":"Colorado Booms-81231-A9634/2650"}]
["2017-02-04","Carlota",93,{"$f":"_xlfn.TEXTJOIN(\"-\",,VLOOKUP(B29,$F$10:$I$18,{2,3,4}))","v":"Gel Booms-94608-C4369/2213"}]
["2017-02-12","Aspen",115,{"$f":"_xlfn.TEXTJOIN(\"-\",,VLOOKUP(B30,$F$10:$I$18,{2,3,4}))","v":"Colorado Booms-81231-A9634/2650"}]
{"$rows_left_out":786}
{"sheet":"INDEX Aprox","index":3,"n_rows":815,"n_cols":25,"rows_kept":815,"cut":false,"hidden":false,"merged":[]}
["Excel Magic Trick 1352: Lookup 3 Items & Return to Single Cell VLOOKUP, INDEX or LOOKUP functions?"]
[]
["Date","Product","Units","Company-ZipCode-ID",null,null,null,null,null,null,null,null,null,null,null,null,null,null,null,null,null,null,"Date","Product","Units"]
["2017-03-16","Aspen",47,{"$f":"INDEX($G$10:$G$18&\"-\"&$H$10:$H$18&\"-\"&$I$10:$I$18,MATCH(B4,$F$10:$F$18))","v":"Colorado Booms-81231-A9634/2650"},null,null,null,null,null,null,null,null,null,null,null,null,null,null,null,null,null,null,{"$f":"RANDBETWEEN(\"1/1/2017\",\"3/31/2017\")","v":"2017-03-16"},{"$f":"INDEX($F$10:$F$18,RANDBETWEEN(1,ROWS($F$10:$F$18)))","v":"Aspen"},{"$f":"INT(ABS(_xlfn.NORM.INV(RAND(),75,25)))","v":65}]
["2017-03-29","Sunbell",90,{"$f":"INDEX($G$10:$G$18&\"-\"&$H$10:$H$18&\"-\"&$I$10:$I$18,MATCH(B5,$F$10:$F$18))","v":"Gel Booms-94618-S4369/2241"}]
["2017-03-02","Eagle",83,"Colorado Booms-81231-E9634/2386"]
["2017-03-25","Aspen",83,"Colorado Booms-81231-A9634/2650"]
["2017-01-11","Bellen",59,"Gel Booms-94618-B4369/2593"]
["2017-01-15","TriBoom",45,"Colorado Booms-90009-T9634/2372",null,"Product","Company","PlantZipCode","ID","RetailPrice","StandardCost"]
["2017-03-15","Sunbell",99,"Gel Booms-94618-S4369/2241",null,"Aspen","Colorado Booms",81231,"A9634/2650",21.95,11.6335]
["2017-02-17","Carlota",114,"Gel Booms-94608-C4369/2213",null,"Bellen","Gel Booms",94618,"B4369/2593",23.95,11.975]
["2017-02-03","Carlota",91,"Gel Booms-94608-C4369/2213",null,"Carlota","Gel Booms",94608,"C4369/2213",28.95,14.185499999999999]
["2017-03-24","Sunbell",87,"Gel Booms-94618-S4369/2241",null,"Eagle","Colorado Booms",81231,"E9634/2386",19.95,8.9774999999999991]
["2017-02-25","Bellen",71,"Gel Booms-94618-B4369/2593",null,"Quad","Gel Booms",94608,"Q4369/2290",43.95,21.535500000000003]
["2017-03-08","Aspen",67,"Colorado Booms-81231-A9634/2650",null,"Sunbell","Gel Booms",94618,"S4369/2241",27.95,15.3725]
["2017-01-05","Yanaki",63,"Colorado Booms-81231-Y9634/2072",null,"Sunshine","Gel Booms",94618,"S4369/2297",22.95,12.163499999999999]
["2017-02-06","Quad",15,"Gel Booms-94608-Q4369/2290",null,"TriBoom","Colorado Booms",90009,"T9634/2372",23.95,11.256499999999999]
["2017-01-06","Yanaki",32,"Colorado Booms-81231-Y9634/2072",null,"Yanaki","Colorado Booms",81231,"Y9634/2072",24.95,13.472999999999999]
["2017-03-14","Aspen",88,"Colorado Booms-81231-A9634/2650"]
["2017-02-05","Quad",50,"Gel Booms-94608-Q4369/2290"]
["2017-02-10","Aspen",69,"Colorado Booms-81231-A9634/2650"]
["2017-02-22","Eagle",98,"Colorado Booms-81231-E9634/2386"]
["2017-02-28","Sunbell",87,"Gel Booms-94618-S4369/2241"]
["2017-02-13","Yanaki",61,"Colorado Booms-81231-Y9634/2072"]
["2017-03-22","Yanaki",51,"Colorado Booms-81231-Y9634/2072"]
["2017-03-26","Carlota",62,"Gel Booms-94608-C4369/2213"]
["2017-01-26","Aspen",78,"Colorado Booms-81231-A9634/2650"]
["2017-01-07","Aspen",32,"Colorado Booms-81231-A9634/2650"]
["2017-02-04","Carlota",93,"Gel Booms-94608-C4369/2213"]
["2017-02-12","Aspen",115,"Colorado Booms-81231-A9634/2650"]
{"$rows_left_out":786}
{"sheet":"3 LOOKUP Aprox","index":4,"n_rows":815,"n_cols":25,"rows_kept":815,"cut":false,"hidden":false,"merged":[]}
["Excel Magic Trick 1352: Lookup 3 Items & Return to Single Cell VLOOKUP, INDEX or LOOKUP functions?"]
[]
["Date","Product","Units","Company-ZipCode-ID",null,null,null,null,null,null,null,null,null,null,null,null,null,null,null,null,null,null,"Date","Product","Units"]
["2017-03-16","Aspen",47,{"$f":"LOOKUP(B4,$F$10:$G$18)&\"-\"&LOOKUP(B4,$F$10:$H$18)&\"-\"&LOOKUP(B4,$F$10:$I$18)","v":"Colorado Booms-81231-A9634/2650"},null,null,null,null,null,null,null,null,null,null,null,null,null,null,null,null,null,null,{"$f":"RANDBETWEEN(\"1/1/2017\",\"3/31/2017\")","v":"2017-02-27"},{"$f":"INDEX($F$10:$F$18,RANDBETWEEN(1,ROWS($F$10:$F$18)))","v":"Quad"},{"$f":"INT(ABS(_xlfn.NORM.INV(RAND(),75,25)))","v":93}]
["2017-03-29","Sunbell",90,{"$f":"LOOKUP(B5,$F$10:$G$18)&\"-\"&LOOKUP(B5,$F$10:$H$18)&\"-\"&LOOKUP(B5,$F$10:$I$18)","v":"Gel Booms-94618-S4369/2241"}]
["2017-03-02","Eagle",83,"Colorado Booms-81231-E9634/2386"]
["2017-03-25","Aspen",83,"Colorado Booms-81231-A9634/2650"]
["2017-01-11","Bellen",59,"Gel Booms-94618-B4369/2593"]
["2017-01-15","TriBoom",45,"Colorado Booms-90009-T9634/2372",null,"Product","Company","PlantZipCode","ID","RetailPrice","StandardCost"]
["2017-03-15","Sunbell",99,"Gel Booms-94618-S4369/2241",null,"Aspen","Colorado Booms",81231,"A9634/2650",21.95,11.6335]
["2017-02-17","Carlota",114,"Gel Booms-94608-C4369/2213",null,"Bellen","Gel Booms",94618,"B4369/2593",23.95,11.975]
["2017-02-03","Carlota",91,"Gel Booms-94608-C4369/2213",null,"Carlota","Gel Booms",94608,"C4369/2213",28.95,14.185499999999999]
["2017-03-24","Sunbell",87,"Gel Booms-94618-S4369/2241",null,"Eagle","Colorado Booms",81231,"E9634/2386",19.95,8.9774999999999991]
["2017-02-25","Bellen",71,"Gel Booms-94618-B4369/2593",null,"Quad","Gel Booms",94608,"Q4369/2290",43.95,21.535500000000003]
["2017-03-08","Aspen",67,"Colorado Booms-81231-A9634/2650",null,"Sunbell","Gel Booms",94618,"S4369/2241",27.95,15.3725]
["2017-01-05","Yanaki",63,"Colorado Booms-81231-Y9634/2072",null,"Sunshine","Gel Booms",94618,"S4369/2297",22.95,12.163499999999999]
["2017-02-06","Quad",15,"Gel Booms-94608-Q4369/2290",null,"TriBoom","Colorado Booms",90009,"T9634/2372",23.95,11.256499999999999]
["2017-01-06","Yanaki",32,"Colorado Booms-81231-Y9634/2072",null,"Yanaki","Colorado Booms",81231,"Y9634/2072",24.95,13.472999999999999]
["2017-03-14","Aspen",88,"Colorado Booms-81231-A9634/2650"]
["2017-02-05","Quad",50,"Gel Booms-94608-Q4369/2290"]
["2017-02-10","Aspen",69,"Colorado Booms-81231-A9634/2650"]
["2017-02-22","Eagle",98,"Colorado Booms-81231-E9634/2386"]
["2017-02-28","Sunbell",87,"Gel Booms-94618-S4369/2241"]
["2017-02-13","Yanaki",61,"Colorado Booms-81231-Y9634/2072"]
["2017-03-22","Yanaki",51,"Colorado Booms-81231-Y9634/2072"]
["2017-03-26","Carlota",62,"Gel Booms-94608-C4369/2213"]
["2017-01-26","Aspen",78,"Colorado Booms-81231-A9634/2650"]
["2017-01-07","Aspen",32,"Colorado Booms-81231-A9634/2650"]
["2017-02-04","Carlota",93,"Gel Booms-94608-C4369/2213"]
["2017-02-12","Aspen",115,"Colorado Booms-81231-A9634/2650"]
{"$rows_left_out":786}
{"sheet":"Bill Szysz (1)","index":5,"n_rows":815,"n_cols":11,"rows_kept":815,"cut":false,"hidden":false,"merged":[]}
[]
[]
["Date","Product","Units","Company-ZipCode-ID"]
["2017-03-16","Aspen",47,{"$f":"_xlfn.TEXTJOIN(\"-\",,INDEX($G$10:$I$18,MATCH(B4,$F$10:$F$18),))","v":"Colorado Booms-81231-A9634/2650"}]
["2017-03-29","Sunbell",90,{"$f":"_xlfn.TEXTJOIN(\"-\",,INDEX($G$10:$I$18,MATCH(B5,$F$10:$F$18),))","v":"Gel Booms-94618-S4369/2241"}]
["2017-03-02","Eagle",83,"Colorado Booms-81231-E9634/2386"]
["2017-03-25","Aspen",83,"Colorado Booms-81231-A9634/2650"]
["2017-01-11","Bellen",59,"Gel Booms-94618-B4369/2593"]
["2017-01-15","TriBoom",45,"Colorado Booms-90009-T9634/2372",null,"Product","Company","PlantZipCode","ID","RetailPrice","StandardCost"]
["2017-03-15","Sunbell",99,"Gel Booms-94618-S4369/2241",null,"Aspen","Colorado Booms",81231,"A9634/2650",21.95,11.6335]
["2017-02-17","Carlota",114,"Gel Booms-94608-C4369/2213",null,"Bellen","Gel Booms",94618,"B4369/2593",23.95,11.975]
["2017-02-03","Carlota",91,"Gel Booms-94608-C4369/2213",null,"Carlota","Gel Booms",94608,"C4369/2213",28.95,14.185499999999999]
["2017-03-24","Sunbell",87,"Gel Booms-94618-S4369/2241",null,"Eagle","Colorado Booms",81231,"E9634/2386",19.95,8.9774999999999991]
["2017-02-25","Bellen",71,"Gel Booms-94618-B4369/2593",null,"Quad","Gel Booms",94608,"Q4369/2290",43.95,21.535500000000003]
["2017-03-08","Aspen",67,"Colorado Booms-81231-A9634/2650",null,"Sunbell","Gel Booms",94618,"S4369/2241",27.95,15.3725]
["2017-01-05","Yanaki",63,"Colorado Booms-81231-Y9634/2072",null,"Sunshine","Gel Booms",94618,"S4369/2297",22.95,12.163499999999999]
["2017-02-06","Quad",15,"Gel Booms-94608-Q4369/2290",null,"TriBoom","Colorado Booms",90009,"T9634/2372",23.95,11.256499999999999]
["2017-01-06","Yanaki",32,"Colorado Booms-81231-Y9634/2072",null,"Yanaki","Colorado Booms",81231,"Y9634/2072",24.95,13.472999999999999]
["2017-03-14","Aspen",88,"Colorado Booms-81231-A9634/2650"]
["2017-02-05","Quad",50,"Gel Booms-94608-Q4369/2290"]
["2017-02-10","Aspen",69,"Colorado Booms-81231-A9634/2650"]
["2017-02-22","Eagle",98,"Colorado Booms-81231-E9634/2386"]
["2017-02-28","Sunbell",87,"Gel Booms-94618-S4369/2241"]
["2017-02-13","Yanaki",61,"Colorado Booms-81231-Y9634/2072"]
["2017-03-22","Yanaki",51,"Colorado Booms-81231-Y9634/2072"]
["2017-03-26","Carlota",62,"Gel Booms-94608-C4369/2213"]
["2017-01-26","Aspen",78,"Colorado Booms-81231-A9634/2650"]
["2017-01-07","Aspen",32,"Colorado Booms-81231-A9634/2650"]
["2017-02-04","Carlota",93,"Gel Booms-94608-C4369/2213"]
["2017-02-12","Aspen",115,"Colorado Booms-81231-A9634/2650"]
{"$rows_left_out":786}
{"sheet":"Bill Szysz (2)","index":6,"n_rows":815,"n_cols":11,"rows_kept":815,"cut":false,"hidden":false,"merged":[]}
[]
[]
["Date","Product","Units","Company-ZipCode-ID"]
["2017-03-16","Aspen",47,{"$f":"_xlfn.TEXTJOIN(\"-\",,INDEX(($G$10:$G$18,$H$10:$H$18,$I$10:$I$18),MATCH(B4,$F$10:$F$18),,N(IF(1,{1,2,3}))))","v":"Colorado Booms-81231-A9634/2650"}]
["2017-03-29","Sunbell",90,{"$f":"_xlfn.TEXTJOIN(\"-\",,INDEX(($G$10:$G$18,$H$10:$H$18,$I$10:$I$18),MATCH(B5,$F$10:$F$18),,N(IF(1,{1,2,3}))))","v":"Gel Booms-94618-S4369/2241"}]
["2017-03-02","Eagle",83,{"$f":"_xlfn.TEXTJOIN(\"-\",,INDEX(($G$10:$G$18,$H$10:$H$18,$I$10:$I$18),MATCH(B6,$F$10:$F$18),,N(IF(1,{1,2,3}))))","v":"Colorado Booms-81231-E9634/2386"}]
["2017-03-25","Aspen",83,{"$f":"_xlfn.TEXTJOIN(\"-\",,INDEX(($G$10:$G$18,$H$10:$H$18,$I$10:$I$18),MATCH(B7,$F$10:$F$18),,N(IF(1,{1,2,3}))))","v":"Colorado Booms-81231-A9634/2650"}]
["2017-01-11","Bellen",59,{"$f":"_xlfn.TEXTJOIN(\"-\",,INDEX(($G$10:$G$18,$H$10:$H$18,$I$10:$I$18),MATCH(B8,$F$10:$F$18),,N(IF(1,{1,2,3}))))","v":"Gel Booms-94618-B4369/2593"}]
["2017-01-15","TriBoom",45,{"$f":"_xlfn.TEXTJOIN(\"-\",,INDEX(($G$10:$G$18,$H$10:$H$18,$I$10:$I$18),MATCH(B9,$F$10:$F$18),,N(IF(1,{1,2,3}))))","v":"Colorado Booms-90009-T9634/2372"},null,"Product","Company","PlantZipCode","ID","RetailPrice","StandardCost"]
["2017-03-15","Sunbell",99,{"$f":"_xlfn.TEXTJOIN(\"-\",,INDEX(($G$10:$G$18,$H$10:$H$18,$I$10:$I$18),MATCH(B10,$F$10:$F$18),,N(IF(1,{1,2,3}))))","v":"Gel Booms-94618-S4369/2241"},null,"Aspen","Colorado Booms",81231,"A9634/2650",21.95,11.6335]
["2017-02-17","Carlota",114,{"$f":"_xlfn.TEXTJOIN(\"-\",,INDEX(($G$10:$G$18,$H$10:$H$18,$I$10:$I$18),MATCH(B11,$F$10:$F$18),,N(IF(1,{1,2,3}))))","v":"Gel Booms-94608-C4369/2213"},null,"Bellen","Gel Booms",94618,"B4369/2593",23.95,11.975]
["2017-02-03","Carlota",91,{"$f":"_xlfn.TEXTJOIN(\"-\",,INDEX(($G$10:$G$18,$H$10:$H$18,$I$10:$I$18),MATCH(B12,$F$10:$F$18),,N(IF(1,{1,2,3}))))","v":"Gel Booms-94608-C4369/2213"},null,"Carlota","Gel Booms",94608,"C4369/2213",28.95,14.185499999999999]
["2017-03-24","Sunbell",87,{"$f":"_xlfn.TEXTJOIN(\"-\",,INDEX(($G$10:$G$18,$H$10:$H$18,$I$10:$I$18),MATCH(B13,$F$10:$F$18),,N(IF(1,{1,2,3}))))","v":"Gel Booms-94618-S4369/2241"},null,"Eagle","Colorado Booms",81231,"E9634/2386",19.95,8.9774999999999991]
["2017-02-25","Bellen",71,{"$f":"_xlfn.TEXTJOIN(\"-\",,INDEX(($G$10:$G$18,$H$10:$H$18,$I$10:$I$18),MATCH(B14,$F$10:$F$18),,N(IF(1,{1,2,3}))))","v":"Gel Booms-94618-B4369/2593"},null,"Quad","Gel Booms",94608,"Q4369/2290",43.95,21.535500000000003]
["2017-03-08","Aspen",67,{"$f":"_xlfn.TEXTJOIN(\"-\",,INDEX(($G$10:$G$18,$H$10:$H$18,$I$10:$I$18),MATCH(B15,$F$10:$F$18),,N(IF(1,{1,2,3}))))","v":"Colorado Booms-81231-A9634/2650"},null,"Sunbell","Gel Booms",94618,"S4369/2241",27.95,15.3725]
["2017-01-05","Yanaki",63,{"$f":"_xlfn.TEXTJOIN(\"-\",,INDEX(($G$10:$G$18,$H$10:$H$18,$I$10:$I$18),MATCH(B16,$F$10:$F$18),,N(IF(1,{1,2,3}))))","v":"Colorado Booms-81231-Y9634/2072"},null,"Sunshine","Gel Booms",94618,"S4369/2297",22.95,12.163499999999999]
["2017-02-06","Quad",15,{"$f":"_xlfn.TEXTJOIN(\"-\",,INDEX(($G$10:$G$18,$H$10:$H$18,$I$10:$I$18),MATCH(B17,$F$10:$F$18),,N(IF(1,{1,2,3}))))","v":"Gel Booms-94608-Q4369/2290"},null,"TriBoom","Colorado Booms",90009,"T9634/2372",23.95,11.256499999999999]
["2017-01-06","Yanaki",32,{"$f":"_xlfn.TEXTJOIN(\"-\",,INDEX(($G$10:$G$18,$H$10:$H$18,$I$10:$I$18),MATCH(B18,$F$10:$F$18),,N(IF(1,{1,2,3}))))","v":"Colorado Booms-81231-Y9634/2072"},null,"Yanaki","Colorado Booms",81231,"Y9634/2072",24.95,13.472999999999999]
["2017-03-14","Aspen",88,{"$f":"_xlfn.TEXTJOIN(\"-\",,INDEX(($G$10:$G$18,$H$10:$H$18,$I$10:$I$18),MATCH(B19,$F$10:$F$18),,N(IF(1,{1,2,3}))))","v":"Colorado Booms-81231-A9634/2650"}]
["2017-02-05","Quad",50,{"$f":"_xlfn.TEXTJOIN(\"-\",,INDEX(($G$10:$G$18,$H$10:$H$18,$I$10:$I$18),MATCH(B20,$F$10:$F$18),,N(IF(1,{1,2,3}))))","v":"Gel Booms-94608-Q4369/2290"}]
["2017-02-10","Aspen",69,{"$f":"_xlfn.TEXTJOIN(\"-\",,INDEX(($G$10:$G$18,$H$10:$H$18,$I$10:$I$18),MATCH(B21,$F$10:$F$18),,N(IF(1,{1,2,3}))))","v":"Colorado Booms-81231-A9634/2650"}]
["2017-02-22","Eagle",98,{"$f":"_xlfn.TEXTJOIN(\"-\",,INDEX(($G$10:$G$18,$H$10:$H$18,$I$10:$I$18),MATCH(B22,$F$10:$F$18),,N(IF(1,{1,2,3}))))","v":"Colorado Booms-81231-E9634/2386"}]
["2017-02-28","Sunbell",87,{"$f":"_xlfn.TEXTJOIN(\"-\",,INDEX(($G$10:$G$18,$H$10:$H$18,$I$10:$I$18),MATCH(B23,$F$10:$F$18),,N(IF(1,{1,2,3}))))","v":"Gel Booms-94618-S4369/2241"}]
["2017-02-13","Yanaki",61,{"$f":"_xlfn.TEXTJOIN(\"-\",,INDEX(($G$10:$G$18,$H$10:$H$18,$I$10:$I$18),MATCH(B24,$F$10:$F$18),,N(IF(1,{1,2,3}))))","v":"Colorado Booms-81231-Y9634/2072"}]
["2017-03-22","Yanaki",51,{"$f":"_xlfn.TEXTJOIN(\"-\",,INDEX(($G$10:$G$18,$H$10:$H$18,$I$10:$I$18),MATCH(B25,$F$10:$F$18),,N(IF(1,{1,2,3}))))","v":"Colorado Booms-81231-Y9634/2072"}]
["2017-03-26","Carlota",62,{"$f":"_xlfn.TEXTJOIN(\"-\",,INDEX(($G$10:$G$18,$H$10:$H$18,$I$10:$I$18),MATCH(B26,$F$10:$F$18),,N(IF(1,{1,2,3}))))","v":"Gel Booms-94608-C4369/2213"}]
["2017-01-26","Aspen",78,{"$f":"_xlfn.TEXTJOIN(\"-\",,INDEX(($G$10:$G$18,$H$10:$H$18,$I$10:$I$18),MATCH(B27,$F$10:$F$18),,N(IF(1,{1,2,3}))))","v":"Colorado Booms-81231-A9634/2650"}]
["2017-01-07","Aspen",32,{"$f":"_xlfn.TEXTJOIN(\"-\",,INDEX(($G$10:$G$18,$H$10:$H$18,$I$10:$I$18),MATCH(B28,$F$10:$F$18),,N(IF(1,{1,2,3}))))","v":"Colorado Booms-81231-A9634/2650"}]
["2017-02-04","Carlota",93,{"$f":"_xlfn.TEXTJOIN(\"-\",,INDEX(($G$10:$G$18,$H$10:$H$18,$I$10:$I$18),MATCH(B29,$F$10:$F$18),,N(IF(1,{1,2,3}))))","v":"Gel Booms-94608-C4369/2213"}]
["2017-02-12","Aspen",115,{"$f":"_xlfn.TEXTJOIN(\"-\",,INDEX(($G$10:$G$18,$H$10:$H$18,$I$10:$I$18),MATCH(B30,$F$10:$F$18),,N(IF(1,{1,2,3}))))","v":"Colorado Booms-81231-A9634/2650"}]
{"$rows_left_out":785}