{"text_format":"1","workbook":"xlsx","n_sheets":7,"sheets":["Timing","3 VLOOKUP Exact","VLOOKUP Array Aprox","INDEX Aprox","3 LOOKUP Aprox","Bill Szysz (1)","Bill Szysz (2)"],"not_rendered":{"charts":0,"images":0,"macros":1,"external_links":0,"defined_names":0,"comments":0,"pivot_tables":0},"unopened":[],"bounds":{"document_bytes":16777216,"sheet_cells":100000,"rows_first":2000,"rows_last":500,"rows_between":2000,"halvings":0,"cell_chars":16384,"cell_head_chars":4096},"cells_cut":0,"cells_raw":0,"read":"whole","date_system":"1900"}

{"sheet":"Timing","index":0,"n_rows":9,"n_cols":10,"rows_kept":9,"cut":false,"hidden":false,"merged":[]}
["Formula","Time 1","Time 2","Time 3","#","Formula Name","Average","% Increase as Compared to Fastest"]
[{"$f":"IFERROR(\" \"&_xlfn.FORMULATEXT(INDIRECT(\"'\"&F2&\"'!D4\")),\"\")","v":" =LOOKUP(B4,$F$10:$G$18)&\"-\"&LOOKUP(B4,$F$10:$H$18)&\"-\"&LOOKUP(B4,$F$10:$I$18)"},1.9499999999999999E-3,1.97E-3,2.0100000000000001E-3,"[4]","3 LOOKUP Aprox",{"$f":"AVERAGE(B2:D2)","v":1.9766666666666665E-3},{"$f":"G2/$G$2-1","v":0}]
[{"$f":"IFERROR(\" \"&_xlfn.FORMULATEXT(INDIRECT(\"'\"&F3&\"'!D4\")),\"\")","v":" =VLOOKUP(B4,$F$10:$I$18,2,0)&\"-\"&VLOOKUP(B4,$F$10:$I$18,3,0)&\"-\"&VLOOKUP(B4,$F$10:$I$18,4,0)"},2.33E-3,2.2699999999999999E-3,2.3400000000000001E-3,"[1]","3 VLOOKUP Exact",{"$f":"AVERAGE(B3:D3)","v":2.3133333333333335E-3},{"$f":"G3/$G$2-1","v":0.17032040472175392}]
[" =INDEX($G$10:$G$18&\"-\"&$H$10:$H$18&\"-\"&$I$10:$I$18,MATCH(B4,$F$10:$F$18))",4.5700000000000003E-3,4.5399999999999998E-3,4.5799999999999999E-3,"[3]","INDEX Aprox",{"$f":"AVERAGE(B4:D4)","v":4.5633333333333333E-3},1.3086003372681283]
[" {=TEXTJOIN(\"-\",,VLOOKUP(B4,$F$10:$I$18,{2,3,4}))}",9.2599999999999991E-3,1.269E-2,1.473E-2,"[2]","VLOOKUP Array Aprox",{"$f":"AVERAGE(B5:D5)","v":1.2226666666666665E-2},5.1854974704890386]
[]
["Added after video filmed:"]
[{"$f":"IFERROR(\" \"&_xlfn.FORMULATEXT(INDIRECT(\"'\"&F8&\"'!D4\")),\"\")","v":" =TEXTJOIN(\"-\",,INDEX($G$10:$I$18,MATCH(B4,$F$10:$F$18),))"},9.8600000000000007E-3,9.9299999999999996E-3,1.001E-2,null,"Bill Szysz (1)",{"$f":"AVERAGE(B8:D8)","v":9.9333333333333339E-3},{"$f":"G8/$G$2-1","v":4.0252951096121423},null,"From Bill Szysz at YouTube"]
[{"$f":"IFERROR(\" \"&_xlfn.FORMULATEXT(INDIRECT(\"'\"&F9&\"'!D4\")),\"\")","v":" =TEXTJOIN(\"-\",,INDEX(($G$10:$G$18,$H$10:$H$18,$I$10:$I$18),MATCH(B4,$F$10:$F$18),,N(IF(1,{1,2,3}))))"},1.061E-2,1.04E-2,1.0449999999999999E-2,null,"Bill Szysz (2)",{"$f":"AVERAGE(B9:D9)","v":1.0486666666666667E-2},{"$f":"G9/$G$2-1","v":4.3052276559865099},null,"From Bill Szysz at YouTube"]

{"sheet":"3 VLOOKUP Exact","index":1,"n_rows":815,"n_cols":25,"rows_kept":815,"cut":false,"hidden":false,"merged":[]}
["Excel Magic Trick 1352: Lookup 3 Items & Return to Single Cell VLOOKUP, INDEX or LOOKUP functions?"]
[]
["Date","Product","Units","Company-ZipCode-ID",null,"4 Formula Examples",null,null,null,null,null,null,null,null,null,null,null,null,null,null,null,null,"Date","Product","Units"]
["2017-03-16","Aspen",47,{"$f":"VLOOKUP(B4,$F$10:$I$18,2,0)&\"-\"&VLOOKUP(B4,$F$10:$I$18,3,0)&\"-\"&VLOOKUP(B4,$F$10:$I$18,4,0)","v":"Colorado Booms-81231-A9634/2650"},null,"[1]","3 VLOOKUP Exact Match functions",null,null,null,null,null,null,null,null,null,null,null,null,null,null,null,{"$f":"RANDBETWEEN(\"1/1/2017\",\"3/31/2017\")","v":"2017-01-03"},{"$f":"INDEX($F$10:$F$18,RANDBETWEEN(1,ROWS($F$10:$F$18)))","v":"TriBoom"},{"$f":"INT(ABS(_xlfn.NORM.INV(RAND(),75,25)))","v":79}]
["2017-03-29","Sunbell",90,{"$f":"VLOOKUP(B5,$F$10:$I$18,2,0)&\"-\"&VLOOKUP(B5,$F$10:$I$18,3,0)&\"-\"&VLOOKUP(B5,$F$10:$I$18,4,0)","v":"Gel Booms-94618-S4369/2241"},null,"[2]","1 VLOOKUP Approximate Match function with Array Operation, Ctrl + Shift + Enter"]
["2017-03-02","Eagle",83,"Colorado Booms-81231-E9634/2386",null,"[3]","1 INDEX & MATCH Approximate Match with Array Operation"]
["2017-03-25","Aspen",83,"Colorado Booms-81231-A9634/2650",null,"[4]","3 LOOKUP Approximate Match functions"]
["2017-01-11","Bellen",59,"Gel Booms-94618-B4369/2593"]
["2017-01-15","TriBoom",45,"Colorado Booms-90009-T9634/2372",null,"Product","Company","PlantZipCode","ID","RetailPrice","StandardCost"]
["2017-03-15","Sunbell",99,"Gel Booms-94618-S4369/2241",null,"Eagle","Colorado Booms",81231,"E9634/2386",19.95,8.9774999999999991]
["2017-02-17","Carlota",114,"Gel Booms-94608-C4369/2213",null,"Aspen","Colorado Booms",81231,"A9634/2650",21.95,11.6335]
["2017-02-03","Carlota",91,"Gel Booms-94608-C4369/2213",null,"Sunshine","Gel Booms",94618,"S4369/2297",22.95,12.163499999999999]
["2017-03-24","Sunbell",87,"Gel Booms-94618-S4369/2241",null,"Bellen","Gel Booms",94618,"B4369/2593",23.95,11.975]
["2017-02-25","Bellen",71,"Gel Booms-94618-B4369/2593",null,"TriBoom","Colorado Booms",90009,"T9634/2372",23.95,11.256499999999999]
["2017-03-08","Aspen",67,"Colorado Booms-81231-A9634/2650",null,"Yanaki","Colorado Booms",81231,"Y9634/2072",24.95,13.472999999999999]
["2017-01-05","Yanaki",63,"Colorado Booms-81231-Y9634/2072",null,"Sunbell","Gel Booms",94618,"S4369/2241",27.95,15.3725]
["2017-02-06","Quad",15,"Gel Booms-94608-Q4369/2290",null,"Carlota","Gel Booms",94608,"C4369/2213",28.95,14.185499999999999]
["2017-01-06","Yanaki",32,"Colorado Booms-81231-Y9634/2072",null,"Quad","Gel Booms",94608,"Q4369/2290",43.95,21.535500000000003]
["2017-03-14","Aspen",88,"Colorado Booms-81231-A9634/2650"]
["2017-02-05","Quad",50,"Gel Booms-94608-Q4369/2290"]
["2017-02-10","Aspen",69,"Colorado Booms-81231-A9634/2650"]
["2017-02-22","Eagle",98,"Colorado Booms-81231-E9634/2386"]
["2017-02-28","Sunbell",87,"Gel Booms-94618-S4369/2241"]
["2017-02-13","Yanaki",61,"Colorado Booms-81231-Y9634/2072"]
["2017-03-22","Yanaki",51,"Colorado Booms-81231-Y9634/2072"]
["2017-03-26","Carlota",62,"Gel Booms-94608-C4369/2213"]
["2017-01-26","Aspen",78,"Colorado Booms-81231-A9634/2650"]
["2017-01-07","Aspen",32,"Colorado Booms-81231-A9634/2650"]
["2017-02-04","Carlota",93,"Gel Booms-94608-C4369/2213"]
["2017-02-12","Aspen",115,"Colorado Booms-81231-A9634/2650"]
["2017-03-19","Bellen",56,"Gel Booms-94618-B4369/2593"]
["2017-03-11","Eagle",68,"Colorado Booms-81231-E9634/2386"]
["2017-03-09","Carlota",71,"Gel Booms-94608-C4369/2213"]
["2017-01-30","Carlota",73,"Gel Booms-94608-C4369/2213"]
["2017-02-16","Carlota",47,"Gel Booms-94608-C4369/2213"]
["2017-02-10","Carlota",82,"Gel Booms-94608-C4369/2213"]
["2017-02-21","Sunshine",61,"Gel Booms-94618-S4369/2297"]
["2017-02-21","Quad",83,"Gel Booms-94608-Q4369/2290"]
["2017-02-02","TriBoom",47,"Colorado Booms-90009-T9634/2372"]
["2017-02-10","Yanaki",83,"Colorado Booms-81231-Y9634/2072"]
["2017-01-04","Carlota",74,"Gel Booms-94608-C4369/2213"]
["2017-01-25","Quad",65,"Gel Booms-94608-Q4369/2290"]
["2017-03-01","Bellen",109,"Gel Booms-94618-B4369/2593"]
["2017-02-20","Aspen",78,"Colorado Booms-81231-A9634/2650"]
["2017-01-02","Aspen",64,"Colorado Booms-81231-A9634/2650"]
["2017-03-30","Yanaki",109,"Colorado Booms-81231-Y9634/2072"]
["2017-01-16","TriBoom",58,"Colorado Booms-90009-T9634/2372"]
["2017-01-12","Carlota",60,"Gel Booms-94608-C4369/2213"]
["2017-02-05","Sunshine",102,"Gel Booms-94618-S4369/2297"]
["2017-02-14","Bellen",65,"Gel Booms-94618-B4369/2593"]
["2017-03-13","Sunbell",31,"Gel Booms-94618-S4369/2241"]
["2017-01-27","Aspen",102,"Colorado Booms-81231-A9634/2650"]
["2017-01-26","Quad",52,"Gel Booms-94608-Q4369/2290"]
["2017-03-08","Sunbell",95,"Gel Booms-94618-S4369/2241"]
["2017-01-08","Aspen",68,"Colorado Booms-81231-A9634/2650"]
["2017-03-11","Bellen",85,"Gel Booms-94618-B4369/2593"]
["2017-03-02","Yanaki",22,"Colorado Booms-81231-Y9634/2072"]
["2017-01-13","Sunshine",79,"Gel Booms-94618-S4369/2297"]
["2017-03-27","Aspen",62,"Colorado Booms-81231-A9634/2650"]
["2017-02-09","Eagle",70,"Colorado Booms-81231-E9634/2386"]
["2017-01-17","TriBoom",60,"Colorado Booms-90009-T9634/2372"]
["2017-03-11","Aspen",65,"Colorado Booms-81231-A9634/2650"]
["2017-03-07","TriBoom",84,"Colorado Booms-90009-T9634/2372"]
["2017-03-03","Carlota",67,"Gel Booms-94608-C4369/2213"]
["2017-03-13","Eagle",104,"Colorado Booms-81231-E9634/2386"]
["2017-01-18","Bellen",93,"Gel Booms-94618-B4369/2593"]
["2017-03-28","Carlota",82,"Gel Booms-94608-C4369/2213"]
["2017-03-10","Bellen",71,"Gel Booms-94618-B4369/2593"]
["2017-01-01","Eagle",71,{"$f":"VLOOKUP(B69,$F$10:$I$18,2,0)&\"-\"&VLOOKUP(B69,$F$10:$I$18,3,0)&\"-\"&VLOOKUP(B69,$F$10:$I$18,4,0)","v":"Colorado Booms-81231-E9634/2386"}]
["2017-03-30","TriBoom",68,"Colorado Booms-90009-T9634/2372"]
["2017-01-15","Bellen",120,"Gel Booms-94618-B4369/2593"]
["2017-01-06","Sunbell",46,"Gel Booms-94618-S4369/2241"]
["2017-01-04","Carlota",96,"Gel Booms-94608-C4369/2213"]
["2017-02-03","Aspen",86,"Colorado Booms-81231-A9634/2650"]
["2017-03-28","Sunbell",79,"Gel Booms-94618-S4369/2241"]
["2017-02-22","Bellen",100,"Gel Booms-94618-B4369/2593"]
["2017-01-23","Yanaki",77,"Colorado Booms-81231-Y9634/2072"]
["2017-01-04","Sunbell",49,"Gel Booms-94618-S4369/2241"]
["2017-03-05","Eagle",92,"Colorado Booms-81231-E9634/2386"]
["2017-01-25","Sunshine",49,"Gel Booms-94618-S4369/2297"]
["2017-01-23","Aspen",9,"Colorado Booms-81231-A9634/2650"]
["2017-03-22","Bellen",44,"Gel Booms-94618-B4369/2593"]
["2017-02-27","Carlota",72,"Gel Booms-94608-C4369/2213"]
["2017-03-02","Carlota",59,"Gel Booms-94608-C4369/2213"]
["2017-01-17","Sunbell",90,"Gel Booms-94618-S4369/2241"]
["2017-02-25","Eagle",54,"Colorado Booms-81231-E9634/2386"]
["2017-01-31","Quad",71,"Gel Booms-94608-Q4369/2290"]
["2017-01-27","Eagle",90,"Colorado Booms-81231-E9634/2386"]
["2017-03-17","Quad",58,"Gel Booms-94608-Q4369/2290"]
["2017-01-29","Bellen",73,"Gel Booms-94618-B4369/2593"]
["2017-03-02","TriBoom",69,"Colorado Booms-90009-T9634/2372"]
["2017-01-11","Eagle",59,"Colorado Booms-81231-E9634/2386"]
["2017-03-06","Yanaki",71,"Colorado Booms-81231-Y9634/2072"]
["2017-02-06","Eagle",111,"Colorado Booms-81231-E9634/2386"]
["2017-03-24","TriBoom",59,"Colorado Booms-90009-T9634/2372"]
["2017-02-20","Carlota",103,"Gel Booms-94608-C4369/2213"]
["2017-02-22","TriBoom",59,"Colorado Booms-90009-T9634/2372"]
["2017-01-28","TriBoom",96,"Colorado Booms-90009-T9634/2372"]
["2017-01-24","TriBoom",53,"Colorado Booms-90009-T9634/2372"]
["2017-01-23","Eagle",43,"Colorado Booms-81231-E9634/2386"]
["2017-02-23","Bellen",67,"Gel Booms-94618-B4369/2593"]
["2017-02-16","Aspen",115,"Colorado Booms-81231-A9634/2650"]
["2017-02-07","TriBoom",93,"Colorado Booms-90009-T9634/2372"]
["2017-03-13","Yanaki",44,"Colorado Booms-81231-Y9634/2072"]
["2017-02-09","Yanaki",82,"Colorado Booms-81231-Y9634/2072"]
["2017-01-24","Aspen",96,"Colorado Booms-81231-A9634/2650"]
["2017-03-03","Eagle",115,"Colorado Booms-81231-E9634/2386"]
["2017-03-15","Carlota",58,"Gel Booms-94608-C4369/2213"]
["2017-02-13","Eagle",100,"Colorado Booms-81231-E9634/2386"]
["2017-03-29","TriBoom",80,"Colorado Booms-90009-T9634/2372"]
["2017-02-25","Sunshine",105,"Gel Booms-94618-S4369/2297"]
["2017-03-19","Sunshine",84,"Gel Booms-94618-S4369/2297"]
["2017-01-03","Bellen",62,"Gel Booms-94618-B4369/2593"]
["2017-03-13","Quad",92,"Gel Booms-94608-Q4369/2290"]
["2017-02-16","Sunshine",49,"Gel Booms-94618-S4369/2297"]
["2017-02-11","Aspen",119,"Colorado Booms-81231-A9634/2650"]
["2017-02-20","Bellen",41,"Gel Booms-94618-B4369/2593"]
["2017-01-13","Aspen",115,"Colorado Booms-81231-A9634/2650"]
["2017-01-04","Quad",103,"Gel Booms-94608-Q4369/2290"]
["2017-01-13","Bellen",79,"Gel Booms-94618-B4369/2593"]
["2017-01-04","Bellen",113,"Gel Booms-94618-B4369/2593"]
["2017-03-25","Aspen",49,"Colorado Booms-81231-A9634/2650"]
["2017-03-29","Quad",77,"Gel Booms-94608-Q4369/2290"]
["2017-02-20","Eagle",63,"Colorado Booms-81231-E9634/2386"]
["2017-02-04","Sunbell",84,"Gel Booms-94618-S4369/2241"]
["2017-02-04","TriBoom",89,"Colorado Booms-90009-T9634/2372"]
["2017-01-19","Sunbell",93,"Gel Booms-94618-S4369/2241"]
["2017-01-21","Bellen",46,"Gel Booms-94618-B4369/2593"]
["2017-01-31","TriBoom",45,"Colorado Booms-90009-T9634/2372"]
["2017-03-23","Yanaki",110,"Colorado Booms-81231-Y9634/2072"]
["2017-01-21","Aspen",54,"Colorado Booms-81231-A9634/2650"]
["2017-01-12","TriBoom",99,"Colorado Booms-90009-T9634/2372"]
["2017-02-19","Yanaki",92,{"$f":"VLOOKUP(B133,$F$10:$I$18,2,0)&\"-\"&VLOOKUP(B133,$F$10:$I$18,3,0)&\"-\"&VLOOKUP(B133,$F$10:$I$18,4,0)","v":"Colorado Booms-81231-Y9634/2072"}]
["2017-02-02","TriBoom",81,"Colorado Booms-90009-T9634/2372"]
["2017-03-10","Carlota",101,"Gel Booms-94608-C4369/2213"]
["2017-02-23","TriBoom",70,"Colorado Booms-90009-T9634/2372"]
["2017-02-07","Yanaki",76,"Colorado Booms-81231-Y9634/2072"]
["2017-02-20","Carlota",103,"Gel Booms-94608-C4369/2213"]
["2017-02-03","Bellen",110,"Gel Booms-94618-B4369/2593"]
["2017-03-30","Carlota",103,"Gel Booms-94608-C4369/2213"]
["2017-03-03","Eagle",48,"Colorado Booms-81231-E9634/2386"]
["2017-03-30","Eagle",96,"Colorado Booms-81231-E9634/2386"]
["2017-01-19","Bellen",102,"Gel Booms-94618-B4369/2593"]
["2017-01-29","Sunshine",81,"Gel Booms-94618-S4369/2297"]
["2017-02-08","Yanaki",90,"Colorado Booms-81231-Y9634/2072"]
["2017-01-15","Bellen",45,"Gel Booms-94618-B4369/2593"]
["2017-02-09","Eagle",54,"Colorado Booms-81231-E9634/2386"]
["2017-02-20","Bellen",52,"Gel Booms-94618-B4369/2593"]
["2017-03-18","Quad",95,"Gel Booms-94608-Q4369/2290"]
["2017-03-15","Carlota",62,"Gel Booms-94608-C4369/2213"]
["2017-03-09","Yanaki",43,"Colorado Booms-81231-Y9634/2072"]
["2017-03-30","TriBoom",46,"Colorado Booms-90009-T9634/2372"]
["2017-01-28","Eagle",44,"Colorado Booms-81231-E9634/2386"]
["2017-01-20","Eagle",84,"Colorado Booms-81231-E9634/2386"]
["2017-02-25","Sunshine",57,"Gel Booms-94618-S4369/2297"]
["2017-01-18","Carlota",82,"Gel Booms-94608-C4369/2213"]
["2017-02-22","Sunbell",74,"Gel Booms-94618-S4369/2241"]
["2017-02-15","Carlota",49,"Gel Booms-94608-C4369/2213"]
["2017-01-01","Bellen",48,"Gel Booms-94618-B4369/2593"]
["2017-02-11","Eagle",105,"Colorado Booms-81231-E9634/2386"]
["2017-03-28","Carlota",43,"Gel Booms-94608-C4369/2213"]
["2017-02-07","Yanaki",60,"Colorado Booms-81231-Y9634/2072"]
["2017-03-13","Yanaki",53,"Colorado Booms-81231-Y9634/2072"]
["2017-02-28","Bellen",103,"Gel Booms-94618-B4369/2593"]
["2017-03-08","Sunbell",29,"Gel Booms-94618-S4369/2241"]
["2017-01-12","Sunshine",60,"Gel Booms-94618-S4369/2297"]
["2017-03-05","TriBoom",91,"Colorado Booms-90009-T9634/2372"]
["2017-02-18","Carlota",61,"Gel Booms-94608-C4369/2213"]
["2017-02-23","Quad",144,"Gel Booms-94608-Q4369/2290"]
["2017-01-28","Eagle",68,"Colorado Booms-81231-E9634/2386"]
["2017-01-15","Carlota",105,"Gel Booms-94608-C4369/2213"]
["2017-01-01","Aspen",71,"Colorado Booms-81231-A9634/2650"]
["2017-03-18","Carlota",44,"Gel Booms-94608-C4369/2213"]
["2017-03-06","Quad",79,"Gel Booms-94608-Q4369/2290"]
["2017-02-28","TriBoom",73,"Colorado Booms-90009-T9634/2372"]
["2017-01-25","Aspen",62,"Colorado Booms-81231-A9634/2650"]
["2017-02-19","Quad",89,"Gel Booms-94608-Q4369/2290"]
["2017-02-28","Yanaki",86,"Colorado Booms-81231-Y9634/2072"]
["2017-03-19","Eagle",65,"Colorado Booms-81231-E9634/2386"]
["2017-01-23","Eagle",68,"Colorado Booms-81231-E9634/2386"]
["2017-01-11","Quad",71,"Gel Booms-94608-Q4369/2290"]
["2017-01-01","Aspen",99,"Colorado Booms-81231-A9634/2650"]
["2017-01-23","Bellen",100,"Gel Booms-94618-B4369/2593"]
["2017-03-05","Sunshine",95,"Gel Booms-94618-S4369/2297"]
["2017-02-26","Sunshine",93,"Gel Booms-94618-S4369/2297"]
["2017-03-28","Quad",80,"Gel Booms-94608-Q4369/2290"]
["2017-01-03","Aspen",51,"Colorado Booms-81231-A9634/2650"]
["2017-03-30","TriBoom",64,"Colorado Booms-90009-T9634/2372"]
["2017-01-25","Bellen",78,"Gel Booms-94618-B4369/2593"]
["2017-03-14","Eagle",67,"Colorado Booms-81231-E9634/2386"]
["2017-03-01","Bellen",58,"Gel Booms-94618-B4369/2593"]
["2017-01-12","Bellen",43,"Gel Booms-94618-B4369/2593"]
["2017-01-03","Yanaki",98,"Colorado Booms-81231-Y9634/2072"]
["2017-01-03","Aspen",57,"Colorado Booms-81231-A9634/2650"]
["2017-02-17","Quad",23,"Gel Booms-94608-Q4369/2290"]
["2017-02-28","Carlota",59,"Gel Booms-94608-C4369/2213"]
["2017-02-07","Sunbell",45,{"$f":"VLOOKUP(B197,$F$10:$I$18,2,0)&\"-\"&VLOOKUP(B197,$F$10:$I$18,3,0)&\"-\"&VLOOKUP(B197,$F$10:$I$18,4,0)","v":"Gel Booms-94618-S4369/2241"}]
["2017-02-06","Aspen",77,"Colorado Booms-81231-A9634/2650"]
["2017-01-25","Aspen",18,"Colorado Booms-81231-A9634/2650"]
["2017-02-01","Yanaki",69,"Colorado Booms-81231-Y9634/2072"]
["2017-01-22","Quad",88,"Gel Booms-94608-Q4369/2290"]
["2017-03-23","Yanaki",130,"Colorado Booms-81231-Y9634/2072"]
["2017-03-07","Sunshine",84,"Gel Booms-94618-S4369/2297"]
["2017-03-04","Carlota",77,"Gel Booms-94608-C4369/2213"]
["2017-01-29","Sunshine",54,"Gel Booms-94618-S4369/2297"]
["2017-01-25","Carlota",69,"Gel Booms-94608-C4369/2213"]
["2017-03-03","Sunshine",65,"Gel Booms-94618-S4369/2297"]
["2017-01-30","Quad",81,"Gel Booms-94608-Q4369/2290"]
["2017-03-01","Sunshine",57,"Gel Booms-94618-S4369/2297"]
["2017-03-05","Yanaki",37,"Colorado Booms-81231-Y9634/2072"]
["2017-03-18","Quad",24,"Gel Booms-94608-Q4369/2290"]
["2017-02-25","Bellen",63,"Gel Booms-94618-B4369/2593"]
["2017-03-03","Aspen",58,"Colorado Booms-81231-A9634/2650"]
["2017-01-08","Quad",72,"Gel Booms-94608-Q4369/2290"]
["2017-02-17","Yanaki",66,"Colorado Booms-81231-Y9634/2072"]
["2017-03-23","Eagle",46,"Colorado Booms-81231-E9634/2386"]
["2017-02-12","Eagle",64,"Colorado Booms-81231-E9634/2386"]
["2017-01-28","Aspen",36,"Colorado Booms-81231-A9634/2650"]
["2017-02-10","Aspen",124,"Colorado Booms-81231-A9634/2650"]
["2017-01-01","Aspen",81,"Colorado Booms-81231-A9634/2650"]
["2017-01-02","Carlota",47,"Gel Booms-94608-C4369/2213"]
["2017-02-17","Quad",94,"Gel Booms-94608-Q4369/2290"]
["2017-01-07","Bellen",69,"Gel Booms-94618-B4369/2593"]
["2017-03-10","TriBoom",48,"Colorado Booms-90009-T9634/2372"]
["2017-03-17","Quad",33,"Gel Booms-94608-Q4369/2290"]
["2017-01-25","Quad",89,"Gel Booms-94608-Q4369/2290"]
["2017-03-25","Sunbell",87,"Gel Booms-94618-S4369/2241"]
["2017-02-04","TriBoom",50,"Colorado Booms-90009-T9634/2372"]
["2017-01-10","Aspen",45,"Colorado Booms-81231-A9634/2650"]
["2017-03-20","Bellen",56,"Gel Booms-94618-B4369/2593"]
["2017-01-10","Bellen",20,"Gel Booms-94618-B4369/2593"]
["2017-02-07","Yanaki",77,"Colorado Booms-81231-Y9634/2072"]
["2017-02-20","Bellen",65,"Gel Booms-94618-B4369/2593"]
["2017-02-11","Carlota",61,"Gel Booms-94608-C4369/2213"]
["2017-03-21","Eagle",49,"Colorado Booms-81231-E9634/2386"]
["2017-02-07","Sunbell",77,"Gel Booms-94618-S4369/2241"]
["2017-01-25","Quad",34,"Gel Booms-94608-Q4369/2290"]
["2017-02-17","Carlota",64,"Gel Booms-94608-C4369/2213"]
["2017-03-29","Bellen",64,"Gel Booms-94618-B4369/2593"]
["2017-02-15","TriBoom",53,"Colorado Booms-90009-T9634/2372"]
["2017-01-10","Bellen",78,"Gel Booms-94618-B4369/2593"]
["2017-02-18","Aspen",131,"Colorado Booms-81231-A9634/2650"]
["2017-03-04","Sunbell",91,"Gel Booms-94618-S4369/2241"]
["2017-01-16","Carlota",105,"Gel Booms-94608-C4369/2213"]
["2017-03-24","Quad",113,"Gel Booms-94608-Q4369/2290"]
["2017-02-27","Yanaki",148,"Colorado Booms-81231-Y9634/2072"]
["2017-03-23","Sunshine",77,"Gel Booms-94618-S4369/2297"]
["2017-01-07","Sunbell",65,"Gel Booms-94618-S4369/2241"]
["2017-03-29","Bellen",92,"Gel Booms-94618-B4369/2593"]
["2017-01-22","Aspen",80,"Colorado Booms-81231-A9634/2650"]
["2017-03-19","Sunshine",90,"Gel Booms-94618-S4369/2297"]
["2017-01-09","Sunshine",49,"Gel Booms-94618-S4369/2297"]
["2017-03-10","Eagle",85,"Colorado Booms-81231-E9634/2386"]
["2017-01-12","Sunshine",37,"Gel Booms-94618-S4369/2297"]
["2017-03-12","Quad",112,"Gel Booms-94608-Q4369/2290"]
["2017-02-18","Sunshine",65,"Gel Booms-94618-S4369/2297"]
["2017-03-07","Carlota",106,"Gel Booms-94608-C4369/2213"]
["2017-01-12","TriBoom",63,"Colorado Booms-90009-T9634/2372"]
["2017-01-25","Quad",80,"Gel Booms-94608-Q4369/2290"]
["2017-02-18","TriBoom",103,"Colorado Booms-90009-T9634/2372"]
["2017-03-10","Bellen",92,{"$f":"VLOOKUP(B261,$F$10:$I$18,2,0)&\"-\"&VLOOKUP(B261,$F$10:$I$18,3,0)&\"-\"&VLOOKUP(B261,$F$10:$I$18,4,0)","v":"Gel Booms-94618-B4369/2593"}]
["2017-01-25","Carlota",35,"Gel Booms-94608-C4369/2213"]
["2017-03-24","Yanaki",60,"Colorado Booms-81231-Y9634/2072"]
["2017-01-02","Eagle",63,"Colorado Booms-81231-E9634/2386"]
["2017-02-18","Yanaki",55,"Colorado Booms-81231-Y9634/2072"]
["2017-02-20","Carlota",57,"Gel Booms-94608-C4369/2213"]
["2017-01-20","Carlota",85,"Gel Booms-94608-C4369/2213"]
["2017-02-03","Sunbell",58,"Gel Booms-94618-S4369/2241"]
["2017-02-28","Aspen",125,"Colorado Booms-81231-A9634/2650"]
["2017-02-14","Yanaki",60,"Colorado Booms-81231-Y9634/2072"]
["2017-02-01","Sunshine",83,"Gel Booms-94618-S4369/2297"]
["2017-03-13","Sunbell",94,"Gel Booms-94618-S4369/2241"]
["2017-02-01","TriBoom",97,"Colorado Booms-90009-T9634/2372"]
["2017-02-15","Bellen",65,"Gel Booms-94618-B4369/2593"]
["2017-02-16","Carlota",55,"Gel Booms-94608-C4369/2213"]
["2017-02-25","Quad",78,"Gel Booms-94608-Q4369/2290"]
["2017-02-23","Quad",97,"Gel Booms-94608-Q4369/2290"]
["2017-03-08","Quad",56,"Gel Booms-94608-Q4369/2290"]
["2017-01-27","TriBoom",70,"Colorado Booms-90009-T9634/2372"]
["2017-02-20","Quad",83,"Gel Booms-94608-Q4369/2290"]
["2017-01-09","Carlota",85,"Gel Booms-94608-C4369/2213"]
["2017-01-01","Eagle",86,"Colorado Booms-81231-E9634/2386"]
["2017-01-31","Sunbell",64,"Gel Booms-94618-S4369/2241"]
["2017-03-24","Yanaki",88,"Colorado Booms-81231-Y9634/2072"]
["2017-02-15","Aspen",62,"Colorado Booms-81231-A9634/2650"]
["2017-02-03","Sunshine",79,"Gel Booms-94618-S4369/2297"]
["2017-02-22","Sunshine",70,"Gel Booms-94618-S4369/2297"]
["2017-03-08","Sunbell",79,"Gel Booms-94618-S4369/2241"]
["2017-03-04","Aspen",78,"Colorado Booms-81231-A9634/2650"]
["2017-02-02","TriBoom",63,"Colorado Booms-90009-T9634/2372"]
["2017-03-18","Aspen",83,"Colorado Booms-81231-A9634/2650"]
["2017-02-28","Quad",39,"Gel Booms-94608-Q4369/2290"]
["2017-01-08","Eagle",110,"Colorado Booms-81231-E9634/2386"]
["2017-03-28","Aspen",86,"Colorado Booms-81231-A9634/2650"]
["2017-03-27","Aspen",107,"Colorado Booms-81231-A9634/2650"]
["2017-02-16","Bellen",56,"Gel Booms-94618-B4369/2593"]
["2017-02-18","TriBoom",100,"Colorado Booms-90009-T9634/2372"]
["2017-01-08","TriBoom",85,"Colorado Booms-90009-T9634/2372"]
["2017-01-18","Sunbell",90,"Gel Booms-94618-S4369/2241"]
["2017-03-23","Eagle",43,"Colorado Booms-81231-E9634/2386"]
["2017-02-19","Eagle",100,"Colorado Booms-81231-E9634/2386"]
["2017-01-25","Sunshine",131,"Gel Booms-94618-S4369/2297"]
["2017-01-22","Quad",90,"Gel Booms-94608-Q4369/2290"]
["2017-03-28","Sunbell",82,"Gel Booms-94618-S4369/2241"]
["2017-03-15","Aspen",36,"Colorado Booms-81231-A9634/2650"]
["2017-02-10","Bellen",51,"Gel Booms-94618-B4369/2593"]
["2017-01-27","Sunshine",62,"Gel Booms-94618-S4369/2297"]
["2017-02-05","Quad",58,"Gel Booms-94608-Q4369/2290"]
["2017-01-07","Sunshine",97,"Gel Booms-94618-S4369/2297"]
["2017-02-15","Sunshine",94,"Gel Booms-94618-S4369/2297"]
["2017-02-03","Yanaki",70,"Colorado Booms-81231-Y9634/2072"]
["2017-03-06","Quad",47,"Gel Booms-94608-Q4369/2290"]
["2017-01-20","Bellen",52,"Gel Booms-94618-B4369/2593"]
["2017-01-20","Carlota",123,"Gel Booms-94608-C4369/2213"]
["2017-02-11","Sunshine",64,"Gel Booms-94618-S4369/2297"]
["2017-03-31","Yanaki",75,"Colorado Booms-81231-Y9634/2072"]
["2017-02-22","TriBoom",60,"Colorado Booms-90009-T9634/2372"]
["2017-02-18","Eagle",61,"Colorado Booms-81231-E9634/2386"]
["2017-03-15","Aspen",76,"Colorado Booms-81231-A9634/2650"]
["2017-02-28","Bellen",96,"Gel Booms-94618-B4369/2593"]
["2017-01-20","Bellen",34,"Gel Booms-94618-B4369/2593"]
["2017-03-24","Sunbell",106,"Gel Booms-94618-S4369/2241"]
["2017-03-06","Sunbell",66,"Gel Booms-94618-S4369/2241"]
["2017-01-21","Sunbell",67,"Gel Booms-94618-S4369/2241"]
["2017-02-06","Eagle",96,{"$f":"VLOOKUP(B325,$F$10:$I$18,2,0)&\"-\"&VLOOKUP(B325,$F$10:$I$18,3,0)&\"-\"&VLOOKUP(B325,$F$10:$I$18,4,0)","v":"Colorado Booms-81231-E9634/2386"}]
["2017-03-08","Bellen",84,"Gel Booms-94618-B4369/2593"]
["2017-03-11","Sunshine",39,"Gel Booms-94618-S4369/2297"]
["2017-01-09","Eagle",88,"Colorado Booms-81231-E9634/2386"]
["2017-03-04","Sunshine",60,"Gel Booms-94618-S4369/2297"]
["2017-03-11","Carlota",63,"Gel Booms-94608-C4369/2213"]
["2017-02-22","Eagle",47,"Colorado Booms-81231-E9634/2386"]
["2017-01-24","Bellen",57,"Gel Booms-94618-B4369/2593"]
["2017-02-02","Bellen",83,"Gel Booms-94618-B4369/2593"]
["2017-03-24","Eagle",92,"Colorado Booms-81231-E9634/2386"]
["2017-01-07","Sunbell",62,"Gel Booms-94618-S4369/2241"]
["2017-02-19","Bellen",53,"Gel Booms-94618-B4369/2593"]
["2017-03-02","Carlota",62,"Gel Booms-94608-C4369/2213"]
["2017-01-03","Sunshine",89,"Gel Booms-94618-S4369/2297"]
["2017-03-26","Yanaki",61,"Colorado Booms-81231-Y9634/2072"]
["2017-03-02","Carlota",94,"Gel Booms-94608-C4369/2213"]
["2017-02-25","Carlota",61,"Gel Booms-94608-C4369/2213"]
["2017-03-20","Aspen",48,"Colorado Booms-81231-A9634/2650"]
["2017-02-12","Quad",61,"Gel Booms-94608-Q4369/2290"]
["2017-01-19","Quad",50,"Gel Booms-94608-Q4369/2290"]
["2017-03-19","Sunbell",31,"Gel Booms-94618-S4369/2241"]
["2017-01-23","Bellen",54,"Gel Booms-94618-B4369/2593"]
["2017-02-14","Eagle",89,"Colorado Booms-81231-E9634/2386"]
["2017-03-04","Bellen",72,"Gel Booms-94618-B4369/2593"]
["2017-03-11","TriBoom",73,"Colorado Booms-90009-T9634/2372"]
["2017-01-03","Sunshine",67,"Gel Booms-94618-S4369/2297"]
["2017-02-03","Eagle",102,"Colorado Booms-81231-E9634/2386"]
["2017-02-15","Sunbell",81,"Gel Booms-94618-S4369/2241"]
["2017-01-15","Yanaki",63,"Colorado Booms-81231-Y9634/2072"]
["2017-02-12","Carlota",63,"Gel Booms-94608-C4369/2213"]
["2017-01-15","Yanaki",105,"Colorado Booms-81231-Y9634/2072"]
["2017-02-19","Sunshine",125,"Gel Booms-94618-S4369/2297"]
["2017-03-30","Bellen",78,"Gel Booms-94618-B4369/2593"]
["2017-02-16","Quad",88,"Gel Booms-94608-Q4369/2290"]
["2017-02-19","Sunbell",77,"Gel Booms-94618-S4369/2241"]
["2017-01-19","Sunshine",73,"Gel Booms-94618-S4369/2297"]
["2017-01-09","Sunshine",45,"Gel Booms-94618-S4369/2297"]
["2017-02-03","Sunbell",92,"Gel Booms-94618-S4369/2241"]
["2017-03-01","Aspen",77,"Colorado Booms-81231-A9634/2650"]
["2017-02-28","Eagle",116,"Colorado Booms-81231-E9634/2386"]
["2017-01-08","Yanaki",94,"Colorado Booms-81231-Y9634/2072"]
["2017-01-28","Yanaki",123,"Colorado Booms-81231-Y9634/2072"]
["2017-01-27","Quad",88,"Gel Booms-94608-Q4369/2290"]
["2017-01-22","Carlota",45,"Gel Booms-94608-C4369/2213"]
["2017-02-19","Sunbell",85,"Gel Booms-94618-S4369/2241"]
["2017-01-11","Bellen",85,"Gel Booms-94618-B4369/2593"]
["2017-03-04","Eagle",30,"Colorado Booms-81231-E9634/2386"]
["2017-03-16","Bellen",84,"Gel Booms-94618-B4369/2593"]
["2017-02-11","Eagle",99,"Colorado Booms-81231-E9634/2386"]
["2017-01-07","Aspen",92,"Colorado Booms-81231-A9634/2650"]
["2017-01-31","Yanaki",87,"Colorado Booms-81231-Y9634/2072"]
["2017-03-30","Sunbell",100,"Gel Booms-94618-S4369/2241"]
["2017-01-16","Eagle",99,"Colorado Booms-81231-E9634/2386"]
["2017-01-09","Sunbell",37,"Gel Booms-94618-S4369/2241"]
["2017-01-22","Sunbell",80,"Gel Booms-94618-S4369/2241"]
["2017-02-05","Sunshine",74,"Gel Booms-94618-S4369/2297"]
["2017-03-29","Yanaki",114,"Colorado Booms-81231-Y9634/2072"]
["2017-03-30","Yanaki",73,"Colorado Booms-81231-Y9634/2072"]
["2017-03-12","Carlota",100,"Gel Booms-94608-C4369/2213"]
["2017-01-30","TriBoom",74,"Colorado Booms-90009-T9634/2372"]
["2017-02-16","Eagle",48,"Colorado Booms-81231-E9634/2386"]
["2017-01-31","Sunshine",100,"Gel Booms-94618-S4369/2297"]
["2017-02-07","Eagle",101,"Colorado Booms-81231-E9634/2386"]
["2017-02-27","Carlota",83,"Gel Booms-94608-C4369/2213"]
["2017-01-21","Bellen",59,{"$f":"VLOOKUP(B389,$F$10:$I$18,2,0)&\"-\"&VLOOKUP(B389,$F$10:$I$18,3,0)&\"-\"&VLOOKUP(B389,$F$10:$I$18,4,0)","v":"Gel Booms-94618-B4369/2593"}]
["2017-02-26","Eagle",81,"Colorado Booms-81231-E9634/2386"]
["2017-03-23","Eagle",91,"Colorado Booms-81231-E9634/2386"]
["2017-02-22","Carlota",99,"Gel Booms-94608-C4369/2213"]
["2017-02-12","Eagle",86,"Colorado Booms-81231-E9634/2386"]
["2017-02-19","Yanaki",67,"Colorado Booms-81231-Y9634/2072"]
["2017-03-25","Quad",18,"Gel Booms-94608-Q4369/2290"]
["2017-03-01","Eagle",76,"Colorado Booms-81231-E9634/2386"]
["2017-02-02","Eagle",54,"Colorado Booms-81231-E9634/2386"]
["2017-01-29","TriBoom",72,"Colorado Booms-90009-T9634/2372"]
["2017-02-12","Sunbell",35,"Gel Booms-94618-S4369/2241"]
["2017-01-13","Aspen",118,"Colorado Booms-81231-A9634/2650"]
["2017-02-13","Bellen",82,"Gel Booms-94618-B4369/2593"]
["2017-02-10","Sunshine",102,"Gel Booms-94618-S4369/2297"]
["2017-02-19","Eagle",118,"Colorado Booms-81231-E9634/2386"]
["2017-02-04","Eagle",58,"Colorado Booms-81231-E9634/2386"]
["2017-03-31","TriBoom",68,"Colorado Booms-90009-T9634/2372"]
["2017-02-10","Quad",41,"Gel Booms-94608-Q4369/2290"]
["2017-01-15","Yanaki",90,"Colorado Booms-81231-Y9634/2072"]
["2017-01-07","Eagle",63,"Colorado Booms-81231-E9634/2386"]
["2017-03-10","Bellen",95,"Gel Booms-94618-B4369/2593"]
["2017-01-18","Yanaki",19,"Colorado Booms-81231-Y9634/2072"]
["2017-02-17","Sunshine",39,"Gel Booms-94618-S4369/2297"]
["2017-03-13","Yanaki",43,"Colorado Booms-81231-Y9634/2072"]
["2017-01-04","TriBoom",56,"Colorado Booms-90009-T9634/2372"]
["2017-03-31","Quad",47,"Gel Booms-94608-Q4369/2290"]
["2017-03-13","Aspen",61,"Colorado Booms-81231-A9634/2650"]
["2017-01-11","Quad",66,"Gel Booms-94608-Q4369/2290"]
["2017-02-22","Aspen",87,"Colorado Booms-81231-A9634/2650"]
["2017-02-21","Sunbell",87,"Gel Booms-94618-S4369/2241"]
["2017-03-02","Eagle",78,"Colorado Booms-81231-E9634/2386"]
["2017-02-25","Eagle",67,"Colorado Booms-81231-E9634/2386"]
["2017-03-05","Sunbell",58,"Gel Booms-94618-S4369/2241"]
["2017-01-29","Carlota",82,"Gel Booms-94608-C4369/2213"]
["2017-01-15","Eagle",99,"Colorado Booms-81231-E9634/2386"]
["2017-03-28","Quad",98,"Gel Booms-94608-Q4369/2290"]
["2017-02-14","Yanaki",58,"Colorado Booms-81231-Y9634/2072"]
["2017-03-11","Aspen",80,"Colorado Booms-81231-A9634/2650"]
["2017-01-12","Aspen",36,"Colorado Booms-81231-A9634/2650"]
["2017-01-14","Sunbell",45,"Gel Booms-94618-S4369/2241"]
["2017-01-08","Quad",77,"Gel Booms-94608-Q4369/2290"]
["2017-02-02","TriBoom",106,"Colorado Booms-90009-T9634/2372"]
["2017-03-10","Sunbell",59,"Gel Booms-94618-S4369/2241"]
["2017-03-25","Sunshine",69,"Gel Booms-94618-S4369/2297"]
["2017-03-02","Yanaki",94,"Colorado Booms-81231-Y9634/2072"]
["2017-01-02","Eagle",118,"Colorado Booms-81231-E9634/2386"]
["2017-01-25","Sunbell",69,"Gel Booms-94618-S4369/2241"]
["2017-01-04","Aspen",50,"Colorado Booms-81231-A9634/2650"]
["2017-02-19","Carlota",92,"Gel Booms-94608-C4369/2213"]
["2017-02-04","Carlota",63,"Gel Booms-94608-C4369/2213"]
["2017-01-02","Carlota",64,"Gel Booms-94608-C4369/2213"]
["2017-03-22","TriBoom",115,"Colorado Booms-90009-T9634/2372"]
["2017-02-08","TriBoom",76,"Colorado Booms-90009-T9634/2372"]
["2017-01-25","TriBoom",30,"Colorado Booms-90009-T9634/2372"]
["2017-02-14","Bellen",106,"Gel Booms-94618-B4369/2593"]
["2017-02-26","Aspen",28,"Colorado Booms-81231-A9634/2650"]
["2017-02-12","Eagle",67,"Colorado Booms-81231-E9634/2386"]
["2017-02-14","Eagle",70,"Colorado Booms-81231-E9634/2386"]
["2017-01-24","TriBoom",78,"Colorado Booms-90009-T9634/2372"]
["2017-02-23","Aspen",44,"Colorado Booms-81231-A9634/2650"]
["2017-01-18","Aspen",80,"Colorado Booms-81231-A9634/2650"]
["2017-02-18","Quad",38,"Gel Booms-94608-Q4369/2290"]
["2017-03-10","Carlota",47,"Gel Booms-94608-C4369/2213"]
["2017-03-31","Sunbell",64,"Gel Booms-94618-S4369/2241"]
["2017-01-12","Eagle",43,{"$f":"VLOOKUP(B453,$F$10:$I$18,2,0)&\"-\"&VLOOKUP(B453,$F$10:$I$18,3,0)&\"-\"&VLOOKUP(B453,$F$10:$I$18,4,0)","v":"Colorado Booms-81231-E9634/2386"}]
["2017-01-30","Yanaki",101,"Colorado Booms-81231-Y9634/2072"]
["2017-01-30","Quad",97,"Gel Booms-94608-Q4369/2290"]
["2017-03-09","TriBoom",63,"Colorado Booms-90009-T9634/2372"]
["2017-02-06","Bellen",80,"Gel Booms-94618-B4369/2593"]
["2017-03-24","Eagle",44,"Colorado Booms-81231-E9634/2386"]
["2017-02-18","Sunbell",37,"Gel Booms-94618-S4369/2241"]
["2017-01-30","Sunbell",65,"Gel Booms-94618-S4369/2241"]
["2017-01-29","TriBoom",64,"Colorado Booms-90009-T9634/2372"]
["2017-02-17","Aspen",75,"Colorado Booms-81231-A9634/2650"]
["2017-02-16","Aspen",98,"Colorado Booms-81231-A9634/2650"]
["2017-02-18","Carlota",83,"Gel Booms-94608-C4369/2213"]
["2017-02-05","Bellen",76,"Gel Booms-94618-B4369/2593"]
["2017-02-22","TriBoom",80,"Colorado Booms-90009-T9634/2372"]
["2017-02-10","Yanaki",43,"Colorado Booms-81231-Y9634/2072"]
["2017-01-30","Sunbell",71,"Gel Booms-94618-S4369/2241"]
["2017-03-09","Bellen",119,"Gel Booms-94618-B4369/2593"]
["2017-02-08","Bellen",91,"Gel Booms-94618-B4369/2593"]
["2017-03-23","Sunshine",111,"Gel Booms-94618-S4369/2297"]
["2017-03-25","Aspen",80,"Colorado Booms-81231-A9634/2650"]
["2017-02-18","Carlota",23,"Gel Booms-94608-C4369/2213"]
["2017-03-20","Carlota",65,"Gel Booms-94608-C4369/2213"]
["2017-02-21","Aspen",34,"Colorado Booms-81231-A9634/2650"]
["2017-01-24","Aspen",89,"Colorado Booms-81231-A9634/2650"]
["2017-03-05","Eagle",132,"Colorado Booms-81231-E9634/2386"]
["2017-01-07","Aspen",109,"Colorado Booms-81231-A9634/2650"]
["2017-01-13","Yanaki",82,"Colorado Booms-81231-Y9634/2072"]
["2017-02-12","Eagle",64,"Colorado Booms-81231-E9634/2386"]
["2017-02-03","Bellen",72,"Gel Booms-94618-B4369/2593"]
["2017-02-05","Bellen",34,"Gel Booms-94618-B4369/2593"]
["2017-01-08","TriBoom",84,"Colorado Booms-90009-T9634/2372"]
["2017-03-18","TriBoom",103,"Colorado Booms-90009-T9634/2372"]
["2017-01-14","Carlota",110,"Gel Booms-94608-C4369/2213"]
["2017-01-16","Aspen",73,"Colorado Booms-81231-A9634/2650"]
["2017-01-22","Sunshine",85,"Gel Booms-94618-S4369/2297"]
["2017-01-09","Eagle",99,"Colorado Booms-81231-E9634/2386"]
["2017-02-25","Eagle",80,"Colorado Booms-81231-E9634/2386"]
["2017-03-04","Carlota",89,"Gel Booms-94608-C4369/2213"]
["2017-02-04","Carlota",99,"Gel Booms-94608-C4369/2213"]
["2017-02-04","Eagle",38,"Colorado Booms-81231-E9634/2386"]
["2017-03-09","Aspen",69,"Colorado Booms-81231-A9634/2650"]
["2017-03-11","Sunbell",83,"Gel Booms-94618-S4369/2241"]
["2017-01-16","Carlota",83,"Gel Booms-94608-C4369/2213"]
["2017-03-18","Bellen",29,"Gel Booms-94618-B4369/2593"]
["2017-01-22","TriBoom",73,"Colorado Booms-90009-T9634/2372"]
["2017-02-15","Aspen",72,"Colorado Booms-81231-A9634/2650"]
["2017-03-21","TriBoom",72,"Colorado Booms-90009-T9634/2372"]
["2017-03-12","Aspen",103,"Colorado Booms-81231-A9634/2650"]
["2017-02-15","Bellen",104,"Gel Booms-94618-B4369/2593"]
["2017-01-14","Aspen",91,"Colorado Booms-81231-A9634/2650"]
["2017-01-15","TriBoom",78,"Colorado Booms-90009-T9634/2372"]
["2017-03-16","Sunbell",57,"Gel Booms-94618-S4369/2241"]
["2017-02-07","Sunbell",103,"Gel Booms-94618-S4369/2241"]
["2017-03-02","TriBoom",89,"Colorado Booms-90009-T9634/2372"]
["2017-01-10","Bellen",100,"Gel Booms-94618-B4369/2593"]
["2017-01-07","Bellen",108,"Gel Booms-94618-B4369/2593"]
["2017-01-13","Yanaki",74,"Colorado Booms-81231-Y9634/2072"]
["2017-01-16","Yanaki",96,"Colorado Booms-81231-Y9634/2072"]
["2017-02-19","Sunshine",63,"Gel Booms-94618-S4369/2297"]
["2017-01-04","Sunshine",116,"Gel Booms-94618-S4369/2297"]
["2017-01-31","Eagle",55,"Colorado Booms-81231-E9634/2386"]
["2017-01-06","Bellen",85,"Gel Booms-94618-B4369/2593"]
["2017-01-11","Bellen",71,"Gel Booms-94618-B4369/2593"]
["2017-02-15","Quad",52,"Gel Booms-94608-Q4369/2290"]
["2017-01-25","Aspen",68,{"$f":"VLOOKUP(B517,$F$10:$I$18,2,0)&\"-\"&VLOOKUP(B517,$F$10:$I$18,3,0)&\"-\"&VLOOKUP(B517,$F$10:$I$18,4,0)","v":"Colorado Booms-81231-A9634/2650"}]
["2017-01-12","Quad",53,"Gel Booms-94608-Q4369/2290"]
["2017-01-19","Sunshine",118,"Gel Booms-94618-S4369/2297"]
["2017-03-13","Eagle",71,"Colorado Booms-81231-E9634/2386"]
["2017-03-24","Carlota",78,"Gel Booms-94608-C4369/2213"]
["2017-02-06","Sunshine",92,"Gel Booms-94618-S4369/2297"]
["2017-01-27","Sunshine",70,"Gel Booms-94618-S4369/2297"]
["2017-02-05","Quad",87,"Gel Booms-94608-Q4369/2290"]
["2017-02-22","Quad",130,"Gel Booms-94608-Q4369/2290"]
["2017-02-12","TriBoom",51,"Colorado Booms-90009-T9634/2372"]
["2017-03-03","Sunshine",87,"Gel Booms-94618-S4369/2297"]
["2017-03-21","Yanaki",82,"Colorado Booms-81231-Y9634/2072"]
["2017-02-17","Bellen",70,"Gel Booms-94618-B4369/2593"]
["2017-03-04","Yanaki",84,"Colorado Booms-81231-Y9634/2072"]
["2017-03-01","Aspen",99,"Colorado Booms-81231-A9634/2650"]
["2017-03-24","Yanaki",48,"Colorado Booms-81231-Y9634/2072"]
["2017-01-31","Quad",93,"Gel Booms-94608-Q4369/2290"]
["2017-01-15","Quad",66,"Gel Booms-94608-Q4369/2290"]
["2017-03-01","Yanaki",57,"Colorado Booms-81231-Y9634/2072"]
["2017-03-31","Carlota",24,"Gel Booms-94608-C4369/2213"]
["2017-02-19","Carlota",121,"Gel Booms-94608-C4369/2213"]
["2017-03-25","Bellen",91,"Gel Booms-94618-B4369/2593"]
["2017-02-25","TriBoom",87,"Colorado Booms-90009-T9634/2372"]
["2017-01-04","Yanaki",77,"Colorado Booms-81231-Y9634/2072"]
["2017-01-25","Sunshine",67,"Gel Booms-94618-S4369/2297"]
["2017-01-03","Bellen",102,"Gel Booms-94618-B4369/2593"]
["2017-01-01","Quad",72,"Gel Booms-94608-Q4369/2290"]
["2017-01-05","Sunbell",69,"Gel Booms-94618-S4369/2241"]
["2017-03-23","Sunshine",38,"Gel Booms-94618-S4369/2297"]
["2017-02-04","Aspen",69,"Colorado Booms-81231-A9634/2650"]
["2017-01-25","Bellen",64,"Gel Booms-94618-B4369/2593"]
["2017-01-28","TriBoom",35,"Colorado Booms-90009-T9634/2372"]
["2017-02-17","Sunbell",95,"Gel Booms-94618-S4369/2241"]
["2017-02-23","Carlota",83,"Gel Booms-94608-C4369/2213"]
["2017-03-12","Aspen",48,"Colorado Booms-81231-A9634/2650"]
["2017-02-07","Carlota",78,"Gel Booms-94608-C4369/2213"]
["2017-03-30","TriBoom",57,"Colorado Booms-90009-T9634/2372"]
["2017-02-21","Sunbell",84,"Gel Booms-94618-S4369/2241"]
["2017-01-23","Eagle",109,"Colorado Booms-81231-E9634/2386"]
["2017-02-15","TriBoom",46,"Colorado Booms-90009-T9634/2372"]
["2017-03-10","TriBoom",77,"Colorado Booms-90009-T9634/2372"]
["2017-03-17","Yanaki",97,"Colorado Booms-81231-Y9634/2072"]
["2017-01-24","Sunbell",89,"Gel Booms-94618-S4369/2241"]
["2017-03-22","Sunshine",56,"Gel Booms-94618-S4369/2297"]
["2017-02-16","Sunbell",77,"Gel Booms-94618-S4369/2241"]
["2017-01-25","Quad",72,"Gel Booms-94608-Q4369/2290"]
["2017-03-30","Sunshine",53,"Gel Booms-94618-S4369/2297"]
["2017-02-26","TriBoom",84,"Colorado Booms-90009-T9634/2372"]
["2017-01-04","Bellen",85,"Gel Booms-94618-B4369/2593"]
["2017-01-08","Sunbell",105,"Gel Booms-94618-S4369/2241"]
["2017-03-22","Sunbell",84,"Gel Booms-94618-S4369/2241"]
["2017-01-10","Eagle",98,"Colorado Booms-81231-E9634/2386"]
["2017-01-29","Eagle",73,"Colorado Booms-81231-E9634/2386"]
["2017-03-11","TriBoom",45,"Colorado Booms-90009-T9634/2372"]
["2017-02-02","Carlota",96,"Gel Booms-94608-C4369/2213"]
["2017-03-20","Bellen",80,"Gel Booms-94618-B4369/2593"]
["2017-02-15","Carlota",46,"Gel Booms-94608-C4369/2213"]
["2017-03-18","Yanaki",108,"Colorado Booms-81231-Y9634/2072"]
["2017-03-15","Sunshine",114,"Gel Booms-94618-S4369/2297"]
["2017-03-23","Quad",99,"Gel Booms-94608-Q4369/2290"]
["2017-01-21","Sunshine",46,"Gel Booms-94618-S4369/2297"]
["2017-02-01","Aspen",71,"Colorado Booms-81231-A9634/2650"]
["2017-03-01","Quad",88,"Gel Booms-94608-Q4369/2290"]
["2017-03-23","TriBoom",79,"Colorado Booms-90009-T9634/2372"]
["2017-03-29","Bellen",35,{"$f":"VLOOKUP(B581,$F$10:$I$18,2,0)&\"-\"&VLOOKUP(B581,$F$10:$I$18,3,0)&\"-\"&VLOOKUP(B581,$F$10:$I$18,4,0)","v":"Gel Booms-94618-B4369/2593"}]
["2017-02-07","Yanaki",61,"Colorado Booms-81231-Y9634/2072"]
["2017-02-25","Aspen",59,"Colorado Booms-81231-A9634/2650"]
["2017-02-16","Sunbell",112,"Gel Booms-94618-S4369/2241"]
["2017-02-01","Bellen",69,"Gel Booms-94618-B4369/2593"]
["2017-02-04","Quad",110,"Gel Booms-94608-Q4369/2290"]
["2017-03-22","Sunbell",90,"Gel Booms-94618-S4369/2241"]
["2017-03-29","Aspen",94,"Colorado Booms-81231-A9634/2650"]
["2017-01-24","Eagle",85,"Colorado Booms-81231-E9634/2386"]
["2017-01-21","TriBoom",62,"Colorado Booms-90009-T9634/2372"]
["2017-02-26","Yanaki",109,"Colorado Booms-81231-Y9634/2072"]
["2017-02-11","Sunshine",63,"Gel Booms-94618-S4369/2297"]
["2017-01-31","Carlota",60,"Gel Booms-94608-C4369/2213"]
["2017-01-03","Eagle",107,"Colorado Booms-81231-E9634/2386"]
["2017-02-05","Sunshine",69,"Gel Booms-94618-S4369/2297"]
["2017-02-20","Yanaki",81,"Colorado Booms-81231-Y9634/2072"]
["2017-03-04","Yanaki",89,"Colorado Booms-81231-Y9634/2072"]
["2017-02-13","TriBoom",48,"Colorado Booms-90009-T9634/2372"]
["2017-01-10","Carlota",36,"Gel Booms-94608-C4369/2213"]
["2017-02-24","Yanaki",78,"Colorado Booms-81231-Y9634/2072"]
["2017-01-11","Aspen",58,"Colorado Booms-81231-A9634/2650"]
["2017-01-19","Yanaki",105,"Colorado Booms-81231-Y9634/2072"]
["2017-02-05","Aspen",94,"Colorado Booms-81231-A9634/2650"]
["2017-01-18","Eagle",80,"Colorado Booms-81231-E9634/2386"]
["2017-02-21","Carlota",47,"Gel Booms-94608-C4369/2213"]
["2017-02-22","TriBoom",103,"Colorado Booms-90009-T9634/2372"]
["2017-02-14","Bellen",50,"Gel Booms-94618-B4369/2593"]
["2017-02-01","Aspen",101,"Colorado Booms-81231-A9634/2650"]
["2017-01-29","Sunshine",78,"Gel Booms-94618-S4369/2297"]
["2017-03-24","Sunbell",74,"Gel Booms-94618-S4369/2241"]
["2017-01-02","Bellen",80,"Gel Booms-94618-B4369/2593"]
["2017-02-06","Bellen",103,"Gel Booms-94618-B4369/2593"]
["2017-02-09","Carlota",106,"Gel Booms-94608-C4369/2213"]
["2017-02-12","Quad",62,"Gel Booms-94608-Q4369/2290"]
["2017-02-08","Aspen",90,"Colorado Booms-81231-A9634/2650"]
["2017-01-22","Bellen",37,"Gel Booms-94618-B4369/2593"]
["2017-03-16","Carlota",64,"Gel Booms-94608-C4369/2213"]
["2017-03-11","Aspen",128,"Colorado Booms-81231-A9634/2650"]
["2017-01-24","TriBoom",80,"Colorado Booms-90009-T9634/2372"]
["2017-02-28","Yanaki",106,"Colorado Booms-81231-Y9634/2072"]
["2017-02-02","Quad",71,"Gel Booms-94608-Q4369/2290"]
["2017-02-08","TriBoom",68,"Colorado Booms-90009-T9634/2372"]
["2017-03-09","Sunbell",78,"Gel Booms-94618-S4369/2241"]
["2017-03-16","TriBoom",107,"Colorado Booms-90009-T9634/2372"]
["2017-02-26","Bellen",82,"Gel Booms-94618-B4369/2593"]
["2017-01-23","Yanaki",115,"Colorado Booms-81231-Y9634/2072"]
["2017-01-07","Carlota",69,"Gel Booms-94608-C4369/2213"]
["2017-01-29","Eagle",99,"Colorado Booms-81231-E9634/2386"]
["2017-02-27","Sunbell",93,"Gel Booms-94618-S4369/2241"]
["2017-01-19","Carlota",92,"Gel Booms-94608-C4369/2213"]
["2017-02-20","TriBoom",21,"Colorado Booms-90009-T9634/2372"]
["2017-03-07","Aspen",67,"Colorado Booms-81231-A9634/2650"]
["2017-03-01","Carlota",63,"Gel Booms-94608-C4369/2213"]
["2017-03-11","Sunbell",65,"Gel Booms-94618-S4369/2241"]
["2017-02-05","Eagle",102,"Colorado Booms-81231-E9634/2386"]
["2017-02-07","Quad",90,"Gel Booms-94608-Q4369/2290"]
["2017-03-01","Sunbell",78,"Gel Booms-94618-S4369/2241"]
["2017-03-02","Carlota",74,"Gel Booms-94608-C4369/2213"]
["2017-02-07","TriBoom",82,"Colorado Booms-90009-T9634/2372"]
["2017-02-08","Aspen",75,"Colorado Booms-81231-A9634/2650"]
["2017-02-22","Eagle",113,"Colorado Booms-81231-E9634/2386"]
["2017-01-12","Sunshine",94,"Gel Booms-94618-S4369/2297"]
["2017-01-05","Carlota",80,"Gel Booms-94608-C4369/2213"]
["2017-01-23","Yanaki",72,"Colorado Booms-81231-Y9634/2072"]
["2017-01-31","Carlota",79,{"$f":"VLOOKUP(B645,$F$10:$I$18,2,0)&\"-\"&VLOOKUP(B645,$F$10:$I$18,3,0)&\"-\"&VLOOKUP(B645,$F$10:$I$18,4,0)","v":"Gel Booms-94608-C4369/2213"}]
["2017-01-22","TriBoom",94,"Colorado Booms-90009-T9634/2372"]
["2017-03-07","Carlota",37,"Gel Booms-94608-C4369/2213"]
["2017-01-15","Quad",88,"Gel Booms-94608-Q4369/2290"]
["2017-02-16","TriBoom",113,"Colorado Booms-90009-T9634/2372"]
["2017-01-01","Sunshine",97,"Gel Booms-94618-S4369/2297"]
["2017-01-21","Bellen",44,"Gel Booms-94618-B4369/2593"]
["2017-02-10","Carlota",59,"Gel Booms-94608-C4369/2213"]
["2017-02-27","Aspen",75,"Colorado Booms-81231-A9634/2650"]
["2017-01-14","Aspen",96,"Colorado Booms-81231-A9634/2650"]
["2017-01-17","Sunbell",96,"Gel Booms-94618-S4369/2241"]
["2017-01-14","Eagle",69,"Colorado Booms-81231-E9634/2386"]
["2017-03-05","TriBoom",131,"Colorado Booms-90009-T9634/2372"]
["2017-02-02","Carlota",96,"Gel Booms-94608-C4369/2213"]
["2017-03-26","Sunbell",114,"Gel Booms-94618-S4369/2241"]
["2017-02-20","Carlota",97,"Gel Booms-94608-C4369/2213"]
["2017-01-23","TriBoom",73,"Colorado Booms-90009-T9634/2372"]
["2017-02-12","TriBoom",106,"Colorado Booms-90009-T9634/2372"]
["2017-02-22","Quad",120,"Gel Booms-94608-Q4369/2290"]
["2017-03-05","Quad",74,"Gel Booms-94608-Q4369/2290"]
["2017-02-21","Aspen",67,"Colorado Booms-81231-A9634/2650"]
["2017-03-14","TriBoom",95,"Colorado Booms-90009-T9634/2372"]
["2017-01-17","Sunbell",58,"Gel Booms-94618-S4369/2241"]
["2017-01-17","Sunbell",87,"Gel Booms-94618-S4369/2241"]
["2017-01-16","Quad",41,"Gel Booms-94608-Q4369/2290"]
["2017-02-25","Bellen",62,"Gel Booms-94618-B4369/2593"]
["2017-01-17","TriBoom",88,"Colorado Booms-90009-T9634/2372"]
["2017-03-27","Sunbell",59,"Gel Booms-94618-S4369/2241"]
["2017-03-15","Yanaki",78,"Colorado Booms-81231-Y9634/2072"]
["2017-01-09","Aspen",61,"Colorado Booms-81231-A9634/2650"]
["2017-01-28","Quad",109,"Gel Booms-94608-Q4369/2290"]
["2017-01-10","Yanaki",51,"Colorado Booms-81231-Y9634/2072"]
["2017-01-06","Bellen",47,"Gel Booms-94618-B4369/2593"]
["2017-02-22","TriBoom",94,"Colorado Booms-90009-T9634/2372"]
["2017-02-23","Quad",99,"Gel Booms-94608-Q4369/2290"]
["2017-01-11","Aspen",57,"Colorado Booms-81231-A9634/2650"]
["2017-03-04","Quad",58,"Gel Booms-94608-Q4369/2290"]
["2017-01-07","Eagle",89,"Colorado Booms-81231-E9634/2386"]
["2017-01-09","Bellen",80,"Gel Booms-94618-B4369/2593"]
["2017-03-30","TriBoom",60,"Colorado Booms-90009-T9634/2372"]
["2017-03-30","Aspen",25,"Colorado Booms-81231-A9634/2650"]
["2017-03-18","Aspen",74,"Colorado Booms-81231-A9634/2650"]
["2017-02-27","Bellen",88,"Gel Booms-94618-B4369/2593"]
["2017-03-18","Aspen",125,"Colorado Booms-81231-A9634/2650"]
["2017-03-22","Eagle",88,"Colorado Booms-81231-E9634/2386"]
["2017-01-16","Aspen",80,"Colorado Booms-81231-A9634/2650"]
["2017-02-11","Quad",89,"Gel Booms-94608-Q4369/2290"]
["2017-02-25","TriBoom",100,"Colorado Booms-90009-T9634/2372"]
["2017-03-09","Sunbell",51,"Gel Booms-94618-S4369/2241"]
["2017-01-05","Quad",119,"Gel Booms-94608-Q4369/2290"]
["2017-02-24","Carlota",58,"Gel Booms-94608-C4369/2213"]
["2017-02-03","Bellen",32,"Gel Booms-94618-B4369/2593"]
["2017-01-11","Carlota",60,"Gel Booms-94608-C4369/2213"]
["2017-03-07","Sunbell",89,"Gel Booms-94618-S4369/2241"]
["2017-02-11","Quad",58,"Gel Booms-94608-Q4369/2290"]
["2017-01-14","TriBoom",79,"Colorado Booms-90009-T9634/2372"]
["2017-03-21","Aspen",51,"Colorado Booms-81231-A9634/2650"]
["2017-01-17","Sunshine",109,"Gel Booms-94618-S4369/2297"]
["2017-03-19","Sunshine",65,"Gel Booms-94618-S4369/2297"]
["2017-01-05","Sunshine",78,"Gel Booms-94618-S4369/2297"]
["2017-01-13","Carlota",59,"Gel Booms-94608-C4369/2213"]
["2017-02-21","Carlota",63,"Gel Booms-94608-C4369/2213"]
["2017-02-03","Bellen",78,"Gel Booms-94618-B4369/2593"]
["2017-01-17","Eagle",84,"Colorado Booms-81231-E9634/2386"]
["2017-02-26","Yanaki",109,{"$f":"VLOOKUP(B709,$F$10:$I$18,2,0)&\"-\"&VLOOKUP(B709,$F$10:$I$18,3,0)&\"-\"&VLOOKUP(B709,$F$10:$I$18,4,0)","v":"Colorado Booms-81231-Y9634/2072"}]
["2017-03-30","Quad",48,"Gel Booms-94608-Q4369/2290"]
["2017-03-01","TriBoom",88,"Colorado Booms-90009-T9634/2372"]
["2017-02-13","Aspen",101,"Colorado Booms-81231-A9634/2650"]
["2017-01-14","Sunbell",56,"Gel Booms-94618-S4369/2241"]
["2017-01-10","Eagle",73,"Colorado Booms-81231-E9634/2386"]
["2017-03-13","Carlota",79,"Gel Booms-94608-C4369/2213"]
["2017-02-24","Eagle",60,"Colorado Booms-81231-E9634/2386"]
["2017-03-29","Aspen",77,"Colorado Booms-81231-A9634/2650"]
["2017-01-07","Quad",69,"Gel Booms-94608-Q4369/2290"]
["2017-01-05","Sunbell",83,"Gel Booms-94618-S4369/2241"]
["2017-02-13","Aspen",87,"Colorado Booms-81231-A9634/2650"]
["2017-03-26","Sunbell",94,"Gel Booms-94618-S4369/2241"]
["2017-01-24","Bellen",106,"Gel Booms-94618-B4369/2593"]
["2017-01-28","Eagle",65,"Colorado Booms-81231-E9634/2386"]
["2017-01-08","Yanaki",107,"Colorado Booms-81231-Y9634/2072"]
["2017-03-04","Quad",91,"Gel Booms-94608-Q4369/2290"]
["2017-03-29","TriBoom",58,"Colorado Booms-90009-T9634/2372"]
["2017-01-23","Quad",87,"Gel Booms-94608-Q4369/2290"]
["2017-03-22","TriBoom",146,"Colorado Booms-90009-T9634/2372"]
["2017-03-14","Bellen",116,"Gel Booms-94618-B4369/2593"]
["2017-01-29","Aspen",66,"Colorado Booms-81231-A9634/2650"]
["2017-01-22","Bellen",60,"Gel Booms-94618-B4369/2593"]
["2017-01-28","Sunshine",92,"Gel Booms-94618-S4369/2297"]
["2017-02-17","Quad",26,"Gel Booms-94608-Q4369/2290"]
["2017-01-16","Eagle",83,"Colorado Booms-81231-E9634/2386"]
["2017-03-25","TriBoom",38,"Colorado Booms-90009-T9634/2372"]
["2017-01-03","Eagle",53,"Colorado Booms-81231-E9634/2386"]
["2017-02-20","Carlota",18,"Gel Booms-94608-C4369/2213"]
["2017-03-22","Sunshine",53,"Gel Booms-94618-S4369/2297"]
["2017-03-08","Quad",59,"Gel Booms-94608-Q4369/2290"]
["2017-02-17","Quad",89,"Gel Booms-94608-Q4369/2290"]
["2017-03-16","Sunbell",46,"Gel Booms-94618-S4369/2241"]
["2017-03-01","Aspen",58,"Colorado Booms-81231-A9634/2650"]
["2017-03-12","Quad",36,"Gel Booms-94608-Q4369/2290"]
["2017-03-17","Yanaki",44,"Colorado Booms-81231-Y9634/2072"]
["2017-03-24","Bellen",64,"Gel Booms-94618-B4369/2593"]
["2017-01-15","Carlota",90,"Gel Booms-94608-C4369/2213"]
["2017-01-19","Eagle",68,"Colorado Booms-81231-E9634/2386"]
["2017-03-04","Sunshine",86,"Gel Booms-94618-S4369/2297"]
["2017-03-27","Sunbell",80,"Gel Booms-94618-S4369/2241"]
["2017-01-31","Carlota",80,"Gel Booms-94608-C4369/2213"]
["2017-03-17","Aspen",87,"Colorado Booms-81231-A9634/2650"]
["2017-03-20","Yanaki",67,"Colorado Booms-81231-Y9634/2072"]
["2017-02-27","Quad",106,"Gel Booms-94608-Q4369/2290"]
["2017-01-20","Quad",77,"Gel Booms-94608-Q4369/2290"]
["2017-02-03","Sunbell",90,"Gel Booms-94618-S4369/2241"]
["2017-02-04","Eagle",93,"Colorado Booms-81231-E9634/2386"]
["2017-02-02","Sunshine",106,"Gel Booms-94618-S4369/2297"]
["2017-01-30","Yanaki",78,"Colorado Booms-81231-Y9634/2072"]
["2017-01-28","Yanaki",97,"Colorado Booms-81231-Y9634/2072"]
["2017-02-04","Yanaki",40,"Colorado Booms-81231-Y9634/2072"]
["2017-03-09","Eagle",59,"Colorado Booms-81231-E9634/2386"]
["2017-03-23","Yanaki",75,"Colorado Booms-81231-Y9634/2072"]
["2017-01-03","Eagle",78,"Colorado Booms-81231-E9634/2386"]
["2017-01-24","TriBoom",88,"Colorado Booms-90009-T9634/2372"]
["2017-02-08","TriBoom",74,"Colorado Booms-90009-T9634/2372"]
["2017-01-20","Sunshine",45,"Gel Booms-94618-S4369/2297"]
["2017-03-21","Sunbell",130,"Gel Booms-94618-S4369/2241"]
["2017-01-20","TriBoom",66,"Colorado Booms-90009-T9634/2372"]
["2017-01-19","Sunbell",78,"Gel Booms-94618-S4369/2241"]
["2017-03-09","Eagle",105,"Colorado Booms-81231-E9634/2386"]
["2017-01-19","Bellen",77,"Gel Booms-94618-B4369/2593"]
["2017-01-02","Sunbell",53,"Gel Booms-94618-S4369/2241"]
["2017-03-02","Sunshine",115,{"$f":"VLOOKUP(B773,$F$10:$I$18,2,0)&\"-\"&VLOOKUP(B773,$F$10:$I$18,3,0)&\"-\"&VLOOKUP(B773,$F$10:$I$18,4,0)","v":"Gel Booms-94618-S4369/2297"}]
["2017-01-28","Quad",70,"Gel Booms-94608-Q4369/2290"]
["2017-03-23","Carlota",57,"Gel Booms-94608-C4369/2213"]
["2017-03-25","Sunshine",78,"Gel Booms-94618-S4369/2297"]
["2017-02-04","Carlota",41,"Gel Booms-94608-C4369/2213"]
["2017-03-02","TriBoom",34,"Colorado Booms-90009-T9634/2372"]
["2017-01-31","Sunshine",116,"Gel Booms-94618-S4369/2297"]
["2017-01-19","Aspen",39,"Colorado Booms-81231-A9634/2650"]
["2017-01-05","Sunshine",57,"Gel Booms-94618-S4369/2297"]
["2017-02-20","Yanaki",104,"Colorado Booms-81231-Y9634/2072"]
["2017-01-02","Eagle",76,"Colorado Booms-81231-E9634/2386"]
["2017-03-28","Quad",49,"Gel Booms-94608-Q4369/2290"]
["2017-02-05","Sunshine",30,"Gel Booms-94618-S4369/2297"]
["2017-02-24","Carlota",59,"Gel Booms-94608-C4369/2213"]
["2017-03-28","Sunshine",82,"Gel Booms-94618-S4369/2297"]
["2017-03-21","Carlota",81,"Gel Booms-94608-C4369/2213"]
["2017-03-21","Carlota",70,"Gel Booms-94608-C4369/2213"]
["2017-01-21","Sunbell",63,"Gel Booms-94618-S4369/2241"]
["2017-01-22","Bellen",79,"Gel Booms-94618-B4369/2593"]
["2017-01-21","Quad",85,"Gel Booms-94608-Q4369/2290"]
["2017-01-20","Quad",72,"Gel Booms-94608-Q4369/2290"]
["2017-01-15","Carlota",73,"Gel Booms-94608-C4369/2213"]
["2017-03-08","TriBoom",52,"Colorado Booms-90009-T9634/2372"]
["2017-01-09","Sunshine",72,"Gel Booms-94618-S4369/2297"]
["2017-02-07","Sunbell",42,"Gel Booms-94618-S4369/2241"]
["2017-03-12","Aspen",71,"Colorado Booms-81231-A9634/2650"]
["2017-02-16","Quad",97,"Gel Booms-94608-Q4369/2290"]
["2017-01-15","Carlota",107,"Gel Booms-94608-C4369/2213"]
["2017-02-23","Aspen",44,"Colorado Booms-81231-A9634/2650"]
["2017-03-21","Carlota",70,"Gel Booms-94608-C4369/2213"]
["2017-02-18","Eagle",55,"Colorado Booms-81231-E9634/2386"]
["2017-02-05","Quad",34,"Gel Booms-94608-Q4369/2290"]
["2017-02-08","Quad",52,"Gel Booms-94608-Q4369/2290"]
["2017-03-02","Bellen",70,"Gel Booms-94618-B4369/2593"]
["2017-03-10","Sunbell",60,"Gel Booms-94618-S4369/2241"]
["2017-01-16","Carlota",77,"Gel Booms-94608-C4369/2213"]
["2017-01-17","Bellen",92,"Gel Booms-94618-B4369/2593"]
["2017-01-18","Sunshine",99,"Gel Booms-94618-S4369/2297"]
["2017-01-30","Bellen",124,"Gel Booms-94618-B4369/2593"]
["2017-02-07","Sunbell",94,"Gel Booms-94618-S4369/2241"]
["2017-02-17","TriBoom",59,"Colorado Booms-90009-T9634/2372"]
["2017-03-30","Sunbell",68,"Gel Booms-94618-S4369/2241"]
["2017-01-15","TriBoom",71,"Colorado Booms-90009-T9634/2372"]

{"sheet":"VLOOKUP Array Aprox","index":2,"n_rows":815,"n_cols":25,"rows_kept":815,"cut":false,"hidden":false,"merged":[]}
["Excel Magic Trick 1352: Lookup 3 Items & Return to Single Cell VLOOKUP, INDEX or LOOKUP functions?"]
[]
["Date","Product","Units","Company-ZipCode-ID",null,null,null,null,null,null,null,null,null,null,null,null,null,null,null,null,null,null,"Date","Product","Units"]
["2017-03-16","Aspen",47,{"$f":"_xlfn.TEXTJOIN(\"-\",,VLOOKUP(B4,$F$10:$I$18,{2,3,4}))","v":"Colorado Booms-81231-A9634/2650"},null,null,null,null,null,null,null,null,null,null,null,null,null,null,null,null,null,null,{"$f":"RANDBETWEEN(\"1/1/2017\",\"3/31/2017\")","v":"2017-01-15"},{"$f":"INDEX($F$10:$F$18,RANDBETWEEN(1,ROWS($F$10:$F$18)))","v":"Yanaki"},{"$f":"INT(ABS(_xlfn.NORM.INV(RAND(),75,25)))","v":64}]
["2017-03-29","Sunbell",90,{"$f":"_xlfn.TEXTJOIN(\"-\",,VLOOKUP(B5,$F$10:$I$18,{2,3,4}))","v":"Gel Booms-94618-S4369/2241"}]
["2017-03-02","Eagle",83,{"$f":"_xlfn.TEXTJOIN(\"-\",,VLOOKUP(B6,$F$10:$I$18,{2,3,4}))","v":"Colorado Booms-81231-E9634/2386"}]
["2017-03-25","Aspen",83,{"$f":"_xlfn.TEXTJOIN(\"-\",,VLOOKUP(B7,$F$10:$I$18,{2,3,4}))","v":"Colorado Booms-81231-A9634/2650"}]
["2017-01-11","Bellen",59,{"$f":"_xlfn.TEXTJOIN(\"-\",,VLOOKUP(B8,$F$10:$I$18,{2,3,4}))","v":"Gel Booms-94618-B4369/2593"}]
["2017-01-15","TriBoom",45,{"$f":"_xlfn.TEXTJOIN(\"-\",,VLOOKUP(B9,$F$10:$I$18,{2,3,4}))","v":"Colorado Booms-90009-T9634/2372"},null,"Product","Company","PlantZipCode","ID","RetailPrice","StandardCost"]
["2017-03-15","Sunbell",99,{"$f":"_xlfn.TEXTJOIN(\"-\",,VLOOKUP(B10,$F$10:$I$18,{2,3,4}))","v":"Gel Booms-94618-S4369/2241"},null,"Aspen","Colorado Booms",81231,"A9634/2650",21.95,11.6335]
["2017-02-17","Carlota",114,{"$f":"_xlfn.TEXTJOIN(\"-\",,VLOOKUP(B11,$F$10:$I$18,{2,3,4}))","v":"Gel Booms-94608-C4369/2213"},null,"Bellen","Gel Booms",94618,"B4369/2593",23.95,11.975]
["2017-02-03","Carlota",91,{"$f":"_xlfn.TEXTJOIN(\"-\",,VLOOKUP(B12,$F$10:$I$18,{2,3,4}))","v":"Gel Booms-94608-C4369/2213"},null,"Carlota","Gel Booms",94608,"C4369/2213",28.95,14.185499999999999]
["2017-03-24","Sunbell",87,{"$f":"_xlfn.TEXTJOIN(\"-\",,VLOOKUP(B13,$F$10:$I$18,{2,3,4}))","v":"Gel Booms-94618-S4369/2241"},null,"Eagle","Colorado Booms",81231,"E9634/2386",19.95,8.9774999999999991]
["2017-02-25","Bellen",71,{"$f":"_xlfn.TEXTJOIN(\"-\",,VLOOKUP(B14,$F$10:$I$18,{2,3,4}))","v":"Gel Booms-94618-B4369/2593"},null,"Quad","Gel Booms",94608,"Q4369/2290",43.95,21.535500000000003]
["2017-03-08","Aspen",67,{"$f":"_xlfn.TEXTJOIN(\"-\",,VLOOKUP(B15,$F$10:$I$18,{2,3,4}))","v":"Colorado Booms-81231-A9634/2650"},null,"Sunbell","Gel Booms",94618,"S4369/2241",27.95,15.3725]
["2017-01-05","Yanaki",63,{"$f":"_xlfn.TEXTJOIN(\"-\",,VLOOKUP(B16,$F$10:$I$18,{2,3,4}))","v":"Colorado Booms-81231-Y9634/2072"},null,"Sunshine","Gel Booms",94618,"S4369/2297",22.95,12.163499999999999]
["2017-02-06","Quad",15,{"$f":"_xlfn.TEXTJOIN(\"-\",,VLOOKUP(B17,$F$10:$I$18,{2,3,4}))","v":"Gel Booms-94608-Q4369/2290"},null,"TriBoom","Colorado Booms",90009,"T9634/2372",23.95,11.256499999999999]
["2017-01-06","Yanaki",32,{"$f":"_xlfn.TEXTJOIN(\"-\",,VLOOKUP(B18,$F$10:$I$18,{2,3,4}))","v":"Colorado Booms-81231-Y9634/2072"},null,"Yanaki","Colorado Booms",81231,"Y9634/2072",24.95,13.472999999999999]
["2017-03-14","Aspen",88,{"$f":"_xlfn.TEXTJOIN(\"-\",,VLOOKUP(B19,$F$10:$I$18,{2,3,4}))","v":"Colorado Booms-81231-A9634/2650"}]
["2017-02-05","Quad",50,{"$f":"_xlfn.TEXTJOIN(\"-\",,VLOOKUP(B20,$F$10:$I$18,{2,3,4}))","v":"Gel Booms-94608-Q4369/2290"}]
["2017-02-10","Aspen",69,{"$f":"_xlfn.TEXTJOIN(\"-\",,VLOOKUP(B21,$F$10:$I$18,{2,3,4}))","v":"Colorado Booms-81231-A9634/2650"}]
["2017-02-22","Eagle",98,{"$f":"_xlfn.TEXTJOIN(\"-\",,VLOOKUP(B22,$F$10:$I$18,{2,3,4}))","v":"Colorado Booms-81231-E9634/2386"}]
["2017-02-28","Sunbell",87,{"$f":"_xlfn.TEXTJOIN(\"-\",,VLOOKUP(B23,$F$10:$I$18,{2,3,4}))","v":"Gel Booms-94618-S4369/2241"}]
["2017-02-13","Yanaki",61,{"$f":"_xlfn.TEXTJOIN(\"-\",,VLOOKUP(B24,$F$10:$I$18,{2,3,4}))","v":"Colorado Booms-81231-Y9634/2072"}]
["2017-03-22","Yanaki",51,{"$f":"_xlfn.TEXTJOIN(\"-\",,VLOOKUP(B25,$F$10:$I$18,{2,3,4}))","v":"Colorado Booms-81231-Y9634/2072"}]
["2017-03-26","Carlota",62,{"$f":"_xlfn.TEXTJOIN(\"-\",,VLOOKUP(B26,$F$10:$I$18,{2,3,4}))","v":"Gel Booms-94608-C4369/2213"}]
["2017-01-26","Aspen",78,{"$f":"_xlfn.TEXTJOIN(\"-\",,VLOOKUP(B27,$F$10:$I$18,{2,3,4}))","v":"Colorado Booms-81231-A9634/2650"}]
["2017-01-07","Aspen",32,{"$f":"_xlfn.TEXTJOIN(\"-\",,VLOOKUP(B28,$F$10:$I$18,{2,3,4}))","v":"Colorado Booms-81231-A9634/2650"}]
["2017-02-04","Carlota",93,{"$f":"_xlfn.TEXTJOIN(\"-\",,VLOOKUP(B29,$F$10:$I$18,{2,3,4}))","v":"Gel Booms-94608-C4369/2213"}]
["2017-02-12","Aspen",115,{"$f":"_xlfn.TEXTJOIN(\"-\",,VLOOKUP(B30,$F$10:$I$18,{2,3,4}))","v":"Colorado Booms-81231-A9634/2650"}]
["2017-03-19","Bellen",56,{"$f":"_xlfn.TEXTJOIN(\"-\",,VLOOKUP(B31,$F$10:$I$18,{2,3,4}))","v":"Gel Booms-94618-B4369/2593"}]
["2017-03-11","Eagle",68,{"$f":"_xlfn.TEXTJOIN(\"-\",,VLOOKUP(B32,$F$10:$I$18,{2,3,4}))","v":"Colorado Booms-81231-E9634/2386"}]
["2017-03-09","Carlota",71,{"$f":"_xlfn.TEXTJOIN(\"-\",,VLOOKUP(B33,$F$10:$I$18,{2,3,4}))","v":"Gel Booms-94608-C4369/2213"}]
["2017-01-30","Carlota",73,{"$f":"_xlfn.TEXTJOIN(\"-\",,VLOOKUP(B34,$F$10:$I$18,{2,3,4}))","v":"Gel Booms-94608-C4369/2213"}]
["2017-02-16","Carlota",47,{"$f":"_xlfn.TEXTJOIN(\"-\",,VLOOKUP(B35,$F$10:$I$18,{2,3,4}))","v":"Gel Booms-94608-C4369/2213"}]
["2017-02-10","Carlota",82,{"$f":"_xlfn.TEXTJOIN(\"-\",,VLOOKUP(B36,$F$10:$I$18,{2,3,4}))","v":"Gel Booms-94608-C4369/2213"}]
["2017-02-21","Sunshine",61,{"$f":"_xlfn.TEXTJOIN(\"-\",,VLOOKUP(B37,$F$10:$I$18,{2,3,4}))","v":"Gel Booms-94618-S4369/2297"}]
["2017-02-21","Quad",83,{"$f":"_xlfn.TEXTJOIN(\"-\",,VLOOKUP(B38,$F$10:$I$18,{2,3,4}))","v":"Gel Booms-94608-Q4369/2290"}]
["2017-02-02","TriBoom",47,{"$f":"_xlfn.TEXTJOIN(\"-\",,VLOOKUP(B39,$F$10:$I$18,{2,3,4}))","v":"Colorado Booms-90009-T9634/2372"}]
["2017-02-10","Yanaki",83,{"$f":"_xlfn.TEXTJOIN(\"-\",,VLOOKUP(B40,$F$10:$I$18,{2,3,4}))","v":"Colorado Booms-81231-Y9634/2072"}]
["2017-01-04","Carlota",74,{"$f":"_xlfn.TEXTJOIN(\"-\",,VLOOKUP(B41,$F$10:$I$18,{2,3,4}))","v":"Gel Booms-94608-C4369/2213"}]
["2017-01-25","Quad",65,{"$f":"_xlfn.TEXTJOIN(\"-\",,VLOOKUP(B42,$F$10:$I$18,{2,3,4}))","v":"Gel Booms-94608-Q4369/2290"}]
["2017-03-01","Bellen",109,{"$f":"_xlfn.TEXTJOIN(\"-\",,VLOOKUP(B43,$F$10:$I$18,{2,3,4}))","v":"Gel Booms-94618-B4369/2593"}]
["2017-02-20","Aspen",78,{"$f":"_xlfn.TEXTJOIN(\"-\",,VLOOKUP(B44,$F$10:$I$18,{2,3,4}))","v":"Colorado Booms-81231-A9634/2650"}]
["2017-01-02","Aspen",64,{"$f":"_xlfn.TEXTJOIN(\"-\",,VLOOKUP(B45,$F$10:$I$18,{2,3,4}))","v":"Colorado Booms-81231-A9634/2650"}]
["2017-03-30","Yanaki",109,{"$f":"_xlfn.TEXTJOIN(\"-\",,VLOOKUP(B46,$F$10:$I$18,{2,3,4}))","v":"Colorado Booms-81231-Y9634/2072"}]
["2017-01-16","TriBoom",58,{"$f":"_xlfn.TEXTJOIN(\"-\",,VLOOKUP(B47,$F$10:$I$18,{2,3,4}))","v":"Colorado Booms-90009-T9634/2372"}]
["2017-01-12","Carlota",60,{"$f":"_xlfn.TEXTJOIN(\"-\",,VLOOKUP(B48,$F$10:$I$18,{2,3,4}))","v":"Gel Booms-94608-C4369/2213"}]
["2017-02-05","Sunshine",102,{"$f":"_xlfn.TEXTJOIN(\"-\",,VLOOKUP(B49,$F$10:$I$18,{2,3,4}))","v":"Gel Booms-94618-S4369/2297"}]
["2017-02-14","Bellen",65,{"$f":"_xlfn.TEXTJOIN(\"-\",,VLOOKUP(B50,$F$10:$I$18,{2,3,4}))","v":"Gel Booms-94618-B4369/2593"}]
["2017-03-13","Sunbell",31,{"$f":"_xlfn.TEXTJOIN(\"-\",,VLOOKUP(B51,$F$10:$I$18,{2,3,4}))","v":"Gel Booms-94618-S4369/2241"}]
["2017-01-27","Aspen",102,{"$f":"_xlfn.TEXTJOIN(\"-\",,VLOOKUP(B52,$F$10:$I$18,{2,3,4}))","v":"Colorado Booms-81231-A9634/2650"}]
["2017-01-26","Quad",52,{"$f":"_xlfn.TEXTJOIN(\"-\",,VLOOKUP(B53,$F$10:$I$18,{2,3,4}))","v":"Gel Booms-94608-Q4369/2290"}]
["2017-03-08","Sunbell",95,{"$f":"_xlfn.TEXTJOIN(\"-\",,VLOOKUP(B54,$F$10:$I$18,{2,3,4}))","v":"Gel Booms-94618-S4369/2241"}]
["2017-01-08","Aspen",68,{"$f":"_xlfn.TEXTJOIN(\"-\",,VLOOKUP(B55,$F$10:$I$18,{2,3,4}))","v":"Colorado Booms-81231-A9634/2650"}]
["2017-03-11","Bellen",85,{"$f":"_xlfn.TEXTJOIN(\"-\",,VLOOKUP(B56,$F$10:$I$18,{2,3,4}))","v":"Gel Booms-94618-B4369/2593"}]
["2017-03-02","Yanaki",22,{"$f":"_xlfn.TEXTJOIN(\"-\",,VLOOKUP(B57,$F$10:$I$18,{2,3,4}))","v":"Colorado Booms-81231-Y9634/2072"}]
["2017-01-13","Sunshine",79,{"$f":"_xlfn.TEXTJOIN(\"-\",,VLOOKUP(B58,$F$10:$I$18,{2,3,4}))","v":"Gel Booms-94618-S4369/2297"}]
["2017-03-27","Aspen",62,{"$f":"_xlfn.TEXTJOIN(\"-\",,VLOOKUP(B59,$F$10:$I$18,{2,3,4}))","v":"Colorado Booms-81231-A9634/2650"}]
["2017-02-09","Eagle",70,{"$f":"_xlfn.TEXTJOIN(\"-\",,VLOOKUP(B60,$F$10:$I$18,{2,3,4}))","v":"Colorado Booms-81231-E9634/2386"}]
["2017-01-17","TriBoom",60,{"$f":"_xlfn.TEXTJOIN(\"-\",,VLOOKUP(B61,$F$10:$I$18,{2,3,4}))","v":"Colorado Booms-90009-T9634/2372"}]
["2017-03-11","Aspen",65,{"$f":"_xlfn.TEXTJOIN(\"-\",,VLOOKUP(B62,$F$10:$I$18,{2,3,4}))","v":"Colorado Booms-81231-A9634/2650"}]
["2017-03-07","TriBoom",84,{"$f":"_xlfn.TEXTJOIN(\"-\",,VLOOKUP(B63,$F$10:$I$18,{2,3,4}))","v":"Colorado Booms-90009-T9634/2372"}]
["2017-03-03","Carlota",67,{"$f":"_xlfn.TEXTJOIN(\"-\",,VLOOKUP(B64,$F$10:$I$18,{2,3,4}))","v":"Gel Booms-94608-C4369/2213"}]
["2017-03-13","Eagle",104,{"$f":"_xlfn.TEXTJOIN(\"-\",,VLOOKUP(B65,$F$10:$I$18,{2,3,4}))","v":"Colorado Booms-81231-E9634/2386"}]
["2017-01-18","Bellen",93,{"$f":"_xlfn.TEXTJOIN(\"-\",,VLOOKUP(B66,$F$10:$I$18,{2,3,4}))","v":"Gel Booms-94618-B4369/2593"}]
["2017-03-28","Carlota",82,{"$f":"_xlfn.TEXTJOIN(\"-\",,VLOOKUP(B67,$F$10:$I$18,{2,3,4}))","v":"Gel Booms-94608-C4369/2213"}]
["2017-03-10","Bellen",71,{"$f":"_xlfn.TEXTJOIN(\"-\",,VLOOKUP(B68,$F$10:$I$18,{2,3,4}))","v":"Gel Booms-94618-B4369/2593"}]
["2017-01-01","Eagle",71,{"$f":"_xlfn.TEXTJOIN(\"-\",,VLOOKUP(B69,$F$10:$I$18,{2,3,4}))","v":"Colorado Booms-81231-E9634/2386"}]
["2017-03-30","TriBoom",68,{"$f":"_xlfn.TEXTJOIN(\"-\",,VLOOKUP(B70,$F$10:$I$18,{2,3,4}))","v":"Colorado Booms-90009-T9634/2372"}]
["2017-01-15","Bellen",120,{"$f":"_xlfn.TEXTJOIN(\"-\",,VLOOKUP(B71,$F$10:$I$18,{2,3,4}))","v":"Gel Booms-94618-B4369/2593"}]
["2017-01-06","Sunbell",46,{"$f":"_xlfn.TEXTJOIN(\"-\",,VLOOKUP(B72,$F$10:$I$18,{2,3,4}))","v":"Gel Booms-94618-S4369/2241"}]
["2017-01-04","Carlota",96,{"$f":"_xlfn.TEXTJOIN(\"-\",,VLOOKUP(B73,$F$10:$I$18,{2,3,4}))","v":"Gel Booms-94608-C4369/2213"}]
["2017-02-03","Aspen",86,{"$f":"_xlfn.TEXTJOIN(\"-\",,VLOOKUP(B74,$F$10:$I$18,{2,3,4}))","v":"Colorado Booms-81231-A9634/2650"}]
["2017-03-28","Sunbell",79,{"$f":"_xlfn.TEXTJOIN(\"-\",,VLOOKUP(B75,$F$10:$I$18,{2,3,4}))","v":"Gel Booms-94618-S4369/2241"}]
["2017-02-22","Bellen",100,{"$f":"_xlfn.TEXTJOIN(\"-\",,VLOOKUP(B76,$F$10:$I$18,{2,3,4}))","v":"Gel Booms-94618-B4369/2593"}]
["2017-01-23","Yanaki",77,{"$f":"_xlfn.TEXTJOIN(\"-\",,VLOOKUP(B77,$F$10:$I$18,{2,3,4}))","v":"Colorado Booms-81231-Y9634/2072"}]
["2017-01-04","Sunbell",49,{"$f":"_xlfn.TEXTJOIN(\"-\",,VLOOKUP(B78,$F$10:$I$18,{2,3,4}))","v":"Gel Booms-94618-S4369/2241"}]
["2017-03-05","Eagle",92,{"$f":"_xlfn.TEXTJOIN(\"-\",,VLOOKUP(B79,$F$10:$I$18,{2,3,4}))","v":"Colorado Booms-81231-E9634/2386"}]
["2017-01-25","Sunshine",49,{"$f":"_xlfn.TEXTJOIN(\"-\",,VLOOKUP(B80,$F$10:$I$18,{2,3,4}))","v":"Gel Booms-94618-S4369/2297"}]
["2017-01-23","Aspen",9,{"$f":"_xlfn.TEXTJOIN(\"-\",,VLOOKUP(B81,$F$10:$I$18,{2,3,4}))","v":"Colorado Booms-81231-A9634/2650"}]
["2017-03-22","Bellen",44,{"$f":"_xlfn.TEXTJOIN(\"-\",,VLOOKUP(B82,$F$10:$I$18,{2,3,4}))","v":"Gel Booms-94618-B4369/2593"}]
["2017-02-27","Carlota",72,{"$f":"_xlfn.TEXTJOIN(\"-\",,VLOOKUP(B83,$F$10:$I$18,{2,3,4}))","v":"Gel Booms-94608-C4369/2213"}]
["2017-03-02","Carlota",59,{"$f":"_xlfn.TEXTJOIN(\"-\",,VLOOKUP(B84,$F$10:$I$18,{2,3,4}))","v":"Gel Booms-94608-C4369/2213"}]
["2017-01-17","Sunbell",90,{"$f":"_xlfn.TEXTJOIN(\"-\",,VLOOKUP(B85,$F$10:$I$18,{2,3,4}))","v":"Gel Booms-94618-S4369/2241"}]
["2017-02-25","Eagle",54,{"$f":"_xlfn.TEXTJOIN(\"-\",,VLOOKUP(B86,$F$10:$I$18,{2,3,4}))","v":"Colorado Booms-81231-E9634/2386"}]
["2017-01-31","Quad",71,{"$f":"_xlfn.TEXTJOIN(\"-\",,VLOOKUP(B87,$F$10:$I$18,{2,3,4}))","v":"Gel Booms-94608-Q4369/2290"}]
["2017-01-27","Eagle",90,{"$f":"_xlfn.TEXTJOIN(\"-\",,VLOOKUP(B88,$F$10:$I$18,{2,3,4}))","v":"Colorado Booms-81231-E9634/2386"}]
["2017-03-17","Quad",58,{"$f":"_xlfn.TEXTJOIN(\"-\",,VLOOKUP(B89,$F$10:$I$18,{2,3,4}))","v":"Gel Booms-94608-Q4369/2290"}]
["2017-01-29","Bellen",73,{"$f":"_xlfn.TEXTJOIN(\"-\",,VLOOKUP(B90,$F$10:$I$18,{2,3,4}))","v":"Gel Booms-94618-B4369/2593"}]
["2017-03-02","TriBoom",69,{"$f":"_xlfn.TEXTJOIN(\"-\",,VLOOKUP(B91,$F$10:$I$18,{2,3,4}))","v":"Colorado Booms-90009-T9634/2372"}]
["2017-01-11","Eagle",59,{"$f":"_xlfn.TEXTJOIN(\"-\",,VLOOKUP(B92,$F$10:$I$18,{2,3,4}))","v":"Colorado Booms-81231-E9634/2386"}]
["2017-03-06","Yanaki",71,{"$f":"_xlfn.TEXTJOIN(\"-\",,VLOOKUP(B93,$F$10:$I$18,{2,3,4}))","v":"Colorado Booms-81231-Y9634/2072"}]
["2017-02-06","Eagle",111,{"$f":"_xlfn.TEXTJOIN(\"-\",,VLOOKUP(B94,$F$10:$I$18,{2,3,4}))","v":"Colorado Booms-81231-E9634/2386"}]
["2017-03-24","TriBoom",59,{"$f":"_xlfn.TEXTJOIN(\"-\",,VLOOKUP(B95,$F$10:$I$18,{2,3,4}))","v":"Colorado Booms-90009-T9634/2372"}]
["2017-02-20","Carlota",103,{"$f":"_xlfn.TEXTJOIN(\"-\",,VLOOKUP(B96,$F$10:$I$18,{2,3,4}))","v":"Gel Booms-94608-C4369/2213"}]
["2017-02-22","TriBoom",59,{"$f":"_xlfn.TEXTJOIN(\"-\",,VLOOKUP(B97,$F$10:$I$18,{2,3,4}))","v":"Colorado Booms-90009-T9634/2372"}]
["2017-01-28","TriBoom",96,{"$f":"_xlfn.TEXTJOIN(\"-\",,VLOOKUP(B98,$F$10:$I$18,{2,3,4}))","v":"Colorado Booms-90009-T9634/2372"}]
["2017-01-24","TriBoom",53,{"$f":"_xlfn.TEXTJOIN(\"-\",,VLOOKUP(B99,$F$10:$I$18,{2,3,4}))","v":"Colorado Booms-90009-T9634/2372"}]
["2017-01-23","Eagle",43,{"$f":"_xlfn.TEXTJOIN(\"-\",,VLOOKUP(B100,$F$10:$I$18,{2,3,4}))","v":"Colorado Booms-81231-E9634/2386"}]
["2017-02-23","Bellen",67,{"$f":"_xlfn.TEXTJOIN(\"-\",,VLOOKUP(B101,$F$10:$I$18,{2,3,4}))","v":"Gel Booms-94618-B4369/2593"}]
["2017-02-16","Aspen",115,{"$f":"_xlfn.TEXTJOIN(\"-\",,VLOOKUP(B102,$F$10:$I$18,{2,3,4}))","v":"Colorado Booms-81231-A9634/2650"}]
["2017-02-07","TriBoom",93,{"$f":"_xlfn.TEXTJOIN(\"-\",,VLOOKUP(B103,$F$10:$I$18,{2,3,4}))","v":"Colorado Booms-90009-T9634/2372"}]
["2017-03-13","Yanaki",44,{"$f":"_xlfn.TEXTJOIN(\"-\",,VLOOKUP(B104,$F$10:$I$18,{2,3,4}))","v":"Colorado Booms-81231-Y9634/2072"}]
["2017-02-09","Yanaki",82,{"$f":"_xlfn.TEXTJOIN(\"-\",,VLOOKUP(B105,$F$10:$I$18,{2,3,4}))","v":"Colorado Booms-81231-Y9634/2072"}]
["2017-01-24","Aspen",96,{"$f":"_xlfn.TEXTJOIN(\"-\",,VLOOKUP(B106,$F$10:$I$18,{2,3,4}))","v":"Colorado Booms-81231-A9634/2650"}]
["2017-03-03","Eagle",115,{"$f":"_xlfn.TEXTJOIN(\"-\",,VLOOKUP(B107,$F$10:$I$18,{2,3,4}))","v":"Colorado Booms-81231-E9634/2386"}]
["2017-03-15","Carlota",58,{"$f":"_xlfn.TEXTJOIN(\"-\",,VLOOKUP(B108,$F$10:$I$18,{2,3,4}))","v":"Gel Booms-94608-C4369/2213"}]
["2017-02-13","Eagle",100,{"$f":"_xlfn.TEXTJOIN(\"-\",,VLOOKUP(B109,$F$10:$I$18,{2,3,4}))","v":"Colorado Booms-81231-E9634/2386"}]
["2017-03-29","TriBoom",80,{"$f":"_xlfn.TEXTJOIN(\"-\",,VLOOKUP(B110,$F$10:$I$18,{2,3,4}))","v":"Colorado Booms-90009-T9634/2372"}]
["2017-02-25","Sunshine",105,{"$f":"_xlfn.TEXTJOIN(\"-\",,VLOOKUP(B111,$F$10:$I$18,{2,3,4}))","v":"Gel Booms-94618-S4369/2297"}]
["2017-03-19","Sunshine",84,{"$f":"_xlfn.TEXTJOIN(\"-\",,VLOOKUP(B112,$F$10:$I$18,{2,3,4}))","v":"Gel Booms-94618-S4369/2297"}]
["2017-01-03","Bellen",62,{"$f":"_xlfn.TEXTJOIN(\"-\",,VLOOKUP(B113,$F$10:$I$18,{2,3,4}))","v":"Gel Booms-94618-B4369/2593"}]
["2017-03-13","Quad",92,{"$f":"_xlfn.TEXTJOIN(\"-\",,VLOOKUP(B114,$F$10:$I$18,{2,3,4}))","v":"Gel Booms-94608-Q4369/2290"}]
["2017-02-16","Sunshine",49,{"$f":"_xlfn.TEXTJOIN(\"-\",,VLOOKUP(B115,$F$10:$I$18,{2,3,4}))","v":"Gel Booms-94618-S4369/2297"}]
["2017-02-11","Aspen",119,{"$f":"_xlfn.TEXTJOIN(\"-\",,VLOOKUP(B116,$F$10:$I$18,{2,3,4}))","v":"Colorado Booms-81231-A9634/2650"}]
["2017-02-20","Bellen",41,{"$f":"_xlfn.TEXTJOIN(\"-\",,VLOOKUP(B117,$F$10:$I$18,{2,3,4}))","v":"Gel Booms-94618-B4369/2593"}]
["2017-01-13","Aspen",115,{"$f":"_xlfn.TEXTJOIN(\"-\",,VLOOKUP(B118,$F$10:$I$18,{2,3,4}))","v":"Colorado Booms-81231-A9634/2650"}]
["2017-01-04","Quad",103,{"$f":"_xlfn.TEXTJOIN(\"-\",,VLOOKUP(B119,$F$10:$I$18,{2,3,4}))","v":"Gel Booms-94608-Q4369/2290"}]
["2017-01-13","Bellen",79,{"$f":"_xlfn.TEXTJOIN(\"-\",,VLOOKUP(B120,$F$10:$I$18,{2,3,4}))","v":"Gel Booms-94618-B4369/2593"}]
["2017-01-04","Bellen",113,{"$f":"_xlfn.TEXTJOIN(\"-\",,VLOOKUP(B121,$F$10:$I$18,{2,3,4}))","v":"Gel Booms-94618-B4369/2593"}]
["2017-03-25","Aspen",49,{"$f":"_xlfn.TEXTJOIN(\"-\",,VLOOKUP(B122,$F$10:$I$18,{2,3,4}))","v":"Colorado Booms-81231-A9634/2650"}]
["2017-03-29","Quad",77,{"$f":"_xlfn.TEXTJOIN(\"-\",,VLOOKUP(B123,$F$10:$I$18,{2,3,4}))","v":"Gel Booms-94608-Q4369/2290"}]
["2017-02-20","Eagle",63,{"$f":"_xlfn.TEXTJOIN(\"-\",,VLOOKUP(B124,$F$10:$I$18,{2,3,4}))","v":"Colorado Booms-81231-E9634/2386"}]
["2017-02-04","Sunbell",84,{"$f":"_xlfn.TEXTJOIN(\"-\",,VLOOKUP(B125,$F$10:$I$18,{2,3,4}))","v":"Gel Booms-94618-S4369/2241"}]
["2017-02-04","TriBoom",89,{"$f":"_xlfn.TEXTJOIN(\"-\",,VLOOKUP(B126,$F$10:$I$18,{2,3,4}))","v":"Colorado Booms-90009-T9634/2372"}]
["2017-01-19","Sunbell",93,{"$f":"_xlfn.TEXTJOIN(\"-\",,VLOOKUP(B127,$F$10:$I$18,{2,3,4}))","v":"Gel Booms-94618-S4369/2241"}]
["2017-01-21","Bellen",46,{"$f":"_xlfn.TEXTJOIN(\"-\",,VLOOKUP(B128,$F$10:$I$18,{2,3,4}))","v":"Gel Booms-94618-B4369/2593"}]
["2017-01-31","TriBoom",45,{"$f":"_xlfn.TEXTJOIN(\"-\",,VLOOKUP(B129,$F$10:$I$18,{2,3,4}))","v":"Colorado Booms-90009-T9634/2372"}]
["2017-03-23","Yanaki",110,{"$f":"_xlfn.TEXTJOIN(\"-\",,VLOOKUP(B130,$F$10:$I$18,{2,3,4}))","v":"Colorado Booms-81231-Y9634/2072"}]
["2017-01-21","Aspen",54,{"$f":"_xlfn.TEXTJOIN(\"-\",,VLOOKUP(B131,$F$10:$I$18,{2,3,4}))","v":"Colorado Booms-81231-A9634/2650"}]
["2017-01-12","TriBoom",99,{"$f":"_xlfn.TEXTJOIN(\"-\",,VLOOKUP(B132,$F$10:$I$18,{2,3,4}))","v":"Colorado Booms-90009-T9634/2372"}]
["2017-02-19","Yanaki",92,{"$f":"_xlfn.TEXTJOIN(\"-\",,VLOOKUP(B133,$F$10:$I$18,{2,3,4}))","v":"Colorado Booms-81231-Y9634/2072"}]
["2017-02-02","TriBoom",81,{"$f":"_xlfn.TEXTJOIN(\"-\",,VLOOKUP(B134,$F$10:$I$18,{2,3,4}))","v":"Colorado Booms-90009-T9634/2372"}]
["2017-03-10","Carlota",101,{"$f":"_xlfn.TEXTJOIN(\"-\",,VLOOKUP(B135,$F$10:$I$18,{2,3,4}))","v":"Gel Booms-94608-C4369/2213"}]
["2017-02-23","TriBoom",70,{"$f":"_xlfn.TEXTJOIN(\"-\",,VLOOKUP(B136,$F$10:$I$18,{2,3,4}))","v":"Colorado Booms-90009-T9634/2372"}]
["2017-02-07","Yanaki",76,{"$f":"_xlfn.TEXTJOIN(\"-\",,VLOOKUP(B137,$F$10:$I$18,{2,3,4}))","v":"Colorado Booms-81231-Y9634/2072"}]
["2017-02-20","Carlota",103,{"$f":"_xlfn.TEXTJOIN(\"-\",,VLOOKUP(B138,$F$10:$I$18,{2,3,4}))","v":"Gel Booms-94608-C4369/2213"}]
["2017-02-03","Bellen",110,{"$f":"_xlfn.TEXTJOIN(\"-\",,VLOOKUP(B139,$F$10:$I$18,{2,3,4}))","v":"Gel Booms-94618-B4369/2593"}]
["2017-03-30","Carlota",103,{"$f":"_xlfn.TEXTJOIN(\"-\",,VLOOKUP(B140,$F$10:$I$18,{2,3,4}))","v":"Gel Booms-94608-C4369/2213"}]
["2017-03-03","Eagle",48,{"$f":"_xlfn.TEXTJOIN(\"-\",,VLOOKUP(B141,$F$10:$I$18,{2,3,4}))","v":"Colorado Booms-81231-E9634/2386"}]
["2017-03-30","Eagle",96,{"$f":"_xlfn.TEXTJOIN(\"-\",,VLOOKUP(B142,$F$10:$I$18,{2,3,4}))","v":"Colorado Booms-81231-E9634/2386"}]
["2017-01-19","Bellen",102,{"$f":"_xlfn.TEXTJOIN(\"-\",,VLOOKUP(B143,$F$10:$I$18,{2,3,4}))","v":"Gel Booms-94618-B4369/2593"}]
["2017-01-29","Sunshine",81,{"$f":"_xlfn.TEXTJOIN(\"-\",,VLOOKUP(B144,$F$10:$I$18,{2,3,4}))","v":"Gel Booms-94618-S4369/2297"}]
["2017-02-08","Yanaki",90,{"$f":"_xlfn.TEXTJOIN(\"-\",,VLOOKUP(B145,$F$10:$I$18,{2,3,4}))","v":"Colorado Booms-81231-Y9634/2072"}]
["2017-01-15","Bellen",45,{"$f":"_xlfn.TEXTJOIN(\"-\",,VLOOKUP(B146,$F$10:$I$18,{2,3,4}))","v":"Gel Booms-94618-B4369/2593"}]
["2017-02-09","Eagle",54,{"$f":"_xlfn.TEXTJOIN(\"-\",,VLOOKUP(B147,$F$10:$I$18,{2,3,4}))","v":"Colorado Booms-81231-E9634/2386"}]
["2017-02-20","Bellen",52,{"$f":"_xlfn.TEXTJOIN(\"-\",,VLOOKUP(B148,$F$10:$I$18,{2,3,4}))","v":"Gel Booms-94618-B4369/2593"}]
["2017-03-18","Quad",95,{"$f":"_xlfn.TEXTJOIN(\"-\",,VLOOKUP(B149,$F$10:$I$18,{2,3,4}))","v":"Gel Booms-94608-Q4369/2290"}]
["2017-03-15","Carlota",62,{"$f":"_xlfn.TEXTJOIN(\"-\",,VLOOKUP(B150,$F$10:$I$18,{2,3,4}))","v":"Gel Booms-94608-C4369/2213"}]
["2017-03-09","Yanaki",43,{"$f":"_xlfn.TEXTJOIN(\"-\",,VLOOKUP(B151,$F$10:$I$18,{2,3,4}))","v":"Colorado Booms-81231-Y9634/2072"}]
["2017-03-30","TriBoom",46,{"$f":"_xlfn.TEXTJOIN(\"-\",,VLOOKUP(B152,$F$10:$I$18,{2,3,4}))","v":"Colorado Booms-90009-T9634/2372"}]
["2017-01-28","Eagle",44,{"$f":"_xlfn.TEXTJOIN(\"-\",,VLOOKUP(B153,$F$10:$I$18,{2,3,4}))","v":"Colorado Booms-81231-E9634/2386"}]
["2017-01-20","Eagle",84,{"$f":"_xlfn.TEXTJOIN(\"-\",,VLOOKUP(B154,$F$10:$I$18,{2,3,4}))","v":"Colorado Booms-81231-E9634/2386"}]
["2017-02-25","Sunshine",57,{"$f":"_xlfn.TEXTJOIN(\"-\",,VLOOKUP(B155,$F$10:$I$18,{2,3,4}))","v":"Gel Booms-94618-S4369/2297"}]
["2017-01-18","Carlota",82,{"$f":"_xlfn.TEXTJOIN(\"-\",,VLOOKUP(B156,$F$10:$I$18,{2,3,4}))","v":"Gel Booms-94608-C4369/2213"}]
["2017-02-22","Sunbell",74,{"$f":"_xlfn.TEXTJOIN(\"-\",,VLOOKUP(B157,$F$10:$I$18,{2,3,4}))","v":"Gel Booms-94618-S4369/2241"}]
["2017-02-15","Carlota",49,{"$f":"_xlfn.TEXTJOIN(\"-\",,VLOOKUP(B158,$F$10:$I$18,{2,3,4}))","v":"Gel Booms-94608-C4369/2213"}]
["2017-01-01","Bellen",48,{"$f":"_xlfn.TEXTJOIN(\"-\",,VLOOKUP(B159,$F$10:$I$18,{2,3,4}))","v":"Gel Booms-94618-B4369/2593"}]
["2017-02-11","Eagle",105,{"$f":"_xlfn.TEXTJOIN(\"-\",,VLOOKUP(B160,$F$10:$I$18,{2,3,4}))","v":"Colorado Booms-81231-E9634/2386"}]
["2017-03-28","Carlota",43,{"$f":"_xlfn.TEXTJOIN(\"-\",,VLOOKUP(B161,$F$10:$I$18,{2,3,4}))","v":"Gel Booms-94608-C4369/2213"}]
["2017-02-07","Yanaki",60,{"$f":"_xlfn.TEXTJOIN(\"-\",,VLOOKUP(B162,$F$10:$I$18,{2,3,4}))","v":"Colorado Booms-81231-Y9634/2072"}]
["2017-03-13","Yanaki",53,{"$f":"_xlfn.TEXTJOIN(\"-\",,VLOOKUP(B163,$F$10:$I$18,{2,3,4}))","v":"Colorado Booms-81231-Y9634/2072"}]
["2017-02-28","Bellen",103,{"$f":"_xlfn.TEXTJOIN(\"-\",,VLOOKUP(B164,$F$10:$I$18,{2,3,4}))","v":"Gel Booms-94618-B4369/2593"}]
["2017-03-08","Sunbell",29,{"$f":"_xlfn.TEXTJOIN(\"-\",,VLOOKUP(B165,$F$10:$I$18,{2,3,4}))","v":"Gel Booms-94618-S4369/2241"}]
["2017-01-12","Sunshine",60,{"$f":"_xlfn.TEXTJOIN(\"-\",,VLOOKUP(B166,$F$10:$I$18,{2,3,4}))","v":"Gel Booms-94618-S4369/2297"}]
["2017-03-05","TriBoom",91,{"$f":"_xlfn.TEXTJOIN(\"-\",,VLOOKUP(B167,$F$10:$I$18,{2,3,4}))","v":"Colorado Booms-90009-T9634/2372"}]
["2017-02-18","Carlota",61,{"$f":"_xlfn.TEXTJOIN(\"-\",,VLOOKUP(B168,$F$10:$I$18,{2,3,4}))","v":"Gel Booms-94608-C4369/2213"}]
["2017-02-23","Quad",144,{"$f":"_xlfn.TEXTJOIN(\"-\",,VLOOKUP(B169,$F$10:$I$18,{2,3,4}))","v":"Gel Booms-94608-Q4369/2290"}]
["2017-01-28","Eagle",68,{"$f":"_xlfn.TEXTJOIN(\"-\",,VLOOKUP(B170,$F$10:$I$18,{2,3,4}))","v":"Colorado Booms-81231-E9634/2386"}]
["2017-01-15","Carlota",105,{"$f":"_xlfn.TEXTJOIN(\"-\",,VLOOKUP(B171,$F$10:$I$18,{2,3,4}))","v":"Gel Booms-94608-C4369/2213"}]
["2017-01-01","Aspen",71,{"$f":"_xlfn.TEXTJOIN(\"-\",,VLOOKUP(B172,$F$10:$I$18,{2,3,4}))","v":"Colorado Booms-81231-A9634/2650"}]
["2017-03-18","Carlota",44,{"$f":"_xlfn.TEXTJOIN(\"-\",,VLOOKUP(B173,$F$10:$I$18,{2,3,4}))","v":"Gel Booms-94608-C4369/2213"}]
["2017-03-06","Quad",79,{"$f":"_xlfn.TEXTJOIN(\"-\",,VLOOKUP(B174,$F$10:$I$18,{2,3,4}))","v":"Gel Booms-94608-Q4369/2290"}]
["2017-02-28","TriBoom",73,{"$f":"_xlfn.TEXTJOIN(\"-\",,VLOOKUP(B175,$F$10:$I$18,{2,3,4}))","v":"Colorado Booms-90009-T9634/2372"}]
["2017-01-25","Aspen",62,{"$f":"_xlfn.TEXTJOIN(\"-\",,VLOOKUP(B176,$F$10:$I$18,{2,3,4}))","v":"Colorado Booms-81231-A9634/2650"}]
["2017-02-19","Quad",89,{"$f":"_xlfn.TEXTJOIN(\"-\",,VLOOKUP(B177,$F$10:$I$18,{2,3,4}))","v":"Gel Booms-94608-Q4369/2290"}]
["2017-02-28","Yanaki",86,{"$f":"_xlfn.TEXTJOIN(\"-\",,VLOOKUP(B178,$F$10:$I$18,{2,3,4}))","v":"Colorado Booms-81231-Y9634/2072"}]
["2017-03-19","Eagle",65,{"$f":"_xlfn.TEXTJOIN(\"-\",,VLOOKUP(B179,$F$10:$I$18,{2,3,4}))","v":"Colorado Booms-81231-E9634/2386"}]
["2017-01-23","Eagle",68,{"$f":"_xlfn.TEXTJOIN(\"-\",,VLOOKUP(B180,$F$10:$I$18,{2,3,4}))","v":"Colorado Booms-81231-E9634/2386"}]
["2017-01-11","Quad",71,{"$f":"_xlfn.TEXTJOIN(\"-\",,VLOOKUP(B181,$F$10:$I$18,{2,3,4}))","v":"Gel Booms-94608-Q4369/2290"}]
["2017-01-01","Aspen",99,{"$f":"_xlfn.TEXTJOIN(\"-\",,VLOOKUP(B182,$F$10:$I$18,{2,3,4}))","v":"Colorado Booms-81231-A9634/2650"}]
["2017-01-23","Bellen",100,{"$f":"_xlfn.TEXTJOIN(\"-\",,VLOOKUP(B183,$F$10:$I$18,{2,3,4}))","v":"Gel Booms-94618-B4369/2593"}]
["2017-03-05","Sunshine",95,{"$f":"_xlfn.TEXTJOIN(\"-\",,VLOOKUP(B184,$F$10:$I$18,{2,3,4}))","v":"Gel Booms-94618-S4369/2297"}]
["2017-02-26","Sunshine",93,{"$f":"_xlfn.TEXTJOIN(\"-\",,VLOOKUP(B185,$F$10:$I$18,{2,3,4}))","v":"Gel Booms-94618-S4369/2297"}]
["2017-03-28","Quad",80,{"$f":"_xlfn.TEXTJOIN(\"-\",,VLOOKUP(B186,$F$10:$I$18,{2,3,4}))","v":"Gel Booms-94608-Q4369/2290"}]
["2017-01-03","Aspen",51,{"$f":"_xlfn.TEXTJOIN(\"-\",,VLOOKUP(B187,$F$10:$I$18,{2,3,4}))","v":"Colorado Booms-81231-A9634/2650"}]
["2017-03-30","TriBoom",64,{"$f":"_xlfn.TEXTJOIN(\"-\",,VLOOKUP(B188,$F$10:$I$18,{2,3,4}))","v":"Colorado Booms-90009-T9634/2372"}]
["2017-01-25","Bellen",78,{"$f":"_xlfn.TEXTJOIN(\"-\",,VLOOKUP(B189,$F$10:$I$18,{2,3,4}))","v":"Gel Booms-94618-B4369/2593"}]
["2017-03-14","Eagle",67,{"$f":"_xlfn.TEXTJOIN(\"-\",,VLOOKUP(B190,$F$10:$I$18,{2,3,4}))","v":"Colorado Booms-81231-E9634/2386"}]
["2017-03-01","Bellen",58,{"$f":"_xlfn.TEXTJOIN(\"-\",,VLOOKUP(B191,$F$10:$I$18,{2,3,4}))","v":"Gel Booms-94618-B4369/2593"}]
["2017-01-12","Bellen",43,{"$f":"_xlfn.TEXTJOIN(\"-\",,VLOOKUP(B192,$F$10:$I$18,{2,3,4}))","v":"Gel Booms-94618-B4369/2593"}]
["2017-01-03","Yanaki",98,{"$f":"_xlfn.TEXTJOIN(\"-\",,VLOOKUP(B193,$F$10:$I$18,{2,3,4}))","v":"Colorado Booms-81231-Y9634/2072"}]
["2017-01-03","Aspen",57,{"$f":"_xlfn.TEXTJOIN(\"-\",,VLOOKUP(B194,$F$10:$I$18,{2,3,4}))","v":"Colorado Booms-81231-A9634/2650"}]
["2017-02-17","Quad",23,{"$f":"_xlfn.TEXTJOIN(\"-\",,VLOOKUP(B195,$F$10:$I$18,{2,3,4}))","v":"Gel Booms-94608-Q4369/2290"}]
["2017-02-28","Carlota",59,{"$f":"_xlfn.TEXTJOIN(\"-\",,VLOOKUP(B196,$F$10:$I$18,{2,3,4}))","v":"Gel Booms-94608-C4369/2213"}]
["2017-02-07","Sunbell",45,{"$f":"_xlfn.TEXTJOIN(\"-\",,VLOOKUP(B197,$F$10:$I$18,{2,3,4}))","v":"Gel Booms-94618-S4369/2241"}]
["2017-02-06","Aspen",77,{"$f":"_xlfn.TEXTJOIN(\"-\",,VLOOKUP(B198,$F$10:$I$18,{2,3,4}))","v":"Colorado Booms-81231-A9634/2650"}]
["2017-01-25","Aspen",18,{"$f":"_xlfn.TEXTJOIN(\"-\",,VLOOKUP(B199,$F$10:$I$18,{2,3,4}))","v":"Colorado Booms-81231-A9634/2650"}]
["2017-02-01","Yanaki",69,{"$f":"_xlfn.TEXTJOIN(\"-\",,VLOOKUP(B200,$F$10:$I$18,{2,3,4}))","v":"Colorado Booms-81231-Y9634/2072"}]
["2017-01-22","Quad",88,{"$f":"_xlfn.TEXTJOIN(\"-\",,VLOOKUP(B201,$F$10:$I$18,{2,3,4}))","v":"Gel Booms-94608-Q4369/2290"}]
["2017-03-23","Yanaki",130,{"$f":"_xlfn.TEXTJOIN(\"-\",,VLOOKUP(B202,$F$10:$I$18,{2,3,4}))","v":"Colorado Booms-81231-Y9634/2072"}]
["2017-03-07","Sunshine",84,{"$f":"_xlfn.TEXTJOIN(\"-\",,VLOOKUP(B203,$F$10:$I$18,{2,3,4}))","v":"Gel Booms-94618-S4369/2297"}]
["2017-03-04","Carlota",77,{"$f":"_xlfn.TEXTJOIN(\"-\",,VLOOKUP(B204,$F$10:$I$18,{2,3,4}))","v":"Gel Booms-94608-C4369/2213"}]
["2017-01-29","Sunshine",54,{"$f":"_xlfn.TEXTJOIN(\"-\",,VLOOKUP(B205,$F$10:$I$18,{2,3,4}))","v":"Gel Booms-94618-S4369/2297"}]
["2017-01-25","Carlota",69,{"$f":"_xlfn.TEXTJOIN(\"-\",,VLOOKUP(B206,$F$10:$I$18,{2,3,4}))","v":"Gel Booms-94608-C4369/2213"}]
["2017-03-03","Sunshine",65,{"$f":"_xlfn.TEXTJOIN(\"-\",,VLOOKUP(B207,$F$10:$I$18,{2,3,4}))","v":"Gel Booms-94618-S4369/2297"}]
["2017-01-30","Quad",81,{"$f":"_xlfn.TEXTJOIN(\"-\",,VLOOKUP(B208,$F$10:$I$18,{2,3,4}))","v":"Gel Booms-94608-Q4369/2290"}]
["2017-03-01","Sunshine",57,{"$f":"_xlfn.TEXTJOIN(\"-\",,VLOOKUP(B209,$F$10:$I$18,{2,3,4}))","v":"Gel Booms-94618-S4369/2297"}]
["2017-03-05","Yanaki",37,{"$f":"_xlfn.TEXTJOIN(\"-\",,VLOOKUP(B210,$F$10:$I$18,{2,3,4}))","v":"Colorado Booms-81231-Y9634/2072"}]
["2017-03-18","Quad",24,{"$f":"_xlfn.TEXTJOIN(\"-\",,VLOOKUP(B211,$F$10:$I$18,{2,3,4}))","v":"Gel Booms-94608-Q4369/2290"}]
["2017-02-25","Bellen",63,{"$f":"_xlfn.TEXTJOIN(\"-\",,VLOOKUP(B212,$F$10:$I$18,{2,3,4}))","v":"Gel Booms-94618-B4369/2593"}]
["2017-03-03","Aspen",58,{"$f":"_xlfn.TEXTJOIN(\"-\",,VLOOKUP(B213,$F$10:$I$18,{2,3,4}))","v":"Colorado Booms-81231-A9634/2650"}]
["2017-01-08","Quad",72,{"$f":"_xlfn.TEXTJOIN(\"-\",,VLOOKUP(B214,$F$10:$I$18,{2,3,4}))","v":"Gel Booms-94608-Q4369/2290"}]
["2017-02-17","Yanaki",66,{"$f":"_xlfn.TEXTJOIN(\"-\",,VLOOKUP(B215,$F$10:$I$18,{2,3,4}))","v":"Colorado Booms-81231-Y9634/2072"}]
["2017-03-23","Eagle",46,{"$f":"_xlfn.TEXTJOIN(\"-\",,VLOOKUP(B216,$F$10:$I$18,{2,3,4}))","v":"Colorado Booms-81231-E9634/2386"}]
["2017-02-12","Eagle",64,{"$f":"_xlfn.TEXTJOIN(\"-\",,VLOOKUP(B217,$F$10:$I$18,{2,3,4}))","v":"Colorado Booms-81231-E9634/2386"}]
["2017-01-28","Aspen",36,{"$f":"_xlfn.TEXTJOIN(\"-\",,VLOOKUP(B218,$F$10:$I$18,{2,3,4}))","v":"Colorado Booms-81231-A9634/2650"}]
["2017-02-10","Aspen",124,{"$f":"_xlfn.TEXTJOIN(\"-\",,VLOOKUP(B219,$F$10:$I$18,{2,3,4}))","v":"Colorado Booms-81231-A9634/2650"}]
["2017-01-01","Aspen",81,{"$f":"_xlfn.TEXTJOIN(\"-\",,VLOOKUP(B220,$F$10:$I$18,{2,3,4}))","v":"Colorado Booms-81231-A9634/2650"}]
["2017-01-02","Carlota",47,{"$f":"_xlfn.TEXTJOIN(\"-\",,VLOOKUP(B221,$F$10:$I$18,{2,3,4}))","v":"Gel Booms-94608-C4369/2213"}]
["2017-02-17","Quad",94,{"$f":"_xlfn.TEXTJOIN(\"-\",,VLOOKUP(B222,$F$10:$I$18,{2,3,4}))","v":"Gel Booms-94608-Q4369/2290"}]
["2017-01-07","Bellen",69,{"$f":"_xlfn.TEXTJOIN(\"-\",,VLOOKUP(B223,$F$10:$I$18,{2,3,4}))","v":"Gel Booms-94618-B4369/2593"}]
["2017-03-10","TriBoom",48,{"$f":"_xlfn.TEXTJOIN(\"-\",,VLOOKUP(B224,$F$10:$I$18,{2,3,4}))","v":"Colorado Booms-90009-T9634/2372"}]
["2017-03-17","Quad",33,{"$f":"_xlfn.TEXTJOIN(\"-\",,VLOOKUP(B225,$F$10:$I$18,{2,3,4}))","v":"Gel Booms-94608-Q4369/2290"}]
["2017-01-25","Quad",89,{"$f":"_xlfn.TEXTJOIN(\"-\",,VLOOKUP(B226,$F$10:$I$18,{2,3,4}))","v":"Gel Booms-94608-Q4369/2290"}]
["2017-03-25","Sunbell",87,{"$f":"_xlfn.TEXTJOIN(\"-\",,VLOOKUP(B227,$F$10:$I$18,{2,3,4}))","v":"Gel Booms-94618-S4369/2241"}]
["2017-02-04","TriBoom",50,{"$f":"_xlfn.TEXTJOIN(\"-\",,VLOOKUP(B228,$F$10:$I$18,{2,3,4}))","v":"Colorado Booms-90009-T9634/2372"}]
["2017-01-10","Aspen",45,{"$f":"_xlfn.TEXTJOIN(\"-\",,VLOOKUP(B229,$F$10:$I$18,{2,3,4}))","v":"Colorado Booms-81231-A9634/2650"}]
["2017-03-20","Bellen",56,{"$f":"_xlfn.TEXTJOIN(\"-\",,VLOOKUP(B230,$F$10:$I$18,{2,3,4}))","v":"Gel Booms-94618-B4369/2593"}]
["2017-01-10","Bellen",20,{"$f":"_xlfn.TEXTJOIN(\"-\",,VLOOKUP(B231,$F$10:$I$18,{2,3,4}))","v":"Gel Booms-94618-B4369/2593"}]
["2017-02-07","Yanaki",77,{"$f":"_xlfn.TEXTJOIN(\"-\",,VLOOKUP(B232,$F$10:$I$18,{2,3,4}))","v":"Colorado Booms-81231-Y9634/2072"}]
["2017-02-20","Bellen",65,{"$f":"_xlfn.TEXTJOIN(\"-\",,VLOOKUP(B233,$F$10:$I$18,{2,3,4}))","v":"Gel Booms-94618-B4369/2593"}]
["2017-02-11","Carlota",61,{"$f":"_xlfn.TEXTJOIN(\"-\",,VLOOKUP(B234,$F$10:$I$18,{2,3,4}))","v":"Gel Booms-94608-C4369/2213"}]
["2017-03-21","Eagle",49,{"$f":"_xlfn.TEXTJOIN(\"-\",,VLOOKUP(B235,$F$10:$I$18,{2,3,4}))","v":"Colorado Booms-81231-E9634/2386"}]
["2017-02-07","Sunbell",77,{"$f":"_xlfn.TEXTJOIN(\"-\",,VLOOKUP(B236,$F$10:$I$18,{2,3,4}))","v":"Gel Booms-94618-S4369/2241"}]
["2017-01-25","Quad",34,{"$f":"_xlfn.TEXTJOIN(\"-\",,VLOOKUP(B237,$F$10:$I$18,{2,3,4}))","v":"Gel Booms-94608-Q4369/2290"}]
["2017-02-17","Carlota",64,{"$f":"_xlfn.TEXTJOIN(\"-\",,VLOOKUP(B238,$F$10:$I$18,{2,3,4}))","v":"Gel Booms-94608-C4369/2213"}]
["2017-03-29","Bellen",64,{"$f":"_xlfn.TEXTJOIN(\"-\",,VLOOKUP(B239,$F$10:$I$18,{2,3,4}))","v":"Gel Booms-94618-B4369/2593"}]
["2017-02-15","TriBoom",53,{"$f":"_xlfn.TEXTJOIN(\"-\",,VLOOKUP(B240,$F$10:$I$18,{2,3,4}))","v":"Colorado Booms-90009-T9634/2372"}]
["2017-01-10","Bellen",78,{"$f":"_xlfn.TEXTJOIN(\"-\",,VLOOKUP(B241,$F$10:$I$18,{2,3,4}))","v":"Gel Booms-94618-B4369/2593"}]
["2017-02-18","Aspen",131,{"$f":"_xlfn.TEXTJOIN(\"-\",,VLOOKUP(B242,$F$10:$I$18,{2,3,4}))","v":"Colorado Booms-81231-A9634/2650"}]
["2017-03-04","Sunbell",91,{"$f":"_xlfn.TEXTJOIN(\"-\",,VLOOKUP(B243,$F$10:$I$18,{2,3,4}))","v":"Gel Booms-94618-S4369/2241"}]
["2017-01-16","Carlota",105,{"$f":"_xlfn.TEXTJOIN(\"-\",,VLOOKUP(B244,$F$10:$I$18,{2,3,4}))","v":"Gel Booms-94608-C4369/2213"}]
["2017-03-24","Quad",113,{"$f":"_xlfn.TEXTJOIN(\"-\",,VLOOKUP(B245,$F$10:$I$18,{2,3,4}))","v":"Gel Booms-94608-Q4369/2290"}]
["2017-02-27","Yanaki",148,{"$f":"_xlfn.TEXTJOIN(\"-\",,VLOOKUP(B246,$F$10:$I$18,{2,3,4}))","v":"Colorado Booms-81231-Y9634/2072"}]
["2017-03-23","Sunshine",77,{"$f":"_xlfn.TEXTJOIN(\"-\",,VLOOKUP(B247,$F$10:$I$18,{2,3,4}))","v":"Gel Booms-94618-S4369/2297"}]
["2017-01-07","Sunbell",65,{"$f":"_xlfn.TEXTJOIN(\"-\",,VLOOKUP(B248,$F$10:$I$18,{2,3,4}))","v":"Gel Booms-94618-S4369/2241"}]
["2017-03-29","Bellen",92,{"$f":"_xlfn.TEXTJOIN(\"-\",,VLOOKUP(B249,$F$10:$I$18,{2,3,4}))","v":"Gel Booms-94618-B4369/2593"}]
["2017-01-22","Aspen",80,{"$f":"_xlfn.TEXTJOIN(\"-\",,VLOOKUP(B250,$F$10:$I$18,{2,3,4}))","v":"Colorado Booms-81231-A9634/2650"}]
["2017-03-19","Sunshine",90,{"$f":"_xlfn.TEXTJOIN(\"-\",,VLOOKUP(B251,$F$10:$I$18,{2,3,4}))","v":"Gel Booms-94618-S4369/2297"}]
["2017-01-09","Sunshine",49,{"$f":"_xlfn.TEXTJOIN(\"-\",,VLOOKUP(B252,$F$10:$I$18,{2,3,4}))","v":"Gel Booms-94618-S4369/2297"}]
["2017-03-10","Eagle",85,{"$f":"_xlfn.TEXTJOIN(\"-\",,VLOOKUP(B253,$F$10:$I$18,{2,3,4}))","v":"Colorado Booms-81231-E9634/2386"}]
["2017-01-12","Sunshine",37,{"$f":"_xlfn.TEXTJOIN(\"-\",,VLOOKUP(B254,$F$10:$I$18,{2,3,4}))","v":"Gel Booms-94618-S4369/2297"}]
["2017-03-12","Quad",112,{"$f":"_xlfn.TEXTJOIN(\"-\",,VLOOKUP(B255,$F$10:$I$18,{2,3,4}))","v":"Gel Booms-94608-Q4369/2290"}]
["2017-02-18","Sunshine",65,{"$f":"_xlfn.TEXTJOIN(\"-\",,VLOOKUP(B256,$F$10:$I$18,{2,3,4}))","v":"Gel Booms-94618-S4369/2297"}]
["2017-03-07","Carlota",106,{"$f":"_xlfn.TEXTJOIN(\"-\",,VLOOKUP(B257,$F$10:$I$18,{2,3,4}))","v":"Gel Booms-94608-C4369/2213"}]
["2017-01-12","TriBoom",63,{"$f":"_xlfn.TEXTJOIN(\"-\",,VLOOKUP(B258,$F$10:$I$18,{2,3,4}))","v":"Colorado Booms-90009-T9634/2372"}]
["2017-01-25","Quad",80,{"$f":"_xlfn.TEXTJOIN(\"-\",,VLOOKUP(B259,$F$10:$I$18,{2,3,4}))","v":"Gel Booms-94608-Q4369/2290"}]
["2017-02-18","TriBoom",103,{"$f":"_xlfn.TEXTJOIN(\"-\",,VLOOKUP(B260,$F$10:$I$18,{2,3,4}))","v":"Colorado Booms-90009-T9634/2372"}]
["2017-03-10","Bellen",92,{"$f":"_xlfn.TEXTJOIN(\"-\",,VLOOKUP(B261,$F$10:$I$18,{2,3,4}))","v":"Gel Booms-94618-B4369/2593"}]
["2017-01-25","Carlota",35,{"$f":"_xlfn.TEXTJOIN(\"-\",,VLOOKUP(B262,$F$10:$I$18,{2,3,4}))","v":"Gel Booms-94608-C4369/2213"}]
["2017-03-24","Yanaki",60,{"$f":"_xlfn.TEXTJOIN(\"-\",,VLOOKUP(B263,$F$10:$I$18,{2,3,4}))","v":"Colorado Booms-81231-Y9634/2072"}]
["2017-01-02","Eagle",63,{"$f":"_xlfn.TEXTJOIN(\"-\",,VLOOKUP(B264,$F$10:$I$18,{2,3,4}))","v":"Colorado Booms-81231-E9634/2386"}]
["2017-02-18","Yanaki",55,{"$f":"_xlfn.TEXTJOIN(\"-\",,VLOOKUP(B265,$F$10:$I$18,{2,3,4}))","v":"Colorado Booms-81231-Y9634/2072"}]
["2017-02-20","Carlota",57,{"$f":"_xlfn.TEXTJOIN(\"-\",,VLOOKUP(B266,$F$10:$I$18,{2,3,4}))","v":"Gel Booms-94608-C4369/2213"}]
["2017-01-20","Carlota",85,{"$f":"_xlfn.TEXTJOIN(\"-\",,VLOOKUP(B267,$F$10:$I$18,{2,3,4}))","v":"Gel Booms-94608-C4369/2213"}]
["2017-02-03","Sunbell",58,{"$f":"_xlfn.TEXTJOIN(\"-\",,VLOOKUP(B268,$F$10:$I$18,{2,3,4}))","v":"Gel Booms-94618-S4369/2241"}]
["2017-02-28","Aspen",125,{"$f":"_xlfn.TEXTJOIN(\"-\",,VLOOKUP(B269,$F$10:$I$18,{2,3,4}))","v":"Colorado Booms-81231-A9634/2650"}]
["2017-02-14","Yanaki",60,{"$f":"_xlfn.TEXTJOIN(\"-\",,VLOOKUP(B270,$F$10:$I$18,{2,3,4}))","v":"Colorado Booms-81231-Y9634/2072"}]
["2017-02-01","Sunshine",83,{"$f":"_xlfn.TEXTJOIN(\"-\",,VLOOKUP(B271,$F$10:$I$18,{2,3,4}))","v":"Gel Booms-94618-S4369/2297"}]
["2017-03-13","Sunbell",94,{"$f":"_xlfn.TEXTJOIN(\"-\",,VLOOKUP(B272,$F$10:$I$18,{2,3,4}))","v":"Gel Booms-94618-S4369/2241"}]
["2017-02-01","TriBoom",97,{"$f":"_xlfn.TEXTJOIN(\"-\",,VLOOKUP(B273,$F$10:$I$18,{2,3,4}))","v":"Colorado Booms-90009-T9634/2372"}]
["2017-02-15","Bellen",65,{"$f":"_xlfn.TEXTJOIN(\"-\",,VLOOKUP(B274,$F$10:$I$18,{2,3,4}))","v":"Gel Booms-94618-B4369/2593"}]
["2017-02-16","Carlota",55,{"$f":"_xlfn.TEXTJOIN(\"-\",,VLOOKUP(B275,$F$10:$I$18,{2,3,4}))","v":"Gel Booms-94608-C4369/2213"}]
["2017-02-25","Quad",78,{"$f":"_xlfn.TEXTJOIN(\"-\",,VLOOKUP(B276,$F$10:$I$18,{2,3,4}))","v":"Gel Booms-94608-Q4369/2290"}]
["2017-02-23","Quad",97,{"$f":"_xlfn.TEXTJOIN(\"-\",,VLOOKUP(B277,$F$10:$I$18,{2,3,4}))","v":"Gel Booms-94608-Q4369/2290"}]
["2017-03-08","Quad",56,{"$f":"_xlfn.TEXTJOIN(\"-\",,VLOOKUP(B278,$F$10:$I$18,{2,3,4}))","v":"Gel Booms-94608-Q4369/2290"}]
["2017-01-27","TriBoom",70,{"$f":"_xlfn.TEXTJOIN(\"-\",,VLOOKUP(B279,$F$10:$I$18,{2,3,4}))","v":"Colorado Booms-90009-T9634/2372"}]
["2017-02-20","Quad",83,{"$f":"_xlfn.TEXTJOIN(\"-\",,VLOOKUP(B280,$F$10:$I$18,{2,3,4}))","v":"Gel Booms-94608-Q4369/2290"}]
["2017-01-09","Carlota",85,{"$f":"_xlfn.TEXTJOIN(\"-\",,VLOOKUP(B281,$F$10:$I$18,{2,3,4}))","v":"Gel Booms-94608-C4369/2213"}]
["2017-01-01","Eagle",86,{"$f":"_xlfn.TEXTJOIN(\"-\",,VLOOKUP(B282,$F$10:$I$18,{2,3,4}))","v":"Colorado Booms-81231-E9634/2386"}]
["2017-01-31","Sunbell",64,{"$f":"_xlfn.TEXTJOIN(\"-\",,VLOOKUP(B283,$F$10:$I$18,{2,3,4}))","v":"Gel Booms-94618-S4369/2241"}]
["2017-03-24","Yanaki",88,{"$f":"_xlfn.TEXTJOIN(\"-\",,VLOOKUP(B284,$F$10:$I$18,{2,3,4}))","v":"Colorado Booms-81231-Y9634/2072"}]
["2017-02-15","Aspen",62,{"$f":"_xlfn.TEXTJOIN(\"-\",,VLOOKUP(B285,$F$10:$I$18,{2,3,4}))","v":"Colorado Booms-81231-A9634/2650"}]
["2017-02-03","Sunshine",79,{"$f":"_xlfn.TEXTJOIN(\"-\",,VLOOKUP(B286,$F$10:$I$18,{2,3,4}))","v":"Gel Booms-94618-S4369/2297"}]
["2017-02-22","Sunshine",70,{"$f":"_xlfn.TEXTJOIN(\"-\",,VLOOKUP(B287,$F$10:$I$18,{2,3,4}))","v":"Gel Booms-94618-S4369/2297"}]
["2017-03-08","Sunbell",79,{"$f":"_xlfn.TEXTJOIN(\"-\",,VLOOKUP(B288,$F$10:$I$18,{2,3,4}))","v":"Gel Booms-94618-S4369/2241"}]
["2017-03-04","Aspen",78,{"$f":"_xlfn.TEXTJOIN(\"-\",,VLOOKUP(B289,$F$10:$I$18,{2,3,4}))","v":"Colorado Booms-81231-A9634/2650"}]
["2017-02-02","TriBoom",63,{"$f":"_xlfn.TEXTJOIN(\"-\",,VLOOKUP(B290,$F$10:$I$18,{2,3,4}))","v":"Colorado Booms-90009-T9634/2372"}]
["2017-03-18","Aspen",83,{"$f":"_xlfn.TEXTJOIN(\"-\",,VLOOKUP(B291,$F$10:$I$18,{2,3,4}))","v":"Colorado Booms-81231-A9634/2650"}]
["2017-02-28","Quad",39,{"$f":"_xlfn.TEXTJOIN(\"-\",,VLOOKUP(B292,$F$10:$I$18,{2,3,4}))","v":"Gel Booms-94608-Q4369/2290"}]
["2017-01-08","Eagle",110,{"$f":"_xlfn.TEXTJOIN(\"-\",,VLOOKUP(B293,$F$10:$I$18,{2,3,4}))","v":"Colorado Booms-81231-E9634/2386"}]
["2017-03-28","Aspen",86,{"$f":"_xlfn.TEXTJOIN(\"-\",,VLOOKUP(B294,$F$10:$I$18,{2,3,4}))","v":"Colorado Booms-81231-A9634/2650"}]
["2017-03-27","Aspen",107,{"$f":"_xlfn.TEXTJOIN(\"-\",,VLOOKUP(B295,$F$10:$I$18,{2,3,4}))","v":"Colorado Booms-81231-A9634/2650"}]
["2017-02-16","Bellen",56,{"$f":"_xlfn.TEXTJOIN(\"-\",,VLOOKUP(B296,$F$10:$I$18,{2,3,4}))","v":"Gel Booms-94618-B4369/2593"}]
["2017-02-18","TriBoom",100,{"$f":"_xlfn.TEXTJOIN(\"-\",,VLOOKUP(B297,$F$10:$I$18,{2,3,4}))","v":"Colorado Booms-90009-T9634/2372"}]
["2017-01-08","TriBoom",85,{"$f":"_xlfn.TEXTJOIN(\"-\",,VLOOKUP(B298,$F$10:$I$18,{2,3,4}))","v":"Colorado Booms-90009-T9634/2372"}]
["2017-01-18","Sunbell",90,{"$f":"_xlfn.TEXTJOIN(\"-\",,VLOOKUP(B299,$F$10:$I$18,{2,3,4}))","v":"Gel Booms-94618-S4369/2241"}]
["2017-03-23","Eagle",43,{"$f":"_xlfn.TEXTJOIN(\"-\",,VLOOKUP(B300,$F$10:$I$18,{2,3,4}))","v":"Colorado Booms-81231-E9634/2386"}]
["2017-02-19","Eagle",100,{"$f":"_xlfn.TEXTJOIN(\"-\",,VLOOKUP(B301,$F$10:$I$18,{2,3,4}))","v":"Colorado Booms-81231-E9634/2386"}]
["2017-01-25","Sunshine",131,{"$f":"_xlfn.TEXTJOIN(\"-\",,VLOOKUP(B302,$F$10:$I$18,{2,3,4}))","v":"Gel Booms-94618-S4369/2297"}]
["2017-01-22","Quad",90,{"$f":"_xlfn.TEXTJOIN(\"-\",,VLOOKUP(B303,$F$10:$I$18,{2,3,4}))","v":"Gel Booms-94608-Q4369/2290"}]
["2017-03-28","Sunbell",82,{"$f":"_xlfn.TEXTJOIN(\"-\",,VLOOKUP(B304,$F$10:$I$18,{2,3,4}))","v":"Gel Booms-94618-S4369/2241"}]
["2017-03-15","Aspen",36,{"$f":"_xlfn.TEXTJOIN(\"-\",,VLOOKUP(B305,$F$10:$I$18,{2,3,4}))","v":"Colorado Booms-81231-A9634/2650"}]
["2017-02-10","Bellen",51,{"$f":"_xlfn.TEXTJOIN(\"-\",,VLOOKUP(B306,$F$10:$I$18,{2,3,4}))","v":"Gel Booms-94618-B4369/2593"}]
["2017-01-27","Sunshine",62,{"$f":"_xlfn.TEXTJOIN(\"-\",,VLOOKUP(B307,$F$10:$I$18,{2,3,4}))","v":"Gel Booms-94618-S4369/2297"}]
["2017-02-05","Quad",58,{"$f":"_xlfn.TEXTJOIN(\"-\",,VLOOKUP(B308,$F$10:$I$18,{2,3,4}))","v":"Gel Booms-94608-Q4369/2290"}]
["2017-01-07","Sunshine",97,{"$f":"_xlfn.TEXTJOIN(\"-\",,VLOOKUP(B309,$F$10:$I$18,{2,3,4}))","v":"Gel Booms-94618-S4369/2297"}]
["2017-02-15","Sunshine",94,{"$f":"_xlfn.TEXTJOIN(\"-\",,VLOOKUP(B310,$F$10:$I$18,{2,3,4}))","v":"Gel Booms-94618-S4369/2297"}]
["2017-02-03","Yanaki",70,{"$f":"_xlfn.TEXTJOIN(\"-\",,VLOOKUP(B311,$F$10:$I$18,{2,3,4}))","v":"Colorado Booms-81231-Y9634/2072"}]
["2017-03-06","Quad",47,{"$f":"_xlfn.TEXTJOIN(\"-\",,VLOOKUP(B312,$F$10:$I$18,{2,3,4}))","v":"Gel Booms-94608-Q4369/2290"}]
["2017-01-20","Bellen",52,{"$f":"_xlfn.TEXTJOIN(\"-\",,VLOOKUP(B313,$F$10:$I$18,{2,3,4}))","v":"Gel Booms-94618-B4369/2593"}]
["2017-01-20","Carlota",123,{"$f":"_xlfn.TEXTJOIN(\"-\",,VLOOKUP(B314,$F$10:$I$18,{2,3,4}))","v":"Gel Booms-94608-C4369/2213"}]
["2017-02-11","Sunshine",64,{"$f":"_xlfn.TEXTJOIN(\"-\",,VLOOKUP(B315,$F$10:$I$18,{2,3,4}))","v":"Gel Booms-94618-S4369/2297"}]
["2017-03-31","Yanaki",75,{"$f":"_xlfn.TEXTJOIN(\"-\",,VLOOKUP(B316,$F$10:$I$18,{2,3,4}))","v":"Colorado Booms-81231-Y9634/2072"}]
["2017-02-22","TriBoom",60,{"$f":"_xlfn.TEXTJOIN(\"-\",,VLOOKUP(B317,$F$10:$I$18,{2,3,4}))","v":"Colorado Booms-90009-T9634/2372"}]
["2017-02-18","Eagle",61,{"$f":"_xlfn.TEXTJOIN(\"-\",,VLOOKUP(B318,$F$10:$I$18,{2,3,4}))","v":"Colorado Booms-81231-E9634/2386"}]
["2017-03-15","Aspen",76,{"$f":"_xlfn.TEXTJOIN(\"-\",,VLOOKUP(B319,$F$10:$I$18,{2,3,4}))","v":"Colorado Booms-81231-A9634/2650"}]
["2017-02-28","Bellen",96,{"$f":"_xlfn.TEXTJOIN(\"-\",,VLOOKUP(B320,$F$10:$I$18,{2,3,4}))","v":"Gel Booms-94618-B4369/2593"}]
["2017-01-20","Bellen",34,{"$f":"_xlfn.TEXTJOIN(\"-\",,VLOOKUP(B321,$F$10:$I$18,{2,3,4}))","v":"Gel Booms-94618-B4369/2593"}]
["2017-03-24","Sunbell",106,{"$f":"_xlfn.TEXTJOIN(\"-\",,VLOOKUP(B322,$F$10:$I$18,{2,3,4}))","v":"Gel Booms-94618-S4369/2241"}]
["2017-03-06","Sunbell",66,{"$f":"_xlfn.TEXTJOIN(\"-\",,VLOOKUP(B323,$F$10:$I$18,{2,3,4}))","v":"Gel Booms-94618-S4369/2241"}]
["2017-01-21","Sunbell",67,{"$f":"_xlfn.TEXTJOIN(\"-\",,VLOOKUP(B324,$F$10:$I$18,{2,3,4}))","v":"Gel Booms-94618-S4369/2241"}]
["2017-02-06","Eagle",96,{"$f":"_xlfn.TEXTJOIN(\"-\",,VLOOKUP(B325,$F$10:$I$18,{2,3,4}))","v":"Colorado Booms-81231-E9634/2386"}]
["2017-03-08","Bellen",84,{"$f":"_xlfn.TEXTJOIN(\"-\",,VLOOKUP(B326,$F$10:$I$18,{2,3,4}))","v":"Gel Booms-94618-B4369/2593"}]
["2017-03-11","Sunshine",39,{"$f":"_xlfn.TEXTJOIN(\"-\",,VLOOKUP(B327,$F$10:$I$18,{2,3,4}))","v":"Gel Booms-94618-S4369/2297"}]
["2017-01-09","Eagle",88,{"$f":"_xlfn.TEXTJOIN(\"-\",,VLOOKUP(B328,$F$10:$I$18,{2,3,4}))","v":"Colorado Booms-81231-E9634/2386"}]
["2017-03-04","Sunshine",60,{"$f":"_xlfn.TEXTJOIN(\"-\",,VLOOKUP(B329,$F$10:$I$18,{2,3,4}))","v":"Gel Booms-94618-S4369/2297"}]
["2017-03-11","Carlota",63,{"$f":"_xlfn.TEXTJOIN(\"-\",,VLOOKUP(B330,$F$10:$I$18,{2,3,4}))","v":"Gel Booms-94608-C4369/2213"}]
["2017-02-22","Eagle",47,{"$f":"_xlfn.TEXTJOIN(\"-\",,VLOOKUP(B331,$F$10:$I$18,{2,3,4}))","v":"Colorado Booms-81231-E9634/2386"}]
["2017-01-24","Bellen",57,{"$f":"_xlfn.TEXTJOIN(\"-\",,VLOOKUP(B332,$F$10:$I$18,{2,3,4}))","v":"Gel Booms-94618-B4369/2593"}]
["2017-02-02","Bellen",83,{"$f":"_xlfn.TEXTJOIN(\"-\",,VLOOKUP(B333,$F$10:$I$18,{2,3,4}))","v":"Gel Booms-94618-B4369/2593"}]
["2017-03-24","Eagle",92,{"$f":"_xlfn.TEXTJOIN(\"-\",,VLOOKUP(B334,$F$10:$I$18,{2,3,4}))","v":"Colorado Booms-81231-E9634/2386"}]
["2017-01-07","Sunbell",62,{"$f":"_xlfn.TEXTJOIN(\"-\",,VLOOKUP(B335,$F$10:$I$18,{2,3,4}))","v":"Gel Booms-94618-S4369/2241"}]
["2017-02-19","Bellen",53,{"$f":"_xlfn.TEXTJOIN(\"-\",,VLOOKUP(B336,$F$10:$I$18,{2,3,4}))","v":"Gel Booms-94618-B4369/2593"}]
["2017-03-02","Carlota",62,{"$f":"_xlfn.TEXTJOIN(\"-\",,VLOOKUP(B337,$F$10:$I$18,{2,3,4}))","v":"Gel Booms-94608-C4369/2213"}]
["2017-01-03","Sunshine",89,{"$f":"_xlfn.TEXTJOIN(\"-\",,VLOOKUP(B338,$F$10:$I$18,{2,3,4}))","v":"Gel Booms-94618-S4369/2297"}]
["2017-03-26","Yanaki",61,{"$f":"_xlfn.TEXTJOIN(\"-\",,VLOOKUP(B339,$F$10:$I$18,{2,3,4}))","v":"Colorado Booms-81231-Y9634/2072"}]
["2017-03-02","Carlota",94,{"$f":"_xlfn.TEXTJOIN(\"-\",,VLOOKUP(B340,$F$10:$I$18,{2,3,4}))","v":"Gel Booms-94608-C4369/2213"}]
["2017-02-25","Carlota",61,{"$f":"_xlfn.TEXTJOIN(\"-\",,VLOOKUP(B341,$F$10:$I$18,{2,3,4}))","v":"Gel Booms-94608-C4369/2213"}]
["2017-03-20","Aspen",48,{"$f":"_xlfn.TEXTJOIN(\"-\",,VLOOKUP(B342,$F$10:$I$18,{2,3,4}))","v":"Colorado Booms-81231-A9634/2650"}]
["2017-02-12","Quad",61,{"$f":"_xlfn.TEXTJOIN(\"-\",,VLOOKUP(B343,$F$10:$I$18,{2,3,4}))","v":"Gel Booms-94608-Q4369/2290"}]
["2017-01-19","Quad",50,{"$f":"_xlfn.TEXTJOIN(\"-\",,VLOOKUP(B344,$F$10:$I$18,{2,3,4}))","v":"Gel Booms-94608-Q4369/2290"}]
["2017-03-19","Sunbell",31,{"$f":"_xlfn.TEXTJOIN(\"-\",,VLOOKUP(B345,$F$10:$I$18,{2,3,4}))","v":"Gel Booms-94618-S4369/2241"}]
["2017-01-23","Bellen",54,{"$f":"_xlfn.TEXTJOIN(\"-\",,VLOOKUP(B346,$F$10:$I$18,{2,3,4}))","v":"Gel Booms-94618-B4369/2593"}]
["2017-02-14","Eagle",89,{"$f":"_xlfn.TEXTJOIN(\"-\",,VLOOKUP(B347,$F$10:$I$18,{2,3,4}))","v":"Colorado Booms-81231-E9634/2386"}]
["2017-03-04","Bellen",72,{"$f":"_xlfn.TEXTJOIN(\"-\",,VLOOKUP(B348,$F$10:$I$18,{2,3,4}))","v":"Gel Booms-94618-B4369/2593"}]
["2017-03-11","TriBoom",73,{"$f":"_xlfn.TEXTJOIN(\"-\",,VLOOKUP(B349,$F$10:$I$18,{2,3,4}))","v":"Colorado Booms-90009-T9634/2372"}]
["2017-01-03","Sunshine",67,{"$f":"_xlfn.TEXTJOIN(\"-\",,VLOOKUP(B350,$F$10:$I$18,{2,3,4}))","v":"Gel Booms-94618-S4369/2297"}]
["2017-02-03","Eagle",102,{"$f":"_xlfn.TEXTJOIN(\"-\",,VLOOKUP(B351,$F$10:$I$18,{2,3,4}))","v":"Colorado Booms-81231-E9634/2386"}]
["2017-02-15","Sunbell",81,{"$f":"_xlfn.TEXTJOIN(\"-\",,VLOOKUP(B352,$F$10:$I$18,{2,3,4}))","v":"Gel Booms-94618-S4369/2241"}]
["2017-01-15","Yanaki",63,{"$f":"_xlfn.TEXTJOIN(\"-\",,VLOOKUP(B353,$F$10:$I$18,{2,3,4}))","v":"Colorado Booms-81231-Y9634/2072"}]
["2017-02-12","Carlota",63,{"$f":"_xlfn.TEXTJOIN(\"-\",,VLOOKUP(B354,$F$10:$I$18,{2,3,4}))","v":"Gel Booms-94608-C4369/2213"}]
["2017-01-15","Yanaki",105,{"$f":"_xlfn.TEXTJOIN(\"-\",,VLOOKUP(B355,$F$10:$I$18,{2,3,4}))","v":"Colorado Booms-81231-Y9634/2072"}]
["2017-02-19","Sunshine",125,{"$f":"_xlfn.TEXTJOIN(\"-\",,VLOOKUP(B356,$F$10:$I$18,{2,3,4}))","v":"Gel Booms-94618-S4369/2297"}]
["2017-03-30","Bellen",78,{"$f":"_xlfn.TEXTJOIN(\"-\",,VLOOKUP(B357,$F$10:$I$18,{2,3,4}))","v":"Gel Booms-94618-B4369/2593"}]
["2017-02-16","Quad",88,{"$f":"_xlfn.TEXTJOIN(\"-\",,VLOOKUP(B358,$F$10:$I$18,{2,3,4}))","v":"Gel Booms-94608-Q4369/2290"}]
["2017-02-19","Sunbell",77,{"$f":"_xlfn.TEXTJOIN(\"-\",,VLOOKUP(B359,$F$10:$I$18,{2,3,4}))","v":"Gel Booms-94618-S4369/2241"}]
["2017-01-19","Sunshine",73,{"$f":"_xlfn.TEXTJOIN(\"-\",,VLOOKUP(B360,$F$10:$I$18,{2,3,4}))","v":"Gel Booms-94618-S4369/2297"}]
["2017-01-09","Sunshine",45,{"$f":"_xlfn.TEXTJOIN(\"-\",,VLOOKUP(B361,$F$10:$I$18,{2,3,4}))","v":"Gel Booms-94618-S4369/2297"}]
["2017-02-03","Sunbell",92,{"$f":"_xlfn.TEXTJOIN(\"-\",,VLOOKUP(B362,$F$10:$I$18,{2,3,4}))","v":"Gel Booms-94618-S4369/2241"}]
["2017-03-01","Aspen",77,{"$f":"_xlfn.TEXTJOIN(\"-\",,VLOOKUP(B363,$F$10:$I$18,{2,3,4}))","v":"Colorado Booms-81231-A9634/2650"}]
["2017-02-28","Eagle",116,{"$f":"_xlfn.TEXTJOIN(\"-\",,VLOOKUP(B364,$F$10:$I$18,{2,3,4}))","v":"Colorado Booms-81231-E9634/2386"}]
["2017-01-08","Yanaki",94,{"$f":"_xlfn.TEXTJOIN(\"-\",,VLOOKUP(B365,$F$10:$I$18,{2,3,4}))","v":"Colorado Booms-81231-Y9634/2072"}]
["2017-01-28","Yanaki",123,{"$f":"_xlfn.TEXTJOIN(\"-\",,VLOOKUP(B366,$F$10:$I$18,{2,3,4}))","v":"Colorado Booms-81231-Y9634/2072"}]
["2017-01-27","Quad",88,{"$f":"_xlfn.TEXTJOIN(\"-\",,VLOOKUP(B367,$F$10:$I$18,{2,3,4}))","v":"Gel Booms-94608-Q4369/2290"}]
["2017-01-22","Carlota",45,{"$f":"_xlfn.TEXTJOIN(\"-\",,VLOOKUP(B368,$F$10:$I$18,{2,3,4}))","v":"Gel Booms-94608-C4369/2213"}]
["2017-02-19","Sunbell",85,{"$f":"_xlfn.TEXTJOIN(\"-\",,VLOOKUP(B369,$F$10:$I$18,{2,3,4}))","v":"Gel Booms-94618-S4369/2241"}]
["2017-01-11","Bellen",85,{"$f":"_xlfn.TEXTJOIN(\"-\",,VLOOKUP(B370,$F$10:$I$18,{2,3,4}))","v":"Gel Booms-94618-B4369/2593"}]
["2017-03-04","Eagle",30,{"$f":"_xlfn.TEXTJOIN(\"-\",,VLOOKUP(B371,$F$10:$I$18,{2,3,4}))","v":"Colorado Booms-81231-E9634/2386"}]
["2017-03-16","Bellen",84,{"$f":"_xlfn.TEXTJOIN(\"-\",,VLOOKUP(B372,$F$10:$I$18,{2,3,4}))","v":"Gel Booms-94618-B4369/2593"}]
["2017-02-11","Eagle",99,{"$f":"_xlfn.TEXTJOIN(\"-\",,VLOOKUP(B373,$F$10:$I$18,{2,3,4}))","v":"Colorado Booms-81231-E9634/2386"}]
["2017-01-07","Aspen",92,{"$f":"_xlfn.TEXTJOIN(\"-\",,VLOOKUP(B374,$F$10:$I$18,{2,3,4}))","v":"Colorado Booms-81231-A9634/2650"}]
["2017-01-31","Yanaki",87,{"$f":"_xlfn.TEXTJOIN(\"-\",,VLOOKUP(B375,$F$10:$I$18,{2,3,4}))","v":"Colorado Booms-81231-Y9634/2072"}]
["2017-03-30","Sunbell",100,{"$f":"_xlfn.TEXTJOIN(\"-\",,VLOOKUP(B376,$F$10:$I$18,{2,3,4}))","v":"Gel Booms-94618-S4369/2241"}]
["2017-01-16","Eagle",99,{"$f":"_xlfn.TEXTJOIN(\"-\",,VLOOKUP(B377,$F$10:$I$18,{2,3,4}))","v":"Colorado Booms-81231-E9634/2386"}]
["2017-01-09","Sunbell",37,{"$f":"_xlfn.TEXTJOIN(\"-\",,VLOOKUP(B378,$F$10:$I$18,{2,3,4}))","v":"Gel Booms-94618-S4369/2241"}]
["2017-01-22","Sunbell",80,{"$f":"_xlfn.TEXTJOIN(\"-\",,VLOOKUP(B379,$F$10:$I$18,{2,3,4}))","v":"Gel Booms-94618-S4369/2241"}]
["2017-02-05","Sunshine",74,{"$f":"_xlfn.TEXTJOIN(\"-\",,VLOOKUP(B380,$F$10:$I$18,{2,3,4}))","v":"Gel Booms-94618-S4369/2297"}]
["2017-03-29","Yanaki",114,{"$f":"_xlfn.TEXTJOIN(\"-\",,VLOOKUP(B381,$F$10:$I$18,{2,3,4}))","v":"Colorado Booms-81231-Y9634/2072"}]
["2017-03-30","Yanaki",73,{"$f":"_xlfn.TEXTJOIN(\"-\",,VLOOKUP(B382,$F$10:$I$18,{2,3,4}))","v":"Colorado Booms-81231-Y9634/2072"}]
["2017-03-12","Carlota",100,{"$f":"_xlfn.TEXTJOIN(\"-\",,VLOOKUP(B383,$F$10:$I$18,{2,3,4}))","v":"Gel Booms-94608-C4369/2213"}]
["2017-01-30","TriBoom",74,{"$f":"_xlfn.TEXTJOIN(\"-\",,VLOOKUP(B384,$F$10:$I$18,{2,3,4}))","v":"Colorado Booms-90009-T9634/2372"}]
["2017-02-16","Eagle",48,{"$f":"_xlfn.TEXTJOIN(\"-\",,VLOOKUP(B385,$F$10:$I$18,{2,3,4}))","v":"Colorado Booms-81231-E9634/2386"}]
["2017-01-31","Sunshine",100,{"$f":"_xlfn.TEXTJOIN(\"-\",,VLOOKUP(B386,$F$10:$I$18,{2,3,4}))","v":"Gel Booms-94618-S4369/2297"}]
["2017-02-07","Eagle",101,{"$f":"_xlfn.TEXTJOIN(\"-\",,VLOOKUP(B387,$F$10:$I$18,{2,3,4}))","v":"Colorado Booms-81231-E9634/2386"}]
["2017-02-27","Carlota",83,{"$f":"_xlfn.TEXTJOIN(\"-\",,VLOOKUP(B388,$F$10:$I$18,{2,3,4}))","v":"Gel Booms-94608-C4369/2213"}]
["2017-01-21","Bellen",59,{"$f":"_xlfn.TEXTJOIN(\"-\",,VLOOKUP(B389,$F$10:$I$18,{2,3,4}))","v":"Gel Booms-94618-B4369/2593"}]
["2017-02-26","Eagle",81,{"$f":"_xlfn.TEXTJOIN(\"-\",,VLOOKUP(B390,$F$10:$I$18,{2,3,4}))","v":"Colorado Booms-81231-E9634/2386"}]
["2017-03-23","Eagle",91,{"$f":"_xlfn.TEXTJOIN(\"-\",,VLOOKUP(B391,$F$10:$I$18,{2,3,4}))","v":"Colorado Booms-81231-E9634/2386"}]
["2017-02-22","Carlota",99,{"$f":"_xlfn.TEXTJOIN(\"-\",,VLOOKUP(B392,$F$10:$I$18,{2,3,4}))","v":"Gel Booms-94608-C4369/2213"}]
["2017-02-12","Eagle",86,{"$f":"_xlfn.TEXTJOIN(\"-\",,VLOOKUP(B393,$F$10:$I$18,{2,3,4}))","v":"Colorado Booms-81231-E9634/2386"}]
["2017-02-19","Yanaki",67,{"$f":"_xlfn.TEXTJOIN(\"-\",,VLOOKUP(B394,$F$10:$I$18,{2,3,4}))","v":"Colorado Booms-81231-Y9634/2072"}]
["2017-03-25","Quad",18,{"$f":"_xlfn.TEXTJOIN(\"-\",,VLOOKUP(B395,$F$10:$I$18,{2,3,4}))","v":"Gel Booms-94608-Q4369/2290"}]
["2017-03-01","Eagle",76,{"$f":"_xlfn.TEXTJOIN(\"-\",,VLOOKUP(B396,$F$10:$I$18,{2,3,4}))","v":"Colorado Booms-81231-E9634/2386"}]
["2017-02-02","Eagle",54,{"$f":"_xlfn.TEXTJOIN(\"-\",,VLOOKUP(B397,$F$10:$I$18,{2,3,4}))","v":"Colorado Booms-81231-E9634/2386"}]
["2017-01-29","TriBoom",72,{"$f":"_xlfn.TEXTJOIN(\"-\",,VLOOKUP(B398,$F$10:$I$18,{2,3,4}))","v":"Colorado Booms-90009-T9634/2372"}]
["2017-02-12","Sunbell",35,{"$f":"_xlfn.TEXTJOIN(\"-\",,VLOOKUP(B399,$F$10:$I$18,{2,3,4}))","v":"Gel Booms-94618-S4369/2241"}]
["2017-01-13","Aspen",118,{"$f":"_xlfn.TEXTJOIN(\"-\",,VLOOKUP(B400,$F$10:$I$18,{2,3,4}))","v":"Colorado Booms-81231-A9634/2650"}]
["2017-02-13","Bellen",82,{"$f":"_xlfn.TEXTJOIN(\"-\",,VLOOKUP(B401,$F$10:$I$18,{2,3,4}))","v":"Gel Booms-94618-B4369/2593"}]
["2017-02-10","Sunshine",102,{"$f":"_xlfn.TEXTJOIN(\"-\",,VLOOKUP(B402,$F$10:$I$18,{2,3,4}))","v":"Gel Booms-94618-S4369/2297"}]
["2017-02-19","Eagle",118,{"$f":"_xlfn.TEXTJOIN(\"-\",,VLOOKUP(B403,$F$10:$I$18,{2,3,4}))","v":"Colorado Booms-81231-E9634/2386"}]
["2017-02-04","Eagle",58,{"$f":"_xlfn.TEXTJOIN(\"-\",,VLOOKUP(B404,$F$10:$I$18,{2,3,4}))","v":"Colorado Booms-81231-E9634/2386"}]
["2017-03-31","TriBoom",68,{"$f":"_xlfn.TEXTJOIN(\"-\",,VLOOKUP(B405,$F$10:$I$18,{2,3,4}))","v":"Colorado Booms-90009-T9634/2372"}]
["2017-02-10","Quad",41,{"$f":"_xlfn.TEXTJOIN(\"-\",,VLOOKUP(B406,$F$10:$I$18,{2,3,4}))","v":"Gel Booms-94608-Q4369/2290"}]
["2017-01-15","Yanaki",90,{"$f":"_xlfn.TEXTJOIN(\"-\",,VLOOKUP(B407,$F$10:$I$18,{2,3,4}))","v":"Colorado Booms-81231-Y9634/2072"}]
["2017-01-07","Eagle",63,{"$f":"_xlfn.TEXTJOIN(\"-\",,VLOOKUP(B408,$F$10:$I$18,{2,3,4}))","v":"Colorado Booms-81231-E9634/2386"}]
["2017-03-10","Bellen",95,{"$f":"_xlfn.TEXTJOIN(\"-\",,VLOOKUP(B409,$F$10:$I$18,{2,3,4}))","v":"Gel Booms-94618-B4369/2593"}]
["2017-01-18","Yanaki",19,{"$f":"_xlfn.TEXTJOIN(\"-\",,VLOOKUP(B410,$F$10:$I$18,{2,3,4}))","v":"Colorado Booms-81231-Y9634/2072"}]
["2017-02-17","Sunshine",39,{"$f":"_xlfn.TEXTJOIN(\"-\",,VLOOKUP(B411,$F$10:$I$18,{2,3,4}))","v":"Gel Booms-94618-S4369/2297"}]
["2017-03-13","Yanaki",43,{"$f":"_xlfn.TEXTJOIN(\"-\",,VLOOKUP(B412,$F$10:$I$18,{2,3,4}))","v":"Colorado Booms-81231-Y9634/2072"}]
["2017-01-04","TriBoom",56,{"$f":"_xlfn.TEXTJOIN(\"-\",,VLOOKUP(B413,$F$10:$I$18,{2,3,4}))","v":"Colorado Booms-90009-T9634/2372"}]
["2017-03-31","Quad",47,{"$f":"_xlfn.TEXTJOIN(\"-\",,VLOOKUP(B414,$F$10:$I$18,{2,3,4}))","v":"Gel Booms-94608-Q4369/2290"}]
["2017-03-13","Aspen",61,{"$f":"_xlfn.TEXTJOIN(\"-\",,VLOOKUP(B415,$F$10:$I$18,{2,3,4}))","v":"Colorado Booms-81231-A9634/2650"}]
["2017-01-11","Quad",66,{"$f":"_xlfn.TEXTJOIN(\"-\",,VLOOKUP(B416,$F$10:$I$18,{2,3,4}))","v":"Gel Booms-94608-Q4369/2290"}]
["2017-02-22","Aspen",87,{"$f":"_xlfn.TEXTJOIN(\"-\",,VLOOKUP(B417,$F$10:$I$18,{2,3,4}))","v":"Colorado Booms-81231-A9634/2650"}]
["2017-02-21","Sunbell",87,{"$f":"_xlfn.TEXTJOIN(\"-\",,VLOOKUP(B418,$F$10:$I$18,{2,3,4}))","v":"Gel Booms-94618-S4369/2241"}]
["2017-03-02","Eagle",78,{"$f":"_xlfn.TEXTJOIN(\"-\",,VLOOKUP(B419,$F$10:$I$18,{2,3,4}))","v":"Colorado Booms-81231-E9634/2386"}]
["2017-02-25","Eagle",67,{"$f":"_xlfn.TEXTJOIN(\"-\",,VLOOKUP(B420,$F$10:$I$18,{2,3,4}))","v":"Colorado Booms-81231-E9634/2386"}]
["2017-03-05","Sunbell",58,{"$f":"_xlfn.TEXTJOIN(\"-\",,VLOOKUP(B421,$F$10:$I$18,{2,3,4}))","v":"Gel Booms-94618-S4369/2241"}]
["2017-01-29","Carlota",82,{"$f":"_xlfn.TEXTJOIN(\"-\",,VLOOKUP(B422,$F$10:$I$18,{2,3,4}))","v":"Gel Booms-94608-C4369/2213"}]
["2017-01-15","Eagle",99,{"$f":"_xlfn.TEXTJOIN(\"-\",,VLOOKUP(B423,$F$10:$I$18,{2,3,4}))","v":"Colorado Booms-81231-E9634/2386"}]
["2017-03-28","Quad",98,{"$f":"_xlfn.TEXTJOIN(\"-\",,VLOOKUP(B424,$F$10:$I$18,{2,3,4}))","v":"Gel Booms-94608-Q4369/2290"}]
["2017-02-14","Yanaki",58,{"$f":"_xlfn.TEXTJOIN(\"-\",,VLOOKUP(B425,$F$10:$I$18,{2,3,4}))","v":"Colorado Booms-81231-Y9634/2072"}]
["2017-03-11","Aspen",80,{"$f":"_xlfn.TEXTJOIN(\"-\",,VLOOKUP(B426,$F$10:$I$18,{2,3,4}))","v":"Colorado Booms-81231-A9634/2650"}]
["2017-01-12","Aspen",36,{"$f":"_xlfn.TEXTJOIN(\"-\",,VLOOKUP(B427,$F$10:$I$18,{2,3,4}))","v":"Colorado Booms-81231-A9634/2650"}]
["2017-01-14","Sunbell",45,{"$f":"_xlfn.TEXTJOIN(\"-\",,VLOOKUP(B428,$F$10:$I$18,{2,3,4}))","v":"Gel Booms-94618-S4369/2241"}]
["2017-01-08","Quad",77,{"$f":"_xlfn.TEXTJOIN(\"-\",,VLOOKUP(B429,$F$10:$I$18,{2,3,4}))","v":"Gel Booms-94608-Q4369/2290"}]
["2017-02-02","TriBoom",106,{"$f":"_xlfn.TEXTJOIN(\"-\",,VLOOKUP(B430,$F$10:$I$18,{2,3,4}))","v":"Colorado Booms-90009-T9634/2372"}]
["2017-03-10","Sunbell",59,{"$f":"_xlfn.TEXTJOIN(\"-\",,VLOOKUP(B431,$F$10:$I$18,{2,3,4}))","v":"Gel Booms-94618-S4369/2241"}]
["2017-03-25","Sunshine",69,{"$f":"_xlfn.TEXTJOIN(\"-\",,VLOOKUP(B432,$F$10:$I$18,{2,3,4}))","v":"Gel Booms-94618-S4369/2297"}]
["2017-03-02","Yanaki",94,{"$f":"_xlfn.TEXTJOIN(\"-\",,VLOOKUP(B433,$F$10:$I$18,{2,3,4}))","v":"Colorado Booms-81231-Y9634/2072"}]
["2017-01-02","Eagle",118,{"$f":"_xlfn.TEXTJOIN(\"-\",,VLOOKUP(B434,$F$10:$I$18,{2,3,4}))","v":"Colorado Booms-81231-E9634/2386"}]
["2017-01-25","Sunbell",69,{"$f":"_xlfn.TEXTJOIN(\"-\",,VLOOKUP(B435,$F$10:$I$18,{2,3,4}))","v":"Gel Booms-94618-S4369/2241"}]
["2017-01-04","Aspen",50,{"$f":"_xlfn.TEXTJOIN(\"-\",,VLOOKUP(B436,$F$10:$I$18,{2,3,4}))","v":"Colorado Booms-81231-A9634/2650"}]
["2017-02-19","Carlota",92,{"$f":"_xlfn.TEXTJOIN(\"-\",,VLOOKUP(B437,$F$10:$I$18,{2,3,4}))","v":"Gel Booms-94608-C4369/2213"}]
["2017-02-04","Carlota",63,{"$f":"_xlfn.TEXTJOIN(\"-\",,VLOOKUP(B438,$F$10:$I$18,{2,3,4}))","v":"Gel Booms-94608-C4369/2213"}]
["2017-01-02","Carlota",64,{"$f":"_xlfn.TEXTJOIN(\"-\",,VLOOKUP(B439,$F$10:$I$18,{2,3,4}))","v":"Gel Booms-94608-C4369/2213"}]
["2017-03-22","TriBoom",115,{"$f":"_xlfn.TEXTJOIN(\"-\",,VLOOKUP(B440,$F$10:$I$18,{2,3,4}))","v":"Colorado Booms-90009-T9634/2372"}]
["2017-02-08","TriBoom",76,{"$f":"_xlfn.TEXTJOIN(\"-\",,VLOOKUP(B441,$F$10:$I$18,{2,3,4}))","v":"Colorado Booms-90009-T9634/2372"}]
["2017-01-25","TriBoom",30,{"$f":"_xlfn.TEXTJOIN(\"-\",,VLOOKUP(B442,$F$10:$I$18,{2,3,4}))","v":"Colorado Booms-90009-T9634/2372"}]
["2017-02-14","Bellen",106,{"$f":"_xlfn.TEXTJOIN(\"-\",,VLOOKUP(B443,$F$10:$I$18,{2,3,4}))","v":"Gel Booms-94618-B4369/2593"}]
["2017-02-26","Aspen",28,{"$f":"_xlfn.TEXTJOIN(\"-\",,VLOOKUP(B444,$F$10:$I$18,{2,3,4}))","v":"Colorado Booms-81231-A9634/2650"}]
["2017-02-12","Eagle",67,{"$f":"_xlfn.TEXTJOIN(\"-\",,VLOOKUP(B445,$F$10:$I$18,{2,3,4}))","v":"Colorado Booms-81231-E9634/2386"}]
["2017-02-14","Eagle",70,{"$f":"_xlfn.TEXTJOIN(\"-\",,VLOOKUP(B446,$F$10:$I$18,{2,3,4}))","v":"Colorado Booms-81231-E9634/2386"}]
["2017-01-24","TriBoom",78,{"$f":"_xlfn.TEXTJOIN(\"-\",,VLOOKUP(B447,$F$10:$I$18,{2,3,4}))","v":"Colorado Booms-90009-T9634/2372"}]
["2017-02-23","Aspen",44,{"$f":"_xlfn.TEXTJOIN(\"-\",,VLOOKUP(B448,$F$10:$I$18,{2,3,4}))","v":"Colorado Booms-81231-A9634/2650"}]
["2017-01-18","Aspen",80,{"$f":"_xlfn.TEXTJOIN(\"-\",,VLOOKUP(B449,$F$10:$I$18,{2,3,4}))","v":"Colorado Booms-81231-A9634/2650"}]
["2017-02-18","Quad",38,{"$f":"_xlfn.TEXTJOIN(\"-\",,VLOOKUP(B450,$F$10:$I$18,{2,3,4}))","v":"Gel Booms-94608-Q4369/2290"}]
["2017-03-10","Carlota",47,{"$f":"_xlfn.TEXTJOIN(\"-\",,VLOOKUP(B451,$F$10:$I$18,{2,3,4}))","v":"Gel Booms-94608-C4369/2213"}]
["2017-03-31","Sunbell",64,{"$f":"_xlfn.TEXTJOIN(\"-\",,VLOOKUP(B452,$F$10:$I$18,{2,3,4}))","v":"Gel Booms-94618-S4369/2241"}]
["2017-01-12","Eagle",43,{"$f":"_xlfn.TEXTJOIN(\"-\",,VLOOKUP(B453,$F$10:$I$18,{2,3,4}))","v":"Colorado Booms-81231-E9634/2386"}]
["2017-01-30","Yanaki",101,{"$f":"_xlfn.TEXTJOIN(\"-\",,VLOOKUP(B454,$F$10:$I$18,{2,3,4}))","v":"Colorado Booms-81231-Y9634/2072"}]
["2017-01-30","Quad",97,{"$f":"_xlfn.TEXTJOIN(\"-\",,VLOOKUP(B455,$F$10:$I$18,{2,3,4}))","v":"Gel Booms-94608-Q4369/2290"}]
["2017-03-09","TriBoom",63,{"$f":"_xlfn.TEXTJOIN(\"-\",,VLOOKUP(B456,$F$10:$I$18,{2,3,4}))","v":"Colorado Booms-90009-T9634/2372"}]
["2017-02-06","Bellen",80,{"$f":"_xlfn.TEXTJOIN(\"-\",,VLOOKUP(B457,$F$10:$I$18,{2,3,4}))","v":"Gel Booms-94618-B4369/2593"}]
["2017-03-24","Eagle",44,{"$f":"_xlfn.TEXTJOIN(\"-\",,VLOOKUP(B458,$F$10:$I$18,{2,3,4}))","v":"Colorado Booms-81231-E9634/2386"}]
["2017-02-18","Sunbell",37,{"$f":"_xlfn.TEXTJOIN(\"-\",,VLOOKUP(B459,$F$10:$I$18,{2,3,4}))","v":"Gel Booms-94618-S4369/2241"}]
["2017-01-30","Sunbell",65,{"$f":"_xlfn.TEXTJOIN(\"-\",,VLOOKUP(B460,$F$10:$I$18,{2,3,4}))","v":"Gel Booms-94618-S4369/2241"}]
["2017-01-29","TriBoom",64,{"$f":"_xlfn.TEXTJOIN(\"-\",,VLOOKUP(B461,$F$10:$I$18,{2,3,4}))","v":"Colorado Booms-90009-T9634/2372"}]
["2017-02-17","Aspen",75,{"$f":"_xlfn.TEXTJOIN(\"-\",,VLOOKUP(B462,$F$10:$I$18,{2,3,4}))","v":"Colorado Booms-81231-A9634/2650"}]
["2017-02-16","Aspen",98,{"$f":"_xlfn.TEXTJOIN(\"-\",,VLOOKUP(B463,$F$10:$I$18,{2,3,4}))","v":"Colorado Booms-81231-A9634/2650"}]
["2017-02-18","Carlota",83,{"$f":"_xlfn.TEXTJOIN(\"-\",,VLOOKUP(B464,$F$10:$I$18,{2,3,4}))","v":"Gel Booms-94608-C4369/2213"}]
["2017-02-05","Bellen",76,{"$f":"_xlfn.TEXTJOIN(\"-\",,VLOOKUP(B465,$F$10:$I$18,{2,3,4}))","v":"Gel Booms-94618-B4369/2593"}]
["2017-02-22","TriBoom",80,{"$f":"_xlfn.TEXTJOIN(\"-\",,VLOOKUP(B466,$F$10:$I$18,{2,3,4}))","v":"Colorado Booms-90009-T9634/2372"}]
["2017-02-10","Yanaki",43,{"$f":"_xlfn.TEXTJOIN(\"-\",,VLOOKUP(B467,$F$10:$I$18,{2,3,4}))","v":"Colorado Booms-81231-Y9634/2072"}]
["2017-01-30","Sunbell",71,{"$f":"_xlfn.TEXTJOIN(\"-\",,VLOOKUP(B468,$F$10:$I$18,{2,3,4}))","v":"Gel Booms-94618-S4369/2241"}]
["2017-03-09","Bellen",119,{"$f":"_xlfn.TEXTJOIN(\"-\",,VLOOKUP(B469,$F$10:$I$18,{2,3,4}))","v":"Gel Booms-94618-B4369/2593"}]
["2017-02-08","Bellen",91,{"$f":"_xlfn.TEXTJOIN(\"-\",,VLOOKUP(B470,$F$10:$I$18,{2,3,4}))","v":"Gel Booms-94618-B4369/2593"}]
["2017-03-23","Sunshine",111,{"$f":"_xlfn.TEXTJOIN(\"-\",,VLOOKUP(B471,$F$10:$I$18,{2,3,4}))","v":"Gel Booms-94618-S4369/2297"}]
["2017-03-25","Aspen",80,{"$f":"_xlfn.TEXTJOIN(\"-\",,VLOOKUP(B472,$F$10:$I$18,{2,3,4}))","v":"Colorado Booms-81231-A9634/2650"}]
["2017-02-18","Carlota",23,{"$f":"_xlfn.TEXTJOIN(\"-\",,VLOOKUP(B473,$F$10:$I$18,{2,3,4}))","v":"Gel Booms-94608-C4369/2213"}]
["2017-03-20","Carlota",65,{"$f":"_xlfn.TEXTJOIN(\"-\",,VLOOKUP(B474,$F$10:$I$18,{2,3,4}))","v":"Gel Booms-94608-C4369/2213"}]
["2017-02-21","Aspen",34,{"$f":"_xlfn.TEXTJOIN(\"-\",,VLOOKUP(B475,$F$10:$I$18,{2,3,4}))","v":"Colorado Booms-81231-A9634/2650"}]
["2017-01-24","Aspen",89,{"$f":"_xlfn.TEXTJOIN(\"-\",,VLOOKUP(B476,$F$10:$I$18,{2,3,4}))","v":"Colorado Booms-81231-A9634/2650"}]
["2017-03-05","Eagle",132,{"$f":"_xlfn.TEXTJOIN(\"-\",,VLOOKUP(B477,$F$10:$I$18,{2,3,4}))","v":"Colorado Booms-81231-E9634/2386"}]
["2017-01-07","Aspen",109,{"$f":"_xlfn.TEXTJOIN(\"-\",,VLOOKUP(B478,$F$10:$I$18,{2,3,4}))","v":"Colorado Booms-81231-A9634/2650"}]
["2017-01-13","Yanaki",82,{"$f":"_xlfn.TEXTJOIN(\"-\",,VLOOKUP(B479,$F$10:$I$18,{2,3,4}))","v":"Colorado Booms-81231-Y9634/2072"}]
["2017-02-12","Eagle",64,{"$f":"_xlfn.TEXTJOIN(\"-\",,VLOOKUP(B480,$F$10:$I$18,{2,3,4}))","v":"Colorado Booms-81231-E9634/2386"}]
["2017-02-03","Bellen",72,{"$f":"_xlfn.TEXTJOIN(\"-\",,VLOOKUP(B481,$F$10:$I$18,{2,3,4}))","v":"Gel Booms-94618-B4369/2593"}]
["2017-02-05","Bellen",34,{"$f":"_xlfn.TEXTJOIN(\"-\",,VLOOKUP(B482,$F$10:$I$18,{2,3,4}))","v":"Gel Booms-94618-B4369/2593"}]
["2017-01-08","TriBoom",84,{"$f":"_xlfn.TEXTJOIN(\"-\",,VLOOKUP(B483,$F$10:$I$18,{2,3,4}))","v":"Colorado Booms-90009-T9634/2372"}]
["2017-03-18","TriBoom",103,{"$f":"_xlfn.TEXTJOIN(\"-\",,VLOOKUP(B484,$F$10:$I$18,{2,3,4}))","v":"Colorado Booms-90009-T9634/2372"}]
["2017-01-14","Carlota",110,{"$f":"_xlfn.TEXTJOIN(\"-\",,VLOOKUP(B485,$F$10:$I$18,{2,3,4}))","v":"Gel Booms-94608-C4369/2213"}]
["2017-01-16","Aspen",73,{"$f":"_xlfn.TEXTJOIN(\"-\",,VLOOKUP(B486,$F$10:$I$18,{2,3,4}))","v":"Colorado Booms-81231-A9634/2650"}]
["2017-01-22","Sunshine",85,{"$f":"_xlfn.TEXTJOIN(\"-\",,VLOOKUP(B487,$F$10:$I$18,{2,3,4}))","v":"Gel Booms-94618-S4369/2297"}]
["2017-01-09","Eagle",99,{"$f":"_xlfn.TEXTJOIN(\"-\",,VLOOKUP(B488,$F$10:$I$18,{2,3,4}))","v":"Colorado Booms-81231-E9634/2386"}]
["2017-02-25","Eagle",80,{"$f":"_xlfn.TEXTJOIN(\"-\",,VLOOKUP(B489,$F$10:$I$18,{2,3,4}))","v":"Colorado Booms-81231-E9634/2386"}]
["2017-03-04","Carlota",89,{"$f":"_xlfn.TEXTJOIN(\"-\",,VLOOKUP(B490,$F$10:$I$18,{2,3,4}))","v":"Gel Booms-94608-C4369/2213"}]
["2017-02-04","Carlota",99,{"$f":"_xlfn.TEXTJOIN(\"-\",,VLOOKUP(B491,$F$10:$I$18,{2,3,4}))","v":"Gel Booms-94608-C4369/2213"}]
["2017-02-04","Eagle",38,{"$f":"_xlfn.TEXTJOIN(\"-\",,VLOOKUP(B492,$F$10:$I$18,{2,3,4}))","v":"Colorado Booms-81231-E9634/2386"}]
["2017-03-09","Aspen",69,{"$f":"_xlfn.TEXTJOIN(\"-\",,VLOOKUP(B493,$F$10:$I$18,{2,3,4}))","v":"Colorado Booms-81231-A9634/2650"}]
["2017-03-11","Sunbell",83,{"$f":"_xlfn.TEXTJOIN(\"-\",,VLOOKUP(B494,$F$10:$I$18,{2,3,4}))","v":"Gel Booms-94618-S4369/2241"}]
["2017-01-16","Carlota",83,{"$f":"_xlfn.TEXTJOIN(\"-\",,VLOOKUP(B495,$F$10:$I$18,{2,3,4}))","v":"Gel Booms-94608-C4369/2213"}]
["2017-03-18","Bellen",29,{"$f":"_xlfn.TEXTJOIN(\"-\",,VLOOKUP(B496,$F$10:$I$18,{2,3,4}))","v":"Gel Booms-94618-B4369/2593"}]
["2017-01-22","TriBoom",73,{"$f":"_xlfn.TEXTJOIN(\"-\",,VLOOKUP(B497,$F$10:$I$18,{2,3,4}))","v":"Colorado Booms-90009-T9634/2372"}]
["2017-02-15","Aspen",72,{"$f":"_xlfn.TEXTJOIN(\"-\",,VLOOKUP(B498,$F$10:$I$18,{2,3,4}))","v":"Colorado Booms-81231-A9634/2650"}]
["2017-03-21","TriBoom",72,{"$f":"_xlfn.TEXTJOIN(\"-\",,VLOOKUP(B499,$F$10:$I$18,{2,3,4}))","v":"Colorado Booms-90009-T9634/2372"}]
["2017-03-12","Aspen",103,{"$f":"_xlfn.TEXTJOIN(\"-\",,VLOOKUP(B500,$F$10:$I$18,{2,3,4}))","v":"Colorado Booms-81231-A9634/2650"}]
["2017-02-15","Bellen",104,{"$f":"_xlfn.TEXTJOIN(\"-\",,VLOOKUP(B501,$F$10:$I$18,{2,3,4}))","v":"Gel Booms-94618-B4369/2593"}]
["2017-01-14","Aspen",91,{"$f":"_xlfn.TEXTJOIN(\"-\",,VLOOKUP(B502,$F$10:$I$18,{2,3,4}))","v":"Colorado Booms-81231-A9634/2650"}]
["2017-01-15","TriBoom",78,{"$f":"_xlfn.TEXTJOIN(\"-\",,VLOOKUP(B503,$F$10:$I$18,{2,3,4}))","v":"Colorado Booms-90009-T9634/2372"}]
["2017-03-16","Sunbell",57,{"$f":"_xlfn.TEXTJOIN(\"-\",,VLOOKUP(B504,$F$10:$I$18,{2,3,4}))","v":"Gel Booms-94618-S4369/2241"}]
["2017-02-07","Sunbell",103,{"$f":"_xlfn.TEXTJOIN(\"-\",,VLOOKUP(B505,$F$10:$I$18,{2,3,4}))","v":"Gel Booms-94618-S4369/2241"}]
["2017-03-02","TriBoom",89,{"$f":"_xlfn.TEXTJOIN(\"-\",,VLOOKUP(B506,$F$10:$I$18,{2,3,4}))","v":"Colorado Booms-90009-T9634/2372"}]
["2017-01-10","Bellen",100,{"$f":"_xlfn.TEXTJOIN(\"-\",,VLOOKUP(B507,$F$10:$I$18,{2,3,4}))","v":"Gel Booms-94618-B4369/2593"}]
["2017-01-07","Bellen",108,{"$f":"_xlfn.TEXTJOIN(\"-\",,VLOOKUP(B508,$F$10:$I$18,{2,3,4}))","v":"Gel Booms-94618-B4369/2593"}]
["2017-01-13","Yanaki",74,{"$f":"_xlfn.TEXTJOIN(\"-\",,VLOOKUP(B509,$F$10:$I$18,{2,3,4}))","v":"Colorado Booms-81231-Y9634/2072"}]
["2017-01-16","Yanaki",96,{"$f":"_xlfn.TEXTJOIN(\"-\",,VLOOKUP(B510,$F$10:$I$18,{2,3,4}))","v":"Colorado Booms-81231-Y9634/2072"}]
["2017-02-19","Sunshine",63,{"$f":"_xlfn.TEXTJOIN(\"-\",,VLOOKUP(B511,$F$10:$I$18,{2,3,4}))","v":"Gel Booms-94618-S4369/2297"}]
["2017-01-04","Sunshine",116,{"$f":"_xlfn.TEXTJOIN(\"-\",,VLOOKUP(B512,$F$10:$I$18,{2,3,4}))","v":"Gel Booms-94618-S4369/2297"}]
["2017-01-31","Eagle",55,{"$f":"_xlfn.TEXTJOIN(\"-\",,VLOOKUP(B513,$F$10:$I$18,{2,3,4}))","v":"Colorado Booms-81231-E9634/2386"}]
["2017-01-06","Bellen",85,{"$f":"_xlfn.TEXTJOIN(\"-\",,VLOOKUP(B514,$F$10:$I$18,{2,3,4}))","v":"Gel Booms-94618-B4369/2593"}]
["2017-01-11","Bellen",71,{"$f":"_xlfn.TEXTJOIN(\"-\",,VLOOKUP(B515,$F$10:$I$18,{2,3,4}))","v":"Gel Booms-94618-B4369/2593"}]
["2017-02-15","Quad",52,{"$f":"_xlfn.TEXTJOIN(\"-\",,VLOOKUP(B516,$F$10:$I$18,{2,3,4}))","v":"Gel Booms-94608-Q4369/2290"}]
["2017-01-25","Aspen",68,{"$f":"_xlfn.TEXTJOIN(\"-\",,VLOOKUP(B517,$F$10:$I$18,{2,3,4}))","v":"Colorado Booms-81231-A9634/2650"}]
["2017-01-12","Quad",53,{"$f":"_xlfn.TEXTJOIN(\"-\",,VLOOKUP(B518,$F$10:$I$18,{2,3,4}))","v":"Gel Booms-94608-Q4369/2290"}]
["2017-01-19","Sunshine",118,{"$f":"_xlfn.TEXTJOIN(\"-\",,VLOOKUP(B519,$F$10:$I$18,{2,3,4}))","v":"Gel Booms-94618-S4369/2297"}]
["2017-03-13","Eagle",71,{"$f":"_xlfn.TEXTJOIN(\"-\",,VLOOKUP(B520,$F$10:$I$18,{2,3,4}))","v":"Colorado Booms-81231-E9634/2386"}]
["2017-03-24","Carlota",78,{"$f":"_xlfn.TEXTJOIN(\"-\",,VLOOKUP(B521,$F$10:$I$18,{2,3,4}))","v":"Gel Booms-94608-C4369/2213"}]
["2017-02-06","Sunshine",92,{"$f":"_xlfn.TEXTJOIN(\"-\",,VLOOKUP(B522,$F$10:$I$18,{2,3,4}))","v":"Gel Booms-94618-S4369/2297"}]
["2017-01-27","Sunshine",70,{"$f":"_xlfn.TEXTJOIN(\"-\",,VLOOKUP(B523,$F$10:$I$18,{2,3,4}))","v":"Gel Booms-94618-S4369/2297"}]
["2017-02-05","Quad",87,{"$f":"_xlfn.TEXTJOIN(\"-\",,VLOOKUP(B524,$F$10:$I$18,{2,3,4}))","v":"Gel Booms-94608-Q4369/2290"}]
["2017-02-22","Quad",130,{"$f":"_xlfn.TEXTJOIN(\"-\",,VLOOKUP(B525,$F$10:$I$18,{2,3,4}))","v":"Gel Booms-94608-Q4369/2290"}]
["2017-02-12","TriBoom",51,{"$f":"_xlfn.TEXTJOIN(\"-\",,VLOOKUP(B526,$F$10:$I$18,{2,3,4}))","v":"Colorado Booms-90009-T9634/2372"}]
["2017-03-03","Sunshine",87,{"$f":"_xlfn.TEXTJOIN(\"-\",,VLOOKUP(B527,$F$10:$I$18,{2,3,4}))","v":"Gel Booms-94618-S4369/2297"}]
["2017-03-21","Yanaki",82,{"$f":"_xlfn.TEXTJOIN(\"-\",,VLOOKUP(B528,$F$10:$I$18,{2,3,4}))","v":"Colorado Booms-81231-Y9634/2072"}]
["2017-02-17","Bellen",70,{"$f":"_xlfn.TEXTJOIN(\"-\",,VLOOKUP(B529,$F$10:$I$18,{2,3,4}))","v":"Gel Booms-94618-B4369/2593"}]
["2017-03-04","Yanaki",84,{"$f":"_xlfn.TEXTJOIN(\"-\",,VLOOKUP(B530,$F$10:$I$18,{2,3,4}))","v":"Colorado Booms-81231-Y9634/2072"}]
["2017-03-01","Aspen",99,{"$f":"_xlfn.TEXTJOIN(\"-\",,VLOOKUP(B531,$F$10:$I$18,{2,3,4}))","v":"Colorado Booms-81231-A9634/2650"}]
["2017-03-24","Yanaki",48,{"$f":"_xlfn.TEXTJOIN(\"-\",,VLOOKUP(B532,$F$10:$I$18,{2,3,4}))","v":"Colorado Booms-81231-Y9634/2072"}]
["2017-01-31","Quad",93,{"$f":"_xlfn.TEXTJOIN(\"-\",,VLOOKUP(B533,$F$10:$I$18,{2,3,4}))","v":"Gel Booms-94608-Q4369/2290"}]
["2017-01-15","Quad",66,{"$f":"_xlfn.TEXTJOIN(\"-\",,VLOOKUP(B534,$F$10:$I$18,{2,3,4}))","v":"Gel Booms-94608-Q4369/2290"}]
["2017-03-01","Yanaki",57,{"$f":"_xlfn.TEXTJOIN(\"-\",,VLOOKUP(B535,$F$10:$I$18,{2,3,4}))","v":"Colorado Booms-81231-Y9634/2072"}]
["2017-03-31","Carlota",24,{"$f":"_xlfn.TEXTJOIN(\"-\",,VLOOKUP(B536,$F$10:$I$18,{2,3,4}))","v":"Gel Booms-94608-C4369/2213"}]
["2017-02-19","Carlota",121,{"$f":"_xlfn.TEXTJOIN(\"-\",,VLOOKUP(B537,$F$10:$I$18,{2,3,4}))","v":"Gel Booms-94608-C4369/2213"}]
["2017-03-25","Bellen",91,{"$f":"_xlfn.TEXTJOIN(\"-\",,VLOOKUP(B538,$F$10:$I$18,{2,3,4}))","v":"Gel Booms-94618-B4369/2593"}]
["2017-02-25","TriBoom",87,{"$f":"_xlfn.TEXTJOIN(\"-\",,VLOOKUP(B539,$F$10:$I$18,{2,3,4}))","v":"Colorado Booms-90009-T9634/2372"}]
["2017-01-04","Yanaki",77,{"$f":"_xlfn.TEXTJOIN(\"-\",,VLOOKUP(B540,$F$10:$I$18,{2,3,4}))","v":"Colorado Booms-81231-Y9634/2072"}]
["2017-01-25","Sunshine",67,{"$f":"_xlfn.TEXTJOIN(\"-\",,VLOOKUP(B541,$F$10:$I$18,{2,3,4}))","v":"Gel Booms-94618-S4369/2297"}]
["2017-01-03","Bellen",102,{"$f":"_xlfn.TEXTJOIN(\"-\",,VLOOKUP(B542,$F$10:$I$18,{2,3,4}))","v":"Gel Booms-94618-B4369/2593"}]
["2017-01-01","Quad",72,{"$f":"_xlfn.TEXTJOIN(\"-\",,VLOOKUP(B543,$F$10:$I$18,{2,3,4}))","v":"Gel Booms-94608-Q4369/2290"}]
["2017-01-05","Sunbell",69,{"$f":"_xlfn.TEXTJOIN(\"-\",,VLOOKUP(B544,$F$10:$I$18,{2,3,4}))","v":"Gel Booms-94618-S4369/2241"}]
["2017-03-23","Sunshine",38,{"$f":"_xlfn.TEXTJOIN(\"-\",,VLOOKUP(B545,$F$10:$I$18,{2,3,4}))","v":"Gel Booms-94618-S4369/2297"}]
["2017-02-04","Aspen",69,{"$f":"_xlfn.TEXTJOIN(\"-\",,VLOOKUP(B546,$F$10:$I$18,{2,3,4}))","v":"Colorado Booms-81231-A9634/2650"}]
["2017-01-25","Bellen",64,{"$f":"_xlfn.TEXTJOIN(\"-\",,VLOOKUP(B547,$F$10:$I$18,{2,3,4}))","v":"Gel Booms-94618-B4369/2593"}]
["2017-01-28","TriBoom",35,{"$f":"_xlfn.TEXTJOIN(\"-\",,VLOOKUP(B548,$F$10:$I$18,{2,3,4}))","v":"Colorado Booms-90009-T9634/2372"}]
["2017-02-17","Sunbell",95,{"$f":"_xlfn.TEXTJOIN(\"-\",,VLOOKUP(B549,$F$10:$I$18,{2,3,4}))","v":"Gel Booms-94618-S4369/2241"}]
["2017-02-23","Carlota",83,{"$f":"_xlfn.TEXTJOIN(\"-\",,VLOOKUP(B550,$F$10:$I$18,{2,3,4}))","v":"Gel Booms-94608-C4369/2213"}]
["2017-03-12","Aspen",48,{"$f":"_xlfn.TEXTJOIN(\"-\",,VLOOKUP(B551,$F$10:$I$18,{2,3,4}))","v":"Colorado Booms-81231-A9634/2650"}]
["2017-02-07","Carlota",78,{"$f":"_xlfn.TEXTJOIN(\"-\",,VLOOKUP(B552,$F$10:$I$18,{2,3,4}))","v":"Gel Booms-94608-C4369/2213"}]
["2017-03-30","TriBoom",57,{"$f":"_xlfn.TEXTJOIN(\"-\",,VLOOKUP(B553,$F$10:$I$18,{2,3,4}))","v":"Colorado Booms-90009-T9634/2372"}]
["2017-02-21","Sunbell",84,{"$f":"_xlfn.TEXTJOIN(\"-\",,VLOOKUP(B554,$F$10:$I$18,{2,3,4}))","v":"Gel Booms-94618-S4369/2241"}]
["2017-01-23","Eagle",109,{"$f":"_xlfn.TEXTJOIN(\"-\",,VLOOKUP(B555,$F$10:$I$18,{2,3,4}))","v":"Colorado Booms-81231-E9634/2386"}]
["2017-02-15","TriBoom",46,{"$f":"_xlfn.TEXTJOIN(\"-\",,VLOOKUP(B556,$F$10:$I$18,{2,3,4}))","v":"Colorado Booms-90009-T9634/2372"}]
["2017-03-10","TriBoom",77,{"$f":"_xlfn.TEXTJOIN(\"-\",,VLOOKUP(B557,$F$10:$I$18,{2,3,4}))","v":"Colorado Booms-90009-T9634/2372"}]
["2017-03-17","Yanaki",97,{"$f":"_xlfn.TEXTJOIN(\"-\",,VLOOKUP(B558,$F$10:$I$18,{2,3,4}))","v":"Colorado Booms-81231-Y9634/2072"}]
["2017-01-24","Sunbell",89,{"$f":"_xlfn.TEXTJOIN(\"-\",,VLOOKUP(B559,$F$10:$I$18,{2,3,4}))","v":"Gel Booms-94618-S4369/2241"}]
["2017-03-22","Sunshine",56,{"$f":"_xlfn.TEXTJOIN(\"-\",,VLOOKUP(B560,$F$10:$I$18,{2,3,4}))","v":"Gel Booms-94618-S4369/2297"}]
["2017-02-16","Sunbell",77,{"$f":"_xlfn.TEXTJOIN(\"-\",,VLOOKUP(B561,$F$10:$I$18,{2,3,4}))","v":"Gel Booms-94618-S4369/2241"}]
["2017-01-25","Quad",72,{"$f":"_xlfn.TEXTJOIN(\"-\",,VLOOKUP(B562,$F$10:$I$18,{2,3,4}))","v":"Gel Booms-94608-Q4369/2290"}]
["2017-03-30","Sunshine",53,{"$f":"_xlfn.TEXTJOIN(\"-\",,VLOOKUP(B563,$F$10:$I$18,{2,3,4}))","v":"Gel Booms-94618-S4369/2297"}]
["2017-02-26","TriBoom",84,{"$f":"_xlfn.TEXTJOIN(\"-\",,VLOOKUP(B564,$F$10:$I$18,{2,3,4}))","v":"Colorado Booms-90009-T9634/2372"}]
["2017-01-04","Bellen",85,{"$f":"_xlfn.TEXTJOIN(\"-\",,VLOOKUP(B565,$F$10:$I$18,{2,3,4}))","v":"Gel Booms-94618-B4369/2593"}]
["2017-01-08","Sunbell",105,{"$f":"_xlfn.TEXTJOIN(\"-\",,VLOOKUP(B566,$F$10:$I$18,{2,3,4}))","v":"Gel Booms-94618-S4369/2241"}]
["2017-03-22","Sunbell",84,{"$f":"_xlfn.TEXTJOIN(\"-\",,VLOOKUP(B567,$F$10:$I$18,{2,3,4}))","v":"Gel Booms-94618-S4369/2241"}]
["2017-01-10","Eagle",98,{"$f":"_xlfn.TEXTJOIN(\"-\",,VLOOKUP(B568,$F$10:$I$18,{2,3,4}))","v":"Colorado Booms-81231-E9634/2386"}]
["2017-01-29","Eagle",73,{"$f":"_xlfn.TEXTJOIN(\"-\",,VLOOKUP(B569,$F$10:$I$18,{2,3,4}))","v":"Colorado Booms-81231-E9634/2386"}]
["2017-03-11","TriBoom",45,{"$f":"_xlfn.TEXTJOIN(\"-\",,VLOOKUP(B570,$F$10:$I$18,{2,3,4}))","v":"Colorado Booms-90009-T9634/2372"}]
["2017-02-02","Carlota",96,{"$f":"_xlfn.TEXTJOIN(\"-\",,VLOOKUP(B571,$F$10:$I$18,{2,3,4}))","v":"Gel Booms-94608-C4369/2213"}]
["2017-03-20","Bellen",80,{"$f":"_xlfn.TEXTJOIN(\"-\",,VLOOKUP(B572,$F$10:$I$18,{2,3,4}))","v":"Gel Booms-94618-B4369/2593"}]
["2017-02-15","Carlota",46,{"$f":"_xlfn.TEXTJOIN(\"-\",,VLOOKUP(B573,$F$10:$I$18,{2,3,4}))","v":"Gel Booms-94608-C4369/2213"}]
["2017-03-18","Yanaki",108,{"$f":"_xlfn.TEXTJOIN(\"-\",,VLOOKUP(B574,$F$10:$I$18,{2,3,4}))","v":"Colorado Booms-81231-Y9634/2072"}]
["2017-03-15","Sunshine",114,{"$f":"_xlfn.TEXTJOIN(\"-\",,VLOOKUP(B575,$F$10:$I$18,{2,3,4}))","v":"Gel Booms-94618-S4369/2297"}]
["2017-03-23","Quad",99,{"$f":"_xlfn.TEXTJOIN(\"-\",,VLOOKUP(B576,$F$10:$I$18,{2,3,4}))","v":"Gel Booms-94608-Q4369/2290"}]
["2017-01-21","Sunshine",46,{"$f":"_xlfn.TEXTJOIN(\"-\",,VLOOKUP(B577,$F$10:$I$18,{2,3,4}))","v":"Gel Booms-94618-S4369/2297"}]
["2017-02-01","Aspen",71,{"$f":"_xlfn.TEXTJOIN(\"-\",,VLOOKUP(B578,$F$10:$I$18,{2,3,4}))","v":"Colorado Booms-81231-A9634/2650"}]
["2017-03-01","Quad",88,{"$f":"_xlfn.TEXTJOIN(\"-\",,VLOOKUP(B579,$F$10:$I$18,{2,3,4}))","v":"Gel Booms-94608-Q4369/2290"}]
["2017-03-23","TriBoom",79,{"$f":"_xlfn.TEXTJOIN(\"-\",,VLOOKUP(B580,$F$10:$I$18,{2,3,4}))","v":"Colorado Booms-90009-T9634/2372"}]
["2017-03-29","Bellen",35,{"$f":"_xlfn.TEXTJOIN(\"-\",,VLOOKUP(B581,$F$10:$I$18,{2,3,4}))","v":"Gel Booms-94618-B4369/2593"}]
["2017-02-07","Yanaki",61,{"$f":"_xlfn.TEXTJOIN(\"-\",,VLOOKUP(B582,$F$10:$I$18,{2,3,4}))","v":"Colorado Booms-81231-Y9634/2072"}]
["2017-02-25","Aspen",59,{"$f":"_xlfn.TEXTJOIN(\"-\",,VLOOKUP(B583,$F$10:$I$18,{2,3,4}))","v":"Colorado Booms-81231-A9634/2650"}]
["2017-02-16","Sunbell",112,{"$f":"_xlfn.TEXTJOIN(\"-\",,VLOOKUP(B584,$F$10:$I$18,{2,3,4}))","v":"Gel Booms-94618-S4369/2241"}]
["2017-02-01","Bellen",69,{"$f":"_xlfn.TEXTJOIN(\"-\",,VLOOKUP(B585,$F$10:$I$18,{2,3,4}))","v":"Gel Booms-94618-B4369/2593"}]
["2017-02-04","Quad",110,{"$f":"_xlfn.TEXTJOIN(\"-\",,VLOOKUP(B586,$F$10:$I$18,{2,3,4}))","v":"Gel Booms-94608-Q4369/2290"}]
["2017-03-22","Sunbell",90,{"$f":"_xlfn.TEXTJOIN(\"-\",,VLOOKUP(B587,$F$10:$I$18,{2,3,4}))","v":"Gel Booms-94618-S4369/2241"}]
["2017-03-29","Aspen",94,{"$f":"_xlfn.TEXTJOIN(\"-\",,VLOOKUP(B588,$F$10:$I$18,{2,3,4}))","v":"Colorado Booms-81231-A9634/2650"}]
["2017-01-24","Eagle",85,{"$f":"_xlfn.TEXTJOIN(\"-\",,VLOOKUP(B589,$F$10:$I$18,{2,3,4}))","v":"Colorado Booms-81231-E9634/2386"}]
["2017-01-21","TriBoom",62,{"$f":"_xlfn.TEXTJOIN(\"-\",,VLOOKUP(B590,$F$10:$I$18,{2,3,4}))","v":"Colorado Booms-90009-T9634/2372"}]
["2017-02-26","Yanaki",109,{"$f":"_xlfn.TEXTJOIN(\"-\",,VLOOKUP(B591,$F$10:$I$18,{2,3,4}))","v":"Colorado Booms-81231-Y9634/2072"}]
["2017-02-11","Sunshine",63,{"$f":"_xlfn.TEXTJOIN(\"-\",,VLOOKUP(B592,$F$10:$I$18,{2,3,4}))","v":"Gel Booms-94618-S4369/2297"}]
["2017-01-31","Carlota",60,{"$f":"_xlfn.TEXTJOIN(\"-\",,VLOOKUP(B593,$F$10:$I$18,{2,3,4}))","v":"Gel Booms-94608-C4369/2213"}]
["2017-01-03","Eagle",107,{"$f":"_xlfn.TEXTJOIN(\"-\",,VLOOKUP(B594,$F$10:$I$18,{2,3,4}))","v":"Colorado Booms-81231-E9634/2386"}]
["2017-02-05","Sunshine",69,{"$f":"_xlfn.TEXTJOIN(\"-\",,VLOOKUP(B595,$F$10:$I$18,{2,3,4}))","v":"Gel Booms-94618-S4369/2297"}]
["2017-02-20","Yanaki",81,{"$f":"_xlfn.TEXTJOIN(\"-\",,VLOOKUP(B596,$F$10:$I$18,{2,3,4}))","v":"Colorado Booms-81231-Y9634/2072"}]
["2017-03-04","Yanaki",89,{"$f":"_xlfn.TEXTJOIN(\"-\",,VLOOKUP(B597,$F$10:$I$18,{2,3,4}))","v":"Colorado Booms-81231-Y9634/2072"}]
["2017-02-13","TriBoom",48,{"$f":"_xlfn.TEXTJOIN(\"-\",,VLOOKUP(B598,$F$10:$I$18,{2,3,4}))","v":"Colorado Booms-90009-T9634/2372"}]
["2017-01-10","Carlota",36,{"$f":"_xlfn.TEXTJOIN(\"-\",,VLOOKUP(B599,$F$10:$I$18,{2,3,4}))","v":"Gel Booms-94608-C4369/2213"}]
["2017-02-24","Yanaki",78,{"$f":"_xlfn.TEXTJOIN(\"-\",,VLOOKUP(B600,$F$10:$I$18,{2,3,4}))","v":"Colorado Booms-81231-Y9634/2072"}]
["2017-01-11","Aspen",58,{"$f":"_xlfn.TEXTJOIN(\"-\",,VLOOKUP(B601,$F$10:$I$18,{2,3,4}))","v":"Colorado Booms-81231-A9634/2650"}]
["2017-01-19","Yanaki",105,{"$f":"_xlfn.TEXTJOIN(\"-\",,VLOOKUP(B602,$F$10:$I$18,{2,3,4}))","v":"Colorado Booms-81231-Y9634/2072"}]
["2017-02-05","Aspen",94,{"$f":"_xlfn.TEXTJOIN(\"-\",,VLOOKUP(B603,$F$10:$I$18,{2,3,4}))","v":"Colorado Booms-81231-A9634/2650"}]
["2017-01-18","Eagle",80,{"$f":"_xlfn.TEXTJOIN(\"-\",,VLOOKUP(B604,$F$10:$I$18,{2,3,4}))","v":"Colorado Booms-81231-E9634/2386"}]
["2017-02-21","Carlota",47,{"$f":"_xlfn.TEXTJOIN(\"-\",,VLOOKUP(B605,$F$10:$I$18,{2,3,4}))","v":"Gel Booms-94608-C4369/2213"}]
["2017-02-22","TriBoom",103,{"$f":"_xlfn.TEXTJOIN(\"-\",,VLOOKUP(B606,$F$10:$I$18,{2,3,4}))","v":"Colorado Booms-90009-T9634/2372"}]
["2017-02-14","Bellen",50,{"$f":"_xlfn.TEXTJOIN(\"-\",,VLOOKUP(B607,$F$10:$I$18,{2,3,4}))","v":"Gel Booms-94618-B4369/2593"}]
["2017-02-01","Aspen",101,{"$f":"_xlfn.TEXTJOIN(\"-\",,VLOOKUP(B608,$F$10:$I$18,{2,3,4}))","v":"Colorado Booms-81231-A9634/2650"}]
["2017-01-29","Sunshine",78,{"$f":"_xlfn.TEXTJOIN(\"-\",,VLOOKUP(B609,$F$10:$I$18,{2,3,4}))","v":"Gel Booms-94618-S4369/2297"}]
["2017-03-24","Sunbell",74,{"$f":"_xlfn.TEXTJOIN(\"-\",,VLOOKUP(B610,$F$10:$I$18,{2,3,4}))","v":"Gel Booms-94618-S4369/2241"}]
["2017-01-02","Bellen",80,{"$f":"_xlfn.TEXTJOIN(\"-\",,VLOOKUP(B611,$F$10:$I$18,{2,3,4}))","v":"Gel Booms-94618-B4369/2593"}]
["2017-02-06","Bellen",103,{"$f":"_xlfn.TEXTJOIN(\"-\",,VLOOKUP(B612,$F$10:$I$18,{2,3,4}))","v":"Gel Booms-94618-B4369/2593"}]
["2017-02-09","Carlota",106,{"$f":"_xlfn.TEXTJOIN(\"-\",,VLOOKUP(B613,$F$10:$I$18,{2,3,4}))","v":"Gel Booms-94608-C4369/2213"}]
["2017-02-12","Quad",62,{"$f":"_xlfn.TEXTJOIN(\"-\",,VLOOKUP(B614,$F$10:$I$18,{2,3,4}))","v":"Gel Booms-94608-Q4369/2290"}]
["2017-02-08","Aspen",90,{"$f":"_xlfn.TEXTJOIN(\"-\",,VLOOKUP(B615,$F$10:$I$18,{2,3,4}))","v":"Colorado Booms-81231-A9634/2650"}]
["2017-01-22","Bellen",37,{"$f":"_xlfn.TEXTJOIN(\"-\",,VLOOKUP(B616,$F$10:$I$18,{2,3,4}))","v":"Gel Booms-94618-B4369/2593"}]
["2017-03-16","Carlota",64,{"$f":"_xlfn.TEXTJOIN(\"-\",,VLOOKUP(B617,$F$10:$I$18,{2,3,4}))","v":"Gel Booms-94608-C4369/2213"}]
["2017-03-11","Aspen",128,{"$f":"_xlfn.TEXTJOIN(\"-\",,VLOOKUP(B618,$F$10:$I$18,{2,3,4}))","v":"Colorado Booms-81231-A9634/2650"}]
["2017-01-24","TriBoom",80,{"$f":"_xlfn.TEXTJOIN(\"-\",,VLOOKUP(B619,$F$10:$I$18,{2,3,4}))","v":"Colorado Booms-90009-T9634/2372"}]
["2017-02-28","Yanaki",106,{"$f":"_xlfn.TEXTJOIN(\"-\",,VLOOKUP(B620,$F$10:$I$18,{2,3,4}))","v":"Colorado Booms-81231-Y9634/2072"}]
["2017-02-02","Quad",71,{"$f":"_xlfn.TEXTJOIN(\"-\",,VLOOKUP(B621,$F$10:$I$18,{2,3,4}))","v":"Gel Booms-94608-Q4369/2290"}]
["2017-02-08","TriBoom",68,{"$f":"_xlfn.TEXTJOIN(\"-\",,VLOOKUP(B622,$F$10:$I$18,{2,3,4}))","v":"Colorado Booms-90009-T9634/2372"}]
["2017-03-09","Sunbell",78,{"$f":"_xlfn.TEXTJOIN(\"-\",,VLOOKUP(B623,$F$10:$I$18,{2,3,4}))","v":"Gel Booms-94618-S4369/2241"}]
["2017-03-16","TriBoom",107,{"$f":"_xlfn.TEXTJOIN(\"-\",,VLOOKUP(B624,$F$10:$I$18,{2,3,4}))","v":"Colorado Booms-90009-T9634/2372"}]
["2017-02-26","Bellen",82,{"$f":"_xlfn.TEXTJOIN(\"-\",,VLOOKUP(B625,$F$10:$I$18,{2,3,4}))","v":"Gel Booms-94618-B4369/2593"}]
["2017-01-23","Yanaki",115,{"$f":"_xlfn.TEXTJOIN(\"-\",,VLOOKUP(B626,$F$10:$I$18,{2,3,4}))","v":"Colorado Booms-81231-Y9634/2072"}]
["2017-01-07","Carlota",69,{"$f":"_xlfn.TEXTJOIN(\"-\",,VLOOKUP(B627,$F$10:$I$18,{2,3,4}))","v":"Gel Booms-94608-C4369/2213"}]
["2017-01-29","Eagle",99,{"$f":"_xlfn.TEXTJOIN(\"-\",,VLOOKUP(B628,$F$10:$I$18,{2,3,4}))","v":"Colorado Booms-81231-E9634/2386"}]
["2017-02-27","Sunbell",93,{"$f":"_xlfn.TEXTJOIN(\"-\",,VLOOKUP(B629,$F$10:$I$18,{2,3,4}))","v":"Gel Booms-94618-S4369/2241"}]
["2017-01-19","Carlota",92,{"$f":"_xlfn.TEXTJOIN(\"-\",,VLOOKUP(B630,$F$10:$I$18,{2,3,4}))","v":"Gel Booms-94608-C4369/2213"}]
["2017-02-20","TriBoom",21,{"$f":"_xlfn.TEXTJOIN(\"-\",,VLOOKUP(B631,$F$10:$I$18,{2,3,4}))","v":"Colorado Booms-90009-T9634/2372"}]
["2017-03-07","Aspen",67,{"$f":"_xlfn.TEXTJOIN(\"-\",,VLOOKUP(B632,$F$10:$I$18,{2,3,4}))","v":"Colorado Booms-81231-A9634/2650"}]
["2017-03-01","Carlota",63,{"$f":"_xlfn.TEXTJOIN(\"-\",,VLOOKUP(B633,$F$10:$I$18,{2,3,4}))","v":"Gel Booms-94608-C4369/2213"}]
["2017-03-11","Sunbell",65,{"$f":"_xlfn.TEXTJOIN(\"-\",,VLOOKUP(B634,$F$10:$I$18,{2,3,4}))","v":"Gel Booms-94618-S4369/2241"}]
["2017-02-05","Eagle",102,{"$f":"_xlfn.TEXTJOIN(\"-\",,VLOOKUP(B635,$F$10:$I$18,{2,3,4}))","v":"Colorado Booms-81231-E9634/2386"}]
["2017-02-07","Quad",90,{"$f":"_xlfn.TEXTJOIN(\"-\",,VLOOKUP(B636,$F$10:$I$18,{2,3,4}))","v":"Gel Booms-94608-Q4369/2290"}]
["2017-03-01","Sunbell",78,{"$f":"_xlfn.TEXTJOIN(\"-\",,VLOOKUP(B637,$F$10:$I$18,{2,3,4}))","v":"Gel Booms-94618-S4369/2241"}]
["2017-03-02","Carlota",74,{"$f":"_xlfn.TEXTJOIN(\"-\",,VLOOKUP(B638,$F$10:$I$18,{2,3,4}))","v":"Gel Booms-94608-C4369/2213"}]
["2017-02-07","TriBoom",82,{"$f":"_xlfn.TEXTJOIN(\"-\",,VLOOKUP(B639,$F$10:$I$18,{2,3,4}))","v":"Colorado Booms-90009-T9634/2372"}]
["2017-02-08","Aspen",75,{"$f":"_xlfn.TEXTJOIN(\"-\",,VLOOKUP(B640,$F$10:$I$18,{2,3,4}))","v":"Colorado Booms-81231-A9634/2650"}]
["2017-02-22","Eagle",113,{"$f":"_xlfn.TEXTJOIN(\"-\",,VLOOKUP(B641,$F$10:$I$18,{2,3,4}))","v":"Colorado Booms-81231-E9634/2386"}]
["2017-01-12","Sunshine",94,{"$f":"_xlfn.TEXTJOIN(\"-\",,VLOOKUP(B642,$F$10:$I$18,{2,3,4}))","v":"Gel Booms-94618-S4369/2297"}]
["2017-01-05","Carlota",80,{"$f":"_xlfn.TEXTJOIN(\"-\",,VLOOKUP(B643,$F$10:$I$18,{2,3,4}))","v":"Gel Booms-94608-C4369/2213"}]
["2017-01-23","Yanaki",72,{"$f":"_xlfn.TEXTJOIN(\"-\",,VLOOKUP(B644,$F$10:$I$18,{2,3,4}))","v":"Colorado Booms-81231-Y9634/2072"}]
["2017-01-31","Carlota",79,{"$f":"_xlfn.TEXTJOIN(\"-\",,VLOOKUP(B645,$F$10:$I$18,{2,3,4}))","v":"Gel Booms-94608-C4369/2213"}]
["2017-01-22","TriBoom",94,{"$f":"_xlfn.TEXTJOIN(\"-\",,VLOOKUP(B646,$F$10:$I$18,{2,3,4}))","v":"Colorado Booms-90009-T9634/2372"}]
["2017-03-07","Carlota",37,{"$f":"_xlfn.TEXTJOIN(\"-\",,VLOOKUP(B647,$F$10:$I$18,{2,3,4}))","v":"Gel Booms-94608-C4369/2213"}]
["2017-01-15","Quad",88,{"$f":"_xlfn.TEXTJOIN(\"-\",,VLOOKUP(B648,$F$10:$I$18,{2,3,4}))","v":"Gel Booms-94608-Q4369/2290"}]
["2017-02-16","TriBoom",113,{"$f":"_xlfn.TEXTJOIN(\"-\",,VLOOKUP(B649,$F$10:$I$18,{2,3,4}))","v":"Colorado Booms-90009-T9634/2372"}]
["2017-01-01","Sunshine",97,{"$f":"_xlfn.TEXTJOIN(\"-\",,VLOOKUP(B650,$F$10:$I$18,{2,3,4}))","v":"Gel Booms-94618-S4369/2297"}]
["2017-01-21","Bellen",44,{"$f":"_xlfn.TEXTJOIN(\"-\",,VLOOKUP(B651,$F$10:$I$18,{2,3,4}))","v":"Gel Booms-94618-B4369/2593"}]
["2017-02-10","Carlota",59,{"$f":"_xlfn.TEXTJOIN(\"-\",,VLOOKUP(B652,$F$10:$I$18,{2,3,4}))","v":"Gel Booms-94608-C4369/2213"}]
["2017-02-27","Aspen",75,{"$f":"_xlfn.TEXTJOIN(\"-\",,VLOOKUP(B653,$F$10:$I$18,{2,3,4}))","v":"Colorado Booms-81231-A9634/2650"}]
["2017-01-14","Aspen",96,{"$f":"_xlfn.TEXTJOIN(\"-\",,VLOOKUP(B654,$F$10:$I$18,{2,3,4}))","v":"Colorado Booms-81231-A9634/2650"}]
["2017-01-17","Sunbell",96,{"$f":"_xlfn.TEXTJOIN(\"-\",,VLOOKUP(B655,$F$10:$I$18,{2,3,4}))","v":"Gel Booms-94618-S4369/2241"}]
["2017-01-14","Eagle",69,{"$f":"_xlfn.TEXTJOIN(\"-\",,VLOOKUP(B656,$F$10:$I$18,{2,3,4}))","v":"Colorado Booms-81231-E9634/2386"}]
["2017-03-05","TriBoom",131,{"$f":"_xlfn.TEXTJOIN(\"-\",,VLOOKUP(B657,$F$10:$I$18,{2,3,4}))","v":"Colorado Booms-90009-T9634/2372"}]
["2017-02-02","Carlota",96,{"$f":"_xlfn.TEXTJOIN(\"-\",,VLOOKUP(B658,$F$10:$I$18,{2,3,4}))","v":"Gel Booms-94608-C4369/2213"}]
["2017-03-26","Sunbell",114,{"$f":"_xlfn.TEXTJOIN(\"-\",,VLOOKUP(B659,$F$10:$I$18,{2,3,4}))","v":"Gel Booms-94618-S4369/2241"}]
["2017-02-20","Carlota",97,{"$f":"_xlfn.TEXTJOIN(\"-\",,VLOOKUP(B660,$F$10:$I$18,{2,3,4}))","v":"Gel Booms-94608-C4369/2213"}]
["2017-01-23","TriBoom",73,{"$f":"_xlfn.TEXTJOIN(\"-\",,VLOOKUP(B661,$F$10:$I$18,{2,3,4}))","v":"Colorado Booms-90009-T9634/2372"}]
["2017-02-12","TriBoom",106,{"$f":"_xlfn.TEXTJOIN(\"-\",,VLOOKUP(B662,$F$10:$I$18,{2,3,4}))","v":"Colorado Booms-90009-T9634/2372"}]
["2017-02-22","Quad",120,{"$f":"_xlfn.TEXTJOIN(\"-\",,VLOOKUP(B663,$F$10:$I$18,{2,3,4}))","v":"Gel Booms-94608-Q4369/2290"}]
["2017-03-05","Quad",74,{"$f":"_xlfn.TEXTJOIN(\"-\",,VLOOKUP(B664,$F$10:$I$18,{2,3,4}))","v":"Gel Booms-94608-Q4369/2290"}]
["2017-02-21","Aspen",67,{"$f":"_xlfn.TEXTJOIN(\"-\",,VLOOKUP(B665,$F$10:$I$18,{2,3,4}))","v":"Colorado Booms-81231-A9634/2650"}]
["2017-03-14","TriBoom",95,{"$f":"_xlfn.TEXTJOIN(\"-\",,VLOOKUP(B666,$F$10:$I$18,{2,3,4}))","v":"Colorado Booms-90009-T9634/2372"}]
["2017-01-17","Sunbell",58,{"$f":"_xlfn.TEXTJOIN(\"-\",,VLOOKUP(B667,$F$10:$I$18,{2,3,4}))","v":"Gel Booms-94618-S4369/2241"}]
["2017-01-17","Sunbell",87,{"$f":"_xlfn.TEXTJOIN(\"-\",,VLOOKUP(B668,$F$10:$I$18,{2,3,4}))","v":"Gel Booms-94618-S4369/2241"}]
["2017-01-16","Quad",41,{"$f":"_xlfn.TEXTJOIN(\"-\",,VLOOKUP(B669,$F$10:$I$18,{2,3,4}))","v":"Gel Booms-94608-Q4369/2290"}]
["2017-02-25","Bellen",62,{"$f":"_xlfn.TEXTJOIN(\"-\",,VLOOKUP(B670,$F$10:$I$18,{2,3,4}))","v":"Gel Booms-94618-B4369/2593"}]
["2017-01-17","TriBoom",88,{"$f":"_xlfn.TEXTJOIN(\"-\",,VLOOKUP(B671,$F$10:$I$18,{2,3,4}))","v":"Colorado Booms-90009-T9634/2372"}]
["2017-03-27","Sunbell",59,{"$f":"_xlfn.TEXTJOIN(\"-\",,VLOOKUP(B672,$F$10:$I$18,{2,3,4}))","v":"Gel Booms-94618-S4369/2241"}]
["2017-03-15","Yanaki",78,{"$f":"_xlfn.TEXTJOIN(\"-\",,VLOOKUP(B673,$F$10:$I$18,{2,3,4}))","v":"Colorado Booms-81231-Y9634/2072"}]
["2017-01-09","Aspen",61,{"$f":"_xlfn.TEXTJOIN(\"-\",,VLOOKUP(B674,$F$10:$I$18,{2,3,4}))","v":"Colorado Booms-81231-A9634/2650"}]
["2017-01-28","Quad",109,{"$f":"_xlfn.TEXTJOIN(\"-\",,VLOOKUP(B675,$F$10:$I$18,{2,3,4}))","v":"Gel Booms-94608-Q4369/2290"}]
["2017-01-10","Yanaki",51,{"$f":"_xlfn.TEXTJOIN(\"-\",,VLOOKUP(B676,$F$10:$I$18,{2,3,4}))","v":"Colorado Booms-81231-Y9634/2072"}]
["2017-01-06","Bellen",47,{"$f":"_xlfn.TEXTJOIN(\"-\",,VLOOKUP(B677,$F$10:$I$18,{2,3,4}))","v":"Gel Booms-94618-B4369/2593"}]
["2017-02-22","TriBoom",94,{"$f":"_xlfn.TEXTJOIN(\"-\",,VLOOKUP(B678,$F$10:$I$18,{2,3,4}))","v":"Colorado Booms-90009-T9634/2372"}]
["2017-02-23","Quad",99,{"$f":"_xlfn.TEXTJOIN(\"-\",,VLOOKUP(B679,$F$10:$I$18,{2,3,4}))","v":"Gel Booms-94608-Q4369/2290"}]
["2017-01-11","Aspen",57,{"$f":"_xlfn.TEXTJOIN(\"-\",,VLOOKUP(B680,$F$10:$I$18,{2,3,4}))","v":"Colorado Booms-81231-A9634/2650"}]
["2017-03-04","Quad",58,{"$f":"_xlfn.TEXTJOIN(\"-\",,VLOOKUP(B681,$F$10:$I$18,{2,3,4}))","v":"Gel Booms-94608-Q4369/2290"}]
["2017-01-07","Eagle",89,{"$f":"_xlfn.TEXTJOIN(\"-\",,VLOOKUP(B682,$F$10:$I$18,{2,3,4}))","v":"Colorado Booms-81231-E9634/2386"}]
["2017-01-09","Bellen",80,{"$f":"_xlfn.TEXTJOIN(\"-\",,VLOOKUP(B683,$F$10:$I$18,{2,3,4}))","v":"Gel Booms-94618-B4369/2593"}]
["2017-03-30","TriBoom",60,{"$f":"_xlfn.TEXTJOIN(\"-\",,VLOOKUP(B684,$F$10:$I$18,{2,3,4}))","v":"Colorado Booms-90009-T9634/2372"}]
["2017-03-30","Aspen",25,{"$f":"_xlfn.TEXTJOIN(\"-\",,VLOOKUP(B685,$F$10:$I$18,{2,3,4}))","v":"Colorado Booms-81231-A9634/2650"}]
["2017-03-18","Aspen",74,{"$f":"_xlfn.TEXTJOIN(\"-\",,VLOOKUP(B686,$F$10:$I$18,{2,3,4}))","v":"Colorado Booms-81231-A9634/2650"}]
["2017-02-27","Bellen",88,{"$f":"_xlfn.TEXTJOIN(\"-\",,VLOOKUP(B687,$F$10:$I$18,{2,3,4}))","v":"Gel Booms-94618-B4369/2593"}]
["2017-03-18","Aspen",125,{"$f":"_xlfn.TEXTJOIN(\"-\",,VLOOKUP(B688,$F$10:$I$18,{2,3,4}))","v":"Colorado Booms-81231-A9634/2650"}]
["2017-03-22","Eagle",88,{"$f":"_xlfn.TEXTJOIN(\"-\",,VLOOKUP(B689,$F$10:$I$18,{2,3,4}))","v":"Colorado Booms-81231-E9634/2386"}]
["2017-01-16","Aspen",80,{"$f":"_xlfn.TEXTJOIN(\"-\",,VLOOKUP(B690,$F$10:$I$18,{2,3,4}))","v":"Colorado Booms-81231-A9634/2650"}]
["2017-02-11","Quad",89,{"$f":"_xlfn.TEXTJOIN(\"-\",,VLOOKUP(B691,$F$10:$I$18,{2,3,4}))","v":"Gel Booms-94608-Q4369/2290"}]
["2017-02-25","TriBoom",100,{"$f":"_xlfn.TEXTJOIN(\"-\",,VLOOKUP(B692,$F$10:$I$18,{2,3,4}))","v":"Colorado Booms-90009-T9634/2372"}]
["2017-03-09","Sunbell",51,{"$f":"_xlfn.TEXTJOIN(\"-\",,VLOOKUP(B693,$F$10:$I$18,{2,3,4}))","v":"Gel Booms-94618-S4369/2241"}]
["2017-01-05","Quad",119,{"$f":"_xlfn.TEXTJOIN(\"-\",,VLOOKUP(B694,$F$10:$I$18,{2,3,4}))","v":"Gel Booms-94608-Q4369/2290"}]
["2017-02-24","Carlota",58,{"$f":"_xlfn.TEXTJOIN(\"-\",,VLOOKUP(B695,$F$10:$I$18,{2,3,4}))","v":"Gel Booms-94608-C4369/2213"}]
["2017-02-03","Bellen",32,{"$f":"_xlfn.TEXTJOIN(\"-\",,VLOOKUP(B696,$F$10:$I$18,{2,3,4}))","v":"Gel Booms-94618-B4369/2593"}]
["2017-01-11","Carlota",60,{"$f":"_xlfn.TEXTJOIN(\"-\",,VLOOKUP(B697,$F$10:$I$18,{2,3,4}))","v":"Gel Booms-94608-C4369/2213"}]
["2017-03-07","Sunbell",89,{"$f":"_xlfn.TEXTJOIN(\"-\",,VLOOKUP(B698,$F$10:$I$18,{2,3,4}))","v":"Gel Booms-94618-S4369/2241"}]
["2017-02-11","Quad",58,{"$f":"_xlfn.TEXTJOIN(\"-\",,VLOOKUP(B699,$F$10:$I$18,{2,3,4}))","v":"Gel Booms-94608-Q4369/2290"}]
["2017-01-14","TriBoom",79,{"$f":"_xlfn.TEXTJOIN(\"-\",,VLOOKUP(B700,$F$10:$I$18,{2,3,4}))","v":"Colorado Booms-90009-T9634/2372"}]
["2017-03-21","Aspen",51,{"$f":"_xlfn.TEXTJOIN(\"-\",,VLOOKUP(B701,$F$10:$I$18,{2,3,4}))","v":"Colorado Booms-81231-A9634/2650"}]
["2017-01-17","Sunshine",109,{"$f":"_xlfn.TEXTJOIN(\"-\",,VLOOKUP(B702,$F$10:$I$18,{2,3,4}))","v":"Gel Booms-94618-S4369/2297"}]
["2017-03-19","Sunshine",65,{"$f":"_xlfn.TEXTJOIN(\"-\",,VLOOKUP(B703,$F$10:$I$18,{2,3,4}))","v":"Gel Booms-94618-S4369/2297"}]
["2017-01-05","Sunshine",78,{"$f":"_xlfn.TEXTJOIN(\"-\",,VLOOKUP(B704,$F$10:$I$18,{2,3,4}))","v":"Gel Booms-94618-S4369/2297"}]
["2017-01-13","Carlota",59,{"$f":"_xlfn.TEXTJOIN(\"-\",,VLOOKUP(B705,$F$10:$I$18,{2,3,4}))","v":"Gel Booms-94608-C4369/2213"}]
["2017-02-21","Carlota",63,{"$f":"_xlfn.TEXTJOIN(\"-\",,VLOOKUP(B706,$F$10:$I$18,{2,3,4}))","v":"Gel Booms-94608-C4369/2213"}]
["2017-02-03","Bellen",78,{"$f":"_xlfn.TEXTJOIN(\"-\",,VLOOKUP(B707,$F$10:$I$18,{2,3,4}))","v":"Gel Booms-94618-B4369/2593"}]
["2017-01-17","Eagle",84,{"$f":"_xlfn.TEXTJOIN(\"-\",,VLOOKUP(B708,$F$10:$I$18,{2,3,4}))","v":"Colorado Booms-81231-E9634/2386"}]
["2017-02-26","Yanaki",109,{"$f":"_xlfn.TEXTJOIN(\"-\",,VLOOKUP(B709,$F$10:$I$18,{2,3,4}))","v":"Colorado Booms-81231-Y9634/2072"}]
["2017-03-30","Quad",48,{"$f":"_xlfn.TEXTJOIN(\"-\",,VLOOKUP(B710,$F$10:$I$18,{2,3,4}))","v":"Gel Booms-94608-Q4369/2290"}]
["2017-03-01","TriBoom",88,{"$f":"_xlfn.TEXTJOIN(\"-\",,VLOOKUP(B711,$F$10:$I$18,{2,3,4}))","v":"Colorado Booms-90009-T9634/2372"}]
["2017-02-13","Aspen",101,{"$f":"_xlfn.TEXTJOIN(\"-\",,VLOOKUP(B712,$F$10:$I$18,{2,3,4}))","v":"Colorado Booms-81231-A9634/2650"}]
["2017-01-14","Sunbell",56,{"$f":"_xlfn.TEXTJOIN(\"-\",,VLOOKUP(B713,$F$10:$I$18,{2,3,4}))","v":"Gel Booms-94618-S4369/2241"}]
["2017-01-10","Eagle",73,{"$f":"_xlfn.TEXTJOIN(\"-\",,VLOOKUP(B714,$F$10:$I$18,{2,3,4}))","v":"Colorado Booms-81231-E9634/2386"}]
["2017-03-13","Carlota",79,{"$f":"_xlfn.TEXTJOIN(\"-\",,VLOOKUP(B715,$F$10:$I$18,{2,3,4}))","v":"Gel Booms-94608-C4369/2213"}]
["2017-02-24","Eagle",60,{"$f":"_xlfn.TEXTJOIN(\"-\",,VLOOKUP(B716,$F$10:$I$18,{2,3,4}))","v":"Colorado Booms-81231-E9634/2386"}]
["2017-03-29","Aspen",77,{"$f":"_xlfn.TEXTJOIN(\"-\",,VLOOKUP(B717,$F$10:$I$18,{2,3,4}))","v":"Colorado Booms-81231-A9634/2650"}]
["2017-01-07","Quad",69,{"$f":"_xlfn.TEXTJOIN(\"-\",,VLOOKUP(B718,$F$10:$I$18,{2,3,4}))","v":"Gel Booms-94608-Q4369/2290"}]
["2017-01-05","Sunbell",83,{"$f":"_xlfn.TEXTJOIN(\"-\",,VLOOKUP(B719,$F$10:$I$18,{2,3,4}))","v":"Gel Booms-94618-S4369/2241"}]
["2017-02-13","Aspen",87,{"$f":"_xlfn.TEXTJOIN(\"-\",,VLOOKUP(B720,$F$10:$I$18,{2,3,4}))","v":"Colorado Booms-81231-A9634/2650"}]
["2017-03-26","Sunbell",94,{"$f":"_xlfn.TEXTJOIN(\"-\",,VLOOKUP(B721,$F$10:$I$18,{2,3,4}))","v":"Gel Booms-94618-S4369/2241"}]
["2017-01-24","Bellen",106,{"$f":"_xlfn.TEXTJOIN(\"-\",,VLOOKUP(B722,$F$10:$I$18,{2,3,4}))","v":"Gel Booms-94618-B4369/2593"}]
["2017-01-28","Eagle",65,{"$f":"_xlfn.TEXTJOIN(\"-\",,VLOOKUP(B723,$F$10:$I$18,{2,3,4}))","v":"Colorado Booms-81231-E9634/2386"}]
["2017-01-08","Yanaki",107,{"$f":"_xlfn.TEXTJOIN(\"-\",,VLOOKUP(B724,$F$10:$I$18,{2,3,4}))","v":"Colorado Booms-81231-Y9634/2072"}]
["2017-03-04","Quad",91,{"$f":"_xlfn.TEXTJOIN(\"-\",,VLOOKUP(B725,$F$10:$I$18,{2,3,4}))","v":"Gel Booms-94608-Q4369/2290"}]
["2017-03-29","TriBoom",58,{"$f":"_xlfn.TEXTJOIN(\"-\",,VLOOKUP(B726,$F$10:$I$18,{2,3,4}))","v":"Colorado Booms-90009-T9634/2372"}]
["2017-01-23","Quad",87,{"$f":"_xlfn.TEXTJOIN(\"-\",,VLOOKUP(B727,$F$10:$I$18,{2,3,4}))","v":"Gel Booms-94608-Q4369/2290"}]
["2017-03-22","TriBoom",146,{"$f":"_xlfn.TEXTJOIN(\"-\",,VLOOKUP(B728,$F$10:$I$18,{2,3,4}))","v":"Colorado Booms-90009-T9634/2372"}]
["2017-03-14","Bellen",116,{"$f":"_xlfn.TEXTJOIN(\"-\",,VLOOKUP(B729,$F$10:$I$18,{2,3,4}))","v":"Gel Booms-94618-B4369/2593"}]
["2017-01-29","Aspen",66,{"$f":"_xlfn.TEXTJOIN(\"-\",,VLOOKUP(B730,$F$10:$I$18,{2,3,4}))","v":"Colorado Booms-81231-A9634/2650"}]
["2017-01-22","Bellen",60,{"$f":"_xlfn.TEXTJOIN(\"-\",,VLOOKUP(B731,$F$10:$I$18,{2,3,4}))","v":"Gel Booms-94618-B4369/2593"}]
["2017-01-28","Sunshine",92,{"$f":"_xlfn.TEXTJOIN(\"-\",,VLOOKUP(B732,$F$10:$I$18,{2,3,4}))","v":"Gel Booms-94618-S4369/2297"}]
["2017-02-17","Quad",26,{"$f":"_xlfn.TEXTJOIN(\"-\",,VLOOKUP(B733,$F$10:$I$18,{2,3,4}))","v":"Gel Booms-94608-Q4369/2290"}]
["2017-01-16","Eagle",83,{"$f":"_xlfn.TEXTJOIN(\"-\",,VLOOKUP(B734,$F$10:$I$18,{2,3,4}))","v":"Colorado Booms-81231-E9634/2386"}]
["2017-03-25","TriBoom",38,{"$f":"_xlfn.TEXTJOIN(\"-\",,VLOOKUP(B735,$F$10:$I$18,{2,3,4}))","v":"Colorado Booms-90009-T9634/2372"}]
["2017-01-03","Eagle",53,{"$f":"_xlfn.TEXTJOIN(\"-\",,VLOOKUP(B736,$F$10:$I$18,{2,3,4}))","v":"Colorado Booms-81231-E9634/2386"}]
["2017-02-20","Carlota",18,{"$f":"_xlfn.TEXTJOIN(\"-\",,VLOOKUP(B737,$F$10:$I$18,{2,3,4}))","v":"Gel Booms-94608-C4369/2213"}]
["2017-03-22","Sunshine",53,{"$f":"_xlfn.TEXTJOIN(\"-\",,VLOOKUP(B738,$F$10:$I$18,{2,3,4}))","v":"Gel Booms-94618-S4369/2297"}]
["2017-03-08","Quad",59,{"$f":"_xlfn.TEXTJOIN(\"-\",,VLOOKUP(B739,$F$10:$I$18,{2,3,4}))","v":"Gel Booms-94608-Q4369/2290"}]
["2017-02-17","Quad",89,{"$f":"_xlfn.TEXTJOIN(\"-\",,VLOOKUP(B740,$F$10:$I$18,{2,3,4}))","v":"Gel Booms-94608-Q4369/2290"}]
["2017-03-16","Sunbell",46,{"$f":"_xlfn.TEXTJOIN(\"-\",,VLOOKUP(B741,$F$10:$I$18,{2,3,4}))","v":"Gel Booms-94618-S4369/2241"}]
["2017-03-01","Aspen",58,{"$f":"_xlfn.TEXTJOIN(\"-\",,VLOOKUP(B742,$F$10:$I$18,{2,3,4}))","v":"Colorado Booms-81231-A9634/2650"}]
["2017-03-12","Quad",36,{"$f":"_xlfn.TEXTJOIN(\"-\",,VLOOKUP(B743,$F$10:$I$18,{2,3,4}))","v":"Gel Booms-94608-Q4369/2290"}]
["2017-03-17","Yanaki",44,{"$f":"_xlfn.TEXTJOIN(\"-\",,VLOOKUP(B744,$F$10:$I$18,{2,3,4}))","v":"Colorado Booms-81231-Y9634/2072"}]
["2017-03-24","Bellen",64,{"$f":"_xlfn.TEXTJOIN(\"-\",,VLOOKUP(B745,$F$10:$I$18,{2,3,4}))","v":"Gel Booms-94618-B4369/2593"}]
["2017-01-15","Carlota",90,{"$f":"_xlfn.TEXTJOIN(\"-\",,VLOOKUP(B746,$F$10:$I$18,{2,3,4}))","v":"Gel Booms-94608-C4369/2213"}]
["2017-01-19","Eagle",68,{"$f":"_xlfn.TEXTJOIN(\"-\",,VLOOKUP(B747,$F$10:$I$18,{2,3,4}))","v":"Colorado Booms-81231-E9634/2386"}]
["2017-03-04","Sunshine",86,{"$f":"_xlfn.TEXTJOIN(\"-\",,VLOOKUP(B748,$F$10:$I$18,{2,3,4}))","v":"Gel Booms-94618-S4369/2297"}]
["2017-03-27","Sunbell",80,{"$f":"_xlfn.TEXTJOIN(\"-\",,VLOOKUP(B749,$F$10:$I$18,{2,3,4}))","v":"Gel Booms-94618-S4369/2241"}]
["2017-01-31","Carlota",80,{"$f":"_xlfn.TEXTJOIN(\"-\",,VLOOKUP(B750,$F$10:$I$18,{2,3,4}))","v":"Gel Booms-94608-C4369/2213"}]
["2017-03-17","Aspen",87,{"$f":"_xlfn.TEXTJOIN(\"-\",,VLOOKUP(B751,$F$10:$I$18,{2,3,4}))","v":"Colorado Booms-81231-A9634/2650"}]
["2017-03-20","Yanaki",67,{"$f":"_xlfn.TEXTJOIN(\"-\",,VLOOKUP(B752,$F$10:$I$18,{2,3,4}))","v":"Colorado Booms-81231-Y9634/2072"}]
["2017-02-27","Quad",106,{"$f":"_xlfn.TEXTJOIN(\"-\",,VLOOKUP(B753,$F$10:$I$18,{2,3,4}))","v":"Gel Booms-94608-Q4369/2290"}]
["2017-01-20","Quad",77,{"$f":"_xlfn.TEXTJOIN(\"-\",,VLOOKUP(B754,$F$10:$I$18,{2,3,4}))","v":"Gel Booms-94608-Q4369/2290"}]
["2017-02-03","Sunbell",90,{"$f":"_xlfn.TEXTJOIN(\"-\",,VLOOKUP(B755,$F$10:$I$18,{2,3,4}))","v":"Gel Booms-94618-S4369/2241"}]
["2017-02-04","Eagle",93,{"$f":"_xlfn.TEXTJOIN(\"-\",,VLOOKUP(B756,$F$10:$I$18,{2,3,4}))","v":"Colorado Booms-81231-E9634/2386"}]
["2017-02-02","Sunshine",106,{"$f":"_xlfn.TEXTJOIN(\"-\",,VLOOKUP(B757,$F$10:$I$18,{2,3,4}))","v":"Gel Booms-94618-S4369/2297"}]
["2017-01-30","Yanaki",78,{"$f":"_xlfn.TEXTJOIN(\"-\",,VLOOKUP(B758,$F$10:$I$18,{2,3,4}))","v":"Colorado Booms-81231-Y9634/2072"}]
["2017-01-28","Yanaki",97,{"$f":"_xlfn.TEXTJOIN(\"-\",,VLOOKUP(B759,$F$10:$I$18,{2,3,4}))","v":"Colorado Booms-81231-Y9634/2072"}]
["2017-02-04","Yanaki",40,{"$f":"_xlfn.TEXTJOIN(\"-\",,VLOOKUP(B760,$F$10:$I$18,{2,3,4}))","v":"Colorado Booms-81231-Y9634/2072"}]
["2017-03-09","Eagle",59,{"$f":"_xlfn.TEXTJOIN(\"-\",,VLOOKUP(B761,$F$10:$I$18,{2,3,4}))","v":"Colorado Booms-81231-E9634/2386"}]
["2017-03-23","Yanaki",75,{"$f":"_xlfn.TEXTJOIN(\"-\",,VLOOKUP(B762,$F$10:$I$18,{2,3,4}))","v":"Colorado Booms-81231-Y9634/2072"}]
["2017-01-03","Eagle",78,{"$f":"_xlfn.TEXTJOIN(\"-\",,VLOOKUP(B763,$F$10:$I$18,{2,3,4}))","v":"Colorado Booms-81231-E9634/2386"}]
["2017-01-24","TriBoom",88,{"$f":"_xlfn.TEXTJOIN(\"-\",,VLOOKUP(B764,$F$10:$I$18,{2,3,4}))","v":"Colorado Booms-90009-T9634/2372"}]
["2017-02-08","TriBoom",74,{"$f":"_xlfn.TEXTJOIN(\"-\",,VLOOKUP(B765,$F$10:$I$18,{2,3,4}))","v":"Colorado Booms-90009-T9634/2372"}]
["2017-01-20","Sunshine",45,{"$f":"_xlfn.TEXTJOIN(\"-\",,VLOOKUP(B766,$F$10:$I$18,{2,3,4}))","v":"Gel Booms-94618-S4369/2297"}]
["2017-03-21","Sunbell",130,{"$f":"_xlfn.TEXTJOIN(\"-\",,VLOOKUP(B767,$F$10:$I$18,{2,3,4}))","v":"Gel Booms-94618-S4369/2241"}]
["2017-01-20","TriBoom",66,{"$f":"_xlfn.TEXTJOIN(\"-\",,VLOOKUP(B768,$F$10:$I$18,{2,3,4}))","v":"Colorado Booms-90009-T9634/2372"}]
["2017-01-19","Sunbell",78,{"$f":"_xlfn.TEXTJOIN(\"-\",,VLOOKUP(B769,$F$10:$I$18,{2,3,4}))","v":"Gel Booms-94618-S4369/2241"}]
["2017-03-09","Eagle",105,{"$f":"_xlfn.TEXTJOIN(\"-\",,VLOOKUP(B770,$F$10:$I$18,{2,3,4}))","v":"Colorado Booms-81231-E9634/2386"}]
["2017-01-19","Bellen",77,{"$f":"_xlfn.TEXTJOIN(\"-\",,VLOOKUP(B771,$F$10:$I$18,{2,3,4}))","v":"Gel Booms-94618-B4369/2593"}]
["2017-01-02","Sunbell",53,{"$f":"_xlfn.TEXTJOIN(\"-\",,VLOOKUP(B772,$F$10:$I$18,{2,3,4}))","v":"Gel Booms-94618-S4369/2241"}]
["2017-03-02","Sunshine",115,{"$f":"_xlfn.TEXTJOIN(\"-\",,VLOOKUP(B773,$F$10:$I$18,{2,3,4}))","v":"Gel Booms-94618-S4369/2297"}]
["2017-01-28","Quad",70,{"$f":"_xlfn.TEXTJOIN(\"-\",,VLOOKUP(B774,$F$10:$I$18,{2,3,4}))","v":"Gel Booms-94608-Q4369/2290"}]
["2017-03-23","Carlota",57,{"$f":"_xlfn.TEXTJOIN(\"-\",,VLOOKUP(B775,$F$10:$I$18,{2,3,4}))","v":"Gel Booms-94608-C4369/2213"}]
["2017-03-25","Sunshine",78,{"$f":"_xlfn.TEXTJOIN(\"-\",,VLOOKUP(B776,$F$10:$I$18,{2,3,4}))","v":"Gel Booms-94618-S4369/2297"}]
["2017-02-04","Carlota",41,{"$f":"_xlfn.TEXTJOIN(\"-\",,VLOOKUP(B777,$F$10:$I$18,{2,3,4}))","v":"Gel Booms-94608-C4369/2213"}]
["2017-03-02","TriBoom",34,{"$f":"_xlfn.TEXTJOIN(\"-\",,VLOOKUP(B778,$F$10:$I$18,{2,3,4}))","v":"Colorado Booms-90009-T9634/2372"}]
["2017-01-31","Sunshine",116,{"$f":"_xlfn.TEXTJOIN(\"-\",,VLOOKUP(B779,$F$10:$I$18,{2,3,4}))","v":"Gel Booms-94618-S4369/2297"}]
["2017-01-19","Aspen",39,{"$f":"_xlfn.TEXTJOIN(\"-\",,VLOOKUP(B780,$F$10:$I$18,{2,3,4}))","v":"Colorado Booms-81231-A9634/2650"}]
["2017-01-05","Sunshine",57,{"$f":"_xlfn.TEXTJOIN(\"-\",,VLOOKUP(B781,$F$10:$I$18,{2,3,4}))","v":"Gel Booms-94618-S4369/2297"}]
["2017-02-20","Yanaki",104,{"$f":"_xlfn.TEXTJOIN(\"-\",,VLOOKUP(B782,$F$10:$I$18,{2,3,4}))","v":"Colorado Booms-81231-Y9634/2072"}]
["2017-01-02","Eagle",76,{"$f":"_xlfn.TEXTJOIN(\"-\",,VLOOKUP(B783,$F$10:$I$18,{2,3,4}))","v":"Colorado Booms-81231-E9634/2386"}]
["2017-03-28","Quad",49,{"$f":"_xlfn.TEXTJOIN(\"-\",,VLOOKUP(B784,$F$10:$I$18,{2,3,4}))","v":"Gel Booms-94608-Q4369/2290"}]
["2017-02-05","Sunshine",30,{"$f":"_xlfn.TEXTJOIN(\"-\",,VLOOKUP(B785,$F$10:$I$18,{2,3,4}))","v":"Gel Booms-94618-S4369/2297"}]
["2017-02-24","Carlota",59,{"$f":"_xlfn.TEXTJOIN(\"-\",,VLOOKUP(B786,$F$10:$I$18,{2,3,4}))","v":"Gel Booms-94608-C4369/2213"}]
["2017-03-28","Sunshine",82,{"$f":"_xlfn.TEXTJOIN(\"-\",,VLOOKUP(B787,$F$10:$I$18,{2,3,4}))","v":"Gel Booms-94618-S4369/2297"}]
["2017-03-21","Carlota",81,{"$f":"_xlfn.TEXTJOIN(\"-\",,VLOOKUP(B788,$F$10:$I$18,{2,3,4}))","v":"Gel Booms-94608-C4369/2213"}]
["2017-03-21","Carlota",70,{"$f":"_xlfn.TEXTJOIN(\"-\",,VLOOKUP(B789,$F$10:$I$18,{2,3,4}))","v":"Gel Booms-94608-C4369/2213"}]
["2017-01-21","Sunbell",63,{"$f":"_xlfn.TEXTJOIN(\"-\",,VLOOKUP(B790,$F$10:$I$18,{2,3,4}))","v":"Gel Booms-94618-S4369/2241"}]
["2017-01-22","Bellen",79,{"$f":"_xlfn.TEXTJOIN(\"-\",,VLOOKUP(B791,$F$10:$I$18,{2,3,4}))","v":"Gel Booms-94618-B4369/2593"}]
["2017-01-21","Quad",85,{"$f":"_xlfn.TEXTJOIN(\"-\",,VLOOKUP(B792,$F$10:$I$18,{2,3,4}))","v":"Gel Booms-94608-Q4369/2290"}]
["2017-01-20","Quad",72,{"$f":"_xlfn.TEXTJOIN(\"-\",,VLOOKUP(B793,$F$10:$I$18,{2,3,4}))","v":"Gel Booms-94608-Q4369/2290"}]
["2017-01-15","Carlota",73,{"$f":"_xlfn.TEXTJOIN(\"-\",,VLOOKUP(B794,$F$10:$I$18,{2,3,4}))","v":"Gel Booms-94608-C4369/2213"}]
["2017-03-08","TriBoom",52,{"$f":"_xlfn.TEXTJOIN(\"-\",,VLOOKUP(B795,$F$10:$I$18,{2,3,4}))","v":"Colorado Booms-90009-T9634/2372"}]
["2017-01-09","Sunshine",72,{"$f":"_xlfn.TEXTJOIN(\"-\",,VLOOKUP(B796,$F$10:$I$18,{2,3,4}))","v":"Gel Booms-94618-S4369/2297"}]
["2017-02-07","Sunbell",42,{"$f":"_xlfn.TEXTJOIN(\"-\",,VLOOKUP(B797,$F$10:$I$18,{2,3,4}))","v":"Gel Booms-94618-S4369/2241"}]
["2017-03-12","Aspen",71,{"$f":"_xlfn.TEXTJOIN(\"-\",,VLOOKUP(B798,$F$10:$I$18,{2,3,4}))","v":"Colorado Booms-81231-A9634/2650"}]
["2017-02-16","Quad",97,{"$f":"_xlfn.TEXTJOIN(\"-\",,VLOOKUP(B799,$F$10:$I$18,{2,3,4}))","v":"Gel Booms-94608-Q4369/2290"}]
["2017-01-15","Carlota",107,{"$f":"_xlfn.TEXTJOIN(\"-\",,VLOOKUP(B800,$F$10:$I$18,{2,3,4}))","v":"Gel Booms-94608-C4369/2213"}]
["2017-02-23","Aspen",44,{"$f":"_xlfn.TEXTJOIN(\"-\",,VLOOKUP(B801,$F$10:$I$18,{2,3,4}))","v":"Colorado Booms-81231-A9634/2650"}]
["2017-03-21","Carlota",70,{"$f":"_xlfn.TEXTJOIN(\"-\",,VLOOKUP(B802,$F$10:$I$18,{2,3,4}))","v":"Gel Booms-94608-C4369/2213"}]
["2017-02-18","Eagle",55,{"$f":"_xlfn.TEXTJOIN(\"-\",,VLOOKUP(B803,$F$10:$I$18,{2,3,4}))","v":"Colorado Booms-81231-E9634/2386"}]
["2017-02-05","Quad",34,{"$f":"_xlfn.TEXTJOIN(\"-\",,VLOOKUP(B804,$F$10:$I$18,{2,3,4}))","v":"Gel Booms-94608-Q4369/2290"}]
["2017-02-08","Quad",52,{"$f":"_xlfn.TEXTJOIN(\"-\",,VLOOKUP(B805,$F$10:$I$18,{2,3,4}))","v":"Gel Booms-94608-Q4369/2290"}]
["2017-03-02","Bellen",70,{"$f":"_xlfn.TEXTJOIN(\"-\",,VLOOKUP(B806,$F$10:$I$18,{2,3,4}))","v":"Gel Booms-94618-B4369/2593"}]
["2017-03-10","Sunbell",60,{"$f":"_xlfn.TEXTJOIN(\"-\",,VLOOKUP(B807,$F$10:$I$18,{2,3,4}))","v":"Gel Booms-94618-S4369/2241"}]
["2017-01-16","Carlota",77,{"$f":"_xlfn.TEXTJOIN(\"-\",,VLOOKUP(B808,$F$10:$I$18,{2,3,4}))","v":"Gel Booms-94608-C4369/2213"}]
["2017-01-17","Bellen",92,{"$f":"_xlfn.TEXTJOIN(\"-\",,VLOOKUP(B809,$F$10:$I$18,{2,3,4}))","v":"Gel Booms-94618-B4369/2593"}]
["2017-01-18","Sunshine",99,{"$f":"_xlfn.TEXTJOIN(\"-\",,VLOOKUP(B810,$F$10:$I$18,{2,3,4}))","v":"Gel Booms-94618-S4369/2297"}]
["2017-01-30","Bellen",124,{"$f":"_xlfn.TEXTJOIN(\"-\",,VLOOKUP(B811,$F$10:$I$18,{2,3,4}))","v":"Gel Booms-94618-B4369/2593"}]
["2017-02-07","Sunbell",94,{"$f":"_xlfn.TEXTJOIN(\"-\",,VLOOKUP(B812,$F$10:$I$18,{2,3,4}))","v":"Gel Booms-94618-S4369/2241"}]
["2017-02-17","TriBoom",59,{"$f":"_xlfn.TEXTJOIN(\"-\",,VLOOKUP(B813,$F$10:$I$18,{2,3,4}))","v":"Colorado Booms-90009-T9634/2372"}]
["2017-03-30","Sunbell",68,{"$f":"_xlfn.TEXTJOIN(\"-\",,VLOOKUP(B814,$F$10:$I$18,{2,3,4}))","v":"Gel Booms-94618-S4369/2241"}]
["2017-01-15","TriBoom",71,{"$f":"_xlfn.TEXTJOIN(\"-\",,VLOOKUP(B815,$F$10:$I$18,{2,3,4}))","v":"Colorado Booms-90009-T9634/2372"}]

{"sheet":"INDEX Aprox","index":3,"n_rows":815,"n_cols":25,"rows_kept":815,"cut":false,"hidden":false,"merged":[]}
["Excel Magic Trick 1352: Lookup 3 Items & Return to Single Cell VLOOKUP, INDEX or LOOKUP functions?"]
[]
["Date","Product","Units","Company-ZipCode-ID",null,null,null,null,null,null,null,null,null,null,null,null,null,null,null,null,null,null,"Date","Product","Units"]
["2017-03-16","Aspen",47,{"$f":"INDEX($G$10:$G$18&\"-\"&$H$10:$H$18&\"-\"&$I$10:$I$18,MATCH(B4,$F$10:$F$18))","v":"Colorado Booms-81231-A9634/2650"},null,null,null,null,null,null,null,null,null,null,null,null,null,null,null,null,null,null,{"$f":"RANDBETWEEN(\"1/1/2017\",\"3/31/2017\")","v":"2017-03-16"},{"$f":"INDEX($F$10:$F$18,RANDBETWEEN(1,ROWS($F$10:$F$18)))","v":"Aspen"},{"$f":"INT(ABS(_xlfn.NORM.INV(RAND(),75,25)))","v":65}]
["2017-03-29","Sunbell",90,{"$f":"INDEX($G$10:$G$18&\"-\"&$H$10:$H$18&\"-\"&$I$10:$I$18,MATCH(B5,$F$10:$F$18))","v":"Gel Booms-94618-S4369/2241"}]
["2017-03-02","Eagle",83,"Colorado Booms-81231-E9634/2386"]
["2017-03-25","Aspen",83,"Colorado Booms-81231-A9634/2650"]
["2017-01-11","Bellen",59,"Gel Booms-94618-B4369/2593"]
["2017-01-15","TriBoom",45,"Colorado Booms-90009-T9634/2372",null,"Product","Company","PlantZipCode","ID","RetailPrice","StandardCost"]
["2017-03-15","Sunbell",99,"Gel Booms-94618-S4369/2241",null,"Aspen","Colorado Booms",81231,"A9634/2650",21.95,11.6335]
["2017-02-17","Carlota",114,"Gel Booms-94608-C4369/2213",null,"Bellen","Gel Booms",94618,"B4369/2593",23.95,11.975]
["2017-02-03","Carlota",91,"Gel Booms-94608-C4369/2213",null,"Carlota","Gel Booms",94608,"C4369/2213",28.95,14.185499999999999]
["2017-03-24","Sunbell",87,"Gel Booms-94618-S4369/2241",null,"Eagle","Colorado Booms",81231,"E9634/2386",19.95,8.9774999999999991]
["2017-02-25","Bellen",71,"Gel Booms-94618-B4369/2593",null,"Quad","Gel Booms",94608,"Q4369/2290",43.95,21.535500000000003]
["2017-03-08","Aspen",67,"Colorado Booms-81231-A9634/2650",null,"Sunbell","Gel Booms",94618,"S4369/2241",27.95,15.3725]
["2017-01-05","Yanaki",63,"Colorado Booms-81231-Y9634/2072",null,"Sunshine","Gel Booms",94618,"S4369/2297",22.95,12.163499999999999]
["2017-02-06","Quad",15,"Gel Booms-94608-Q4369/2290",null,"TriBoom","Colorado Booms",90009,"T9634/2372",23.95,11.256499999999999]
["2017-01-06","Yanaki",32,"Colorado Booms-81231-Y9634/2072",null,"Yanaki","Colorado Booms",81231,"Y9634/2072",24.95,13.472999999999999]
["2017-03-14","Aspen",88,"Colorado Booms-81231-A9634/2650"]
["2017-02-05","Quad",50,"Gel Booms-94608-Q4369/2290"]
["2017-02-10","Aspen",69,"Colorado Booms-81231-A9634/2650"]
["2017-02-22","Eagle",98,"Colorado Booms-81231-E9634/2386"]
["2017-02-28","Sunbell",87,"Gel Booms-94618-S4369/2241"]
["2017-02-13","Yanaki",61,"Colorado Booms-81231-Y9634/2072"]
["2017-03-22","Yanaki",51,"Colorado Booms-81231-Y9634/2072"]
["2017-03-26","Carlota",62,"Gel Booms-94608-C4369/2213"]
["2017-01-26","Aspen",78,"Colorado Booms-81231-A9634/2650"]
["2017-01-07","Aspen",32,"Colorado Booms-81231-A9634/2650"]
["2017-02-04","Carlota",93,"Gel Booms-94608-C4369/2213"]
["2017-02-12","Aspen",115,"Colorado Booms-81231-A9634/2650"]
["2017-03-19","Bellen",56,"Gel Booms-94618-B4369/2593"]
["2017-03-11","Eagle",68,"Colorado Booms-81231-E9634/2386"]
["2017-03-09","Carlota",71,"Gel Booms-94608-C4369/2213"]
["2017-01-30","Carlota",73,"Gel Booms-94608-C4369/2213"]
["2017-02-16","Carlota",47,"Gel Booms-94608-C4369/2213"]
["2017-02-10","Carlota",82,"Gel Booms-94608-C4369/2213"]
["2017-02-21","Sunshine",61,"Gel Booms-94618-S4369/2297"]
["2017-02-21","Quad",83,"Gel Booms-94608-Q4369/2290"]
["2017-02-02","TriBoom",47,"Colorado Booms-90009-T9634/2372"]
["2017-02-10","Yanaki",83,"Colorado Booms-81231-Y9634/2072"]
["2017-01-04","Carlota",74,"Gel Booms-94608-C4369/2213"]
["2017-01-25","Quad",65,"Gel Booms-94608-Q4369/2290"]
["2017-03-01","Bellen",109,"Gel Booms-94618-B4369/2593"]
["2017-02-20","Aspen",78,"Colorado Booms-81231-A9634/2650"]
["2017-01-02","Aspen",64,"Colorado Booms-81231-A9634/2650"]
["2017-03-30","Yanaki",109,"Colorado Booms-81231-Y9634/2072"]
["2017-01-16","TriBoom",58,"Colorado Booms-90009-T9634/2372"]
["2017-01-12","Carlota",60,"Gel Booms-94608-C4369/2213"]
["2017-02-05","Sunshine",102,"Gel Booms-94618-S4369/2297"]
["2017-02-14","Bellen",65,"Gel Booms-94618-B4369/2593"]
["2017-03-13","Sunbell",31,"Gel Booms-94618-S4369/2241"]
["2017-01-27","Aspen",102,"Colorado Booms-81231-A9634/2650"]
["2017-01-26","Quad",52,"Gel Booms-94608-Q4369/2290"]
["2017-03-08","Sunbell",95,"Gel Booms-94618-S4369/2241"]
["2017-01-08","Aspen",68,"Colorado Booms-81231-A9634/2650"]
["2017-03-11","Bellen",85,"Gel Booms-94618-B4369/2593"]
["2017-03-02","Yanaki",22,"Colorado Booms-81231-Y9634/2072"]
["2017-01-13","Sunshine",79,"Gel Booms-94618-S4369/2297"]
["2017-03-27","Aspen",62,"Colorado Booms-81231-A9634/2650"]
["2017-02-09","Eagle",70,"Colorado Booms-81231-E9634/2386"]
["2017-01-17","TriBoom",60,"Colorado Booms-90009-T9634/2372"]
["2017-03-11","Aspen",65,"Colorado Booms-81231-A9634/2650"]
["2017-03-07","TriBoom",84,"Colorado Booms-90009-T9634/2372"]
["2017-03-03","Carlota",67,"Gel Booms-94608-C4369/2213"]
["2017-03-13","Eagle",104,"Colorado Booms-81231-E9634/2386"]
["2017-01-18","Bellen",93,"Gel Booms-94618-B4369/2593"]
["2017-03-28","Carlota",82,"Gel Booms-94608-C4369/2213"]
["2017-03-10","Bellen",71,"Gel Booms-94618-B4369/2593"]
["2017-01-01","Eagle",71,{"$f":"INDEX($G$10:$G$18&\"-\"&$H$10:$H$18&\"-\"&$I$10:$I$18,MATCH(B69,$F$10:$F$18))","v":"Colorado Booms-81231-E9634/2386"}]
["2017-03-30","TriBoom",68,"Colorado Booms-90009-T9634/2372"]
["2017-01-15","Bellen",120,"Gel Booms-94618-B4369/2593"]
["2017-01-06","Sunbell",46,"Gel Booms-94618-S4369/2241"]
["2017-01-04","Carlota",96,"Gel Booms-94608-C4369/2213"]
["2017-02-03","Aspen",86,"Colorado Booms-81231-A9634/2650"]
["2017-03-28","Sunbell",79,"Gel Booms-94618-S4369/2241"]
["2017-02-22","Bellen",100,"Gel Booms-94618-B4369/2593"]
["2017-01-23","Yanaki",77,"Colorado Booms-81231-Y9634/2072"]
["2017-01-04","Sunbell",49,"Gel Booms-94618-S4369/2241"]
["2017-03-05","Eagle",92,"Colorado Booms-81231-E9634/2386"]
["2017-01-25","Sunshine",49,"Gel Booms-94618-S4369/2297"]
["2017-01-23","Aspen",9,"Colorado Booms-81231-A9634/2650"]
["2017-03-22","Bellen",44,"Gel Booms-94618-B4369/2593"]
["2017-02-27","Carlota",72,"Gel Booms-94608-C4369/2213"]
["2017-03-02","Carlota",59,"Gel Booms-94608-C4369/2213"]
["2017-01-17","Sunbell",90,"Gel Booms-94618-S4369/2241"]
["2017-02-25","Eagle",54,"Colorado Booms-81231-E9634/2386"]
["2017-01-31","Quad",71,"Gel Booms-94608-Q4369/2290"]
["2017-01-27","Eagle",90,"Colorado Booms-81231-E9634/2386"]
["2017-03-17","Quad",58,"Gel Booms-94608-Q4369/2290"]
["2017-01-29","Bellen",73,"Gel Booms-94618-B4369/2593"]
["2017-03-02","TriBoom",69,"Colorado Booms-90009-T9634/2372"]
["2017-01-11","Eagle",59,"Colorado Booms-81231-E9634/2386"]
["2017-03-06","Yanaki",71,"Colorado Booms-81231-Y9634/2072"]
["2017-02-06","Eagle",111,"Colorado Booms-81231-E9634/2386"]
["2017-03-24","TriBoom",59,"Colorado Booms-90009-T9634/2372"]
["2017-02-20","Carlota",103,"Gel Booms-94608-C4369/2213"]
["2017-02-22","TriBoom",59,"Colorado Booms-90009-T9634/2372"]
["2017-01-28","TriBoom",96,"Colorado Booms-90009-T9634/2372"]
["2017-01-24","TriBoom",53,"Colorado Booms-90009-T9634/2372"]
["2017-01-23","Eagle",43,"Colorado Booms-81231-E9634/2386"]
["2017-02-23","Bellen",67,"Gel Booms-94618-B4369/2593"]
["2017-02-16","Aspen",115,"Colorado Booms-81231-A9634/2650"]
["2017-02-07","TriBoom",93,"Colorado Booms-90009-T9634/2372"]
["2017-03-13","Yanaki",44,"Colorado Booms-81231-Y9634/2072"]
["2017-02-09","Yanaki",82,"Colorado Booms-81231-Y9634/2072"]
["2017-01-24","Aspen",96,"Colorado Booms-81231-A9634/2650"]
["2017-03-03","Eagle",115,"Colorado Booms-81231-E9634/2386"]
["2017-03-15","Carlota",58,"Gel Booms-94608-C4369/2213"]
["2017-02-13","Eagle",100,"Colorado Booms-81231-E9634/2386"]
["2017-03-29","TriBoom",80,"Colorado Booms-90009-T9634/2372"]
["2017-02-25","Sunshine",105,"Gel Booms-94618-S4369/2297"]
["2017-03-19","Sunshine",84,"Gel Booms-94618-S4369/2297"]
["2017-01-03","Bellen",62,"Gel Booms-94618-B4369/2593"]
["2017-03-13","Quad",92,"Gel Booms-94608-Q4369/2290"]
["2017-02-16","Sunshine",49,"Gel Booms-94618-S4369/2297"]
["2017-02-11","Aspen",119,"Colorado Booms-81231-A9634/2650"]
["2017-02-20","Bellen",41,"Gel Booms-94618-B4369/2593"]
["2017-01-13","Aspen",115,"Colorado Booms-81231-A9634/2650"]
["2017-01-04","Quad",103,"Gel Booms-94608-Q4369/2290"]
["2017-01-13","Bellen",79,"Gel Booms-94618-B4369/2593"]
["2017-01-04","Bellen",113,"Gel Booms-94618-B4369/2593"]
["2017-03-25","Aspen",49,"Colorado Booms-81231-A9634/2650"]
["2017-03-29","Quad",77,"Gel Booms-94608-Q4369/2290"]
["2017-02-20","Eagle",63,"Colorado Booms-81231-E9634/2386"]
["2017-02-04","Sunbell",84,"Gel Booms-94618-S4369/2241"]
["2017-02-04","TriBoom",89,"Colorado Booms-90009-T9634/2372"]
["2017-01-19","Sunbell",93,"Gel Booms-94618-S4369/2241"]
["2017-01-21","Bellen",46,"Gel Booms-94618-B4369/2593"]
["2017-01-31","TriBoom",45,"Colorado Booms-90009-T9634/2372"]
["2017-03-23","Yanaki",110,"Colorado Booms-81231-Y9634/2072"]
["2017-01-21","Aspen",54,"Colorado Booms-81231-A9634/2650"]
["2017-01-12","TriBoom",99,"Colorado Booms-90009-T9634/2372"]
["2017-02-19","Yanaki",92,{"$f":"INDEX($G$10:$G$18&\"-\"&$H$10:$H$18&\"-\"&$I$10:$I$18,MATCH(B133,$F$10:$F$18))","v":"Colorado Booms-81231-Y9634/2072"}]
["2017-02-02","TriBoom",81,"Colorado Booms-90009-T9634/2372"]
["2017-03-10","Carlota",101,"Gel Booms-94608-C4369/2213"]
["2017-02-23","TriBoom",70,"Colorado Booms-90009-T9634/2372"]
["2017-02-07","Yanaki",76,"Colorado Booms-81231-Y9634/2072"]
["2017-02-20","Carlota",103,"Gel Booms-94608-C4369/2213"]
["2017-02-03","Bellen",110,"Gel Booms-94618-B4369/2593"]
["2017-03-30","Carlota",103,"Gel Booms-94608-C4369/2213"]
["2017-03-03","Eagle",48,"Colorado Booms-81231-E9634/2386"]
["2017-03-30","Eagle",96,"Colorado Booms-81231-E9634/2386"]
["2017-01-19","Bellen",102,"Gel Booms-94618-B4369/2593"]
["2017-01-29","Sunshine",81,"Gel Booms-94618-S4369/2297"]
["2017-02-08","Yanaki",90,"Colorado Booms-81231-Y9634/2072"]
["2017-01-15","Bellen",45,"Gel Booms-94618-B4369/2593"]
["2017-02-09","Eagle",54,"Colorado Booms-81231-E9634/2386"]
["2017-02-20","Bellen",52,"Gel Booms-94618-B4369/2593"]
["2017-03-18","Quad",95,"Gel Booms-94608-Q4369/2290"]
["2017-03-15","Carlota",62,"Gel Booms-94608-C4369/2213"]
["2017-03-09","Yanaki",43,"Colorado Booms-81231-Y9634/2072"]
["2017-03-30","TriBoom",46,"Colorado Booms-90009-T9634/2372"]
["2017-01-28","Eagle",44,"Colorado Booms-81231-E9634/2386"]
["2017-01-20","Eagle",84,"Colorado Booms-81231-E9634/2386"]
["2017-02-25","Sunshine",57,"Gel Booms-94618-S4369/2297"]
["2017-01-18","Carlota",82,"Gel Booms-94608-C4369/2213"]
["2017-02-22","Sunbell",74,"Gel Booms-94618-S4369/2241"]
["2017-02-15","Carlota",49,"Gel Booms-94608-C4369/2213"]
["2017-01-01","Bellen",48,"Gel Booms-94618-B4369/2593"]
["2017-02-11","Eagle",105,"Colorado Booms-81231-E9634/2386"]
["2017-03-28","Carlota",43,"Gel Booms-94608-C4369/2213"]
["2017-02-07","Yanaki",60,"Colorado Booms-81231-Y9634/2072"]
["2017-03-13","Yanaki",53,"Colorado Booms-81231-Y9634/2072"]
["2017-02-28","Bellen",103,"Gel Booms-94618-B4369/2593"]
["2017-03-08","Sunbell",29,"Gel Booms-94618-S4369/2241"]
["2017-01-12","Sunshine",60,"Gel Booms-94618-S4369/2297"]
["2017-03-05","TriBoom",91,"Colorado Booms-90009-T9634/2372"]
["2017-02-18","Carlota",61,"Gel Booms-94608-C4369/2213"]
["2017-02-23","Quad",144,"Gel Booms-94608-Q4369/2290"]
["2017-01-28","Eagle",68,"Colorado Booms-81231-E9634/2386"]
["2017-01-15","Carlota",105,"Gel Booms-94608-C4369/2213"]
["2017-01-01","Aspen",71,"Colorado Booms-81231-A9634/2650"]
["2017-03-18","Carlota",44,"Gel Booms-94608-C4369/2213"]
["2017-03-06","Quad",79,"Gel Booms-94608-Q4369/2290"]
["2017-02-28","TriBoom",73,"Colorado Booms-90009-T9634/2372"]
["2017-01-25","Aspen",62,"Colorado Booms-81231-A9634/2650"]
["2017-02-19","Quad",89,"Gel Booms-94608-Q4369/2290"]
["2017-02-28","Yanaki",86,"Colorado Booms-81231-Y9634/2072"]
["2017-03-19","Eagle",65,"Colorado Booms-81231-E9634/2386"]
["2017-01-23","Eagle",68,"Colorado Booms-81231-E9634/2386"]
["2017-01-11","Quad",71,"Gel Booms-94608-Q4369/2290"]
["2017-01-01","Aspen",99,"Colorado Booms-81231-A9634/2650"]
["2017-01-23","Bellen",100,"Gel Booms-94618-B4369/2593"]
["2017-03-05","Sunshine",95,"Gel Booms-94618-S4369/2297"]
["2017-02-26","Sunshine",93,"Gel Booms-94618-S4369/2297"]
["2017-03-28","Quad",80,"Gel Booms-94608-Q4369/2290"]
["2017-01-03","Aspen",51,"Colorado Booms-81231-A9634/2650"]
["2017-03-30","TriBoom",64,"Colorado Booms-90009-T9634/2372"]
["2017-01-25","Bellen",78,"Gel Booms-94618-B4369/2593"]
["2017-03-14","Eagle",67,"Colorado Booms-81231-E9634/2386"]
["2017-03-01","Bellen",58,"Gel Booms-94618-B4369/2593"]
["2017-01-12","Bellen",43,"Gel Booms-94618-B4369/2593"]
["2017-01-03","Yanaki",98,"Colorado Booms-81231-Y9634/2072"]
["2017-01-03","Aspen",57,"Colorado Booms-81231-A9634/2650"]
["2017-02-17","Quad",23,"Gel Booms-94608-Q4369/2290"]
["2017-02-28","Carlota",59,"Gel Booms-94608-C4369/2213"]
["2017-02-07","Sunbell",45,{"$f":"INDEX($G$10:$G$18&\"-\"&$H$10:$H$18&\"-\"&$I$10:$I$18,MATCH(B197,$F$10:$F$18))","v":"Gel Booms-94618-S4369/2241"}]
["2017-02-06","Aspen",77,"Colorado Booms-81231-A9634/2650"]
["2017-01-25","Aspen",18,"Colorado Booms-81231-A9634/2650"]
["2017-02-01","Yanaki",69,"Colorado Booms-81231-Y9634/2072"]
["2017-01-22","Quad",88,"Gel Booms-94608-Q4369/2290"]
["2017-03-23","Yanaki",130,"Colorado Booms-81231-Y9634/2072"]
["2017-03-07","Sunshine",84,"Gel Booms-94618-S4369/2297"]
["2017-03-04","Carlota",77,"Gel Booms-94608-C4369/2213"]
["2017-01-29","Sunshine",54,"Gel Booms-94618-S4369/2297"]
["2017-01-25","Carlota",69,"Gel Booms-94608-C4369/2213"]
["2017-03-03","Sunshine",65,"Gel Booms-94618-S4369/2297"]
["2017-01-30","Quad",81,"Gel Booms-94608-Q4369/2290"]
["2017-03-01","Sunshine",57,"Gel Booms-94618-S4369/2297"]
["2017-03-05","Yanaki",37,"Colorado Booms-81231-Y9634/2072"]
["2017-03-18","Quad",24,"Gel Booms-94608-Q4369/2290"]
["2017-02-25","Bellen",63,"Gel Booms-94618-B4369/2593"]
["2017-03-03","Aspen",58,"Colorado Booms-81231-A9634/2650"]
["2017-01-08","Quad",72,"Gel Booms-94608-Q4369/2290"]
["2017-02-17","Yanaki",66,"Colorado Booms-81231-Y9634/2072"]
["2017-03-23","Eagle",46,"Colorado Booms-81231-E9634/2386"]
["2017-02-12","Eagle",64,"Colorado Booms-81231-E9634/2386"]
["2017-01-28","Aspen",36,"Colorado Booms-81231-A9634/2650"]
["2017-02-10","Aspen",124,"Colorado Booms-81231-A9634/2650"]
["2017-01-01","Aspen",81,"Colorado Booms-81231-A9634/2650"]
["2017-01-02","Carlota",47,"Gel Booms-94608-C4369/2213"]
["2017-02-17","Quad",94,"Gel Booms-94608-Q4369/2290"]
["2017-01-07","Bellen",69,"Gel Booms-94618-B4369/2593"]
["2017-03-10","TriBoom",48,"Colorado Booms-90009-T9634/2372"]
["2017-03-17","Quad",33,"Gel Booms-94608-Q4369/2290"]
["2017-01-25","Quad",89,"Gel Booms-94608-Q4369/2290"]
["2017-03-25","Sunbell",87,"Gel Booms-94618-S4369/2241"]
["2017-02-04","TriBoom",50,"Colorado Booms-90009-T9634/2372"]
["2017-01-10","Aspen",45,"Colorado Booms-81231-A9634/2650"]
["2017-03-20","Bellen",56,"Gel Booms-94618-B4369/2593"]
["2017-01-10","Bellen",20,"Gel Booms-94618-B4369/2593"]
["2017-02-07","Yanaki",77,"Colorado Booms-81231-Y9634/2072"]
["2017-02-20","Bellen",65,"Gel Booms-94618-B4369/2593"]
["2017-02-11","Carlota",61,"Gel Booms-94608-C4369/2213"]
["2017-03-21","Eagle",49,"Colorado Booms-81231-E9634/2386"]
["2017-02-07","Sunbell",77,"Gel Booms-94618-S4369/2241"]
["2017-01-25","Quad",34,"Gel Booms-94608-Q4369/2290"]
["2017-02-17","Carlota",64,"Gel Booms-94608-C4369/2213"]
["2017-03-29","Bellen",64,"Gel Booms-94618-B4369/2593"]
["2017-02-15","TriBoom",53,"Colorado Booms-90009-T9634/2372"]
["2017-01-10","Bellen",78,"Gel Booms-94618-B4369/2593"]
["2017-02-18","Aspen",131,"Colorado Booms-81231-A9634/2650"]
["2017-03-04","Sunbell",91,"Gel Booms-94618-S4369/2241"]
["2017-01-16","Carlota",105,"Gel Booms-94608-C4369/2213"]
["2017-03-24","Quad",113,"Gel Booms-94608-Q4369/2290"]
["2017-02-27","Yanaki",148,"Colorado Booms-81231-Y9634/2072"]
["2017-03-23","Sunshine",77,"Gel Booms-94618-S4369/2297"]
["2017-01-07","Sunbell",65,"Gel Booms-94618-S4369/2241"]
["2017-03-29","Bellen",92,"Gel Booms-94618-B4369/2593"]
["2017-01-22","Aspen",80,"Colorado Booms-81231-A9634/2650"]
["2017-03-19","Sunshine",90,"Gel Booms-94618-S4369/2297"]
["2017-01-09","Sunshine",49,"Gel Booms-94618-S4369/2297"]
["2017-03-10","Eagle",85,"Colorado Booms-81231-E9634/2386"]
["2017-01-12","Sunshine",37,"Gel Booms-94618-S4369/2297"]
["2017-03-12","Quad",112,"Gel Booms-94608-Q4369/2290"]
["2017-02-18","Sunshine",65,"Gel Booms-94618-S4369/2297"]
["2017-03-07","Carlota",106,"Gel Booms-94608-C4369/2213"]
["2017-01-12","TriBoom",63,"Colorado Booms-90009-T9634/2372"]
["2017-01-25","Quad",80,"Gel Booms-94608-Q4369/2290"]
["2017-02-18","TriBoom",103,"Colorado Booms-90009-T9634/2372"]
["2017-03-10","Bellen",92,{"$f":"INDEX($G$10:$G$18&\"-\"&$H$10:$H$18&\"-\"&$I$10:$I$18,MATCH(B261,$F$10:$F$18))","v":"Gel Booms-94618-B4369/2593"}]
["2017-01-25","Carlota",35,"Gel Booms-94608-C4369/2213"]
["2017-03-24","Yanaki",60,"Colorado Booms-81231-Y9634/2072"]
["2017-01-02","Eagle",63,"Colorado Booms-81231-E9634/2386"]
["2017-02-18","Yanaki",55,"Colorado Booms-81231-Y9634/2072"]
["2017-02-20","Carlota",57,"Gel Booms-94608-C4369/2213"]
["2017-01-20","Carlota",85,"Gel Booms-94608-C4369/2213"]
["2017-02-03","Sunbell",58,"Gel Booms-94618-S4369/2241"]
["2017-02-28","Aspen",125,"Colorado Booms-81231-A9634/2650"]
["2017-02-14","Yanaki",60,"Colorado Booms-81231-Y9634/2072"]
["2017-02-01","Sunshine",83,"Gel Booms-94618-S4369/2297"]
["2017-03-13","Sunbell",94,"Gel Booms-94618-S4369/2241"]
["2017-02-01","TriBoom",97,"Colorado Booms-90009-T9634/2372"]
["2017-02-15","Bellen",65,"Gel Booms-94618-B4369/2593"]
["2017-02-16","Carlota",55,"Gel Booms-94608-C4369/2213"]
["2017-02-25","Quad",78,"Gel Booms-94608-Q4369/2290"]
["2017-02-23","Quad",97,"Gel Booms-94608-Q4369/2290"]
["2017-03-08","Quad",56,"Gel Booms-94608-Q4369/2290"]
["2017-01-27","TriBoom",70,"Colorado Booms-90009-T9634/2372"]
["2017-02-20","Quad",83,"Gel Booms-94608-Q4369/2290"]
["2017-01-09","Carlota",85,"Gel Booms-94608-C4369/2213"]
["2017-01-01","Eagle",86,"Colorado Booms-81231-E9634/2386"]
["2017-01-31","Sunbell",64,"Gel Booms-94618-S4369/2241"]
["2017-03-24","Yanaki",88,"Colorado Booms-81231-Y9634/2072"]
["2017-02-15","Aspen",62,"Colorado Booms-81231-A9634/2650"]
["2017-02-03","Sunshine",79,"Gel Booms-94618-S4369/2297"]
["2017-02-22","Sunshine",70,"Gel Booms-94618-S4369/2297"]
["2017-03-08","Sunbell",79,"Gel Booms-94618-S4369/2241"]
["2017-03-04","Aspen",78,"Colorado Booms-81231-A9634/2650"]
["2017-02-02","TriBoom",63,"Colorado Booms-90009-T9634/2372"]
["2017-03-18","Aspen",83,"Colorado Booms-81231-A9634/2650"]
["2017-02-28","Quad",39,"Gel Booms-94608-Q4369/2290"]
["2017-01-08","Eagle",110,"Colorado Booms-81231-E9634/2386"]
["2017-03-28","Aspen",86,"Colorado Booms-81231-A9634/2650"]
["2017-03-27","Aspen",107,"Colorado Booms-81231-A9634/2650"]
["2017-02-16","Bellen",56,"Gel Booms-94618-B4369/2593"]
["2017-02-18","TriBoom",100,"Colorado Booms-90009-T9634/2372"]
["2017-01-08","TriBoom",85,"Colorado Booms-90009-T9634/2372"]
["2017-01-18","Sunbell",90,"Gel Booms-94618-S4369/2241"]
["2017-03-23","Eagle",43,"Colorado Booms-81231-E9634/2386"]
["2017-02-19","Eagle",100,"Colorado Booms-81231-E9634/2386"]
["2017-01-25","Sunshine",131,"Gel Booms-94618-S4369/2297"]
["2017-01-22","Quad",90,"Gel Booms-94608-Q4369/2290"]
["2017-03-28","Sunbell",82,"Gel Booms-94618-S4369/2241"]
["2017-03-15","Aspen",36,"Colorado Booms-81231-A9634/2650"]
["2017-02-10","Bellen",51,"Gel Booms-94618-B4369/2593"]
["2017-01-27","Sunshine",62,"Gel Booms-94618-S4369/2297"]
["2017-02-05","Quad",58,"Gel Booms-94608-Q4369/2290"]
["2017-01-07","Sunshine",97,"Gel Booms-94618-S4369/2297"]
["2017-02-15","Sunshine",94,"Gel Booms-94618-S4369/2297"]
["2017-02-03","Yanaki",70,"Colorado Booms-81231-Y9634/2072"]
["2017-03-06","Quad",47,"Gel Booms-94608-Q4369/2290"]
["2017-01-20","Bellen",52,"Gel Booms-94618-B4369/2593"]
["2017-01-20","Carlota",123,"Gel Booms-94608-C4369/2213"]
["2017-02-11","Sunshine",64,"Gel Booms-94618-S4369/2297"]
["2017-03-31","Yanaki",75,"Colorado Booms-81231-Y9634/2072"]
["2017-02-22","TriBoom",60,"Colorado Booms-90009-T9634/2372"]
["2017-02-18","Eagle",61,"Colorado Booms-81231-E9634/2386"]
["2017-03-15","Aspen",76,"Colorado Booms-81231-A9634/2650"]
["2017-02-28","Bellen",96,"Gel Booms-94618-B4369/2593"]
["2017-01-20","Bellen",34,"Gel Booms-94618-B4369/2593"]
["2017-03-24","Sunbell",106,"Gel Booms-94618-S4369/2241"]
["2017-03-06","Sunbell",66,"Gel Booms-94618-S4369/2241"]
["2017-01-21","Sunbell",67,"Gel Booms-94618-S4369/2241"]
["2017-02-06","Eagle",96,{"$f":"INDEX($G$10:$G$18&\"-\"&$H$10:$H$18&\"-\"&$I$10:$I$18,MATCH(B325,$F$10:$F$18))","v":"Colorado Booms-81231-E9634/2386"}]
["2017-03-08","Bellen",84,"Gel Booms-94618-B4369/2593"]
["2017-03-11","Sunshine",39,"Gel Booms-94618-S4369/2297"]
["2017-01-09","Eagle",88,"Colorado Booms-81231-E9634/2386"]
["2017-03-04","Sunshine",60,"Gel Booms-94618-S4369/2297"]
["2017-03-11","Carlota",63,"Gel Booms-94608-C4369/2213"]
["2017-02-22","Eagle",47,"Colorado Booms-81231-E9634/2386"]
["2017-01-24","Bellen",57,"Gel Booms-94618-B4369/2593"]
["2017-02-02","Bellen",83,"Gel Booms-94618-B4369/2593"]
["2017-03-24","Eagle",92,"Colorado Booms-81231-E9634/2386"]
["2017-01-07","Sunbell",62,"Gel Booms-94618-S4369/2241"]
["2017-02-19","Bellen",53,"Gel Booms-94618-B4369/2593"]
["2017-03-02","Carlota",62,"Gel Booms-94608-C4369/2213"]
["2017-01-03","Sunshine",89,"Gel Booms-94618-S4369/2297"]
["2017-03-26","Yanaki",61,"Colorado Booms-81231-Y9634/2072"]
["2017-03-02","Carlota",94,"Gel Booms-94608-C4369/2213"]
["2017-02-25","Carlota",61,"Gel Booms-94608-C4369/2213"]
["2017-03-20","Aspen",48,"Colorado Booms-81231-A9634/2650"]
["2017-02-12","Quad",61,"Gel Booms-94608-Q4369/2290"]
["2017-01-19","Quad",50,"Gel Booms-94608-Q4369/2290"]
["2017-03-19","Sunbell",31,"Gel Booms-94618-S4369/2241"]
["2017-01-23","Bellen",54,"Gel Booms-94618-B4369/2593"]
["2017-02-14","Eagle",89,"Colorado Booms-81231-E9634/2386"]
["2017-03-04","Bellen",72,"Gel Booms-94618-B4369/2593"]
["2017-03-11","TriBoom",73,"Colorado Booms-90009-T9634/2372"]
["2017-01-03","Sunshine",67,"Gel Booms-94618-S4369/2297"]
["2017-02-03","Eagle",102,"Colorado Booms-81231-E9634/2386"]
["2017-02-15","Sunbell",81,"Gel Booms-94618-S4369/2241"]
["2017-01-15","Yanaki",63,"Colorado Booms-81231-Y9634/2072"]
["2017-02-12","Carlota",63,"Gel Booms-94608-C4369/2213"]
["2017-01-15","Yanaki",105,"Colorado Booms-81231-Y9634/2072"]
["2017-02-19","Sunshine",125,"Gel Booms-94618-S4369/2297"]
["2017-03-30","Bellen",78,"Gel Booms-94618-B4369/2593"]
["2017-02-16","Quad",88,"Gel Booms-94608-Q4369/2290"]
["2017-02-19","Sunbell",77,"Gel Booms-94618-S4369/2241"]
["2017-01-19","Sunshine",73,"Gel Booms-94618-S4369/2297"]
["2017-01-09","Sunshine",45,"Gel Booms-94618-S4369/2297"]
["2017-02-03","Sunbell",92,"Gel Booms-94618-S4369/2241"]
["2017-03-01","Aspen",77,"Colorado Booms-81231-A9634/2650"]
["2017-02-28","Eagle",116,"Colorado Booms-81231-E9634/2386"]
["2017-01-08","Yanaki",94,"Colorado Booms-81231-Y9634/2072"]
["2017-01-28","Yanaki",123,"Colorado Booms-81231-Y9634/2072"]
["2017-01-27","Quad",88,"Gel Booms-94608-Q4369/2290"]
["2017-01-22","Carlota",45,"Gel Booms-94608-C4369/2213"]
["2017-02-19","Sunbell",85,"Gel Booms-94618-S4369/2241"]
["2017-01-11","Bellen",85,"Gel Booms-94618-B4369/2593"]
["2017-03-04","Eagle",30,"Colorado Booms-81231-E9634/2386"]
["2017-03-16","Bellen",84,"Gel Booms-94618-B4369/2593"]
["2017-02-11","Eagle",99,"Colorado Booms-81231-E9634/2386"]
["2017-01-07","Aspen",92,"Colorado Booms-81231-A9634/2650"]
["2017-01-31","Yanaki",87,"Colorado Booms-81231-Y9634/2072"]
["2017-03-30","Sunbell",100,"Gel Booms-94618-S4369/2241"]
["2017-01-16","Eagle",99,"Colorado Booms-81231-E9634/2386"]
["2017-01-09","Sunbell",37,"Gel Booms-94618-S4369/2241"]
["2017-01-22","Sunbell",80,"Gel Booms-94618-S4369/2241"]
["2017-02-05","Sunshine",74,"Gel Booms-94618-S4369/2297"]
["2017-03-29","Yanaki",114,"Colorado Booms-81231-Y9634/2072"]
["2017-03-30","Yanaki",73,"Colorado Booms-81231-Y9634/2072"]
["2017-03-12","Carlota",100,"Gel Booms-94608-C4369/2213"]
["2017-01-30","TriBoom",74,"Colorado Booms-90009-T9634/2372"]
["2017-02-16","Eagle",48,"Colorado Booms-81231-E9634/2386"]
["2017-01-31","Sunshine",100,"Gel Booms-94618-S4369/2297"]
["2017-02-07","Eagle",101,"Colorado Booms-81231-E9634/2386"]
["2017-02-27","Carlota",83,"Gel Booms-94608-C4369/2213"]
["2017-01-21","Bellen",59,{"$f":"INDEX($G$10:$G$18&\"-\"&$H$10:$H$18&\"-\"&$I$10:$I$18,MATCH(B389,$F$10:$F$18))","v":"Gel Booms-94618-B4369/2593"}]
["2017-02-26","Eagle",81,"Colorado Booms-81231-E9634/2386"]
["2017-03-23","Eagle",91,"Colorado Booms-81231-E9634/2386"]
["2017-02-22","Carlota",99,"Gel Booms-94608-C4369/2213"]
["2017-02-12","Eagle",86,"Colorado Booms-81231-E9634/2386"]
["2017-02-19","Yanaki",67,"Colorado Booms-81231-Y9634/2072"]
["2017-03-25","Quad",18,"Gel Booms-94608-Q4369/2290"]
["2017-03-01","Eagle",76,"Colorado Booms-81231-E9634/2386"]
["2017-02-02","Eagle",54,"Colorado Booms-81231-E9634/2386"]
["2017-01-29","TriBoom",72,"Colorado Booms-90009-T9634/2372"]
["2017-02-12","Sunbell",35,"Gel Booms-94618-S4369/2241"]
["2017-01-13","Aspen",118,"Colorado Booms-81231-A9634/2650"]
["2017-02-13","Bellen",82,"Gel Booms-94618-B4369/2593"]
["2017-02-10","Sunshine",102,"Gel Booms-94618-S4369/2297"]
["2017-02-19","Eagle",118,"Colorado Booms-81231-E9634/2386"]
["2017-02-04","Eagle",58,"Colorado Booms-81231-E9634/2386"]
["2017-03-31","TriBoom",68,"Colorado Booms-90009-T9634/2372"]
["2017-02-10","Quad",41,"Gel Booms-94608-Q4369/2290"]
["2017-01-15","Yanaki",90,"Colorado Booms-81231-Y9634/2072"]
["2017-01-07","Eagle",63,"Colorado Booms-81231-E9634/2386"]
["2017-03-10","Bellen",95,"Gel Booms-94618-B4369/2593"]
["2017-01-18","Yanaki",19,"Colorado Booms-81231-Y9634/2072"]
["2017-02-17","Sunshine",39,"Gel Booms-94618-S4369/2297"]
["2017-03-13","Yanaki",43,"Colorado Booms-81231-Y9634/2072"]
["2017-01-04","TriBoom",56,"Colorado Booms-90009-T9634/2372"]
["2017-03-31","Quad",47,"Gel Booms-94608-Q4369/2290"]
["2017-03-13","Aspen",61,"Colorado Booms-81231-A9634/2650"]
["2017-01-11","Quad",66,"Gel Booms-94608-Q4369/2290"]
["2017-02-22","Aspen",87,"Colorado Booms-81231-A9634/2650"]
["2017-02-21","Sunbell",87,"Gel Booms-94618-S4369/2241"]
["2017-03-02","Eagle",78,"Colorado Booms-81231-E9634/2386"]
["2017-02-25","Eagle",67,"Colorado Booms-81231-E9634/2386"]
["2017-03-05","Sunbell",58,"Gel Booms-94618-S4369/2241"]
["2017-01-29","Carlota",82,"Gel Booms-94608-C4369/2213"]
["2017-01-15","Eagle",99,"Colorado Booms-81231-E9634/2386"]
["2017-03-28","Quad",98,"Gel Booms-94608-Q4369/2290"]
["2017-02-14","Yanaki",58,"Colorado Booms-81231-Y9634/2072"]
["2017-03-11","Aspen",80,"Colorado Booms-81231-A9634/2650"]
["2017-01-12","Aspen",36,"Colorado Booms-81231-A9634/2650"]
["2017-01-14","Sunbell",45,"Gel Booms-94618-S4369/2241"]
["2017-01-08","Quad",77,"Gel Booms-94608-Q4369/2290"]
["2017-02-02","TriBoom",106,"Colorado Booms-90009-T9634/2372"]
["2017-03-10","Sunbell",59,"Gel Booms-94618-S4369/2241"]
["2017-03-25","Sunshine",69,"Gel Booms-94618-S4369/2297"]
["2017-03-02","Yanaki",94,"Colorado Booms-81231-Y9634/2072"]
["2017-01-02","Eagle",118,"Colorado Booms-81231-E9634/2386"]
["2017-01-25","Sunbell",69,"Gel Booms-94618-S4369/2241"]
["2017-01-04","Aspen",50,"Colorado Booms-81231-A9634/2650"]
["2017-02-19","Carlota",92,"Gel Booms-94608-C4369/2213"]
["2017-02-04","Carlota",63,"Gel Booms-94608-C4369/2213"]
["2017-01-02","Carlota",64,"Gel Booms-94608-C4369/2213"]
["2017-03-22","TriBoom",115,"Colorado Booms-90009-T9634/2372"]
["2017-02-08","TriBoom",76,"Colorado Booms-90009-T9634/2372"]
["2017-01-25","TriBoom",30,"Colorado Booms-90009-T9634/2372"]
["2017-02-14","Bellen",106,"Gel Booms-94618-B4369/2593"]
["2017-02-26","Aspen",28,"Colorado Booms-81231-A9634/2650"]
["2017-02-12","Eagle",67,"Colorado Booms-81231-E9634/2386"]
["2017-02-14","Eagle",70,"Colorado Booms-81231-E9634/2386"]
["2017-01-24","TriBoom",78,"Colorado Booms-90009-T9634/2372"]
["2017-02-23","Aspen",44,"Colorado Booms-81231-A9634/2650"]
["2017-01-18","Aspen",80,"Colorado Booms-81231-A9634/2650"]
["2017-02-18","Quad",38,"Gel Booms-94608-Q4369/2290"]
["2017-03-10","Carlota",47,"Gel Booms-94608-C4369/2213"]
["2017-03-31","Sunbell",64,"Gel Booms-94618-S4369/2241"]
["2017-01-12","Eagle",43,{"$f":"INDEX($G$10:$G$18&\"-\"&$H$10:$H$18&\"-\"&$I$10:$I$18,MATCH(B453,$F$10:$F$18))","v":"Colorado Booms-81231-E9634/2386"}]
["2017-01-30","Yanaki",101,"Colorado Booms-81231-Y9634/2072"]
["2017-01-30","Quad",97,"Gel Booms-94608-Q4369/2290"]
["2017-03-09","TriBoom",63,"Colorado Booms-90009-T9634/2372"]
["2017-02-06","Bellen",80,"Gel Booms-94618-B4369/2593"]
["2017-03-24","Eagle",44,"Colorado Booms-81231-E9634/2386"]
["2017-02-18","Sunbell",37,"Gel Booms-94618-S4369/2241"]
["2017-01-30","Sunbell",65,"Gel Booms-94618-S4369/2241"]
["2017-01-29","TriBoom",64,"Colorado Booms-90009-T9634/2372"]
["2017-02-17","Aspen",75,"Colorado Booms-81231-A9634/2650"]
["2017-02-16","Aspen",98,"Colorado Booms-81231-A9634/2650"]
["2017-02-18","Carlota",83,"Gel Booms-94608-C4369/2213"]
["2017-02-05","Bellen",76,"Gel Booms-94618-B4369/2593"]
["2017-02-22","TriBoom",80,"Colorado Booms-90009-T9634/2372"]
["2017-02-10","Yanaki",43,"Colorado Booms-81231-Y9634/2072"]
["2017-01-30","Sunbell",71,"Gel Booms-94618-S4369/2241"]
["2017-03-09","Bellen",119,"Gel Booms-94618-B4369/2593"]
["2017-02-08","Bellen",91,"Gel Booms-94618-B4369/2593"]
["2017-03-23","Sunshine",111,"Gel Booms-94618-S4369/2297"]
["2017-03-25","Aspen",80,"Colorado Booms-81231-A9634/2650"]
["2017-02-18","Carlota",23,"Gel Booms-94608-C4369/2213"]
["2017-03-20","Carlota",65,"Gel Booms-94608-C4369/2213"]
["2017-02-21","Aspen",34,"Colorado Booms-81231-A9634/2650"]
["2017-01-24","Aspen",89,"Colorado Booms-81231-A9634/2650"]
["2017-03-05","Eagle",132,"Colorado Booms-81231-E9634/2386"]
["2017-01-07","Aspen",109,"Colorado Booms-81231-A9634/2650"]
["2017-01-13","Yanaki",82,"Colorado Booms-81231-Y9634/2072"]
["2017-02-12","Eagle",64,"Colorado Booms-81231-E9634/2386"]
["2017-02-03","Bellen",72,"Gel Booms-94618-B4369/2593"]
["2017-02-05","Bellen",34,"Gel Booms-94618-B4369/2593"]
["2017-01-08","TriBoom",84,"Colorado Booms-90009-T9634/2372"]
["2017-03-18","TriBoom",103,"Colorado Booms-90009-T9634/2372"]
["2017-01-14","Carlota",110,"Gel Booms-94608-C4369/2213"]
["2017-01-16","Aspen",73,"Colorado Booms-81231-A9634/2650"]
["2017-01-22","Sunshine",85,"Gel Booms-94618-S4369/2297"]
["2017-01-09","Eagle",99,"Colorado Booms-81231-E9634/2386"]
["2017-02-25","Eagle",80,"Colorado Booms-81231-E9634/2386"]
["2017-03-04","Carlota",89,"Gel Booms-94608-C4369/2213"]
["2017-02-04","Carlota",99,"Gel Booms-94608-C4369/2213"]
["2017-02-04","Eagle",38,"Colorado Booms-81231-E9634/2386"]
["2017-03-09","Aspen",69,"Colorado Booms-81231-A9634/2650"]
["2017-03-11","Sunbell",83,"Gel Booms-94618-S4369/2241"]
["2017-01-16","Carlota",83,"Gel Booms-94608-C4369/2213"]
["2017-03-18","Bellen",29,"Gel Booms-94618-B4369/2593"]
["2017-01-22","TriBoom",73,"Colorado Booms-90009-T9634/2372"]
["2017-02-15","Aspen",72,"Colorado Booms-81231-A9634/2650"]
["2017-03-21","TriBoom",72,"Colorado Booms-90009-T9634/2372"]
["2017-03-12","Aspen",103,"Colorado Booms-81231-A9634/2650"]
["2017-02-15","Bellen",104,"Gel Booms-94618-B4369/2593"]
["2017-01-14","Aspen",91,"Colorado Booms-81231-A9634/2650"]
["2017-01-15","TriBoom",78,"Colorado Booms-90009-T9634/2372"]
["2017-03-16","Sunbell",57,"Gel Booms-94618-S4369/2241"]
["2017-02-07","Sunbell",103,"Gel Booms-94618-S4369/2241"]
["2017-03-02","TriBoom",89,"Colorado Booms-90009-T9634/2372"]
["2017-01-10","Bellen",100,"Gel Booms-94618-B4369/2593"]
["2017-01-07","Bellen",108,"Gel Booms-94618-B4369/2593"]
["2017-01-13","Yanaki",74,"Colorado Booms-81231-Y9634/2072"]
["2017-01-16","Yanaki",96,"Colorado Booms-81231-Y9634/2072"]
["2017-02-19","Sunshine",63,"Gel Booms-94618-S4369/2297"]
["2017-01-04","Sunshine",116,"Gel Booms-94618-S4369/2297"]
["2017-01-31","Eagle",55,"Colorado Booms-81231-E9634/2386"]
["2017-01-06","Bellen",85,"Gel Booms-94618-B4369/2593"]
["2017-01-11","Bellen",71,"Gel Booms-94618-B4369/2593"]
["2017-02-15","Quad",52,"Gel Booms-94608-Q4369/2290"]
["2017-01-25","Aspen",68,{"$f":"INDEX($G$10:$G$18&\"-\"&$H$10:$H$18&\"-\"&$I$10:$I$18,MATCH(B517,$F$10:$F$18))","v":"Colorado Booms-81231-A9634/2650"}]
["2017-01-12","Quad",53,"Gel Booms-94608-Q4369/2290"]
["2017-01-19","Sunshine",118,"Gel Booms-94618-S4369/2297"]
["2017-03-13","Eagle",71,"Colorado Booms-81231-E9634/2386"]
["2017-03-24","Carlota",78,"Gel Booms-94608-C4369/2213"]
["2017-02-06","Sunshine",92,"Gel Booms-94618-S4369/2297"]
["2017-01-27","Sunshine",70,"Gel Booms-94618-S4369/2297"]
["2017-02-05","Quad",87,"Gel Booms-94608-Q4369/2290"]
["2017-02-22","Quad",130,"Gel Booms-94608-Q4369/2290"]
["2017-02-12","TriBoom",51,"Colorado Booms-90009-T9634/2372"]
["2017-03-03","Sunshine",87,"Gel Booms-94618-S4369/2297"]
["2017-03-21","Yanaki",82,"Colorado Booms-81231-Y9634/2072"]
["2017-02-17","Bellen",70,"Gel Booms-94618-B4369/2593"]
["2017-03-04","Yanaki",84,"Colorado Booms-81231-Y9634/2072"]
["2017-03-01","Aspen",99,"Colorado Booms-81231-A9634/2650"]
["2017-03-24","Yanaki",48,"Colorado Booms-81231-Y9634/2072"]
["2017-01-31","Quad",93,"Gel Booms-94608-Q4369/2290"]
["2017-01-15","Quad",66,"Gel Booms-94608-Q4369/2290"]
["2017-03-01","Yanaki",57,"Colorado Booms-81231-Y9634/2072"]
["2017-03-31","Carlota",24,"Gel Booms-94608-C4369/2213"]
["2017-02-19","Carlota",121,"Gel Booms-94608-C4369/2213"]
["2017-03-25","Bellen",91,"Gel Booms-94618-B4369/2593"]
["2017-02-25","TriBoom",87,"Colorado Booms-90009-T9634/2372"]
["2017-01-04","Yanaki",77,"Colorado Booms-81231-Y9634/2072"]
["2017-01-25","Sunshine",67,"Gel Booms-94618-S4369/2297"]
["2017-01-03","Bellen",102,"Gel Booms-94618-B4369/2593"]
["2017-01-01","Quad",72,"Gel Booms-94608-Q4369/2290"]
["2017-01-05","Sunbell",69,"Gel Booms-94618-S4369/2241"]
["2017-03-23","Sunshine",38,"Gel Booms-94618-S4369/2297"]
["2017-02-04","Aspen",69,"Colorado Booms-81231-A9634/2650"]
["2017-01-25","Bellen",64,"Gel Booms-94618-B4369/2593"]
["2017-01-28","TriBoom",35,"Colorado Booms-90009-T9634/2372"]
["2017-02-17","Sunbell",95,"Gel Booms-94618-S4369/2241"]
["2017-02-23","Carlota",83,"Gel Booms-94608-C4369/2213"]
["2017-03-12","Aspen",48,"Colorado Booms-81231-A9634/2650"]
["2017-02-07","Carlota",78,"Gel Booms-94608-C4369/2213"]
["2017-03-30","TriBoom",57,"Colorado Booms-90009-T9634/2372"]
["2017-02-21","Sunbell",84,"Gel Booms-94618-S4369/2241"]
["2017-01-23","Eagle",109,"Colorado Booms-81231-E9634/2386"]
["2017-02-15","TriBoom",46,"Colorado Booms-90009-T9634/2372"]
["2017-03-10","TriBoom",77,"Colorado Booms-90009-T9634/2372"]
["2017-03-17","Yanaki",97,"Colorado Booms-81231-Y9634/2072"]
["2017-01-24","Sunbell",89,"Gel Booms-94618-S4369/2241"]
["2017-03-22","Sunshine",56,"Gel Booms-94618-S4369/2297"]
["2017-02-16","Sunbell",77,"Gel Booms-94618-S4369/2241"]
["2017-01-25","Quad",72,"Gel Booms-94608-Q4369/2290"]
["2017-03-30","Sunshine",53,"Gel Booms-94618-S4369/2297"]
["2017-02-26","TriBoom",84,"Colorado Booms-90009-T9634/2372"]
["2017-01-04","Bellen",85,"Gel Booms-94618-B4369/2593"]
["2017-01-08","Sunbell",105,"Gel Booms-94618-S4369/2241"]
["2017-03-22","Sunbell",84,"Gel Booms-94618-S4369/2241"]
["2017-01-10","Eagle",98,"Colorado Booms-81231-E9634/2386"]
["2017-01-29","Eagle",73,"Colorado Booms-81231-E9634/2386"]
["2017-03-11","TriBoom",45,"Colorado Booms-90009-T9634/2372"]
["2017-02-02","Carlota",96,"Gel Booms-94608-C4369/2213"]
["2017-03-20","Bellen",80,"Gel Booms-94618-B4369/2593"]
["2017-02-15","Carlota",46,"Gel Booms-94608-C4369/2213"]
["2017-03-18","Yanaki",108,"Colorado Booms-81231-Y9634/2072"]
["2017-03-15","Sunshine",114,"Gel Booms-94618-S4369/2297"]
["2017-03-23","Quad",99,"Gel Booms-94608-Q4369/2290"]
["2017-01-21","Sunshine",46,"Gel Booms-94618-S4369/2297"]
["2017-02-01","Aspen",71,"Colorado Booms-81231-A9634/2650"]
["2017-03-01","Quad",88,"Gel Booms-94608-Q4369/2290"]
["2017-03-23","TriBoom",79,"Colorado Booms-90009-T9634/2372"]
["2017-03-29","Bellen",35,{"$f":"INDEX($G$10:$G$18&\"-\"&$H$10:$H$18&\"-\"&$I$10:$I$18,MATCH(B581,$F$10:$F$18))","v":"Gel Booms-94618-B4369/2593"}]
["2017-02-07","Yanaki",61,"Colorado Booms-81231-Y9634/2072"]
["2017-02-25","Aspen",59,"Colorado Booms-81231-A9634/2650"]
["2017-02-16","Sunbell",112,"Gel Booms-94618-S4369/2241"]
["2017-02-01","Bellen",69,"Gel Booms-94618-B4369/2593"]
["2017-02-04","Quad",110,"Gel Booms-94608-Q4369/2290"]
["2017-03-22","Sunbell",90,"Gel Booms-94618-S4369/2241"]
["2017-03-29","Aspen",94,"Colorado Booms-81231-A9634/2650"]
["2017-01-24","Eagle",85,"Colorado Booms-81231-E9634/2386"]
["2017-01-21","TriBoom",62,"Colorado Booms-90009-T9634/2372"]
["2017-02-26","Yanaki",109,"Colorado Booms-81231-Y9634/2072"]
["2017-02-11","Sunshine",63,"Gel Booms-94618-S4369/2297"]
["2017-01-31","Carlota",60,"Gel Booms-94608-C4369/2213"]
["2017-01-03","Eagle",107,"Colorado Booms-81231-E9634/2386"]
["2017-02-05","Sunshine",69,"Gel Booms-94618-S4369/2297"]
["2017-02-20","Yanaki",81,"Colorado Booms-81231-Y9634/2072"]
["2017-03-04","Yanaki",89,"Colorado Booms-81231-Y9634/2072"]
["2017-02-13","TriBoom",48,"Colorado Booms-90009-T9634/2372"]
["2017-01-10","Carlota",36,"Gel Booms-94608-C4369/2213"]
["2017-02-24","Yanaki",78,"Colorado Booms-81231-Y9634/2072"]
["2017-01-11","Aspen",58,"Colorado Booms-81231-A9634/2650"]
["2017-01-19","Yanaki",105,"Colorado Booms-81231-Y9634/2072"]
["2017-02-05","Aspen",94,"Colorado Booms-81231-A9634/2650"]
["2017-01-18","Eagle",80,"Colorado Booms-81231-E9634/2386"]
["2017-02-21","Carlota",47,"Gel Booms-94608-C4369/2213"]
["2017-02-22","TriBoom",103,"Colorado Booms-90009-T9634/2372"]
["2017-02-14","Bellen",50,"Gel Booms-94618-B4369/2593"]
["2017-02-01","Aspen",101,"Colorado Booms-81231-A9634/2650"]
["2017-01-29","Sunshine",78,"Gel Booms-94618-S4369/2297"]
["2017-03-24","Sunbell",74,"Gel Booms-94618-S4369/2241"]
["2017-01-02","Bellen",80,"Gel Booms-94618-B4369/2593"]
["2017-02-06","Bellen",103,"Gel Booms-94618-B4369/2593"]
["2017-02-09","Carlota",106,"Gel Booms-94608-C4369/2213"]
["2017-02-12","Quad",62,"Gel Booms-94608-Q4369/2290"]
["2017-02-08","Aspen",90,"Colorado Booms-81231-A9634/2650"]
["2017-01-22","Bellen",37,"Gel Booms-94618-B4369/2593"]
["2017-03-16","Carlota",64,"Gel Booms-94608-C4369/2213"]
["2017-03-11","Aspen",128,"Colorado Booms-81231-A9634/2650"]
["2017-01-24","TriBoom",80,"Colorado Booms-90009-T9634/2372"]
["2017-02-28","Yanaki",106,"Colorado Booms-81231-Y9634/2072"]
["2017-02-02","Quad",71,"Gel Booms-94608-Q4369/2290"]
["2017-02-08","TriBoom",68,"Colorado Booms-90009-T9634/2372"]
["2017-03-09","Sunbell",78,"Gel Booms-94618-S4369/2241"]
["2017-03-16","TriBoom",107,"Colorado Booms-90009-T9634/2372"]
["2017-02-26","Bellen",82,"Gel Booms-94618-B4369/2593"]
["2017-01-23","Yanaki",115,"Colorado Booms-81231-Y9634/2072"]
["2017-01-07","Carlota",69,"Gel Booms-94608-C4369/2213"]
["2017-01-29","Eagle",99,"Colorado Booms-81231-E9634/2386"]
["2017-02-27","Sunbell",93,"Gel Booms-94618-S4369/2241"]
["2017-01-19","Carlota",92,"Gel Booms-94608-C4369/2213"]
["2017-02-20","TriBoom",21,"Colorado Booms-90009-T9634/2372"]
["2017-03-07","Aspen",67,"Colorado Booms-81231-A9634/2650"]
["2017-03-01","Carlota",63,"Gel Booms-94608-C4369/2213"]
["2017-03-11","Sunbell",65,"Gel Booms-94618-S4369/2241"]
["2017-02-05","Eagle",102,"Colorado Booms-81231-E9634/2386"]
["2017-02-07","Quad",90,"Gel Booms-94608-Q4369/2290"]
["2017-03-01","Sunbell",78,"Gel Booms-94618-S4369/2241"]
["2017-03-02","Carlota",74,"Gel Booms-94608-C4369/2213"]
["2017-02-07","TriBoom",82,"Colorado Booms-90009-T9634/2372"]
["2017-02-08","Aspen",75,"Colorado Booms-81231-A9634/2650"]
["2017-02-22","Eagle",113,"Colorado Booms-81231-E9634/2386"]
["2017-01-12","Sunshine",94,"Gel Booms-94618-S4369/2297"]
["2017-01-05","Carlota",80,"Gel Booms-94608-C4369/2213"]
["2017-01-23","Yanaki",72,"Colorado Booms-81231-Y9634/2072"]
["2017-01-31","Carlota",79,{"$f":"INDEX($G$10:$G$18&\"-\"&$H$10:$H$18&\"-\"&$I$10:$I$18,MATCH(B645,$F$10:$F$18))","v":"Gel Booms-94608-C4369/2213"}]
["2017-01-22","TriBoom",94,"Colorado Booms-90009-T9634/2372"]
["2017-03-07","Carlota",37,"Gel Booms-94608-C4369/2213"]
["2017-01-15","Quad",88,"Gel Booms-94608-Q4369/2290"]
["2017-02-16","TriBoom",113,"Colorado Booms-90009-T9634/2372"]
["2017-01-01","Sunshine",97,"Gel Booms-94618-S4369/2297"]
["2017-01-21","Bellen",44,"Gel Booms-94618-B4369/2593"]
["2017-02-10","Carlota",59,"Gel Booms-94608-C4369/2213"]
["2017-02-27","Aspen",75,"Colorado Booms-81231-A9634/2650"]
["2017-01-14","Aspen",96,"Colorado Booms-81231-A9634/2650"]
["2017-01-17","Sunbell",96,"Gel Booms-94618-S4369/2241"]
["2017-01-14","Eagle",69,"Colorado Booms-81231-E9634/2386"]
["2017-03-05","TriBoom",131,"Colorado Booms-90009-T9634/2372"]
["2017-02-02","Carlota",96,"Gel Booms-94608-C4369/2213"]
["2017-03-26","Sunbell",114,"Gel Booms-94618-S4369/2241"]
["2017-02-20","Carlota",97,"Gel Booms-94608-C4369/2213"]
["2017-01-23","TriBoom",73,"Colorado Booms-90009-T9634/2372"]
["2017-02-12","TriBoom",106,"Colorado Booms-90009-T9634/2372"]
["2017-02-22","Quad",120,"Gel Booms-94608-Q4369/2290"]
["2017-03-05","Quad",74,"Gel Booms-94608-Q4369/2290"]
["2017-02-21","Aspen",67,"Colorado Booms-81231-A9634/2650"]
["2017-03-14","TriBoom",95,"Colorado Booms-90009-T9634/2372"]
["2017-01-17","Sunbell",58,"Gel Booms-94618-S4369/2241"]
["2017-01-17","Sunbell",87,"Gel Booms-94618-S4369/2241"]
["2017-01-16","Quad",41,"Gel Booms-94608-Q4369/2290"]
["2017-02-25","Bellen",62,"Gel Booms-94618-B4369/2593"]
["2017-01-17","TriBoom",88,"Colorado Booms-90009-T9634/2372"]
["2017-03-27","Sunbell",59,"Gel Booms-94618-S4369/2241"]
["2017-03-15","Yanaki",78,"Colorado Booms-81231-Y9634/2072"]
["2017-01-09","Aspen",61,"Colorado Booms-81231-A9634/2650"]
["2017-01-28","Quad",109,"Gel Booms-94608-Q4369/2290"]
["2017-01-10","Yanaki",51,"Colorado Booms-81231-Y9634/2072"]
["2017-01-06","Bellen",47,"Gel Booms-94618-B4369/2593"]
["2017-02-22","TriBoom",94,"Colorado Booms-90009-T9634/2372"]
["2017-02-23","Quad",99,"Gel Booms-94608-Q4369/2290"]
["2017-01-11","Aspen",57,"Colorado Booms-81231-A9634/2650"]
["2017-03-04","Quad",58,"Gel Booms-94608-Q4369/2290"]
["2017-01-07","Eagle",89,"Colorado Booms-81231-E9634/2386"]
["2017-01-09","Bellen",80,"Gel Booms-94618-B4369/2593"]
["2017-03-30","TriBoom",60,"Colorado Booms-90009-T9634/2372"]
["2017-03-30","Aspen",25,"Colorado Booms-81231-A9634/2650"]
["2017-03-18","Aspen",74,"Colorado Booms-81231-A9634/2650"]
["2017-02-27","Bellen",88,"Gel Booms-94618-B4369/2593"]
["2017-03-18","Aspen",125,"Colorado Booms-81231-A9634/2650"]
["2017-03-22","Eagle",88,"Colorado Booms-81231-E9634/2386"]
["2017-01-16","Aspen",80,"Colorado Booms-81231-A9634/2650"]
["2017-02-11","Quad",89,"Gel Booms-94608-Q4369/2290"]
["2017-02-25","TriBoom",100,"Colorado Booms-90009-T9634/2372"]
["2017-03-09","Sunbell",51,"Gel Booms-94618-S4369/2241"]
["2017-01-05","Quad",119,"Gel Booms-94608-Q4369/2290"]
["2017-02-24","Carlota",58,"Gel Booms-94608-C4369/2213"]
["2017-02-03","Bellen",32,"Gel Booms-94618-B4369/2593"]
["2017-01-11","Carlota",60,"Gel Booms-94608-C4369/2213"]
["2017-03-07","Sunbell",89,"Gel Booms-94618-S4369/2241"]
["2017-02-11","Quad",58,"Gel Booms-94608-Q4369/2290"]
["2017-01-14","TriBoom",79,"Colorado Booms-90009-T9634/2372"]
["2017-03-21","Aspen",51,"Colorado Booms-81231-A9634/2650"]
["2017-01-17","Sunshine",109,"Gel Booms-94618-S4369/2297"]
["2017-03-19","Sunshine",65,"Gel Booms-94618-S4369/2297"]
["2017-01-05","Sunshine",78,"Gel Booms-94618-S4369/2297"]
["2017-01-13","Carlota",59,"Gel Booms-94608-C4369/2213"]
["2017-02-21","Carlota",63,"Gel Booms-94608-C4369/2213"]
["2017-02-03","Bellen",78,"Gel Booms-94618-B4369/2593"]
["2017-01-17","Eagle",84,"Colorado Booms-81231-E9634/2386"]
["2017-02-26","Yanaki",109,{"$f":"INDEX($G$10:$G$18&\"-\"&$H$10:$H$18&\"-\"&$I$10:$I$18,MATCH(B709,$F$10:$F$18))","v":"Colorado Booms-81231-Y9634/2072"}]
["2017-03-30","Quad",48,"Gel Booms-94608-Q4369/2290"]
["2017-03-01","TriBoom",88,"Colorado Booms-90009-T9634/2372"]
["2017-02-13","Aspen",101,"Colorado Booms-81231-A9634/2650"]
["2017-01-14","Sunbell",56,"Gel Booms-94618-S4369/2241"]
["2017-01-10","Eagle",73,"Colorado Booms-81231-E9634/2386"]
["2017-03-13","Carlota",79,"Gel Booms-94608-C4369/2213"]
["2017-02-24","Eagle",60,"Colorado Booms-81231-E9634/2386"]
["2017-03-29","Aspen",77,"Colorado Booms-81231-A9634/2650"]
["2017-01-07","Quad",69,"Gel Booms-94608-Q4369/2290"]
["2017-01-05","Sunbell",83,"Gel Booms-94618-S4369/2241"]
["2017-02-13","Aspen",87,"Colorado Booms-81231-A9634/2650"]
["2017-03-26","Sunbell",94,"Gel Booms-94618-S4369/2241"]
["2017-01-24","Bellen",106,"Gel Booms-94618-B4369/2593"]
["2017-01-28","Eagle",65,"Colorado Booms-81231-E9634/2386"]
["2017-01-08","Yanaki",107,"Colorado Booms-81231-Y9634/2072"]
["2017-03-04","Quad",91,"Gel Booms-94608-Q4369/2290"]
["2017-03-29","TriBoom",58,"Colorado Booms-90009-T9634/2372"]
["2017-01-23","Quad",87,"Gel Booms-94608-Q4369/2290"]
["2017-03-22","TriBoom",146,"Colorado Booms-90009-T9634/2372"]
["2017-03-14","Bellen",116,"Gel Booms-94618-B4369/2593"]
["2017-01-29","Aspen",66,"Colorado Booms-81231-A9634/2650"]
["2017-01-22","Bellen",60,"Gel Booms-94618-B4369/2593"]
["2017-01-28","Sunshine",92,"Gel Booms-94618-S4369/2297"]
["2017-02-17","Quad",26,"Gel Booms-94608-Q4369/2290"]
["2017-01-16","Eagle",83,"Colorado Booms-81231-E9634/2386"]
["2017-03-25","TriBoom",38,"Colorado Booms-90009-T9634/2372"]
["2017-01-03","Eagle",53,"Colorado Booms-81231-E9634/2386"]
["2017-02-20","Carlota",18,"Gel Booms-94608-C4369/2213"]
["2017-03-22","Sunshine",53,"Gel Booms-94618-S4369/2297"]
["2017-03-08","Quad",59,"Gel Booms-94608-Q4369/2290"]
["2017-02-17","Quad",89,"Gel Booms-94608-Q4369/2290"]
["2017-03-16","Sunbell",46,"Gel Booms-94618-S4369/2241"]
["2017-03-01","Aspen",58,"Colorado Booms-81231-A9634/2650"]
["2017-03-12","Quad",36,"Gel Booms-94608-Q4369/2290"]
["2017-03-17","Yanaki",44,"Colorado Booms-81231-Y9634/2072"]
["2017-03-24","Bellen",64,"Gel Booms-94618-B4369/2593"]
["2017-01-15","Carlota",90,"Gel Booms-94608-C4369/2213"]
["2017-01-19","Eagle",68,"Colorado Booms-81231-E9634/2386"]
["2017-03-04","Sunshine",86,"Gel Booms-94618-S4369/2297"]
["2017-03-27","Sunbell",80,"Gel Booms-94618-S4369/2241"]
["2017-01-31","Carlota",80,"Gel Booms-94608-C4369/2213"]
["2017-03-17","Aspen",87,"Colorado Booms-81231-A9634/2650"]
["2017-03-20","Yanaki",67,"Colorado Booms-81231-Y9634/2072"]
["2017-02-27","Quad",106,"Gel Booms-94608-Q4369/2290"]
["2017-01-20","Quad",77,"Gel Booms-94608-Q4369/2290"]
["2017-02-03","Sunbell",90,"Gel Booms-94618-S4369/2241"]
["2017-02-04","Eagle",93,"Colorado Booms-81231-E9634/2386"]
["2017-02-02","Sunshine",106,"Gel Booms-94618-S4369/2297"]
["2017-01-30","Yanaki",78,"Colorado Booms-81231-Y9634/2072"]
["2017-01-28","Yanaki",97,"Colorado Booms-81231-Y9634/2072"]
["2017-02-04","Yanaki",40,"Colorado Booms-81231-Y9634/2072"]
["2017-03-09","Eagle",59,"Colorado Booms-81231-E9634/2386"]
["2017-03-23","Yanaki",75,"Colorado Booms-81231-Y9634/2072"]
["2017-01-03","Eagle",78,"Colorado Booms-81231-E9634/2386"]
["2017-01-24","TriBoom",88,"Colorado Booms-90009-T9634/2372"]
["2017-02-08","TriBoom",74,"Colorado Booms-90009-T9634/2372"]
["2017-01-20","Sunshine",45,"Gel Booms-94618-S4369/2297"]
["2017-03-21","Sunbell",130,"Gel Booms-94618-S4369/2241"]
["2017-01-20","TriBoom",66,"Colorado Booms-90009-T9634/2372"]
["2017-01-19","Sunbell",78,"Gel Booms-94618-S4369/2241"]
["2017-03-09","Eagle",105,"Colorado Booms-81231-E9634/2386"]
["2017-01-19","Bellen",77,"Gel Booms-94618-B4369/2593"]
["2017-01-02","Sunbell",53,"Gel Booms-94618-S4369/2241"]
["2017-03-02","Sunshine",115,{"$f":"INDEX($G$10:$G$18&\"-\"&$H$10:$H$18&\"-\"&$I$10:$I$18,MATCH(B773,$F$10:$F$18))","v":"Gel Booms-94618-S4369/2297"}]
["2017-01-28","Quad",70,"Gel Booms-94608-Q4369/2290"]
["2017-03-23","Carlota",57,"Gel Booms-94608-C4369/2213"]
["2017-03-25","Sunshine",78,"Gel Booms-94618-S4369/2297"]
["2017-02-04","Carlota",41,"Gel Booms-94608-C4369/2213"]
["2017-03-02","TriBoom",34,"Colorado Booms-90009-T9634/2372"]
["2017-01-31","Sunshine",116,"Gel Booms-94618-S4369/2297"]
["2017-01-19","Aspen",39,"Colorado Booms-81231-A9634/2650"]
["2017-01-05","Sunshine",57,"Gel Booms-94618-S4369/2297"]
["2017-02-20","Yanaki",104,"Colorado Booms-81231-Y9634/2072"]
["2017-01-02","Eagle",76,"Colorado Booms-81231-E9634/2386"]
["2017-03-28","Quad",49,"Gel Booms-94608-Q4369/2290"]
["2017-02-05","Sunshine",30,"Gel Booms-94618-S4369/2297"]
["2017-02-24","Carlota",59,"Gel Booms-94608-C4369/2213"]
["2017-03-28","Sunshine",82,"Gel Booms-94618-S4369/2297"]
["2017-03-21","Carlota",81,"Gel Booms-94608-C4369/2213"]
["2017-03-21","Carlota",70,"Gel Booms-94608-C4369/2213"]
["2017-01-21","Sunbell",63,"Gel Booms-94618-S4369/2241"]
["2017-01-22","Bellen",79,"Gel Booms-94618-B4369/2593"]
["2017-01-21","Quad",85,"Gel Booms-94608-Q4369/2290"]
["2017-01-20","Quad",72,"Gel Booms-94608-Q4369/2290"]
["2017-01-15","Carlota",73,"Gel Booms-94608-C4369/2213"]
["2017-03-08","TriBoom",52,"Colorado Booms-90009-T9634/2372"]
["2017-01-09","Sunshine",72,"Gel Booms-94618-S4369/2297"]
["2017-02-07","Sunbell",42,"Gel Booms-94618-S4369/2241"]
["2017-03-12","Aspen",71,"Colorado Booms-81231-A9634/2650"]
["2017-02-16","Quad",97,"Gel Booms-94608-Q4369/2290"]
["2017-01-15","Carlota",107,"Gel Booms-94608-C4369/2213"]
["2017-02-23","Aspen",44,"Colorado Booms-81231-A9634/2650"]
["2017-03-21","Carlota",70,"Gel Booms-94608-C4369/2213"]
["2017-02-18","Eagle",55,"Colorado Booms-81231-E9634/2386"]
["2017-02-05","Quad",34,"Gel Booms-94608-Q4369/2290"]
["2017-02-08","Quad",52,"Gel Booms-94608-Q4369/2290"]
["2017-03-02","Bellen",70,"Gel Booms-94618-B4369/2593"]
["2017-03-10","Sunbell",60,"Gel Booms-94618-S4369/2241"]
["2017-01-16","Carlota",77,"Gel Booms-94608-C4369/2213"]
["2017-01-17","Bellen",92,"Gel Booms-94618-B4369/2593"]
["2017-01-18","Sunshine",99,"Gel Booms-94618-S4369/2297"]
["2017-01-30","Bellen",124,"Gel Booms-94618-B4369/2593"]
["2017-02-07","Sunbell",94,"Gel Booms-94618-S4369/2241"]
["2017-02-17","TriBoom",59,"Colorado Booms-90009-T9634/2372"]
["2017-03-30","Sunbell",68,"Gel Booms-94618-S4369/2241"]
["2017-01-15","TriBoom",71,"Colorado Booms-90009-T9634/2372"]

{"sheet":"3 LOOKUP Aprox","index":4,"n_rows":815,"n_cols":25,"rows_kept":815,"cut":false,"hidden":false,"merged":[]}
["Excel Magic Trick 1352: Lookup 3 Items & Return to Single Cell VLOOKUP, INDEX or LOOKUP functions?"]
[]
["Date","Product","Units","Company-ZipCode-ID",null,null,null,null,null,null,null,null,null,null,null,null,null,null,null,null,null,null,"Date","Product","Units"]
["2017-03-16","Aspen",47,{"$f":"LOOKUP(B4,$F$10:$G$18)&\"-\"&LOOKUP(B4,$F$10:$H$18)&\"-\"&LOOKUP(B4,$F$10:$I$18)","v":"Colorado Booms-81231-A9634/2650"},null,null,null,null,null,null,null,null,null,null,null,null,null,null,null,null,null,null,{"$f":"RANDBETWEEN(\"1/1/2017\",\"3/31/2017\")","v":"2017-02-27"},{"$f":"INDEX($F$10:$F$18,RANDBETWEEN(1,ROWS($F$10:$F$18)))","v":"Quad"},{"$f":"INT(ABS(_xlfn.NORM.INV(RAND(),75,25)))","v":93}]
["2017-03-29","Sunbell",90,{"$f":"LOOKUP(B5,$F$10:$G$18)&\"-\"&LOOKUP(B5,$F$10:$H$18)&\"-\"&LOOKUP(B5,$F$10:$I$18)","v":"Gel Booms-94618-S4369/2241"}]
["2017-03-02","Eagle",83,"Colorado Booms-81231-E9634/2386"]
["2017-03-25","Aspen",83,"Colorado Booms-81231-A9634/2650"]
["2017-01-11","Bellen",59,"Gel Booms-94618-B4369/2593"]
["2017-01-15","TriBoom",45,"Colorado Booms-90009-T9634/2372",null,"Product","Company","PlantZipCode","ID","RetailPrice","StandardCost"]
["2017-03-15","Sunbell",99,"Gel Booms-94618-S4369/2241",null,"Aspen","Colorado Booms",81231,"A9634/2650",21.95,11.6335]
["2017-02-17","Carlota",114,"Gel Booms-94608-C4369/2213",null,"Bellen","Gel Booms",94618,"B4369/2593",23.95,11.975]
["2017-02-03","Carlota",91,"Gel Booms-94608-C4369/2213",null,"Carlota","Gel Booms",94608,"C4369/2213",28.95,14.185499999999999]
["2017-03-24","Sunbell",87,"Gel Booms-94618-S4369/2241",null,"Eagle","Colorado Booms",81231,"E9634/2386",19.95,8.9774999999999991]
["2017-02-25","Bellen",71,"Gel Booms-94618-B4369/2593",null,"Quad","Gel Booms",94608,"Q4369/2290",43.95,21.535500000000003]
["2017-03-08","Aspen",67,"Colorado Booms-81231-A9634/2650",null,"Sunbell","Gel Booms",94618,"S4369/2241",27.95,15.3725]
["2017-01-05","Yanaki",63,"Colorado Booms-81231-Y9634/2072",null,"Sunshine","Gel Booms",94618,"S4369/2297",22.95,12.163499999999999]
["2017-02-06","Quad",15,"Gel Booms-94608-Q4369/2290",null,"TriBoom","Colorado Booms",90009,"T9634/2372",23.95,11.256499999999999]
["2017-01-06","Yanaki",32,"Colorado Booms-81231-Y9634/2072",null,"Yanaki","Colorado Booms",81231,"Y9634/2072",24.95,13.472999999999999]
["2017-03-14","Aspen",88,"Colorado Booms-81231-A9634/2650"]
["2017-02-05","Quad",50,"Gel Booms-94608-Q4369/2290"]
["2017-02-10","Aspen",69,"Colorado Booms-81231-A9634/2650"]
["2017-02-22","Eagle",98,"Colorado Booms-81231-E9634/2386"]
["2017-02-28","Sunbell",87,"Gel Booms-94618-S4369/2241"]
["2017-02-13","Yanaki",61,"Colorado Booms-81231-Y9634/2072"]
["2017-03-22","Yanaki",51,"Colorado Booms-81231-Y9634/2072"]
["2017-03-26","Carlota",62,"Gel Booms-94608-C4369/2213"]
["2017-01-26","Aspen",78,"Colorado Booms-81231-A9634/2650"]
["2017-01-07","Aspen",32,"Colorado Booms-81231-A9634/2650"]
["2017-02-04","Carlota",93,"Gel Booms-94608-C4369/2213"]
["2017-02-12","Aspen",115,"Colorado Booms-81231-A9634/2650"]
["2017-03-19","Bellen",56,"Gel Booms-94618-B4369/2593"]
["2017-03-11","Eagle",68,"Colorado Booms-81231-E9634/2386"]
["2017-03-09","Carlota",71,"Gel Booms-94608-C4369/2213"]
["2017-01-30","Carlota",73,"Gel Booms-94608-C4369/2213"]
["2017-02-16","Carlota",47,"Gel Booms-94608-C4369/2213"]
["2017-02-10","Carlota",82,"Gel Booms-94608-C4369/2213"]
["2017-02-21","Sunshine",61,"Gel Booms-94618-S4369/2297"]
["2017-02-21","Quad",83,"Gel Booms-94608-Q4369/2290"]
["2017-02-02","TriBoom",47,"Colorado Booms-90009-T9634/2372"]
["2017-02-10","Yanaki",83,"Colorado Booms-81231-Y9634/2072"]
["2017-01-04","Carlota",74,"Gel Booms-94608-C4369/2213"]
["2017-01-25","Quad",65,"Gel Booms-94608-Q4369/2290"]
["2017-03-01","Bellen",109,"Gel Booms-94618-B4369/2593"]
["2017-02-20","Aspen",78,"Colorado Booms-81231-A9634/2650"]
["2017-01-02","Aspen",64,"Colorado Booms-81231-A9634/2650"]
["2017-03-30","Yanaki",109,"Colorado Booms-81231-Y9634/2072"]
["2017-01-16","TriBoom",58,"Colorado Booms-90009-T9634/2372"]
["2017-01-12","Carlota",60,"Gel Booms-94608-C4369/2213"]
["2017-02-05","Sunshine",102,"Gel Booms-94618-S4369/2297"]
["2017-02-14","Bellen",65,"Gel Booms-94618-B4369/2593"]
["2017-03-13","Sunbell",31,"Gel Booms-94618-S4369/2241"]
["2017-01-27","Aspen",102,"Colorado Booms-81231-A9634/2650"]
["2017-01-26","Quad",52,"Gel Booms-94608-Q4369/2290"]
["2017-03-08","Sunbell",95,"Gel Booms-94618-S4369/2241"]
["2017-01-08","Aspen",68,"Colorado Booms-81231-A9634/2650"]
["2017-03-11","Bellen",85,"Gel Booms-94618-B4369/2593"]
["2017-03-02","Yanaki",22,"Colorado Booms-81231-Y9634/2072"]
["2017-01-13","Sunshine",79,"Gel Booms-94618-S4369/2297"]
["2017-03-27","Aspen",62,"Colorado Booms-81231-A9634/2650"]
["2017-02-09","Eagle",70,"Colorado Booms-81231-E9634/2386"]
["2017-01-17","TriBoom",60,"Colorado Booms-90009-T9634/2372"]
["2017-03-11","Aspen",65,"Colorado Booms-81231-A9634/2650"]
["2017-03-07","TriBoom",84,"Colorado Booms-90009-T9634/2372"]
["2017-03-03","Carlota",67,"Gel Booms-94608-C4369/2213"]
["2017-03-13","Eagle",104,"Colorado Booms-81231-E9634/2386"]
["2017-01-18","Bellen",93,"Gel Booms-94618-B4369/2593"]
["2017-03-28","Carlota",82,"Gel Booms-94608-C4369/2213"]
["2017-03-10","Bellen",71,"Gel Booms-94618-B4369/2593"]
["2017-01-01","Eagle",71,{"$f":"LOOKUP(B69,$F$10:$G$18)&\"-\"&LOOKUP(B69,$F$10:$H$18)&\"-\"&LOOKUP(B69,$F$10:$I$18)","v":"Colorado Booms-81231-E9634/2386"}]
["2017-03-30","TriBoom",68,"Colorado Booms-90009-T9634/2372"]
["2017-01-15","Bellen",120,"Gel Booms-94618-B4369/2593"]
["2017-01-06","Sunbell",46,"Gel Booms-94618-S4369/2241"]
["2017-01-04","Carlota",96,"Gel Booms-94608-C4369/2213"]
["2017-02-03","Aspen",86,"Colorado Booms-81231-A9634/2650"]
["2017-03-28","Sunbell",79,"Gel Booms-94618-S4369/2241"]
["2017-02-22","Bellen",100,"Gel Booms-94618-B4369/2593"]
["2017-01-23","Yanaki",77,"Colorado Booms-81231-Y9634/2072"]
["2017-01-04","Sunbell",49,"Gel Booms-94618-S4369/2241"]
["2017-03-05","Eagle",92,"Colorado Booms-81231-E9634/2386"]
["2017-01-25","Sunshine",49,"Gel Booms-94618-S4369/2297"]
["2017-01-23","Aspen",9,"Colorado Booms-81231-A9634/2650"]
["2017-03-22","Bellen",44,"Gel Booms-94618-B4369/2593"]
["2017-02-27","Carlota",72,"Gel Booms-94608-C4369/2213"]
["2017-03-02","Carlota",59,"Gel Booms-94608-C4369/2213"]
["2017-01-17","Sunbell",90,"Gel Booms-94618-S4369/2241"]
["2017-02-25","Eagle",54,"Colorado Booms-81231-E9634/2386"]
["2017-01-31","Quad",71,"Gel Booms-94608-Q4369/2290"]
["2017-01-27","Eagle",90,"Colorado Booms-81231-E9634/2386"]
["2017-03-17","Quad",58,"Gel Booms-94608-Q4369/2290"]
["2017-01-29","Bellen",73,"Gel Booms-94618-B4369/2593"]
["2017-03-02","TriBoom",69,"Colorado Booms-90009-T9634/2372"]
["2017-01-11","Eagle",59,"Colorado Booms-81231-E9634/2386"]
["2017-03-06","Yanaki",71,"Colorado Booms-81231-Y9634/2072"]
["2017-02-06","Eagle",111,"Colorado Booms-81231-E9634/2386"]
["2017-03-24","TriBoom",59,"Colorado Booms-90009-T9634/2372"]
["2017-02-20","Carlota",103,"Gel Booms-94608-C4369/2213"]
["2017-02-22","TriBoom",59,"Colorado Booms-90009-T9634/2372"]
["2017-01-28","TriBoom",96,"Colorado Booms-90009-T9634/2372"]
["2017-01-24","TriBoom",53,"Colorado Booms-90009-T9634/2372"]
["2017-01-23","Eagle",43,"Colorado Booms-81231-E9634/2386"]
["2017-02-23","Bellen",67,"Gel Booms-94618-B4369/2593"]
["2017-02-16","Aspen",115,"Colorado Booms-81231-A9634/2650"]
["2017-02-07","TriBoom",93,"Colorado Booms-90009-T9634/2372"]
["2017-03-13","Yanaki",44,"Colorado Booms-81231-Y9634/2072"]
["2017-02-09","Yanaki",82,"Colorado Booms-81231-Y9634/2072"]
["2017-01-24","Aspen",96,"Colorado Booms-81231-A9634/2650"]
["2017-03-03","Eagle",115,"Colorado Booms-81231-E9634/2386"]
["2017-03-15","Carlota",58,"Gel Booms-94608-C4369/2213"]
["2017-02-13","Eagle",100,"Colorado Booms-81231-E9634/2386"]
["2017-03-29","TriBoom",80,"Colorado Booms-90009-T9634/2372"]
["2017-02-25","Sunshine",105,"Gel Booms-94618-S4369/2297"]
["2017-03-19","Sunshine",84,"Gel Booms-94618-S4369/2297"]
["2017-01-03","Bellen",62,"Gel Booms-94618-B4369/2593"]
["2017-03-13","Quad",92,"Gel Booms-94608-Q4369/2290"]
["2017-02-16","Sunshine",49,"Gel Booms-94618-S4369/2297"]
["2017-02-11","Aspen",119,"Colorado Booms-81231-A9634/2650"]
["2017-02-20","Bellen",41,"Gel Booms-94618-B4369/2593"]
["2017-01-13","Aspen",115,"Colorado Booms-81231-A9634/2650"]
["2017-01-04","Quad",103,"Gel Booms-94608-Q4369/2290"]
["2017-01-13","Bellen",79,"Gel Booms-94618-B4369/2593"]
["2017-01-04","Bellen",113,"Gel Booms-94618-B4369/2593"]
["2017-03-25","Aspen",49,"Colorado Booms-81231-A9634/2650"]
["2017-03-29","Quad",77,"Gel Booms-94608-Q4369/2290"]
["2017-02-20","Eagle",63,"Colorado Booms-81231-E9634/2386"]
["2017-02-04","Sunbell",84,"Gel Booms-94618-S4369/2241"]
["2017-02-04","TriBoom",89,"Colorado Booms-90009-T9634/2372"]
["2017-01-19","Sunbell",93,"Gel Booms-94618-S4369/2241"]
["2017-01-21","Bellen",46,"Gel Booms-94618-B4369/2593"]
["2017-01-31","TriBoom",45,"Colorado Booms-90009-T9634/2372"]
["2017-03-23","Yanaki",110,"Colorado Booms-81231-Y9634/2072"]
["2017-01-21","Aspen",54,"Colorado Booms-81231-A9634/2650"]
["2017-01-12","TriBoom",99,"Colorado Booms-90009-T9634/2372"]
["2017-02-19","Yanaki",92,{"$f":"LOOKUP(B133,$F$10:$G$18)&\"-\"&LOOKUP(B133,$F$10:$H$18)&\"-\"&LOOKUP(B133,$F$10:$I$18)","v":"Colorado Booms-81231-Y9634/2072"}]
["2017-02-02","TriBoom",81,"Colorado Booms-90009-T9634/2372"]
["2017-03-10","Carlota",101,"Gel Booms-94608-C4369/2213"]
["2017-02-23","TriBoom",70,"Colorado Booms-90009-T9634/2372"]
["2017-02-07","Yanaki",76,"Colorado Booms-81231-Y9634/2072"]
["2017-02-20","Carlota",103,"Gel Booms-94608-C4369/2213"]
["2017-02-03","Bellen",110,"Gel Booms-94618-B4369/2593"]
["2017-03-30","Carlota",103,"Gel Booms-94608-C4369/2213"]
["2017-03-03","Eagle",48,"Colorado Booms-81231-E9634/2386"]
["2017-03-30","Eagle",96,"Colorado Booms-81231-E9634/2386"]
["2017-01-19","Bellen",102,"Gel Booms-94618-B4369/2593"]
["2017-01-29","Sunshine",81,"Gel Booms-94618-S4369/2297"]
["2017-02-08","Yanaki",90,"Colorado Booms-81231-Y9634/2072"]
["2017-01-15","Bellen",45,"Gel Booms-94618-B4369/2593"]
["2017-02-09","Eagle",54,"Colorado Booms-81231-E9634/2386"]
["2017-02-20","Bellen",52,"Gel Booms-94618-B4369/2593"]
["2017-03-18","Quad",95,"Gel Booms-94608-Q4369/2290"]
["2017-03-15","Carlota",62,"Gel Booms-94608-C4369/2213"]
["2017-03-09","Yanaki",43,"Colorado Booms-81231-Y9634/2072"]
["2017-03-30","TriBoom",46,"Colorado Booms-90009-T9634/2372"]
["2017-01-28","Eagle",44,"Colorado Booms-81231-E9634/2386"]
["2017-01-20","Eagle",84,"Colorado Booms-81231-E9634/2386"]
["2017-02-25","Sunshine",57,"Gel Booms-94618-S4369/2297"]
["2017-01-18","Carlota",82,"Gel Booms-94608-C4369/2213"]
["2017-02-22","Sunbell",74,"Gel Booms-94618-S4369/2241"]
["2017-02-15","Carlota",49,"Gel Booms-94608-C4369/2213"]
["2017-01-01","Bellen",48,"Gel Booms-94618-B4369/2593"]
["2017-02-11","Eagle",105,"Colorado Booms-81231-E9634/2386"]
["2017-03-28","Carlota",43,"Gel Booms-94608-C4369/2213"]
["2017-02-07","Yanaki",60,"Colorado Booms-81231-Y9634/2072"]
["2017-03-13","Yanaki",53,"Colorado Booms-81231-Y9634/2072"]
["2017-02-28","Bellen",103,"Gel Booms-94618-B4369/2593"]
["2017-03-08","Sunbell",29,"Gel Booms-94618-S4369/2241"]
["2017-01-12","Sunshine",60,"Gel Booms-94618-S4369/2297"]
["2017-03-05","TriBoom",91,"Colorado Booms-90009-T9634/2372"]
["2017-02-18","Carlota",61,"Gel Booms-94608-C4369/2213"]
["2017-02-23","Quad",144,"Gel Booms-94608-Q4369/2290"]
["2017-01-28","Eagle",68,"Colorado Booms-81231-E9634/2386"]
["2017-01-15","Carlota",105,"Gel Booms-94608-C4369/2213"]
["2017-01-01","Aspen",71,"Colorado Booms-81231-A9634/2650"]
["2017-03-18","Carlota",44,"Gel Booms-94608-C4369/2213"]
["2017-03-06","Quad",79,"Gel Booms-94608-Q4369/2290"]
["2017-02-28","TriBoom",73,"Colorado Booms-90009-T9634/2372"]
["2017-01-25","Aspen",62,"Colorado Booms-81231-A9634/2650"]
["2017-02-19","Quad",89,"Gel Booms-94608-Q4369/2290"]
["2017-02-28","Yanaki",86,"Colorado Booms-81231-Y9634/2072"]
["2017-03-19","Eagle",65,"Colorado Booms-81231-E9634/2386"]
["2017-01-23","Eagle",68,"Colorado Booms-81231-E9634/2386"]
["2017-01-11","Quad",71,"Gel Booms-94608-Q4369/2290"]
["2017-01-01","Aspen",99,"Colorado Booms-81231-A9634/2650"]
["2017-01-23","Bellen",100,"Gel Booms-94618-B4369/2593"]
["2017-03-05","Sunshine",95,"Gel Booms-94618-S4369/2297"]
["2017-02-26","Sunshine",93,"Gel Booms-94618-S4369/2297"]
["2017-03-28","Quad",80,"Gel Booms-94608-Q4369/2290"]
["2017-01-03","Aspen",51,"Colorado Booms-81231-A9634/2650"]
["2017-03-30","TriBoom",64,"Colorado Booms-90009-T9634/2372"]
["2017-01-25","Bellen",78,"Gel Booms-94618-B4369/2593"]
["2017-03-14","Eagle",67,"Colorado Booms-81231-E9634/2386"]
["2017-03-01","Bellen",58,"Gel Booms-94618-B4369/2593"]
["2017-01-12","Bellen",43,"Gel Booms-94618-B4369/2593"]
["2017-01-03","Yanaki",98,"Colorado Booms-81231-Y9634/2072"]
["2017-01-03","Aspen",57,"Colorado Booms-81231-A9634/2650"]
["2017-02-17","Quad",23,"Gel Booms-94608-Q4369/2290"]
["2017-02-28","Carlota",59,"Gel Booms-94608-C4369/2213"]
["2017-02-07","Sunbell",45,{"$f":"LOOKUP(B197,$F$10:$G$18)&\"-\"&LOOKUP(B197,$F$10:$H$18)&\"-\"&LOOKUP(B197,$F$10:$I$18)","v":"Gel Booms-94618-S4369/2241"}]
["2017-02-06","Aspen",77,"Colorado Booms-81231-A9634/2650"]
["2017-01-25","Aspen",18,"Colorado Booms-81231-A9634/2650"]
["2017-02-01","Yanaki",69,"Colorado Booms-81231-Y9634/2072"]
["2017-01-22","Quad",88,"Gel Booms-94608-Q4369/2290"]
["2017-03-23","Yanaki",130,"Colorado Booms-81231-Y9634/2072"]
["2017-03-07","Sunshine",84,"Gel Booms-94618-S4369/2297"]
["2017-03-04","Carlota",77,"Gel Booms-94608-C4369/2213"]
["2017-01-29","Sunshine",54,"Gel Booms-94618-S4369/2297"]
["2017-01-25","Carlota",69,"Gel Booms-94608-C4369/2213"]
["2017-03-03","Sunshine",65,"Gel Booms-94618-S4369/2297"]
["2017-01-30","Quad",81,"Gel Booms-94608-Q4369/2290"]
["2017-03-01","Sunshine",57,"Gel Booms-94618-S4369/2297"]
["2017-03-05","Yanaki",37,"Colorado Booms-81231-Y9634/2072"]
["2017-03-18","Quad",24,"Gel Booms-94608-Q4369/2290"]
["2017-02-25","Bellen",63,"Gel Booms-94618-B4369/2593"]
["2017-03-03","Aspen",58,"Colorado Booms-81231-A9634/2650"]
["2017-01-08","Quad",72,"Gel Booms-94608-Q4369/2290"]
["2017-02-17","Yanaki",66,"Colorado Booms-81231-Y9634/2072"]
["2017-03-23","Eagle",46,"Colorado Booms-81231-E9634/2386"]
["2017-02-12","Eagle",64,"Colorado Booms-81231-E9634/2386"]
["2017-01-28","Aspen",36,"Colorado Booms-81231-A9634/2650"]
["2017-02-10","Aspen",124,"Colorado Booms-81231-A9634/2650"]
["2017-01-01","Aspen",81,"Colorado Booms-81231-A9634/2650"]
["2017-01-02","Carlota",47,"Gel Booms-94608-C4369/2213"]
["2017-02-17","Quad",94,"Gel Booms-94608-Q4369/2290"]
["2017-01-07","Bellen",69,"Gel Booms-94618-B4369/2593"]
["2017-03-10","TriBoom",48,"Colorado Booms-90009-T9634/2372"]
["2017-03-17","Quad",33,"Gel Booms-94608-Q4369/2290"]
["2017-01-25","Quad",89,"Gel Booms-94608-Q4369/2290"]
["2017-03-25","Sunbell",87,"Gel Booms-94618-S4369/2241"]
["2017-02-04","TriBoom",50,"Colorado Booms-90009-T9634/2372"]
["2017-01-10","Aspen",45,"Colorado Booms-81231-A9634/2650"]
["2017-03-20","Bellen",56,"Gel Booms-94618-B4369/2593"]
["2017-01-10","Bellen",20,"Gel Booms-94618-B4369/2593"]
["2017-02-07","Yanaki",77,"Colorado Booms-81231-Y9634/2072"]
["2017-02-20","Bellen",65,"Gel Booms-94618-B4369/2593"]
["2017-02-11","Carlota",61,"Gel Booms-94608-C4369/2213"]
["2017-03-21","Eagle",49,"Colorado Booms-81231-E9634/2386"]
["2017-02-07","Sunbell",77,"Gel Booms-94618-S4369/2241"]
["2017-01-25","Quad",34,"Gel Booms-94608-Q4369/2290"]
["2017-02-17","Carlota",64,"Gel Booms-94608-C4369/2213"]
["2017-03-29","Bellen",64,"Gel Booms-94618-B4369/2593"]
["2017-02-15","TriBoom",53,"Colorado Booms-90009-T9634/2372"]
["2017-01-10","Bellen",78,"Gel Booms-94618-B4369/2593"]
["2017-02-18","Aspen",131,"Colorado Booms-81231-A9634/2650"]
["2017-03-04","Sunbell",91,"Gel Booms-94618-S4369/2241"]
["2017-01-16","Carlota",105,"Gel Booms-94608-C4369/2213"]
["2017-03-24","Quad",113,"Gel Booms-94608-Q4369/2290"]
["2017-02-27","Yanaki",148,"Colorado Booms-81231-Y9634/2072"]
["2017-03-23","Sunshine",77,"Gel Booms-94618-S4369/2297"]
["2017-01-07","Sunbell",65,"Gel Booms-94618-S4369/2241"]
["2017-03-29","Bellen",92,"Gel Booms-94618-B4369/2593"]
["2017-01-22","Aspen",80,"Colorado Booms-81231-A9634/2650"]
["2017-03-19","Sunshine",90,"Gel Booms-94618-S4369/2297"]
["2017-01-09","Sunshine",49,"Gel Booms-94618-S4369/2297"]
["2017-03-10","Eagle",85,"Colorado Booms-81231-E9634/2386"]
["2017-01-12","Sunshine",37,"Gel Booms-94618-S4369/2297"]
["2017-03-12","Quad",112,"Gel Booms-94608-Q4369/2290"]
["2017-02-18","Sunshine",65,"Gel Booms-94618-S4369/2297"]
["2017-03-07","Carlota",106,"Gel Booms-94608-C4369/2213"]
["2017-01-12","TriBoom",63,"Colorado Booms-90009-T9634/2372"]
["2017-01-25","Quad",80,"Gel Booms-94608-Q4369/2290"]
["2017-02-18","TriBoom",103,"Colorado Booms-90009-T9634/2372"]
["2017-03-10","Bellen",92,{"$f":"LOOKUP(B261,$F$10:$G$18)&\"-\"&LOOKUP(B261,$F$10:$H$18)&\"-\"&LOOKUP(B261,$F$10:$I$18)","v":"Gel Booms-94618-B4369/2593"}]
["2017-01-25","Carlota",35,"Gel Booms-94608-C4369/2213"]
["2017-03-24","Yanaki",60,"Colorado Booms-81231-Y9634/2072"]
["2017-01-02","Eagle",63,"Colorado Booms-81231-E9634/2386"]
["2017-02-18","Yanaki",55,"Colorado Booms-81231-Y9634/2072"]
["2017-02-20","Carlota",57,"Gel Booms-94608-C4369/2213"]
["2017-01-20","Carlota",85,"Gel Booms-94608-C4369/2213"]
["2017-02-03","Sunbell",58,"Gel Booms-94618-S4369/2241"]
["2017-02-28","Aspen",125,"Colorado Booms-81231-A9634/2650"]
["2017-02-14","Yanaki",60,"Colorado Booms-81231-Y9634/2072"]
["2017-02-01","Sunshine",83,"Gel Booms-94618-S4369/2297"]
["2017-03-13","Sunbell",94,"Gel Booms-94618-S4369/2241"]
["2017-02-01","TriBoom",97,"Colorado Booms-90009-T9634/2372"]
["2017-02-15","Bellen",65,"Gel Booms-94618-B4369/2593"]
["2017-02-16","Carlota",55,"Gel Booms-94608-C4369/2213"]
["2017-02-25","Quad",78,"Gel Booms-94608-Q4369/2290"]
["2017-02-23","Quad",97,"Gel Booms-94608-Q4369/2290"]
["2017-03-08","Quad",56,"Gel Booms-94608-Q4369/2290"]
["2017-01-27","TriBoom",70,"Colorado Booms-90009-T9634/2372"]
["2017-02-20","Quad",83,"Gel Booms-94608-Q4369/2290"]
["2017-01-09","Carlota",85,"Gel Booms-94608-C4369/2213"]
["2017-01-01","Eagle",86,"Colorado Booms-81231-E9634/2386"]
["2017-01-31","Sunbell",64,"Gel Booms-94618-S4369/2241"]
["2017-03-24","Yanaki",88,"Colorado Booms-81231-Y9634/2072"]
["2017-02-15","Aspen",62,"Colorado Booms-81231-A9634/2650"]
["2017-02-03","Sunshine",79,"Gel Booms-94618-S4369/2297"]
["2017-02-22","Sunshine",70,"Gel Booms-94618-S4369/2297"]
["2017-03-08","Sunbell",79,"Gel Booms-94618-S4369/2241"]
["2017-03-04","Aspen",78,"Colorado Booms-81231-A9634/2650"]
["2017-02-02","TriBoom",63,"Colorado Booms-90009-T9634/2372"]
["2017-03-18","Aspen",83,"Colorado Booms-81231-A9634/2650"]
["2017-02-28","Quad",39,"Gel Booms-94608-Q4369/2290"]
["2017-01-08","Eagle",110,"Colorado Booms-81231-E9634/2386"]
["2017-03-28","Aspen",86,"Colorado Booms-81231-A9634/2650"]
["2017-03-27","Aspen",107,"Colorado Booms-81231-A9634/2650"]
["2017-02-16","Bellen",56,"Gel Booms-94618-B4369/2593"]
["2017-02-18","TriBoom",100,"Colorado Booms-90009-T9634/2372"]
["2017-01-08","TriBoom",85,"Colorado Booms-90009-T9634/2372"]
["2017-01-18","Sunbell",90,"Gel Booms-94618-S4369/2241"]
["2017-03-23","Eagle",43,"Colorado Booms-81231-E9634/2386"]
["2017-02-19","Eagle",100,"Colorado Booms-81231-E9634/2386"]
["2017-01-25","Sunshine",131,"Gel Booms-94618-S4369/2297"]
["2017-01-22","Quad",90,"Gel Booms-94608-Q4369/2290"]
["2017-03-28","Sunbell",82,"Gel Booms-94618-S4369/2241"]
["2017-03-15","Aspen",36,"Colorado Booms-81231-A9634/2650"]
["2017-02-10","Bellen",51,"Gel Booms-94618-B4369/2593"]
["2017-01-27","Sunshine",62,"Gel Booms-94618-S4369/2297"]
["2017-02-05","Quad",58,"Gel Booms-94608-Q4369/2290"]
["2017-01-07","Sunshine",97,"Gel Booms-94618-S4369/2297"]
["2017-02-15","Sunshine",94,"Gel Booms-94618-S4369/2297"]
["2017-02-03","Yanaki",70,"Colorado Booms-81231-Y9634/2072"]
["2017-03-06","Quad",47,"Gel Booms-94608-Q4369/2290"]
["2017-01-20","Bellen",52,"Gel Booms-94618-B4369/2593"]
["2017-01-20","Carlota",123,"Gel Booms-94608-C4369/2213"]
["2017-02-11","Sunshine",64,"Gel Booms-94618-S4369/2297"]
["2017-03-31","Yanaki",75,"Colorado Booms-81231-Y9634/2072"]
["2017-02-22","TriBoom",60,"Colorado Booms-90009-T9634/2372"]
["2017-02-18","Eagle",61,"Colorado Booms-81231-E9634/2386"]
["2017-03-15","Aspen",76,"Colorado Booms-81231-A9634/2650"]
["2017-02-28","Bellen",96,"Gel Booms-94618-B4369/2593"]
["2017-01-20","Bellen",34,"Gel Booms-94618-B4369/2593"]
["2017-03-24","Sunbell",106,"Gel Booms-94618-S4369/2241"]
["2017-03-06","Sunbell",66,"Gel Booms-94618-S4369/2241"]
["2017-01-21","Sunbell",67,"Gel Booms-94618-S4369/2241"]
["2017-02-06","Eagle",96,{"$f":"LOOKUP(B325,$F$10:$G$18)&\"-\"&LOOKUP(B325,$F$10:$H$18)&\"-\"&LOOKUP(B325,$F$10:$I$18)","v":"Colorado Booms-81231-E9634/2386"}]
["2017-03-08","Bellen",84,"Gel Booms-94618-B4369/2593"]
["2017-03-11","Sunshine",39,"Gel Booms-94618-S4369/2297"]
["2017-01-09","Eagle",88,"Colorado Booms-81231-E9634/2386"]
["2017-03-04","Sunshine",60,"Gel Booms-94618-S4369/2297"]
["2017-03-11","Carlota",63,"Gel Booms-94608-C4369/2213"]
["2017-02-22","Eagle",47,"Colorado Booms-81231-E9634/2386"]
["2017-01-24","Bellen",57,"Gel Booms-94618-B4369/2593"]
["2017-02-02","Bellen",83,"Gel Booms-94618-B4369/2593"]
["2017-03-24","Eagle",92,"Colorado Booms-81231-E9634/2386"]
["2017-01-07","Sunbell",62,"Gel Booms-94618-S4369/2241"]
["2017-02-19","Bellen",53,"Gel Booms-94618-B4369/2593"]
["2017-03-02","Carlota",62,"Gel Booms-94608-C4369/2213"]
["2017-01-03","Sunshine",89,"Gel Booms-94618-S4369/2297"]
["2017-03-26","Yanaki",61,"Colorado Booms-81231-Y9634/2072"]
["2017-03-02","Carlota",94,"Gel Booms-94608-C4369/2213"]
["2017-02-25","Carlota",61,"Gel Booms-94608-C4369/2213"]
["2017-03-20","Aspen",48,"Colorado Booms-81231-A9634/2650"]
["2017-02-12","Quad",61,"Gel Booms-94608-Q4369/2290"]
["2017-01-19","Quad",50,"Gel Booms-94608-Q4369/2290"]
["2017-03-19","Sunbell",31,"Gel Booms-94618-S4369/2241"]
["2017-01-23","Bellen",54,"Gel Booms-94618-B4369/2593"]
["2017-02-14","Eagle",89,"Colorado Booms-81231-E9634/2386"]
["2017-03-04","Bellen",72,"Gel Booms-94618-B4369/2593"]
["2017-03-11","TriBoom",73,"Colorado Booms-90009-T9634/2372"]
["2017-01-03","Sunshine",67,"Gel Booms-94618-S4369/2297"]
["2017-02-03","Eagle",102,"Colorado Booms-81231-E9634/2386"]
["2017-02-15","Sunbell",81,"Gel Booms-94618-S4369/2241"]
["2017-01-15","Yanaki",63,"Colorado Booms-81231-Y9634/2072"]
["2017-02-12","Carlota",63,"Gel Booms-94608-C4369/2213"]
["2017-01-15","Yanaki",105,"Colorado Booms-81231-Y9634/2072"]
["2017-02-19","Sunshine",125,"Gel Booms-94618-S4369/2297"]
["2017-03-30","Bellen",78,"Gel Booms-94618-B4369/2593"]
["2017-02-16","Quad",88,"Gel Booms-94608-Q4369/2290"]
["2017-02-19","Sunbell",77,"Gel Booms-94618-S4369/2241"]
["2017-01-19","Sunshine",73,"Gel Booms-94618-S4369/2297"]
["2017-01-09","Sunshine",45,"Gel Booms-94618-S4369/2297"]
["2017-02-03","Sunbell",92,"Gel Booms-94618-S4369/2241"]
["2017-03-01","Aspen",77,"Colorado Booms-81231-A9634/2650"]
["2017-02-28","Eagle",116,"Colorado Booms-81231-E9634/2386"]
["2017-01-08","Yanaki",94,"Colorado Booms-81231-Y9634/2072"]
["2017-01-28","Yanaki",123,"Colorado Booms-81231-Y9634/2072"]
["2017-01-27","Quad",88,"Gel Booms-94608-Q4369/2290"]
["2017-01-22","Carlota",45,"Gel Booms-94608-C4369/2213"]
["2017-02-19","Sunbell",85,"Gel Booms-94618-S4369/2241"]
["2017-01-11","Bellen",85,"Gel Booms-94618-B4369/2593"]
["2017-03-04","Eagle",30,"Colorado Booms-81231-E9634/2386"]
["2017-03-16","Bellen",84,"Gel Booms-94618-B4369/2593"]
["2017-02-11","Eagle",99,"Colorado Booms-81231-E9634/2386"]
["2017-01-07","Aspen",92,"Colorado Booms-81231-A9634/2650"]
["2017-01-31","Yanaki",87,"Colorado Booms-81231-Y9634/2072"]
["2017-03-30","Sunbell",100,"Gel Booms-94618-S4369/2241"]
["2017-01-16","Eagle",99,"Colorado Booms-81231-E9634/2386"]
["2017-01-09","Sunbell",37,"Gel Booms-94618-S4369/2241"]
["2017-01-22","Sunbell",80,"Gel Booms-94618-S4369/2241"]
["2017-02-05","Sunshine",74,"Gel Booms-94618-S4369/2297"]
["2017-03-29","Yanaki",114,"Colorado Booms-81231-Y9634/2072"]
["2017-03-30","Yanaki",73,"Colorado Booms-81231-Y9634/2072"]
["2017-03-12","Carlota",100,"Gel Booms-94608-C4369/2213"]
["2017-01-30","TriBoom",74,"Colorado Booms-90009-T9634/2372"]
["2017-02-16","Eagle",48,"Colorado Booms-81231-E9634/2386"]
["2017-01-31","Sunshine",100,"Gel Booms-94618-S4369/2297"]
["2017-02-07","Eagle",101,"Colorado Booms-81231-E9634/2386"]
["2017-02-27","Carlota",83,"Gel Booms-94608-C4369/2213"]
["2017-01-21","Bellen",59,{"$f":"LOOKUP(B389,$F$10:$G$18)&\"-\"&LOOKUP(B389,$F$10:$H$18)&\"-\"&LOOKUP(B389,$F$10:$I$18)","v":"Gel Booms-94618-B4369/2593"}]
["2017-02-26","Eagle",81,"Colorado Booms-81231-E9634/2386"]
["2017-03-23","Eagle",91,"Colorado Booms-81231-E9634/2386"]
["2017-02-22","Carlota",99,"Gel Booms-94608-C4369/2213"]
["2017-02-12","Eagle",86,"Colorado Booms-81231-E9634/2386"]
["2017-02-19","Yanaki",67,"Colorado Booms-81231-Y9634/2072"]
["2017-03-25","Quad",18,"Gel Booms-94608-Q4369/2290"]
["2017-03-01","Eagle",76,"Colorado Booms-81231-E9634/2386"]
["2017-02-02","Eagle",54,"Colorado Booms-81231-E9634/2386"]
["2017-01-29","TriBoom",72,"Colorado Booms-90009-T9634/2372"]
["2017-02-12","Sunbell",35,"Gel Booms-94618-S4369/2241"]
["2017-01-13","Aspen",118,"Colorado Booms-81231-A9634/2650"]
["2017-02-13","Bellen",82,"Gel Booms-94618-B4369/2593"]
["2017-02-10","Sunshine",102,"Gel Booms-94618-S4369/2297"]
["2017-02-19","Eagle",118,"Colorado Booms-81231-E9634/2386"]
["2017-02-04","Eagle",58,"Colorado Booms-81231-E9634/2386"]
["2017-03-31","TriBoom",68,"Colorado Booms-90009-T9634/2372"]
["2017-02-10","Quad",41,"Gel Booms-94608-Q4369/2290"]
["2017-01-15","Yanaki",90,"Colorado Booms-81231-Y9634/2072"]
["2017-01-07","Eagle",63,"Colorado Booms-81231-E9634/2386"]
["2017-03-10","Bellen",95,"Gel Booms-94618-B4369/2593"]
["2017-01-18","Yanaki",19,"Colorado Booms-81231-Y9634/2072"]
["2017-02-17","Sunshine",39,"Gel Booms-94618-S4369/2297"]
["2017-03-13","Yanaki",43,"Colorado Booms-81231-Y9634/2072"]
["2017-01-04","TriBoom",56,"Colorado Booms-90009-T9634/2372"]
["2017-03-31","Quad",47,"Gel Booms-94608-Q4369/2290"]
["2017-03-13","Aspen",61,"Colorado Booms-81231-A9634/2650"]
["2017-01-11","Quad",66,"Gel Booms-94608-Q4369/2290"]
["2017-02-22","Aspen",87,"Colorado Booms-81231-A9634/2650"]
["2017-02-21","Sunbell",87,"Gel Booms-94618-S4369/2241"]
["2017-03-02","Eagle",78,"Colorado Booms-81231-E9634/2386"]
["2017-02-25","Eagle",67,"Colorado Booms-81231-E9634/2386"]
["2017-03-05","Sunbell",58,"Gel Booms-94618-S4369/2241"]
["2017-01-29","Carlota",82,"Gel Booms-94608-C4369/2213"]
["2017-01-15","Eagle",99,"Colorado Booms-81231-E9634/2386"]
["2017-03-28","Quad",98,"Gel Booms-94608-Q4369/2290"]
["2017-02-14","Yanaki",58,"Colorado Booms-81231-Y9634/2072"]
["2017-03-11","Aspen",80,"Colorado Booms-81231-A9634/2650"]
["2017-01-12","Aspen",36,"Colorado Booms-81231-A9634/2650"]
["2017-01-14","Sunbell",45,"Gel Booms-94618-S4369/2241"]
["2017-01-08","Quad",77,"Gel Booms-94608-Q4369/2290"]
["2017-02-02","TriBoom",106,"Colorado Booms-90009-T9634/2372"]
["2017-03-10","Sunbell",59,"Gel Booms-94618-S4369/2241"]
["2017-03-25","Sunshine",69,"Gel Booms-94618-S4369/2297"]
["2017-03-02","Yanaki",94,"Colorado Booms-81231-Y9634/2072"]
["2017-01-02","Eagle",118,"Colorado Booms-81231-E9634/2386"]
["2017-01-25","Sunbell",69,"Gel Booms-94618-S4369/2241"]
["2017-01-04","Aspen",50,"Colorado Booms-81231-A9634/2650"]
["2017-02-19","Carlota",92,"Gel Booms-94608-C4369/2213"]
["2017-02-04","Carlota",63,"Gel Booms-94608-C4369/2213"]
["2017-01-02","Carlota",64,"Gel Booms-94608-C4369/2213"]
["2017-03-22","TriBoom",115,"Colorado Booms-90009-T9634/2372"]
["2017-02-08","TriBoom",76,"Colorado Booms-90009-T9634/2372"]
["2017-01-25","TriBoom",30,"Colorado Booms-90009-T9634/2372"]
["2017-02-14","Bellen",106,"Gel Booms-94618-B4369/2593"]
["2017-02-26","Aspen",28,"Colorado Booms-81231-A9634/2650"]
["2017-02-12","Eagle",67,"Colorado Booms-81231-E9634/2386"]
["2017-02-14","Eagle",70,"Colorado Booms-81231-E9634/2386"]
["2017-01-24","TriBoom",78,"Colorado Booms-90009-T9634/2372"]
["2017-02-23","Aspen",44,"Colorado Booms-81231-A9634/2650"]
["2017-01-18","Aspen",80,"Colorado Booms-81231-A9634/2650"]
["2017-02-18","Quad",38,"Gel Booms-94608-Q4369/2290"]
["2017-03-10","Carlota",47,"Gel Booms-94608-C4369/2213"]
["2017-03-31","Sunbell",64,"Gel Booms-94618-S4369/2241"]
["2017-01-12","Eagle",43,{"$f":"LOOKUP(B453,$F$10:$G$18)&\"-\"&LOOKUP(B453,$F$10:$H$18)&\"-\"&LOOKUP(B453,$F$10:$I$18)","v":"Colorado Booms-81231-E9634/2386"}]
["2017-01-30","Yanaki",101,"Colorado Booms-81231-Y9634/2072"]
["2017-01-30","Quad",97,"Gel Booms-94608-Q4369/2290"]
["2017-03-09","TriBoom",63,"Colorado Booms-90009-T9634/2372"]
["2017-02-06","Bellen",80,"Gel Booms-94618-B4369/2593"]
["2017-03-24","Eagle",44,"Colorado Booms-81231-E9634/2386"]
["2017-02-18","Sunbell",37,"Gel Booms-94618-S4369/2241"]
["2017-01-30","Sunbell",65,"Gel Booms-94618-S4369/2241"]
["2017-01-29","TriBoom",64,"Colorado Booms-90009-T9634/2372"]
["2017-02-17","Aspen",75,"Colorado Booms-81231-A9634/2650"]
["2017-02-16","Aspen",98,"Colorado Booms-81231-A9634/2650"]
["2017-02-18","Carlota",83,"Gel Booms-94608-C4369/2213"]
["2017-02-05","Bellen",76,"Gel Booms-94618-B4369/2593"]
["2017-02-22","TriBoom",80,"Colorado Booms-90009-T9634/2372"]
["2017-02-10","Yanaki",43,"Colorado Booms-81231-Y9634/2072"]
["2017-01-30","Sunbell",71,"Gel Booms-94618-S4369/2241"]
["2017-03-09","Bellen",119,"Gel Booms-94618-B4369/2593"]
["2017-02-08","Bellen",91,"Gel Booms-94618-B4369/2593"]
["2017-03-23","Sunshine",111,"Gel Booms-94618-S4369/2297"]
["2017-03-25","Aspen",80,"Colorado Booms-81231-A9634/2650"]
["2017-02-18","Carlota",23,"Gel Booms-94608-C4369/2213"]
["2017-03-20","Carlota",65,"Gel Booms-94608-C4369/2213"]
["2017-02-21","Aspen",34,"Colorado Booms-81231-A9634/2650"]
["2017-01-24","Aspen",89,"Colorado Booms-81231-A9634/2650"]
["2017-03-05","Eagle",132,"Colorado Booms-81231-E9634/2386"]
["2017-01-07","Aspen",109,"Colorado Booms-81231-A9634/2650"]
["2017-01-13","Yanaki",82,"Colorado Booms-81231-Y9634/2072"]
["2017-02-12","Eagle",64,"Colorado Booms-81231-E9634/2386"]
["2017-02-03","Bellen",72,"Gel Booms-94618-B4369/2593"]
["2017-02-05","Bellen",34,"Gel Booms-94618-B4369/2593"]
["2017-01-08","TriBoom",84,"Colorado Booms-90009-T9634/2372"]
["2017-03-18","TriBoom",103,"Colorado Booms-90009-T9634/2372"]
["2017-01-14","Carlota",110,"Gel Booms-94608-C4369/2213"]
["2017-01-16","Aspen",73,"Colorado Booms-81231-A9634/2650"]
["2017-01-22","Sunshine",85,"Gel Booms-94618-S4369/2297"]
["2017-01-09","Eagle",99,"Colorado Booms-81231-E9634/2386"]
["2017-02-25","Eagle",80,"Colorado Booms-81231-E9634/2386"]
["2017-03-04","Carlota",89,"Gel Booms-94608-C4369/2213"]
["2017-02-04","Carlota",99,"Gel Booms-94608-C4369/2213"]
["2017-02-04","Eagle",38,"Colorado Booms-81231-E9634/2386"]
["2017-03-09","Aspen",69,"Colorado Booms-81231-A9634/2650"]
["2017-03-11","Sunbell",83,"Gel Booms-94618-S4369/2241"]
["2017-01-16","Carlota",83,"Gel Booms-94608-C4369/2213"]
["2017-03-18","Bellen",29,"Gel Booms-94618-B4369/2593"]
["2017-01-22","TriBoom",73,"Colorado Booms-90009-T9634/2372"]
["2017-02-15","Aspen",72,"Colorado Booms-81231-A9634/2650"]
["2017-03-21","TriBoom",72,"Colorado Booms-90009-T9634/2372"]
["2017-03-12","Aspen",103,"Colorado Booms-81231-A9634/2650"]
["2017-02-15","Bellen",104,"Gel Booms-94618-B4369/2593"]
["2017-01-14","Aspen",91,"Colorado Booms-81231-A9634/2650"]
["2017-01-15","TriBoom",78,"Colorado Booms-90009-T9634/2372"]
["2017-03-16","Sunbell",57,"Gel Booms-94618-S4369/2241"]
["2017-02-07","Sunbell",103,"Gel Booms-94618-S4369/2241"]
["2017-03-02","TriBoom",89,"Colorado Booms-90009-T9634/2372"]
["2017-01-10","Bellen",100,"Gel Booms-94618-B4369/2593"]
["2017-01-07","Bellen",108,"Gel Booms-94618-B4369/2593"]
["2017-01-13","Yanaki",74,"Colorado Booms-81231-Y9634/2072"]
["2017-01-16","Yanaki",96,"Colorado Booms-81231-Y9634/2072"]
["2017-02-19","Sunshine",63,"Gel Booms-94618-S4369/2297"]
["2017-01-04","Sunshine",116,"Gel Booms-94618-S4369/2297"]
["2017-01-31","Eagle",55,"Colorado Booms-81231-E9634/2386"]
["2017-01-06","Bellen",85,"Gel Booms-94618-B4369/2593"]
["2017-01-11","Bellen",71,"Gel Booms-94618-B4369/2593"]
["2017-02-15","Quad",52,"Gel Booms-94608-Q4369/2290"]
["2017-01-25","Aspen",68,{"$f":"LOOKUP(B517,$F$10:$G$18)&\"-\"&LOOKUP(B517,$F$10:$H$18)&\"-\"&LOOKUP(B517,$F$10:$I$18)","v":"Colorado Booms-81231-A9634/2650"}]
["2017-01-12","Quad",53,"Gel Booms-94608-Q4369/2290"]
["2017-01-19","Sunshine",118,"Gel Booms-94618-S4369/2297"]
["2017-03-13","Eagle",71,"Colorado Booms-81231-E9634/2386"]
["2017-03-24","Carlota",78,"Gel Booms-94608-C4369/2213"]
["2017-02-06","Sunshine",92,"Gel Booms-94618-S4369/2297"]
["2017-01-27","Sunshine",70,"Gel Booms-94618-S4369/2297"]
["2017-02-05","Quad",87,"Gel Booms-94608-Q4369/2290"]
["2017-02-22","Quad",130,"Gel Booms-94608-Q4369/2290"]
["2017-02-12","TriBoom",51,"Colorado Booms-90009-T9634/2372"]
["2017-03-03","Sunshine",87,"Gel Booms-94618-S4369/2297"]
["2017-03-21","Yanaki",82,"Colorado Booms-81231-Y9634/2072"]
["2017-02-17","Bellen",70,"Gel Booms-94618-B4369/2593"]
["2017-03-04","Yanaki",84,"Colorado Booms-81231-Y9634/2072"]
["2017-03-01","Aspen",99,"Colorado Booms-81231-A9634/2650"]
["2017-03-24","Yanaki",48,"Colorado Booms-81231-Y9634/2072"]
["2017-01-31","Quad",93,"Gel Booms-94608-Q4369/2290"]
["2017-01-15","Quad",66,"Gel Booms-94608-Q4369/2290"]
["2017-03-01","Yanaki",57,"Colorado Booms-81231-Y9634/2072"]
["2017-03-31","Carlota",24,"Gel Booms-94608-C4369/2213"]
["2017-02-19","Carlota",121,"Gel Booms-94608-C4369/2213"]
["2017-03-25","Bellen",91,"Gel Booms-94618-B4369/2593"]
["2017-02-25","TriBoom",87,"Colorado Booms-90009-T9634/2372"]
["2017-01-04","Yanaki",77,"Colorado Booms-81231-Y9634/2072"]
["2017-01-25","Sunshine",67,"Gel Booms-94618-S4369/2297"]
["2017-01-03","Bellen",102,"Gel Booms-94618-B4369/2593"]
["2017-01-01","Quad",72,"Gel Booms-94608-Q4369/2290"]
["2017-01-05","Sunbell",69,"Gel Booms-94618-S4369/2241"]
["2017-03-23","Sunshine",38,"Gel Booms-94618-S4369/2297"]
["2017-02-04","Aspen",69,"Colorado Booms-81231-A9634/2650"]
["2017-01-25","Bellen",64,"Gel Booms-94618-B4369/2593"]
["2017-01-28","TriBoom",35,"Colorado Booms-90009-T9634/2372"]
["2017-02-17","Sunbell",95,"Gel Booms-94618-S4369/2241"]
["2017-02-23","Carlota",83,"Gel Booms-94608-C4369/2213"]
["2017-03-12","Aspen",48,"Colorado Booms-81231-A9634/2650"]
["2017-02-07","Carlota",78,"Gel Booms-94608-C4369/2213"]
["2017-03-30","TriBoom",57,"Colorado Booms-90009-T9634/2372"]
["2017-02-21","Sunbell",84,"Gel Booms-94618-S4369/2241"]
["2017-01-23","Eagle",109,"Colorado Booms-81231-E9634/2386"]
["2017-02-15","TriBoom",46,"Colorado Booms-90009-T9634/2372"]
["2017-03-10","TriBoom",77,"Colorado Booms-90009-T9634/2372"]
["2017-03-17","Yanaki",97,"Colorado Booms-81231-Y9634/2072"]
["2017-01-24","Sunbell",89,"Gel Booms-94618-S4369/2241"]
["2017-03-22","Sunshine",56,"Gel Booms-94618-S4369/2297"]
["2017-02-16","Sunbell",77,"Gel Booms-94618-S4369/2241"]
["2017-01-25","Quad",72,"Gel Booms-94608-Q4369/2290"]
["2017-03-30","Sunshine",53,"Gel Booms-94618-S4369/2297"]
["2017-02-26","TriBoom",84,"Colorado Booms-90009-T9634/2372"]
["2017-01-04","Bellen",85,"Gel Booms-94618-B4369/2593"]
["2017-01-08","Sunbell",105,"Gel Booms-94618-S4369/2241"]
["2017-03-22","Sunbell",84,"Gel Booms-94618-S4369/2241"]
["2017-01-10","Eagle",98,"Colorado Booms-81231-E9634/2386"]
["2017-01-29","Eagle",73,"Colorado Booms-81231-E9634/2386"]
["2017-03-11","TriBoom",45,"Colorado Booms-90009-T9634/2372"]
["2017-02-02","Carlota",96,"Gel Booms-94608-C4369/2213"]
["2017-03-20","Bellen",80,"Gel Booms-94618-B4369/2593"]
["2017-02-15","Carlota",46,"Gel Booms-94608-C4369/2213"]
["2017-03-18","Yanaki",108,"Colorado Booms-81231-Y9634/2072"]
["2017-03-15","Sunshine",114,"Gel Booms-94618-S4369/2297"]
["2017-03-23","Quad",99,"Gel Booms-94608-Q4369/2290"]
["2017-01-21","Sunshine",46,"Gel Booms-94618-S4369/2297"]
["2017-02-01","Aspen",71,"Colorado Booms-81231-A9634/2650"]
["2017-03-01","Quad",88,"Gel Booms-94608-Q4369/2290"]
["2017-03-23","TriBoom",79,"Colorado Booms-90009-T9634/2372"]
["2017-03-29","Bellen",35,{"$f":"LOOKUP(B581,$F$10:$G$18)&\"-\"&LOOKUP(B581,$F$10:$H$18)&\"-\"&LOOKUP(B581,$F$10:$I$18)","v":"Gel Booms-94618-B4369/2593"}]
["2017-02-07","Yanaki",61,"Colorado Booms-81231-Y9634/2072"]
["2017-02-25","Aspen",59,"Colorado Booms-81231-A9634/2650"]
["2017-02-16","Sunbell",112,"Gel Booms-94618-S4369/2241"]
["2017-02-01","Bellen",69,"Gel Booms-94618-B4369/2593"]
["2017-02-04","Quad",110,"Gel Booms-94608-Q4369/2290"]
["2017-03-22","Sunbell",90,"Gel Booms-94618-S4369/2241"]
["2017-03-29","Aspen",94,"Colorado Booms-81231-A9634/2650"]
["2017-01-24","Eagle",85,"Colorado Booms-81231-E9634/2386"]
["2017-01-21","TriBoom",62,"Colorado Booms-90009-T9634/2372"]
["2017-02-26","Yanaki",109,"Colorado Booms-81231-Y9634/2072"]
["2017-02-11","Sunshine",63,"Gel Booms-94618-S4369/2297"]
["2017-01-31","Carlota",60,"Gel Booms-94608-C4369/2213"]
["2017-01-03","Eagle",107,"Colorado Booms-81231-E9634/2386"]
["2017-02-05","Sunshine",69,"Gel Booms-94618-S4369/2297"]
["2017-02-20","Yanaki",81,"Colorado Booms-81231-Y9634/2072"]
["2017-03-04","Yanaki",89,"Colorado Booms-81231-Y9634/2072"]
["2017-02-13","TriBoom",48,"Colorado Booms-90009-T9634/2372"]
["2017-01-10","Carlota",36,"Gel Booms-94608-C4369/2213"]
["2017-02-24","Yanaki",78,"Colorado Booms-81231-Y9634/2072"]
["2017-01-11","Aspen",58,"Colorado Booms-81231-A9634/2650"]
["2017-01-19","Yanaki",105,"Colorado Booms-81231-Y9634/2072"]
["2017-02-05","Aspen",94,"Colorado Booms-81231-A9634/2650"]
["2017-01-18","Eagle",80,"Colorado Booms-81231-E9634/2386"]
["2017-02-21","Carlota",47,"Gel Booms-94608-C4369/2213"]
["2017-02-22","TriBoom",103,"Colorado Booms-90009-T9634/2372"]
["2017-02-14","Bellen",50,"Gel Booms-94618-B4369/2593"]
["2017-02-01","Aspen",101,"Colorado Booms-81231-A9634/2650"]
["2017-01-29","Sunshine",78,"Gel Booms-94618-S4369/2297"]
["2017-03-24","Sunbell",74,"Gel Booms-94618-S4369/2241"]
["2017-01-02","Bellen",80,"Gel Booms-94618-B4369/2593"]
["2017-02-06","Bellen",103,"Gel Booms-94618-B4369/2593"]
["2017-02-09","Carlota",106,"Gel Booms-94608-C4369/2213"]
["2017-02-12","Quad",62,"Gel Booms-94608-Q4369/2290"]
["2017-02-08","Aspen",90,"Colorado Booms-81231-A9634/2650"]
["2017-01-22","Bellen",37,"Gel Booms-94618-B4369/2593"]
["2017-03-16","Carlota",64,"Gel Booms-94608-C4369/2213"]
["2017-03-11","Aspen",128,"Colorado Booms-81231-A9634/2650"]
["2017-01-24","TriBoom",80,"Colorado Booms-90009-T9634/2372"]
["2017-02-28","Yanaki",106,"Colorado Booms-81231-Y9634/2072"]
["2017-02-02","Quad",71,"Gel Booms-94608-Q4369/2290"]
["2017-02-08","TriBoom",68,"Colorado Booms-90009-T9634/2372"]
["2017-03-09","Sunbell",78,"Gel Booms-94618-S4369/2241"]
["2017-03-16","TriBoom",107,"Colorado Booms-90009-T9634/2372"]
["2017-02-26","Bellen",82,"Gel Booms-94618-B4369/2593"]
["2017-01-23","Yanaki",115,"Colorado Booms-81231-Y9634/2072"]
["2017-01-07","Carlota",69,"Gel Booms-94608-C4369/2213"]
["2017-01-29","Eagle",99,"Colorado Booms-81231-E9634/2386"]
["2017-02-27","Sunbell",93,"Gel Booms-94618-S4369/2241"]
["2017-01-19","Carlota",92,"Gel Booms-94608-C4369/2213"]
["2017-02-20","TriBoom",21,"Colorado Booms-90009-T9634/2372"]
["2017-03-07","Aspen",67,"Colorado Booms-81231-A9634/2650"]
["2017-03-01","Carlota",63,"Gel Booms-94608-C4369/2213"]
["2017-03-11","Sunbell",65,"Gel Booms-94618-S4369/2241"]
["2017-02-05","Eagle",102,"Colorado Booms-81231-E9634/2386"]
["2017-02-07","Quad",90,"Gel Booms-94608-Q4369/2290"]
["2017-03-01","Sunbell",78,"Gel Booms-94618-S4369/2241"]
["2017-03-02","Carlota",74,"Gel Booms-94608-C4369/2213"]
["2017-02-07","TriBoom",82,"Colorado Booms-90009-T9634/2372"]
["2017-02-08","Aspen",75,"Colorado Booms-81231-A9634/2650"]
["2017-02-22","Eagle",113,"Colorado Booms-81231-E9634/2386"]
["2017-01-12","Sunshine",94,"Gel Booms-94618-S4369/2297"]
["2017-01-05","Carlota",80,"Gel Booms-94608-C4369/2213"]
["2017-01-23","Yanaki",72,"Colorado Booms-81231-Y9634/2072"]
["2017-01-31","Carlota",79,{"$f":"LOOKUP(B645,$F$10:$G$18)&\"-\"&LOOKUP(B645,$F$10:$H$18)&\"-\"&LOOKUP(B645,$F$10:$I$18)","v":"Gel Booms-94608-C4369/2213"}]
["2017-01-22","TriBoom",94,"Colorado Booms-90009-T9634/2372"]
["2017-03-07","Carlota",37,"Gel Booms-94608-C4369/2213"]
["2017-01-15","Quad",88,"Gel Booms-94608-Q4369/2290"]
["2017-02-16","TriBoom",113,"Colorado Booms-90009-T9634/2372"]
["2017-01-01","Sunshine",97,"Gel Booms-94618-S4369/2297"]
["2017-01-21","Bellen",44,"Gel Booms-94618-B4369/2593"]
["2017-02-10","Carlota",59,"Gel Booms-94608-C4369/2213"]
["2017-02-27","Aspen",75,"Colorado Booms-81231-A9634/2650"]
["2017-01-14","Aspen",96,"Colorado Booms-81231-A9634/2650"]
["2017-01-17","Sunbell",96,"Gel Booms-94618-S4369/2241"]
["2017-01-14","Eagle",69,"Colorado Booms-81231-E9634/2386"]
["2017-03-05","TriBoom",131,"Colorado Booms-90009-T9634/2372"]
["2017-02-02","Carlota",96,"Gel Booms-94608-C4369/2213"]
["2017-03-26","Sunbell",114,"Gel Booms-94618-S4369/2241"]
["2017-02-20","Carlota",97,"Gel Booms-94608-C4369/2213"]
["2017-01-23","TriBoom",73,"Colorado Booms-90009-T9634/2372"]
["2017-02-12","TriBoom",106,"Colorado Booms-90009-T9634/2372"]
["2017-02-22","Quad",120,"Gel Booms-94608-Q4369/2290"]
["2017-03-05","Quad",74,"Gel Booms-94608-Q4369/2290"]
["2017-02-21","Aspen",67,"Colorado Booms-81231-A9634/2650"]
["2017-03-14","TriBoom",95,"Colorado Booms-90009-T9634/2372"]
["2017-01-17","Sunbell",58,"Gel Booms-94618-S4369/2241"]
["2017-01-17","Sunbell",87,"Gel Booms-94618-S4369/2241"]
["2017-01-16","Quad",41,"Gel Booms-94608-Q4369/2290"]
["2017-02-25","Bellen",62,"Gel Booms-94618-B4369/2593"]
["2017-01-17","TriBoom",88,"Colorado Booms-90009-T9634/2372"]
["2017-03-27","Sunbell",59,"Gel Booms-94618-S4369/2241"]
["2017-03-15","Yanaki",78,"Colorado Booms-81231-Y9634/2072"]
["2017-01-09","Aspen",61,"Colorado Booms-81231-A9634/2650"]
["2017-01-28","Quad",109,"Gel Booms-94608-Q4369/2290"]
["2017-01-10","Yanaki",51,"Colorado Booms-81231-Y9634/2072"]
["2017-01-06","Bellen",47,"Gel Booms-94618-B4369/2593"]
["2017-02-22","TriBoom",94,"Colorado Booms-90009-T9634/2372"]
["2017-02-23","Quad",99,"Gel Booms-94608-Q4369/2290"]
["2017-01-11","Aspen",57,"Colorado Booms-81231-A9634/2650"]
["2017-03-04","Quad",58,"Gel Booms-94608-Q4369/2290"]
["2017-01-07","Eagle",89,"Colorado Booms-81231-E9634/2386"]
["2017-01-09","Bellen",80,"Gel Booms-94618-B4369/2593"]
["2017-03-30","TriBoom",60,"Colorado Booms-90009-T9634/2372"]
["2017-03-30","Aspen",25,"Colorado Booms-81231-A9634/2650"]
["2017-03-18","Aspen",74,"Colorado Booms-81231-A9634/2650"]
["2017-02-27","Bellen",88,"Gel Booms-94618-B4369/2593"]
["2017-03-18","Aspen",125,"Colorado Booms-81231-A9634/2650"]
["2017-03-22","Eagle",88,"Colorado Booms-81231-E9634/2386"]
["2017-01-16","Aspen",80,"Colorado Booms-81231-A9634/2650"]
["2017-02-11","Quad",89,"Gel Booms-94608-Q4369/2290"]
["2017-02-25","TriBoom",100,"Colorado Booms-90009-T9634/2372"]
["2017-03-09","Sunbell",51,"Gel Booms-94618-S4369/2241"]
["2017-01-05","Quad",119,"Gel Booms-94608-Q4369/2290"]
["2017-02-24","Carlota",58,"Gel Booms-94608-C4369/2213"]
["2017-02-03","Bellen",32,"Gel Booms-94618-B4369/2593"]
["2017-01-11","Carlota",60,"Gel Booms-94608-C4369/2213"]
["2017-03-07","Sunbell",89,"Gel Booms-94618-S4369/2241"]
["2017-02-11","Quad",58,"Gel Booms-94608-Q4369/2290"]
["2017-01-14","TriBoom",79,"Colorado Booms-90009-T9634/2372"]
["2017-03-21","Aspen",51,"Colorado Booms-81231-A9634/2650"]
["2017-01-17","Sunshine",109,"Gel Booms-94618-S4369/2297"]
["2017-03-19","Sunshine",65,"Gel Booms-94618-S4369/2297"]
["2017-01-05","Sunshine",78,"Gel Booms-94618-S4369/2297"]
["2017-01-13","Carlota",59,"Gel Booms-94608-C4369/2213"]
["2017-02-21","Carlota",63,"Gel Booms-94608-C4369/2213"]
["2017-02-03","Bellen",78,"Gel Booms-94618-B4369/2593"]
["2017-01-17","Eagle",84,"Colorado Booms-81231-E9634/2386"]
["2017-02-26","Yanaki",109,{"$f":"LOOKUP(B709,$F$10:$G$18)&\"-\"&LOOKUP(B709,$F$10:$H$18)&\"-\"&LOOKUP(B709,$F$10:$I$18)","v":"Colorado Booms-81231-Y9634/2072"}]
["2017-03-30","Quad",48,"Gel Booms-94608-Q4369/2290"]
["2017-03-01","TriBoom",88,"Colorado Booms-90009-T9634/2372"]
["2017-02-13","Aspen",101,"Colorado Booms-81231-A9634/2650"]
["2017-01-14","Sunbell",56,"Gel Booms-94618-S4369/2241"]
["2017-01-10","Eagle",73,"Colorado Booms-81231-E9634/2386"]
["2017-03-13","Carlota",79,"Gel Booms-94608-C4369/2213"]
["2017-02-24","Eagle",60,"Colorado Booms-81231-E9634/2386"]
["2017-03-29","Aspen",77,"Colorado Booms-81231-A9634/2650"]
["2017-01-07","Quad",69,"Gel Booms-94608-Q4369/2290"]
["2017-01-05","Sunbell",83,"Gel Booms-94618-S4369/2241"]
["2017-02-13","Aspen",87,"Colorado Booms-81231-A9634/2650"]
["2017-03-26","Sunbell",94,"Gel Booms-94618-S4369/2241"]
["2017-01-24","Bellen",106,"Gel Booms-94618-B4369/2593"]
["2017-01-28","Eagle",65,"Colorado Booms-81231-E9634/2386"]
["2017-01-08","Yanaki",107,"Colorado Booms-81231-Y9634/2072"]
["2017-03-04","Quad",91,"Gel Booms-94608-Q4369/2290"]
["2017-03-29","TriBoom",58,"Colorado Booms-90009-T9634/2372"]
["2017-01-23","Quad",87,"Gel Booms-94608-Q4369/2290"]
["2017-03-22","TriBoom",146,"Colorado Booms-90009-T9634/2372"]
["2017-03-14","Bellen",116,"Gel Booms-94618-B4369/2593"]
["2017-01-29","Aspen",66,"Colorado Booms-81231-A9634/2650"]
["2017-01-22","Bellen",60,"Gel Booms-94618-B4369/2593"]
["2017-01-28","Sunshine",92,"Gel Booms-94618-S4369/2297"]
["2017-02-17","Quad",26,"Gel Booms-94608-Q4369/2290"]
["2017-01-16","Eagle",83,"Colorado Booms-81231-E9634/2386"]
["2017-03-25","TriBoom",38,"Colorado Booms-90009-T9634/2372"]
["2017-01-03","Eagle",53,"Colorado Booms-81231-E9634/2386"]
["2017-02-20","Carlota",18,"Gel Booms-94608-C4369/2213"]
["2017-03-22","Sunshine",53,"Gel Booms-94618-S4369/2297"]
["2017-03-08","Quad",59,"Gel Booms-94608-Q4369/2290"]
["2017-02-17","Quad",89,"Gel Booms-94608-Q4369/2290"]
["2017-03-16","Sunbell",46,"Gel Booms-94618-S4369/2241"]
["2017-03-01","Aspen",58,"Colorado Booms-81231-A9634/2650"]
["2017-03-12","Quad",36,"Gel Booms-94608-Q4369/2290"]
["2017-03-17","Yanaki",44,"Colorado Booms-81231-Y9634/2072"]
["2017-03-24","Bellen",64,"Gel Booms-94618-B4369/2593"]
["2017-01-15","Carlota",90,"Gel Booms-94608-C4369/2213"]
["2017-01-19","Eagle",68,"Colorado Booms-81231-E9634/2386"]
["2017-03-04","Sunshine",86,"Gel Booms-94618-S4369/2297"]
["2017-03-27","Sunbell",80,"Gel Booms-94618-S4369/2241"]
["2017-01-31","Carlota",80,"Gel Booms-94608-C4369/2213"]
["2017-03-17","Aspen",87,"Colorado Booms-81231-A9634/2650"]
["2017-03-20","Yanaki",67,"Colorado Booms-81231-Y9634/2072"]
["2017-02-27","Quad",106,"Gel Booms-94608-Q4369/2290"]
["2017-01-20","Quad",77,"Gel Booms-94608-Q4369/2290"]
["2017-02-03","Sunbell",90,"Gel Booms-94618-S4369/2241"]
["2017-02-04","Eagle",93,"Colorado Booms-81231-E9634/2386"]
["2017-02-02","Sunshine",106,"Gel Booms-94618-S4369/2297"]
["2017-01-30","Yanaki",78,"Colorado Booms-81231-Y9634/2072"]
["2017-01-28","Yanaki",97,"Colorado Booms-81231-Y9634/2072"]
["2017-02-04","Yanaki",40,"Colorado Booms-81231-Y9634/2072"]
["2017-03-09","Eagle",59,"Colorado Booms-81231-E9634/2386"]
["2017-03-23","Yanaki",75,"Colorado Booms-81231-Y9634/2072"]
["2017-01-03","Eagle",78,"Colorado Booms-81231-E9634/2386"]
["2017-01-24","TriBoom",88,"Colorado Booms-90009-T9634/2372"]
["2017-02-08","TriBoom",74,"Colorado Booms-90009-T9634/2372"]
["2017-01-20","Sunshine",45,"Gel Booms-94618-S4369/2297"]
["2017-03-21","Sunbell",130,"Gel Booms-94618-S4369/2241"]
["2017-01-20","TriBoom",66,"Colorado Booms-90009-T9634/2372"]
["2017-01-19","Sunbell",78,"Gel Booms-94618-S4369/2241"]
["2017-03-09","Eagle",105,"Colorado Booms-81231-E9634/2386"]
["2017-01-19","Bellen",77,"Gel Booms-94618-B4369/2593"]
["2017-01-02","Sunbell",53,"Gel Booms-94618-S4369/2241"]
["2017-03-02","Sunshine",115,{"$f":"LOOKUP(B773,$F$10:$G$18)&\"-\"&LOOKUP(B773,$F$10:$H$18)&\"-\"&LOOKUP(B773,$F$10:$I$18)","v":"Gel Booms-94618-S4369/2297"}]
["2017-01-28","Quad",70,"Gel Booms-94608-Q4369/2290"]
["2017-03-23","Carlota",57,"Gel Booms-94608-C4369/2213"]
["2017-03-25","Sunshine",78,"Gel Booms-94618-S4369/2297"]
["2017-02-04","Carlota",41,"Gel Booms-94608-C4369/2213"]
["2017-03-02","TriBoom",34,"Colorado Booms-90009-T9634/2372"]
["2017-01-31","Sunshine",116,"Gel Booms-94618-S4369/2297"]
["2017-01-19","Aspen",39,"Colorado Booms-81231-A9634/2650"]
["2017-01-05","Sunshine",57,"Gel Booms-94618-S4369/2297"]
["2017-02-20","Yanaki",104,"Colorado Booms-81231-Y9634/2072"]
["2017-01-02","Eagle",76,"Colorado Booms-81231-E9634/2386"]
["2017-03-28","Quad",49,"Gel Booms-94608-Q4369/2290"]
["2017-02-05","Sunshine",30,"Gel Booms-94618-S4369/2297"]
["2017-02-24","Carlota",59,"Gel Booms-94608-C4369/2213"]
["2017-03-28","Sunshine",82,"Gel Booms-94618-S4369/2297"]
["2017-03-21","Carlota",81,"Gel Booms-94608-C4369/2213"]
["2017-03-21","Carlota",70,"Gel Booms-94608-C4369/2213"]
["2017-01-21","Sunbell",63,"Gel Booms-94618-S4369/2241"]
["2017-01-22","Bellen",79,"Gel Booms-94618-B4369/2593"]
["2017-01-21","Quad",85,"Gel Booms-94608-Q4369/2290"]
["2017-01-20","Quad",72,"Gel Booms-94608-Q4369/2290"]
["2017-01-15","Carlota",73,"Gel Booms-94608-C4369/2213"]
["2017-03-08","TriBoom",52,"Colorado Booms-90009-T9634/2372"]
["2017-01-09","Sunshine",72,"Gel Booms-94618-S4369/2297"]
["2017-02-07","Sunbell",42,"Gel Booms-94618-S4369/2241"]
["2017-03-12","Aspen",71,"Colorado Booms-81231-A9634/2650"]
["2017-02-16","Quad",97,"Gel Booms-94608-Q4369/2290"]
["2017-01-15","Carlota",107,"Gel Booms-94608-C4369/2213"]
["2017-02-23","Aspen",44,"Colorado Booms-81231-A9634/2650"]
["2017-03-21","Carlota",70,"Gel Booms-94608-C4369/2213"]
["2017-02-18","Eagle",55,"Colorado Booms-81231-E9634/2386"]
["2017-02-05","Quad",34,"Gel Booms-94608-Q4369/2290"]
["2017-02-08","Quad",52,"Gel Booms-94608-Q4369/2290"]
["2017-03-02","Bellen",70,"Gel Booms-94618-B4369/2593"]
["2017-03-10","Sunbell",60,"Gel Booms-94618-S4369/2241"]
["2017-01-16","Carlota",77,"Gel Booms-94608-C4369/2213"]
["2017-01-17","Bellen",92,"Gel Booms-94618-B4369/2593"]
["2017-01-18","Sunshine",99,"Gel Booms-94618-S4369/2297"]
["2017-01-30","Bellen",124,"Gel Booms-94618-B4369/2593"]
["2017-02-07","Sunbell",94,"Gel Booms-94618-S4369/2241"]
["2017-02-17","TriBoom",59,"Colorado Booms-90009-T9634/2372"]
["2017-03-30","Sunbell",68,"Gel Booms-94618-S4369/2241"]
["2017-01-15","TriBoom",71,"Colorado Booms-90009-T9634/2372"]

{"sheet":"Bill Szysz (1)","index":5,"n_rows":815,"n_cols":11,"rows_kept":815,"cut":false,"hidden":false,"merged":[]}
[]
[]
["Date","Product","Units","Company-ZipCode-ID"]
["2017-03-16","Aspen",47,{"$f":"_xlfn.TEXTJOIN(\"-\",,INDEX($G$10:$I$18,MATCH(B4,$F$10:$F$18),))","v":"Colorado Booms-81231-A9634/2650"}]
["2017-03-29","Sunbell",90,{"$f":"_xlfn.TEXTJOIN(\"-\",,INDEX($G$10:$I$18,MATCH(B5,$F$10:$F$18),))","v":"Gel Booms-94618-S4369/2241"}]
["2017-03-02","Eagle",83,"Colorado Booms-81231-E9634/2386"]
["2017-03-25","Aspen",83,"Colorado Booms-81231-A9634/2650"]
["2017-01-11","Bellen",59,"Gel Booms-94618-B4369/2593"]
["2017-01-15","TriBoom",45,"Colorado Booms-90009-T9634/2372",null,"Product","Company","PlantZipCode","ID","RetailPrice","StandardCost"]
["2017-03-15","Sunbell",99,"Gel Booms-94618-S4369/2241",null,"Aspen","Colorado Booms",81231,"A9634/2650",21.95,11.6335]
["2017-02-17","Carlota",114,"Gel Booms-94608-C4369/2213",null,"Bellen","Gel Booms",94618,"B4369/2593",23.95,11.975]
["2017-02-03","Carlota",91,"Gel Booms-94608-C4369/2213",null,"Carlota","Gel Booms",94608,"C4369/2213",28.95,14.185499999999999]
["2017-03-24","Sunbell",87,"Gel Booms-94618-S4369/2241",null,"Eagle","Colorado Booms",81231,"E9634/2386",19.95,8.9774999999999991]
["2017-02-25","Bellen",71,"Gel Booms-94618-B4369/2593",null,"Quad","Gel Booms",94608,"Q4369/2290",43.95,21.535500000000003]
["2017-03-08","Aspen",67,"Colorado Booms-81231-A9634/2650",null,"Sunbell","Gel Booms",94618,"S4369/2241",27.95,15.3725]
["2017-01-05","Yanaki",63,"Colorado Booms-81231-Y9634/2072",null,"Sunshine","Gel Booms",94618,"S4369/2297",22.95,12.163499999999999]
["2017-02-06","Quad",15,"Gel Booms-94608-Q4369/2290",null,"TriBoom","Colorado Booms",90009,"T9634/2372",23.95,11.256499999999999]
["2017-01-06","Yanaki",32,"Colorado Booms-81231-Y9634/2072",null,"Yanaki","Colorado Booms",81231,"Y9634/2072",24.95,13.472999999999999]
["2017-03-14","Aspen",88,"Colorado Booms-81231-A9634/2650"]
["2017-02-05","Quad",50,"Gel Booms-94608-Q4369/2290"]
["2017-02-10","Aspen",69,"Colorado Booms-81231-A9634/2650"]
["2017-02-22","Eagle",98,"Colorado Booms-81231-E9634/2386"]
["2017-02-28","Sunbell",87,"Gel Booms-94618-S4369/2241"]
["2017-02-13","Yanaki",61,"Colorado Booms-81231-Y9634/2072"]
["2017-03-22","Yanaki",51,"Colorado Booms-81231-Y9634/2072"]
["2017-03-26","Carlota",62,"Gel Booms-94608-C4369/2213"]
["2017-01-26","Aspen",78,"Colorado Booms-81231-A9634/2650"]
["2017-01-07","Aspen",32,"Colorado Booms-81231-A9634/2650"]
["2017-02-04","Carlota",93,"Gel Booms-94608-C4369/2213"]
["2017-02-12","Aspen",115,"Colorado Booms-81231-A9634/2650"]
["2017-03-19","Bellen",56,"Gel Booms-94618-B4369/2593"]
["2017-03-11","Eagle",68,"Colorado Booms-81231-E9634/2386"]
["2017-03-09","Carlota",71,"Gel Booms-94608-C4369/2213"]
["2017-01-30","Carlota",73,"Gel Booms-94608-C4369/2213"]
["2017-02-16","Carlota",47,"Gel Booms-94608-C4369/2213"]
["2017-02-10","Carlota",82,"Gel Booms-94608-C4369/2213"]
["2017-02-21","Sunshine",61,"Gel Booms-94618-S4369/2297"]
["2017-02-21","Quad",83,"Gel Booms-94608-Q4369/2290"]
["2017-02-02","TriBoom",47,"Colorado Booms-90009-T9634/2372"]
["2017-02-10","Yanaki",83,"Colorado Booms-81231-Y9634/2072"]
["2017-01-04","Carlota",74,"Gel Booms-94608-C4369/2213"]
["2017-01-25","Quad",65,"Gel Booms-94608-Q4369/2290"]
["2017-03-01","Bellen",109,"Gel Booms-94618-B4369/2593"]
["2017-02-20","Aspen",78,"Colorado Booms-81231-A9634/2650"]
["2017-01-02","Aspen",64,"Colorado Booms-81231-A9634/2650"]
["2017-03-30","Yanaki",109,"Colorado Booms-81231-Y9634/2072"]
["2017-01-16","TriBoom",58,"Colorado Booms-90009-T9634/2372"]
["2017-01-12","Carlota",60,"Gel Booms-94608-C4369/2213"]
["2017-02-05","Sunshine",102,"Gel Booms-94618-S4369/2297"]
["2017-02-14","Bellen",65,"Gel Booms-94618-B4369/2593"]
["2017-03-13","Sunbell",31,"Gel Booms-94618-S4369/2241"]
["2017-01-27","Aspen",102,"Colorado Booms-81231-A9634/2650"]
["2017-01-26","Quad",52,"Gel Booms-94608-Q4369/2290"]
["2017-03-08","Sunbell",95,"Gel Booms-94618-S4369/2241"]
["2017-01-08","Aspen",68,"Colorado Booms-81231-A9634/2650"]
["2017-03-11","Bellen",85,"Gel Booms-94618-B4369/2593"]
["2017-03-02","Yanaki",22,"Colorado Booms-81231-Y9634/2072"]
["2017-01-13","Sunshine",79,"Gel Booms-94618-S4369/2297"]
["2017-03-27","Aspen",62,"Colorado Booms-81231-A9634/2650"]
["2017-02-09","Eagle",70,"Colorado Booms-81231-E9634/2386"]
["2017-01-17","TriBoom",60,"Colorado Booms-90009-T9634/2372"]
["2017-03-11","Aspen",65,"Colorado Booms-81231-A9634/2650"]
["2017-03-07","TriBoom",84,"Colorado Booms-90009-T9634/2372"]
["2017-03-03","Carlota",67,"Gel Booms-94608-C4369/2213"]
["2017-03-13","Eagle",104,"Colorado Booms-81231-E9634/2386"]
["2017-01-18","Bellen",93,"Gel Booms-94618-B4369/2593"]
["2017-03-28","Carlota",82,"Gel Booms-94608-C4369/2213"]
["2017-03-10","Bellen",71,"Gel Booms-94618-B4369/2593"]
["2017-01-01","Eagle",71,{"$f":"_xlfn.TEXTJOIN(\"-\",,INDEX($G$10:$I$18,MATCH(B69,$F$10:$F$18),))","v":"Colorado Booms-81231-E9634/2386"}]
["2017-03-30","TriBoom",68,"Colorado Booms-90009-T9634/2372"]
["2017-01-15","Bellen",120,"Gel Booms-94618-B4369/2593"]
["2017-01-06","Sunbell",46,"Gel Booms-94618-S4369/2241"]
["2017-01-04","Carlota",96,"Gel Booms-94608-C4369/2213"]
["2017-02-03","Aspen",86,"Colorado Booms-81231-A9634/2650"]
["2017-03-28","Sunbell",79,"Gel Booms-94618-S4369/2241"]
["2017-02-22","Bellen",100,"Gel Booms-94618-B4369/2593"]
["2017-01-23","Yanaki",77,"Colorado Booms-81231-Y9634/2072"]
["2017-01-04","Sunbell",49,"Gel Booms-94618-S4369/2241"]
["2017-03-05","Eagle",92,"Colorado Booms-81231-E9634/2386"]
["2017-01-25","Sunshine",49,"Gel Booms-94618-S4369/2297"]
["2017-01-23","Aspen",9,"Colorado Booms-81231-A9634/2650"]
["2017-03-22","Bellen",44,"Gel Booms-94618-B4369/2593"]
["2017-02-27","Carlota",72,"Gel Booms-94608-C4369/2213"]
["2017-03-02","Carlota",59,"Gel Booms-94608-C4369/2213"]
["2017-01-17","Sunbell",90,"Gel Booms-94618-S4369/2241"]
["2017-02-25","Eagle",54,"Colorado Booms-81231-E9634/2386"]
["2017-01-31","Quad",71,"Gel Booms-94608-Q4369/2290"]
["2017-01-27","Eagle",90,"Colorado Booms-81231-E9634/2386"]
["2017-03-17","Quad",58,"Gel Booms-94608-Q4369/2290"]
["2017-01-29","Bellen",73,"Gel Booms-94618-B4369/2593"]
["2017-03-02","TriBoom",69,"Colorado Booms-90009-T9634/2372"]
["2017-01-11","Eagle",59,"Colorado Booms-81231-E9634/2386"]
["2017-03-06","Yanaki",71,"Colorado Booms-81231-Y9634/2072"]
["2017-02-06","Eagle",111,"Colorado Booms-81231-E9634/2386"]
["2017-03-24","TriBoom",59,"Colorado Booms-90009-T9634/2372"]
["2017-02-20","Carlota",103,"Gel Booms-94608-C4369/2213"]
["2017-02-22","TriBoom",59,"Colorado Booms-90009-T9634/2372"]
["2017-01-28","TriBoom",96,"Colorado Booms-90009-T9634/2372"]
["2017-01-24","TriBoom",53,"Colorado Booms-90009-T9634/2372"]
["2017-01-23","Eagle",43,"Colorado Booms-81231-E9634/2386"]
["2017-02-23","Bellen",67,"Gel Booms-94618-B4369/2593"]
["2017-02-16","Aspen",115,"Colorado Booms-81231-A9634/2650"]
["2017-02-07","TriBoom",93,"Colorado Booms-90009-T9634/2372"]
["2017-03-13","Yanaki",44,"Colorado Booms-81231-Y9634/2072"]
["2017-02-09","Yanaki",82,"Colorado Booms-81231-Y9634/2072"]
["2017-01-24","Aspen",96,"Colorado Booms-81231-A9634/2650"]
["2017-03-03","Eagle",115,"Colorado Booms-81231-E9634/2386"]
["2017-03-15","Carlota",58,"Gel Booms-94608-C4369/2213"]
["2017-02-13","Eagle",100,"Colorado Booms-81231-E9634/2386"]
["2017-03-29","TriBoom",80,"Colorado Booms-90009-T9634/2372"]
["2017-02-25","Sunshine",105,"Gel Booms-94618-S4369/2297"]
["2017-03-19","Sunshine",84,"Gel Booms-94618-S4369/2297"]
["2017-01-03","Bellen",62,"Gel Booms-94618-B4369/2593"]
["2017-03-13","Quad",92,"Gel Booms-94608-Q4369/2290"]
["2017-02-16","Sunshine",49,"Gel Booms-94618-S4369/2297"]
["2017-02-11","Aspen",119,"Colorado Booms-81231-A9634/2650"]
["2017-02-20","Bellen",41,"Gel Booms-94618-B4369/2593"]
["2017-01-13","Aspen",115,"Colorado Booms-81231-A9634/2650"]
["2017-01-04","Quad",103,"Gel Booms-94608-Q4369/2290"]
["2017-01-13","Bellen",79,"Gel Booms-94618-B4369/2593"]
["2017-01-04","Bellen",113,"Gel Booms-94618-B4369/2593"]
["2017-03-25","Aspen",49,"Colorado Booms-81231-A9634/2650"]
["2017-03-29","Quad",77,"Gel Booms-94608-Q4369/2290"]
["2017-02-20","Eagle",63,"Colorado Booms-81231-E9634/2386"]
["2017-02-04","Sunbell",84,"Gel Booms-94618-S4369/2241"]
["2017-02-04","TriBoom",89,"Colorado Booms-90009-T9634/2372"]
["2017-01-19","Sunbell",93,"Gel Booms-94618-S4369/2241"]
["2017-01-21","Bellen",46,"Gel Booms-94618-B4369/2593"]
["2017-01-31","TriBoom",45,"Colorado Booms-90009-T9634/2372"]
["2017-03-23","Yanaki",110,"Colorado Booms-81231-Y9634/2072"]
["2017-01-21","Aspen",54,"Colorado Booms-81231-A9634/2650"]
["2017-01-12","TriBoom",99,"Colorado Booms-90009-T9634/2372"]
["2017-02-19","Yanaki",92,{"$f":"_xlfn.TEXTJOIN(\"-\",,INDEX($G$10:$I$18,MATCH(B133,$F$10:$F$18),))","v":"Colorado Booms-81231-Y9634/2072"}]
["2017-02-02","TriBoom",81,"Colorado Booms-90009-T9634/2372"]
["2017-03-10","Carlota",101,"Gel Booms-94608-C4369/2213"]
["2017-02-23","TriBoom",70,"Colorado Booms-90009-T9634/2372"]
["2017-02-07","Yanaki",76,"Colorado Booms-81231-Y9634/2072"]
["2017-02-20","Carlota",103,"Gel Booms-94608-C4369/2213"]
["2017-02-03","Bellen",110,"Gel Booms-94618-B4369/2593"]
["2017-03-30","Carlota",103,"Gel Booms-94608-C4369/2213"]
["2017-03-03","Eagle",48,"Colorado Booms-81231-E9634/2386"]
["2017-03-30","Eagle",96,"Colorado Booms-81231-E9634/2386"]
["2017-01-19","Bellen",102,"Gel Booms-94618-B4369/2593"]
["2017-01-29","Sunshine",81,"Gel Booms-94618-S4369/2297"]
["2017-02-08","Yanaki",90,"Colorado Booms-81231-Y9634/2072"]
["2017-01-15","Bellen",45,"Gel Booms-94618-B4369/2593"]
["2017-02-09","Eagle",54,"Colorado Booms-81231-E9634/2386"]
["2017-02-20","Bellen",52,"Gel Booms-94618-B4369/2593"]
["2017-03-18","Quad",95,"Gel Booms-94608-Q4369/2290"]
["2017-03-15","Carlota",62,"Gel Booms-94608-C4369/2213"]
["2017-03-09","Yanaki",43,"Colorado Booms-81231-Y9634/2072"]
["2017-03-30","TriBoom",46,"Colorado Booms-90009-T9634/2372"]
["2017-01-28","Eagle",44,"Colorado Booms-81231-E9634/2386"]
["2017-01-20","Eagle",84,"Colorado Booms-81231-E9634/2386"]
["2017-02-25","Sunshine",57,"Gel Booms-94618-S4369/2297"]
["2017-01-18","Carlota",82,"Gel Booms-94608-C4369/2213"]
["2017-02-22","Sunbell",74,"Gel Booms-94618-S4369/2241"]
["2017-02-15","Carlota",49,"Gel Booms-94608-C4369/2213"]
["2017-01-01","Bellen",48,"Gel Booms-94618-B4369/2593"]
["2017-02-11","Eagle",105,"Colorado Booms-81231-E9634/2386"]
["2017-03-28","Carlota",43,"Gel Booms-94608-C4369/2213"]
["2017-02-07","Yanaki",60,"Colorado Booms-81231-Y9634/2072"]
["2017-03-13","Yanaki",53,"Colorado Booms-81231-Y9634/2072"]
["2017-02-28","Bellen",103,"Gel Booms-94618-B4369/2593"]
["2017-03-08","Sunbell",29,"Gel Booms-94618-S4369/2241"]
["2017-01-12","Sunshine",60,"Gel Booms-94618-S4369/2297"]
["2017-03-05","TriBoom",91,"Colorado Booms-90009-T9634/2372"]
["2017-02-18","Carlota",61,"Gel Booms-94608-C4369/2213"]
["2017-02-23","Quad",144,"Gel Booms-94608-Q4369/2290"]
["2017-01-28","Eagle",68,"Colorado Booms-81231-E9634/2386"]
["2017-01-15","Carlota",105,"Gel Booms-94608-C4369/2213"]
["2017-01-01","Aspen",71,"Colorado Booms-81231-A9634/2650"]
["2017-03-18","Carlota",44,"Gel Booms-94608-C4369/2213"]
["2017-03-06","Quad",79,"Gel Booms-94608-Q4369/2290"]
["2017-02-28","TriBoom",73,"Colorado Booms-90009-T9634/2372"]
["2017-01-25","Aspen",62,"Colorado Booms-81231-A9634/2650"]
["2017-02-19","Quad",89,"Gel Booms-94608-Q4369/2290"]
["2017-02-28","Yanaki",86,"Colorado Booms-81231-Y9634/2072"]
["2017-03-19","Eagle",65,"Colorado Booms-81231-E9634/2386"]
["2017-01-23","Eagle",68,"Colorado Booms-81231-E9634/2386"]
["2017-01-11","Quad",71,"Gel Booms-94608-Q4369/2290"]
["2017-01-01","Aspen",99,"Colorado Booms-81231-A9634/2650"]
["2017-01-23","Bellen",100,"Gel Booms-94618-B4369/2593"]
["2017-03-05","Sunshine",95,"Gel Booms-94618-S4369/2297"]
["2017-02-26","Sunshine",93,"Gel Booms-94618-S4369/2297"]
["2017-03-28","Quad",80,"Gel Booms-94608-Q4369/2290"]
["2017-01-03","Aspen",51,"Colorado Booms-81231-A9634/2650"]
["2017-03-30","TriBoom",64,"Colorado Booms-90009-T9634/2372"]
["2017-01-25","Bellen",78,"Gel Booms-94618-B4369/2593"]
["2017-03-14","Eagle",67,"Colorado Booms-81231-E9634/2386"]
["2017-03-01","Bellen",58,"Gel Booms-94618-B4369/2593"]
["2017-01-12","Bellen",43,"Gel Booms-94618-B4369/2593"]
["2017-01-03","Yanaki",98,"Colorado Booms-81231-Y9634/2072"]
["2017-01-03","Aspen",57,"Colorado Booms-81231-A9634/2650"]
["2017-02-17","Quad",23,"Gel Booms-94608-Q4369/2290"]
["2017-02-28","Carlota",59,"Gel Booms-94608-C4369/2213"]
["2017-02-07","Sunbell",45,{"$f":"_xlfn.TEXTJOIN(\"-\",,INDEX($G$10:$I$18,MATCH(B197,$F$10:$F$18),))","v":"Gel Booms-94618-S4369/2241"}]
["2017-02-06","Aspen",77,"Colorado Booms-81231-A9634/2650"]
["2017-01-25","Aspen",18,"Colorado Booms-81231-A9634/2650"]
["2017-02-01","Yanaki",69,"Colorado Booms-81231-Y9634/2072"]
["2017-01-22","Quad",88,"Gel Booms-94608-Q4369/2290"]
["2017-03-23","Yanaki",130,"Colorado Booms-81231-Y9634/2072"]
["2017-03-07","Sunshine",84,"Gel Booms-94618-S4369/2297"]
["2017-03-04","Carlota",77,"Gel Booms-94608-C4369/2213"]
["2017-01-29","Sunshine",54,"Gel Booms-94618-S4369/2297"]
["2017-01-25","Carlota",69,"Gel Booms-94608-C4369/2213"]
["2017-03-03","Sunshine",65,"Gel Booms-94618-S4369/2297"]
["2017-01-30","Quad",81,"Gel Booms-94608-Q4369/2290"]
["2017-03-01","Sunshine",57,"Gel Booms-94618-S4369/2297"]
["2017-03-05","Yanaki",37,"Colorado Booms-81231-Y9634/2072"]
["2017-03-18","Quad",24,"Gel Booms-94608-Q4369/2290"]
["2017-02-25","Bellen",63,"Gel Booms-94618-B4369/2593"]
["2017-03-03","Aspen",58,"Colorado Booms-81231-A9634/2650"]
["2017-01-08","Quad",72,"Gel Booms-94608-Q4369/2290"]
["2017-02-17","Yanaki",66,"Colorado Booms-81231-Y9634/2072"]
["2017-03-23","Eagle",46,"Colorado Booms-81231-E9634/2386"]
["2017-02-12","Eagle",64,"Colorado Booms-81231-E9634/2386"]
["2017-01-28","Aspen",36,"Colorado Booms-81231-A9634/2650"]
["2017-02-10","Aspen",124,"Colorado Booms-81231-A9634/2650"]
["2017-01-01","Aspen",81,"Colorado Booms-81231-A9634/2650"]
["2017-01-02","Carlota",47,"Gel Booms-94608-C4369/2213"]
["2017-02-17","Quad",94,"Gel Booms-94608-Q4369/2290"]
["2017-01-07","Bellen",69,"Gel Booms-94618-B4369/2593"]
["2017-03-10","TriBoom",48,"Colorado Booms-90009-T9634/2372"]
["2017-03-17","Quad",33,"Gel Booms-94608-Q4369/2290"]
["2017-01-25","Quad",89,"Gel Booms-94608-Q4369/2290"]
["2017-03-25","Sunbell",87,"Gel Booms-94618-S4369/2241"]
["2017-02-04","TriBoom",50,"Colorado Booms-90009-T9634/2372"]
["2017-01-10","Aspen",45,"Colorado Booms-81231-A9634/2650"]
["2017-03-20","Bellen",56,"Gel Booms-94618-B4369/2593"]
["2017-01-10","Bellen",20,"Gel Booms-94618-B4369/2593"]
["2017-02-07","Yanaki",77,"Colorado Booms-81231-Y9634/2072"]
["2017-02-20","Bellen",65,"Gel Booms-94618-B4369/2593"]
["2017-02-11","Carlota",61,"Gel Booms-94608-C4369/2213"]
["2017-03-21","Eagle",49,"Colorado Booms-81231-E9634/2386"]
["2017-02-07","Sunbell",77,"Gel Booms-94618-S4369/2241"]
["2017-01-25","Quad",34,"Gel Booms-94608-Q4369/2290"]
["2017-02-17","Carlota",64,"Gel Booms-94608-C4369/2213"]
["2017-03-29","Bellen",64,"Gel Booms-94618-B4369/2593"]
["2017-02-15","TriBoom",53,"Colorado Booms-90009-T9634/2372"]
["2017-01-10","Bellen",78,"Gel Booms-94618-B4369/2593"]
["2017-02-18","Aspen",131,"Colorado Booms-81231-A9634/2650"]
["2017-03-04","Sunbell",91,"Gel Booms-94618-S4369/2241"]
["2017-01-16","Carlota",105,"Gel Booms-94608-C4369/2213"]
["2017-03-24","Quad",113,"Gel Booms-94608-Q4369/2290"]
["2017-02-27","Yanaki",148,"Colorado Booms-81231-Y9634/2072"]
["2017-03-23","Sunshine",77,"Gel Booms-94618-S4369/2297"]
["2017-01-07","Sunbell",65,"Gel Booms-94618-S4369/2241"]
["2017-03-29","Bellen",92,"Gel Booms-94618-B4369/2593"]
["2017-01-22","Aspen",80,"Colorado Booms-81231-A9634/2650"]
["2017-03-19","Sunshine",90,"Gel Booms-94618-S4369/2297"]
["2017-01-09","Sunshine",49,"Gel Booms-94618-S4369/2297"]
["2017-03-10","Eagle",85,"Colorado Booms-81231-E9634/2386"]
["2017-01-12","Sunshine",37,"Gel Booms-94618-S4369/2297"]
["2017-03-12","Quad",112,"Gel Booms-94608-Q4369/2290"]
["2017-02-18","Sunshine",65,"Gel Booms-94618-S4369/2297"]
["2017-03-07","Carlota",106,"Gel Booms-94608-C4369/2213"]
["2017-01-12","TriBoom",63,"Colorado Booms-90009-T9634/2372"]
["2017-01-25","Quad",80,"Gel Booms-94608-Q4369/2290"]
["2017-02-18","TriBoom",103,"Colorado Booms-90009-T9634/2372"]
["2017-03-10","Bellen",92,{"$f":"_xlfn.TEXTJOIN(\"-\",,INDEX($G$10:$I$18,MATCH(B261,$F$10:$F$18),))","v":"Gel Booms-94618-B4369/2593"}]
["2017-01-25","Carlota",35,"Gel Booms-94608-C4369/2213"]
["2017-03-24","Yanaki",60,"Colorado Booms-81231-Y9634/2072"]
["2017-01-02","Eagle",63,"Colorado Booms-81231-E9634/2386"]
["2017-02-18","Yanaki",55,"Colorado Booms-81231-Y9634/2072"]
["2017-02-20","Carlota",57,"Gel Booms-94608-C4369/2213"]
["2017-01-20","Carlota",85,"Gel Booms-94608-C4369/2213"]
["2017-02-03","Sunbell",58,"Gel Booms-94618-S4369/2241"]
["2017-02-28","Aspen",125,"Colorado Booms-81231-A9634/2650"]
["2017-02-14","Yanaki",60,"Colorado Booms-81231-Y9634/2072"]
["2017-02-01","Sunshine",83,"Gel Booms-94618-S4369/2297"]
["2017-03-13","Sunbell",94,"Gel Booms-94618-S4369/2241"]
["2017-02-01","TriBoom",97,"Colorado Booms-90009-T9634/2372"]
["2017-02-15","Bellen",65,"Gel Booms-94618-B4369/2593"]
["2017-02-16","Carlota",55,"Gel Booms-94608-C4369/2213"]
["2017-02-25","Quad",78,"Gel Booms-94608-Q4369/2290"]
["2017-02-23","Quad",97,"Gel Booms-94608-Q4369/2290"]
["2017-03-08","Quad",56,"Gel Booms-94608-Q4369/2290"]
["2017-01-27","TriBoom",70,"Colorado Booms-90009-T9634/2372"]
["2017-02-20","Quad",83,"Gel Booms-94608-Q4369/2290"]
["2017-01-09","Carlota",85,"Gel Booms-94608-C4369/2213"]
["2017-01-01","Eagle",86,"Colorado Booms-81231-E9634/2386"]
["2017-01-31","Sunbell",64,"Gel Booms-94618-S4369/2241"]
["2017-03-24","Yanaki",88,"Colorado Booms-81231-Y9634/2072"]
["2017-02-15","Aspen",62,"Colorado Booms-81231-A9634/2650"]
["2017-02-03","Sunshine",79,"Gel Booms-94618-S4369/2297"]
["2017-02-22","Sunshine",70,"Gel Booms-94618-S4369/2297"]
["2017-03-08","Sunbell",79,"Gel Booms-94618-S4369/2241"]
["2017-03-04","Aspen",78,"Colorado Booms-81231-A9634/2650"]
["2017-02-02","TriBoom",63,"Colorado Booms-90009-T9634/2372"]
["2017-03-18","Aspen",83,"Colorado Booms-81231-A9634/2650"]
["2017-02-28","Quad",39,"Gel Booms-94608-Q4369/2290"]
["2017-01-08","Eagle",110,"Colorado Booms-81231-E9634/2386"]
["2017-03-28","Aspen",86,"Colorado Booms-81231-A9634/2650"]
["2017-03-27","Aspen",107,"Colorado Booms-81231-A9634/2650"]
["2017-02-16","Bellen",56,"Gel Booms-94618-B4369/2593"]
["2017-02-18","TriBoom",100,"Colorado Booms-90009-T9634/2372"]
["2017-01-08","TriBoom",85,"Colorado Booms-90009-T9634/2372"]
["2017-01-18","Sunbell",90,"Gel Booms-94618-S4369/2241"]
["2017-03-23","Eagle",43,"Colorado Booms-81231-E9634/2386"]
["2017-02-19","Eagle",100,"Colorado Booms-81231-E9634/2386"]
["2017-01-25","Sunshine",131,"Gel Booms-94618-S4369/2297"]
["2017-01-22","Quad",90,"Gel Booms-94608-Q4369/2290"]
["2017-03-28","Sunbell",82,"Gel Booms-94618-S4369/2241"]
["2017-03-15","Aspen",36,"Colorado Booms-81231-A9634/2650"]
["2017-02-10","Bellen",51,"Gel Booms-94618-B4369/2593"]
["2017-01-27","Sunshine",62,"Gel Booms-94618-S4369/2297"]
["2017-02-05","Quad",58,"Gel Booms-94608-Q4369/2290"]
["2017-01-07","Sunshine",97,"Gel Booms-94618-S4369/2297"]
["2017-02-15","Sunshine",94,"Gel Booms-94618-S4369/2297"]
["2017-02-03","Yanaki",70,"Colorado Booms-81231-Y9634/2072"]
["2017-03-06","Quad",47,"Gel Booms-94608-Q4369/2290"]
["2017-01-20","Bellen",52,"Gel Booms-94618-B4369/2593"]
["2017-01-20","Carlota",123,"Gel Booms-94608-C4369/2213"]
["2017-02-11","Sunshine",64,"Gel Booms-94618-S4369/2297"]
["2017-03-31","Yanaki",75,"Colorado Booms-81231-Y9634/2072"]
["2017-02-22","TriBoom",60,"Colorado Booms-90009-T9634/2372"]
["2017-02-18","Eagle",61,"Colorado Booms-81231-E9634/2386"]
["2017-03-15","Aspen",76,"Colorado Booms-81231-A9634/2650"]
["2017-02-28","Bellen",96,"Gel Booms-94618-B4369/2593"]
["2017-01-20","Bellen",34,"Gel Booms-94618-B4369/2593"]
["2017-03-24","Sunbell",106,"Gel Booms-94618-S4369/2241"]
["2017-03-06","Sunbell",66,"Gel Booms-94618-S4369/2241"]
["2017-01-21","Sunbell",67,"Gel Booms-94618-S4369/2241"]
["2017-02-06","Eagle",96,{"$f":"_xlfn.TEXTJOIN(\"-\",,INDEX($G$10:$I$18,MATCH(B325,$F$10:$F$18),))","v":"Colorado Booms-81231-E9634/2386"}]
["2017-03-08","Bellen",84,"Gel Booms-94618-B4369/2593"]
["2017-03-11","Sunshine",39,"Gel Booms-94618-S4369/2297"]
["2017-01-09","Eagle",88,"Colorado Booms-81231-E9634/2386"]
["2017-03-04","Sunshine",60,"Gel Booms-94618-S4369/2297"]
["2017-03-11","Carlota",63,"Gel Booms-94608-C4369/2213"]
["2017-02-22","Eagle",47,"Colorado Booms-81231-E9634/2386"]
["2017-01-24","Bellen",57,"Gel Booms-94618-B4369/2593"]
["2017-02-02","Bellen",83,"Gel Booms-94618-B4369/2593"]
["2017-03-24","Eagle",92,"Colorado Booms-81231-E9634/2386"]
["2017-01-07","Sunbell",62,"Gel Booms-94618-S4369/2241"]
["2017-02-19","Bellen",53,"Gel Booms-94618-B4369/2593"]
["2017-03-02","Carlota",62,"Gel Booms-94608-C4369/2213"]
["2017-01-03","Sunshine",89,"Gel Booms-94618-S4369/2297"]
["2017-03-26","Yanaki",61,"Colorado Booms-81231-Y9634/2072"]
["2017-03-02","Carlota",94,"Gel Booms-94608-C4369/2213"]
["2017-02-25","Carlota",61,"Gel Booms-94608-C4369/2213"]
["2017-03-20","Aspen",48,"Colorado Booms-81231-A9634/2650"]
["2017-02-12","Quad",61,"Gel Booms-94608-Q4369/2290"]
["2017-01-19","Quad",50,"Gel Booms-94608-Q4369/2290"]
["2017-03-19","Sunbell",31,"Gel Booms-94618-S4369/2241"]
["2017-01-23","Bellen",54,"Gel Booms-94618-B4369/2593"]
["2017-02-14","Eagle",89,"Colorado Booms-81231-E9634/2386"]
["2017-03-04","Bellen",72,"Gel Booms-94618-B4369/2593"]
["2017-03-11","TriBoom",73,"Colorado Booms-90009-T9634/2372"]
["2017-01-03","Sunshine",67,"Gel Booms-94618-S4369/2297"]
["2017-02-03","Eagle",102,"Colorado Booms-81231-E9634/2386"]
["2017-02-15","Sunbell",81,"Gel Booms-94618-S4369/2241"]
["2017-01-15","Yanaki",63,"Colorado Booms-81231-Y9634/2072"]
["2017-02-12","Carlota",63,"Gel Booms-94608-C4369/2213"]
["2017-01-15","Yanaki",105,"Colorado Booms-81231-Y9634/2072"]
["2017-02-19","Sunshine",125,"Gel Booms-94618-S4369/2297"]
["2017-03-30","Bellen",78,"Gel Booms-94618-B4369/2593"]
["2017-02-16","Quad",88,"Gel Booms-94608-Q4369/2290"]
["2017-02-19","Sunbell",77,"Gel Booms-94618-S4369/2241"]
["2017-01-19","Sunshine",73,"Gel Booms-94618-S4369/2297"]
["2017-01-09","Sunshine",45,"Gel Booms-94618-S4369/2297"]
["2017-02-03","Sunbell",92,"Gel Booms-94618-S4369/2241"]
["2017-03-01","Aspen",77,"Colorado Booms-81231-A9634/2650"]
["2017-02-28","Eagle",116,"Colorado Booms-81231-E9634/2386"]
["2017-01-08","Yanaki",94,"Colorado Booms-81231-Y9634/2072"]
["2017-01-28","Yanaki",123,"Colorado Booms-81231-Y9634/2072"]
["2017-01-27","Quad",88,"Gel Booms-94608-Q4369/2290"]
["2017-01-22","Carlota",45,"Gel Booms-94608-C4369/2213"]
["2017-02-19","Sunbell",85,"Gel Booms-94618-S4369/2241"]
["2017-01-11","Bellen",85,"Gel Booms-94618-B4369/2593"]
["2017-03-04","Eagle",30,"Colorado Booms-81231-E9634/2386"]
["2017-03-16","Bellen",84,"Gel Booms-94618-B4369/2593"]
["2017-02-11","Eagle",99,"Colorado Booms-81231-E9634/2386"]
["2017-01-07","Aspen",92,"Colorado Booms-81231-A9634/2650"]
["2017-01-31","Yanaki",87,"Colorado Booms-81231-Y9634/2072"]
["2017-03-30","Sunbell",100,"Gel Booms-94618-S4369/2241"]
["2017-01-16","Eagle",99,"Colorado Booms-81231-E9634/2386"]
["2017-01-09","Sunbell",37,"Gel Booms-94618-S4369/2241"]
["2017-01-22","Sunbell",80,"Gel Booms-94618-S4369/2241"]
["2017-02-05","Sunshine",74,"Gel Booms-94618-S4369/2297"]
["2017-03-29","Yanaki",114,"Colorado Booms-81231-Y9634/2072"]
["2017-03-30","Yanaki",73,"Colorado Booms-81231-Y9634/2072"]
["2017-03-12","Carlota",100,"Gel Booms-94608-C4369/2213"]
["2017-01-30","TriBoom",74,"Colorado Booms-90009-T9634/2372"]
["2017-02-16","Eagle",48,"Colorado Booms-81231-E9634/2386"]
["2017-01-31","Sunshine",100,"Gel Booms-94618-S4369/2297"]
["2017-02-07","Eagle",101,"Colorado Booms-81231-E9634/2386"]
["2017-02-27","Carlota",83,"Gel Booms-94608-C4369/2213"]
["2017-01-21","Bellen",59,{"$f":"_xlfn.TEXTJOIN(\"-\",,INDEX($G$10:$I$18,MATCH(B389,$F$10:$F$18),))","v":"Gel Booms-94618-B4369/2593"}]
["2017-02-26","Eagle",81,"Colorado Booms-81231-E9634/2386"]
["2017-03-23","Eagle",91,"Colorado Booms-81231-E9634/2386"]
["2017-02-22","Carlota",99,"Gel Booms-94608-C4369/2213"]
["2017-02-12","Eagle",86,"Colorado Booms-81231-E9634/2386"]
["2017-02-19","Yanaki",67,"Colorado Booms-81231-Y9634/2072"]
["2017-03-25","Quad",18,"Gel Booms-94608-Q4369/2290"]
["2017-03-01","Eagle",76,"Colorado Booms-81231-E9634/2386"]
["2017-02-02","Eagle",54,"Colorado Booms-81231-E9634/2386"]
["2017-01-29","TriBoom",72,"Colorado Booms-90009-T9634/2372"]
["2017-02-12","Sunbell",35,"Gel Booms-94618-S4369/2241"]
["2017-01-13","Aspen",118,"Colorado Booms-81231-A9634/2650"]
["2017-02-13","Bellen",82,"Gel Booms-94618-B4369/2593"]
["2017-02-10","Sunshine",102,"Gel Booms-94618-S4369/2297"]
["2017-02-19","Eagle",118,"Colorado Booms-81231-E9634/2386"]
["2017-02-04","Eagle",58,"Colorado Booms-81231-E9634/2386"]
["2017-03-31","TriBoom",68,"Colorado Booms-90009-T9634/2372"]
["2017-02-10","Quad",41,"Gel Booms-94608-Q4369/2290"]
["2017-01-15","Yanaki",90,"Colorado Booms-81231-Y9634/2072"]
["2017-01-07","Eagle",63,"Colorado Booms-81231-E9634/2386"]
["2017-03-10","Bellen",95,"Gel Booms-94618-B4369/2593"]
["2017-01-18","Yanaki",19,"Colorado Booms-81231-Y9634/2072"]
["2017-02-17","Sunshine",39,"Gel Booms-94618-S4369/2297"]
["2017-03-13","Yanaki",43,"Colorado Booms-81231-Y9634/2072"]
["2017-01-04","TriBoom",56,"Colorado Booms-90009-T9634/2372"]
["2017-03-31","Quad",47,"Gel Booms-94608-Q4369/2290"]
["2017-03-13","Aspen",61,"Colorado Booms-81231-A9634/2650"]
["2017-01-11","Quad",66,"Gel Booms-94608-Q4369/2290"]
["2017-02-22","Aspen",87,"Colorado Booms-81231-A9634/2650"]
["2017-02-21","Sunbell",87,"Gel Booms-94618-S4369/2241"]
["2017-03-02","Eagle",78,"Colorado Booms-81231-E9634/2386"]
["2017-02-25","Eagle",67,"Colorado Booms-81231-E9634/2386"]
["2017-03-05","Sunbell",58,"Gel Booms-94618-S4369/2241"]
["2017-01-29","Carlota",82,"Gel Booms-94608-C4369/2213"]
["2017-01-15","Eagle",99,"Colorado Booms-81231-E9634/2386"]
["2017-03-28","Quad",98,"Gel Booms-94608-Q4369/2290"]
["2017-02-14","Yanaki",58,"Colorado Booms-81231-Y9634/2072"]
["2017-03-11","Aspen",80,"Colorado Booms-81231-A9634/2650"]
["2017-01-12","Aspen",36,"Colorado Booms-81231-A9634/2650"]
["2017-01-14","Sunbell",45,"Gel Booms-94618-S4369/2241"]
["2017-01-08","Quad",77,"Gel Booms-94608-Q4369/2290"]
["2017-02-02","TriBoom",106,"Colorado Booms-90009-T9634/2372"]
["2017-03-10","Sunbell",59,"Gel Booms-94618-S4369/2241"]
["2017-03-25","Sunshine",69,"Gel Booms-94618-S4369/2297"]
["2017-03-02","Yanaki",94,"Colorado Booms-81231-Y9634/2072"]
["2017-01-02","Eagle",118,"Colorado Booms-81231-E9634/2386"]
["2017-01-25","Sunbell",69,"Gel Booms-94618-S4369/2241"]
["2017-01-04","Aspen",50,"Colorado Booms-81231-A9634/2650"]
["2017-02-19","Carlota",92,"Gel Booms-94608-C4369/2213"]
["2017-02-04","Carlota",63,"Gel Booms-94608-C4369/2213"]
["2017-01-02","Carlota",64,"Gel Booms-94608-C4369/2213"]
["2017-03-22","TriBoom",115,"Colorado Booms-90009-T9634/2372"]
["2017-02-08","TriBoom",76,"Colorado Booms-90009-T9634/2372"]
["2017-01-25","TriBoom",30,"Colorado Booms-90009-T9634/2372"]
["2017-02-14","Bellen",106,"Gel Booms-94618-B4369/2593"]
["2017-02-26","Aspen",28,"Colorado Booms-81231-A9634/2650"]
["2017-02-12","Eagle",67,"Colorado Booms-81231-E9634/2386"]
["2017-02-14","Eagle",70,"Colorado Booms-81231-E9634/2386"]
["2017-01-24","TriBoom",78,"Colorado Booms-90009-T9634/2372"]
["2017-02-23","Aspen",44,"Colorado Booms-81231-A9634/2650"]
["2017-01-18","Aspen",80,"Colorado Booms-81231-A9634/2650"]
["2017-02-18","Quad",38,"Gel Booms-94608-Q4369/2290"]
["2017-03-10","Carlota",47,"Gel Booms-94608-C4369/2213"]
["2017-03-31","Sunbell",64,"Gel Booms-94618-S4369/2241"]
["2017-01-12","Eagle",43,{"$f":"_xlfn.TEXTJOIN(\"-\",,INDEX($G$10:$I$18,MATCH(B453,$F$10:$F$18),))","v":"Colorado Booms-81231-E9634/2386"}]
["2017-01-30","Yanaki",101,"Colorado Booms-81231-Y9634/2072"]
["2017-01-30","Quad",97,"Gel Booms-94608-Q4369/2290"]
["2017-03-09","TriBoom",63,"Colorado Booms-90009-T9634/2372"]
["2017-02-06","Bellen",80,"Gel Booms-94618-B4369/2593"]
["2017-03-24","Eagle",44,"Colorado Booms-81231-E9634/2386"]
["2017-02-18","Sunbell",37,"Gel Booms-94618-S4369/2241"]
["2017-01-30","Sunbell",65,"Gel Booms-94618-S4369/2241"]
["2017-01-29","TriBoom",64,"Colorado Booms-90009-T9634/2372"]
["2017-02-17","Aspen",75,"Colorado Booms-81231-A9634/2650"]
["2017-02-16","Aspen",98,"Colorado Booms-81231-A9634/2650"]
["2017-02-18","Carlota",83,"Gel Booms-94608-C4369/2213"]
["2017-02-05","Bellen",76,"Gel Booms-94618-B4369/2593"]
["2017-02-22","TriBoom",80,"Colorado Booms-90009-T9634/2372"]
["2017-02-10","Yanaki",43,"Colorado Booms-81231-Y9634/2072"]
["2017-01-30","Sunbell",71,"Gel Booms-94618-S4369/2241"]
["2017-03-09","Bellen",119,"Gel Booms-94618-B4369/2593"]
["2017-02-08","Bellen",91,"Gel Booms-94618-B4369/2593"]
["2017-03-23","Sunshine",111,"Gel Booms-94618-S4369/2297"]
["2017-03-25","Aspen",80,"Colorado Booms-81231-A9634/2650"]
["2017-02-18","Carlota",23,"Gel Booms-94608-C4369/2213"]
["2017-03-20","Carlota",65,"Gel Booms-94608-C4369/2213"]
["2017-02-21","Aspen",34,"Colorado Booms-81231-A9634/2650"]
["2017-01-24","Aspen",89,"Colorado Booms-81231-A9634/2650"]
["2017-03-05","Eagle",132,"Colorado Booms-81231-E9634/2386"]
["2017-01-07","Aspen",109,"Colorado Booms-81231-A9634/2650"]
["2017-01-13","Yanaki",82,"Colorado Booms-81231-Y9634/2072"]
["2017-02-12","Eagle",64,"Colorado Booms-81231-E9634/2386"]
["2017-02-03","Bellen",72,"Gel Booms-94618-B4369/2593"]
["2017-02-05","Bellen",34,"Gel Booms-94618-B4369/2593"]
["2017-01-08","TriBoom",84,"Colorado Booms-90009-T9634/2372"]
["2017-03-18","TriBoom",103,"Colorado Booms-90009-T9634/2372"]
["2017-01-14","Carlota",110,"Gel Booms-94608-C4369/2213"]
["2017-01-16","Aspen",73,"Colorado Booms-81231-A9634/2650"]
["2017-01-22","Sunshine",85,"Gel Booms-94618-S4369/2297"]
["2017-01-09","Eagle",99,"Colorado Booms-81231-E9634/2386"]
["2017-02-25","Eagle",80,"Colorado Booms-81231-E9634/2386"]
["2017-03-04","Carlota",89,"Gel Booms-94608-C4369/2213"]
["2017-02-04","Carlota",99,"Gel Booms-94608-C4369/2213"]
["2017-02-04","Eagle",38,"Colorado Booms-81231-E9634/2386"]
["2017-03-09","Aspen",69,"Colorado Booms-81231-A9634/2650"]
["2017-03-11","Sunbell",83,"Gel Booms-94618-S4369/2241"]
["2017-01-16","Carlota",83,"Gel Booms-94608-C4369/2213"]
["2017-03-18","Bellen",29,"Gel Booms-94618-B4369/2593"]
["2017-01-22","TriBoom",73,"Colorado Booms-90009-T9634/2372"]
["2017-02-15","Aspen",72,"Colorado Booms-81231-A9634/2650"]
["2017-03-21","TriBoom",72,"Colorado Booms-90009-T9634/2372"]
["2017-03-12","Aspen",103,"Colorado Booms-81231-A9634/2650"]
["2017-02-15","Bellen",104,"Gel Booms-94618-B4369/2593"]
["2017-01-14","Aspen",91,"Colorado Booms-81231-A9634/2650"]
["2017-01-15","TriBoom",78,"Colorado Booms-90009-T9634/2372"]
["2017-03-16","Sunbell",57,"Gel Booms-94618-S4369/2241"]
["2017-02-07","Sunbell",103,"Gel Booms-94618-S4369/2241"]
["2017-03-02","TriBoom",89,"Colorado Booms-90009-T9634/2372"]
["2017-01-10","Bellen",100,"Gel Booms-94618-B4369/2593"]
["2017-01-07","Bellen",108,"Gel Booms-94618-B4369/2593"]
["2017-01-13","Yanaki",74,"Colorado Booms-81231-Y9634/2072"]
["2017-01-16","Yanaki",96,"Colorado Booms-81231-Y9634/2072"]
["2017-02-19","Sunshine",63,"Gel Booms-94618-S4369/2297"]
["2017-01-04","Sunshine",116,"Gel Booms-94618-S4369/2297"]
["2017-01-31","Eagle",55,"Colorado Booms-81231-E9634/2386"]
["2017-01-06","Bellen",85,"Gel Booms-94618-B4369/2593"]
["2017-01-11","Bellen",71,"Gel Booms-94618-B4369/2593"]
["2017-02-15","Quad",52,"Gel Booms-94608-Q4369/2290"]
["2017-01-25","Aspen",68,{"$f":"_xlfn.TEXTJOIN(\"-\",,INDEX($G$10:$I$18,MATCH(B517,$F$10:$F$18),))","v":"Colorado Booms-81231-A9634/2650"}]
["2017-01-12","Quad",53,"Gel Booms-94608-Q4369/2290"]
["2017-01-19","Sunshine",118,"Gel Booms-94618-S4369/2297"]
["2017-03-13","Eagle",71,"Colorado Booms-81231-E9634/2386"]
["2017-03-24","Carlota",78,"Gel Booms-94608-C4369/2213"]
["2017-02-06","Sunshine",92,"Gel Booms-94618-S4369/2297"]
["2017-01-27","Sunshine",70,"Gel Booms-94618-S4369/2297"]
["2017-02-05","Quad",87,"Gel Booms-94608-Q4369/2290"]
["2017-02-22","Quad",130,"Gel Booms-94608-Q4369/2290"]
["2017-02-12","TriBoom",51,"Colorado Booms-90009-T9634/2372"]
["2017-03-03","Sunshine",87,"Gel Booms-94618-S4369/2297"]
["2017-03-21","Yanaki",82,"Colorado Booms-81231-Y9634/2072"]
["2017-02-17","Bellen",70,"Gel Booms-94618-B4369/2593"]
["2017-03-04","Yanaki",84,"Colorado Booms-81231-Y9634/2072"]
["2017-03-01","Aspen",99,"Colorado Booms-81231-A9634/2650"]
["2017-03-24","Yanaki",48,"Colorado Booms-81231-Y9634/2072"]
["2017-01-31","Quad",93,"Gel Booms-94608-Q4369/2290"]
["2017-01-15","Quad",66,"Gel Booms-94608-Q4369/2290"]
["2017-03-01","Yanaki",57,"Colorado Booms-81231-Y9634/2072"]
["2017-03-31","Carlota",24,"Gel Booms-94608-C4369/2213"]
["2017-02-19","Carlota",121,"Gel Booms-94608-C4369/2213"]
["2017-03-25","Bellen",91,"Gel Booms-94618-B4369/2593"]
["2017-02-25","TriBoom",87,"Colorado Booms-90009-T9634/2372"]
["2017-01-04","Yanaki",77,"Colorado Booms-81231-Y9634/2072"]
["2017-01-25","Sunshine",67,"Gel Booms-94618-S4369/2297"]
["2017-01-03","Bellen",102,"Gel Booms-94618-B4369/2593"]
["2017-01-01","Quad",72,"Gel Booms-94608-Q4369/2290"]
["2017-01-05","Sunbell",69,"Gel Booms-94618-S4369/2241"]
["2017-03-23","Sunshine",38,"Gel Booms-94618-S4369/2297"]
["2017-02-04","Aspen",69,"Colorado Booms-81231-A9634/2650"]
["2017-01-25","Bellen",64,"Gel Booms-94618-B4369/2593"]
["2017-01-28","TriBoom",35,"Colorado Booms-90009-T9634/2372"]
["2017-02-17","Sunbell",95,"Gel Booms-94618-S4369/2241"]
["2017-02-23","Carlota",83,"Gel Booms-94608-C4369/2213"]
["2017-03-12","Aspen",48,"Colorado Booms-81231-A9634/2650"]
["2017-02-07","Carlota",78,"Gel Booms-94608-C4369/2213"]
["2017-03-30","TriBoom",57,"Colorado Booms-90009-T9634/2372"]
["2017-02-21","Sunbell",84,"Gel Booms-94618-S4369/2241"]
["2017-01-23","Eagle",109,"Colorado Booms-81231-E9634/2386"]
["2017-02-15","TriBoom",46,"Colorado Booms-90009-T9634/2372"]
["2017-03-10","TriBoom",77,"Colorado Booms-90009-T9634/2372"]
["2017-03-17","Yanaki",97,"Colorado Booms-81231-Y9634/2072"]
["2017-01-24","Sunbell",89,"Gel Booms-94618-S4369/2241"]
["2017-03-22","Sunshine",56,"Gel Booms-94618-S4369/2297"]
["2017-02-16","Sunbell",77,"Gel Booms-94618-S4369/2241"]
["2017-01-25","Quad",72,"Gel Booms-94608-Q4369/2290"]
["2017-03-30","Sunshine",53,"Gel Booms-94618-S4369/2297"]
["2017-02-26","TriBoom",84,"Colorado Booms-90009-T9634/2372"]
["2017-01-04","Bellen",85,"Gel Booms-94618-B4369/2593"]
["2017-01-08","Sunbell",105,"Gel Booms-94618-S4369/2241"]
["2017-03-22","Sunbell",84,"Gel Booms-94618-S4369/2241"]
["2017-01-10","Eagle",98,"Colorado Booms-81231-E9634/2386"]
["2017-01-29","Eagle",73,"Colorado Booms-81231-E9634/2386"]
["2017-03-11","TriBoom",45,"Colorado Booms-90009-T9634/2372"]
["2017-02-02","Carlota",96,"Gel Booms-94608-C4369/2213"]
["2017-03-20","Bellen",80,"Gel Booms-94618-B4369/2593"]
["2017-02-15","Carlota",46,"Gel Booms-94608-C4369/2213"]
["2017-03-18","Yanaki",108,"Colorado Booms-81231-Y9634/2072"]
["2017-03-15","Sunshine",114,"Gel Booms-94618-S4369/2297"]
["2017-03-23","Quad",99,"Gel Booms-94608-Q4369/2290"]
["2017-01-21","Sunshine",46,"Gel Booms-94618-S4369/2297"]
["2017-02-01","Aspen",71,"Colorado Booms-81231-A9634/2650"]
["2017-03-01","Quad",88,"Gel Booms-94608-Q4369/2290"]
["2017-03-23","TriBoom",79,"Colorado Booms-90009-T9634/2372"]
["2017-03-29","Bellen",35,{"$f":"_xlfn.TEXTJOIN(\"-\",,INDEX($G$10:$I$18,MATCH(B581,$F$10:$F$18),))","v":"Gel Booms-94618-B4369/2593"}]
["2017-02-07","Yanaki",61,"Colorado Booms-81231-Y9634/2072"]
["2017-02-25","Aspen",59,"Colorado Booms-81231-A9634/2650"]
["2017-02-16","Sunbell",112,"Gel Booms-94618-S4369/2241"]
["2017-02-01","Bellen",69,"Gel Booms-94618-B4369/2593"]
["2017-02-04","Quad",110,"Gel Booms-94608-Q4369/2290"]
["2017-03-22","Sunbell",90,"Gel Booms-94618-S4369/2241"]
["2017-03-29","Aspen",94,"Colorado Booms-81231-A9634/2650"]
["2017-01-24","Eagle",85,"Colorado Booms-81231-E9634/2386"]
["2017-01-21","TriBoom",62,"Colorado Booms-90009-T9634/2372"]
["2017-02-26","Yanaki",109,"Colorado Booms-81231-Y9634/2072"]
["2017-02-11","Sunshine",63,"Gel Booms-94618-S4369/2297"]
["2017-01-31","Carlota",60,"Gel Booms-94608-C4369/2213"]
["2017-01-03","Eagle",107,"Colorado Booms-81231-E9634/2386"]
["2017-02-05","Sunshine",69,"Gel Booms-94618-S4369/2297"]
["2017-02-20","Yanaki",81,"Colorado Booms-81231-Y9634/2072"]
["2017-03-04","Yanaki",89,"Colorado Booms-81231-Y9634/2072"]
["2017-02-13","TriBoom",48,"Colorado Booms-90009-T9634/2372"]
["2017-01-10","Carlota",36,"Gel Booms-94608-C4369/2213"]
["2017-02-24","Yanaki",78,"Colorado Booms-81231-Y9634/2072"]
["2017-01-11","Aspen",58,"Colorado Booms-81231-A9634/2650"]
["2017-01-19","Yanaki",105,"Colorado Booms-81231-Y9634/2072"]
["2017-02-05","Aspen",94,"Colorado Booms-81231-A9634/2650"]
["2017-01-18","Eagle",80,"Colorado Booms-81231-E9634/2386"]
["2017-02-21","Carlota",47,"Gel Booms-94608-C4369/2213"]
["2017-02-22","TriBoom",103,"Colorado Booms-90009-T9634/2372"]
["2017-02-14","Bellen",50,"Gel Booms-94618-B4369/2593"]
["2017-02-01","Aspen",101,"Colorado Booms-81231-A9634/2650"]
["2017-01-29","Sunshine",78,"Gel Booms-94618-S4369/2297"]
["2017-03-24","Sunbell",74,"Gel Booms-94618-S4369/2241"]
["2017-01-02","Bellen",80,"Gel Booms-94618-B4369/2593"]
["2017-02-06","Bellen",103,"Gel Booms-94618-B4369/2593"]
["2017-02-09","Carlota",106,"Gel Booms-94608-C4369/2213"]
["2017-02-12","Quad",62,"Gel Booms-94608-Q4369/2290"]
["2017-02-08","Aspen",90,"Colorado Booms-81231-A9634/2650"]
["2017-01-22","Bellen",37,"Gel Booms-94618-B4369/2593"]
["2017-03-16","Carlota",64,"Gel Booms-94608-C4369/2213"]
["2017-03-11","Aspen",128,"Colorado Booms-81231-A9634/2650"]
["2017-01-24","TriBoom",80,"Colorado Booms-90009-T9634/2372"]
["2017-02-28","Yanaki",106,"Colorado Booms-81231-Y9634/2072"]
["2017-02-02","Quad",71,"Gel Booms-94608-Q4369/2290"]
["2017-02-08","TriBoom",68,"Colorado Booms-90009-T9634/2372"]
["2017-03-09","Sunbell",78,"Gel Booms-94618-S4369/2241"]
["2017-03-16","TriBoom",107,"Colorado Booms-90009-T9634/2372"]
["2017-02-26","Bellen",82,"Gel Booms-94618-B4369/2593"]
["2017-01-23","Yanaki",115,"Colorado Booms-81231-Y9634/2072"]
["2017-01-07","Carlota",69,"Gel Booms-94608-C4369/2213"]
["2017-01-29","Eagle",99,"Colorado Booms-81231-E9634/2386"]
["2017-02-27","Sunbell",93,"Gel Booms-94618-S4369/2241"]
["2017-01-19","Carlota",92,"Gel Booms-94608-C4369/2213"]
["2017-02-20","TriBoom",21,"Colorado Booms-90009-T9634/2372"]
["2017-03-07","Aspen",67,"Colorado Booms-81231-A9634/2650"]
["2017-03-01","Carlota",63,"Gel Booms-94608-C4369/2213"]
["2017-03-11","Sunbell",65,"Gel Booms-94618-S4369/2241"]
["2017-02-05","Eagle",102,"Colorado Booms-81231-E9634/2386"]
["2017-02-07","Quad",90,"Gel Booms-94608-Q4369/2290"]
["2017-03-01","Sunbell",78,"Gel Booms-94618-S4369/2241"]
["2017-03-02","Carlota",74,"Gel Booms-94608-C4369/2213"]
["2017-02-07","TriBoom",82,"Colorado Booms-90009-T9634/2372"]
["2017-02-08","Aspen",75,"Colorado Booms-81231-A9634/2650"]
["2017-02-22","Eagle",113,"Colorado Booms-81231-E9634/2386"]
["2017-01-12","Sunshine",94,"Gel Booms-94618-S4369/2297"]
["2017-01-05","Carlota",80,"Gel Booms-94608-C4369/2213"]
["2017-01-23","Yanaki",72,"Colorado Booms-81231-Y9634/2072"]
["2017-01-31","Carlota",79,{"$f":"_xlfn.TEXTJOIN(\"-\",,INDEX($G$10:$I$18,MATCH(B645,$F$10:$F$18),))","v":"Gel Booms-94608-C4369/2213"}]
["2017-01-22","TriBoom",94,"Colorado Booms-90009-T9634/2372"]
["2017-03-07","Carlota",37,"Gel Booms-94608-C4369/2213"]
["2017-01-15","Quad",88,"Gel Booms-94608-Q4369/2290"]
["2017-02-16","TriBoom",113,"Colorado Booms-90009-T9634/2372"]
["2017-01-01","Sunshine",97,"Gel Booms-94618-S4369/2297"]
["2017-01-21","Bellen",44,"Gel Booms-94618-B4369/2593"]
["2017-02-10","Carlota",59,"Gel Booms-94608-C4369/2213"]
["2017-02-27","Aspen",75,"Colorado Booms-81231-A9634/2650"]
["2017-01-14","Aspen",96,"Colorado Booms-81231-A9634/2650"]
["2017-01-17","Sunbell",96,"Gel Booms-94618-S4369/2241"]
["2017-01-14","Eagle",69,"Colorado Booms-81231-E9634/2386"]
["2017-03-05","TriBoom",131,"Colorado Booms-90009-T9634/2372"]
["2017-02-02","Carlota",96,"Gel Booms-94608-C4369/2213"]
["2017-03-26","Sunbell",114,"Gel Booms-94618-S4369/2241"]
["2017-02-20","Carlota",97,"Gel Booms-94608-C4369/2213"]
["2017-01-23","TriBoom",73,"Colorado Booms-90009-T9634/2372"]
["2017-02-12","TriBoom",106,"Colorado Booms-90009-T9634/2372"]
["2017-02-22","Quad",120,"Gel Booms-94608-Q4369/2290"]
["2017-03-05","Quad",74,"Gel Booms-94608-Q4369/2290"]
["2017-02-21","Aspen",67,"Colorado Booms-81231-A9634/2650"]
["2017-03-14","TriBoom",95,"Colorado Booms-90009-T9634/2372"]
["2017-01-17","Sunbell",58,"Gel Booms-94618-S4369/2241"]
["2017-01-17","Sunbell",87,"Gel Booms-94618-S4369/2241"]
["2017-01-16","Quad",41,"Gel Booms-94608-Q4369/2290"]
["2017-02-25","Bellen",62,"Gel Booms-94618-B4369/2593"]
["2017-01-17","TriBoom",88,"Colorado Booms-90009-T9634/2372"]
["2017-03-27","Sunbell",59,"Gel Booms-94618-S4369/2241"]
["2017-03-15","Yanaki",78,"Colorado Booms-81231-Y9634/2072"]
["2017-01-09","Aspen",61,"Colorado Booms-81231-A9634/2650"]
["2017-01-28","Quad",109,"Gel Booms-94608-Q4369/2290"]
["2017-01-10","Yanaki",51,"Colorado Booms-81231-Y9634/2072"]
["2017-01-06","Bellen",47,"Gel Booms-94618-B4369/2593"]
["2017-02-22","TriBoom",94,"Colorado Booms-90009-T9634/2372"]
["2017-02-23","Quad",99,"Gel Booms-94608-Q4369/2290"]
["2017-01-11","Aspen",57,"Colorado Booms-81231-A9634/2650"]
["2017-03-04","Quad",58,"Gel Booms-94608-Q4369/2290"]
["2017-01-07","Eagle",89,"Colorado Booms-81231-E9634/2386"]
["2017-01-09","Bellen",80,"Gel Booms-94618-B4369/2593"]
["2017-03-30","TriBoom",60,"Colorado Booms-90009-T9634/2372"]
["2017-03-30","Aspen",25,"Colorado Booms-81231-A9634/2650"]
["2017-03-18","Aspen",74,"Colorado Booms-81231-A9634/2650"]
["2017-02-27","Bellen",88,"Gel Booms-94618-B4369/2593"]
["2017-03-18","Aspen",125,"Colorado Booms-81231-A9634/2650"]
["2017-03-22","Eagle",88,"Colorado Booms-81231-E9634/2386"]
["2017-01-16","Aspen",80,"Colorado Booms-81231-A9634/2650"]
["2017-02-11","Quad",89,"Gel Booms-94608-Q4369/2290"]
["2017-02-25","TriBoom",100,"Colorado Booms-90009-T9634/2372"]
["2017-03-09","Sunbell",51,"Gel Booms-94618-S4369/2241"]
["2017-01-05","Quad",119,"Gel Booms-94608-Q4369/2290"]
["2017-02-24","Carlota",58,"Gel Booms-94608-C4369/2213"]
["2017-02-03","Bellen",32,"Gel Booms-94618-B4369/2593"]
["2017-01-11","Carlota",60,"Gel Booms-94608-C4369/2213"]
["2017-03-07","Sunbell",89,"Gel Booms-94618-S4369/2241"]
["2017-02-11","Quad",58,"Gel Booms-94608-Q4369/2290"]
["2017-01-14","TriBoom",79,"Colorado Booms-90009-T9634/2372"]
["2017-03-21","Aspen",51,"Colorado Booms-81231-A9634/2650"]
["2017-01-17","Sunshine",109,"Gel Booms-94618-S4369/2297"]
["2017-03-19","Sunshine",65,"Gel Booms-94618-S4369/2297"]
["2017-01-05","Sunshine",78,"Gel Booms-94618-S4369/2297"]
["2017-01-13","Carlota",59,"Gel Booms-94608-C4369/2213"]
["2017-02-21","Carlota",63,"Gel Booms-94608-C4369/2213"]
["2017-02-03","Bellen",78,"Gel Booms-94618-B4369/2593"]
["2017-01-17","Eagle",84,"Colorado Booms-81231-E9634/2386"]
["2017-02-26","Yanaki",109,{"$f":"_xlfn.TEXTJOIN(\"-\",,INDEX($G$10:$I$18,MATCH(B709,$F$10:$F$18),))","v":"Colorado Booms-81231-Y9634/2072"}]
["2017-03-30","Quad",48,"Gel Booms-94608-Q4369/2290"]
["2017-03-01","TriBoom",88,"Colorado Booms-90009-T9634/2372"]
["2017-02-13","Aspen",101,"Colorado Booms-81231-A9634/2650"]
["2017-01-14","Sunbell",56,"Gel Booms-94618-S4369/2241"]
["2017-01-10","Eagle",73,"Colorado Booms-81231-E9634/2386"]
["2017-03-13","Carlota",79,"Gel Booms-94608-C4369/2213"]
["2017-02-24","Eagle",60,"Colorado Booms-81231-E9634/2386"]
["2017-03-29","Aspen",77,"Colorado Booms-81231-A9634/2650"]
["2017-01-07","Quad",69,"Gel Booms-94608-Q4369/2290"]
["2017-01-05","Sunbell",83,"Gel Booms-94618-S4369/2241"]
["2017-02-13","Aspen",87,"Colorado Booms-81231-A9634/2650"]
["2017-03-26","Sunbell",94,"Gel Booms-94618-S4369/2241"]
["2017-01-24","Bellen",106,"Gel Booms-94618-B4369/2593"]
["2017-01-28","Eagle",65,"Colorado Booms-81231-E9634/2386"]
["2017-01-08","Yanaki",107,"Colorado Booms-81231-Y9634/2072"]
["2017-03-04","Quad",91,"Gel Booms-94608-Q4369/2290"]
["2017-03-29","TriBoom",58,"Colorado Booms-90009-T9634/2372"]
["2017-01-23","Quad",87,"Gel Booms-94608-Q4369/2290"]
["2017-03-22","TriBoom",146,"Colorado Booms-90009-T9634/2372"]
["2017-03-14","Bellen",116,"Gel Booms-94618-B4369/2593"]
["2017-01-29","Aspen",66,"Colorado Booms-81231-A9634/2650"]
["2017-01-22","Bellen",60,"Gel Booms-94618-B4369/2593"]
["2017-01-28","Sunshine",92,"Gel Booms-94618-S4369/2297"]
["2017-02-17","Quad",26,"Gel Booms-94608-Q4369/2290"]
["2017-01-16","Eagle",83,"Colorado Booms-81231-E9634/2386"]
["2017-03-25","TriBoom",38,"Colorado Booms-90009-T9634/2372"]
["2017-01-03","Eagle",53,"Colorado Booms-81231-E9634/2386"]
["2017-02-20","Carlota",18,"Gel Booms-94608-C4369/2213"]
["2017-03-22","Sunshine",53,"Gel Booms-94618-S4369/2297"]
["2017-03-08","Quad",59,"Gel Booms-94608-Q4369/2290"]
["2017-02-17","Quad",89,"Gel Booms-94608-Q4369/2290"]
["2017-03-16","Sunbell",46,"Gel Booms-94618-S4369/2241"]
["2017-03-01","Aspen",58,"Colorado Booms-81231-A9634/2650"]
["2017-03-12","Quad",36,"Gel Booms-94608-Q4369/2290"]
["2017-03-17","Yanaki",44,"Colorado Booms-81231-Y9634/2072"]
["2017-03-24","Bellen",64,"Gel Booms-94618-B4369/2593"]
["2017-01-15","Carlota",90,"Gel Booms-94608-C4369/2213"]
["2017-01-19","Eagle",68,"Colorado Booms-81231-E9634/2386"]
["2017-03-04","Sunshine",86,"Gel Booms-94618-S4369/2297"]
["2017-03-27","Sunbell",80,"Gel Booms-94618-S4369/2241"]
["2017-01-31","Carlota",80,"Gel Booms-94608-C4369/2213"]
["2017-03-17","Aspen",87,"Colorado Booms-81231-A9634/2650"]
["2017-03-20","Yanaki",67,"Colorado Booms-81231-Y9634/2072"]
["2017-02-27","Quad",106,"Gel Booms-94608-Q4369/2290"]
["2017-01-20","Quad",77,"Gel Booms-94608-Q4369/2290"]
["2017-02-03","Sunbell",90,"Gel Booms-94618-S4369/2241"]
["2017-02-04","Eagle",93,"Colorado Booms-81231-E9634/2386"]
["2017-02-02","Sunshine",106,"Gel Booms-94618-S4369/2297"]
["2017-01-30","Yanaki",78,"Colorado Booms-81231-Y9634/2072"]
["2017-01-28","Yanaki",97,"Colorado Booms-81231-Y9634/2072"]
["2017-02-04","Yanaki",40,"Colorado Booms-81231-Y9634/2072"]
["2017-03-09","Eagle",59,"Colorado Booms-81231-E9634/2386"]
["2017-03-23","Yanaki",75,"Colorado Booms-81231-Y9634/2072"]
["2017-01-03","Eagle",78,"Colorado Booms-81231-E9634/2386"]
["2017-01-24","TriBoom",88,"Colorado Booms-90009-T9634/2372"]
["2017-02-08","TriBoom",74,"Colorado Booms-90009-T9634/2372"]
["2017-01-20","Sunshine",45,"Gel Booms-94618-S4369/2297"]
["2017-03-21","Sunbell",130,"Gel Booms-94618-S4369/2241"]
["2017-01-20","TriBoom",66,"Colorado Booms-90009-T9634/2372"]
["2017-01-19","Sunbell",78,"Gel Booms-94618-S4369/2241"]
["2017-03-09","Eagle",105,"Colorado Booms-81231-E9634/2386"]
["2017-01-19","Bellen",77,"Gel Booms-94618-B4369/2593"]
["2017-01-02","Sunbell",53,"Gel Booms-94618-S4369/2241"]
["2017-03-02","Sunshine",115,{"$f":"_xlfn.TEXTJOIN(\"-\",,INDEX($G$10:$I$18,MATCH(B773,$F$10:$F$18),))","v":"Gel Booms-94618-S4369/2297"}]
["2017-01-28","Quad",70,"Gel Booms-94608-Q4369/2290"]
["2017-03-23","Carlota",57,"Gel Booms-94608-C4369/2213"]
["2017-03-25","Sunshine",78,"Gel Booms-94618-S4369/2297"]
["2017-02-04","Carlota",41,"Gel Booms-94608-C4369/2213"]
["2017-03-02","TriBoom",34,"Colorado Booms-90009-T9634/2372"]
["2017-01-31","Sunshine",116,"Gel Booms-94618-S4369/2297"]
["2017-01-19","Aspen",39,"Colorado Booms-81231-A9634/2650"]
["2017-01-05","Sunshine",57,"Gel Booms-94618-S4369/2297"]
["2017-02-20","Yanaki",104,"Colorado Booms-81231-Y9634/2072"]
["2017-01-02","Eagle",76,"Colorado Booms-81231-E9634/2386"]
["2017-03-28","Quad",49,"Gel Booms-94608-Q4369/2290"]
["2017-02-05","Sunshine",30,"Gel Booms-94618-S4369/2297"]
["2017-02-24","Carlota",59,"Gel Booms-94608-C4369/2213"]
["2017-03-28","Sunshine",82,"Gel Booms-94618-S4369/2297"]
["2017-03-21","Carlota",81,"Gel Booms-94608-C4369/2213"]
["2017-03-21","Carlota",70,"Gel Booms-94608-C4369/2213"]
["2017-01-21","Sunbell",63,"Gel Booms-94618-S4369/2241"]
["2017-01-22","Bellen",79,"Gel Booms-94618-B4369/2593"]
["2017-01-21","Quad",85,"Gel Booms-94608-Q4369/2290"]
["2017-01-20","Quad",72,"Gel Booms-94608-Q4369/2290"]
["2017-01-15","Carlota",73,"Gel Booms-94608-C4369/2213"]
["2017-03-08","TriBoom",52,"Colorado Booms-90009-T9634/2372"]
["2017-01-09","Sunshine",72,"Gel Booms-94618-S4369/2297"]
["2017-02-07","Sunbell",42,"Gel Booms-94618-S4369/2241"]
["2017-03-12","Aspen",71,"Colorado Booms-81231-A9634/2650"]
["2017-02-16","Quad",97,"Gel Booms-94608-Q4369/2290"]
["2017-01-15","Carlota",107,"Gel Booms-94608-C4369/2213"]
["2017-02-23","Aspen",44,"Colorado Booms-81231-A9634/2650"]
["2017-03-21","Carlota",70,"Gel Booms-94608-C4369/2213"]
["2017-02-18","Eagle",55,"Colorado Booms-81231-E9634/2386"]
["2017-02-05","Quad",34,"Gel Booms-94608-Q4369/2290"]
["2017-02-08","Quad",52,"Gel Booms-94608-Q4369/2290"]
["2017-03-02","Bellen",70,"Gel Booms-94618-B4369/2593"]
["2017-03-10","Sunbell",60,"Gel Booms-94618-S4369/2241"]
["2017-01-16","Carlota",77,"Gel Booms-94608-C4369/2213"]
["2017-01-17","Bellen",92,"Gel Booms-94618-B4369/2593"]
["2017-01-18","Sunshine",99,"Gel Booms-94618-S4369/2297"]
["2017-01-30","Bellen",124,"Gel Booms-94618-B4369/2593"]
["2017-02-07","Sunbell",94,"Gel Booms-94618-S4369/2241"]
["2017-02-17","TriBoom",59,"Colorado Booms-90009-T9634/2372"]
["2017-03-30","Sunbell",68,"Gel Booms-94618-S4369/2241"]
["2017-01-15","TriBoom",71,"Colorado Booms-90009-T9634/2372"]

{"sheet":"Bill Szysz (2)","index":6,"n_rows":815,"n_cols":11,"rows_kept":815,"cut":false,"hidden":false,"merged":[]}
[]
[]
["Date","Product","Units","Company-ZipCode-ID"]
["2017-03-16","Aspen",47,{"$f":"_xlfn.TEXTJOIN(\"-\",,INDEX(($G$10:$G$18,$H$10:$H$18,$I$10:$I$18),MATCH(B4,$F$10:$F$18),,N(IF(1,{1,2,3}))))","v":"Colorado Booms-81231-A9634/2650"}]
["2017-03-29","Sunbell",90,{"$f":"_xlfn.TEXTJOIN(\"-\",,INDEX(($G$10:$G$18,$H$10:$H$18,$I$10:$I$18),MATCH(B5,$F$10:$F$18),,N(IF(1,{1,2,3}))))","v":"Gel Booms-94618-S4369/2241"}]
["2017-03-02","Eagle",83,{"$f":"_xlfn.TEXTJOIN(\"-\",,INDEX(($G$10:$G$18,$H$10:$H$18,$I$10:$I$18),MATCH(B6,$F$10:$F$18),,N(IF(1,{1,2,3}))))","v":"Colorado Booms-81231-E9634/2386"}]
["2017-03-25","Aspen",83,{"$f":"_xlfn.TEXTJOIN(\"-\",,INDEX(($G$10:$G$18,$H$10:$H$18,$I$10:$I$18),MATCH(B7,$F$10:$F$18),,N(IF(1,{1,2,3}))))","v":"Colorado Booms-81231-A9634/2650"}]
["2017-01-11","Bellen",59,{"$f":"_xlfn.TEXTJOIN(\"-\",,INDEX(($G$10:$G$18,$H$10:$H$18,$I$10:$I$18),MATCH(B8,$F$10:$F$18),,N(IF(1,{1,2,3}))))","v":"Gel Booms-94618-B4369/2593"}]
["2017-01-15","TriBoom",45,{"$f":"_xlfn.TEXTJOIN(\"-\",,INDEX(($G$10:$G$18,$H$10:$H$18,$I$10:$I$18),MATCH(B9,$F$10:$F$18),,N(IF(1,{1,2,3}))))","v":"Colorado Booms-90009-T9634/2372"},null,"Product","Company","PlantZipCode","ID","RetailPrice","StandardCost"]
["2017-03-15","Sunbell",99,{"$f":"_xlfn.TEXTJOIN(\"-\",,INDEX(($G$10:$G$18,$H$10:$H$18,$I$10:$I$18),MATCH(B10,$F$10:$F$18),,N(IF(1,{1,2,3}))))","v":"Gel Booms-94618-S4369/2241"},null,"Aspen","Colorado Booms",81231,"A9634/2650",21.95,11.6335]
["2017-02-17","Carlota",114,{"$f":"_xlfn.TEXTJOIN(\"-\",,INDEX(($G$10:$G$18,$H$10:$H$18,$I$10:$I$18),MATCH(B11,$F$10:$F$18),,N(IF(1,{1,2,3}))))","v":"Gel Booms-94608-C4369/2213"},null,"Bellen","Gel Booms",94618,"B4369/2593",23.95,11.975]
["2017-02-03","Carlota",91,{"$f":"_xlfn.TEXTJOIN(\"-\",,INDEX(($G$10:$G$18,$H$10:$H$18,$I$10:$I$18),MATCH(B12,$F$10:$F$18),,N(IF(1,{1,2,3}))))","v":"Gel Booms-94608-C4369/2213"},null,"Carlota","Gel Booms",94608,"C4369/2213",28.95,14.185499999999999]
["2017-03-24","Sunbell",87,{"$f":"_xlfn.TEXTJOIN(\"-\",,INDEX(($G$10:$G$18,$H$10:$H$18,$I$10:$I$18),MATCH(B13,$F$10:$F$18),,N(IF(1,{1,2,3}))))","v":"Gel Booms-94618-S4369/2241"},null,"Eagle","Colorado Booms",81231,"E9634/2386",19.95,8.9774999999999991]
["2017-02-25","Bellen",71,{"$f":"_xlfn.TEXTJOIN(\"-\",,INDEX(($G$10:$G$18,$H$10:$H$18,$I$10:$I$18),MATCH(B14,$F$10:$F$18),,N(IF(1,{1,2,3}))))","v":"Gel Booms-94618-B4369/2593"},null,"Quad","Gel Booms",94608,"Q4369/2290",43.95,21.535500000000003]
["2017-03-08","Aspen",67,{"$f":"_xlfn.TEXTJOIN(\"-\",,INDEX(($G$10:$G$18,$H$10:$H$18,$I$10:$I$18),MATCH(B15,$F$10:$F$18),,N(IF(1,{1,2,3}))))","v":"Colorado Booms-81231-A9634/2650"},null,"Sunbell","Gel Booms",94618,"S4369/2241",27.95,15.3725]
["2017-01-05","Yanaki",63,{"$f":"_xlfn.TEXTJOIN(\"-\",,INDEX(($G$10:$G$18,$H$10:$H$18,$I$10:$I$18),MATCH(B16,$F$10:$F$18),,N(IF(1,{1,2,3}))))","v":"Colorado Booms-81231-Y9634/2072"},null,"Sunshine","Gel Booms",94618,"S4369/2297",22.95,12.163499999999999]
["2017-02-06","Quad",15,{"$f":"_xlfn.TEXTJOIN(\"-\",,INDEX(($G$10:$G$18,$H$10:$H$18,$I$10:$I$18),MATCH(B17,$F$10:$F$18),,N(IF(1,{1,2,3}))))","v":"Gel Booms-94608-Q4369/2290"},null,"TriBoom","Colorado Booms",90009,"T9634/2372",23.95,11.256499999999999]
["2017-01-06","Yanaki",32,{"$f":"_xlfn.TEXTJOIN(\"-\",,INDEX(($G$10:$G$18,$H$10:$H$18,$I$10:$I$18),MATCH(B18,$F$10:$F$18),,N(IF(1,{1,2,3}))))","v":"Colorado Booms-81231-Y9634/2072"},null,"Yanaki","Colorado Booms",81231,"Y9634/2072",24.95,13.472999999999999]
["2017-03-14","Aspen",88,{"$f":"_xlfn.TEXTJOIN(\"-\",,INDEX(($G$10:$G$18,$H$10:$H$18,$I$10:$I$18),MATCH(B19,$F$10:$F$18),,N(IF(1,{1,2,3}))))","v":"Colorado Booms-81231-A9634/2650"}]
["2017-02-05","Quad",50,{"$f":"_xlfn.TEXTJOIN(\"-\",,INDEX(($G$10:$G$18,$H$10:$H$18,$I$10:$I$18),MATCH(B20,$F$10:$F$18),,N(IF(1,{1,2,3}))))","v":"Gel Booms-94608-Q4369/2290"}]
["2017-02-10","Aspen",69,{"$f":"_xlfn.TEXTJOIN(\"-\",,INDEX(($G$10:$G$18,$H$10:$H$18,$I$10:$I$18),MATCH(B21,$F$10:$F$18),,N(IF(1,{1,2,3}))))","v":"Colorado Booms-81231-A9634/2650"}]
["2017-02-22","Eagle",98,{"$f":"_xlfn.TEXTJOIN(\"-\",,INDEX(($G$10:$G$18,$H$10:$H$18,$I$10:$I$18),MATCH(B22,$F$10:$F$18),,N(IF(1,{1,2,3}))))","v":"Colorado Booms-81231-E9634/2386"}]
["2017-02-28","Sunbell",87,{"$f":"_xlfn.TEXTJOIN(\"-\",,INDEX(($G$10:$G$18,$H$10:$H$18,$I$10:$I$18),MATCH(B23,$F$10:$F$18),,N(IF(1,{1,2,3}))))","v":"Gel Booms-94618-S4369/2241"}]
["2017-02-13","Yanaki",61,{"$f":"_xlfn.TEXTJOIN(\"-\",,INDEX(($G$10:$G$18,$H$10:$H$18,$I$10:$I$18),MATCH(B24,$F$10:$F$18),,N(IF(1,{1,2,3}))))","v":"Colorado Booms-81231-Y9634/2072"}]
["2017-03-22","Yanaki",51,{"$f":"_xlfn.TEXTJOIN(\"-\",,INDEX(($G$10:$G$18,$H$10:$H$18,$I$10:$I$18),MATCH(B25,$F$10:$F$18),,N(IF(1,{1,2,3}))))","v":"Colorado Booms-81231-Y9634/2072"}]
["2017-03-26","Carlota",62,{"$f":"_xlfn.TEXTJOIN(\"-\",,INDEX(($G$10:$G$18,$H$10:$H$18,$I$10:$I$18),MATCH(B26,$F$10:$F$18),,N(IF(1,{1,2,3}))))","v":"Gel Booms-94608-C4369/2213"}]
["2017-01-26","Aspen",78,{"$f":"_xlfn.TEXTJOIN(\"-\",,INDEX(($G$10:$G$18,$H$10:$H$18,$I$10:$I$18),MATCH(B27,$F$10:$F$18),,N(IF(1,{1,2,3}))))","v":"Colorado Booms-81231-A9634/2650"}]
["2017-01-07","Aspen",32,{"$f":"_xlfn.TEXTJOIN(\"-\",,INDEX(($G$10:$G$18,$H$10:$H$18,$I$10:$I$18),MATCH(B28,$F$10:$F$18),,N(IF(1,{1,2,3}))))","v":"Colorado Booms-81231-A9634/2650"}]
["2017-02-04","Carlota",93,{"$f":"_xlfn.TEXTJOIN(\"-\",,INDEX(($G$10:$G$18,$H$10:$H$18,$I$10:$I$18),MATCH(B29,$F$10:$F$18),,N(IF(1,{1,2,3}))))","v":"Gel Booms-94608-C4369/2213"}]
["2017-02-12","Aspen",115,{"$f":"_xlfn.TEXTJOIN(\"-\",,INDEX(($G$10:$G$18,$H$10:$H$18,$I$10:$I$18),MATCH(B30,$F$10:$F$18),,N(IF(1,{1,2,3}))))","v":"Colorado Booms-81231-A9634/2650"}]
["2017-03-19","Bellen",56,{"$f":"_xlfn.TEXTJOIN(\"-\",,INDEX(($G$10:$G$18,$H$10:$H$18,$I$10:$I$18),MATCH(B31,$F$10:$F$18),,N(IF(1,{1,2,3}))))","v":"Gel Booms-94618-B4369/2593"}]
["2017-03-11","Eagle",68,{"$f":"_xlfn.TEXTJOIN(\"-\",,INDEX(($G$10:$G$18,$H$10:$H$18,$I$10:$I$18),MATCH(B32,$F$10:$F$18),,N(IF(1,{1,2,3}))))","v":"Colorado Booms-81231-E9634/2386"}]
["2017-03-09","Carlota",71,{"$f":"_xlfn.TEXTJOIN(\"-\",,INDEX(($G$10:$G$18,$H$10:$H$18,$I$10:$I$18),MATCH(B33,$F$10:$F$18),,N(IF(1,{1,2,3}))))","v":"Gel Booms-94608-C4369/2213"}]
["2017-01-30","Carlota",73,{"$f":"_xlfn.TEXTJOIN(\"-\",,INDEX(($G$10:$G$18,$H$10:$H$18,$I$10:$I$18),MATCH(B34,$F$10:$F$18),,N(IF(1,{1,2,3}))))","v":"Gel Booms-94608-C4369/2213"}]
["2017-02-16","Carlota",47,{"$f":"_xlfn.TEXTJOIN(\"-\",,INDEX(($G$10:$G$18,$H$10:$H$18,$I$10:$I$18),MATCH(B35,$F$10:$F$18),,N(IF(1,{1,2,3}))))","v":"Gel Booms-94608-C4369/2213"}]
["2017-02-10","Carlota",82,{"$f":"_xlfn.TEXTJOIN(\"-\",,INDEX(($G$10:$G$18,$H$10:$H$18,$I$10:$I$18),MATCH(B36,$F$10:$F$18),,N(IF(1,{1,2,3}))))","v":"Gel Booms-94608-C4369/2213"}]
["2017-02-21","Sunshine",61,{"$f":"_xlfn.TEXTJOIN(\"-\",,INDEX(($G$10:$G$18,$H$10:$H$18,$I$10:$I$18),MATCH(B37,$F$10:$F$18),,N(IF(1,{1,2,3}))))","v":"Gel Booms-94618-S4369/2297"}]
["2017-02-21","Quad",83,{"$f":"_xlfn.TEXTJOIN(\"-\",,INDEX(($G$10:$G$18,$H$10:$H$18,$I$10:$I$18),MATCH(B38,$F$10:$F$18),,N(IF(1,{1,2,3}))))","v":"Gel Booms-94608-Q4369/2290"}]
["2017-02-02","TriBoom",47,{"$f":"_xlfn.TEXTJOIN(\"-\",,INDEX(($G$10:$G$18,$H$10:$H$18,$I$10:$I$18),MATCH(B39,$F$10:$F$18),,N(IF(1,{1,2,3}))))","v":"Colorado Booms-90009-T9634/2372"}]
["2017-02-10","Yanaki",83,{"$f":"_xlfn.TEXTJOIN(\"-\",,INDEX(($G$10:$G$18,$H$10:$H$18,$I$10:$I$18),MATCH(B40,$F$10:$F$18),,N(IF(1,{1,2,3}))))","v":"Colorado Booms-81231-Y9634/2072"}]
["2017-01-04","Carlota",74,{"$f":"_xlfn.TEXTJOIN(\"-\",,INDEX(($G$10:$G$18,$H$10:$H$18,$I$10:$I$18),MATCH(B41,$F$10:$F$18),,N(IF(1,{1,2,3}))))","v":"Gel Booms-94608-C4369/2213"}]
["2017-01-25","Quad",65,{"$f":"_xlfn.TEXTJOIN(\"-\",,INDEX(($G$10:$G$18,$H$10:$H$18,$I$10:$I$18),MATCH(B42,$F$10:$F$18),,N(IF(1,{1,2,3}))))","v":"Gel Booms-94608-Q4369/2290"}]
["2017-03-01","Bellen",109,{"$f":"_xlfn.TEXTJOIN(\"-\",,INDEX(($G$10:$G$18,$H$10:$H$18,$I$10:$I$18),MATCH(B43,$F$10:$F$18),,N(IF(1,{1,2,3}))))","v":"Gel Booms-94618-B4369/2593"}]
["2017-02-20","Aspen",78,{"$f":"_xlfn.TEXTJOIN(\"-\",,INDEX(($G$10:$G$18,$H$10:$H$18,$I$10:$I$18),MATCH(B44,$F$10:$F$18),,N(IF(1,{1,2,3}))))","v":"Colorado Booms-81231-A9634/2650"}]
["2017-01-02","Aspen",64,{"$f":"_xlfn.TEXTJOIN(\"-\",,INDEX(($G$10:$G$18,$H$10:$H$18,$I$10:$I$18),MATCH(B45,$F$10:$F$18),,N(IF(1,{1,2,3}))))","v":"Colorado Booms-81231-A9634/2650"}]
["2017-03-30","Yanaki",109,{"$f":"_xlfn.TEXTJOIN(\"-\",,INDEX(($G$10:$G$18,$H$10:$H$18,$I$10:$I$18),MATCH(B46,$F$10:$F$18),,N(IF(1,{1,2,3}))))","v":"Colorado Booms-81231-Y9634/2072"}]
["2017-01-16","TriBoom",58,{"$f":"_xlfn.TEXTJOIN(\"-\",,INDEX(($G$10:$G$18,$H$10:$H$18,$I$10:$I$18),MATCH(B47,$F$10:$F$18),,N(IF(1,{1,2,3}))))","v":"Colorado Booms-90009-T9634/2372"}]
["2017-01-12","Carlota",60,{"$f":"_xlfn.TEXTJOIN(\"-\",,INDEX(($G$10:$G$18,$H$10:$H$18,$I$10:$I$18),MATCH(B48,$F$10:$F$18),,N(IF(1,{1,2,3}))))","v":"Gel Booms-94608-C4369/2213"}]
["2017-02-05","Sunshine",102,{"$f":"_xlfn.TEXTJOIN(\"-\",,INDEX(($G$10:$G$18,$H$10:$H$18,$I$10:$I$18),MATCH(B49,$F$10:$F$18),,N(IF(1,{1,2,3}))))","v":"Gel Booms-94618-S4369/2297"}]
["2017-02-14","Bellen",65,{"$f":"_xlfn.TEXTJOIN(\"-\",,INDEX(($G$10:$G$18,$H$10:$H$18,$I$10:$I$18),MATCH(B50,$F$10:$F$18),,N(IF(1,{1,2,3}))))","v":"Gel Booms-94618-B4369/2593"}]
["2017-03-13","Sunbell",31,{"$f":"_xlfn.TEXTJOIN(\"-\",,INDEX(($G$10:$G$18,$H$10:$H$18,$I$10:$I$18),MATCH(B51,$F$10:$F$18),,N(IF(1,{1,2,3}))))","v":"Gel Booms-94618-S4369/2241"}]
["2017-01-27","Aspen",102,{"$f":"_xlfn.TEXTJOIN(\"-\",,INDEX(($G$10:$G$18,$H$10:$H$18,$I$10:$I$18),MATCH(B52,$F$10:$F$18),,N(IF(1,{1,2,3}))))","v":"Colorado Booms-81231-A9634/2650"}]
["2017-01-26","Quad",52,{"$f":"_xlfn.TEXTJOIN(\"-\",,INDEX(($G$10:$G$18,$H$10:$H$18,$I$10:$I$18),MATCH(B53,$F$10:$F$18),,N(IF(1,{1,2,3}))))","v":"Gel Booms-94608-Q4369/2290"}]
["2017-03-08","Sunbell",95,{"$f":"_xlfn.TEXTJOIN(\"-\",,INDEX(($G$10:$G$18,$H$10:$H$18,$I$10:$I$18),MATCH(B54,$F$10:$F$18),,N(IF(1,{1,2,3}))))","v":"Gel Booms-94618-S4369/2241"}]
["2017-01-08","Aspen",68,{"$f":"_xlfn.TEXTJOIN(\"-\",,INDEX(($G$10:$G$18,$H$10:$H$18,$I$10:$I$18),MATCH(B55,$F$10:$F$18),,N(IF(1,{1,2,3}))))","v":"Colorado Booms-81231-A9634/2650"}]
["2017-03-11","Bellen",85,{"$f":"_xlfn.TEXTJOIN(\"-\",,INDEX(($G$10:$G$18,$H$10:$H$18,$I$10:$I$18),MATCH(B56,$F$10:$F$18),,N(IF(1,{1,2,3}))))","v":"Gel Booms-94618-B4369/2593"}]
["2017-03-02","Yanaki",22,{"$f":"_xlfn.TEXTJOIN(\"-\",,INDEX(($G$10:$G$18,$H$10:$H$18,$I$10:$I$18),MATCH(B57,$F$10:$F$18),,N(IF(1,{1,2,3}))))","v":"Colorado Booms-81231-Y9634/2072"}]
["2017-01-13","Sunshine",79,{"$f":"_xlfn.TEXTJOIN(\"-\",,INDEX(($G$10:$G$18,$H$10:$H$18,$I$10:$I$18),MATCH(B58,$F$10:$F$18),,N(IF(1,{1,2,3}))))","v":"Gel Booms-94618-S4369/2297"}]
["2017-03-27","Aspen",62,{"$f":"_xlfn.TEXTJOIN(\"-\",,INDEX(($G$10:$G$18,$H$10:$H$18,$I$10:$I$18),MATCH(B59,$F$10:$F$18),,N(IF(1,{1,2,3}))))","v":"Colorado Booms-81231-A9634/2650"}]
["2017-02-09","Eagle",70,{"$f":"_xlfn.TEXTJOIN(\"-\",,INDEX(($G$10:$G$18,$H$10:$H$18,$I$10:$I$18),MATCH(B60,$F$10:$F$18),,N(IF(1,{1,2,3}))))","v":"Colorado Booms-81231-E9634/2386"}]
["2017-01-17","TriBoom",60,{"$f":"_xlfn.TEXTJOIN(\"-\",,INDEX(($G$10:$G$18,$H$10:$H$18,$I$10:$I$18),MATCH(B61,$F$10:$F$18),,N(IF(1,{1,2,3}))))","v":"Colorado Booms-90009-T9634/2372"}]
["2017-03-11","Aspen",65,{"$f":"_xlfn.TEXTJOIN(\"-\",,INDEX(($G$10:$G$18,$H$10:$H$18,$I$10:$I$18),MATCH(B62,$F$10:$F$18),,N(IF(1,{1,2,3}))))","v":"Colorado Booms-81231-A9634/2650"}]
["2017-03-07","TriBoom",84,{"$f":"_xlfn.TEXTJOIN(\"-\",,INDEX(($G$10:$G$18,$H$10:$H$18,$I$10:$I$18),MATCH(B63,$F$10:$F$18),,N(IF(1,{1,2,3}))))","v":"Colorado Booms-90009-T9634/2372"}]
["2017-03-03","Carlota",67,{"$f":"_xlfn.TEXTJOIN(\"-\",,INDEX(($G$10:$G$18,$H$10:$H$18,$I$10:$I$18),MATCH(B64,$F$10:$F$18),,N(IF(1,{1,2,3}))))","v":"Gel Booms-94608-C4369/2213"}]
["2017-03-13","Eagle",104,{"$f":"_xlfn.TEXTJOIN(\"-\",,INDEX(($G$10:$G$18,$H$10:$H$18,$I$10:$I$18),MATCH(B65,$F$10:$F$18),,N(IF(1,{1,2,3}))))","v":"Colorado Booms-81231-E9634/2386"}]
["2017-01-18","Bellen",93,{"$f":"_xlfn.TEXTJOIN(\"-\",,INDEX(($G$10:$G$18,$H$10:$H$18,$I$10:$I$18),MATCH(B66,$F$10:$F$18),,N(IF(1,{1,2,3}))))","v":"Gel Booms-94618-B4369/2593"}]
["2017-03-28","Carlota",82,{"$f":"_xlfn.TEXTJOIN(\"-\",,INDEX(($G$10:$G$18,$H$10:$H$18,$I$10:$I$18),MATCH(B67,$F$10:$F$18),,N(IF(1,{1,2,3}))))","v":"Gel Booms-94608-C4369/2213"}]
["2017-03-10","Bellen",71,{"$f":"_xlfn.TEXTJOIN(\"-\",,INDEX(($G$10:$G$18,$H$10:$H$18,$I$10:$I$18),MATCH(B68,$F$10:$F$18),,N(IF(1,{1,2,3}))))","v":"Gel Booms-94618-B4369/2593"}]
["2017-01-01","Eagle",71,{"$f":"_xlfn.TEXTJOIN(\"-\",,INDEX(($G$10:$G$18,$H$10:$H$18,$I$10:$I$18),MATCH(B69,$F$10:$F$18),,N(IF(1,{1,2,3}))))","v":"Colorado Booms-81231-E9634/2386"}]
["2017-03-30","TriBoom",68,{"$f":"_xlfn.TEXTJOIN(\"-\",,INDEX(($G$10:$G$18,$H$10:$H$18,$I$10:$I$18),MATCH(B70,$F$10:$F$18),,N(IF(1,{1,2,3}))))","v":"Colorado Booms-90009-T9634/2372"}]
["2017-01-15","Bellen",120,{"$f":"_xlfn.TEXTJOIN(\"-\",,INDEX(($G$10:$G$18,$H$10:$H$18,$I$10:$I$18),MATCH(B71,$F$10:$F$18),,N(IF(1,{1,2,3}))))","v":"Gel Booms-94618-B4369/2593"}]
["2017-01-06","Sunbell",46,{"$f":"_xlfn.TEXTJOIN(\"-\",,INDEX(($G$10:$G$18,$H$10:$H$18,$I$10:$I$18),MATCH(B72,$F$10:$F$18),,N(IF(1,{1,2,3}))))","v":"Gel Booms-94618-S4369/2241"}]
["2017-01-04","Carlota",96,{"$f":"_xlfn.TEXTJOIN(\"-\",,INDEX(($G$10:$G$18,$H$10:$H$18,$I$10:$I$18),MATCH(B73,$F$10:$F$18),,N(IF(1,{1,2,3}))))","v":"Gel Booms-94608-C4369/2213"}]
["2017-02-03","Aspen",86,{"$f":"_xlfn.TEXTJOIN(\"-\",,INDEX(($G$10:$G$18,$H$10:$H$18,$I$10:$I$18),MATCH(B74,$F$10:$F$18),,N(IF(1,{1,2,3}))))","v":"Colorado Booms-81231-A9634/2650"}]
["2017-03-28","Sunbell",79,{"$f":"_xlfn.TEXTJOIN(\"-\",,INDEX(($G$10:$G$18,$H$10:$H$18,$I$10:$I$18),MATCH(B75,$F$10:$F$18),,N(IF(1,{1,2,3}))))","v":"Gel Booms-94618-S4369/2241"}]
["2017-02-22","Bellen",100,{"$f":"_xlfn.TEXTJOIN(\"-\",,INDEX(($G$10:$G$18,$H$10:$H$18,$I$10:$I$18),MATCH(B76,$F$10:$F$18),,N(IF(1,{1,2,3}))))","v":"Gel Booms-94618-B4369/2593"}]
["2017-01-23","Yanaki",77,{"$f":"_xlfn.TEXTJOIN(\"-\",,INDEX(($G$10:$G$18,$H$10:$H$18,$I$10:$I$18),MATCH(B77,$F$10:$F$18),,N(IF(1,{1,2,3}))))","v":"Colorado Booms-81231-Y9634/2072"}]
["2017-01-04","Sunbell",49,{"$f":"_xlfn.TEXTJOIN(\"-\",,INDEX(($G$10:$G$18,$H$10:$H$18,$I$10:$I$18),MATCH(B78,$F$10:$F$18),,N(IF(1,{1,2,3}))))","v":"Gel Booms-94618-S4369/2241"}]
["2017-03-05","Eagle",92,{"$f":"_xlfn.TEXTJOIN(\"-\",,INDEX(($G$10:$G$18,$H$10:$H$18,$I$10:$I$18),MATCH(B79,$F$10:$F$18),,N(IF(1,{1,2,3}))))","v":"Colorado Booms-81231-E9634/2386"}]
["2017-01-25","Sunshine",49,{"$f":"_xlfn.TEXTJOIN(\"-\",,INDEX(($G$10:$G$18,$H$10:$H$18,$I$10:$I$18),MATCH(B80,$F$10:$F$18),,N(IF(1,{1,2,3}))))","v":"Gel Booms-94618-S4369/2297"}]
["2017-01-23","Aspen",9,{"$f":"_xlfn.TEXTJOIN(\"-\",,INDEX(($G$10:$G$18,$H$10:$H$18,$I$10:$I$18),MATCH(B81,$F$10:$F$18),,N(IF(1,{1,2,3}))))","v":"Colorado Booms-81231-A9634/2650"}]
["2017-03-22","Bellen",44,{"$f":"_xlfn.TEXTJOIN(\"-\",,INDEX(($G$10:$G$18,$H$10:$H$18,$I$10:$I$18),MATCH(B82,$F$10:$F$18),,N(IF(1,{1,2,3}))))","v":"Gel Booms-94618-B4369/2593"}]
["2017-02-27","Carlota",72,{"$f":"_xlfn.TEXTJOIN(\"-\",,INDEX(($G$10:$G$18,$H$10:$H$18,$I$10:$I$18),MATCH(B83,$F$10:$F$18),,N(IF(1,{1,2,3}))))","v":"Gel Booms-94608-C4369/2213"}]
["2017-03-02","Carlota",59,{"$f":"_xlfn.TEXTJOIN(\"-\",,INDEX(($G$10:$G$18,$H$10:$H$18,$I$10:$I$18),MATCH(B84,$F$10:$F$18),,N(IF(1,{1,2,3}))))","v":"Gel Booms-94608-C4369/2213"}]
["2017-01-17","Sunbell",90,{"$f":"_xlfn.TEXTJOIN(\"-\",,INDEX(($G$10:$G$18,$H$10:$H$18,$I$10:$I$18),MATCH(B85,$F$10:$F$18),,N(IF(1,{1,2,3}))))","v":"Gel Booms-94618-S4369/2241"}]
["2017-02-25","Eagle",54,{"$f":"_xlfn.TEXTJOIN(\"-\",,INDEX(($G$10:$G$18,$H$10:$H$18,$I$10:$I$18),MATCH(B86,$F$10:$F$18),,N(IF(1,{1,2,3}))))","v":"Colorado Booms-81231-E9634/2386"}]
["2017-01-31","Quad",71,{"$f":"_xlfn.TEXTJOIN(\"-\",,INDEX(($G$10:$G$18,$H$10:$H$18,$I$10:$I$18),MATCH(B87,$F$10:$F$18),,N(IF(1,{1,2,3}))))","v":"Gel Booms-94608-Q4369/2290"}]
["2017-01-27","Eagle",90,{"$f":"_xlfn.TEXTJOIN(\"-\",,INDEX(($G$10:$G$18,$H$10:$H$18,$I$10:$I$18),MATCH(B88,$F$10:$F$18),,N(IF(1,{1,2,3}))))","v":"Colorado Booms-81231-E9634/2386"}]
["2017-03-17","Quad",58,{"$f":"_xlfn.TEXTJOIN(\"-\",,INDEX(($G$10:$G$18,$H$10:$H$18,$I$10:$I$18),MATCH(B89,$F$10:$F$18),,N(IF(1,{1,2,3}))))","v":"Gel Booms-94608-Q4369/2290"}]
["2017-01-29","Bellen",73,{"$f":"_xlfn.TEXTJOIN(\"-\",,INDEX(($G$10:$G$18,$H$10:$H$18,$I$10:$I$18),MATCH(B90,$F$10:$F$18),,N(IF(1,{1,2,3}))))","v":"Gel Booms-94618-B4369/2593"}]
["2017-03-02","TriBoom",69,{"$f":"_xlfn.TEXTJOIN(\"-\",,INDEX(($G$10:$G$18,$H$10:$H$18,$I$10:$I$18),MATCH(B91,$F$10:$F$18),,N(IF(1,{1,2,3}))))","v":"Colorado Booms-90009-T9634/2372"}]
["2017-01-11","Eagle",59,{"$f":"_xlfn.TEXTJOIN(\"-\",,INDEX(($G$10:$G$18,$H$10:$H$18,$I$10:$I$18),MATCH(B92,$F$10:$F$18),,N(IF(1,{1,2,3}))))","v":"Colorado Booms-81231-E9634/2386"}]
["2017-03-06","Yanaki",71,{"$f":"_xlfn.TEXTJOIN(\"-\",,INDEX(($G$10:$G$18,$H$10:$H$18,$I$10:$I$18),MATCH(B93,$F$10:$F$18),,N(IF(1,{1,2,3}))))","v":"Colorado Booms-81231-Y9634/2072"}]
["2017-02-06","Eagle",111,{"$f":"_xlfn.TEXTJOIN(\"-\",,INDEX(($G$10:$G$18,$H$10:$H$18,$I$10:$I$18),MATCH(B94,$F$10:$F$18),,N(IF(1,{1,2,3}))))","v":"Colorado Booms-81231-E9634/2386"}]
["2017-03-24","TriBoom",59,{"$f":"_xlfn.TEXTJOIN(\"-\",,INDEX(($G$10:$G$18,$H$10:$H$18,$I$10:$I$18),MATCH(B95,$F$10:$F$18),,N(IF(1,{1,2,3}))))","v":"Colorado Booms-90009-T9634/2372"}]
["2017-02-20","Carlota",103,{"$f":"_xlfn.TEXTJOIN(\"-\",,INDEX(($G$10:$G$18,$H$10:$H$18,$I$10:$I$18),MATCH(B96,$F$10:$F$18),,N(IF(1,{1,2,3}))))","v":"Gel Booms-94608-C4369/2213"}]
["2017-02-22","TriBoom",59,{"$f":"_xlfn.TEXTJOIN(\"-\",,INDEX(($G$10:$G$18,$H$10:$H$18,$I$10:$I$18),MATCH(B97,$F$10:$F$18),,N(IF(1,{1,2,3}))))","v":"Colorado Booms-90009-T9634/2372"}]
["2017-01-28","TriBoom",96,{"$f":"_xlfn.TEXTJOIN(\"-\",,INDEX(($G$10:$G$18,$H$10:$H$18,$I$10:$I$18),MATCH(B98,$F$10:$F$18),,N(IF(1,{1,2,3}))))","v":"Colorado Booms-90009-T9634/2372"}]
["2017-01-24","TriBoom",53,{"$f":"_xlfn.TEXTJOIN(\"-\",,INDEX(($G$10:$G$18,$H$10:$H$18,$I$10:$I$18),MATCH(B99,$F$10:$F$18),,N(IF(1,{1,2,3}))))","v":"Colorado Booms-90009-T9634/2372"}]
["2017-01-23","Eagle",43,{"$f":"_xlfn.TEXTJOIN(\"-\",,INDEX(($G$10:$G$18,$H$10:$H$18,$I$10:$I$18),MATCH(B100,$F$10:$F$18),,N(IF(1,{1,2,3}))))","v":"Colorado Booms-81231-E9634/2386"}]
["2017-02-23","Bellen",67,{"$f":"_xlfn.TEXTJOIN(\"-\",,INDEX(($G$10:$G$18,$H$10:$H$18,$I$10:$I$18),MATCH(B101,$F$10:$F$18),,N(IF(1,{1,2,3}))))","v":"Gel Booms-94618-B4369/2593"}]
["2017-02-16","Aspen",115,{"$f":"_xlfn.TEXTJOIN(\"-\",,INDEX(($G$10:$G$18,$H$10:$H$18,$I$10:$I$18),MATCH(B102,$F$10:$F$18),,N(IF(1,{1,2,3}))))","v":"Colorado Booms-81231-A9634/2650"}]
["2017-02-07","TriBoom",93,{"$f":"_xlfn.TEXTJOIN(\"-\",,INDEX(($G$10:$G$18,$H$10:$H$18,$I$10:$I$18),MATCH(B103,$F$10:$F$18),,N(IF(1,{1,2,3}))))","v":"Colorado Booms-90009-T9634/2372"}]
["2017-03-13","Yanaki",44,{"$f":"_xlfn.TEXTJOIN(\"-\",,INDEX(($G$10:$G$18,$H$10:$H$18,$I$10:$I$18),MATCH(B104,$F$10:$F$18),,N(IF(1,{1,2,3}))))","v":"Colorado Booms-81231-Y9634/2072"}]
["2017-02-09","Yanaki",82,{"$f":"_xlfn.TEXTJOIN(\"-\",,INDEX(($G$10:$G$18,$H$10:$H$18,$I$10:$I$18),MATCH(B105,$F$10:$F$18),,N(IF(1,{1,2,3}))))","v":"Colorado Booms-81231-Y9634/2072"}]
["2017-01-24","Aspen",96,{"$f":"_xlfn.TEXTJOIN(\"-\",,INDEX(($G$10:$G$18,$H$10:$H$18,$I$10:$I$18),MATCH(B106,$F$10:$F$18),,N(IF(1,{1,2,3}))))","v":"Colorado Booms-81231-A9634/2650"}]
["2017-03-03","Eagle",115,{"$f":"_xlfn.TEXTJOIN(\"-\",,INDEX(($G$10:$G$18,$H$10:$H$18,$I$10:$I$18),MATCH(B107,$F$10:$F$18),,N(IF(1,{1,2,3}))))","v":"Colorado Booms-81231-E9634/2386"}]
["2017-03-15","Carlota",58,{"$f":"_xlfn.TEXTJOIN(\"-\",,INDEX(($G$10:$G$18,$H$10:$H$18,$I$10:$I$18),MATCH(B108,$F$10:$F$18),,N(IF(1,{1,2,3}))))","v":"Gel Booms-94608-C4369/2213"}]
["2017-02-13","Eagle",100,{"$f":"_xlfn.TEXTJOIN(\"-\",,INDEX(($G$10:$G$18,$H$10:$H$18,$I$10:$I$18),MATCH(B109,$F$10:$F$18),,N(IF(1,{1,2,3}))))","v":"Colorado Booms-81231-E9634/2386"}]
["2017-03-29","TriBoom",80,{"$f":"_xlfn.TEXTJOIN(\"-\",,INDEX(($G$10:$G$18,$H$10:$H$18,$I$10:$I$18),MATCH(B110,$F$10:$F$18),,N(IF(1,{1,2,3}))))","v":"Colorado Booms-90009-T9634/2372"}]
["2017-02-25","Sunshine",105,{"$f":"_xlfn.TEXTJOIN(\"-\",,INDEX(($G$10:$G$18,$H$10:$H$18,$I$10:$I$18),MATCH(B111,$F$10:$F$18),,N(IF(1,{1,2,3}))))","v":"Gel Booms-94618-S4369/2297"}]
["2017-03-19","Sunshine",84,{"$f":"_xlfn.TEXTJOIN(\"-\",,INDEX(($G$10:$G$18,$H$10:$H$18,$I$10:$I$18),MATCH(B112,$F$10:$F$18),,N(IF(1,{1,2,3}))))","v":"Gel Booms-94618-S4369/2297"}]
["2017-01-03","Bellen",62,{"$f":"_xlfn.TEXTJOIN(\"-\",,INDEX(($G$10:$G$18,$H$10:$H$18,$I$10:$I$18),MATCH(B113,$F$10:$F$18),,N(IF(1,{1,2,3}))))","v":"Gel Booms-94618-B4369/2593"}]
["2017-03-13","Quad",92,{"$f":"_xlfn.TEXTJOIN(\"-\",,INDEX(($G$10:$G$18,$H$10:$H$18,$I$10:$I$18),MATCH(B114,$F$10:$F$18),,N(IF(1,{1,2,3}))))","v":"Gel Booms-94608-Q4369/2290"}]
["2017-02-16","Sunshine",49,{"$f":"_xlfn.TEXTJOIN(\"-\",,INDEX(($G$10:$G$18,$H$10:$H$18,$I$10:$I$18),MATCH(B115,$F$10:$F$18),,N(IF(1,{1,2,3}))))","v":"Gel Booms-94618-S4369/2297"}]
["2017-02-11","Aspen",119,{"$f":"_xlfn.TEXTJOIN(\"-\",,INDEX(($G$10:$G$18,$H$10:$H$18,$I$10:$I$18),MATCH(B116,$F$10:$F$18),,N(IF(1,{1,2,3}))))","v":"Colorado Booms-81231-A9634/2650"}]
["2017-02-20","Bellen",41,{"$f":"_xlfn.TEXTJOIN(\"-\",,INDEX(($G$10:$G$18,$H$10:$H$18,$I$10:$I$18),MATCH(B117,$F$10:$F$18),,N(IF(1,{1,2,3}))))","v":"Gel Booms-94618-B4369/2593"}]
["2017-01-13","Aspen",115,{"$f":"_xlfn.TEXTJOIN(\"-\",,INDEX(($G$10:$G$18,$H$10:$H$18,$I$10:$I$18),MATCH(B118,$F$10:$F$18),,N(IF(1,{1,2,3}))))","v":"Colorado Booms-81231-A9634/2650"}]
["2017-01-04","Quad",103,{"$f":"_xlfn.TEXTJOIN(\"-\",,INDEX(($G$10:$G$18,$H$10:$H$18,$I$10:$I$18),MATCH(B119,$F$10:$F$18),,N(IF(1,{1,2,3}))))","v":"Gel Booms-94608-Q4369/2290"}]
["2017-01-13","Bellen",79,{"$f":"_xlfn.TEXTJOIN(\"-\",,INDEX(($G$10:$G$18,$H$10:$H$18,$I$10:$I$18),MATCH(B120,$F$10:$F$18),,N(IF(1,{1,2,3}))))","v":"Gel Booms-94618-B4369/2593"}]
["2017-01-04","Bellen",113,{"$f":"_xlfn.TEXTJOIN(\"-\",,INDEX(($G$10:$G$18,$H$10:$H$18,$I$10:$I$18),MATCH(B121,$F$10:$F$18),,N(IF(1,{1,2,3}))))","v":"Gel Booms-94618-B4369/2593"}]
["2017-03-25","Aspen",49,{"$f":"_xlfn.TEXTJOIN(\"-\",,INDEX(($G$10:$G$18,$H$10:$H$18,$I$10:$I$18),MATCH(B122,$F$10:$F$18),,N(IF(1,{1,2,3}))))","v":"Colorado Booms-81231-A9634/2650"}]
["2017-03-29","Quad",77,{"$f":"_xlfn.TEXTJOIN(\"-\",,INDEX(($G$10:$G$18,$H$10:$H$18,$I$10:$I$18),MATCH(B123,$F$10:$F$18),,N(IF(1,{1,2,3}))))","v":"Gel Booms-94608-Q4369/2290"}]
["2017-02-20","Eagle",63,{"$f":"_xlfn.TEXTJOIN(\"-\",,INDEX(($G$10:$G$18,$H$10:$H$18,$I$10:$I$18),MATCH(B124,$F$10:$F$18),,N(IF(1,{1,2,3}))))","v":"Colorado Booms-81231-E9634/2386"}]
["2017-02-04","Sunbell",84,{"$f":"_xlfn.TEXTJOIN(\"-\",,INDEX(($G$10:$G$18,$H$10:$H$18,$I$10:$I$18),MATCH(B125,$F$10:$F$18),,N(IF(1,{1,2,3}))))","v":"Gel Booms-94618-S4369/2241"}]
["2017-02-04","TriBoom",89,{"$f":"_xlfn.TEXTJOIN(\"-\",,INDEX(($G$10:$G$18,$H$10:$H$18,$I$10:$I$18),MATCH(B126,$F$10:$F$18),,N(IF(1,{1,2,3}))))","v":"Colorado Booms-90009-T9634/2372"}]
["2017-01-19","Sunbell",93,{"$f":"_xlfn.TEXTJOIN(\"-\",,INDEX(($G$10:$G$18,$H$10:$H$18,$I$10:$I$18),MATCH(B127,$F$10:$F$18),,N(IF(1,{1,2,3}))))","v":"Gel Booms-94618-S4369/2241"}]
["2017-01-21","Bellen",46,{"$f":"_xlfn.TEXTJOIN(\"-\",,INDEX(($G$10:$G$18,$H$10:$H$18,$I$10:$I$18),MATCH(B128,$F$10:$F$18),,N(IF(1,{1,2,3}))))","v":"Gel Booms-94618-B4369/2593"}]
["2017-01-31","TriBoom",45,{"$f":"_xlfn.TEXTJOIN(\"-\",,INDEX(($G$10:$G$18,$H$10:$H$18,$I$10:$I$18),MATCH(B129,$F$10:$F$18),,N(IF(1,{1,2,3}))))","v":"Colorado Booms-90009-T9634/2372"}]
["2017-03-23","Yanaki",110,{"$f":"_xlfn.TEXTJOIN(\"-\",,INDEX(($G$10:$G$18,$H$10:$H$18,$I$10:$I$18),MATCH(B130,$F$10:$F$18),,N(IF(1,{1,2,3}))))","v":"Colorado Booms-81231-Y9634/2072"}]
["2017-01-21","Aspen",54,{"$f":"_xlfn.TEXTJOIN(\"-\",,INDEX(($G$10:$G$18,$H$10:$H$18,$I$10:$I$18),MATCH(B131,$F$10:$F$18),,N(IF(1,{1,2,3}))))","v":"Colorado Booms-81231-A9634/2650"}]
["2017-01-12","TriBoom",99,{"$f":"_xlfn.TEXTJOIN(\"-\",,INDEX(($G$10:$G$18,$H$10:$H$18,$I$10:$I$18),MATCH(B132,$F$10:$F$18),,N(IF(1,{1,2,3}))))","v":"Colorado Booms-90009-T9634/2372"}]
["2017-02-19","Yanaki",92,{"$f":"_xlfn.TEXTJOIN(\"-\",,INDEX(($G$10:$G$18,$H$10:$H$18,$I$10:$I$18),MATCH(B133,$F$10:$F$18),,N(IF(1,{1,2,3}))))","v":"Colorado Booms-81231-Y9634/2072"}]
["2017-02-02","TriBoom",81,{"$f":"_xlfn.TEXTJOIN(\"-\",,INDEX(($G$10:$G$18,$H$10:$H$18,$I$10:$I$18),MATCH(B134,$F$10:$F$18),,N(IF(1,{1,2,3}))))","v":"Colorado Booms-90009-T9634/2372"}]
["2017-03-10","Carlota",101,{"$f":"_xlfn.TEXTJOIN(\"-\",,INDEX(($G$10:$G$18,$H$10:$H$18,$I$10:$I$18),MATCH(B135,$F$10:$F$18),,N(IF(1,{1,2,3}))))","v":"Gel Booms-94608-C4369/2213"}]
["2017-02-23","TriBoom",70,{"$f":"_xlfn.TEXTJOIN(\"-\",,INDEX(($G$10:$G$18,$H$10:$H$18,$I$10:$I$18),MATCH(B136,$F$10:$F$18),,N(IF(1,{1,2,3}))))","v":"Colorado Booms-90009-T9634/2372"}]
["2017-02-07","Yanaki",76,{"$f":"_xlfn.TEXTJOIN(\"-\",,INDEX(($G$10:$G$18,$H$10:$H$18,$I$10:$I$18),MATCH(B137,$F$10:$F$18),,N(IF(1,{1,2,3}))))","v":"Colorado Booms-81231-Y9634/2072"}]
["2017-02-20","Carlota",103,{"$f":"_xlfn.TEXTJOIN(\"-\",,INDEX(($G$10:$G$18,$H$10:$H$18,$I$10:$I$18),MATCH(B138,$F$10:$F$18),,N(IF(1,{1,2,3}))))","v":"Gel Booms-94608-C4369/2213"}]
["2017-02-03","Bellen",110,{"$f":"_xlfn.TEXTJOIN(\"-\",,INDEX(($G$10:$G$18,$H$10:$H$18,$I$10:$I$18),MATCH(B139,$F$10:$F$18),,N(IF(1,{1,2,3}))))","v":"Gel Booms-94618-B4369/2593"}]
["2017-03-30","Carlota",103,{"$f":"_xlfn.TEXTJOIN(\"-\",,INDEX(($G$10:$G$18,$H$10:$H$18,$I$10:$I$18),MATCH(B140,$F$10:$F$18),,N(IF(1,{1,2,3}))))","v":"Gel Booms-94608-C4369/2213"}]
["2017-03-03","Eagle",48,{"$f":"_xlfn.TEXTJOIN(\"-\",,INDEX(($G$10:$G$18,$H$10:$H$18,$I$10:$I$18),MATCH(B141,$F$10:$F$18),,N(IF(1,{1,2,3}))))","v":"Colorado Booms-81231-E9634/2386"}]
["2017-03-30","Eagle",96,{"$f":"_xlfn.TEXTJOIN(\"-\",,INDEX(($G$10:$G$18,$H$10:$H$18,$I$10:$I$18),MATCH(B142,$F$10:$F$18),,N(IF(1,{1,2,3}))))","v":"Colorado Booms-81231-E9634/2386"}]
["2017-01-19","Bellen",102,{"$f":"_xlfn.TEXTJOIN(\"-\",,INDEX(($G$10:$G$18,$H$10:$H$18,$I$10:$I$18),MATCH(B143,$F$10:$F$18),,N(IF(1,{1,2,3}))))","v":"Gel Booms-94618-B4369/2593"}]
["2017-01-29","Sunshine",81,{"$f":"_xlfn.TEXTJOIN(\"-\",,INDEX(($G$10:$G$18,$H$10:$H$18,$I$10:$I$18),MATCH(B144,$F$10:$F$18),,N(IF(1,{1,2,3}))))","v":"Gel Booms-94618-S4369/2297"}]
["2017-02-08","Yanaki",90,{"$f":"_xlfn.TEXTJOIN(\"-\",,INDEX(($G$10:$G$18,$H$10:$H$18,$I$10:$I$18),MATCH(B145,$F$10:$F$18),,N(IF(1,{1,2,3}))))","v":"Colorado Booms-81231-Y9634/2072"}]
["2017-01-15","Bellen",45,{"$f":"_xlfn.TEXTJOIN(\"-\",,INDEX(($G$10:$G$18,$H$10:$H$18,$I$10:$I$18),MATCH(B146,$F$10:$F$18),,N(IF(1,{1,2,3}))))","v":"Gel Booms-94618-B4369/2593"}]
["2017-02-09","Eagle",54,{"$f":"_xlfn.TEXTJOIN(\"-\",,INDEX(($G$10:$G$18,$H$10:$H$18,$I$10:$I$18),MATCH(B147,$F$10:$F$18),,N(IF(1,{1,2,3}))))","v":"Colorado Booms-81231-E9634/2386"}]
["2017-02-20","Bellen",52,{"$f":"_xlfn.TEXTJOIN(\"-\",,INDEX(($G$10:$G$18,$H$10:$H$18,$I$10:$I$18),MATCH(B148,$F$10:$F$18),,N(IF(1,{1,2,3}))))","v":"Gel Booms-94618-B4369/2593"}]
["2017-03-18","Quad",95,{"$f":"_xlfn.TEXTJOIN(\"-\",,INDEX(($G$10:$G$18,$H$10:$H$18,$I$10:$I$18),MATCH(B149,$F$10:$F$18),,N(IF(1,{1,2,3}))))","v":"Gel Booms-94608-Q4369/2290"}]
["2017-03-15","Carlota",62,{"$f":"_xlfn.TEXTJOIN(\"-\",,INDEX(($G$10:$G$18,$H$10:$H$18,$I$10:$I$18),MATCH(B150,$F$10:$F$18),,N(IF(1,{1,2,3}))))","v":"Gel Booms-94608-C4369/2213"}]
["2017-03-09","Yanaki",43,{"$f":"_xlfn.TEXTJOIN(\"-\",,INDEX(($G$10:$G$18,$H$10:$H$18,$I$10:$I$18),MATCH(B151,$F$10:$F$18),,N(IF(1,{1,2,3}))))","v":"Colorado Booms-81231-Y9634/2072"}]
["2017-03-30","TriBoom",46,{"$f":"_xlfn.TEXTJOIN(\"-\",,INDEX(($G$10:$G$18,$H$10:$H$18,$I$10:$I$18),MATCH(B152,$F$10:$F$18),,N(IF(1,{1,2,3}))))","v":"Colorado Booms-90009-T9634/2372"}]
["2017-01-28","Eagle",44,{"$f":"_xlfn.TEXTJOIN(\"-\",,INDEX(($G$10:$G$18,$H$10:$H$18,$I$10:$I$18),MATCH(B153,$F$10:$F$18),,N(IF(1,{1,2,3}))))","v":"Colorado Booms-81231-E9634/2386"}]
["2017-01-20","Eagle",84,{"$f":"_xlfn.TEXTJOIN(\"-\",,INDEX(($G$10:$G$18,$H$10:$H$18,$I$10:$I$18),MATCH(B154,$F$10:$F$18),,N(IF(1,{1,2,3}))))","v":"Colorado Booms-81231-E9634/2386"}]
["2017-02-25","Sunshine",57,{"$f":"_xlfn.TEXTJOIN(\"-\",,INDEX(($G$10:$G$18,$H$10:$H$18,$I$10:$I$18),MATCH(B155,$F$10:$F$18),,N(IF(1,{1,2,3}))))","v":"Gel Booms-94618-S4369/2297"}]
["2017-01-18","Carlota",82,{"$f":"_xlfn.TEXTJOIN(\"-\",,INDEX(($G$10:$G$18,$H$10:$H$18,$I$10:$I$18),MATCH(B156,$F$10:$F$18),,N(IF(1,{1,2,3}))))","v":"Gel Booms-94608-C4369/2213"}]
["2017-02-22","Sunbell",74,{"$f":"_xlfn.TEXTJOIN(\"-\",,INDEX(($G$10:$G$18,$H$10:$H$18,$I$10:$I$18),MATCH(B157,$F$10:$F$18),,N(IF(1,{1,2,3}))))","v":"Gel Booms-94618-S4369/2241"}]
["2017-02-15","Carlota",49,{"$f":"_xlfn.TEXTJOIN(\"-\",,INDEX(($G$10:$G$18,$H$10:$H$18,$I$10:$I$18),MATCH(B158,$F$10:$F$18),,N(IF(1,{1,2,3}))))","v":"Gel Booms-94608-C4369/2213"}]
["2017-01-01","Bellen",48,{"$f":"_xlfn.TEXTJOIN(\"-\",,INDEX(($G$10:$G$18,$H$10:$H$18,$I$10:$I$18),MATCH(B159,$F$10:$F$18),,N(IF(1,{1,2,3}))))","v":"Gel Booms-94618-B4369/2593"}]
["2017-02-11","Eagle",105,{"$f":"_xlfn.TEXTJOIN(\"-\",,INDEX(($G$10:$G$18,$H$10:$H$18,$I$10:$I$18),MATCH(B160,$F$10:$F$18),,N(IF(1,{1,2,3}))))","v":"Colorado Booms-81231-E9634/2386"}]
["2017-03-28","Carlota",43,{"$f":"_xlfn.TEXTJOIN(\"-\",,INDEX(($G$10:$G$18,$H$10:$H$18,$I$10:$I$18),MATCH(B161,$F$10:$F$18),,N(IF(1,{1,2,3}))))","v":"Gel Booms-94608-C4369/2213"}]
["2017-02-07","Yanaki",60,{"$f":"_xlfn.TEXTJOIN(\"-\",,INDEX(($G$10:$G$18,$H$10:$H$18,$I$10:$I$18),MATCH(B162,$F$10:$F$18),,N(IF(1,{1,2,3}))))","v":"Colorado Booms-81231-Y9634/2072"}]
["2017-03-13","Yanaki",53,{"$f":"_xlfn.TEXTJOIN(\"-\",,INDEX(($G$10:$G$18,$H$10:$H$18,$I$10:$I$18),MATCH(B163,$F$10:$F$18),,N(IF(1,{1,2,3}))))","v":"Colorado Booms-81231-Y9634/2072"}]
["2017-02-28","Bellen",103,{"$f":"_xlfn.TEXTJOIN(\"-\",,INDEX(($G$10:$G$18,$H$10:$H$18,$I$10:$I$18),MATCH(B164,$F$10:$F$18),,N(IF(1,{1,2,3}))))","v":"Gel Booms-94618-B4369/2593"}]
["2017-03-08","Sunbell",29,{"$f":"_xlfn.TEXTJOIN(\"-\",,INDEX(($G$10:$G$18,$H$10:$H$18,$I$10:$I$18),MATCH(B165,$F$10:$F$18),,N(IF(1,{1,2,3}))))","v":"Gel Booms-94618-S4369/2241"}]
["2017-01-12","Sunshine",60,{"$f":"_xlfn.TEXTJOIN(\"-\",,INDEX(($G$10:$G$18,$H$10:$H$18,$I$10:$I$18),MATCH(B166,$F$10:$F$18),,N(IF(1,{1,2,3}))))","v":"Gel Booms-94618-S4369/2297"}]
["2017-03-05","TriBoom",91,{"$f":"_xlfn.TEXTJOIN(\"-\",,INDEX(($G$10:$G$18,$H$10:$H$18,$I$10:$I$18),MATCH(B167,$F$10:$F$18),,N(IF(1,{1,2,3}))))","v":"Colorado Booms-90009-T9634/2372"}]
["2017-02-18","Carlota",61,{"$f":"_xlfn.TEXTJOIN(\"-\",,INDEX(($G$10:$G$18,$H$10:$H$18,$I$10:$I$18),MATCH(B168,$F$10:$F$18),,N(IF(1,{1,2,3}))))","v":"Gel Booms-94608-C4369/2213"}]
["2017-02-23","Quad",144,{"$f":"_xlfn.TEXTJOIN(\"-\",,INDEX(($G$10:$G$18,$H$10:$H$18,$I$10:$I$18),MATCH(B169,$F$10:$F$18),,N(IF(1,{1,2,3}))))","v":"Gel Booms-94608-Q4369/2290"}]
["2017-01-28","Eagle",68,{"$f":"_xlfn.TEXTJOIN(\"-\",,INDEX(($G$10:$G$18,$H$10:$H$18,$I$10:$I$18),MATCH(B170,$F$10:$F$18),,N(IF(1,{1,2,3}))))","v":"Colorado Booms-81231-E9634/2386"}]
["2017-01-15","Carlota",105,{"$f":"_xlfn.TEXTJOIN(\"-\",,INDEX(($G$10:$G$18,$H$10:$H$18,$I$10:$I$18),MATCH(B171,$F$10:$F$18),,N(IF(1,{1,2,3}))))","v":"Gel Booms-94608-C4369/2213"}]
["2017-01-01","Aspen",71,{"$f":"_xlfn.TEXTJOIN(\"-\",,INDEX(($G$10:$G$18,$H$10:$H$18,$I$10:$I$18),MATCH(B172,$F$10:$F$18),,N(IF(1,{1,2,3}))))","v":"Colorado Booms-81231-A9634/2650"}]
["2017-03-18","Carlota",44,{"$f":"_xlfn.TEXTJOIN(\"-\",,INDEX(($G$10:$G$18,$H$10:$H$18,$I$10:$I$18),MATCH(B173,$F$10:$F$18),,N(IF(1,{1,2,3}))))","v":"Gel Booms-94608-C4369/2213"}]
["2017-03-06","Quad",79,{"$f":"_xlfn.TEXTJOIN(\"-\",,INDEX(($G$10:$G$18,$H$10:$H$18,$I$10:$I$18),MATCH(B174,$F$10:$F$18),,N(IF(1,{1,2,3}))))","v":"Gel Booms-94608-Q4369/2290"}]
["2017-02-28","TriBoom",73,{"$f":"_xlfn.TEXTJOIN(\"-\",,INDEX(($G$10:$G$18,$H$10:$H$18,$I$10:$I$18),MATCH(B175,$F$10:$F$18),,N(IF(1,{1,2,3}))))","v":"Colorado Booms-90009-T9634/2372"}]
["2017-01-25","Aspen",62,{"$f":"_xlfn.TEXTJOIN(\"-\",,INDEX(($G$10:$G$18,$H$10:$H$18,$I$10:$I$18),MATCH(B176,$F$10:$F$18),,N(IF(1,{1,2,3}))))","v":"Colorado Booms-81231-A9634/2650"}]
["2017-02-19","Quad",89,{"$f":"_xlfn.TEXTJOIN(\"-\",,INDEX(($G$10:$G$18,$H$10:$H$18,$I$10:$I$18),MATCH(B177,$F$10:$F$18),,N(IF(1,{1,2,3}))))","v":"Gel Booms-94608-Q4369/2290"}]
["2017-02-28","Yanaki",86,{"$f":"_xlfn.TEXTJOIN(\"-\",,INDEX(($G$10:$G$18,$H$10:$H$18,$I$10:$I$18),MATCH(B178,$F$10:$F$18),,N(IF(1,{1,2,3}))))","v":"Colorado Booms-81231-Y9634/2072"}]
["2017-03-19","Eagle",65,{"$f":"_xlfn.TEXTJOIN(\"-\",,INDEX(($G$10:$G$18,$H$10:$H$18,$I$10:$I$18),MATCH(B179,$F$10:$F$18),,N(IF(1,{1,2,3}))))","v":"Colorado Booms-81231-E9634/2386"}]
["2017-01-23","Eagle",68,{"$f":"_xlfn.TEXTJOIN(\"-\",,INDEX(($G$10:$G$18,$H$10:$H$18,$I$10:$I$18),MATCH(B180,$F$10:$F$18),,N(IF(1,{1,2,3}))))","v":"Colorado Booms-81231-E9634/2386"}]
["2017-01-11","Quad",71,{"$f":"_xlfn.TEXTJOIN(\"-\",,INDEX(($G$10:$G$18,$H$10:$H$18,$I$10:$I$18),MATCH(B181,$F$10:$F$18),,N(IF(1,{1,2,3}))))","v":"Gel Booms-94608-Q4369/2290"}]
["2017-01-01","Aspen",99,{"$f":"_xlfn.TEXTJOIN(\"-\",,INDEX(($G$10:$G$18,$H$10:$H$18,$I$10:$I$18),MATCH(B182,$F$10:$F$18),,N(IF(1,{1,2,3}))))","v":"Colorado Booms-81231-A9634/2650"}]
["2017-01-23","Bellen",100,{"$f":"_xlfn.TEXTJOIN(\"-\",,INDEX(($G$10:$G$18,$H$10:$H$18,$I$10:$I$18),MATCH(B183,$F$10:$F$18),,N(IF(1,{1,2,3}))))","v":"Gel Booms-94618-B4369/2593"}]
["2017-03-05","Sunshine",95,{"$f":"_xlfn.TEXTJOIN(\"-\",,INDEX(($G$10:$G$18,$H$10:$H$18,$I$10:$I$18),MATCH(B184,$F$10:$F$18),,N(IF(1,{1,2,3}))))","v":"Gel Booms-94618-S4369/2297"}]
["2017-02-26","Sunshine",93,{"$f":"_xlfn.TEXTJOIN(\"-\",,INDEX(($G$10:$G$18,$H$10:$H$18,$I$10:$I$18),MATCH(B185,$F$10:$F$18),,N(IF(1,{1,2,3}))))","v":"Gel Booms-94618-S4369/2297"}]
["2017-03-28","Quad",80,{"$f":"_xlfn.TEXTJOIN(\"-\",,INDEX(($G$10:$G$18,$H$10:$H$18,$I$10:$I$18),MATCH(B186,$F$10:$F$18),,N(IF(1,{1,2,3}))))","v":"Gel Booms-94608-Q4369/2290"}]
["2017-01-03","Aspen",51,{"$f":"_xlfn.TEXTJOIN(\"-\",,INDEX(($G$10:$G$18,$H$10:$H$18,$I$10:$I$18),MATCH(B187,$F$10:$F$18),,N(IF(1,{1,2,3}))))","v":"Colorado Booms-81231-A9634/2650"}]
["2017-03-30","TriBoom",64,{"$f":"_xlfn.TEXTJOIN(\"-\",,INDEX(($G$10:$G$18,$H$10:$H$18,$I$10:$I$18),MATCH(B188,$F$10:$F$18),,N(IF(1,{1,2,3}))))","v":"Colorado Booms-90009-T9634/2372"}]
["2017-01-25","Bellen",78,{"$f":"_xlfn.TEXTJOIN(\"-\",,INDEX(($G$10:$G$18,$H$10:$H$18,$I$10:$I$18),MATCH(B189,$F$10:$F$18),,N(IF(1,{1,2,3}))))","v":"Gel Booms-94618-B4369/2593"}]
["2017-03-14","Eagle",67,{"$f":"_xlfn.TEXTJOIN(\"-\",,INDEX(($G$10:$G$18,$H$10:$H$18,$I$10:$I$18),MATCH(B190,$F$10:$F$18),,N(IF(1,{1,2,3}))))","v":"Colorado Booms-81231-E9634/2386"}]
["2017-03-01","Bellen",58,{"$f":"_xlfn.TEXTJOIN(\"-\",,INDEX(($G$10:$G$18,$H$10:$H$18,$I$10:$I$18),MATCH(B191,$F$10:$F$18),,N(IF(1,{1,2,3}))))","v":"Gel Booms-94618-B4369/2593"}]
["2017-01-12","Bellen",43,{"$f":"_xlfn.TEXTJOIN(\"-\",,INDEX(($G$10:$G$18,$H$10:$H$18,$I$10:$I$18),MATCH(B192,$F$10:$F$18),,N(IF(1,{1,2,3}))))","v":"Gel Booms-94618-B4369/2593"}]
["2017-01-03","Yanaki",98,{"$f":"_xlfn.TEXTJOIN(\"-\",,INDEX(($G$10:$G$18,$H$10:$H$18,$I$10:$I$18),MATCH(B193,$F$10:$F$18),,N(IF(1,{1,2,3}))))","v":"Colorado Booms-81231-Y9634/2072"}]
["2017-01-03","Aspen",57,{"$f":"_xlfn.TEXTJOIN(\"-\",,INDEX(($G$10:$G$18,$H$10:$H$18,$I$10:$I$18),MATCH(B194,$F$10:$F$18),,N(IF(1,{1,2,3}))))","v":"Colorado Booms-81231-A9634/2650"}]
["2017-02-17","Quad",23,{"$f":"_xlfn.TEXTJOIN(\"-\",,INDEX(($G$10:$G$18,$H$10:$H$18,$I$10:$I$18),MATCH(B195,$F$10:$F$18),,N(IF(1,{1,2,3}))))","v":"Gel Booms-94608-Q4369/2290"}]
["2017-02-28","Carlota",59,{"$f":"_xlfn.TEXTJOIN(\"-\",,INDEX(($G$10:$G$18,$H$10:$H$18,$I$10:$I$18),MATCH(B196,$F$10:$F$18),,N(IF(1,{1,2,3}))))","v":"Gel Booms-94608-C4369/2213"}]
["2017-02-07","Sunbell",45,{"$f":"_xlfn.TEXTJOIN(\"-\",,INDEX(($G$10:$G$18,$H$10:$H$18,$I$10:$I$18),MATCH(B197,$F$10:$F$18),,N(IF(1,{1,2,3}))))","v":"Gel Booms-94618-S4369/2241"}]
["2017-02-06","Aspen",77,{"$f":"_xlfn.TEXTJOIN(\"-\",,INDEX(($G$10:$G$18,$H$10:$H$18,$I$10:$I$18),MATCH(B198,$F$10:$F$18),,N(IF(1,{1,2,3}))))","v":"Colorado Booms-81231-A9634/2650"}]
["2017-01-25","Aspen",18,{"$f":"_xlfn.TEXTJOIN(\"-\",,INDEX(($G$10:$G$18,$H$10:$H$18,$I$10:$I$18),MATCH(B199,$F$10:$F$18),,N(IF(1,{1,2,3}))))","v":"Colorado Booms-81231-A9634/2650"}]
["2017-02-01","Yanaki",69,{"$f":"_xlfn.TEXTJOIN(\"-\",,INDEX(($G$10:$G$18,$H$10:$H$18,$I$10:$I$18),MATCH(B200,$F$10:$F$18),,N(IF(1,{1,2,3}))))","v":"Colorado Booms-81231-Y9634/2072"}]
["2017-01-22","Quad",88,{"$f":"_xlfn.TEXTJOIN(\"-\",,INDEX(($G$10:$G$18,$H$10:$H$18,$I$10:$I$18),MATCH(B201,$F$10:$F$18),,N(IF(1,{1,2,3}))))","v":"Gel Booms-94608-Q4369/2290"}]
["2017-03-23","Yanaki",130,{"$f":"_xlfn.TEXTJOIN(\"-\",,INDEX(($G$10:$G$18,$H$10:$H$18,$I$10:$I$18),MATCH(B202,$F$10:$F$18),,N(IF(1,{1,2,3}))))","v":"Colorado Booms-81231-Y9634/2072"}]
["2017-03-07","Sunshine",84,{"$f":"_xlfn.TEXTJOIN(\"-\",,INDEX(($G$10:$G$18,$H$10:$H$18,$I$10:$I$18),MATCH(B203,$F$10:$F$18),,N(IF(1,{1,2,3}))))","v":"Gel Booms-94618-S4369/2297"}]
["2017-03-04","Carlota",77,{"$f":"_xlfn.TEXTJOIN(\"-\",,INDEX(($G$10:$G$18,$H$10:$H$18,$I$10:$I$18),MATCH(B204,$F$10:$F$18),,N(IF(1,{1,2,3}))))","v":"Gel Booms-94608-C4369/2213"}]
["2017-01-29","Sunshine",54,{"$f":"_xlfn.TEXTJOIN(\"-\",,INDEX(($G$10:$G$18,$H$10:$H$18,$I$10:$I$18),MATCH(B205,$F$10:$F$18),,N(IF(1,{1,2,3}))))","v":"Gel Booms-94618-S4369/2297"}]
["2017-01-25","Carlota",69,{"$f":"_xlfn.TEXTJOIN(\"-\",,INDEX(($G$10:$G$18,$H$10:$H$18,$I$10:$I$18),MATCH(B206,$F$10:$F$18),,N(IF(1,{1,2,3}))))","v":"Gel Booms-94608-C4369/2213"}]
["2017-03-03","Sunshine",65,{"$f":"_xlfn.TEXTJOIN(\"-\",,INDEX(($G$10:$G$18,$H$10:$H$18,$I$10:$I$18),MATCH(B207,$F$10:$F$18),,N(IF(1,{1,2,3}))))","v":"Gel Booms-94618-S4369/2297"}]
["2017-01-30","Quad",81,{"$f":"_xlfn.TEXTJOIN(\"-\",,INDEX(($G$10:$G$18,$H$10:$H$18,$I$10:$I$18),MATCH(B208,$F$10:$F$18),,N(IF(1,{1,2,3}))))","v":"Gel Booms-94608-Q4369/2290"}]
["2017-03-01","Sunshine",57,{"$f":"_xlfn.TEXTJOIN(\"-\",,INDEX(($G$10:$G$18,$H$10:$H$18,$I$10:$I$18),MATCH(B209,$F$10:$F$18),,N(IF(1,{1,2,3}))))","v":"Gel Booms-94618-S4369/2297"}]
["2017-03-05","Yanaki",37,{"$f":"_xlfn.TEXTJOIN(\"-\",,INDEX(($G$10:$G$18,$H$10:$H$18,$I$10:$I$18),MATCH(B210,$F$10:$F$18),,N(IF(1,{1,2,3}))))","v":"Colorado Booms-81231-Y9634/2072"}]
["2017-03-18","Quad",24,{"$f":"_xlfn.TEXTJOIN(\"-\",,INDEX(($G$10:$G$18,$H$10:$H$18,$I$10:$I$18),MATCH(B211,$F$10:$F$18),,N(IF(1,{1,2,3}))))","v":"Gel Booms-94608-Q4369/2290"}]
["2017-02-25","Bellen",63,{"$f":"_xlfn.TEXTJOIN(\"-\",,INDEX(($G$10:$G$18,$H$10:$H$18,$I$10:$I$18),MATCH(B212,$F$10:$F$18),,N(IF(1,{1,2,3}))))","v":"Gel Booms-94618-B4369/2593"}]
["2017-03-03","Aspen",58,{"$f":"_xlfn.TEXTJOIN(\"-\",,INDEX(($G$10:$G$18,$H$10:$H$18,$I$10:$I$18),MATCH(B213,$F$10:$F$18),,N(IF(1,{1,2,3}))))","v":"Colorado Booms-81231-A9634/2650"}]
["2017-01-08","Quad",72,{"$f":"_xlfn.TEXTJOIN(\"-\",,INDEX(($G$10:$G$18,$H$10:$H$18,$I$10:$I$18),MATCH(B214,$F$10:$F$18),,N(IF(1,{1,2,3}))))","v":"Gel Booms-94608-Q4369/2290"}]
["2017-02-17","Yanaki",66,{"$f":"_xlfn.TEXTJOIN(\"-\",,INDEX(($G$10:$G$18,$H$10:$H$18,$I$10:$I$18),MATCH(B215,$F$10:$F$18),,N(IF(1,{1,2,3}))))","v":"Colorado Booms-81231-Y9634/2072"}]
["2017-03-23","Eagle",46,{"$f":"_xlfn.TEXTJOIN(\"-\",,INDEX(($G$10:$G$18,$H$10:$H$18,$I$10:$I$18),MATCH(B216,$F$10:$F$18),,N(IF(1,{1,2,3}))))","v":"Colorado Booms-81231-E9634/2386"}]
["2017-02-12","Eagle",64,{"$f":"_xlfn.TEXTJOIN(\"-\",,INDEX(($G$10:$G$18,$H$10:$H$18,$I$10:$I$18),MATCH(B217,$F$10:$F$18),,N(IF(1,{1,2,3}))))","v":"Colorado Booms-81231-E9634/2386"}]
["2017-01-28","Aspen",36,{"$f":"_xlfn.TEXTJOIN(\"-\",,INDEX(($G$10:$G$18,$H$10:$H$18,$I$10:$I$18),MATCH(B218,$F$10:$F$18),,N(IF(1,{1,2,3}))))","v":"Colorado Booms-81231-A9634/2650"}]
["2017-02-10","Aspen",124,{"$f":"_xlfn.TEXTJOIN(\"-\",,INDEX(($G$10:$G$18,$H$10:$H$18,$I$10:$I$18),MATCH(B219,$F$10:$F$18),,N(IF(1,{1,2,3}))))","v":"Colorado Booms-81231-A9634/2650"}]
["2017-01-01","Aspen",81,{"$f":"_xlfn.TEXTJOIN(\"-\",,INDEX(($G$10:$G$18,$H$10:$H$18,$I$10:$I$18),MATCH(B220,$F$10:$F$18),,N(IF(1,{1,2,3}))))","v":"Colorado Booms-81231-A9634/2650"}]
["2017-01-02","Carlota",47,{"$f":"_xlfn.TEXTJOIN(\"-\",,INDEX(($G$10:$G$18,$H$10:$H$18,$I$10:$I$18),MATCH(B221,$F$10:$F$18),,N(IF(1,{1,2,3}))))","v":"Gel Booms-94608-C4369/2213"}]
["2017-02-17","Quad",94,{"$f":"_xlfn.TEXTJOIN(\"-\",,INDEX(($G$10:$G$18,$H$10:$H$18,$I$10:$I$18),MATCH(B222,$F$10:$F$18),,N(IF(1,{1,2,3}))))","v":"Gel Booms-94608-Q4369/2290"}]
["2017-01-07","Bellen",69,{"$f":"_xlfn.TEXTJOIN(\"-\",,INDEX(($G$10:$G$18,$H$10:$H$18,$I$10:$I$18),MATCH(B223,$F$10:$F$18),,N(IF(1,{1,2,3}))))","v":"Gel Booms-94618-B4369/2593"}]
["2017-03-10","TriBoom",48,{"$f":"_xlfn.TEXTJOIN(\"-\",,INDEX(($G$10:$G$18,$H$10:$H$18,$I$10:$I$18),MATCH(B224,$F$10:$F$18),,N(IF(1,{1,2,3}))))","v":"Colorado Booms-90009-T9634/2372"}]
["2017-03-17","Quad",33,{"$f":"_xlfn.TEXTJOIN(\"-\",,INDEX(($G$10:$G$18,$H$10:$H$18,$I$10:$I$18),MATCH(B225,$F$10:$F$18),,N(IF(1,{1,2,3}))))","v":"Gel Booms-94608-Q4369/2290"}]
["2017-01-25","Quad",89,{"$f":"_xlfn.TEXTJOIN(\"-\",,INDEX(($G$10:$G$18,$H$10:$H$18,$I$10:$I$18),MATCH(B226,$F$10:$F$18),,N(IF(1,{1,2,3}))))","v":"Gel Booms-94608-Q4369/2290"}]
["2017-03-25","Sunbell",87,{"$f":"_xlfn.TEXTJOIN(\"-\",,INDEX(($G$10:$G$18,$H$10:$H$18,$I$10:$I$18),MATCH(B227,$F$10:$F$18),,N(IF(1,{1,2,3}))))","v":"Gel Booms-94618-S4369/2241"}]
["2017-02-04","TriBoom",50,{"$f":"_xlfn.TEXTJOIN(\"-\",,INDEX(($G$10:$G$18,$H$10:$H$18,$I$10:$I$18),MATCH(B228,$F$10:$F$18),,N(IF(1,{1,2,3}))))","v":"Colorado Booms-90009-T9634/2372"}]
["2017-01-10","Aspen",45,{"$f":"_xlfn.TEXTJOIN(\"-\",,INDEX(($G$10:$G$18,$H$10:$H$18,$I$10:$I$18),MATCH(B229,$F$10:$F$18),,N(IF(1,{1,2,3}))))","v":"Colorado Booms-81231-A9634/2650"}]
["2017-03-20","Bellen",56,{"$f":"_xlfn.TEXTJOIN(\"-\",,INDEX(($G$10:$G$18,$H$10:$H$18,$I$10:$I$18),MATCH(B230,$F$10:$F$18),,N(IF(1,{1,2,3}))))","v":"Gel Booms-94618-B4369/2593"}]
["2017-01-10","Bellen",20,{"$f":"_xlfn.TEXTJOIN(\"-\",,INDEX(($G$10:$G$18,$H$10:$H$18,$I$10:$I$18),MATCH(B231,$F$10:$F$18),,N(IF(1,{1,2,3}))))","v":"Gel Booms-94618-B4369/2593"}]
["2017-02-07","Yanaki",77,{"$f":"_xlfn.TEXTJOIN(\"-\",,INDEX(($G$10:$G$18,$H$10:$H$18,$I$10:$I$18),MATCH(B232,$F$10:$F$18),,N(IF(1,{1,2,3}))))","v":"Colorado Booms-81231-Y9634/2072"}]
["2017-02-20","Bellen",65,{"$f":"_xlfn.TEXTJOIN(\"-\",,INDEX(($G$10:$G$18,$H$10:$H$18,$I$10:$I$18),MATCH(B233,$F$10:$F$18),,N(IF(1,{1,2,3}))))","v":"Gel Booms-94618-B4369/2593"}]
["2017-02-11","Carlota",61,{"$f":"_xlfn.TEXTJOIN(\"-\",,INDEX(($G$10:$G$18,$H$10:$H$18,$I$10:$I$18),MATCH(B234,$F$10:$F$18),,N(IF(1,{1,2,3}))))","v":"Gel Booms-94608-C4369/2213"}]
["2017-03-21","Eagle",49,{"$f":"_xlfn.TEXTJOIN(\"-\",,INDEX(($G$10:$G$18,$H$10:$H$18,$I$10:$I$18),MATCH(B235,$F$10:$F$18),,N(IF(1,{1,2,3}))))","v":"Colorado Booms-81231-E9634/2386"}]
["2017-02-07","Sunbell",77,{"$f":"_xlfn.TEXTJOIN(\"-\",,INDEX(($G$10:$G$18,$H$10:$H$18,$I$10:$I$18),MATCH(B236,$F$10:$F$18),,N(IF(1,{1,2,3}))))","v":"Gel Booms-94618-S4369/2241"}]
["2017-01-25","Quad",34,{"$f":"_xlfn.TEXTJOIN(\"-\",,INDEX(($G$10:$G$18,$H$10:$H$18,$I$10:$I$18),MATCH(B237,$F$10:$F$18),,N(IF(1,{1,2,3}))))","v":"Gel Booms-94608-Q4369/2290"}]
["2017-02-17","Carlota",64,{"$f":"_xlfn.TEXTJOIN(\"-\",,INDEX(($G$10:$G$18,$H$10:$H$18,$I$10:$I$18),MATCH(B238,$F$10:$F$18),,N(IF(1,{1,2,3}))))","v":"Gel Booms-94608-C4369/2213"}]
["2017-03-29","Bellen",64,{"$f":"_xlfn.TEXTJOIN(\"-\",,INDEX(($G$10:$G$18,$H$10:$H$18,$I$10:$I$18),MATCH(B239,$F$10:$F$18),,N(IF(1,{1,2,3}))))","v":"Gel Booms-94618-B4369/2593"}]
["2017-02-15","TriBoom",53,{"$f":"_xlfn.TEXTJOIN(\"-\",,INDEX(($G$10:$G$18,$H$10:$H$18,$I$10:$I$18),MATCH(B240,$F$10:$F$18),,N(IF(1,{1,2,3}))))","v":"Colorado Booms-90009-T9634/2372"}]
["2017-01-10","Bellen",78,{"$f":"_xlfn.TEXTJOIN(\"-\",,INDEX(($G$10:$G$18,$H$10:$H$18,$I$10:$I$18),MATCH(B241,$F$10:$F$18),,N(IF(1,{1,2,3}))))","v":"Gel Booms-94618-B4369/2593"}]
["2017-02-18","Aspen",131,{"$f":"_xlfn.TEXTJOIN(\"-\",,INDEX(($G$10:$G$18,$H$10:$H$18,$I$10:$I$18),MATCH(B242,$F$10:$F$18),,N(IF(1,{1,2,3}))))","v":"Colorado Booms-81231-A9634/2650"}]
["2017-03-04","Sunbell",91,{"$f":"_xlfn.TEXTJOIN(\"-\",,INDEX(($G$10:$G$18,$H$10:$H$18,$I$10:$I$18),MATCH(B243,$F$10:$F$18),,N(IF(1,{1,2,3}))))","v":"Gel Booms-94618-S4369/2241"}]
["2017-01-16","Carlota",105,{"$f":"_xlfn.TEXTJOIN(\"-\",,INDEX(($G$10:$G$18,$H$10:$H$18,$I$10:$I$18),MATCH(B244,$F$10:$F$18),,N(IF(1,{1,2,3}))))","v":"Gel Booms-94608-C4369/2213"}]
["2017-03-24","Quad",113,{"$f":"_xlfn.TEXTJOIN(\"-\",,INDEX(($G$10:$G$18,$H$10:$H$18,$I$10:$I$18),MATCH(B245,$F$10:$F$18),,N(IF(1,{1,2,3}))))","v":"Gel Booms-94608-Q4369/2290"}]
["2017-02-27","Yanaki",148,{"$f":"_xlfn.TEXTJOIN(\"-\",,INDEX(($G$10:$G$18,$H$10:$H$18,$I$10:$I$18),MATCH(B246,$F$10:$F$18),,N(IF(1,{1,2,3}))))","v":"Colorado Booms-81231-Y9634/2072"}]
["2017-03-23","Sunshine",77,{"$f":"_xlfn.TEXTJOIN(\"-\",,INDEX(($G$10:$G$18,$H$10:$H$18,$I$10:$I$18),MATCH(B247,$F$10:$F$18),,N(IF(1,{1,2,3}))))","v":"Gel Booms-94618-S4369/2297"}]
["2017-01-07","Sunbell",65,{"$f":"_xlfn.TEXTJOIN(\"-\",,INDEX(($G$10:$G$18,$H$10:$H$18,$I$10:$I$18),MATCH(B248,$F$10:$F$18),,N(IF(1,{1,2,3}))))","v":"Gel Booms-94618-S4369/2241"}]
["2017-03-29","Bellen",92,{"$f":"_xlfn.TEXTJOIN(\"-\",,INDEX(($G$10:$G$18,$H$10:$H$18,$I$10:$I$18),MATCH(B249,$F$10:$F$18),,N(IF(1,{1,2,3}))))","v":"Gel Booms-94618-B4369/2593"}]
["2017-01-22","Aspen",80,{"$f":"_xlfn.TEXTJOIN(\"-\",,INDEX(($G$10:$G$18,$H$10:$H$18,$I$10:$I$18),MATCH(B250,$F$10:$F$18),,N(IF(1,{1,2,3}))))","v":"Colorado Booms-81231-A9634/2650"}]
["2017-03-19","Sunshine",90,{"$f":"_xlfn.TEXTJOIN(\"-\",,INDEX(($G$10:$G$18,$H$10:$H$18,$I$10:$I$18),MATCH(B251,$F$10:$F$18),,N(IF(1,{1,2,3}))))","v":"Gel Booms-94618-S4369/2297"}]
["2017-01-09","Sunshine",49,{"$f":"_xlfn.TEXTJOIN(\"-\",,INDEX(($G$10:$G$18,$H$10:$H$18,$I$10:$I$18),MATCH(B252,$F$10:$F$18),,N(IF(1,{1,2,3}))))","v":"Gel Booms-94618-S4369/2297"}]
["2017-03-10","Eagle",85,{"$f":"_xlfn.TEXTJOIN(\"-\",,INDEX(($G$10:$G$18,$H$10:$H$18,$I$10:$I$18),MATCH(B253,$F$10:$F$18),,N(IF(1,{1,2,3}))))","v":"Colorado Booms-81231-E9634/2386"}]
["2017-01-12","Sunshine",37,{"$f":"_xlfn.TEXTJOIN(\"-\",,INDEX(($G$10:$G$18,$H$10:$H$18,$I$10:$I$18),MATCH(B254,$F$10:$F$18),,N(IF(1,{1,2,3}))))","v":"Gel Booms-94618-S4369/2297"}]
["2017-03-12","Quad",112,{"$f":"_xlfn.TEXTJOIN(\"-\",,INDEX(($G$10:$G$18,$H$10:$H$18,$I$10:$I$18),MATCH(B255,$F$10:$F$18),,N(IF(1,{1,2,3}))))","v":"Gel Booms-94608-Q4369/2290"}]
["2017-02-18","Sunshine",65,{"$f":"_xlfn.TEXTJOIN(\"-\",,INDEX(($G$10:$G$18,$H$10:$H$18,$I$10:$I$18),MATCH(B256,$F$10:$F$18),,N(IF(1,{1,2,3}))))","v":"Gel Booms-94618-S4369/2297"}]
["2017-03-07","Carlota",106,{"$f":"_xlfn.TEXTJOIN(\"-\",,INDEX(($G$10:$G$18,$H$10:$H$18,$I$10:$I$18),MATCH(B257,$F$10:$F$18),,N(IF(1,{1,2,3}))))","v":"Gel Booms-94608-C4369/2213"}]
["2017-01-12","TriBoom",63,{"$f":"_xlfn.TEXTJOIN(\"-\",,INDEX(($G$10:$G$18,$H$10:$H$18,$I$10:$I$18),MATCH(B258,$F$10:$F$18),,N(IF(1,{1,2,3}))))","v":"Colorado Booms-90009-T9634/2372"}]
["2017-01-25","Quad",80,{"$f":"_xlfn.TEXTJOIN(\"-\",,INDEX(($G$10:$G$18,$H$10:$H$18,$I$10:$I$18),MATCH(B259,$F$10:$F$18),,N(IF(1,{1,2,3}))))","v":"Gel Booms-94608-Q4369/2290"}]
["2017-02-18","TriBoom",103,{"$f":"_xlfn.TEXTJOIN(\"-\",,INDEX(($G$10:$G$18,$H$10:$H$18,$I$10:$I$18),MATCH(B260,$F$10:$F$18),,N(IF(1,{1,2,3}))))","v":"Colorado Booms-90009-T9634/2372"}]
["2017-03-10","Bellen",92,{"$f":"_xlfn.TEXTJOIN(\"-\",,INDEX(($G$10:$G$18,$H$10:$H$18,$I$10:$I$18),MATCH(B261,$F$10:$F$18),,N(IF(1,{1,2,3}))))","v":"Gel Booms-94618-B4369/2593"}]
["2017-01-25","Carlota",35,{"$f":"_xlfn.TEXTJOIN(\"-\",,INDEX(($G$10:$G$18,$H$10:$H$18,$I$10:$I$18),MATCH(B262,$F$10:$F$18),,N(IF(1,{1,2,3}))))","v":"Gel Booms-94608-C4369/2213"}]
["2017-03-24","Yanaki",60,{"$f":"_xlfn.TEXTJOIN(\"-\",,INDEX(($G$10:$G$18,$H$10:$H$18,$I$10:$I$18),MATCH(B263,$F$10:$F$18),,N(IF(1,{1,2,3}))))","v":"Colorado Booms-81231-Y9634/2072"}]
["2017-01-02","Eagle",63,{"$f":"_xlfn.TEXTJOIN(\"-\",,INDEX(($G$10:$G$18,$H$10:$H$18,$I$10:$I$18),MATCH(B264,$F$10:$F$18),,N(IF(1,{1,2,3}))))","v":"Colorado Booms-81231-E9634/2386"}]
["2017-02-18","Yanaki",55,{"$f":"_xlfn.TEXTJOIN(\"-\",,INDEX(($G$10:$G$18,$H$10:$H$18,$I$10:$I$18),MATCH(B265,$F$10:$F$18),,N(IF(1,{1,2,3}))))","v":"Colorado Booms-81231-Y9634/2072"}]
["2017-02-20","Carlota",57,{"$f":"_xlfn.TEXTJOIN(\"-\",,INDEX(($G$10:$G$18,$H$10:$H$18,$I$10:$I$18),MATCH(B266,$F$10:$F$18),,N(IF(1,{1,2,3}))))","v":"Gel Booms-94608-C4369/2213"}]
["2017-01-20","Carlota",85,{"$f":"_xlfn.TEXTJOIN(\"-\",,INDEX(($G$10:$G$18,$H$10:$H$18,$I$10:$I$18),MATCH(B267,$F$10:$F$18),,N(IF(1,{1,2,3}))))","v":"Gel Booms-94608-C4369/2213"}]
["2017-02-03","Sunbell",58,{"$f":"_xlfn.TEXTJOIN(\"-\",,INDEX(($G$10:$G$18,$H$10:$H$18,$I$10:$I$18),MATCH(B268,$F$10:$F$18),,N(IF(1,{1,2,3}))))","v":"Gel Booms-94618-S4369/2241"}]
["2017-02-28","Aspen",125,{"$f":"_xlfn.TEXTJOIN(\"-\",,INDEX(($G$10:$G$18,$H$10:$H$18,$I$10:$I$18),MATCH(B269,$F$10:$F$18),,N(IF(1,{1,2,3}))))","v":"Colorado Booms-81231-A9634/2650"}]
["2017-02-14","Yanaki",60,{"$f":"_xlfn.TEXTJOIN(\"-\",,INDEX(($G$10:$G$18,$H$10:$H$18,$I$10:$I$18),MATCH(B270,$F$10:$F$18),,N(IF(1,{1,2,3}))))","v":"Colorado Booms-81231-Y9634/2072"}]
["2017-02-01","Sunshine",83,{"$f":"_xlfn.TEXTJOIN(\"-\",,INDEX(($G$10:$G$18,$H$10:$H$18,$I$10:$I$18),MATCH(B271,$F$10:$F$18),,N(IF(1,{1,2,3}))))","v":"Gel Booms-94618-S4369/2297"}]
["2017-03-13","Sunbell",94,{"$f":"_xlfn.TEXTJOIN(\"-\",,INDEX(($G$10:$G$18,$H$10:$H$18,$I$10:$I$18),MATCH(B272,$F$10:$F$18),,N(IF(1,{1,2,3}))))","v":"Gel Booms-94618-S4369/2241"}]
["2017-02-01","TriBoom",97,{"$f":"_xlfn.TEXTJOIN(\"-\",,INDEX(($G$10:$G$18,$H$10:$H$18,$I$10:$I$18),MATCH(B273,$F$10:$F$18),,N(IF(1,{1,2,3}))))","v":"Colorado Booms-90009-T9634/2372"}]
["2017-02-15","Bellen",65,{"$f":"_xlfn.TEXTJOIN(\"-\",,INDEX(($G$10:$G$18,$H$10:$H$18,$I$10:$I$18),MATCH(B274,$F$10:$F$18),,N(IF(1,{1,2,3}))))","v":"Gel Booms-94618-B4369/2593"}]
["2017-02-16","Carlota",55,{"$f":"_xlfn.TEXTJOIN(\"-\",,INDEX(($G$10:$G$18,$H$10:$H$18,$I$10:$I$18),MATCH(B275,$F$10:$F$18),,N(IF(1,{1,2,3}))))","v":"Gel Booms-94608-C4369/2213"}]
["2017-02-25","Quad",78,{"$f":"_xlfn.TEXTJOIN(\"-\",,INDEX(($G$10:$G$18,$H$10:$H$18,$I$10:$I$18),MATCH(B276,$F$10:$F$18),,N(IF(1,{1,2,3}))))","v":"Gel Booms-94608-Q4369/2290"}]
["2017-02-23","Quad",97,{"$f":"_xlfn.TEXTJOIN(\"-\",,INDEX(($G$10:$G$18,$H$10:$H$18,$I$10:$I$18),MATCH(B277,$F$10:$F$18),,N(IF(1,{1,2,3}))))","v":"Gel Booms-94608-Q4369/2290"}]
["2017-03-08","Quad",56,{"$f":"_xlfn.TEXTJOIN(\"-\",,INDEX(($G$10:$G$18,$H$10:$H$18,$I$10:$I$18),MATCH(B278,$F$10:$F$18),,N(IF(1,{1,2,3}))))","v":"Gel Booms-94608-Q4369/2290"}]
["2017-01-27","TriBoom",70,{"$f":"_xlfn.TEXTJOIN(\"-\",,INDEX(($G$10:$G$18,$H$10:$H$18,$I$10:$I$18),MATCH(B279,$F$10:$F$18),,N(IF(1,{1,2,3}))))","v":"Colorado Booms-90009-T9634/2372"}]
["2017-02-20","Quad",83,{"$f":"_xlfn.TEXTJOIN(\"-\",,INDEX(($G$10:$G$18,$H$10:$H$18,$I$10:$I$18),MATCH(B280,$F$10:$F$18),,N(IF(1,{1,2,3}))))","v":"Gel Booms-94608-Q4369/2290"}]
["2017-01-09","Carlota",85,{"$f":"_xlfn.TEXTJOIN(\"-\",,INDEX(($G$10:$G$18,$H$10:$H$18,$I$10:$I$18),MATCH(B281,$F$10:$F$18),,N(IF(1,{1,2,3}))))","v":"Gel Booms-94608-C4369/2213"}]
["2017-01-01","Eagle",86,{"$f":"_xlfn.TEXTJOIN(\"-\",,INDEX(($G$10:$G$18,$H$10:$H$18,$I$10:$I$18),MATCH(B282,$F$10:$F$18),,N(IF(1,{1,2,3}))))","v":"Colorado Booms-81231-E9634/2386"}]
["2017-01-31","Sunbell",64,{"$f":"_xlfn.TEXTJOIN(\"-\",,INDEX(($G$10:$G$18,$H$10:$H$18,$I$10:$I$18),MATCH(B283,$F$10:$F$18),,N(IF(1,{1,2,3}))))","v":"Gel Booms-94618-S4369/2241"}]
["2017-03-24","Yanaki",88,{"$f":"_xlfn.TEXTJOIN(\"-\",,INDEX(($G$10:$G$18,$H$10:$H$18,$I$10:$I$18),MATCH(B284,$F$10:$F$18),,N(IF(1,{1,2,3}))))","v":"Colorado Booms-81231-Y9634/2072"}]
["2017-02-15","Aspen",62,{"$f":"_xlfn.TEXTJOIN(\"-\",,INDEX(($G$10:$G$18,$H$10:$H$18,$I$10:$I$18),MATCH(B285,$F$10:$F$18),,N(IF(1,{1,2,3}))))","v":"Colorado Booms-81231-A9634/2650"}]
["2017-02-03","Sunshine",79,{"$f":"_xlfn.TEXTJOIN(\"-\",,INDEX(($G$10:$G$18,$H$10:$H$18,$I$10:$I$18),MATCH(B286,$F$10:$F$18),,N(IF(1,{1,2,3}))))","v":"Gel Booms-94618-S4369/2297"}]
["2017-02-22","Sunshine",70,{"$f":"_xlfn.TEXTJOIN(\"-\",,INDEX(($G$10:$G$18,$H$10:$H$18,$I$10:$I$18),MATCH(B287,$F$10:$F$18),,N(IF(1,{1,2,3}))))","v":"Gel Booms-94618-S4369/2297"}]
["2017-03-08","Sunbell",79,{"$f":"_xlfn.TEXTJOIN(\"-\",,INDEX(($G$10:$G$18,$H$10:$H$18,$I$10:$I$18),MATCH(B288,$F$10:$F$18),,N(IF(1,{1,2,3}))))","v":"Gel Booms-94618-S4369/2241"}]
["2017-03-04","Aspen",78,{"$f":"_xlfn.TEXTJOIN(\"-\",,INDEX(($G$10:$G$18,$H$10:$H$18,$I$10:$I$18),MATCH(B289,$F$10:$F$18),,N(IF(1,{1,2,3}))))","v":"Colorado Booms-81231-A9634/2650"}]
["2017-02-02","TriBoom",63,{"$f":"_xlfn.TEXTJOIN(\"-\",,INDEX(($G$10:$G$18,$H$10:$H$18,$I$10:$I$18),MATCH(B290,$F$10:$F$18),,N(IF(1,{1,2,3}))))","v":"Colorado Booms-90009-T9634/2372"}]
["2017-03-18","Aspen",83,{"$f":"_xlfn.TEXTJOIN(\"-\",,INDEX(($G$10:$G$18,$H$10:$H$18,$I$10:$I$18),MATCH(B291,$F$10:$F$18),,N(IF(1,{1,2,3}))))","v":"Colorado Booms-81231-A9634/2650"}]
["2017-02-28","Quad",39,{"$f":"_xlfn.TEXTJOIN(\"-\",,INDEX(($G$10:$G$18,$H$10:$H$18,$I$10:$I$18),MATCH(B292,$F$10:$F$18),,N(IF(1,{1,2,3}))))","v":"Gel Booms-94608-Q4369/2290"}]
["2017-01-08","Eagle",110,{"$f":"_xlfn.TEXTJOIN(\"-\",,INDEX(($G$10:$G$18,$H$10:$H$18,$I$10:$I$18),MATCH(B293,$F$10:$F$18),,N(IF(1,{1,2,3}))))","v":"Colorado Booms-81231-E9634/2386"}]
["2017-03-28","Aspen",86,{"$f":"_xlfn.TEXTJOIN(\"-\",,INDEX(($G$10:$G$18,$H$10:$H$18,$I$10:$I$18),MATCH(B294,$F$10:$F$18),,N(IF(1,{1,2,3}))))","v":"Colorado Booms-81231-A9634/2650"}]
["2017-03-27","Aspen",107,{"$f":"_xlfn.TEXTJOIN(\"-\",,INDEX(($G$10:$G$18,$H$10:$H$18,$I$10:$I$18),MATCH(B295,$F$10:$F$18),,N(IF(1,{1,2,3}))))","v":"Colorado Booms-81231-A9634/2650"}]
["2017-02-16","Bellen",56,{"$f":"_xlfn.TEXTJOIN(\"-\",,INDEX(($G$10:$G$18,$H$10:$H$18,$I$10:$I$18),MATCH(B296,$F$10:$F$18),,N(IF(1,{1,2,3}))))","v":"Gel Booms-94618-B4369/2593"}]
["2017-02-18","TriBoom",100,{"$f":"_xlfn.TEXTJOIN(\"-\",,INDEX(($G$10:$G$18,$H$10:$H$18,$I$10:$I$18),MATCH(B297,$F$10:$F$18),,N(IF(1,{1,2,3}))))","v":"Colorado Booms-90009-T9634/2372"}]
["2017-01-08","TriBoom",85,{"$f":"_xlfn.TEXTJOIN(\"-\",,INDEX(($G$10:$G$18,$H$10:$H$18,$I$10:$I$18),MATCH(B298,$F$10:$F$18),,N(IF(1,{1,2,3}))))","v":"Colorado Booms-90009-T9634/2372"}]
["2017-01-18","Sunbell",90,{"$f":"_xlfn.TEXTJOIN(\"-\",,INDEX(($G$10:$G$18,$H$10:$H$18,$I$10:$I$18),MATCH(B299,$F$10:$F$18),,N(IF(1,{1,2,3}))))","v":"Gel Booms-94618-S4369/2241"}]
["2017-03-23","Eagle",43,{"$f":"_xlfn.TEXTJOIN(\"-\",,INDEX(($G$10:$G$18,$H$10:$H$18,$I$10:$I$18),MATCH(B300,$F$10:$F$18),,N(IF(1,{1,2,3}))))","v":"Colorado Booms-81231-E9634/2386"}]
["2017-02-19","Eagle",100,{"$f":"_xlfn.TEXTJOIN(\"-\",,INDEX(($G$10:$G$18,$H$10:$H$18,$I$10:$I$18),MATCH(B301,$F$10:$F$18),,N(IF(1,{1,2,3}))))","v":"Colorado Booms-81231-E9634/2386"}]
["2017-01-25","Sunshine",131,{"$f":"_xlfn.TEXTJOIN(\"-\",,INDEX(($G$10:$G$18,$H$10:$H$18,$I$10:$I$18),MATCH(B302,$F$10:$F$18),,N(IF(1,{1,2,3}))))","v":"Gel Booms-94618-S4369/2297"}]
["2017-01-22","Quad",90,{"$f":"_xlfn.TEXTJOIN(\"-\",,INDEX(($G$10:$G$18,$H$10:$H$18,$I$10:$I$18),MATCH(B303,$F$10:$F$18),,N(IF(1,{1,2,3}))))","v":"Gel Booms-94608-Q4369/2290"}]
["2017-03-28","Sunbell",82,{"$f":"_xlfn.TEXTJOIN(\"-\",,INDEX(($G$10:$G$18,$H$10:$H$18,$I$10:$I$18),MATCH(B304,$F$10:$F$18),,N(IF(1,{1,2,3}))))","v":"Gel Booms-94618-S4369/2241"}]
["2017-03-15","Aspen",36,{"$f":"_xlfn.TEXTJOIN(\"-\",,INDEX(($G$10:$G$18,$H$10:$H$18,$I$10:$I$18),MATCH(B305,$F$10:$F$18),,N(IF(1,{1,2,3}))))","v":"Colorado Booms-81231-A9634/2650"}]
["2017-02-10","Bellen",51,{"$f":"_xlfn.TEXTJOIN(\"-\",,INDEX(($G$10:$G$18,$H$10:$H$18,$I$10:$I$18),MATCH(B306,$F$10:$F$18),,N(IF(1,{1,2,3}))))","v":"Gel Booms-94618-B4369/2593"}]
["2017-01-27","Sunshine",62,{"$f":"_xlfn.TEXTJOIN(\"-\",,INDEX(($G$10:$G$18,$H$10:$H$18,$I$10:$I$18),MATCH(B307,$F$10:$F$18),,N(IF(1,{1,2,3}))))","v":"Gel Booms-94618-S4369/2297"}]
["2017-02-05","Quad",58,{"$f":"_xlfn.TEXTJOIN(\"-\",,INDEX(($G$10:$G$18,$H$10:$H$18,$I$10:$I$18),MATCH(B308,$F$10:$F$18),,N(IF(1,{1,2,3}))))","v":"Gel Booms-94608-Q4369/2290"}]
["2017-01-07","Sunshine",97,{"$f":"_xlfn.TEXTJOIN(\"-\",,INDEX(($G$10:$G$18,$H$10:$H$18,$I$10:$I$18),MATCH(B309,$F$10:$F$18),,N(IF(1,{1,2,3}))))","v":"Gel Booms-94618-S4369/2297"}]
["2017-02-15","Sunshine",94,{"$f":"_xlfn.TEXTJOIN(\"-\",,INDEX(($G$10:$G$18,$H$10:$H$18,$I$10:$I$18),MATCH(B310,$F$10:$F$18),,N(IF(1,{1,2,3}))))","v":"Gel Booms-94618-S4369/2297"}]
["2017-02-03","Yanaki",70,{"$f":"_xlfn.TEXTJOIN(\"-\",,INDEX(($G$10:$G$18,$H$10:$H$18,$I$10:$I$18),MATCH(B311,$F$10:$F$18),,N(IF(1,{1,2,3}))))","v":"Colorado Booms-81231-Y9634/2072"}]
["2017-03-06","Quad",47,{"$f":"_xlfn.TEXTJOIN(\"-\",,INDEX(($G$10:$G$18,$H$10:$H$18,$I$10:$I$18),MATCH(B312,$F$10:$F$18),,N(IF(1,{1,2,3}))))","v":"Gel Booms-94608-Q4369/2290"}]
["2017-01-20","Bellen",52,{"$f":"_xlfn.TEXTJOIN(\"-\",,INDEX(($G$10:$G$18,$H$10:$H$18,$I$10:$I$18),MATCH(B313,$F$10:$F$18),,N(IF(1,{1,2,3}))))","v":"Gel Booms-94618-B4369/2593"}]
["2017-01-20","Carlota",123,{"$f":"_xlfn.TEXTJOIN(\"-\",,INDEX(($G$10:$G$18,$H$10:$H$18,$I$10:$I$18),MATCH(B314,$F$10:$F$18),,N(IF(1,{1,2,3}))))","v":"Gel Booms-94608-C4369/2213"}]
["2017-02-11","Sunshine",64,{"$f":"_xlfn.TEXTJOIN(\"-\",,INDEX(($G$10:$G$18,$H$10:$H$18,$I$10:$I$18),MATCH(B315,$F$10:$F$18),,N(IF(1,{1,2,3}))))","v":"Gel Booms-94618-S4369/2297"}]
["2017-03-31","Yanaki",75,{"$f":"_xlfn.TEXTJOIN(\"-\",,INDEX(($G$10:$G$18,$H$10:$H$18,$I$10:$I$18),MATCH(B316,$F$10:$F$18),,N(IF(1,{1,2,3}))))","v":"Colorado Booms-81231-Y9634/2072"}]
["2017-02-22","TriBoom",60,{"$f":"_xlfn.TEXTJOIN(\"-\",,INDEX(($G$10:$G$18,$H$10:$H$18,$I$10:$I$18),MATCH(B317,$F$10:$F$18),,N(IF(1,{1,2,3}))))","v":"Colorado Booms-90009-T9634/2372"}]
["2017-02-18","Eagle",61,{"$f":"_xlfn.TEXTJOIN(\"-\",,INDEX(($G$10:$G$18,$H$10:$H$18,$I$10:$I$18),MATCH(B318,$F$10:$F$18),,N(IF(1,{1,2,3}))))","v":"Colorado Booms-81231-E9634/2386"}]
["2017-03-15","Aspen",76,{"$f":"_xlfn.TEXTJOIN(\"-\",,INDEX(($G$10:$G$18,$H$10:$H$18,$I$10:$I$18),MATCH(B319,$F$10:$F$18),,N(IF(1,{1,2,3}))))","v":"Colorado Booms-81231-A9634/2650"}]
["2017-02-28","Bellen",96,{"$f":"_xlfn.TEXTJOIN(\"-\",,INDEX(($G$10:$G$18,$H$10:$H$18,$I$10:$I$18),MATCH(B320,$F$10:$F$18),,N(IF(1,{1,2,3}))))","v":"Gel Booms-94618-B4369/2593"}]
["2017-01-20","Bellen",34,{"$f":"_xlfn.TEXTJOIN(\"-\",,INDEX(($G$10:$G$18,$H$10:$H$18,$I$10:$I$18),MATCH(B321,$F$10:$F$18),,N(IF(1,{1,2,3}))))","v":"Gel Booms-94618-B4369/2593"}]
["2017-03-24","Sunbell",106,{"$f":"_xlfn.TEXTJOIN(\"-\",,INDEX(($G$10:$G$18,$H$10:$H$18,$I$10:$I$18),MATCH(B322,$F$10:$F$18),,N(IF(1,{1,2,3}))))","v":"Gel Booms-94618-S4369/2241"}]
["2017-03-06","Sunbell",66,{"$f":"_xlfn.TEXTJOIN(\"-\",,INDEX(($G$10:$G$18,$H$10:$H$18,$I$10:$I$18),MATCH(B323,$F$10:$F$18),,N(IF(1,{1,2,3}))))","v":"Gel Booms-94618-S4369/2241"}]
["2017-01-21","Sunbell",67,{"$f":"_xlfn.TEXTJOIN(\"-\",,INDEX(($G$10:$G$18,$H$10:$H$18,$I$10:$I$18),MATCH(B324,$F$10:$F$18),,N(IF(1,{1,2,3}))))","v":"Gel Booms-94618-S4369/2241"}]
["2017-02-06","Eagle",96,{"$f":"_xlfn.TEXTJOIN(\"-\",,INDEX(($G$10:$G$18,$H$10:$H$18,$I$10:$I$18),MATCH(B325,$F$10:$F$18),,N(IF(1,{1,2,3}))))","v":"Colorado Booms-81231-E9634/2386"}]
["2017-03-08","Bellen",84,{"$f":"_xlfn.TEXTJOIN(\"-\",,INDEX(($G$10:$G$18,$H$10:$H$18,$I$10:$I$18),MATCH(B326,$F$10:$F$18),,N(IF(1,{1,2,3}))))","v":"Gel Booms-94618-B4369/2593"}]
["2017-03-11","Sunshine",39,{"$f":"_xlfn.TEXTJOIN(\"-\",,INDEX(($G$10:$G$18,$H$10:$H$18,$I$10:$I$18),MATCH(B327,$F$10:$F$18),,N(IF(1,{1,2,3}))))","v":"Gel Booms-94618-S4369/2297"}]
["2017-01-09","Eagle",88,{"$f":"_xlfn.TEXTJOIN(\"-\",,INDEX(($G$10:$G$18,$H$10:$H$18,$I$10:$I$18),MATCH(B328,$F$10:$F$18),,N(IF(1,{1,2,3}))))","v":"Colorado Booms-81231-E9634/2386"}]
["2017-03-04","Sunshine",60,{"$f":"_xlfn.TEXTJOIN(\"-\",,INDEX(($G$10:$G$18,$H$10:$H$18,$I$10:$I$18),MATCH(B329,$F$10:$F$18),,N(IF(1,{1,2,3}))))","v":"Gel Booms-94618-S4369/2297"}]
["2017-03-11","Carlota",63,{"$f":"_xlfn.TEXTJOIN(\"-\",,INDEX(($G$10:$G$18,$H$10:$H$18,$I$10:$I$18),MATCH(B330,$F$10:$F$18),,N(IF(1,{1,2,3}))))","v":"Gel Booms-94608-C4369/2213"}]
["2017-02-22","Eagle",47,{"$f":"_xlfn.TEXTJOIN(\"-\",,INDEX(($G$10:$G$18,$H$10:$H$18,$I$10:$I$18),MATCH(B331,$F$10:$F$18),,N(IF(1,{1,2,3}))))","v":"Colorado Booms-81231-E9634/2386"}]
["2017-01-24","Bellen",57,{"$f":"_xlfn.TEXTJOIN(\"-\",,INDEX(($G$10:$G$18,$H$10:$H$18,$I$10:$I$18),MATCH(B332,$F$10:$F$18),,N(IF(1,{1,2,3}))))","v":"Gel Booms-94618-B4369/2593"}]
["2017-02-02","Bellen",83,{"$f":"_xlfn.TEXTJOIN(\"-\",,INDEX(($G$10:$G$18,$H$10:$H$18,$I$10:$I$18),MATCH(B333,$F$10:$F$18),,N(IF(1,{1,2,3}))))","v":"Gel Booms-94618-B4369/2593"}]
["2017-03-24","Eagle",92,{"$f":"_xlfn.TEXTJOIN(\"-\",,INDEX(($G$10:$G$18,$H$10:$H$18,$I$10:$I$18),MATCH(B334,$F$10:$F$18),,N(IF(1,{1,2,3}))))","v":"Colorado Booms-81231-E9634/2386"}]
["2017-01-07","Sunbell",62,{"$f":"_xlfn.TEXTJOIN(\"-\",,INDEX(($G$10:$G$18,$H$10:$H$18,$I$10:$I$18),MATCH(B335,$F$10:$F$18),,N(IF(1,{1,2,3}))))","v":"Gel Booms-94618-S4369/2241"}]
["2017-02-19","Bellen",53,{"$f":"_xlfn.TEXTJOIN(\"-\",,INDEX(($G$10:$G$18,$H$10:$H$18,$I$10:$I$18),MATCH(B336,$F$10:$F$18),,N(IF(1,{1,2,3}))))","v":"Gel Booms-94618-B4369/2593"}]
["2017-03-02","Carlota",62,{"$f":"_xlfn.TEXTJOIN(\"-\",,INDEX(($G$10:$G$18,$H$10:$H$18,$I$10:$I$18),MATCH(B337,$F$10:$F$18),,N(IF(1,{1,2,3}))))","v":"Gel Booms-94608-C4369/2213"}]
["2017-01-03","Sunshine",89,{"$f":"_xlfn.TEXTJOIN(\"-\",,INDEX(($G$10:$G$18,$H$10:$H$18,$I$10:$I$18),MATCH(B338,$F$10:$F$18),,N(IF(1,{1,2,3}))))","v":"Gel Booms-94618-S4369/2297"}]
["2017-03-26","Yanaki",61,{"$f":"_xlfn.TEXTJOIN(\"-\",,INDEX(($G$10:$G$18,$H$10:$H$18,$I$10:$I$18),MATCH(B339,$F$10:$F$18),,N(IF(1,{1,2,3}))))","v":"Colorado Booms-81231-Y9634/2072"}]
["2017-03-02","Carlota",94,{"$f":"_xlfn.TEXTJOIN(\"-\",,INDEX(($G$10:$G$18,$H$10:$H$18,$I$10:$I$18),MATCH(B340,$F$10:$F$18),,N(IF(1,{1,2,3}))))","v":"Gel Booms-94608-C4369/2213"}]
["2017-02-25","Carlota",61,{"$f":"_xlfn.TEXTJOIN(\"-\",,INDEX(($G$10:$G$18,$H$10:$H$18,$I$10:$I$18),MATCH(B341,$F$10:$F$18),,N(IF(1,{1,2,3}))))","v":"Gel Booms-94608-C4369/2213"}]
["2017-03-20","Aspen",48,{"$f":"_xlfn.TEXTJOIN(\"-\",,INDEX(($G$10:$G$18,$H$10:$H$18,$I$10:$I$18),MATCH(B342,$F$10:$F$18),,N(IF(1,{1,2,3}))))","v":"Colorado Booms-81231-A9634/2650"}]
["2017-02-12","Quad",61,{"$f":"_xlfn.TEXTJOIN(\"-\",,INDEX(($G$10:$G$18,$H$10:$H$18,$I$10:$I$18),MATCH(B343,$F$10:$F$18),,N(IF(1,{1,2,3}))))","v":"Gel Booms-94608-Q4369/2290"}]
["2017-01-19","Quad",50,{"$f":"_xlfn.TEXTJOIN(\"-\",,INDEX(($G$10:$G$18,$H$10:$H$18,$I$10:$I$18),MATCH(B344,$F$10:$F$18),,N(IF(1,{1,2,3}))))","v":"Gel Booms-94608-Q4369/2290"}]
["2017-03-19","Sunbell",31,{"$f":"_xlfn.TEXTJOIN(\"-\",,INDEX(($G$10:$G$18,$H$10:$H$18,$I$10:$I$18),MATCH(B345,$F$10:$F$18),,N(IF(1,{1,2,3}))))","v":"Gel Booms-94618-S4369/2241"}]
["2017-01-23","Bellen",54,{"$f":"_xlfn.TEXTJOIN(\"-\",,INDEX(($G$10:$G$18,$H$10:$H$18,$I$10:$I$18),MATCH(B346,$F$10:$F$18),,N(IF(1,{1,2,3}))))","v":"Gel Booms-94618-B4369/2593"}]
["2017-02-14","Eagle",89,{"$f":"_xlfn.TEXTJOIN(\"-\",,INDEX(($G$10:$G$18,$H$10:$H$18,$I$10:$I$18),MATCH(B347,$F$10:$F$18),,N(IF(1,{1,2,3}))))","v":"Colorado Booms-81231-E9634/2386"}]
["2017-03-04","Bellen",72,{"$f":"_xlfn.TEXTJOIN(\"-\",,INDEX(($G$10:$G$18,$H$10:$H$18,$I$10:$I$18),MATCH(B348,$F$10:$F$18),,N(IF(1,{1,2,3}))))","v":"Gel Booms-94618-B4369/2593"}]
["2017-03-11","TriBoom",73,{"$f":"_xlfn.TEXTJOIN(\"-\",,INDEX(($G$10:$G$18,$H$10:$H$18,$I$10:$I$18),MATCH(B349,$F$10:$F$18),,N(IF(1,{1,2,3}))))","v":"Colorado Booms-90009-T9634/2372"}]
["2017-01-03","Sunshine",67,{"$f":"_xlfn.TEXTJOIN(\"-\",,INDEX(($G$10:$G$18,$H$10:$H$18,$I$10:$I$18),MATCH(B350,$F$10:$F$18),,N(IF(1,{1,2,3}))))","v":"Gel Booms-94618-S4369/2297"}]
["2017-02-03","Eagle",102,{"$f":"_xlfn.TEXTJOIN(\"-\",,INDEX(($G$10:$G$18,$H$10:$H$18,$I$10:$I$18),MATCH(B351,$F$10:$F$18),,N(IF(1,{1,2,3}))))","v":"Colorado Booms-81231-E9634/2386"}]
["2017-02-15","Sunbell",81,{"$f":"_xlfn.TEXTJOIN(\"-\",,INDEX(($G$10:$G$18,$H$10:$H$18,$I$10:$I$18),MATCH(B352,$F$10:$F$18),,N(IF(1,{1,2,3}))))","v":"Gel Booms-94618-S4369/2241"}]
["2017-01-15","Yanaki",63,{"$f":"_xlfn.TEXTJOIN(\"-\",,INDEX(($G$10:$G$18,$H$10:$H$18,$I$10:$I$18),MATCH(B353,$F$10:$F$18),,N(IF(1,{1,2,3}))))","v":"Colorado Booms-81231-Y9634/2072"}]
["2017-02-12","Carlota",63,{"$f":"_xlfn.TEXTJOIN(\"-\",,INDEX(($G$10:$G$18,$H$10:$H$18,$I$10:$I$18),MATCH(B354,$F$10:$F$18),,N(IF(1,{1,2,3}))))","v":"Gel Booms-94608-C4369/2213"}]
["2017-01-15","Yanaki",105,{"$f":"_xlfn.TEXTJOIN(\"-\",,INDEX(($G$10:$G$18,$H$10:$H$18,$I$10:$I$18),MATCH(B355,$F$10:$F$18),,N(IF(1,{1,2,3}))))","v":"Colorado Booms-81231-Y9634/2072"}]
["2017-02-19","Sunshine",125,{"$f":"_xlfn.TEXTJOIN(\"-\",,INDEX(($G$10:$G$18,$H$10:$H$18,$I$10:$I$18),MATCH(B356,$F$10:$F$18),,N(IF(1,{1,2,3}))))","v":"Gel Booms-94618-S4369/2297"}]
["2017-03-30","Bellen",78,{"$f":"_xlfn.TEXTJOIN(\"-\",,INDEX(($G$10:$G$18,$H$10:$H$18,$I$10:$I$18),MATCH(B357,$F$10:$F$18),,N(IF(1,{1,2,3}))))","v":"Gel Booms-94618-B4369/2593"}]
["2017-02-16","Quad",88,{"$f":"_xlfn.TEXTJOIN(\"-\",,INDEX(($G$10:$G$18,$H$10:$H$18,$I$10:$I$18),MATCH(B358,$F$10:$F$18),,N(IF(1,{1,2,3}))))","v":"Gel Booms-94608-Q4369/2290"}]
["2017-02-19","Sunbell",77,{"$f":"_xlfn.TEXTJOIN(\"-\",,INDEX(($G$10:$G$18,$H$10:$H$18,$I$10:$I$18),MATCH(B359,$F$10:$F$18),,N(IF(1,{1,2,3}))))","v":"Gel Booms-94618-S4369/2241"}]
["2017-01-19","Sunshine",73,{"$f":"_xlfn.TEXTJOIN(\"-\",,INDEX(($G$10:$G$18,$H$10:$H$18,$I$10:$I$18),MATCH(B360,$F$10:$F$18),,N(IF(1,{1,2,3}))))","v":"Gel Booms-94618-S4369/2297"}]
["2017-01-09","Sunshine",45,{"$f":"_xlfn.TEXTJOIN(\"-\",,INDEX(($G$10:$G$18,$H$10:$H$18,$I$10:$I$18),MATCH(B361,$F$10:$F$18),,N(IF(1,{1,2,3}))))","v":"Gel Booms-94618-S4369/2297"}]
["2017-02-03","Sunbell",92,{"$f":"_xlfn.TEXTJOIN(\"-\",,INDEX(($G$10:$G$18,$H$10:$H$18,$I$10:$I$18),MATCH(B362,$F$10:$F$18),,N(IF(1,{1,2,3}))))","v":"Gel Booms-94618-S4369/2241"}]
["2017-03-01","Aspen",77,{"$f":"_xlfn.TEXTJOIN(\"-\",,INDEX(($G$10:$G$18,$H$10:$H$18,$I$10:$I$18),MATCH(B363,$F$10:$F$18),,N(IF(1,{1,2,3}))))","v":"Colorado Booms-81231-A9634/2650"}]
["2017-02-28","Eagle",116,{"$f":"_xlfn.TEXTJOIN(\"-\",,INDEX(($G$10:$G$18,$H$10:$H$18,$I$10:$I$18),MATCH(B364,$F$10:$F$18),,N(IF(1,{1,2,3}))))","v":"Colorado Booms-81231-E9634/2386"}]
["2017-01-08","Yanaki",94,{"$f":"_xlfn.TEXTJOIN(\"-\",,INDEX(($G$10:$G$18,$H$10:$H$18,$I$10:$I$18),MATCH(B365,$F$10:$F$18),,N(IF(1,{1,2,3}))))","v":"Colorado Booms-81231-Y9634/2072"}]
["2017-01-28","Yanaki",123,{"$f":"_xlfn.TEXTJOIN(\"-\",,INDEX(($G$10:$G$18,$H$10:$H$18,$I$10:$I$18),MATCH(B366,$F$10:$F$18),,N(IF(1,{1,2,3}))))","v":"Colorado Booms-81231-Y9634/2072"}]
["2017-01-27","Quad",88,{"$f":"_xlfn.TEXTJOIN(\"-\",,INDEX(($G$10:$G$18,$H$10:$H$18,$I$10:$I$18),MATCH(B367,$F$10:$F$18),,N(IF(1,{1,2,3}))))","v":"Gel Booms-94608-Q4369/2290"}]
["2017-01-22","Carlota",45,{"$f":"_xlfn.TEXTJOIN(\"-\",,INDEX(($G$10:$G$18,$H$10:$H$18,$I$10:$I$18),MATCH(B368,$F$10:$F$18),,N(IF(1,{1,2,3}))))","v":"Gel Booms-94608-C4369/2213"}]
["2017-02-19","Sunbell",85,{"$f":"_xlfn.TEXTJOIN(\"-\",,INDEX(($G$10:$G$18,$H$10:$H$18,$I$10:$I$18),MATCH(B369,$F$10:$F$18),,N(IF(1,{1,2,3}))))","v":"Gel Booms-94618-S4369/2241"}]
["2017-01-11","Bellen",85,{"$f":"_xlfn.TEXTJOIN(\"-\",,INDEX(($G$10:$G$18,$H$10:$H$18,$I$10:$I$18),MATCH(B370,$F$10:$F$18),,N(IF(1,{1,2,3}))))","v":"Gel Booms-94618-B4369/2593"}]
["2017-03-04","Eagle",30,{"$f":"_xlfn.TEXTJOIN(\"-\",,INDEX(($G$10:$G$18,$H$10:$H$18,$I$10:$I$18),MATCH(B371,$F$10:$F$18),,N(IF(1,{1,2,3}))))","v":"Colorado Booms-81231-E9634/2386"}]
["2017-03-16","Bellen",84,{"$f":"_xlfn.TEXTJOIN(\"-\",,INDEX(($G$10:$G$18,$H$10:$H$18,$I$10:$I$18),MATCH(B372,$F$10:$F$18),,N(IF(1,{1,2,3}))))","v":"Gel Booms-94618-B4369/2593"}]
["2017-02-11","Eagle",99,{"$f":"_xlfn.TEXTJOIN(\"-\",,INDEX(($G$10:$G$18,$H$10:$H$18,$I$10:$I$18),MATCH(B373,$F$10:$F$18),,N(IF(1,{1,2,3}))))","v":"Colorado Booms-81231-E9634/2386"}]
["2017-01-07","Aspen",92,{"$f":"_xlfn.TEXTJOIN(\"-\",,INDEX(($G$10:$G$18,$H$10:$H$18,$I$10:$I$18),MATCH(B374,$F$10:$F$18),,N(IF(1,{1,2,3}))))","v":"Colorado Booms-81231-A9634/2650"}]
["2017-01-31","Yanaki",87,{"$f":"_xlfn.TEXTJOIN(\"-\",,INDEX(($G$10:$G$18,$H$10:$H$18,$I$10:$I$18),MATCH(B375,$F$10:$F$18),,N(IF(1,{1,2,3}))))","v":"Colorado Booms-81231-Y9634/2072"}]
["2017-03-30","Sunbell",100,{"$f":"_xlfn.TEXTJOIN(\"-\",,INDEX(($G$10:$G$18,$H$10:$H$18,$I$10:$I$18),MATCH(B376,$F$10:$F$18),,N(IF(1,{1,2,3}))))","v":"Gel Booms-94618-S4369/2241"}]
["2017-01-16","Eagle",99,{"$f":"_xlfn.TEXTJOIN(\"-\",,INDEX(($G$10:$G$18,$H$10:$H$18,$I$10:$I$18),MATCH(B377,$F$10:$F$18),,N(IF(1,{1,2,3}))))","v":"Colorado Booms-81231-E9634/2386"}]
["2017-01-09","Sunbell",37,{"$f":"_xlfn.TEXTJOIN(\"-\",,INDEX(($G$10:$G$18,$H$10:$H$18,$I$10:$I$18),MATCH(B378,$F$10:$F$18),,N(IF(1,{1,2,3}))))","v":"Gel Booms-94618-S4369/2241"}]
["2017-01-22","Sunbell",80,{"$f":"_xlfn.TEXTJOIN(\"-\",,INDEX(($G$10:$G$18,$H$10:$H$18,$I$10:$I$18),MATCH(B379,$F$10:$F$18),,N(IF(1,{1,2,3}))))","v":"Gel Booms-94618-S4369/2241"}]
["2017-02-05","Sunshine",74,{"$f":"_xlfn.TEXTJOIN(\"-\",,INDEX(($G$10:$G$18,$H$10:$H$18,$I$10:$I$18),MATCH(B380,$F$10:$F$18),,N(IF(1,{1,2,3}))))","v":"Gel Booms-94618-S4369/2297"}]
["2017-03-29","Yanaki",114,{"$f":"_xlfn.TEXTJOIN(\"-\",,INDEX(($G$10:$G$18,$H$10:$H$18,$I$10:$I$18),MATCH(B381,$F$10:$F$18),,N(IF(1,{1,2,3}))))","v":"Colorado Booms-81231-Y9634/2072"}]
["2017-03-30","Yanaki",73,{"$f":"_xlfn.TEXTJOIN(\"-\",,INDEX(($G$10:$G$18,$H$10:$H$18,$I$10:$I$18),MATCH(B382,$F$10:$F$18),,N(IF(1,{1,2,3}))))","v":"Colorado Booms-81231-Y9634/2072"}]
["2017-03-12","Carlota",100,{"$f":"_xlfn.TEXTJOIN(\"-\",,INDEX(($G$10:$G$18,$H$10:$H$18,$I$10:$I$18),MATCH(B383,$F$10:$F$18),,N(IF(1,{1,2,3}))))","v":"Gel Booms-94608-C4369/2213"}]
["2017-01-30","TriBoom",74,{"$f":"_xlfn.TEXTJOIN(\"-\",,INDEX(($G$10:$G$18,$H$10:$H$18,$I$10:$I$18),MATCH(B384,$F$10:$F$18),,N(IF(1,{1,2,3}))))","v":"Colorado Booms-90009-T9634/2372"}]
["2017-02-16","Eagle",48,{"$f":"_xlfn.TEXTJOIN(\"-\",,INDEX(($G$10:$G$18,$H$10:$H$18,$I$10:$I$18),MATCH(B385,$F$10:$F$18),,N(IF(1,{1,2,3}))))","v":"Colorado Booms-81231-E9634/2386"}]
["2017-01-31","Sunshine",100,{"$f":"_xlfn.TEXTJOIN(\"-\",,INDEX(($G$10:$G$18,$H$10:$H$18,$I$10:$I$18),MATCH(B386,$F$10:$F$18),,N(IF(1,{1,2,3}))))","v":"Gel Booms-94618-S4369/2297"}]
["2017-02-07","Eagle",101,{"$f":"_xlfn.TEXTJOIN(\"-\",,INDEX(($G$10:$G$18,$H$10:$H$18,$I$10:$I$18),MATCH(B387,$F$10:$F$18),,N(IF(1,{1,2,3}))))","v":"Colorado Booms-81231-E9634/2386"}]
["2017-02-27","Carlota",83,{"$f":"_xlfn.TEXTJOIN(\"-\",,INDEX(($G$10:$G$18,$H$10:$H$18,$I$10:$I$18),MATCH(B388,$F$10:$F$18),,N(IF(1,{1,2,3}))))","v":"Gel Booms-94608-C4369/2213"}]
["2017-01-21","Bellen",59,{"$f":"_xlfn.TEXTJOIN(\"-\",,INDEX(($G$10:$G$18,$H$10:$H$18,$I$10:$I$18),MATCH(B389,$F$10:$F$18),,N(IF(1,{1,2,3}))))","v":"Gel Booms-94618-B4369/2593"}]
["2017-02-26","Eagle",81,{"$f":"_xlfn.TEXTJOIN(\"-\",,INDEX(($G$10:$G$18,$H$10:$H$18,$I$10:$I$18),MATCH(B390,$F$10:$F$18),,N(IF(1,{1,2,3}))))","v":"Colorado Booms-81231-E9634/2386"}]
["2017-03-23","Eagle",91,{"$f":"_xlfn.TEXTJOIN(\"-\",,INDEX(($G$10:$G$18,$H$10:$H$18,$I$10:$I$18),MATCH(B391,$F$10:$F$18),,N(IF(1,{1,2,3}))))","v":"Colorado Booms-81231-E9634/2386"}]
["2017-02-22","Carlota",99,{"$f":"_xlfn.TEXTJOIN(\"-\",,INDEX(($G$10:$G$18,$H$10:$H$18,$I$10:$I$18),MATCH(B392,$F$10:$F$18),,N(IF(1,{1,2,3}))))","v":"Gel Booms-94608-C4369/2213"}]
["2017-02-12","Eagle",86,{"$f":"_xlfn.TEXTJOIN(\"-\",,INDEX(($G$10:$G$18,$H$10:$H$18,$I$10:$I$18),MATCH(B393,$F$10:$F$18),,N(IF(1,{1,2,3}))))","v":"Colorado Booms-81231-E9634/2386"}]
["2017-02-19","Yanaki",67,{"$f":"_xlfn.TEXTJOIN(\"-\",,INDEX(($G$10:$G$18,$H$10:$H$18,$I$10:$I$18),MATCH(B394,$F$10:$F$18),,N(IF(1,{1,2,3}))))","v":"Colorado Booms-81231-Y9634/2072"}]
["2017-03-25","Quad",18,{"$f":"_xlfn.TEXTJOIN(\"-\",,INDEX(($G$10:$G$18,$H$10:$H$18,$I$10:$I$18),MATCH(B395,$F$10:$F$18),,N(IF(1,{1,2,3}))))","v":"Gel Booms-94608-Q4369/2290"}]
["2017-03-01","Eagle",76,{"$f":"_xlfn.TEXTJOIN(\"-\",,INDEX(($G$10:$G$18,$H$10:$H$18,$I$10:$I$18),MATCH(B396,$F$10:$F$18),,N(IF(1,{1,2,3}))))","v":"Colorado Booms-81231-E9634/2386"}]
["2017-02-02","Eagle",54,{"$f":"_xlfn.TEXTJOIN(\"-\",,INDEX(($G$10:$G$18,$H$10:$H$18,$I$10:$I$18),MATCH(B397,$F$10:$F$18),,N(IF(1,{1,2,3}))))","v":"Colorado Booms-81231-E9634/2386"}]
["2017-01-29","TriBoom",72,{"$f":"_xlfn.TEXTJOIN(\"-\",,INDEX(($G$10:$G$18,$H$10:$H$18,$I$10:$I$18),MATCH(B398,$F$10:$F$18),,N(IF(1,{1,2,3}))))","v":"Colorado Booms-90009-T9634/2372"}]
["2017-02-12","Sunbell",35,{"$f":"_xlfn.TEXTJOIN(\"-\",,INDEX(($G$10:$G$18,$H$10:$H$18,$I$10:$I$18),MATCH(B399,$F$10:$F$18),,N(IF(1,{1,2,3}))))","v":"Gel Booms-94618-S4369/2241"}]
["2017-01-13","Aspen",118,{"$f":"_xlfn.TEXTJOIN(\"-\",,INDEX(($G$10:$G$18,$H$10:$H$18,$I$10:$I$18),MATCH(B400,$F$10:$F$18),,N(IF(1,{1,2,3}))))","v":"Colorado Booms-81231-A9634/2650"}]
["2017-02-13","Bellen",82,{"$f":"_xlfn.TEXTJOIN(\"-\",,INDEX(($G$10:$G$18,$H$10:$H$18,$I$10:$I$18),MATCH(B401,$F$10:$F$18),,N(IF(1,{1,2,3}))))","v":"Gel Booms-94618-B4369/2593"}]
["2017-02-10","Sunshine",102,{"$f":"_xlfn.TEXTJOIN(\"-\",,INDEX(($G$10:$G$18,$H$10:$H$18,$I$10:$I$18),MATCH(B402,$F$10:$F$18),,N(IF(1,{1,2,3}))))","v":"Gel Booms-94618-S4369/2297"}]
["2017-02-19","Eagle",118,{"$f":"_xlfn.TEXTJOIN(\"-\",,INDEX(($G$10:$G$18,$H$10:$H$18,$I$10:$I$18),MATCH(B403,$F$10:$F$18),,N(IF(1,{1,2,3}))))","v":"Colorado Booms-81231-E9634/2386"}]
["2017-02-04","Eagle",58,{"$f":"_xlfn.TEXTJOIN(\"-\",,INDEX(($G$10:$G$18,$H$10:$H$18,$I$10:$I$18),MATCH(B404,$F$10:$F$18),,N(IF(1,{1,2,3}))))","v":"Colorado Booms-81231-E9634/2386"}]
["2017-03-31","TriBoom",68,{"$f":"_xlfn.TEXTJOIN(\"-\",,INDEX(($G$10:$G$18,$H$10:$H$18,$I$10:$I$18),MATCH(B405,$F$10:$F$18),,N(IF(1,{1,2,3}))))","v":"Colorado Booms-90009-T9634/2372"}]
["2017-02-10","Quad",41,{"$f":"_xlfn.TEXTJOIN(\"-\",,INDEX(($G$10:$G$18,$H$10:$H$18,$I$10:$I$18),MATCH(B406,$F$10:$F$18),,N(IF(1,{1,2,3}))))","v":"Gel Booms-94608-Q4369/2290"}]
["2017-01-15","Yanaki",90,{"$f":"_xlfn.TEXTJOIN(\"-\",,INDEX(($G$10:$G$18,$H$10:$H$18,$I$10:$I$18),MATCH(B407,$F$10:$F$18),,N(IF(1,{1,2,3}))))","v":"Colorado Booms-81231-Y9634/2072"}]
["2017-01-07","Eagle",63,{"$f":"_xlfn.TEXTJOIN(\"-\",,INDEX(($G$10:$G$18,$H$10:$H$18,$I$10:$I$18),MATCH(B408,$F$10:$F$18),,N(IF(1,{1,2,3}))))","v":"Colorado Booms-81231-E9634/2386"}]
["2017-03-10","Bellen",95,{"$f":"_xlfn.TEXTJOIN(\"-\",,INDEX(($G$10:$G$18,$H$10:$H$18,$I$10:$I$18),MATCH(B409,$F$10:$F$18),,N(IF(1,{1,2,3}))))","v":"Gel Booms-94618-B4369/2593"}]
["2017-01-18","Yanaki",19,{"$f":"_xlfn.TEXTJOIN(\"-\",,INDEX(($G$10:$G$18,$H$10:$H$18,$I$10:$I$18),MATCH(B410,$F$10:$F$18),,N(IF(1,{1,2,3}))))","v":"Colorado Booms-81231-Y9634/2072"}]
["2017-02-17","Sunshine",39,{"$f":"_xlfn.TEXTJOIN(\"-\",,INDEX(($G$10:$G$18,$H$10:$H$18,$I$10:$I$18),MATCH(B411,$F$10:$F$18),,N(IF(1,{1,2,3}))))","v":"Gel Booms-94618-S4369/2297"}]
["2017-03-13","Yanaki",43,{"$f":"_xlfn.TEXTJOIN(\"-\",,INDEX(($G$10:$G$18,$H$10:$H$18,$I$10:$I$18),MATCH(B412,$F$10:$F$18),,N(IF(1,{1,2,3}))))","v":"Colorado Booms-81231-Y9634/2072"}]
["2017-01-04","TriBoom",56,{"$f":"_xlfn.TEXTJOIN(\"-\",,INDEX(($G$10:$G$18,$H$10:$H$18,$I$10:$I$18),MATCH(B413,$F$10:$F$18),,N(IF(1,{1,2,3}))))","v":"Colorado Booms-90009-T9634/2372"}]
["2017-03-31","Quad",47,{"$f":"_xlfn.TEXTJOIN(\"-\",,INDEX(($G$10:$G$18,$H$10:$H$18,$I$10:$I$18),MATCH(B414,$F$10:$F$18),,N(IF(1,{1,2,3}))))","v":"Gel Booms-94608-Q4369/2290"}]
["2017-03-13","Aspen",61,{"$f":"_xlfn.TEXTJOIN(\"-\",,INDEX(($G$10:$G$18,$H$10:$H$18,$I$10:$I$18),MATCH(B415,$F$10:$F$18),,N(IF(1,{1,2,3}))))","v":"Colorado Booms-81231-A9634/2650"}]
["2017-01-11","Quad",66,{"$f":"_xlfn.TEXTJOIN(\"-\",,INDEX(($G$10:$G$18,$H$10:$H$18,$I$10:$I$18),MATCH(B416,$F$10:$F$18),,N(IF(1,{1,2,3}))))","v":"Gel Booms-94608-Q4369/2290"}]
["2017-02-22","Aspen",87,{"$f":"_xlfn.TEXTJOIN(\"-\",,INDEX(($G$10:$G$18,$H$10:$H$18,$I$10:$I$18),MATCH(B417,$F$10:$F$18),,N(IF(1,{1,2,3}))))","v":"Colorado Booms-81231-A9634/2650"}]
["2017-02-21","Sunbell",87,{"$f":"_xlfn.TEXTJOIN(\"-\",,INDEX(($G$10:$G$18,$H$10:$H$18,$I$10:$I$18),MATCH(B418,$F$10:$F$18),,N(IF(1,{1,2,3}))))","v":"Gel Booms-94618-S4369/2241"}]
["2017-03-02","Eagle",78,{"$f":"_xlfn.TEXTJOIN(\"-\",,INDEX(($G$10:$G$18,$H$10:$H$18,$I$10:$I$18),MATCH(B419,$F$10:$F$18),,N(IF(1,{1,2,3}))))","v":"Colorado Booms-81231-E9634/2386"}]
["2017-02-25","Eagle",67,{"$f":"_xlfn.TEXTJOIN(\"-\",,INDEX(($G$10:$G$18,$H$10:$H$18,$I$10:$I$18),MATCH(B420,$F$10:$F$18),,N(IF(1,{1,2,3}))))","v":"Colorado Booms-81231-E9634/2386"}]
["2017-03-05","Sunbell",58,{"$f":"_xlfn.TEXTJOIN(\"-\",,INDEX(($G$10:$G$18,$H$10:$H$18,$I$10:$I$18),MATCH(B421,$F$10:$F$18),,N(IF(1,{1,2,3}))))","v":"Gel Booms-94618-S4369/2241"}]
["2017-01-29","Carlota",82,{"$f":"_xlfn.TEXTJOIN(\"-\",,INDEX(($G$10:$G$18,$H$10:$H$18,$I$10:$I$18),MATCH(B422,$F$10:$F$18),,N(IF(1,{1,2,3}))))","v":"Gel Booms-94608-C4369/2213"}]
["2017-01-15","Eagle",99,{"$f":"_xlfn.TEXTJOIN(\"-\",,INDEX(($G$10:$G$18,$H$10:$H$18,$I$10:$I$18),MATCH(B423,$F$10:$F$18),,N(IF(1,{1,2,3}))))","v":"Colorado Booms-81231-E9634/2386"}]
["2017-03-28","Quad",98,{"$f":"_xlfn.TEXTJOIN(\"-\",,INDEX(($G$10:$G$18,$H$10:$H$18,$I$10:$I$18),MATCH(B424,$F$10:$F$18),,N(IF(1,{1,2,3}))))","v":"Gel Booms-94608-Q4369/2290"}]
["2017-02-14","Yanaki",58,{"$f":"_xlfn.TEXTJOIN(\"-\",,INDEX(($G$10:$G$18,$H$10:$H$18,$I$10:$I$18),MATCH(B425,$F$10:$F$18),,N(IF(1,{1,2,3}))))","v":"Colorado Booms-81231-Y9634/2072"}]
["2017-03-11","Aspen",80,{"$f":"_xlfn.TEXTJOIN(\"-\",,INDEX(($G$10:$G$18,$H$10:$H$18,$I$10:$I$18),MATCH(B426,$F$10:$F$18),,N(IF(1,{1,2,3}))))","v":"Colorado Booms-81231-A9634/2650"}]
["2017-01-12","Aspen",36,{"$f":"_xlfn.TEXTJOIN(\"-\",,INDEX(($G$10:$G$18,$H$10:$H$18,$I$10:$I$18),MATCH(B427,$F$10:$F$18),,N(IF(1,{1,2,3}))))","v":"Colorado Booms-81231-A9634/2650"}]
["2017-01-14","Sunbell",45,{"$f":"_xlfn.TEXTJOIN(\"-\",,INDEX(($G$10:$G$18,$H$10:$H$18,$I$10:$I$18),MATCH(B428,$F$10:$F$18),,N(IF(1,{1,2,3}))))","v":"Gel Booms-94618-S4369/2241"}]
["2017-01-08","Quad",77,{"$f":"_xlfn.TEXTJOIN(\"-\",,INDEX(($G$10:$G$18,$H$10:$H$18,$I$10:$I$18),MATCH(B429,$F$10:$F$18),,N(IF(1,{1,2,3}))))","v":"Gel Booms-94608-Q4369/2290"}]
["2017-02-02","TriBoom",106,{"$f":"_xlfn.TEXTJOIN(\"-\",,INDEX(($G$10:$G$18,$H$10:$H$18,$I$10:$I$18),MATCH(B430,$F$10:$F$18),,N(IF(1,{1,2,3}))))","v":"Colorado Booms-90009-T9634/2372"}]
["2017-03-10","Sunbell",59,{"$f":"_xlfn.TEXTJOIN(\"-\",,INDEX(($G$10:$G$18,$H$10:$H$18,$I$10:$I$18),MATCH(B431,$F$10:$F$18),,N(IF(1,{1,2,3}))))","v":"Gel Booms-94618-S4369/2241"}]
["2017-03-25","Sunshine",69,{"$f":"_xlfn.TEXTJOIN(\"-\",,INDEX(($G$10:$G$18,$H$10:$H$18,$I$10:$I$18),MATCH(B432,$F$10:$F$18),,N(IF(1,{1,2,3}))))","v":"Gel Booms-94618-S4369/2297"}]
["2017-03-02","Yanaki",94,{"$f":"_xlfn.TEXTJOIN(\"-\",,INDEX(($G$10:$G$18,$H$10:$H$18,$I$10:$I$18),MATCH(B433,$F$10:$F$18),,N(IF(1,{1,2,3}))))","v":"Colorado Booms-81231-Y9634/2072"}]
["2017-01-02","Eagle",118,{"$f":"_xlfn.TEXTJOIN(\"-\",,INDEX(($G$10:$G$18,$H$10:$H$18,$I$10:$I$18),MATCH(B434,$F$10:$F$18),,N(IF(1,{1,2,3}))))","v":"Colorado Booms-81231-E9634/2386"}]
["2017-01-25","Sunbell",69,{"$f":"_xlfn.TEXTJOIN(\"-\",,INDEX(($G$10:$G$18,$H$10:$H$18,$I$10:$I$18),MATCH(B435,$F$10:$F$18),,N(IF(1,{1,2,3}))))","v":"Gel Booms-94618-S4369/2241"}]
["2017-01-04","Aspen",50,{"$f":"_xlfn.TEXTJOIN(\"-\",,INDEX(($G$10:$G$18,$H$10:$H$18,$I$10:$I$18),MATCH(B436,$F$10:$F$18),,N(IF(1,{1,2,3}))))","v":"Colorado Booms-81231-A9634/2650"}]
["2017-02-19","Carlota",92,{"$f":"_xlfn.TEXTJOIN(\"-\",,INDEX(($G$10:$G$18,$H$10:$H$18,$I$10:$I$18),MATCH(B437,$F$10:$F$18),,N(IF(1,{1,2,3}))))","v":"Gel Booms-94608-C4369/2213"}]
["2017-02-04","Carlota",63,{"$f":"_xlfn.TEXTJOIN(\"-\",,INDEX(($G$10:$G$18,$H$10:$H$18,$I$10:$I$18),MATCH(B438,$F$10:$F$18),,N(IF(1,{1,2,3}))))","v":"Gel Booms-94608-C4369/2213"}]
["2017-01-02","Carlota",64,{"$f":"_xlfn.TEXTJOIN(\"-\",,INDEX(($G$10:$G$18,$H$10:$H$18,$I$10:$I$18),MATCH(B439,$F$10:$F$18),,N(IF(1,{1,2,3}))))","v":"Gel Booms-94608-C4369/2213"}]
["2017-03-22","TriBoom",115,{"$f":"_xlfn.TEXTJOIN(\"-\",,INDEX(($G$10:$G$18,$H$10:$H$18,$I$10:$I$18),MATCH(B440,$F$10:$F$18),,N(IF(1,{1,2,3}))))","v":"Colorado Booms-90009-T9634/2372"}]
["2017-02-08","TriBoom",76,{"$f":"_xlfn.TEXTJOIN(\"-\",,INDEX(($G$10:$G$18,$H$10:$H$18,$I$10:$I$18),MATCH(B441,$F$10:$F$18),,N(IF(1,{1,2,3}))))","v":"Colorado Booms-90009-T9634/2372"}]
["2017-01-25","TriBoom",30,{"$f":"_xlfn.TEXTJOIN(\"-\",,INDEX(($G$10:$G$18,$H$10:$H$18,$I$10:$I$18),MATCH(B442,$F$10:$F$18),,N(IF(1,{1,2,3}))))","v":"Colorado Booms-90009-T9634/2372"}]
["2017-02-14","Bellen",106,{"$f":"_xlfn.TEXTJOIN(\"-\",,INDEX(($G$10:$G$18,$H$10:$H$18,$I$10:$I$18),MATCH(B443,$F$10:$F$18),,N(IF(1,{1,2,3}))))","v":"Gel Booms-94618-B4369/2593"}]
["2017-02-26","Aspen",28,{"$f":"_xlfn.TEXTJOIN(\"-\",,INDEX(($G$10:$G$18,$H$10:$H$18,$I$10:$I$18),MATCH(B444,$F$10:$F$18),,N(IF(1,{1,2,3}))))","v":"Colorado Booms-81231-A9634/2650"}]
["2017-02-12","Eagle",67,{"$f":"_xlfn.TEXTJOIN(\"-\",,INDEX(($G$10:$G$18,$H$10:$H$18,$I$10:$I$18),MATCH(B445,$F$10:$F$18),,N(IF(1,{1,2,3}))))","v":"Colorado Booms-81231-E9634/2386"}]
["2017-02-14","Eagle",70,{"$f":"_xlfn.TEXTJOIN(\"-\",,INDEX(($G$10:$G$18,$H$10:$H$18,$I$10:$I$18),MATCH(B446,$F$10:$F$18),,N(IF(1,{1,2,3}))))","v":"Colorado Booms-81231-E9634/2386"}]
["2017-01-24","TriBoom",78,{"$f":"_xlfn.TEXTJOIN(\"-\",,INDEX(($G$10:$G$18,$H$10:$H$18,$I$10:$I$18),MATCH(B447,$F$10:$F$18),,N(IF(1,{1,2,3}))))","v":"Colorado Booms-90009-T9634/2372"}]
["2017-02-23","Aspen",44,{"$f":"_xlfn.TEXTJOIN(\"-\",,INDEX(($G$10:$G$18,$H$10:$H$18,$I$10:$I$18),MATCH(B448,$F$10:$F$18),,N(IF(1,{1,2,3}))))","v":"Colorado Booms-81231-A9634/2650"}]
["2017-01-18","Aspen",80,{"$f":"_xlfn.TEXTJOIN(\"-\",,INDEX(($G$10:$G$18,$H$10:$H$18,$I$10:$I$18),MATCH(B449,$F$10:$F$18),,N(IF(1,{1,2,3}))))","v":"Colorado Booms-81231-A9634/2650"}]
["2017-02-18","Quad",38,{"$f":"_xlfn.TEXTJOIN(\"-\",,INDEX(($G$10:$G$18,$H$10:$H$18,$I$10:$I$18),MATCH(B450,$F$10:$F$18),,N(IF(1,{1,2,3}))))","v":"Gel Booms-94608-Q4369/2290"}]
["2017-03-10","Carlota",47,{"$f":"_xlfn.TEXTJOIN(\"-\",,INDEX(($G$10:$G$18,$H$10:$H$18,$I$10:$I$18),MATCH(B451,$F$10:$F$18),,N(IF(1,{1,2,3}))))","v":"Gel Booms-94608-C4369/2213"}]
["2017-03-31","Sunbell",64,{"$f":"_xlfn.TEXTJOIN(\"-\",,INDEX(($G$10:$G$18,$H$10:$H$18,$I$10:$I$18),MATCH(B452,$F$10:$F$18),,N(IF(1,{1,2,3}))))","v":"Gel Booms-94618-S4369/2241"}]
["2017-01-12","Eagle",43,{"$f":"_xlfn.TEXTJOIN(\"-\",,INDEX(($G$10:$G$18,$H$10:$H$18,$I$10:$I$18),MATCH(B453,$F$10:$F$18),,N(IF(1,{1,2,3}))))","v":"Colorado Booms-81231-E9634/2386"}]
["2017-01-30","Yanaki",101,{"$f":"_xlfn.TEXTJOIN(\"-\",,INDEX(($G$10:$G$18,$H$10:$H$18,$I$10:$I$18),MATCH(B454,$F$10:$F$18),,N(IF(1,{1,2,3}))))","v":"Colorado Booms-81231-Y9634/2072"}]
["2017-01-30","Quad",97,{"$f":"_xlfn.TEXTJOIN(\"-\",,INDEX(($G$10:$G$18,$H$10:$H$18,$I$10:$I$18),MATCH(B455,$F$10:$F$18),,N(IF(1,{1,2,3}))))","v":"Gel Booms-94608-Q4369/2290"}]
["2017-03-09","TriBoom",63,{"$f":"_xlfn.TEXTJOIN(\"-\",,INDEX(($G$10:$G$18,$H$10:$H$18,$I$10:$I$18),MATCH(B456,$F$10:$F$18),,N(IF(1,{1,2,3}))))","v":"Colorado Booms-90009-T9634/2372"}]
["2017-02-06","Bellen",80,{"$f":"_xlfn.TEXTJOIN(\"-\",,INDEX(($G$10:$G$18,$H$10:$H$18,$I$10:$I$18),MATCH(B457,$F$10:$F$18),,N(IF(1,{1,2,3}))))","v":"Gel Booms-94618-B4369/2593"}]
["2017-03-24","Eagle",44,{"$f":"_xlfn.TEXTJOIN(\"-\",,INDEX(($G$10:$G$18,$H$10:$H$18,$I$10:$I$18),MATCH(B458,$F$10:$F$18),,N(IF(1,{1,2,3}))))","v":"Colorado Booms-81231-E9634/2386"}]
["2017-02-18","Sunbell",37,{"$f":"_xlfn.TEXTJOIN(\"-\",,INDEX(($G$10:$G$18,$H$10:$H$18,$I$10:$I$18),MATCH(B459,$F$10:$F$18),,N(IF(1,{1,2,3}))))","v":"Gel Booms-94618-S4369/2241"}]
["2017-01-30","Sunbell",65,{"$f":"_xlfn.TEXTJOIN(\"-\",,INDEX(($G$10:$G$18,$H$10:$H$18,$I$10:$I$18),MATCH(B460,$F$10:$F$18),,N(IF(1,{1,2,3}))))","v":"Gel Booms-94618-S4369/2241"}]
["2017-01-29","TriBoom",64,{"$f":"_xlfn.TEXTJOIN(\"-\",,INDEX(($G$10:$G$18,$H$10:$H$18,$I$10:$I$18),MATCH(B461,$F$10:$F$18),,N(IF(1,{1,2,3}))))","v":"Colorado Booms-90009-T9634/2372"}]
["2017-02-17","Aspen",75,{"$f":"_xlfn.TEXTJOIN(\"-\",,INDEX(($G$10:$G$18,$H$10:$H$18,$I$10:$I$18),MATCH(B462,$F$10:$F$18),,N(IF(1,{1,2,3}))))","v":"Colorado Booms-81231-A9634/2650"}]
["2017-02-16","Aspen",98,{"$f":"_xlfn.TEXTJOIN(\"-\",,INDEX(($G$10:$G$18,$H$10:$H$18,$I$10:$I$18),MATCH(B463,$F$10:$F$18),,N(IF(1,{1,2,3}))))","v":"Colorado Booms-81231-A9634/2650"}]
["2017-02-18","Carlota",83,{"$f":"_xlfn.TEXTJOIN(\"-\",,INDEX(($G$10:$G$18,$H$10:$H$18,$I$10:$I$18),MATCH(B464,$F$10:$F$18),,N(IF(1,{1,2,3}))))","v":"Gel Booms-94608-C4369/2213"}]
["2017-02-05","Bellen",76,{"$f":"_xlfn.TEXTJOIN(\"-\",,INDEX(($G$10:$G$18,$H$10:$H$18,$I$10:$I$18),MATCH(B465,$F$10:$F$18),,N(IF(1,{1,2,3}))))","v":"Gel Booms-94618-B4369/2593"}]
["2017-02-22","TriBoom",80,{"$f":"_xlfn.TEXTJOIN(\"-\",,INDEX(($G$10:$G$18,$H$10:$H$18,$I$10:$I$18),MATCH(B466,$F$10:$F$18),,N(IF(1,{1,2,3}))))","v":"Colorado Booms-90009-T9634/2372"}]
["2017-02-10","Yanaki",43,{"$f":"_xlfn.TEXTJOIN(\"-\",,INDEX(($G$10:$G$18,$H$10:$H$18,$I$10:$I$18),MATCH(B467,$F$10:$F$18),,N(IF(1,{1,2,3}))))","v":"Colorado Booms-81231-Y9634/2072"}]
["2017-01-30","Sunbell",71,{"$f":"_xlfn.TEXTJOIN(\"-\",,INDEX(($G$10:$G$18,$H$10:$H$18,$I$10:$I$18),MATCH(B468,$F$10:$F$18),,N(IF(1,{1,2,3}))))","v":"Gel Booms-94618-S4369/2241"}]
["2017-03-09","Bellen",119,{"$f":"_xlfn.TEXTJOIN(\"-\",,INDEX(($G$10:$G$18,$H$10:$H$18,$I$10:$I$18),MATCH(B469,$F$10:$F$18),,N(IF(1,{1,2,3}))))","v":"Gel Booms-94618-B4369/2593"}]
["2017-02-08","Bellen",91,{"$f":"_xlfn.TEXTJOIN(\"-\",,INDEX(($G$10:$G$18,$H$10:$H$18,$I$10:$I$18),MATCH(B470,$F$10:$F$18),,N(IF(1,{1,2,3}))))","v":"Gel Booms-94618-B4369/2593"}]
["2017-03-23","Sunshine",111,{"$f":"_xlfn.TEXTJOIN(\"-\",,INDEX(($G$10:$G$18,$H$10:$H$18,$I$10:$I$18),MATCH(B471,$F$10:$F$18),,N(IF(1,{1,2,3}))))","v":"Gel Booms-94618-S4369/2297"}]
["2017-03-25","Aspen",80,{"$f":"_xlfn.TEXTJOIN(\"-\",,INDEX(($G$10:$G$18,$H$10:$H$18,$I$10:$I$18),MATCH(B472,$F$10:$F$18),,N(IF(1,{1,2,3}))))","v":"Colorado Booms-81231-A9634/2650"}]
["2017-02-18","Carlota",23,{"$f":"_xlfn.TEXTJOIN(\"-\",,INDEX(($G$10:$G$18,$H$10:$H$18,$I$10:$I$18),MATCH(B473,$F$10:$F$18),,N(IF(1,{1,2,3}))))","v":"Gel Booms-94608-C4369/2213"}]
["2017-03-20","Carlota",65,{"$f":"_xlfn.TEXTJOIN(\"-\",,INDEX(($G$10:$G$18,$H$10:$H$18,$I$10:$I$18),MATCH(B474,$F$10:$F$18),,N(IF(1,{1,2,3}))))","v":"Gel Booms-94608-C4369/2213"}]
["2017-02-21","Aspen",34,{"$f":"_xlfn.TEXTJOIN(\"-\",,INDEX(($G$10:$G$18,$H$10:$H$18,$I$10:$I$18),MATCH(B475,$F$10:$F$18),,N(IF(1,{1,2,3}))))","v":"Colorado Booms-81231-A9634/2650"}]
["2017-01-24","Aspen",89,{"$f":"_xlfn.TEXTJOIN(\"-\",,INDEX(($G$10:$G$18,$H$10:$H$18,$I$10:$I$18),MATCH(B476,$F$10:$F$18),,N(IF(1,{1,2,3}))))","v":"Colorado Booms-81231-A9634/2650"}]
["2017-03-05","Eagle",132,{"$f":"_xlfn.TEXTJOIN(\"-\",,INDEX(($G$10:$G$18,$H$10:$H$18,$I$10:$I$18),MATCH(B477,$F$10:$F$18),,N(IF(1,{1,2,3}))))","v":"Colorado Booms-81231-E9634/2386"}]
["2017-01-07","Aspen",109,{"$f":"_xlfn.TEXTJOIN(\"-\",,INDEX(($G$10:$G$18,$H$10:$H$18,$I$10:$I$18),MATCH(B478,$F$10:$F$18),,N(IF(1,{1,2,3}))))","v":"Colorado Booms-81231-A9634/2650"}]
["2017-01-13","Yanaki",82,{"$f":"_xlfn.TEXTJOIN(\"-\",,INDEX(($G$10:$G$18,$H$10:$H$18,$I$10:$I$18),MATCH(B479,$F$10:$F$18),,N(IF(1,{1,2,3}))))","v":"Colorado Booms-81231-Y9634/2072"}]
["2017-02-12","Eagle",64,{"$f":"_xlfn.TEXTJOIN(\"-\",,INDEX(($G$10:$G$18,$H$10:$H$18,$I$10:$I$18),MATCH(B480,$F$10:$F$18),,N(IF(1,{1,2,3}))))","v":"Colorado Booms-81231-E9634/2386"}]
["2017-02-03","Bellen",72,{"$f":"_xlfn.TEXTJOIN(\"-\",,INDEX(($G$10:$G$18,$H$10:$H$18,$I$10:$I$18),MATCH(B481,$F$10:$F$18),,N(IF(1,{1,2,3}))))","v":"Gel Booms-94618-B4369/2593"}]
["2017-02-05","Bellen",34,{"$f":"_xlfn.TEXTJOIN(\"-\",,INDEX(($G$10:$G$18,$H$10:$H$18,$I$10:$I$18),MATCH(B482,$F$10:$F$18),,N(IF(1,{1,2,3}))))","v":"Gel Booms-94618-B4369/2593"}]
["2017-01-08","TriBoom",84,{"$f":"_xlfn.TEXTJOIN(\"-\",,INDEX(($G$10:$G$18,$H$10:$H$18,$I$10:$I$18),MATCH(B483,$F$10:$F$18),,N(IF(1,{1,2,3}))))","v":"Colorado Booms-90009-T9634/2372"}]
["2017-03-18","TriBoom",103,{"$f":"_xlfn.TEXTJOIN(\"-\",,INDEX(($G$10:$G$18,$H$10:$H$18,$I$10:$I$18),MATCH(B484,$F$10:$F$18),,N(IF(1,{1,2,3}))))","v":"Colorado Booms-90009-T9634/2372"}]
["2017-01-14","Carlota",110,{"$f":"_xlfn.TEXTJOIN(\"-\",,INDEX(($G$10:$G$18,$H$10:$H$18,$I$10:$I$18),MATCH(B485,$F$10:$F$18),,N(IF(1,{1,2,3}))))","v":"Gel Booms-94608-C4369/2213"}]
["2017-01-16","Aspen",73,{"$f":"_xlfn.TEXTJOIN(\"-\",,INDEX(($G$10:$G$18,$H$10:$H$18,$I$10:$I$18),MATCH(B486,$F$10:$F$18),,N(IF(1,{1,2,3}))))","v":"Colorado Booms-81231-A9634/2650"}]
["2017-01-22","Sunshine",85,{"$f":"_xlfn.TEXTJOIN(\"-\",,INDEX(($G$10:$G$18,$H$10:$H$18,$I$10:$I$18),MATCH(B487,$F$10:$F$18),,N(IF(1,{1,2,3}))))","v":"Gel Booms-94618-S4369/2297"}]
["2017-01-09","Eagle",99,{"$f":"_xlfn.TEXTJOIN(\"-\",,INDEX(($G$10:$G$18,$H$10:$H$18,$I$10:$I$18),MATCH(B488,$F$10:$F$18),,N(IF(1,{1,2,3}))))","v":"Colorado Booms-81231-E9634/2386"}]
["2017-02-25","Eagle",80,{"$f":"_xlfn.TEXTJOIN(\"-\",,INDEX(($G$10:$G$18,$H$10:$H$18,$I$10:$I$18),MATCH(B489,$F$10:$F$18),,N(IF(1,{1,2,3}))))","v":"Colorado Booms-81231-E9634/2386"}]
["2017-03-04","Carlota",89,{"$f":"_xlfn.TEXTJOIN(\"-\",,INDEX(($G$10:$G$18,$H$10:$H$18,$I$10:$I$18),MATCH(B490,$F$10:$F$18),,N(IF(1,{1,2,3}))))","v":"Gel Booms-94608-C4369/2213"}]
["2017-02-04","Carlota",99,{"$f":"_xlfn.TEXTJOIN(\"-\",,INDEX(($G$10:$G$18,$H$10:$H$18,$I$10:$I$18),MATCH(B491,$F$10:$F$18),,N(IF(1,{1,2,3}))))","v":"Gel Booms-94608-C4369/2213"}]
["2017-02-04","Eagle",38,{"$f":"_xlfn.TEXTJOIN(\"-\",,INDEX(($G$10:$G$18,$H$10:$H$18,$I$10:$I$18),MATCH(B492,$F$10:$F$18),,N(IF(1,{1,2,3}))))","v":"Colorado Booms-81231-E9634/2386"}]
["2017-03-09","Aspen",69,{"$f":"_xlfn.TEXTJOIN(\"-\",,INDEX(($G$10:$G$18,$H$10:$H$18,$I$10:$I$18),MATCH(B493,$F$10:$F$18),,N(IF(1,{1,2,3}))))","v":"Colorado Booms-81231-A9634/2650"}]
["2017-03-11","Sunbell",83,{"$f":"_xlfn.TEXTJOIN(\"-\",,INDEX(($G$10:$G$18,$H$10:$H$18,$I$10:$I$18),MATCH(B494,$F$10:$F$18),,N(IF(1,{1,2,3}))))","v":"Gel Booms-94618-S4369/2241"}]
["2017-01-16","Carlota",83,{"$f":"_xlfn.TEXTJOIN(\"-\",,INDEX(($G$10:$G$18,$H$10:$H$18,$I$10:$I$18),MATCH(B495,$F$10:$F$18),,N(IF(1,{1,2,3}))))","v":"Gel Booms-94608-C4369/2213"}]
["2017-03-18","Bellen",29,{"$f":"_xlfn.TEXTJOIN(\"-\",,INDEX(($G$10:$G$18,$H$10:$H$18,$I$10:$I$18),MATCH(B496,$F$10:$F$18),,N(IF(1,{1,2,3}))))","v":"Gel Booms-94618-B4369/2593"}]
["2017-01-22","TriBoom",73,{"$f":"_xlfn.TEXTJOIN(\"-\",,INDEX(($G$10:$G$18,$H$10:$H$18,$I$10:$I$18),MATCH(B497,$F$10:$F$18),,N(IF(1,{1,2,3}))))","v":"Colorado Booms-90009-T9634/2372"}]
["2017-02-15","Aspen",72,{"$f":"_xlfn.TEXTJOIN(\"-\",,INDEX(($G$10:$G$18,$H$10:$H$18,$I$10:$I$18),MATCH(B498,$F$10:$F$18),,N(IF(1,{1,2,3}))))","v":"Colorado Booms-81231-A9634/2650"}]
["2017-03-21","TriBoom",72,{"$f":"_xlfn.TEXTJOIN(\"-\",,INDEX(($G$10:$G$18,$H$10:$H$18,$I$10:$I$18),MATCH(B499,$F$10:$F$18),,N(IF(1,{1,2,3}))))","v":"Colorado Booms-90009-T9634/2372"}]
["2017-03-12","Aspen",103,{"$f":"_xlfn.TEXTJOIN(\"-\",,INDEX(($G$10:$G$18,$H$10:$H$18,$I$10:$I$18),MATCH(B500,$F$10:$F$18),,N(IF(1,{1,2,3}))))","v":"Colorado Booms-81231-A9634/2650"}]
["2017-02-15","Bellen",104,{"$f":"_xlfn.TEXTJOIN(\"-\",,INDEX(($G$10:$G$18,$H$10:$H$18,$I$10:$I$18),MATCH(B501,$F$10:$F$18),,N(IF(1,{1,2,3}))))","v":"Gel Booms-94618-B4369/2593"}]
["2017-01-14","Aspen",91,{"$f":"_xlfn.TEXTJOIN(\"-\",,INDEX(($G$10:$G$18,$H$10:$H$18,$I$10:$I$18),MATCH(B502,$F$10:$F$18),,N(IF(1,{1,2,3}))))","v":"Colorado Booms-81231-A9634/2650"}]
["2017-01-15","TriBoom",78,{"$f":"_xlfn.TEXTJOIN(\"-\",,INDEX(($G$10:$G$18,$H$10:$H$18,$I$10:$I$18),MATCH(B503,$F$10:$F$18),,N(IF(1,{1,2,3}))))","v":"Colorado Booms-90009-T9634/2372"}]
["2017-03-16","Sunbell",57,{"$f":"_xlfn.TEXTJOIN(\"-\",,INDEX(($G$10:$G$18,$H$10:$H$18,$I$10:$I$18),MATCH(B504,$F$10:$F$18),,N(IF(1,{1,2,3}))))","v":"Gel Booms-94618-S4369/2241"}]
["2017-02-07","Sunbell",103,{"$f":"_xlfn.TEXTJOIN(\"-\",,INDEX(($G$10:$G$18,$H$10:$H$18,$I$10:$I$18),MATCH(B505,$F$10:$F$18),,N(IF(1,{1,2,3}))))","v":"Gel Booms-94618-S4369/2241"}]
["2017-03-02","TriBoom",89,{"$f":"_xlfn.TEXTJOIN(\"-\",,INDEX(($G$10:$G$18,$H$10:$H$18,$I$10:$I$18),MATCH(B506,$F$10:$F$18),,N(IF(1,{1,2,3}))))","v":"Colorado Booms-90009-T9634/2372"}]
["2017-01-10","Bellen",100,{"$f":"_xlfn.TEXTJOIN(\"-\",,INDEX(($G$10:$G$18,$H$10:$H$18,$I$10:$I$18),MATCH(B507,$F$10:$F$18),,N(IF(1,{1,2,3}))))","v":"Gel Booms-94618-B4369/2593"}]
["2017-01-07","Bellen",108,{"$f":"_xlfn.TEXTJOIN(\"-\",,INDEX(($G$10:$G$18,$H$10:$H$18,$I$10:$I$18),MATCH(B508,$F$10:$F$18),,N(IF(1,{1,2,3}))))","v":"Gel Booms-94618-B4369/2593"}]
["2017-01-13","Yanaki",74,{"$f":"_xlfn.TEXTJOIN(\"-\",,INDEX(($G$10:$G$18,$H$10:$H$18,$I$10:$I$18),MATCH(B509,$F$10:$F$18),,N(IF(1,{1,2,3}))))","v":"Colorado Booms-81231-Y9634/2072"}]
["2017-01-16","Yanaki",96,{"$f":"_xlfn.TEXTJOIN(\"-\",,INDEX(($G$10:$G$18,$H$10:$H$18,$I$10:$I$18),MATCH(B510,$F$10:$F$18),,N(IF(1,{1,2,3}))))","v":"Colorado Booms-81231-Y9634/2072"}]
["2017-02-19","Sunshine",63,{"$f":"_xlfn.TEXTJOIN(\"-\",,INDEX(($G$10:$G$18,$H$10:$H$18,$I$10:$I$18),MATCH(B511,$F$10:$F$18),,N(IF(1,{1,2,3}))))","v":"Gel Booms-94618-S4369/2297"}]
["2017-01-04","Sunshine",116,{"$f":"_xlfn.TEXTJOIN(\"-\",,INDEX(($G$10:$G$18,$H$10:$H$18,$I$10:$I$18),MATCH(B512,$F$10:$F$18),,N(IF(1,{1,2,3}))))","v":"Gel Booms-94618-S4369/2297"}]
["2017-01-31","Eagle",55,{"$f":"_xlfn.TEXTJOIN(\"-\",,INDEX(($G$10:$G$18,$H$10:$H$18,$I$10:$I$18),MATCH(B513,$F$10:$F$18),,N(IF(1,{1,2,3}))))","v":"Colorado Booms-81231-E9634/2386"}]
["2017-01-06","Bellen",85,{"$f":"_xlfn.TEXTJOIN(\"-\",,INDEX(($G$10:$G$18,$H$10:$H$18,$I$10:$I$18),MATCH(B514,$F$10:$F$18),,N(IF(1,{1,2,3}))))","v":"Gel Booms-94618-B4369/2593"}]
["2017-01-11","Bellen",71,{"$f":"_xlfn.TEXTJOIN(\"-\",,INDEX(($G$10:$G$18,$H$10:$H$18,$I$10:$I$18),MATCH(B515,$F$10:$F$18),,N(IF(1,{1,2,3}))))","v":"Gel Booms-94618-B4369/2593"}]
["2017-02-15","Quad",52,{"$f":"_xlfn.TEXTJOIN(\"-\",,INDEX(($G$10:$G$18,$H$10:$H$18,$I$10:$I$18),MATCH(B516,$F$10:$F$18),,N(IF(1,{1,2,3}))))","v":"Gel Booms-94608-Q4369/2290"}]
["2017-01-25","Aspen",68,{"$f":"_xlfn.TEXTJOIN(\"-\",,INDEX(($G$10:$G$18,$H$10:$H$18,$I$10:$I$18),MATCH(B517,$F$10:$F$18),,N(IF(1,{1,2,3}))))","v":"Colorado Booms-81231-A9634/2650"}]
["2017-01-12","Quad",53,{"$f":"_xlfn.TEXTJOIN(\"-\",,INDEX(($G$10:$G$18,$H$10:$H$18,$I$10:$I$18),MATCH(B518,$F$10:$F$18),,N(IF(1,{1,2,3}))))","v":"Gel Booms-94608-Q4369/2290"}]
["2017-01-19","Sunshine",118,{"$f":"_xlfn.TEXTJOIN(\"-\",,INDEX(($G$10:$G$18,$H$10:$H$18,$I$10:$I$18),MATCH(B519,$F$10:$F$18),,N(IF(1,{1,2,3}))))","v":"Gel Booms-94618-S4369/2297"}]
["2017-03-13","Eagle",71,{"$f":"_xlfn.TEXTJOIN(\"-\",,INDEX(($G$10:$G$18,$H$10:$H$18,$I$10:$I$18),MATCH(B520,$F$10:$F$18),,N(IF(1,{1,2,3}))))","v":"Colorado Booms-81231-E9634/2386"}]
["2017-03-24","Carlota",78,{"$f":"_xlfn.TEXTJOIN(\"-\",,INDEX(($G$10:$G$18,$H$10:$H$18,$I$10:$I$18),MATCH(B521,$F$10:$F$18),,N(IF(1,{1,2,3}))))","v":"Gel Booms-94608-C4369/2213"}]
["2017-02-06","Sunshine",92,{"$f":"_xlfn.TEXTJOIN(\"-\",,INDEX(($G$10:$G$18,$H$10:$H$18,$I$10:$I$18),MATCH(B522,$F$10:$F$18),,N(IF(1,{1,2,3}))))","v":"Gel Booms-94618-S4369/2297"}]
["2017-01-27","Sunshine",70,{"$f":"_xlfn.TEXTJOIN(\"-\",,INDEX(($G$10:$G$18,$H$10:$H$18,$I$10:$I$18),MATCH(B523,$F$10:$F$18),,N(IF(1,{1,2,3}))))","v":"Gel Booms-94618-S4369/2297"}]
["2017-02-05","Quad",87,{"$f":"_xlfn.TEXTJOIN(\"-\",,INDEX(($G$10:$G$18,$H$10:$H$18,$I$10:$I$18),MATCH(B524,$F$10:$F$18),,N(IF(1,{1,2,3}))))","v":"Gel Booms-94608-Q4369/2290"}]
["2017-02-22","Quad",130,{"$f":"_xlfn.TEXTJOIN(\"-\",,INDEX(($G$10:$G$18,$H$10:$H$18,$I$10:$I$18),MATCH(B525,$F$10:$F$18),,N(IF(1,{1,2,3}))))","v":"Gel Booms-94608-Q4369/2290"}]
["2017-02-12","TriBoom",51,{"$f":"_xlfn.TEXTJOIN(\"-\",,INDEX(($G$10:$G$18,$H$10:$H$18,$I$10:$I$18),MATCH(B526,$F$10:$F$18),,N(IF(1,{1,2,3}))))","v":"Colorado Booms-90009-T9634/2372"}]
["2017-03-03","Sunshine",87,{"$f":"_xlfn.TEXTJOIN(\"-\",,INDEX(($G$10:$G$18,$H$10:$H$18,$I$10:$I$18),MATCH(B527,$F$10:$F$18),,N(IF(1,{1,2,3}))))","v":"Gel Booms-94618-S4369/2297"}]
["2017-03-21","Yanaki",82,{"$f":"_xlfn.TEXTJOIN(\"-\",,INDEX(($G$10:$G$18,$H$10:$H$18,$I$10:$I$18),MATCH(B528,$F$10:$F$18),,N(IF(1,{1,2,3}))))","v":"Colorado Booms-81231-Y9634/2072"}]
["2017-02-17","Bellen",70,{"$f":"_xlfn.TEXTJOIN(\"-\",,INDEX(($G$10:$G$18,$H$10:$H$18,$I$10:$I$18),MATCH(B529,$F$10:$F$18),,N(IF(1,{1,2,3}))))","v":"Gel Booms-94618-B4369/2593"}]
["2017-03-04","Yanaki",84,{"$f":"_xlfn.TEXTJOIN(\"-\",,INDEX(($G$10:$G$18,$H$10:$H$18,$I$10:$I$18),MATCH(B530,$F$10:$F$18),,N(IF(1,{1,2,3}))))","v":"Colorado Booms-81231-Y9634/2072"}]
["2017-03-01","Aspen",99,{"$f":"_xlfn.TEXTJOIN(\"-\",,INDEX(($G$10:$G$18,$H$10:$H$18,$I$10:$I$18),MATCH(B531,$F$10:$F$18),,N(IF(1,{1,2,3}))))","v":"Colorado Booms-81231-A9634/2650"}]
["2017-03-24","Yanaki",48,{"$f":"_xlfn.TEXTJOIN(\"-\",,INDEX(($G$10:$G$18,$H$10:$H$18,$I$10:$I$18),MATCH(B532,$F$10:$F$18),,N(IF(1,{1,2,3}))))","v":"Colorado Booms-81231-Y9634/2072"}]
["2017-01-31","Quad",93,{"$f":"_xlfn.TEXTJOIN(\"-\",,INDEX(($G$10:$G$18,$H$10:$H$18,$I$10:$I$18),MATCH(B533,$F$10:$F$18),,N(IF(1,{1,2,3}))))","v":"Gel Booms-94608-Q4369/2290"}]
["2017-01-15","Quad",66,{"$f":"_xlfn.TEXTJOIN(\"-\",,INDEX(($G$10:$G$18,$H$10:$H$18,$I$10:$I$18),MATCH(B534,$F$10:$F$18),,N(IF(1,{1,2,3}))))","v":"Gel Booms-94608-Q4369/2290"}]
["2017-03-01","Yanaki",57,{"$f":"_xlfn.TEXTJOIN(\"-\",,INDEX(($G$10:$G$18,$H$10:$H$18,$I$10:$I$18),MATCH(B535,$F$10:$F$18),,N(IF(1,{1,2,3}))))","v":"Colorado Booms-81231-Y9634/2072"}]
["2017-03-31","Carlota",24,{"$f":"_xlfn.TEXTJOIN(\"-\",,INDEX(($G$10:$G$18,$H$10:$H$18,$I$10:$I$18),MATCH(B536,$F$10:$F$18),,N(IF(1,{1,2,3}))))","v":"Gel Booms-94608-C4369/2213"}]
["2017-02-19","Carlota",121,{"$f":"_xlfn.TEXTJOIN(\"-\",,INDEX(($G$10:$G$18,$H$10:$H$18,$I$10:$I$18),MATCH(B537,$F$10:$F$18),,N(IF(1,{1,2,3}))))","v":"Gel Booms-94608-C4369/2213"}]
["2017-03-25","Bellen",91,{"$f":"_xlfn.TEXTJOIN(\"-\",,INDEX(($G$10:$G$18,$H$10:$H$18,$I$10:$I$18),MATCH(B538,$F$10:$F$18),,N(IF(1,{1,2,3}))))","v":"Gel Booms-94618-B4369/2593"}]
["2017-02-25","TriBoom",87,{"$f":"_xlfn.TEXTJOIN(\"-\",,INDEX(($G$10:$G$18,$H$10:$H$18,$I$10:$I$18),MATCH(B539,$F$10:$F$18),,N(IF(1,{1,2,3}))))","v":"Colorado Booms-90009-T9634/2372"}]
["2017-01-04","Yanaki",77,{"$f":"_xlfn.TEXTJOIN(\"-\",,INDEX(($G$10:$G$18,$H$10:$H$18,$I$10:$I$18),MATCH(B540,$F$10:$F$18),,N(IF(1,{1,2,3}))))","v":"Colorado Booms-81231-Y9634/2072"}]
["2017-01-25","Sunshine",67,{"$f":"_xlfn.TEXTJOIN(\"-\",,INDEX(($G$10:$G$18,$H$10:$H$18,$I$10:$I$18),MATCH(B541,$F$10:$F$18),,N(IF(1,{1,2,3}))))","v":"Gel Booms-94618-S4369/2297"}]
["2017-01-03","Bellen",102,{"$f":"_xlfn.TEXTJOIN(\"-\",,INDEX(($G$10:$G$18,$H$10:$H$18,$I$10:$I$18),MATCH(B542,$F$10:$F$18),,N(IF(1,{1,2,3}))))","v":"Gel Booms-94618-B4369/2593"}]
["2017-01-01","Quad",72,{"$f":"_xlfn.TEXTJOIN(\"-\",,INDEX(($G$10:$G$18,$H$10:$H$18,$I$10:$I$18),MATCH(B543,$F$10:$F$18),,N(IF(1,{1,2,3}))))","v":"Gel Booms-94608-Q4369/2290"}]
["2017-01-05","Sunbell",69,{"$f":"_xlfn.TEXTJOIN(\"-\",,INDEX(($G$10:$G$18,$H$10:$H$18,$I$10:$I$18),MATCH(B544,$F$10:$F$18),,N(IF(1,{1,2,3}))))","v":"Gel Booms-94618-S4369/2241"}]
["2017-03-23","Sunshine",38,{"$f":"_xlfn.TEXTJOIN(\"-\",,INDEX(($G$10:$G$18,$H$10:$H$18,$I$10:$I$18),MATCH(B545,$F$10:$F$18),,N(IF(1,{1,2,3}))))","v":"Gel Booms-94618-S4369/2297"}]
["2017-02-04","Aspen",69,{"$f":"_xlfn.TEXTJOIN(\"-\",,INDEX(($G$10:$G$18,$H$10:$H$18,$I$10:$I$18),MATCH(B546,$F$10:$F$18),,N(IF(1,{1,2,3}))))","v":"Colorado Booms-81231-A9634/2650"}]
["2017-01-25","Bellen",64,{"$f":"_xlfn.TEXTJOIN(\"-\",,INDEX(($G$10:$G$18,$H$10:$H$18,$I$10:$I$18),MATCH(B547,$F$10:$F$18),,N(IF(1,{1,2,3}))))","v":"Gel Booms-94618-B4369/2593"}]
["2017-01-28","TriBoom",35,{"$f":"_xlfn.TEXTJOIN(\"-\",,INDEX(($G$10:$G$18,$H$10:$H$18,$I$10:$I$18),MATCH(B548,$F$10:$F$18),,N(IF(1,{1,2,3}))))","v":"Colorado Booms-90009-T9634/2372"}]
["2017-02-17","Sunbell",95,{"$f":"_xlfn.TEXTJOIN(\"-\",,INDEX(($G$10:$G$18,$H$10:$H$18,$I$10:$I$18),MATCH(B549,$F$10:$F$18),,N(IF(1,{1,2,3}))))","v":"Gel Booms-94618-S4369/2241"}]
["2017-02-23","Carlota",83,{"$f":"_xlfn.TEXTJOIN(\"-\",,INDEX(($G$10:$G$18,$H$10:$H$18,$I$10:$I$18),MATCH(B550,$F$10:$F$18),,N(IF(1,{1,2,3}))))","v":"Gel Booms-94608-C4369/2213"}]
["2017-03-12","Aspen",48,{"$f":"_xlfn.TEXTJOIN(\"-\",,INDEX(($G$10:$G$18,$H$10:$H$18,$I$10:$I$18),MATCH(B551,$F$10:$F$18),,N(IF(1,{1,2,3}))))","v":"Colorado Booms-81231-A9634/2650"}]
["2017-02-07","Carlota",78,{"$f":"_xlfn.TEXTJOIN(\"-\",,INDEX(($G$10:$G$18,$H$10:$H$18,$I$10:$I$18),MATCH(B552,$F$10:$F$18),,N(IF(1,{1,2,3}))))","v":"Gel Booms-94608-C4369/2213"}]
["2017-03-30","TriBoom",57,{"$f":"_xlfn.TEXTJOIN(\"-\",,INDEX(($G$10:$G$18,$H$10:$H$18,$I$10:$I$18),MATCH(B553,$F$10:$F$18),,N(IF(1,{1,2,3}))))","v":"Colorado Booms-90009-T9634/2372"}]
["2017-02-21","Sunbell",84,{"$f":"_xlfn.TEXTJOIN(\"-\",,INDEX(($G$10:$G$18,$H$10:$H$18,$I$10:$I$18),MATCH(B554,$F$10:$F$18),,N(IF(1,{1,2,3}))))","v":"Gel Booms-94618-S4369/2241"}]
["2017-01-23","Eagle",109,{"$f":"_xlfn.TEXTJOIN(\"-\",,INDEX(($G$10:$G$18,$H$10:$H$18,$I$10:$I$18),MATCH(B555,$F$10:$F$18),,N(IF(1,{1,2,3}))))","v":"Colorado Booms-81231-E9634/2386"}]
["2017-02-15","TriBoom",46,{"$f":"_xlfn.TEXTJOIN(\"-\",,INDEX(($G$10:$G$18,$H$10:$H$18,$I$10:$I$18),MATCH(B556,$F$10:$F$18),,N(IF(1,{1,2,3}))))","v":"Colorado Booms-90009-T9634/2372"}]
["2017-03-10","TriBoom",77,{"$f":"_xlfn.TEXTJOIN(\"-\",,INDEX(($G$10:$G$18,$H$10:$H$18,$I$10:$I$18),MATCH(B557,$F$10:$F$18),,N(IF(1,{1,2,3}))))","v":"Colorado Booms-90009-T9634/2372"}]
["2017-03-17","Yanaki",97,{"$f":"_xlfn.TEXTJOIN(\"-\",,INDEX(($G$10:$G$18,$H$10:$H$18,$I$10:$I$18),MATCH(B558,$F$10:$F$18),,N(IF(1,{1,2,3}))))","v":"Colorado Booms-81231-Y9634/2072"}]
["2017-01-24","Sunbell",89,{"$f":"_xlfn.TEXTJOIN(\"-\",,INDEX(($G$10:$G$18,$H$10:$H$18,$I$10:$I$18),MATCH(B559,$F$10:$F$18),,N(IF(1,{1,2,3}))))","v":"Gel Booms-94618-S4369/2241"}]
["2017-03-22","Sunshine",56,{"$f":"_xlfn.TEXTJOIN(\"-\",,INDEX(($G$10:$G$18,$H$10:$H$18,$I$10:$I$18),MATCH(B560,$F$10:$F$18),,N(IF(1,{1,2,3}))))","v":"Gel Booms-94618-S4369/2297"}]
["2017-02-16","Sunbell",77,{"$f":"_xlfn.TEXTJOIN(\"-\",,INDEX(($G$10:$G$18,$H$10:$H$18,$I$10:$I$18),MATCH(B561,$F$10:$F$18),,N(IF(1,{1,2,3}))))","v":"Gel Booms-94618-S4369/2241"}]
["2017-01-25","Quad",72,{"$f":"_xlfn.TEXTJOIN(\"-\",,INDEX(($G$10:$G$18,$H$10:$H$18,$I$10:$I$18),MATCH(B562,$F$10:$F$18),,N(IF(1,{1,2,3}))))","v":"Gel Booms-94608-Q4369/2290"}]
["2017-03-30","Sunshine",53,{"$f":"_xlfn.TEXTJOIN(\"-\",,INDEX(($G$10:$G$18,$H$10:$H$18,$I$10:$I$18),MATCH(B563,$F$10:$F$18),,N(IF(1,{1,2,3}))))","v":"Gel Booms-94618-S4369/2297"}]
["2017-02-26","TriBoom",84,{"$f":"_xlfn.TEXTJOIN(\"-\",,INDEX(($G$10:$G$18,$H$10:$H$18,$I$10:$I$18),MATCH(B564,$F$10:$F$18),,N(IF(1,{1,2,3}))))","v":"Colorado Booms-90009-T9634/2372"}]
["2017-01-04","Bellen",85,{"$f":"_xlfn.TEXTJOIN(\"-\",,INDEX(($G$10:$G$18,$H$10:$H$18,$I$10:$I$18),MATCH(B565,$F$10:$F$18),,N(IF(1,{1,2,3}))))","v":"Gel Booms-94618-B4369/2593"}]
["2017-01-08","Sunbell",105,{"$f":"_xlfn.TEXTJOIN(\"-\",,INDEX(($G$10:$G$18,$H$10:$H$18,$I$10:$I$18),MATCH(B566,$F$10:$F$18),,N(IF(1,{1,2,3}))))","v":"Gel Booms-94618-S4369/2241"}]
["2017-03-22","Sunbell",84,{"$f":"_xlfn.TEXTJOIN(\"-\",,INDEX(($G$10:$G$18,$H$10:$H$18,$I$10:$I$18),MATCH(B567,$F$10:$F$18),,N(IF(1,{1,2,3}))))","v":"Gel Booms-94618-S4369/2241"}]
["2017-01-10","Eagle",98,{"$f":"_xlfn.TEXTJOIN(\"-\",,INDEX(($G$10:$G$18,$H$10:$H$18,$I$10:$I$18),MATCH(B568,$F$10:$F$18),,N(IF(1,{1,2,3}))))","v":"Colorado Booms-81231-E9634/2386"}]
["2017-01-29","Eagle",73,{"$f":"_xlfn.TEXTJOIN(\"-\",,INDEX(($G$10:$G$18,$H$10:$H$18,$I$10:$I$18),MATCH(B569,$F$10:$F$18),,N(IF(1,{1,2,3}))))","v":"Colorado Booms-81231-E9634/2386"}]
["2017-03-11","TriBoom",45,{"$f":"_xlfn.TEXTJOIN(\"-\",,INDEX(($G$10:$G$18,$H$10:$H$18,$I$10:$I$18),MATCH(B570,$F$10:$F$18),,N(IF(1,{1,2,3}))))","v":"Colorado Booms-90009-T9634/2372"}]
["2017-02-02","Carlota",96,{"$f":"_xlfn.TEXTJOIN(\"-\",,INDEX(($G$10:$G$18,$H$10:$H$18,$I$10:$I$18),MATCH(B571,$F$10:$F$18),,N(IF(1,{1,2,3}))))","v":"Gel Booms-94608-C4369/2213"}]
["2017-03-20","Bellen",80,{"$f":"_xlfn.TEXTJOIN(\"-\",,INDEX(($G$10:$G$18,$H$10:$H$18,$I$10:$I$18),MATCH(B572,$F$10:$F$18),,N(IF(1,{1,2,3}))))","v":"Gel Booms-94618-B4369/2593"}]
["2017-02-15","Carlota",46,{"$f":"_xlfn.TEXTJOIN(\"-\",,INDEX(($G$10:$G$18,$H$10:$H$18,$I$10:$I$18),MATCH(B573,$F$10:$F$18),,N(IF(1,{1,2,3}))))","v":"Gel Booms-94608-C4369/2213"}]
["2017-03-18","Yanaki",108,{"$f":"_xlfn.TEXTJOIN(\"-\",,INDEX(($G$10:$G$18,$H$10:$H$18,$I$10:$I$18),MATCH(B574,$F$10:$F$18),,N(IF(1,{1,2,3}))))","v":"Colorado Booms-81231-Y9634/2072"}]
["2017-03-15","Sunshine",114,{"$f":"_xlfn.TEXTJOIN(\"-\",,INDEX(($G$10:$G$18,$H$10:$H$18,$I$10:$I$18),MATCH(B575,$F$10:$F$18),,N(IF(1,{1,2,3}))))","v":"Gel Booms-94618-S4369/2297"}]
["2017-03-23","Quad",99,{"$f":"_xlfn.TEXTJOIN(\"-\",,INDEX(($G$10:$G$18,$H$10:$H$18,$I$10:$I$18),MATCH(B576,$F$10:$F$18),,N(IF(1,{1,2,3}))))","v":"Gel Booms-94608-Q4369/2290"}]
["2017-01-21","Sunshine",46,{"$f":"_xlfn.TEXTJOIN(\"-\",,INDEX(($G$10:$G$18,$H$10:$H$18,$I$10:$I$18),MATCH(B577,$F$10:$F$18),,N(IF(1,{1,2,3}))))","v":"Gel Booms-94618-S4369/2297"}]
["2017-02-01","Aspen",71,{"$f":"_xlfn.TEXTJOIN(\"-\",,INDEX(($G$10:$G$18,$H$10:$H$18,$I$10:$I$18),MATCH(B578,$F$10:$F$18),,N(IF(1,{1,2,3}))))","v":"Colorado Booms-81231-A9634/2650"}]
["2017-03-01","Quad",88,{"$f":"_xlfn.TEXTJOIN(\"-\",,INDEX(($G$10:$G$18,$H$10:$H$18,$I$10:$I$18),MATCH(B579,$F$10:$F$18),,N(IF(1,{1,2,3}))))","v":"Gel Booms-94608-Q4369/2290"}]
["2017-03-23","TriBoom",79,{"$f":"_xlfn.TEXTJOIN(\"-\",,INDEX(($G$10:$G$18,$H$10:$H$18,$I$10:$I$18),MATCH(B580,$F$10:$F$18),,N(IF(1,{1,2,3}))))","v":"Colorado Booms-90009-T9634/2372"}]
["2017-03-29","Bellen",35,{"$f":"_xlfn.TEXTJOIN(\"-\",,INDEX(($G$10:$G$18,$H$10:$H$18,$I$10:$I$18),MATCH(B581,$F$10:$F$18),,N(IF(1,{1,2,3}))))","v":"Gel Booms-94618-B4369/2593"}]
["2017-02-07","Yanaki",61,{"$f":"_xlfn.TEXTJOIN(\"-\",,INDEX(($G$10:$G$18,$H$10:$H$18,$I$10:$I$18),MATCH(B582,$F$10:$F$18),,N(IF(1,{1,2,3}))))","v":"Colorado Booms-81231-Y9634/2072"}]
["2017-02-25","Aspen",59,{"$f":"_xlfn.TEXTJOIN(\"-\",,INDEX(($G$10:$G$18,$H$10:$H$18,$I$10:$I$18),MATCH(B583,$F$10:$F$18),,N(IF(1,{1,2,3}))))","v":"Colorado Booms-81231-A9634/2650"}]
["2017-02-16","Sunbell",112,{"$f":"_xlfn.TEXTJOIN(\"-\",,INDEX(($G$10:$G$18,$H$10:$H$18,$I$10:$I$18),MATCH(B584,$F$10:$F$18),,N(IF(1,{1,2,3}))))","v":"Gel Booms-94618-S4369/2241"}]
["2017-02-01","Bellen",69,{"$f":"_xlfn.TEXTJOIN(\"-\",,INDEX(($G$10:$G$18,$H$10:$H$18,$I$10:$I$18),MATCH(B585,$F$10:$F$18),,N(IF(1,{1,2,3}))))","v":"Gel Booms-94618-B4369/2593"}]
["2017-02-04","Quad",110,{"$f":"_xlfn.TEXTJOIN(\"-\",,INDEX(($G$10:$G$18,$H$10:$H$18,$I$10:$I$18),MATCH(B586,$F$10:$F$18),,N(IF(1,{1,2,3}))))","v":"Gel Booms-94608-Q4369/2290"}]
["2017-03-22","Sunbell",90,{"$f":"_xlfn.TEXTJOIN(\"-\",,INDEX(($G$10:$G$18,$H$10:$H$18,$I$10:$I$18),MATCH(B587,$F$10:$F$18),,N(IF(1,{1,2,3}))))","v":"Gel Booms-94618-S4369/2241"}]
["2017-03-29","Aspen",94,{"$f":"_xlfn.TEXTJOIN(\"-\",,INDEX(($G$10:$G$18,$H$10:$H$18,$I$10:$I$18),MATCH(B588,$F$10:$F$18),,N(IF(1,{1,2,3}))))","v":"Colorado Booms-81231-A9634/2650"}]
["2017-01-24","Eagle",85,{"$f":"_xlfn.TEXTJOIN(\"-\",,INDEX(($G$10:$G$18,$H$10:$H$18,$I$10:$I$18),MATCH(B589,$F$10:$F$18),,N(IF(1,{1,2,3}))))","v":"Colorado Booms-81231-E9634/2386"}]
["2017-01-21","TriBoom",62,{"$f":"_xlfn.TEXTJOIN(\"-\",,INDEX(($G$10:$G$18,$H$10:$H$18,$I$10:$I$18),MATCH(B590,$F$10:$F$18),,N(IF(1,{1,2,3}))))","v":"Colorado Booms-90009-T9634/2372"}]
["2017-02-26","Yanaki",109,{"$f":"_xlfn.TEXTJOIN(\"-\",,INDEX(($G$10:$G$18,$H$10:$H$18,$I$10:$I$18),MATCH(B591,$F$10:$F$18),,N(IF(1,{1,2,3}))))","v":"Colorado Booms-81231-Y9634/2072"}]
["2017-02-11","Sunshine",63,{"$f":"_xlfn.TEXTJOIN(\"-\",,INDEX(($G$10:$G$18,$H$10:$H$18,$I$10:$I$18),MATCH(B592,$F$10:$F$18),,N(IF(1,{1,2,3}))))","v":"Gel Booms-94618-S4369/2297"}]
["2017-01-31","Carlota",60,{"$f":"_xlfn.TEXTJOIN(\"-\",,INDEX(($G$10:$G$18,$H$10:$H$18,$I$10:$I$18),MATCH(B593,$F$10:$F$18),,N(IF(1,{1,2,3}))))","v":"Gel Booms-94608-C4369/2213"}]
["2017-01-03","Eagle",107,{"$f":"_xlfn.TEXTJOIN(\"-\",,INDEX(($G$10:$G$18,$H$10:$H$18,$I$10:$I$18),MATCH(B594,$F$10:$F$18),,N(IF(1,{1,2,3}))))","v":"Colorado Booms-81231-E9634/2386"}]
["2017-02-05","Sunshine",69,{"$f":"_xlfn.TEXTJOIN(\"-\",,INDEX(($G$10:$G$18,$H$10:$H$18,$I$10:$I$18),MATCH(B595,$F$10:$F$18),,N(IF(1,{1,2,3}))))","v":"Gel Booms-94618-S4369/2297"}]
["2017-02-20","Yanaki",81,{"$f":"_xlfn.TEXTJOIN(\"-\",,INDEX(($G$10:$G$18,$H$10:$H$18,$I$10:$I$18),MATCH(B596,$F$10:$F$18),,N(IF(1,{1,2,3}))))","v":"Colorado Booms-81231-Y9634/2072"}]
["2017-03-04","Yanaki",89,{"$f":"_xlfn.TEXTJOIN(\"-\",,INDEX(($G$10:$G$18,$H$10:$H$18,$I$10:$I$18),MATCH(B597,$F$10:$F$18),,N(IF(1,{1,2,3}))))","v":"Colorado Booms-81231-Y9634/2072"}]
["2017-02-13","TriBoom",48,{"$f":"_xlfn.TEXTJOIN(\"-\",,INDEX(($G$10:$G$18,$H$10:$H$18,$I$10:$I$18),MATCH(B598,$F$10:$F$18),,N(IF(1,{1,2,3}))))","v":"Colorado Booms-90009-T9634/2372"}]
["2017-01-10","Carlota",36,{"$f":"_xlfn.TEXTJOIN(\"-\",,INDEX(($G$10:$G$18,$H$10:$H$18,$I$10:$I$18),MATCH(B599,$F$10:$F$18),,N(IF(1,{1,2,3}))))","v":"Gel Booms-94608-C4369/2213"}]
["2017-02-24","Yanaki",78,{"$f":"_xlfn.TEXTJOIN(\"-\",,INDEX(($G$10:$G$18,$H$10:$H$18,$I$10:$I$18),MATCH(B600,$F$10:$F$18),,N(IF(1,{1,2,3}))))","v":"Colorado Booms-81231-Y9634/2072"}]
["2017-01-11","Aspen",58,{"$f":"_xlfn.TEXTJOIN(\"-\",,INDEX(($G$10:$G$18,$H$10:$H$18,$I$10:$I$18),MATCH(B601,$F$10:$F$18),,N(IF(1,{1,2,3}))))","v":"Colorado Booms-81231-A9634/2650"}]
["2017-01-19","Yanaki",105,{"$f":"_xlfn.TEXTJOIN(\"-\",,INDEX(($G$10:$G$18,$H$10:$H$18,$I$10:$I$18),MATCH(B602,$F$10:$F$18),,N(IF(1,{1,2,3}))))","v":"Colorado Booms-81231-Y9634/2072"}]
["2017-02-05","Aspen",94,{"$f":"_xlfn.TEXTJOIN(\"-\",,INDEX(($G$10:$G$18,$H$10:$H$18,$I$10:$I$18),MATCH(B603,$F$10:$F$18),,N(IF(1,{1,2,3}))))","v":"Colorado Booms-81231-A9634/2650"}]
["2017-01-18","Eagle",80,{"$f":"_xlfn.TEXTJOIN(\"-\",,INDEX(($G$10:$G$18,$H$10:$H$18,$I$10:$I$18),MATCH(B604,$F$10:$F$18),,N(IF(1,{1,2,3}))))","v":"Colorado Booms-81231-E9634/2386"}]
["2017-02-21","Carlota",47,{"$f":"_xlfn.TEXTJOIN(\"-\",,INDEX(($G$10:$G$18,$H$10:$H$18,$I$10:$I$18),MATCH(B605,$F$10:$F$18),,N(IF(1,{1,2,3}))))","v":"Gel Booms-94608-C4369/2213"}]
["2017-02-22","TriBoom",103,{"$f":"_xlfn.TEXTJOIN(\"-\",,INDEX(($G$10:$G$18,$H$10:$H$18,$I$10:$I$18),MATCH(B606,$F$10:$F$18),,N(IF(1,{1,2,3}))))","v":"Colorado Booms-90009-T9634/2372"}]
["2017-02-14","Bellen",50,{"$f":"_xlfn.TEXTJOIN(\"-\",,INDEX(($G$10:$G$18,$H$10:$H$18,$I$10:$I$18),MATCH(B607,$F$10:$F$18),,N(IF(1,{1,2,3}))))","v":"Gel Booms-94618-B4369/2593"}]
["2017-02-01","Aspen",101,{"$f":"_xlfn.TEXTJOIN(\"-\",,INDEX(($G$10:$G$18,$H$10:$H$18,$I$10:$I$18),MATCH(B608,$F$10:$F$18),,N(IF(1,{1,2,3}))))","v":"Colorado Booms-81231-A9634/2650"}]
["2017-01-29","Sunshine",78,{"$f":"_xlfn.TEXTJOIN(\"-\",,INDEX(($G$10:$G$18,$H$10:$H$18,$I$10:$I$18),MATCH(B609,$F$10:$F$18),,N(IF(1,{1,2,3}))))","v":"Gel Booms-94618-S4369/2297"}]
["2017-03-24","Sunbell",74,{"$f":"_xlfn.TEXTJOIN(\"-\",,INDEX(($G$10:$G$18,$H$10:$H$18,$I$10:$I$18),MATCH(B610,$F$10:$F$18),,N(IF(1,{1,2,3}))))","v":"Gel Booms-94618-S4369/2241"}]
["2017-01-02","Bellen",80,{"$f":"_xlfn.TEXTJOIN(\"-\",,INDEX(($G$10:$G$18,$H$10:$H$18,$I$10:$I$18),MATCH(B611,$F$10:$F$18),,N(IF(1,{1,2,3}))))","v":"Gel Booms-94618-B4369/2593"}]
["2017-02-06","Bellen",103,{"$f":"_xlfn.TEXTJOIN(\"-\",,INDEX(($G$10:$G$18,$H$10:$H$18,$I$10:$I$18),MATCH(B612,$F$10:$F$18),,N(IF(1,{1,2,3}))))","v":"Gel Booms-94618-B4369/2593"}]
["2017-02-09","Carlota",106,{"$f":"_xlfn.TEXTJOIN(\"-\",,INDEX(($G$10:$G$18,$H$10:$H$18,$I$10:$I$18),MATCH(B613,$F$10:$F$18),,N(IF(1,{1,2,3}))))","v":"Gel Booms-94608-C4369/2213"}]
["2017-02-12","Quad",62,{"$f":"_xlfn.TEXTJOIN(\"-\",,INDEX(($G$10:$G$18,$H$10:$H$18,$I$10:$I$18),MATCH(B614,$F$10:$F$18),,N(IF(1,{1,2,3}))))","v":"Gel Booms-94608-Q4369/2290"}]
["2017-02-08","Aspen",90,{"$f":"_xlfn.TEXTJOIN(\"-\",,INDEX(($G$10:$G$18,$H$10:$H$18,$I$10:$I$18),MATCH(B615,$F$10:$F$18),,N(IF(1,{1,2,3}))))","v":"Colorado Booms-81231-A9634/2650"}]
["2017-01-22","Bellen",37,{"$f":"_xlfn.TEXTJOIN(\"-\",,INDEX(($G$10:$G$18,$H$10:$H$18,$I$10:$I$18),MATCH(B616,$F$10:$F$18),,N(IF(1,{1,2,3}))))","v":"Gel Booms-94618-B4369/2593"}]
["2017-03-16","Carlota",64,{"$f":"_xlfn.TEXTJOIN(\"-\",,INDEX(($G$10:$G$18,$H$10:$H$18,$I$10:$I$18),MATCH(B617,$F$10:$F$18),,N(IF(1,{1,2,3}))))","v":"Gel Booms-94608-C4369/2213"}]
["2017-03-11","Aspen",128,{"$f":"_xlfn.TEXTJOIN(\"-\",,INDEX(($G$10:$G$18,$H$10:$H$18,$I$10:$I$18),MATCH(B618,$F$10:$F$18),,N(IF(1,{1,2,3}))))","v":"Colorado Booms-81231-A9634/2650"}]
["2017-01-24","TriBoom",80,{"$f":"_xlfn.TEXTJOIN(\"-\",,INDEX(($G$10:$G$18,$H$10:$H$18,$I$10:$I$18),MATCH(B619,$F$10:$F$18),,N(IF(1,{1,2,3}))))","v":"Colorado Booms-90009-T9634/2372"}]
["2017-02-28","Yanaki",106,{"$f":"_xlfn.TEXTJOIN(\"-\",,INDEX(($G$10:$G$18,$H$10:$H$18,$I$10:$I$18),MATCH(B620,$F$10:$F$18),,N(IF(1,{1,2,3}))))","v":"Colorado Booms-81231-Y9634/2072"}]
["2017-02-02","Quad",71,{"$f":"_xlfn.TEXTJOIN(\"-\",,INDEX(($G$10:$G$18,$H$10:$H$18,$I$10:$I$18),MATCH(B621,$F$10:$F$18),,N(IF(1,{1,2,3}))))","v":"Gel Booms-94608-Q4369/2290"}]
["2017-02-08","TriBoom",68,{"$f":"_xlfn.TEXTJOIN(\"-\",,INDEX(($G$10:$G$18,$H$10:$H$18,$I$10:$I$18),MATCH(B622,$F$10:$F$18),,N(IF(1,{1,2,3}))))","v":"Colorado Booms-90009-T9634/2372"}]
["2017-03-09","Sunbell",78,{"$f":"_xlfn.TEXTJOIN(\"-\",,INDEX(($G$10:$G$18,$H$10:$H$18,$I$10:$I$18),MATCH(B623,$F$10:$F$18),,N(IF(1,{1,2,3}))))","v":"Gel Booms-94618-S4369/2241"}]
["2017-03-16","TriBoom",107,{"$f":"_xlfn.TEXTJOIN(\"-\",,INDEX(($G$10:$G$18,$H$10:$H$18,$I$10:$I$18),MATCH(B624,$F$10:$F$18),,N(IF(1,{1,2,3}))))","v":"Colorado Booms-90009-T9634/2372"}]
["2017-02-26","Bellen",82,{"$f":"_xlfn.TEXTJOIN(\"-\",,INDEX(($G$10:$G$18,$H$10:$H$18,$I$10:$I$18),MATCH(B625,$F$10:$F$18),,N(IF(1,{1,2,3}))))","v":"Gel Booms-94618-B4369/2593"}]
["2017-01-23","Yanaki",115,{"$f":"_xlfn.TEXTJOIN(\"-\",,INDEX(($G$10:$G$18,$H$10:$H$18,$I$10:$I$18),MATCH(B626,$F$10:$F$18),,N(IF(1,{1,2,3}))))","v":"Colorado Booms-81231-Y9634/2072"}]
["2017-01-07","Carlota",69,{"$f":"_xlfn.TEXTJOIN(\"-\",,INDEX(($G$10:$G$18,$H$10:$H$18,$I$10:$I$18),MATCH(B627,$F$10:$F$18),,N(IF(1,{1,2,3}))))","v":"Gel Booms-94608-C4369/2213"}]
["2017-01-29","Eagle",99,{"$f":"_xlfn.TEXTJOIN(\"-\",,INDEX(($G$10:$G$18,$H$10:$H$18,$I$10:$I$18),MATCH(B628,$F$10:$F$18),,N(IF(1,{1,2,3}))))","v":"Colorado Booms-81231-E9634/2386"}]
["2017-02-27","Sunbell",93,{"$f":"_xlfn.TEXTJOIN(\"-\",,INDEX(($G$10:$G$18,$H$10:$H$18,$I$10:$I$18),MATCH(B629,$F$10:$F$18),,N(IF(1,{1,2,3}))))","v":"Gel Booms-94618-S4369/2241"}]
["2017-01-19","Carlota",92,{"$f":"_xlfn.TEXTJOIN(\"-\",,INDEX(($G$10:$G$18,$H$10:$H$18,$I$10:$I$18),MATCH(B630,$F$10:$F$18),,N(IF(1,{1,2,3}))))","v":"Gel Booms-94608-C4369/2213"}]
["2017-02-20","TriBoom",21,{"$f":"_xlfn.TEXTJOIN(\"-\",,INDEX(($G$10:$G$18,$H$10:$H$18,$I$10:$I$18),MATCH(B631,$F$10:$F$18),,N(IF(1,{1,2,3}))))","v":"Colorado Booms-90009-T9634/2372"}]
["2017-03-07","Aspen",67,{"$f":"_xlfn.TEXTJOIN(\"-\",,INDEX(($G$10:$G$18,$H$10:$H$18,$I$10:$I$18),MATCH(B632,$F$10:$F$18),,N(IF(1,{1,2,3}))))","v":"Colorado Booms-81231-A9634/2650"}]
["2017-03-01","Carlota",63,{"$f":"_xlfn.TEXTJOIN(\"-\",,INDEX(($G$10:$G$18,$H$10:$H$18,$I$10:$I$18),MATCH(B633,$F$10:$F$18),,N(IF(1,{1,2,3}))))","v":"Gel Booms-94608-C4369/2213"}]
["2017-03-11","Sunbell",65,{"$f":"_xlfn.TEXTJOIN(\"-\",,INDEX(($G$10:$G$18,$H$10:$H$18,$I$10:$I$18),MATCH(B634,$F$10:$F$18),,N(IF(1,{1,2,3}))))","v":"Gel Booms-94618-S4369/2241"}]
["2017-02-05","Eagle",102,{"$f":"_xlfn.TEXTJOIN(\"-\",,INDEX(($G$10:$G$18,$H$10:$H$18,$I$10:$I$18),MATCH(B635,$F$10:$F$18),,N(IF(1,{1,2,3}))))","v":"Colorado Booms-81231-E9634/2386"}]
["2017-02-07","Quad",90,{"$f":"_xlfn.TEXTJOIN(\"-\",,INDEX(($G$10:$G$18,$H$10:$H$18,$I$10:$I$18),MATCH(B636,$F$10:$F$18),,N(IF(1,{1,2,3}))))","v":"Gel Booms-94608-Q4369/2290"}]
["2017-03-01","Sunbell",78,{"$f":"_xlfn.TEXTJOIN(\"-\",,INDEX(($G$10:$G$18,$H$10:$H$18,$I$10:$I$18),MATCH(B637,$F$10:$F$18),,N(IF(1,{1,2,3}))))","v":"Gel Booms-94618-S4369/2241"}]
["2017-03-02","Carlota",74,{"$f":"_xlfn.TEXTJOIN(\"-\",,INDEX(($G$10:$G$18,$H$10:$H$18,$I$10:$I$18),MATCH(B638,$F$10:$F$18),,N(IF(1,{1,2,3}))))","v":"Gel Booms-94608-C4369/2213"}]
["2017-02-07","TriBoom",82,{"$f":"_xlfn.TEXTJOIN(\"-\",,INDEX(($G$10:$G$18,$H$10:$H$18,$I$10:$I$18),MATCH(B639,$F$10:$F$18),,N(IF(1,{1,2,3}))))","v":"Colorado Booms-90009-T9634/2372"}]
["2017-02-08","Aspen",75,{"$f":"_xlfn.TEXTJOIN(\"-\",,INDEX(($G$10:$G$18,$H$10:$H$18,$I$10:$I$18),MATCH(B640,$F$10:$F$18),,N(IF(1,{1,2,3}))))","v":"Colorado Booms-81231-A9634/2650"}]
["2017-02-22","Eagle",113,{"$f":"_xlfn.TEXTJOIN(\"-\",,INDEX(($G$10:$G$18,$H$10:$H$18,$I$10:$I$18),MATCH(B641,$F$10:$F$18),,N(IF(1,{1,2,3}))))","v":"Colorado Booms-81231-E9634/2386"}]
["2017-01-12","Sunshine",94,{"$f":"_xlfn.TEXTJOIN(\"-\",,INDEX(($G$10:$G$18,$H$10:$H$18,$I$10:$I$18),MATCH(B642,$F$10:$F$18),,N(IF(1,{1,2,3}))))","v":"Gel Booms-94618-S4369/2297"}]
["2017-01-05","Carlota",80,{"$f":"_xlfn.TEXTJOIN(\"-\",,INDEX(($G$10:$G$18,$H$10:$H$18,$I$10:$I$18),MATCH(B643,$F$10:$F$18),,N(IF(1,{1,2,3}))))","v":"Gel Booms-94608-C4369/2213"}]
["2017-01-23","Yanaki",72,{"$f":"_xlfn.TEXTJOIN(\"-\",,INDEX(($G$10:$G$18,$H$10:$H$18,$I$10:$I$18),MATCH(B644,$F$10:$F$18),,N(IF(1,{1,2,3}))))","v":"Colorado Booms-81231-Y9634/2072"}]
["2017-01-31","Carlota",79,{"$f":"_xlfn.TEXTJOIN(\"-\",,INDEX(($G$10:$G$18,$H$10:$H$18,$I$10:$I$18),MATCH(B645,$F$10:$F$18),,N(IF(1,{1,2,3}))))","v":"Gel Booms-94608-C4369/2213"}]
["2017-01-22","TriBoom",94,{"$f":"_xlfn.TEXTJOIN(\"-\",,INDEX(($G$10:$G$18,$H$10:$H$18,$I$10:$I$18),MATCH(B646,$F$10:$F$18),,N(IF(1,{1,2,3}))))","v":"Colorado Booms-90009-T9634/2372"}]
["2017-03-07","Carlota",37,{"$f":"_xlfn.TEXTJOIN(\"-\",,INDEX(($G$10:$G$18,$H$10:$H$18,$I$10:$I$18),MATCH(B647,$F$10:$F$18),,N(IF(1,{1,2,3}))))","v":"Gel Booms-94608-C4369/2213"}]
["2017-01-15","Quad",88,{"$f":"_xlfn.TEXTJOIN(\"-\",,INDEX(($G$10:$G$18,$H$10:$H$18,$I$10:$I$18),MATCH(B648,$F$10:$F$18),,N(IF(1,{1,2,3}))))","v":"Gel Booms-94608-Q4369/2290"}]
["2017-02-16","TriBoom",113,{"$f":"_xlfn.TEXTJOIN(\"-\",,INDEX(($G$10:$G$18,$H$10:$H$18,$I$10:$I$18),MATCH(B649,$F$10:$F$18),,N(IF(1,{1,2,3}))))","v":"Colorado Booms-90009-T9634/2372"}]
["2017-01-01","Sunshine",97,{"$f":"_xlfn.TEXTJOIN(\"-\",,INDEX(($G$10:$G$18,$H$10:$H$18,$I$10:$I$18),MATCH(B650,$F$10:$F$18),,N(IF(1,{1,2,3}))))","v":"Gel Booms-94618-S4369/2297"}]
["2017-01-21","Bellen",44,{"$f":"_xlfn.TEXTJOIN(\"-\",,INDEX(($G$10:$G$18,$H$10:$H$18,$I$10:$I$18),MATCH(B651,$F$10:$F$18),,N(IF(1,{1,2,3}))))","v":"Gel Booms-94618-B4369/2593"}]
["2017-02-10","Carlota",59,{"$f":"_xlfn.TEXTJOIN(\"-\",,INDEX(($G$10:$G$18,$H$10:$H$18,$I$10:$I$18),MATCH(B652,$F$10:$F$18),,N(IF(1,{1,2,3}))))","v":"Gel Booms-94608-C4369/2213"}]
["2017-02-27","Aspen",75,{"$f":"_xlfn.TEXTJOIN(\"-\",,INDEX(($G$10:$G$18,$H$10:$H$18,$I$10:$I$18),MATCH(B653,$F$10:$F$18),,N(IF(1,{1,2,3}))))","v":"Colorado Booms-81231-A9634/2650"}]
["2017-01-14","Aspen",96,{"$f":"_xlfn.TEXTJOIN(\"-\",,INDEX(($G$10:$G$18,$H$10:$H$18,$I$10:$I$18),MATCH(B654,$F$10:$F$18),,N(IF(1,{1,2,3}))))","v":"Colorado Booms-81231-A9634/2650"}]
["2017-01-17","Sunbell",96,{"$f":"_xlfn.TEXTJOIN(\"-\",,INDEX(($G$10:$G$18,$H$10:$H$18,$I$10:$I$18),MATCH(B655,$F$10:$F$18),,N(IF(1,{1,2,3}))))","v":"Gel Booms-94618-S4369/2241"}]
["2017-01-14","Eagle",69,{"$f":"_xlfn.TEXTJOIN(\"-\",,INDEX(($G$10:$G$18,$H$10:$H$18,$I$10:$I$18),MATCH(B656,$F$10:$F$18),,N(IF(1,{1,2,3}))))","v":"Colorado Booms-81231-E9634/2386"}]
["2017-03-05","TriBoom",131,{"$f":"_xlfn.TEXTJOIN(\"-\",,INDEX(($G$10:$G$18,$H$10:$H$18,$I$10:$I$18),MATCH(B657,$F$10:$F$18),,N(IF(1,{1,2,3}))))","v":"Colorado Booms-90009-T9634/2372"}]
["2017-02-02","Carlota",96,{"$f":"_xlfn.TEXTJOIN(\"-\",,INDEX(($G$10:$G$18,$H$10:$H$18,$I$10:$I$18),MATCH(B658,$F$10:$F$18),,N(IF(1,{1,2,3}))))","v":"Gel Booms-94608-C4369/2213"}]
["2017-03-26","Sunbell",114,{"$f":"_xlfn.TEXTJOIN(\"-\",,INDEX(($G$10:$G$18,$H$10:$H$18,$I$10:$I$18),MATCH(B659,$F$10:$F$18),,N(IF(1,{1,2,3}))))","v":"Gel Booms-94618-S4369/2241"}]
["2017-02-20","Carlota",97,{"$f":"_xlfn.TEXTJOIN(\"-\",,INDEX(($G$10:$G$18,$H$10:$H$18,$I$10:$I$18),MATCH(B660,$F$10:$F$18),,N(IF(1,{1,2,3}))))","v":"Gel Booms-94608-C4369/2213"}]
["2017-01-23","TriBoom",73,{"$f":"_xlfn.TEXTJOIN(\"-\",,INDEX(($G$10:$G$18,$H$10:$H$18,$I$10:$I$18),MATCH(B661,$F$10:$F$18),,N(IF(1,{1,2,3}))))","v":"Colorado Booms-90009-T9634/2372"}]
["2017-02-12","TriBoom",106,{"$f":"_xlfn.TEXTJOIN(\"-\",,INDEX(($G$10:$G$18,$H$10:$H$18,$I$10:$I$18),MATCH(B662,$F$10:$F$18),,N(IF(1,{1,2,3}))))","v":"Colorado Booms-90009-T9634/2372"}]
["2017-02-22","Quad",120,{"$f":"_xlfn.TEXTJOIN(\"-\",,INDEX(($G$10:$G$18,$H$10:$H$18,$I$10:$I$18),MATCH(B663,$F$10:$F$18),,N(IF(1,{1,2,3}))))","v":"Gel Booms-94608-Q4369/2290"}]
["2017-03-05","Quad",74,{"$f":"_xlfn.TEXTJOIN(\"-\",,INDEX(($G$10:$G$18,$H$10:$H$18,$I$10:$I$18),MATCH(B664,$F$10:$F$18),,N(IF(1,{1,2,3}))))","v":"Gel Booms-94608-Q4369/2290"}]
["2017-02-21","Aspen",67,{"$f":"_xlfn.TEXTJOIN(\"-\",,INDEX(($G$10:$G$18,$H$10:$H$18,$I$10:$I$18),MATCH(B665,$F$10:$F$18),,N(IF(1,{1,2,3}))))","v":"Colorado Booms-81231-A9634/2650"}]
["2017-03-14","TriBoom",95,{"$f":"_xlfn.TEXTJOIN(\"-\",,INDEX(($G$10:$G$18,$H$10:$H$18,$I$10:$I$18),MATCH(B666,$F$10:$F$18),,N(IF(1,{1,2,3}))))","v":"Colorado Booms-90009-T9634/2372"}]
["2017-01-17","Sunbell",58,{"$f":"_xlfn.TEXTJOIN(\"-\",,INDEX(($G$10:$G$18,$H$10:$H$18,$I$10:$I$18),MATCH(B667,$F$10:$F$18),,N(IF(1,{1,2,3}))))","v":"Gel Booms-94618-S4369/2241"}]
["2017-01-17","Sunbell",87,{"$f":"_xlfn.TEXTJOIN(\"-\",,INDEX(($G$10:$G$18,$H$10:$H$18,$I$10:$I$18),MATCH(B668,$F$10:$F$18),,N(IF(1,{1,2,3}))))","v":"Gel Booms-94618-S4369/2241"}]
["2017-01-16","Quad",41,{"$f":"_xlfn.TEXTJOIN(\"-\",,INDEX(($G$10:$G$18,$H$10:$H$18,$I$10:$I$18),MATCH(B669,$F$10:$F$18),,N(IF(1,{1,2,3}))))","v":"Gel Booms-94608-Q4369/2290"}]
["2017-02-25","Bellen",62,{"$f":"_xlfn.TEXTJOIN(\"-\",,INDEX(($G$10:$G$18,$H$10:$H$18,$I$10:$I$18),MATCH(B670,$F$10:$F$18),,N(IF(1,{1,2,3}))))","v":"Gel Booms-94618-B4369/2593"}]
["2017-01-17","TriBoom",88,{"$f":"_xlfn.TEXTJOIN(\"-\",,INDEX(($G$10:$G$18,$H$10:$H$18,$I$10:$I$18),MATCH(B671,$F$10:$F$18),,N(IF(1,{1,2,3}))))","v":"Colorado Booms-90009-T9634/2372"}]
["2017-03-27","Sunbell",59,{"$f":"_xlfn.TEXTJOIN(\"-\",,INDEX(($G$10:$G$18,$H$10:$H$18,$I$10:$I$18),MATCH(B672,$F$10:$F$18),,N(IF(1,{1,2,3}))))","v":"Gel Booms-94618-S4369/2241"}]
["2017-03-15","Yanaki",78,{"$f":"_xlfn.TEXTJOIN(\"-\",,INDEX(($G$10:$G$18,$H$10:$H$18,$I$10:$I$18),MATCH(B673,$F$10:$F$18),,N(IF(1,{1,2,3}))))","v":"Colorado Booms-81231-Y9634/2072"}]
["2017-01-09","Aspen",61,{"$f":"_xlfn.TEXTJOIN(\"-\",,INDEX(($G$10:$G$18,$H$10:$H$18,$I$10:$I$18),MATCH(B674,$F$10:$F$18),,N(IF(1,{1,2,3}))))","v":"Colorado Booms-81231-A9634/2650"}]
["2017-01-28","Quad",109,{"$f":"_xlfn.TEXTJOIN(\"-\",,INDEX(($G$10:$G$18,$H$10:$H$18,$I$10:$I$18),MATCH(B675,$F$10:$F$18),,N(IF(1,{1,2,3}))))","v":"Gel Booms-94608-Q4369/2290"}]
["2017-01-10","Yanaki",51,{"$f":"_xlfn.TEXTJOIN(\"-\",,INDEX(($G$10:$G$18,$H$10:$H$18,$I$10:$I$18),MATCH(B676,$F$10:$F$18),,N(IF(1,{1,2,3}))))","v":"Colorado Booms-81231-Y9634/2072"}]
["2017-01-06","Bellen",47,{"$f":"_xlfn.TEXTJOIN(\"-\",,INDEX(($G$10:$G$18,$H$10:$H$18,$I$10:$I$18),MATCH(B677,$F$10:$F$18),,N(IF(1,{1,2,3}))))","v":"Gel Booms-94618-B4369/2593"}]
["2017-02-22","TriBoom",94,{"$f":"_xlfn.TEXTJOIN(\"-\",,INDEX(($G$10:$G$18,$H$10:$H$18,$I$10:$I$18),MATCH(B678,$F$10:$F$18),,N(IF(1,{1,2,3}))))","v":"Colorado Booms-90009-T9634/2372"}]
["2017-02-23","Quad",99,{"$f":"_xlfn.TEXTJOIN(\"-\",,INDEX(($G$10:$G$18,$H$10:$H$18,$I$10:$I$18),MATCH(B679,$F$10:$F$18),,N(IF(1,{1,2,3}))))","v":"Gel Booms-94608-Q4369/2290"}]
["2017-01-11","Aspen",57,{"$f":"_xlfn.TEXTJOIN(\"-\",,INDEX(($G$10:$G$18,$H$10:$H$18,$I$10:$I$18),MATCH(B680,$F$10:$F$18),,N(IF(1,{1,2,3}))))","v":"Colorado Booms-81231-A9634/2650"}]
["2017-03-04","Quad",58,{"$f":"_xlfn.TEXTJOIN(\"-\",,INDEX(($G$10:$G$18,$H$10:$H$18,$I$10:$I$18),MATCH(B681,$F$10:$F$18),,N(IF(1,{1,2,3}))))","v":"Gel Booms-94608-Q4369/2290"}]
["2017-01-07","Eagle",89,{"$f":"_xlfn.TEXTJOIN(\"-\",,INDEX(($G$10:$G$18,$H$10:$H$18,$I$10:$I$18),MATCH(B682,$F$10:$F$18),,N(IF(1,{1,2,3}))))","v":"Colorado Booms-81231-E9634/2386"}]
["2017-01-09","Bellen",80,{"$f":"_xlfn.TEXTJOIN(\"-\",,INDEX(($G$10:$G$18,$H$10:$H$18,$I$10:$I$18),MATCH(B683,$F$10:$F$18),,N(IF(1,{1,2,3}))))","v":"Gel Booms-94618-B4369/2593"}]
["2017-03-30","TriBoom",60,{"$f":"_xlfn.TEXTJOIN(\"-\",,INDEX(($G$10:$G$18,$H$10:$H$18,$I$10:$I$18),MATCH(B684,$F$10:$F$18),,N(IF(1,{1,2,3}))))","v":"Colorado Booms-90009-T9634/2372"}]
["2017-03-30","Aspen",25,{"$f":"_xlfn.TEXTJOIN(\"-\",,INDEX(($G$10:$G$18,$H$10:$H$18,$I$10:$I$18),MATCH(B685,$F$10:$F$18),,N(IF(1,{1,2,3}))))","v":"Colorado Booms-81231-A9634/2650"}]
["2017-03-18","Aspen",74,{"$f":"_xlfn.TEXTJOIN(\"-\",,INDEX(($G$10:$G$18,$H$10:$H$18,$I$10:$I$18),MATCH(B686,$F$10:$F$18),,N(IF(1,{1,2,3}))))","v":"Colorado Booms-81231-A9634/2650"}]
["2017-02-27","Bellen",88,{"$f":"_xlfn.TEXTJOIN(\"-\",,INDEX(($G$10:$G$18,$H$10:$H$18,$I$10:$I$18),MATCH(B687,$F$10:$F$18),,N(IF(1,{1,2,3}))))","v":"Gel Booms-94618-B4369/2593"}]
["2017-03-18","Aspen",125,{"$f":"_xlfn.TEXTJOIN(\"-\",,INDEX(($G$10:$G$18,$H$10:$H$18,$I$10:$I$18),MATCH(B688,$F$10:$F$18),,N(IF(1,{1,2,3}))))","v":"Colorado Booms-81231-A9634/2650"}]
["2017-03-22","Eagle",88,{"$f":"_xlfn.TEXTJOIN(\"-\",,INDEX(($G$10:$G$18,$H$10:$H$18,$I$10:$I$18),MATCH(B689,$F$10:$F$18),,N(IF(1,{1,2,3}))))","v":"Colorado Booms-81231-E9634/2386"}]
["2017-01-16","Aspen",80,{"$f":"_xlfn.TEXTJOIN(\"-\",,INDEX(($G$10:$G$18,$H$10:$H$18,$I$10:$I$18),MATCH(B690,$F$10:$F$18),,N(IF(1,{1,2,3}))))","v":"Colorado Booms-81231-A9634/2650"}]
["2017-02-11","Quad",89,{"$f":"_xlfn.TEXTJOIN(\"-\",,INDEX(($G$10:$G$18,$H$10:$H$18,$I$10:$I$18),MATCH(B691,$F$10:$F$18),,N(IF(1,{1,2,3}))))","v":"Gel Booms-94608-Q4369/2290"}]
["2017-02-25","TriBoom",100,{"$f":"_xlfn.TEXTJOIN(\"-\",,INDEX(($G$10:$G$18,$H$10:$H$18,$I$10:$I$18),MATCH(B692,$F$10:$F$18),,N(IF(1,{1,2,3}))))","v":"Colorado Booms-90009-T9634/2372"}]
["2017-03-09","Sunbell",51,{"$f":"_xlfn.TEXTJOIN(\"-\",,INDEX(($G$10:$G$18,$H$10:$H$18,$I$10:$I$18),MATCH(B693,$F$10:$F$18),,N(IF(1,{1,2,3}))))","v":"Gel Booms-94618-S4369/2241"}]
["2017-01-05","Quad",119,{"$f":"_xlfn.TEXTJOIN(\"-\",,INDEX(($G$10:$G$18,$H$10:$H$18,$I$10:$I$18),MATCH(B694,$F$10:$F$18),,N(IF(1,{1,2,3}))))","v":"Gel Booms-94608-Q4369/2290"}]
["2017-02-24","Carlota",58,{"$f":"_xlfn.TEXTJOIN(\"-\",,INDEX(($G$10:$G$18,$H$10:$H$18,$I$10:$I$18),MATCH(B695,$F$10:$F$18),,N(IF(1,{1,2,3}))))","v":"Gel Booms-94608-C4369/2213"}]
["2017-02-03","Bellen",32,{"$f":"_xlfn.TEXTJOIN(\"-\",,INDEX(($G$10:$G$18,$H$10:$H$18,$I$10:$I$18),MATCH(B696,$F$10:$F$18),,N(IF(1,{1,2,3}))))","v":"Gel Booms-94618-B4369/2593"}]
["2017-01-11","Carlota",60,{"$f":"_xlfn.TEXTJOIN(\"-\",,INDEX(($G$10:$G$18,$H$10:$H$18,$I$10:$I$18),MATCH(B697,$F$10:$F$18),,N(IF(1,{1,2,3}))))","v":"Gel Booms-94608-C4369/2213"}]
["2017-03-07","Sunbell",89,{"$f":"_xlfn.TEXTJOIN(\"-\",,INDEX(($G$10:$G$18,$H$10:$H$18,$I$10:$I$18),MATCH(B698,$F$10:$F$18),,N(IF(1,{1,2,3}))))","v":"Gel Booms-94618-S4369/2241"}]
["2017-02-11","Quad",58,{"$f":"_xlfn.TEXTJOIN(\"-\",,INDEX(($G$10:$G$18,$H$10:$H$18,$I$10:$I$18),MATCH(B699,$F$10:$F$18),,N(IF(1,{1,2,3}))))","v":"Gel Booms-94608-Q4369/2290"}]
["2017-01-14","TriBoom",79,{"$f":"_xlfn.TEXTJOIN(\"-\",,INDEX(($G$10:$G$18,$H$10:$H$18,$I$10:$I$18),MATCH(B700,$F$10:$F$18),,N(IF(1,{1,2,3}))))","v":"Colorado Booms-90009-T9634/2372"}]
["2017-03-21","Aspen",51,{"$f":"_xlfn.TEXTJOIN(\"-\",,INDEX(($G$10:$G$18,$H$10:$H$18,$I$10:$I$18),MATCH(B701,$F$10:$F$18),,N(IF(1,{1,2,3}))))","v":"Colorado Booms-81231-A9634/2650"}]
["2017-01-17","Sunshine",109,{"$f":"_xlfn.TEXTJOIN(\"-\",,INDEX(($G$10:$G$18,$H$10:$H$18,$I$10:$I$18),MATCH(B702,$F$10:$F$18),,N(IF(1,{1,2,3}))))","v":"Gel Booms-94618-S4369/2297"}]
["2017-03-19","Sunshine",65,{"$f":"_xlfn.TEXTJOIN(\"-\",,INDEX(($G$10:$G$18,$H$10:$H$18,$I$10:$I$18),MATCH(B703,$F$10:$F$18),,N(IF(1,{1,2,3}))))","v":"Gel Booms-94618-S4369/2297"}]
["2017-01-05","Sunshine",78,{"$f":"_xlfn.TEXTJOIN(\"-\",,INDEX(($G$10:$G$18,$H$10:$H$18,$I$10:$I$18),MATCH(B704,$F$10:$F$18),,N(IF(1,{1,2,3}))))","v":"Gel Booms-94618-S4369/2297"}]
["2017-01-13","Carlota",59,{"$f":"_xlfn.TEXTJOIN(\"-\",,INDEX(($G$10:$G$18,$H$10:$H$18,$I$10:$I$18),MATCH(B705,$F$10:$F$18),,N(IF(1,{1,2,3}))))","v":"Gel Booms-94608-C4369/2213"}]
["2017-02-21","Carlota",63,{"$f":"_xlfn.TEXTJOIN(\"-\",,INDEX(($G$10:$G$18,$H$10:$H$18,$I$10:$I$18),MATCH(B706,$F$10:$F$18),,N(IF(1,{1,2,3}))))","v":"Gel Booms-94608-C4369/2213"}]
["2017-02-03","Bellen",78,{"$f":"_xlfn.TEXTJOIN(\"-\",,INDEX(($G$10:$G$18,$H$10:$H$18,$I$10:$I$18),MATCH(B707,$F$10:$F$18),,N(IF(1,{1,2,3}))))","v":"Gel Booms-94618-B4369/2593"}]
["2017-01-17","Eagle",84,{"$f":"_xlfn.TEXTJOIN(\"-\",,INDEX(($G$10:$G$18,$H$10:$H$18,$I$10:$I$18),MATCH(B708,$F$10:$F$18),,N(IF(1,{1,2,3}))))","v":"Colorado Booms-81231-E9634/2386"}]
["2017-02-26","Yanaki",109,{"$f":"_xlfn.TEXTJOIN(\"-\",,INDEX(($G$10:$G$18,$H$10:$H$18,$I$10:$I$18),MATCH(B709,$F$10:$F$18),,N(IF(1,{1,2,3}))))","v":"Colorado Booms-81231-Y9634/2072"}]
["2017-03-30","Quad",48,{"$f":"_xlfn.TEXTJOIN(\"-\",,INDEX(($G$10:$G$18,$H$10:$H$18,$I$10:$I$18),MATCH(B710,$F$10:$F$18),,N(IF(1,{1,2,3}))))","v":"Gel Booms-94608-Q4369/2290"}]
["2017-03-01","TriBoom",88,{"$f":"_xlfn.TEXTJOIN(\"-\",,INDEX(($G$10:$G$18,$H$10:$H$18,$I$10:$I$18),MATCH(B711,$F$10:$F$18),,N(IF(1,{1,2,3}))))","v":"Colorado Booms-90009-T9634/2372"}]
["2017-02-13","Aspen",101,{"$f":"_xlfn.TEXTJOIN(\"-\",,INDEX(($G$10:$G$18,$H$10:$H$18,$I$10:$I$18),MATCH(B712,$F$10:$F$18),,N(IF(1,{1,2,3}))))","v":"Colorado Booms-81231-A9634/2650"}]
["2017-01-14","Sunbell",56,{"$f":"_xlfn.TEXTJOIN(\"-\",,INDEX(($G$10:$G$18,$H$10:$H$18,$I$10:$I$18),MATCH(B713,$F$10:$F$18),,N(IF(1,{1,2,3}))))","v":"Gel Booms-94618-S4369/2241"}]
["2017-01-10","Eagle",73,{"$f":"_xlfn.TEXTJOIN(\"-\",,INDEX(($G$10:$G$18,$H$10:$H$18,$I$10:$I$18),MATCH(B714,$F$10:$F$18),,N(IF(1,{1,2,3}))))","v":"Colorado Booms-81231-E9634/2386"}]
["2017-03-13","Carlota",79,{"$f":"_xlfn.TEXTJOIN(\"-\",,INDEX(($G$10:$G$18,$H$10:$H$18,$I$10:$I$18),MATCH(B715,$F$10:$F$18),,N(IF(1,{1,2,3}))))","v":"Gel Booms-94608-C4369/2213"}]
["2017-02-24","Eagle",60,{"$f":"_xlfn.TEXTJOIN(\"-\",,INDEX(($G$10:$G$18,$H$10:$H$18,$I$10:$I$18),MATCH(B716,$F$10:$F$18),,N(IF(1,{1,2,3}))))","v":"Colorado Booms-81231-E9634/2386"}]
["2017-03-29","Aspen",77,{"$f":"_xlfn.TEXTJOIN(\"-\",,INDEX(($G$10:$G$18,$H$10:$H$18,$I$10:$I$18),MATCH(B717,$F$10:$F$18),,N(IF(1,{1,2,3}))))","v":"Colorado Booms-81231-A9634/2650"}]
["2017-01-07","Quad",69,{"$f":"_xlfn.TEXTJOIN(\"-\",,INDEX(($G$10:$G$18,$H$10:$H$18,$I$10:$I$18),MATCH(B718,$F$10:$F$18),,N(IF(1,{1,2,3}))))","v":"Gel Booms-94608-Q4369/2290"}]
["2017-01-05","Sunbell",83,{"$f":"_xlfn.TEXTJOIN(\"-\",,INDEX(($G$10:$G$18,$H$10:$H$18,$I$10:$I$18),MATCH(B719,$F$10:$F$18),,N(IF(1,{1,2,3}))))","v":"Gel Booms-94618-S4369/2241"}]
["2017-02-13","Aspen",87,{"$f":"_xlfn.TEXTJOIN(\"-\",,INDEX(($G$10:$G$18,$H$10:$H$18,$I$10:$I$18),MATCH(B720,$F$10:$F$18),,N(IF(1,{1,2,3}))))","v":"Colorado Booms-81231-A9634/2650"}]
["2017-03-26","Sunbell",94,{"$f":"_xlfn.TEXTJOIN(\"-\",,INDEX(($G$10:$G$18,$H$10:$H$18,$I$10:$I$18),MATCH(B721,$F$10:$F$18),,N(IF(1,{1,2,3}))))","v":"Gel Booms-94618-S4369/2241"}]
["2017-01-24","Bellen",106,{"$f":"_xlfn.TEXTJOIN(\"-\",,INDEX(($G$10:$G$18,$H$10:$H$18,$I$10:$I$18),MATCH(B722,$F$10:$F$18),,N(IF(1,{1,2,3}))))","v":"Gel Booms-94618-B4369/2593"}]
["2017-01-28","Eagle",65,{"$f":"_xlfn.TEXTJOIN(\"-\",,INDEX(($G$10:$G$18,$H$10:$H$18,$I$10:$I$18),MATCH(B723,$F$10:$F$18),,N(IF(1,{1,2,3}))))","v":"Colorado Booms-81231-E9634/2386"}]
["2017-01-08","Yanaki",107,{"$f":"_xlfn.TEXTJOIN(\"-\",,INDEX(($G$10:$G$18,$H$10:$H$18,$I$10:$I$18),MATCH(B724,$F$10:$F$18),,N(IF(1,{1,2,3}))))","v":"Colorado Booms-81231-Y9634/2072"}]
["2017-03-04","Quad",91,{"$f":"_xlfn.TEXTJOIN(\"-\",,INDEX(($G$10:$G$18,$H$10:$H$18,$I$10:$I$18),MATCH(B725,$F$10:$F$18),,N(IF(1,{1,2,3}))))","v":"Gel Booms-94608-Q4369/2290"}]
["2017-03-29","TriBoom",58,{"$f":"_xlfn.TEXTJOIN(\"-\",,INDEX(($G$10:$G$18,$H$10:$H$18,$I$10:$I$18),MATCH(B726,$F$10:$F$18),,N(IF(1,{1,2,3}))))","v":"Colorado Booms-90009-T9634/2372"}]
["2017-01-23","Quad",87,{"$f":"_xlfn.TEXTJOIN(\"-\",,INDEX(($G$10:$G$18,$H$10:$H$18,$I$10:$I$18),MATCH(B727,$F$10:$F$18),,N(IF(1,{1,2,3}))))","v":"Gel Booms-94608-Q4369/2290"}]
["2017-03-22","TriBoom",146,{"$f":"_xlfn.TEXTJOIN(\"-\",,INDEX(($G$10:$G$18,$H$10:$H$18,$I$10:$I$18),MATCH(B728,$F$10:$F$18),,N(IF(1,{1,2,3}))))","v":"Colorado Booms-90009-T9634/2372"}]
["2017-03-14","Bellen",116,{"$f":"_xlfn.TEXTJOIN(\"-\",,INDEX(($G$10:$G$18,$H$10:$H$18,$I$10:$I$18),MATCH(B729,$F$10:$F$18),,N(IF(1,{1,2,3}))))","v":"Gel Booms-94618-B4369/2593"}]
["2017-01-29","Aspen",66,{"$f":"_xlfn.TEXTJOIN(\"-\",,INDEX(($G$10:$G$18,$H$10:$H$18,$I$10:$I$18),MATCH(B730,$F$10:$F$18),,N(IF(1,{1,2,3}))))","v":"Colorado Booms-81231-A9634/2650"}]
["2017-01-22","Bellen",60,{"$f":"_xlfn.TEXTJOIN(\"-\",,INDEX(($G$10:$G$18,$H$10:$H$18,$I$10:$I$18),MATCH(B731,$F$10:$F$18),,N(IF(1,{1,2,3}))))","v":"Gel Booms-94618-B4369/2593"}]
["2017-01-28","Sunshine",92,{"$f":"_xlfn.TEXTJOIN(\"-\",,INDEX(($G$10:$G$18,$H$10:$H$18,$I$10:$I$18),MATCH(B732,$F$10:$F$18),,N(IF(1,{1,2,3}))))","v":"Gel Booms-94618-S4369/2297"}]
["2017-02-17","Quad",26,{"$f":"_xlfn.TEXTJOIN(\"-\",,INDEX(($G$10:$G$18,$H$10:$H$18,$I$10:$I$18),MATCH(B733,$F$10:$F$18),,N(IF(1,{1,2,3}))))","v":"Gel Booms-94608-Q4369/2290"}]
["2017-01-16","Eagle",83,{"$f":"_xlfn.TEXTJOIN(\"-\",,INDEX(($G$10:$G$18,$H$10:$H$18,$I$10:$I$18),MATCH(B734,$F$10:$F$18),,N(IF(1,{1,2,3}))))","v":"Colorado Booms-81231-E9634/2386"}]
["2017-03-25","TriBoom",38,{"$f":"_xlfn.TEXTJOIN(\"-\",,INDEX(($G$10:$G$18,$H$10:$H$18,$I$10:$I$18),MATCH(B735,$F$10:$F$18),,N(IF(1,{1,2,3}))))","v":"Colorado Booms-90009-T9634/2372"}]
["2017-01-03","Eagle",53,{"$f":"_xlfn.TEXTJOIN(\"-\",,INDEX(($G$10:$G$18,$H$10:$H$18,$I$10:$I$18),MATCH(B736,$F$10:$F$18),,N(IF(1,{1,2,3}))))","v":"Colorado Booms-81231-E9634/2386"}]
["2017-02-20","Carlota",18,{"$f":"_xlfn.TEXTJOIN(\"-\",,INDEX(($G$10:$G$18,$H$10:$H$18,$I$10:$I$18),MATCH(B737,$F$10:$F$18),,N(IF(1,{1,2,3}))))","v":"Gel Booms-94608-C4369/2213"}]
["2017-03-22","Sunshine",53,{"$f":"_xlfn.TEXTJOIN(\"-\",,INDEX(($G$10:$G$18,$H$10:$H$18,$I$10:$I$18),MATCH(B738,$F$10:$F$18),,N(IF(1,{1,2,3}))))","v":"Gel Booms-94618-S4369/2297"}]
["2017-03-08","Quad",59,{"$f":"_xlfn.TEXTJOIN(\"-\",,INDEX(($G$10:$G$18,$H$10:$H$18,$I$10:$I$18),MATCH(B739,$F$10:$F$18),,N(IF(1,{1,2,3}))))","v":"Gel Booms-94608-Q4369/2290"}]
["2017-02-17","Quad",89,{"$f":"_xlfn.TEXTJOIN(\"-\",,INDEX(($G$10:$G$18,$H$10:$H$18,$I$10:$I$18),MATCH(B740,$F$10:$F$18),,N(IF(1,{1,2,3}))))","v":"Gel Booms-94608-Q4369/2290"}]
["2017-03-16","Sunbell",46,{"$f":"_xlfn.TEXTJOIN(\"-\",,INDEX(($G$10:$G$18,$H$10:$H$18,$I$10:$I$18),MATCH(B741,$F$10:$F$18),,N(IF(1,{1,2,3}))))","v":"Gel Booms-94618-S4369/2241"}]
["2017-03-01","Aspen",58,{"$f":"_xlfn.TEXTJOIN(\"-\",,INDEX(($G$10:$G$18,$H$10:$H$18,$I$10:$I$18),MATCH(B742,$F$10:$F$18),,N(IF(1,{1,2,3}))))","v":"Colorado Booms-81231-A9634/2650"}]
["2017-03-12","Quad",36,{"$f":"_xlfn.TEXTJOIN(\"-\",,INDEX(($G$10:$G$18,$H$10:$H$18,$I$10:$I$18),MATCH(B743,$F$10:$F$18),,N(IF(1,{1,2,3}))))","v":"Gel Booms-94608-Q4369/2290"}]
["2017-03-17","Yanaki",44,{"$f":"_xlfn.TEXTJOIN(\"-\",,INDEX(($G$10:$G$18,$H$10:$H$18,$I$10:$I$18),MATCH(B744,$F$10:$F$18),,N(IF(1,{1,2,3}))))","v":"Colorado Booms-81231-Y9634/2072"}]
["2017-03-24","Bellen",64,{"$f":"_xlfn.TEXTJOIN(\"-\",,INDEX(($G$10:$G$18,$H$10:$H$18,$I$10:$I$18),MATCH(B745,$F$10:$F$18),,N(IF(1,{1,2,3}))))","v":"Gel Booms-94618-B4369/2593"}]
["2017-01-15","Carlota",90,{"$f":"_xlfn.TEXTJOIN(\"-\",,INDEX(($G$10:$G$18,$H$10:$H$18,$I$10:$I$18),MATCH(B746,$F$10:$F$18),,N(IF(1,{1,2,3}))))","v":"Gel Booms-94608-C4369/2213"}]
["2017-01-19","Eagle",68,{"$f":"_xlfn.TEXTJOIN(\"-\",,INDEX(($G$10:$G$18,$H$10:$H$18,$I$10:$I$18),MATCH(B747,$F$10:$F$18),,N(IF(1,{1,2,3}))))","v":"Colorado Booms-81231-E9634/2386"}]
["2017-03-04","Sunshine",86,{"$f":"_xlfn.TEXTJOIN(\"-\",,INDEX(($G$10:$G$18,$H$10:$H$18,$I$10:$I$18),MATCH(B748,$F$10:$F$18),,N(IF(1,{1,2,3}))))","v":"Gel Booms-94618-S4369/2297"}]
["2017-03-27","Sunbell",80,{"$f":"_xlfn.TEXTJOIN(\"-\",,INDEX(($G$10:$G$18,$H$10:$H$18,$I$10:$I$18),MATCH(B749,$F$10:$F$18),,N(IF(1,{1,2,3}))))","v":"Gel Booms-94618-S4369/2241"}]
["2017-01-31","Carlota",80,{"$f":"_xlfn.TEXTJOIN(\"-\",,INDEX(($G$10:$G$18,$H$10:$H$18,$I$10:$I$18),MATCH(B750,$F$10:$F$18),,N(IF(1,{1,2,3}))))","v":"Gel Booms-94608-C4369/2213"}]
["2017-03-17","Aspen",87,{"$f":"_xlfn.TEXTJOIN(\"-\",,INDEX(($G$10:$G$18,$H$10:$H$18,$I$10:$I$18),MATCH(B751,$F$10:$F$18),,N(IF(1,{1,2,3}))))","v":"Colorado Booms-81231-A9634/2650"}]
["2017-03-20","Yanaki",67,{"$f":"_xlfn.TEXTJOIN(\"-\",,INDEX(($G$10:$G$18,$H$10:$H$18,$I$10:$I$18),MATCH(B752,$F$10:$F$18),,N(IF(1,{1,2,3}))))","v":"Colorado Booms-81231-Y9634/2072"}]
["2017-02-27","Quad",106,{"$f":"_xlfn.TEXTJOIN(\"-\",,INDEX(($G$10:$G$18,$H$10:$H$18,$I$10:$I$18),MATCH(B753,$F$10:$F$18),,N(IF(1,{1,2,3}))))","v":"Gel Booms-94608-Q4369/2290"}]
["2017-01-20","Quad",77,{"$f":"_xlfn.TEXTJOIN(\"-\",,INDEX(($G$10:$G$18,$H$10:$H$18,$I$10:$I$18),MATCH(B754,$F$10:$F$18),,N(IF(1,{1,2,3}))))","v":"Gel Booms-94608-Q4369/2290"}]
["2017-02-03","Sunbell",90,{"$f":"_xlfn.TEXTJOIN(\"-\",,INDEX(($G$10:$G$18,$H$10:$H$18,$I$10:$I$18),MATCH(B755,$F$10:$F$18),,N(IF(1,{1,2,3}))))","v":"Gel Booms-94618-S4369/2241"}]
["2017-02-04","Eagle",93,{"$f":"_xlfn.TEXTJOIN(\"-\",,INDEX(($G$10:$G$18,$H$10:$H$18,$I$10:$I$18),MATCH(B756,$F$10:$F$18),,N(IF(1,{1,2,3}))))","v":"Colorado Booms-81231-E9634/2386"}]
["2017-02-02","Sunshine",106,{"$f":"_xlfn.TEXTJOIN(\"-\",,INDEX(($G$10:$G$18,$H$10:$H$18,$I$10:$I$18),MATCH(B757,$F$10:$F$18),,N(IF(1,{1,2,3}))))","v":"Gel Booms-94618-S4369/2297"}]
["2017-01-30","Yanaki",78,{"$f":"_xlfn.TEXTJOIN(\"-\",,INDEX(($G$10:$G$18,$H$10:$H$18,$I$10:$I$18),MATCH(B758,$F$10:$F$18),,N(IF(1,{1,2,3}))))","v":"Colorado Booms-81231-Y9634/2072"}]
["2017-01-28","Yanaki",97,{"$f":"_xlfn.TEXTJOIN(\"-\",,INDEX(($G$10:$G$18,$H$10:$H$18,$I$10:$I$18),MATCH(B759,$F$10:$F$18),,N(IF(1,{1,2,3}))))","v":"Colorado Booms-81231-Y9634/2072"}]
["2017-02-04","Yanaki",40,{"$f":"_xlfn.TEXTJOIN(\"-\",,INDEX(($G$10:$G$18,$H$10:$H$18,$I$10:$I$18),MATCH(B760,$F$10:$F$18),,N(IF(1,{1,2,3}))))","v":"Colorado Booms-81231-Y9634/2072"}]
["2017-03-09","Eagle",59,{"$f":"_xlfn.TEXTJOIN(\"-\",,INDEX(($G$10:$G$18,$H$10:$H$18,$I$10:$I$18),MATCH(B761,$F$10:$F$18),,N(IF(1,{1,2,3}))))","v":"Colorado Booms-81231-E9634/2386"}]
["2017-03-23","Yanaki",75,{"$f":"_xlfn.TEXTJOIN(\"-\",,INDEX(($G$10:$G$18,$H$10:$H$18,$I$10:$I$18),MATCH(B762,$F$10:$F$18),,N(IF(1,{1,2,3}))))","v":"Colorado Booms-81231-Y9634/2072"}]
["2017-01-03","Eagle",78,{"$f":"_xlfn.TEXTJOIN(\"-\",,INDEX(($G$10:$G$18,$H$10:$H$18,$I$10:$I$18),MATCH(B763,$F$10:$F$18),,N(IF(1,{1,2,3}))))","v":"Colorado Booms-81231-E9634/2386"}]
["2017-01-24","TriBoom",88,{"$f":"_xlfn.TEXTJOIN(\"-\",,INDEX(($G$10:$G$18,$H$10:$H$18,$I$10:$I$18),MATCH(B764,$F$10:$F$18),,N(IF(1,{1,2,3}))))","v":"Colorado Booms-90009-T9634/2372"}]
["2017-02-08","TriBoom",74,{"$f":"_xlfn.TEXTJOIN(\"-\",,INDEX(($G$10:$G$18,$H$10:$H$18,$I$10:$I$18),MATCH(B765,$F$10:$F$18),,N(IF(1,{1,2,3}))))","v":"Colorado Booms-90009-T9634/2372"}]
["2017-01-20","Sunshine",45,{"$f":"_xlfn.TEXTJOIN(\"-\",,INDEX(($G$10:$G$18,$H$10:$H$18,$I$10:$I$18),MATCH(B766,$F$10:$F$18),,N(IF(1,{1,2,3}))))","v":"Gel Booms-94618-S4369/2297"}]
["2017-03-21","Sunbell",130,{"$f":"_xlfn.TEXTJOIN(\"-\",,INDEX(($G$10:$G$18,$H$10:$H$18,$I$10:$I$18),MATCH(B767,$F$10:$F$18),,N(IF(1,{1,2,3}))))","v":"Gel Booms-94618-S4369/2241"}]
["2017-01-20","TriBoom",66,{"$f":"_xlfn.TEXTJOIN(\"-\",,INDEX(($G$10:$G$18,$H$10:$H$18,$I$10:$I$18),MATCH(B768,$F$10:$F$18),,N(IF(1,{1,2,3}))))","v":"Colorado Booms-90009-T9634/2372"}]
["2017-01-19","Sunbell",78,{"$f":"_xlfn.TEXTJOIN(\"-\",,INDEX(($G$10:$G$18,$H$10:$H$18,$I$10:$I$18),MATCH(B769,$F$10:$F$18),,N(IF(1,{1,2,3}))))","v":"Gel Booms-94618-S4369/2241"}]
["2017-03-09","Eagle",105,{"$f":"_xlfn.TEXTJOIN(\"-\",,INDEX(($G$10:$G$18,$H$10:$H$18,$I$10:$I$18),MATCH(B770,$F$10:$F$18),,N(IF(1,{1,2,3}))))","v":"Colorado Booms-81231-E9634/2386"}]
["2017-01-19","Bellen",77,{"$f":"_xlfn.TEXTJOIN(\"-\",,INDEX(($G$10:$G$18,$H$10:$H$18,$I$10:$I$18),MATCH(B771,$F$10:$F$18),,N(IF(1,{1,2,3}))))","v":"Gel Booms-94618-B4369/2593"}]
["2017-01-02","Sunbell",53,{"$f":"_xlfn.TEXTJOIN(\"-\",,INDEX(($G$10:$G$18,$H$10:$H$18,$I$10:$I$18),MATCH(B772,$F$10:$F$18),,N(IF(1,{1,2,3}))))","v":"Gel Booms-94618-S4369/2241"}]
["2017-03-02","Sunshine",115,{"$f":"_xlfn.TEXTJOIN(\"-\",,INDEX(($G$10:$G$18,$H$10:$H$18,$I$10:$I$18),MATCH(B773,$F$10:$F$18),,N(IF(1,{1,2,3}))))","v":"Gel Booms-94618-S4369/2297"}]
["2017-01-28","Quad",70,{"$f":"_xlfn.TEXTJOIN(\"-\",,INDEX(($G$10:$G$18,$H$10:$H$18,$I$10:$I$18),MATCH(B774,$F$10:$F$18),,N(IF(1,{1,2,3}))))","v":"Gel Booms-94608-Q4369/2290"}]
["2017-03-23","Carlota",57,{"$f":"_xlfn.TEXTJOIN(\"-\",,INDEX(($G$10:$G$18,$H$10:$H$18,$I$10:$I$18),MATCH(B775,$F$10:$F$18),,N(IF(1,{1,2,3}))))","v":"Gel Booms-94608-C4369/2213"}]
["2017-03-25","Sunshine",78,{"$f":"_xlfn.TEXTJOIN(\"-\",,INDEX(($G$10:$G$18,$H$10:$H$18,$I$10:$I$18),MATCH(B776,$F$10:$F$18),,N(IF(1,{1,2,3}))))","v":"Gel Booms-94618-S4369/2297"}]
["2017-02-04","Carlota",41,{"$f":"_xlfn.TEXTJOIN(\"-\",,INDEX(($G$10:$G$18,$H$10:$H$18,$I$10:$I$18),MATCH(B777,$F$10:$F$18),,N(IF(1,{1,2,3}))))","v":"Gel Booms-94608-C4369/2213"}]
["2017-03-02","TriBoom",34,{"$f":"_xlfn.TEXTJOIN(\"-\",,INDEX(($G$10:$G$18,$H$10:$H$18,$I$10:$I$18),MATCH(B778,$F$10:$F$18),,N(IF(1,{1,2,3}))))","v":"Colorado Booms-90009-T9634/2372"}]
["2017-01-31","Sunshine",116,{"$f":"_xlfn.TEXTJOIN(\"-\",,INDEX(($G$10:$G$18,$H$10:$H$18,$I$10:$I$18),MATCH(B779,$F$10:$F$18),,N(IF(1,{1,2,3}))))","v":"Gel Booms-94618-S4369/2297"}]
["2017-01-19","Aspen",39,{"$f":"_xlfn.TEXTJOIN(\"-\",,INDEX(($G$10:$G$18,$H$10:$H$18,$I$10:$I$18),MATCH(B780,$F$10:$F$18),,N(IF(1,{1,2,3}))))","v":"Colorado Booms-81231-A9634/2650"}]
["2017-01-05","Sunshine",57,{"$f":"_xlfn.TEXTJOIN(\"-\",,INDEX(($G$10:$G$18,$H$10:$H$18,$I$10:$I$18),MATCH(B781,$F$10:$F$18),,N(IF(1,{1,2,3}))))","v":"Gel Booms-94618-S4369/2297"}]
["2017-02-20","Yanaki",104,{"$f":"_xlfn.TEXTJOIN(\"-\",,INDEX(($G$10:$G$18,$H$10:$H$18,$I$10:$I$18),MATCH(B782,$F$10:$F$18),,N(IF(1,{1,2,3}))))","v":"Colorado Booms-81231-Y9634/2072"}]
["2017-01-02","Eagle",76,{"$f":"_xlfn.TEXTJOIN(\"-\",,INDEX(($G$10:$G$18,$H$10:$H$18,$I$10:$I$18),MATCH(B783,$F$10:$F$18),,N(IF(1,{1,2,3}))))","v":"Colorado Booms-81231-E9634/2386"}]
["2017-03-28","Quad",49,{"$f":"_xlfn.TEXTJOIN(\"-\",,INDEX(($G$10:$G$18,$H$10:$H$18,$I$10:$I$18),MATCH(B784,$F$10:$F$18),,N(IF(1,{1,2,3}))))","v":"Gel Booms-94608-Q4369/2290"}]
["2017-02-05","Sunshine",30,{"$f":"_xlfn.TEXTJOIN(\"-\",,INDEX(($G$10:$G$18,$H$10:$H$18,$I$10:$I$18),MATCH(B785,$F$10:$F$18),,N(IF(1,{1,2,3}))))","v":"Gel Booms-94618-S4369/2297"}]
["2017-02-24","Carlota",59,{"$f":"_xlfn.TEXTJOIN(\"-\",,INDEX(($G$10:$G$18,$H$10:$H$18,$I$10:$I$18),MATCH(B786,$F$10:$F$18),,N(IF(1,{1,2,3}))))","v":"Gel Booms-94608-C4369/2213"}]
["2017-03-28","Sunshine",82,{"$f":"_xlfn.TEXTJOIN(\"-\",,INDEX(($G$10:$G$18,$H$10:$H$18,$I$10:$I$18),MATCH(B787,$F$10:$F$18),,N(IF(1,{1,2,3}))))","v":"Gel Booms-94618-S4369/2297"}]
["2017-03-21","Carlota",81,{"$f":"_xlfn.TEXTJOIN(\"-\",,INDEX(($G$10:$G$18,$H$10:$H$18,$I$10:$I$18),MATCH(B788,$F$10:$F$18),,N(IF(1,{1,2,3}))))","v":"Gel Booms-94608-C4369/2213"}]
["2017-03-21","Carlota",70,{"$f":"_xlfn.TEXTJOIN(\"-\",,INDEX(($G$10:$G$18,$H$10:$H$18,$I$10:$I$18),MATCH(B789,$F$10:$F$18),,N(IF(1,{1,2,3}))))","v":"Gel Booms-94608-C4369/2213"}]
["2017-01-21","Sunbell",63,{"$f":"_xlfn.TEXTJOIN(\"-\",,INDEX(($G$10:$G$18,$H$10:$H$18,$I$10:$I$18),MATCH(B790,$F$10:$F$18),,N(IF(1,{1,2,3}))))","v":"Gel Booms-94618-S4369/2241"}]
["2017-01-22","Bellen",79,{"$f":"_xlfn.TEXTJOIN(\"-\",,INDEX(($G$10:$G$18,$H$10:$H$18,$I$10:$I$18),MATCH(B791,$F$10:$F$18),,N(IF(1,{1,2,3}))))","v":"Gel Booms-94618-B4369/2593"}]
["2017-01-21","Quad",85,{"$f":"_xlfn.TEXTJOIN(\"-\",,INDEX(($G$10:$G$18,$H$10:$H$18,$I$10:$I$18),MATCH(B792,$F$10:$F$18),,N(IF(1,{1,2,3}))))","v":"Gel Booms-94608-Q4369/2290"}]
["2017-01-20","Quad",72,{"$f":"_xlfn.TEXTJOIN(\"-\",,INDEX(($G$10:$G$18,$H$10:$H$18,$I$10:$I$18),MATCH(B793,$F$10:$F$18),,N(IF(1,{1,2,3}))))","v":"Gel Booms-94608-Q4369/2290"}]
["2017-01-15","Carlota",73,{"$f":"_xlfn.TEXTJOIN(\"-\",,INDEX(($G$10:$G$18,$H$10:$H$18,$I$10:$I$18),MATCH(B794,$F$10:$F$18),,N(IF(1,{1,2,3}))))","v":"Gel Booms-94608-C4369/2213"}]
["2017-03-08","TriBoom",52,{"$f":"_xlfn.TEXTJOIN(\"-\",,INDEX(($G$10:$G$18,$H$10:$H$18,$I$10:$I$18),MATCH(B795,$F$10:$F$18),,N(IF(1,{1,2,3}))))","v":"Colorado Booms-90009-T9634/2372"}]
["2017-01-09","Sunshine",72,{"$f":"_xlfn.TEXTJOIN(\"-\",,INDEX(($G$10:$G$18,$H$10:$H$18,$I$10:$I$18),MATCH(B796,$F$10:$F$18),,N(IF(1,{1,2,3}))))","v":"Gel Booms-94618-S4369/2297"}]
["2017-02-07","Sunbell",42,{"$f":"_xlfn.TEXTJOIN(\"-\",,INDEX(($G$10:$G$18,$H$10:$H$18,$I$10:$I$18),MATCH(B797,$F$10:$F$18),,N(IF(1,{1,2,3}))))","v":"Gel Booms-94618-S4369/2241"}]
["2017-03-12","Aspen",71,{"$f":"_xlfn.TEXTJOIN(\"-\",,INDEX(($G$10:$G$18,$H$10:$H$18,$I$10:$I$18),MATCH(B798,$F$10:$F$18),,N(IF(1,{1,2,3}))))","v":"Colorado Booms-81231-A9634/2650"}]
["2017-02-16","Quad",97,{"$f":"_xlfn.TEXTJOIN(\"-\",,INDEX(($G$10:$G$18,$H$10:$H$18,$I$10:$I$18),MATCH(B799,$F$10:$F$18),,N(IF(1,{1,2,3}))))","v":"Gel Booms-94608-Q4369/2290"}]
["2017-01-15","Carlota",107,{"$f":"_xlfn.TEXTJOIN(\"-\",,INDEX(($G$10:$G$18,$H$10:$H$18,$I$10:$I$18),MATCH(B800,$F$10:$F$18),,N(IF(1,{1,2,3}))))","v":"Gel Booms-94608-C4369/2213"}]
["2017-02-23","Aspen",44,{"$f":"_xlfn.TEXTJOIN(\"-\",,INDEX(($G$10:$G$18,$H$10:$H$18,$I$10:$I$18),MATCH(B801,$F$10:$F$18),,N(IF(1,{1,2,3}))))","v":"Colorado Booms-81231-A9634/2650"}]
["2017-03-21","Carlota",70,{"$f":"_xlfn.TEXTJOIN(\"-\",,INDEX(($G$10:$G$18,$H$10:$H$18,$I$10:$I$18),MATCH(B802,$F$10:$F$18),,N(IF(1,{1,2,3}))))","v":"Gel Booms-94608-C4369/2213"}]
["2017-02-18","Eagle",55,{"$f":"_xlfn.TEXTJOIN(\"-\",,INDEX(($G$10:$G$18,$H$10:$H$18,$I$10:$I$18),MATCH(B803,$F$10:$F$18),,N(IF(1,{1,2,3}))))","v":"Colorado Booms-81231-E9634/2386"}]
["2017-02-05","Quad",34,{"$f":"_xlfn.TEXTJOIN(\"-\",,INDEX(($G$10:$G$18,$H$10:$H$18,$I$10:$I$18),MATCH(B804,$F$10:$F$18),,N(IF(1,{1,2,3}))))","v":"Gel Booms-94608-Q4369/2290"}]
["2017-02-08","Quad",52,{"$f":"_xlfn.TEXTJOIN(\"-\",,INDEX(($G$10:$G$18,$H$10:$H$18,$I$10:$I$18),MATCH(B805,$F$10:$F$18),,N(IF(1,{1,2,3}))))","v":"Gel Booms-94608-Q4369/2290"}]
["2017-03-02","Bellen",70,{"$f":"_xlfn.TEXTJOIN(\"-\",,INDEX(($G$10:$G$18,$H$10:$H$18,$I$10:$I$18),MATCH(B806,$F$10:$F$18),,N(IF(1,{1,2,3}))))","v":"Gel Booms-94618-B4369/2593"}]
["2017-03-10","Sunbell",60,{"$f":"_xlfn.TEXTJOIN(\"-\",,INDEX(($G$10:$G$18,$H$10:$H$18,$I$10:$I$18),MATCH(B807,$F$10:$F$18),,N(IF(1,{1,2,3}))))","v":"Gel Booms-94618-S4369/2241"}]
["2017-01-16","Carlota",77,{"$f":"_xlfn.TEXTJOIN(\"-\",,INDEX(($G$10:$G$18,$H$10:$H$18,$I$10:$I$18),MATCH(B808,$F$10:$F$18),,N(IF(1,{1,2,3}))))","v":"Gel Booms-94608-C4369/2213"}]
["2017-01-17","Bellen",92,{"$f":"_xlfn.TEXTJOIN(\"-\",,INDEX(($G$10:$G$18,$H$10:$H$18,$I$10:$I$18),MATCH(B809,$F$10:$F$18),,N(IF(1,{1,2,3}))))","v":"Gel Booms-94618-B4369/2593"}]
["2017-01-18","Sunshine",99,{"$f":"_xlfn.TEXTJOIN(\"-\",,INDEX(($G$10:$G$18,$H$10:$H$18,$I$10:$I$18),MATCH(B810,$F$10:$F$18),,N(IF(1,{1,2,3}))))","v":"Gel Booms-94618-S4369/2297"}]
["2017-01-30","Bellen",124,{"$f":"_xlfn.TEXTJOIN(\"-\",,INDEX(($G$10:$G$18,$H$10:$H$18,$I$10:$I$18),MATCH(B811,$F$10:$F$18),,N(IF(1,{1,2,3}))))","v":"Gel Booms-94618-B4369/2593"}]
["2017-02-07","Sunbell",94,{"$f":"_xlfn.TEXTJOIN(\"-\",,INDEX(($G$10:$G$18,$H$10:$H$18,$I$10:$I$18),MATCH(B812,$F$10:$F$18),,N(IF(1,{1,2,3}))))","v":"Gel Booms-94618-S4369/2241"}]
["2017-02-17","TriBoom",59,{"$f":"_xlfn.TEXTJOIN(\"-\",,INDEX(($G$10:$G$18,$H$10:$H$18,$I$10:$I$18),MATCH(B813,$F$10:$F$18),,N(IF(1,{1,2,3}))))","v":"Colorado Booms-90009-T9634/2372"}]
["2017-03-30","Sunbell",68,{"$f":"_xlfn.TEXTJOIN(\"-\",,INDEX(($G$10:$G$18,$H$10:$H$18,$I$10:$I$18),MATCH(B814,$F$10:$F$18),,N(IF(1,{1,2,3}))))","v":"Gel Booms-94618-S4369/2241"}]
["2017-01-15","TriBoom",71,{"$f":"_xlfn.TEXTJOIN(\"-\",,INDEX(($G$10:$G$18,$H$10:$H$18,$I$10:$I$18),MATCH(B815,$F$10:$F$18),,N(IF(1,{1,2,3}))))","v":"Colorado Booms-90009-T9634/2372"}]