{"text_format":"1","workbook":"xlsx","n_sheets":7,"sheets":["Question","Try","MrExcel","excelsifun","Sheet2","Sheet1","(1033)"],"not_rendered":{"charts":0,"images":0,"macros":1,"external_links":0,"defined_names":0,"comments":3,"pivot_tables":1},"unopened":[],"bounds":{"document_bytes":16777216,"sheet_cells":100000,"rows_first":2000,"rows_last":500,"rows_between":2000,"halvings":0,"cell_chars":16384,"cell_head_chars":4096},"cells_cut":0,"cells_raw":0,"read":"whole","date_system":"1900"}

{"sheet":"Question","index":0,"n_rows":722,"n_cols":9,"rows_kept":722,"cut":false,"hidden":false,"merged":[]}
[]
[]
[]
[]
[]
[]
[]
[]
[]
[]
[]
[]
[]
[]
[]
[]
[]
[]
[]
["From This:",null,null,null,null,null,null,null,"To This:"]
[]
["Product","Sub Product 1","Sub Product 2","Sub Product 3","Sub Product 4","Sub Product 5","Sub Product 6",null,"Join Text"]
["Geo Fan","J-V/DQ1477","N-Y/DQ3773","B-Z/DQ7827","M-W/DQ6663","R-A/DQ8080","S-S/DQ4315",null,"Geo Fan"]
["Kin-Light","S-O/DQ9675","F-Z/DQ5663","T-Y/DQ3628","B-T/DQ6204","S-S/DQ1007","S-R/DQ3874",null,"Geo Fan - J-V/DQ1477"]
["Stock Hotex","W-F/DQ4209","K-I/DQ4485","J-O/DQ5352","Y-V/DQ1863","V-S/DQ1390","J-C/DQ8654",null,"Geo Fan - N-Y/DQ3773"]
["Konk Tinstock","N-R/DQ9237","K-Q/DQ9170","W-I/DQ7389","G-Z/DQ3645","H-K/DQ8345","I-S/DQ3284",null,"Geo Fan - B-Z/DQ7827"]
["Silver-Touch","F-Z/DQ7971","C-X/DQ9559","C-P/DQ9259","R-T/DQ3009","H-F/DQ9091","Z-F/DQ8491",null,"Geo Fan - M-W/DQ6663"]
["S-eco","X-O/DQ2585","R-L/DQ5437","F-G/DQ1353","Q-X/DQ3038","F-H/DQ7618","C-R/DQ6413",null,"Geo Fan - R-A/DQ8080"]
["Unoin","F-U/DQ2015","V-V/DQ1486","G-S/DQ3365","J-J/DQ8974","K-A/DQ1284","P-N/DQ7205",null,"Geo Fan - S-S/DQ4315"]
["Laeco","Y-V/DQ6202","R-T/DQ1158","F-P/DQ2866","Q-Z/DQ9290","T-D/DQ5678","V-V/DQ1452",null,"Kin-Light"]
["Touch-Lam","O-G/DQ1258","B-M/DQ7666","E-F/DQ8623","N-H/DQ1331","A-B/DQ3518","A-S/DQ7923",null,"Kin-Light - S-O/DQ9675"]
["Lot String","G-J/DQ7020","Z-X/DQ5056","T-X/DQ1948","O-M/DQ4209","R-X/DQ8489","K-F/DQ8350",null,"Kin-Light - F-Z/DQ5663"]
["Toncore","B-Q/DQ1113","S-J/DQ8641","T-O/DQ6035","O-D/DQ2138","A-Y/DQ5852","A-P/DQ6874",null,"Kin-Light - T-Y/DQ3628"]
["Greeneco","Z-D/DQ3486","V-L/DQ2156","S-W/DQ3812","O-J/DQ4817","W-U/DQ5837","K-U/DQ5815",null,"Kin-Light - B-T/DQ6204"]
["Airdex","T-Z/DQ8308","Q-Y/DQ1201","X-T/DQ3151","T-U/DQ7219","X-P/DQ1517","Q-E/DQ3131",null,"Kin-Light - S-S/DQ1007"]
["Lamhold","C-D/DQ9157","P-K/DQ1400","G-M/DQ3192","G-S/DQ5812","O-X/DQ5678","V-P/DQ8051",null,"Kin-Light - S-R/DQ3874"]
["Biosing","E-I/DQ8446","D-L/DQ9756","L-O/DQ5650","I-D/DQ6108","O-W/DQ1349","O-J/DQ3480",null,"Stock Hotex"]
["Viais","Z-X/DQ5986","Q-X/DQ5295","B-D/DQ7046","Q-O/DQ4384","E-P/DQ1000","H-A/DQ4471",null,"Stock Hotex - W-F/DQ4209"]
["Zim Lax","N-D/DQ2280","W-K/DQ4119","I-L/DQ5301","Z-M/DQ9782","M-O/DQ2381","D-X/DQ6309",null,"Stock Hotex - K-I/DQ4485"]
["S-lab","Y-S/DQ3406","J-L/DQ1112","Z-Q/DQ1200","Q-E/DQ6957","K-X/DQ6856","C-W/DQ5579",null,"Stock Hotex - J-O/DQ5352"]
["Stanity","R-U/DQ4312","N-X/DQ1329","M-K/DQ7985","U-T/DQ3735","A-X/DQ5877","P-Y/DQ5472",null,"Stock Hotex - Y-V/DQ1863"]
["Contom","H-C/DQ2317","X-V/DQ6726","C-B/DQ5190","Q-Y/DQ2021","E-E/DQ5627","A-K/DQ5855",null,"Stock Hotex - V-S/DQ1390"]
["Lam-Top","T-E/DQ7702","S-M/DQ3163","B-I/DQ6623","U-G/DQ3097","V-D/DQ3996","U-N/DQ7711",null,"Stock Hotex - J-C/DQ8654"]
["Trantraxbam","C-T/DQ4565","Z-F/DQ1695","V-V/DQ3074","V-P/DQ9688","S-M/DQ1541","G-E/DQ8061",null,"Konk Tinstock"]
["Silver Traxsing","N-V/DQ7788","R-O/DQ1810","E-X/DQ4308","T-D/DQ7728","Y-J/DQ5551","D-M/DQ7097",null,"Konk Tinstock - N-R/DQ9237"]
["Softdex","F-G/DQ1406","M-B/DQ8930","L-R/DQ1359","I-P/DQ1241","C-I/DQ3156","R-B/DQ8080",null,"Konk Tinstock - K-Q/DQ9170"]
["Air-Trax","I-Y/DQ6462","U-B/DQ2419","Y-X/DQ9909","J-E/DQ2773","V-E/DQ6312","E-T/DQ4131",null,"Konk Tinstock - W-I/DQ7389"]
["Labfax","W-U/DQ4000","Z-G/DQ3343","U-F/DQ2988","T-R/DQ1925","Z-P/DQ7423","Z-P/DQ9403",null,"Konk Tinstock - G-Z/DQ3645"]
["Konkstatis","H-T/DQ7055","V-Y/DQ8364","U-Z/DQ3697","N-H/DQ9038","L-N/DQ1973","G-T/DQ5579",null,"Konk Tinstock - H-K/DQ8345"]
["Touchtone","D-O/DQ4093","D-C/DQ1506","X-V/DQ3046","Z-T/DQ8406","R-G/DQ2487","O-G/DQ9131",null,"Konk Tinstock - I-S/DQ3284"]
["Ecotone","L-M/DQ2346","W-H/DQ7772","H-O/DQ8735","Y-R/DQ3598","E-Y/DQ1323","C-Q/DQ1220",null,"Silver-Touch"]
["Sublax","K-Z/DQ1958","E-T/DQ1182","D-V/DQ2263","F-Q/DQ1782","F-W/DQ1945","F-J/DQ1793",null,"Silver-Touch - F-Z/DQ7971"]
["Donlab","M-U/DQ5037","E-B/DQ7006","R-Q/DQ3540","I-I/DQ2681","G-U/DQ4067","N-R/DQ9996",null,"Silver-Touch - C-X/DQ9559"]
["Freetaming","P-U/DQ7673","D-V/DQ8854","K-H/DQ9072","G-I/DQ6806","M-M/DQ3184","B-V/DQ1806",null,"Silver-Touch - C-P/DQ9259"]
["Volt Tanstock","E-V/DQ1711","D-D/DQ3113","U-H/DQ3939","V-W/DQ2342","B-C/DQ4270","J-N/DQ2005",null,"Silver-Touch - R-T/DQ3009"]
["Single Zimfax","Q-K/DQ8122","X-H/DQ4021","F-K/DQ3308","H-O/DQ8072","D-Z/DQ6642","P-Q/DQ7285",null,"Silver-Touch - H-F/DQ9091"]
["Nameco","A-E/DQ4006","M-L/DQ5420","A-I/DQ5311","G-N/DQ5865","O-O/DQ6738","I-O/DQ8975",null,"Silver-Touch - Z-F/DQ8491"]
["Canhotin","X-C/DQ7536","H-O/DQ5982","U-U/DQ6424","C-S/DQ9155","O-K/DQ2805","I-S/DQ2919",null,"S-eco"]
["Opedax","V-K/DQ5620","I-A/DQ6402","O-C/DQ1475","U-V/DQ5750","D-W/DQ9169","X-U/DQ4908",null,"S-eco - X-O/DQ2585"]
["Touchfresh","H-C/DQ4665","C-D/DQ6489","R-H/DQ7954","D-D/DQ1228","X-K/DQ6699","D-V/DQ9848",null,"S-eco - R-L/DQ5437"]
["Inhold","V-U/DQ3537","J-U/DQ9185","Y-X/DQ3832","Y-L/DQ3782","L-R/DQ2810","O-M/DQ5259",null,"S-eco - F-G/DQ1353"]
["Saillux","K-S/DQ7277","C-S/DQ6120","J-Y/DQ3382","E-R/DQ2393","P-M/DQ2704","C-C/DQ7661",null,"S-eco - Q-X/DQ3038"]
["Zenjob","D-O/DQ9424","Z-X/DQ3592","E-D/DQ7789","A-P/DQ7456","M-R/DQ7298","H-S/DQ3032",null,"S-eco - F-H/DQ7618"]
["Sum-Home","R-Y/DQ1205","H-I/DQ6676","T-G/DQ3044","V-P/DQ4500","M-I/DQ1594","X-S/DQ9659",null,"S-eco - C-R/DQ6413"]
["Topair","G-H/DQ5891","B-G/DQ5422","A-L/DQ3927","F-N/DQ5639","S-Y/DQ1460","W-T/DQ2891",null,"Unoin"]
["New Cof","A-E/DQ8571","O-B/DQ2118","S-B/DQ3332","J-I/DQ4049","C-D/DQ1103","Q-Z/DQ3080",null,"Unoin - F-U/DQ2015"]
["Silverdom","V-Q/DQ2006","I-H/DQ3986","S-Y/DQ9987","K-W/DQ9789","M-V/DQ6609","E-G/DQ1666",null,"Unoin - V-V/DQ1486"]
["Black Silflex","V-T/DQ8139","M-U/DQ4261","E-M/DQ5191","U-T/DQ6381","T-V/DQ3190","M-I/DQ7893",null,"Unoin - G-S/DQ3365"]
["Zentom","H-O/DQ8291","U-M/DQ2997","D-V/DQ2055","S-F/DQ1630","E-Y/DQ9811","R-D/DQ1916",null,"Unoin - J-J/DQ8974"]
["Antex","U-V/DQ8524","H-O/DQ2807","Y-G/DQ8263","K-X/DQ7690","T-F/DQ6604","X-M/DQ8067",null,"Unoin - K-A/DQ1284"]
["Ranity","M-W/DQ2718","D-W/DQ8974","I-F/DQ8856","E-P/DQ3003","P-J/DQ5975","A-Y/DQ1109",null,"Unoin - P-N/DQ7205"]
["S-kix","K-G/DQ2749","P-J/DQ4709","N-X/DQ2600","B-T/DQ9604","R-W/DQ6294","O-U/DQ2096",null,"Laeco"]
["Zath-Lex","M-X/DQ6178","C-U/DQ1618","O-P/DQ3023","S-T/DQ8619","V-O/DQ9170","P-J/DQ3470",null,"Laeco - Y-V/DQ6202"]
["Tin Tam","V-E/DQ3168","X-O/DQ7726","K-Q/DQ3777","G-C/DQ5626","S-D/DQ7723","R-X/DQ8582",null,"Laeco - R-T/DQ1158"]
["Home-Fix","V-K/DQ4188","W-D/DQ9139","S-W/DQ7140","G-J/DQ2389","L-J/DQ9015","D-D/DQ9127",null,"Laeco - F-P/DQ2866"]
["Strongtax","C-B/DQ7246","S-Z/DQ9931","I-U/DQ6209","R-D/DQ7972","C-N/DQ7927","J-I/DQ6121",null,"Laeco - Q-Z/DQ9290"]
["Scottrax","V-B/DQ7247","R-B/DQ5325","Y-I/DQ1428","R-P/DQ3760","M-X/DQ6435","U-O/DQ2357",null,"Laeco - T-D/DQ5678"]
["Home Ron","W-Q/DQ8964","B-X/DQ4767","A-V/DQ6228","I-T/DQ7745","R-L/DQ1239","Z-L/DQ1190",null,"Laeco - V-V/DQ1452"]
["Mathtip","Q-Z/DQ9353","U-E/DQ3079","U-C/DQ9253","U-I/DQ9502","A-Z/DQ1514","F-H/DQ4922",null,"Touch-Lam"]
["Quad Joytax","U-G/DQ9961","O-N/DQ4189","R-C/DQ7978","X-B/DQ4884","V-P/DQ6114","P-B/DQ6522",null,"Touch-Lam - O-G/DQ1258"]
["Quotejob","A-L/DQ2468","G-J/DQ5678","H-P/DQ9164","C-G/DQ5033","H-E/DQ7018","X-Z/DQ7564",null,"Touch-Lam - B-M/DQ7666"]
["Zen Strong","B-N/DQ7372","C-E/DQ2712","W-Y/DQ2767","Q-K/DQ8866","H-Y/DQ3836","K-I/DQ2152",null,"Touch-Lam - E-F/DQ8623"]
["Stock Touch","V-B/DQ6141","F-K/DQ9978","G-T/DQ4323","E-G/DQ1291","Q-N/DQ9494","X-A/DQ3304",null,"Touch-Lam - N-H/DQ1331"]
["Stockdox","G-J/DQ1262","M-E/DQ9467","T-M/DQ6911","V-W/DQ3008","J-Q/DQ4683","W-D/DQ1503",null,"Touch-Lam - A-B/DQ3518"]
["Y- Lax","L-W/DQ7254","S-I/DQ5658","V-Z/DQ8574","A-L/DQ9394","I-O/DQ2393","E-U/DQ4627",null,"Touch-Lam - A-S/DQ7923"]
["Duolux","W-H/DQ3557","N-L/DQ2999","F-C/DQ1983","X-Q/DQ9087","J-X/DQ8959","Z-V/DQ3936",null,"Lot String"]
["Biofresh","L-A/DQ6923","U-X/DQ7740","H-S/DQ8103","C-E/DQ2233","O-I/DQ5625","F-G/DQ6422",null,"Lot String - G-J/DQ7020"]
["Lam-Find","L-B/DQ6600","J-J/DQ6636","T-F/DQ7235","L-E/DQ5363","S-C/DQ9729","K-U/DQ6401",null,"Lot String - Z-X/DQ5056"]
["Sanlam","U-G/DQ2593","I-N/DQ8908","N-K/DQ7667","C-X/DQ2549","I-I/DQ4036","P-F/DQ5733",null,"Lot String - T-X/DQ1948"]
["Lexiair","N-I/DQ8055","B-X/DQ9278","B-W/DQ6317","P-S/DQ6855","C-L/DQ3860","Z-D/DQ9878",null,"Lot String - O-M/DQ4209"]
["Stat-La","V-R/DQ3359","V-H/DQ7313","F-F/DQ5200","J-Q/DQ5746","A-Q/DQ5080","F-V/DQ2552",null,"Lot String - R-X/DQ8489"]
["Move Jaytop","T-O/DQ7238","F-D/DQ6648","K-A/DQ9049","H-O/DQ2208","I-Z/DQ5486","X-Y/DQ4699",null,"Lot String - K-F/DQ8350"]
["Hottrax","J-H/DQ6022","G-H/DQ5842","W-B/DQ2309","C-L/DQ5586","W-F/DQ3438","X-R/DQ3727",null,"Toncore"]
["Doublehome","I-X/DQ1764","F-V/DQ9308","G-E/DQ9441","D-P/DQ4540","A-C/DQ5093","P-M/DQ5272",null,"Toncore - B-Q/DQ1113"]
["Geoeco","K-I/DQ6541","O-A/DQ4828","L-B/DQ5503","U-G/DQ1778","D-V/DQ5889","N-C/DQ6848",null,"Toncore - S-J/DQ8641"]
["Nimtex","H-V/DQ2801","A-F/DQ3370","E-R/DQ2577","Y-G/DQ7693","P-X/DQ1156","Z-T/DQ1399",null,"Toncore - T-O/DQ6035"]
["Roneco","D-D/DQ9977","W-U/DQ9156","B-F/DQ9761","G-J/DQ8671","M-Z/DQ2823","Y-S/DQ7569",null,"Toncore - O-D/DQ2138"]
["Super Damlex","X-K/DQ5825","B-M/DQ4799","F-Y/DQ7680","E-K/DQ5609","X-H/DQ4124","T-L/DQ1506",null,"Toncore - A-Y/DQ5852"]
["Donlam","I-C/DQ1599","M-W/DQ6736","M-U/DQ3289","D-G/DQ9953","M-K/DQ2272","B-V/DQ4292",null,"Toncore - A-P/DQ6874"]
["Year Quolex","F-Y/DQ5679","E-W/DQ8224","N-X/DQ6670","L-Z/DQ5606","M-J/DQ6877","A-H/DQ1309",null,"Greeneco"]
["Stimlax","B-D/DQ7855","K-E/DQ8332","A-P/DQ4738","V-G/DQ2524","Y-O/DQ9675","N-S/DQ6800",null,"Greeneco - Z-D/DQ3486"]
["Duotouch","Z-V/DQ3753","F-F/DQ5074","A-Y/DQ2802","P-R/DQ8445","Y-H/DQ6655","S-L/DQ4687",null,"Greeneco - V-L/DQ2156"]
["Tam Cof","H-V/DQ1159","I-R/DQ8841","V-Q/DQ8805","X-X/DQ6355","E-B/DQ6085","V-F/DQ3156",null,"Greeneco - S-W/DQ3812"]
["Viafax","C-U/DQ9402","B-J/DQ9539","L-F/DQ2057","O-X/DQ7355","V-V/DQ1752","R-Y/DQ2556",null,"Greeneco - O-J/DQ4817"]
["Plus Zap","F-P/DQ1528","A-R/DQ8428","P-J/DQ8896","C-P/DQ5399","X-Z/DQ5028","S-C/DQ3339",null,"Greeneco - W-U/DQ5837"]
["Toptax","P-P/DQ7924","G-O/DQ6067","Z-J/DQ8325","U-W/DQ4138","C-P/DQ4351","D-U/DQ7085",null,"Greeneco - K-U/DQ5815"]
["Softsoft","K-H/DQ9934","Z-A/DQ9772","T-X/DQ3131","I-W/DQ1963","L-L/DQ3491","R-P/DQ4740",null,"Airdex"]
["Sumremjob","U-I/DQ5770","J-V/DQ1316","S-D/DQ3642","M-Z/DQ8379","I-B/DQ7976","N-C/DQ8554",null,"Airdex - T-Z/DQ8308"]
["Kanflex","M-F/DQ2070","S-Y/DQ9095","R-W/DQ8908","N-L/DQ6432","M-L/DQ8263","L-O/DQ6467",null,"Airdex - Q-Y/DQ1201"]
["Trustlex","Y-G/DQ3874","O-W/DQ1250","F-T/DQ7332","V-Q/DQ9747","J-W/DQ5551","K-Y/DQ4298",null,"Airdex - X-T/DQ3151"]
["Joyis","T-C/DQ6871","J-D/DQ9245","J-P/DQ4029","G-N/DQ6122","A-X/DQ4996","S-J/DQ6029",null,"Airdex - T-U/DQ7219"]
["Salt Damwarm","T-F/DQ5587","Y-L/DQ9024","V-C/DQ9304","U-G/DQ8743","X-K/DQ5215","M-N/DQ7537",null,"Airdex - X-P/DQ1517"]
["Tripple Apin","J-P/DQ7429","P-G/DQ7086","Y-L/DQ6224","I-A/DQ3124","X-R/DQ2483","K-H/DQ1008",null,"Airdex - Q-E/DQ3131"]
["Sil It","I-P/DQ8226","N-P/DQ4986","X-S/DQ9478","J-F/DQ8109","V-V/DQ4594","Q-K/DQ4132",null,"Lamhold"]
["Re Zoztex","F-E/DQ4809","P-N/DQ1239","S-X/DQ6329","I-O/DQ5603","I-R/DQ4357","K-A/DQ4274",null,"Lamhold - C-D/DQ9157"]
["Labfan","B-K/DQ8375","H-F/DQ4313","C-C/DQ1150","L-C/DQ9449","W-Z/DQ9017","B-P/DQ9089",null,"Lamhold - P-K/DQ1400"]
["Canex","W-Q/DQ1827","Z-X/DQ5599","H-Y/DQ3392","G-O/DQ8134","P-Z/DQ1145","S-T/DQ9864",null,"Lamhold - G-M/DQ3192"]
["Kinsing","D-O/DQ9948","I-C/DQ8877","A-X/DQ1627","U-L/DQ6403","O-E/DQ6432","T-V/DQ6488",null,"Lamhold - G-S/DQ5812"]
["Geo-Dax","N-M/DQ4637","Z-F/DQ9504","R-N/DQ8726","E-Q/DQ8209","O-Z/DQ2286","I-B/DQ1744",null,"Lamhold - O-X/DQ5678"]
["Freesoft","N-Y/DQ6967","A-R/DQ8303","H-A/DQ8782","P-R/DQ1717","H-C/DQ9144","F-S/DQ3434",null,"Lamhold - V-P/DQ8051"]
["Via Kix","B-J/DQ8771","F-S/DQ3920","D-G/DQ8328","C-B/DQ1806","G-Z/DQ2323","T-T/DQ8641",null,"Biosing"]
["Kan-Dom","I-S/DQ2111","L-J/DQ7510","C-K/DQ5503","Z-V/DQ2269","Z-N/DQ6435","S-Q/DQ1078",null,"Biosing - E-I/DQ8446"]
[null,null,null,null,null,null,null,null,"Biosing - D-L/DQ9756"]
[null,null,null,null,null,null,null,null,"Biosing - L-O/DQ5650"]
[null,null,null,null,null,null,null,null,"Biosing - I-D/DQ6108"]
[null,null,null,null,null,null,null,null,"Biosing - O-W/DQ1349"]
[null,null,null,null,null,null,null,null,"Biosing - O-J/DQ3480"]
[null,null,null,null,null,null,null,null,"Viais"]
[null,null,null,null,null,null,null,null,"Viais - Z-X/DQ5986"]
[null,null,null,null,null,null,null,null,"Viais - Q-X/DQ5295"]
[null,null,null,null,null,null,null,null,"Viais - B-D/DQ7046"]
[null,null,null,null,null,null,null,null,"Viais - Q-O/DQ4384"]
[null,null,null,null,null,null,null,null,"Viais - E-P/DQ1000"]
[null,null,null,null,null,null,null,null,"Viais - H-A/DQ4471"]
[null,null,null,null,null,null,null,null,"Zim Lax"]
[null,null,null,null,null,null,null,null,"Zim Lax - N-D/DQ2280"]
[null,null,null,null,null,null,null,null,"Zim Lax - W-K/DQ4119"]
[null,null,null,null,null,null,null,null,"Zim Lax - I-L/DQ5301"]
[null,null,null,null,null,null,null,null,"Zim Lax - Z-M/DQ9782"]
[null,null,null,null,null,null,null,null,"Zim Lax - M-O/DQ2381"]
[null,null,null,null,null,null,null,null,"Zim Lax - D-X/DQ6309"]
[null,null,null,null,null,null,null,null,"S-lab"]
[null,null,null,null,null,null,null,null,"S-lab - Y-S/DQ3406"]
[null,null,null,null,null,null,null,null,"S-lab - J-L/DQ1112"]
[null,null,null,null,null,null,null,null,"S-lab - Z-Q/DQ1200"]
[null,null,null,null,null,null,null,null,"S-lab - Q-E/DQ6957"]
[null,null,null,null,null,null,null,null,"S-lab - K-X/DQ6856"]
[null,null,null,null,null,null,null,null,"S-lab - C-W/DQ5579"]
[null,null,null,null,null,null,null,null,"Stanity"]
[null,null,null,null,null,null,null,null,"Stanity - R-U/DQ4312"]
[null,null,null,null,null,null,null,null,"Stanity - N-X/DQ1329"]
[null,null,null,null,null,null,null,null,"Stanity - M-K/DQ7985"]
[null,null,null,null,null,null,null,null,"Stanity - U-T/DQ3735"]
[null,null,null,null,null,null,null,null,"Stanity - A-X/DQ5877"]
[null,null,null,null,null,null,null,null,"Stanity - P-Y/DQ5472"]
[null,null,null,null,null,null,null,null,"Contom"]
[null,null,null,null,null,null,null,null,"Contom - H-C/DQ2317"]
[null,null,null,null,null,null,null,null,"Contom - X-V/DQ6726"]
[null,null,null,null,null,null,null,null,"Contom - C-B/DQ5190"]
[null,null,null,null,null,null,null,null,"Contom - Q-Y/DQ2021"]
[null,null,null,null,null,null,null,null,"Contom - E-E/DQ5627"]
[null,null,null,null,null,null,null,null,"Contom - A-K/DQ5855"]
[null,null,null,null,null,null,null,null,"Lam-Top"]
[null,null,null,null,null,null,null,null,"Lam-Top - T-E/DQ7702"]
[null,null,null,null,null,null,null,null,"Lam-Top - S-M/DQ3163"]
[null,null,null,null,null,null,null,null,"Lam-Top - B-I/DQ6623"]
[null,null,null,null,null,null,null,null,"Lam-Top - U-G/DQ3097"]
[null,null,null,null,null,null,null,null,"Lam-Top - V-D/DQ3996"]
[null,null,null,null,null,null,null,null,"Lam-Top - U-N/DQ7711"]
[null,null,null,null,null,null,null,null,"Trantraxbam"]
[null,null,null,null,null,null,null,null,"Trantraxbam - C-T/DQ4565"]
[null,null,null,null,null,null,null,null,"Trantraxbam - Z-F/DQ1695"]
[null,null,null,null,null,null,null,null,"Trantraxbam - V-V/DQ3074"]
[null,null,null,null,null,null,null,null,"Trantraxbam - V-P/DQ9688"]
[null,null,null,null,null,null,null,null,"Trantraxbam - S-M/DQ1541"]
[null,null,null,null,null,null,null,null,"Trantraxbam - G-E/DQ8061"]
[null,null,null,null,null,null,null,null,"Silver Traxsing"]
[null,null,null,null,null,null,null,null,"Silver Traxsing - N-V/DQ7788"]
[null,null,null,null,null,null,null,null,"Silver Traxsing - R-O/DQ1810"]
[null,null,null,null,null,null,null,null,"Silver Traxsing - E-X/DQ4308"]
[null,null,null,null,null,null,null,null,"Silver Traxsing - T-D/DQ7728"]
[null,null,null,null,null,null,null,null,"Silver Traxsing - Y-J/DQ5551"]
[null,null,null,null,null,null,null,null,"Silver Traxsing - D-M/DQ7097"]
[null,null,null,null,null,null,null,null,"Softdex"]
[null,null,null,null,null,null,null,null,"Softdex - F-G/DQ1406"]
[null,null,null,null,null,null,null,null,"Softdex - M-B/DQ8930"]
[null,null,null,null,null,null,null,null,"Softdex - L-R/DQ1359"]
[null,null,null,null,null,null,null,null,"Softdex - I-P/DQ1241"]
[null,null,null,null,null,null,null,null,"Softdex - C-I/DQ3156"]
[null,null,null,null,null,null,null,null,"Softdex - R-B/DQ8080"]
[null,null,null,null,null,null,null,null,"Air-Trax"]
[null,null,null,null,null,null,null,null,"Air-Trax - I-Y/DQ6462"]
[null,null,null,null,null,null,null,null,"Air-Trax - U-B/DQ2419"]
[null,null,null,null,null,null,null,null,"Air-Trax - Y-X/DQ9909"]
[null,null,null,null,null,null,null,null,"Air-Trax - J-E/DQ2773"]
[null,null,null,null,null,null,null,null,"Air-Trax - V-E/DQ6312"]
[null,null,null,null,null,null,null,null,"Air-Trax - E-T/DQ4131"]
[null,null,null,null,null,null,null,null,"Labfax"]
[null,null,null,null,null,null,null,null,"Labfax - W-U/DQ4000"]
[null,null,null,null,null,null,null,null,"Labfax - Z-G/DQ3343"]
[null,null,null,null,null,null,null,null,"Labfax - U-F/DQ2988"]
[null,null,null,null,null,null,null,null,"Labfax - T-R/DQ1925"]
[null,null,null,null,null,null,null,null,"Labfax - Z-P/DQ7423"]
[null,null,null,null,null,null,null,null,"Labfax - Z-P/DQ9403"]
[null,null,null,null,null,null,null,null,"Konkstatis"]
[null,null,null,null,null,null,null,null,"Konkstatis - H-T/DQ7055"]
[null,null,null,null,null,null,null,null,"Konkstatis - V-Y/DQ8364"]
[null,null,null,null,null,null,null,null,"Konkstatis - U-Z/DQ3697"]
[null,null,null,null,null,null,null,null,"Konkstatis - N-H/DQ9038"]
[null,null,null,null,null,null,null,null,"Konkstatis - L-N/DQ1973"]
[null,null,null,null,null,null,null,null,"Konkstatis - G-T/DQ5579"]
[null,null,null,null,null,null,null,null,"Touchtone"]
[null,null,null,null,null,null,null,null,"Touchtone - D-O/DQ4093"]
[null,null,null,null,null,null,null,null,"Touchtone - D-C/DQ1506"]
[null,null,null,null,null,null,null,null,"Touchtone - X-V/DQ3046"]
[null,null,null,null,null,null,null,null,"Touchtone - Z-T/DQ8406"]
[null,null,null,null,null,null,null,null,"Touchtone - R-G/DQ2487"]
[null,null,null,null,null,null,null,null,"Touchtone - O-G/DQ9131"]
[null,null,null,null,null,null,null,null,"Ecotone"]
[null,null,null,null,null,null,null,null,"Ecotone - L-M/DQ2346"]
[null,null,null,null,null,null,null,null,"Ecotone - W-H/DQ7772"]
[null,null,null,null,null,null,null,null,"Ecotone - H-O/DQ8735"]
[null,null,null,null,null,null,null,null,"Ecotone - Y-R/DQ3598"]
[null,null,null,null,null,null,null,null,"Ecotone - E-Y/DQ1323"]
[null,null,null,null,null,null,null,null,"Ecotone - C-Q/DQ1220"]
[null,null,null,null,null,null,null,null,"Sublax"]
[null,null,null,null,null,null,null,null,"Sublax - K-Z/DQ1958"]
[null,null,null,null,null,null,null,null,"Sublax - E-T/DQ1182"]
[null,null,null,null,null,null,null,null,"Sublax - D-V/DQ2263"]
[null,null,null,null,null,null,null,null,"Sublax - F-Q/DQ1782"]
[null,null,null,null,null,null,null,null,"Sublax - F-W/DQ1945"]
[null,null,null,null,null,null,null,null,"Sublax - F-J/DQ1793"]
[null,null,null,null,null,null,null,null,"Donlab"]
[null,null,null,null,null,null,null,null,"Donlab - M-U/DQ5037"]
[null,null,null,null,null,null,null,null,"Donlab - E-B/DQ7006"]
[null,null,null,null,null,null,null,null,"Donlab - R-Q/DQ3540"]
[null,null,null,null,null,null,null,null,"Donlab - I-I/DQ2681"]
[null,null,null,null,null,null,null,null,"Donlab - G-U/DQ4067"]
[null,null,null,null,null,null,null,null,"Donlab - N-R/DQ9996"]
[null,null,null,null,null,null,null,null,"Freetaming"]
[null,null,null,null,null,null,null,null,"Freetaming - P-U/DQ7673"]
[null,null,null,null,null,null,null,null,"Freetaming - D-V/DQ8854"]
[null,null,null,null,null,null,null,null,"Freetaming - K-H/DQ9072"]
[null,null,null,null,null,null,null,null,"Freetaming - G-I/DQ6806"]
[null,null,null,null,null,null,null,null,"Freetaming - M-M/DQ3184"]
[null,null,null,null,null,null,null,null,"Freetaming - B-V/DQ1806"]
[null,null,null,null,null,null,null,null,"Volt Tanstock"]
[null,null,null,null,null,null,null,null,"Volt Tanstock - E-V/DQ1711"]
[null,null,null,null,null,null,null,null,"Volt Tanstock - D-D/DQ3113"]
[null,null,null,null,null,null,null,null,"Volt Tanstock - U-H/DQ3939"]
[null,null,null,null,null,null,null,null,"Volt Tanstock - V-W/DQ2342"]
[null,null,null,null,null,null,null,null,"Volt Tanstock - B-C/DQ4270"]
[null,null,null,null,null,null,null,null,"Volt Tanstock - J-N/DQ2005"]
[null,null,null,null,null,null,null,null,"Single Zimfax"]
[null,null,null,null,null,null,null,null,"Single Zimfax - Q-K/DQ8122"]
[null,null,null,null,null,null,null,null,"Single Zimfax - X-H/DQ4021"]
[null,null,null,null,null,null,null,null,"Single Zimfax - F-K/DQ3308"]
[null,null,null,null,null,null,null,null,"Single Zimfax - H-O/DQ8072"]
[null,null,null,null,null,null,null,null,"Single Zimfax - D-Z/DQ6642"]
[null,null,null,null,null,null,null,null,"Single Zimfax - P-Q/DQ7285"]
[null,null,null,null,null,null,null,null,"Nameco"]
[null,null,null,null,null,null,null,null,"Nameco - A-E/DQ4006"]
[null,null,null,null,null,null,null,null,"Nameco - M-L/DQ5420"]
[null,null,null,null,null,null,null,null,"Nameco - A-I/DQ5311"]
[null,null,null,null,null,null,null,null,"Nameco - G-N/DQ5865"]
[null,null,null,null,null,null,null,null,"Nameco - O-O/DQ6738"]
[null,null,null,null,null,null,null,null,"Nameco - I-O/DQ8975"]
[null,null,null,null,null,null,null,null,"Canhotin"]
[null,null,null,null,null,null,null,null,"Canhotin - X-C/DQ7536"]
[null,null,null,null,null,null,null,null,"Canhotin - H-O/DQ5982"]
[null,null,null,null,null,null,null,null,"Canhotin - U-U/DQ6424"]
[null,null,null,null,null,null,null,null,"Canhotin - C-S/DQ9155"]
[null,null,null,null,null,null,null,null,"Canhotin - O-K/DQ2805"]
[null,null,null,null,null,null,null,null,"Canhotin - I-S/DQ2919"]
[null,null,null,null,null,null,null,null,"Opedax"]
[null,null,null,null,null,null,null,null,"Opedax - V-K/DQ5620"]
[null,null,null,null,null,null,null,null,"Opedax - I-A/DQ6402"]
[null,null,null,null,null,null,null,null,"Opedax - O-C/DQ1475"]
[null,null,null,null,null,null,null,null,"Opedax - U-V/DQ5750"]
[null,null,null,null,null,null,null,null,"Opedax - D-W/DQ9169"]
[null,null,null,null,null,null,null,null,"Opedax - X-U/DQ4908"]
[null,null,null,null,null,null,null,null,"Touchfresh"]
[null,null,null,null,null,null,null,null,"Touchfresh - H-C/DQ4665"]
[null,null,null,null,null,null,null,null,"Touchfresh - C-D/DQ6489"]
[null,null,null,null,null,null,null,null,"Touchfresh - R-H/DQ7954"]
[null,null,null,null,null,null,null,null,"Touchfresh - D-D/DQ1228"]
[null,null,null,null,null,null,null,null,"Touchfresh - X-K/DQ6699"]
[null,null,null,null,null,null,null,null,"Touchfresh - D-V/DQ9848"]
[null,null,null,null,null,null,null,null,"Inhold"]
[null,null,null,null,null,null,null,null,"Inhold - V-U/DQ3537"]
[null,null,null,null,null,null,null,null,"Inhold - J-U/DQ9185"]
[null,null,null,null,null,null,null,null,"Inhold - Y-X/DQ3832"]
[null,null,null,null,null,null,null,null,"Inhold - Y-L/DQ3782"]
[null,null,null,null,null,null,null,null,"Inhold - L-R/DQ2810"]
[null,null,null,null,null,null,null,null,"Inhold - O-M/DQ5259"]
[null,null,null,null,null,null,null,null,"Saillux"]
[null,null,null,null,null,null,null,null,"Saillux - K-S/DQ7277"]
[null,null,null,null,null,null,null,null,"Saillux - C-S/DQ6120"]
[null,null,null,null,null,null,null,null,"Saillux - J-Y/DQ3382"]
[null,null,null,null,null,null,null,null,"Saillux - E-R/DQ2393"]
[null,null,null,null,null,null,null,null,"Saillux - P-M/DQ2704"]
[null,null,null,null,null,null,null,null,"Saillux - C-C/DQ7661"]
[null,null,null,null,null,null,null,null,"Zenjob"]
[null,null,null,null,null,null,null,null,"Zenjob - D-O/DQ9424"]
[null,null,null,null,null,null,null,null,"Zenjob - Z-X/DQ3592"]
[null,null,null,null,null,null,null,null,"Zenjob - E-D/DQ7789"]
[null,null,null,null,null,null,null,null,"Zenjob - A-P/DQ7456"]
[null,null,null,null,null,null,null,null,"Zenjob - M-R/DQ7298"]
[null,null,null,null,null,null,null,null,"Zenjob - H-S/DQ3032"]
[null,null,null,null,null,null,null,null,"Sum-Home"]
[null,null,null,null,null,null,null,null,"Sum-Home - R-Y/DQ1205"]
[null,null,null,null,null,null,null,null,"Sum-Home - H-I/DQ6676"]
[null,null,null,null,null,null,null,null,"Sum-Home - T-G/DQ3044"]
[null,null,null,null,null,null,null,null,"Sum-Home - V-P/DQ4500"]
[null,null,null,null,null,null,null,null,"Sum-Home - M-I/DQ1594"]
[null,null,null,null,null,null,null,null,"Sum-Home - X-S/DQ9659"]
[null,null,null,null,null,null,null,null,"Topair"]
[null,null,null,null,null,null,null,null,"Topair - G-H/DQ5891"]
[null,null,null,null,null,null,null,null,"Topair - B-G/DQ5422"]
[null,null,null,null,null,null,null,null,"Topair - A-L/DQ3927"]
[null,null,null,null,null,null,null,null,"Topair - F-N/DQ5639"]
[null,null,null,null,null,null,null,null,"Topair - S-Y/DQ1460"]
[null,null,null,null,null,null,null,null,"Topair - W-T/DQ2891"]
[null,null,null,null,null,null,null,null,"New Cof"]
[null,null,null,null,null,null,null,null,"New Cof - A-E/DQ8571"]
[null,null,null,null,null,null,null,null,"New Cof - O-B/DQ2118"]
[null,null,null,null,null,null,null,null,"New Cof - S-B/DQ3332"]
[null,null,null,null,null,null,null,null,"New Cof - J-I/DQ4049"]
[null,null,null,null,null,null,null,null,"New Cof - C-D/DQ1103"]
[null,null,null,null,null,null,null,null,"New Cof - Q-Z/DQ3080"]
[null,null,null,null,null,null,null,null,"Silverdom"]
[null,null,null,null,null,null,null,null,"Silverdom - V-Q/DQ2006"]
[null,null,null,null,null,null,null,null,"Silverdom - I-H/DQ3986"]
[null,null,null,null,null,null,null,null,"Silverdom - S-Y/DQ9987"]
[null,null,null,null,null,null,null,null,"Silverdom - K-W/DQ9789"]
[null,null,null,null,null,null,null,null,"Silverdom - M-V/DQ6609"]
[null,null,null,null,null,null,null,null,"Silverdom - E-G/DQ1666"]
[null,null,null,null,null,null,null,null,"Black Silflex"]
[null,null,null,null,null,null,null,null,"Black Silflex - V-T/DQ8139"]
[null,null,null,null,null,null,null,null,"Black Silflex - M-U/DQ4261"]
[null,null,null,null,null,null,null,null,"Black Silflex - E-M/DQ5191"]
[null,null,null,null,null,null,null,null,"Black Silflex - U-T/DQ6381"]
[null,null,null,null,null,null,null,null,"Black Silflex - T-V/DQ3190"]
[null,null,null,null,null,null,null,null,"Black Silflex - M-I/DQ7893"]
[null,null,null,null,null,null,null,null,"Zentom"]
[null,null,null,null,null,null,null,null,"Zentom - H-O/DQ8291"]
[null,null,null,null,null,null,null,null,"Zentom - U-M/DQ2997"]
[null,null,null,null,null,null,null,null,"Zentom - D-V/DQ2055"]
[null,null,null,null,null,null,null,null,"Zentom - S-F/DQ1630"]
[null,null,null,null,null,null,null,null,"Zentom - E-Y/DQ9811"]
[null,null,null,null,null,null,null,null,"Zentom - R-D/DQ1916"]
[null,null,null,null,null,null,null,null,"Antex"]
[null,null,null,null,null,null,null,null,"Antex - U-V/DQ8524"]
[null,null,null,null,null,null,null,null,"Antex - H-O/DQ2807"]
[null,null,null,null,null,null,null,null,"Antex - Y-G/DQ8263"]
[null,null,null,null,null,null,null,null,"Antex - K-X/DQ7690"]
[null,null,null,null,null,null,null,null,"Antex - T-F/DQ6604"]
[null,null,null,null,null,null,null,null,"Antex - X-M/DQ8067"]
[null,null,null,null,null,null,null,null,"Ranity"]
[null,null,null,null,null,null,null,null,"Ranity - M-W/DQ2718"]
[null,null,null,null,null,null,null,null,"Ranity - D-W/DQ8974"]
[null,null,null,null,null,null,null,null,"Ranity - I-F/DQ8856"]
[null,null,null,null,null,null,null,null,"Ranity - E-P/DQ3003"]
[null,null,null,null,null,null,null,null,"Ranity - P-J/DQ5975"]
[null,null,null,null,null,null,null,null,"Ranity - A-Y/DQ1109"]
[null,null,null,null,null,null,null,null,"S-kix"]
[null,null,null,null,null,null,null,null,"S-kix - K-G/DQ2749"]
[null,null,null,null,null,null,null,null,"S-kix - P-J/DQ4709"]
[null,null,null,null,null,null,null,null,"S-kix - N-X/DQ2600"]
[null,null,null,null,null,null,null,null,"S-kix - B-T/DQ9604"]
[null,null,null,null,null,null,null,null,"S-kix - R-W/DQ6294"]
[null,null,null,null,null,null,null,null,"S-kix - O-U/DQ2096"]
[null,null,null,null,null,null,null,null,"Zath-Lex"]
[null,null,null,null,null,null,null,null,"Zath-Lex - M-X/DQ6178"]
[null,null,null,null,null,null,null,null,"Zath-Lex - C-U/DQ1618"]
[null,null,null,null,null,null,null,null,"Zath-Lex - O-P/DQ3023"]
[null,null,null,null,null,null,null,null,"Zath-Lex - S-T/DQ8619"]
[null,null,null,null,null,null,null,null,"Zath-Lex - V-O/DQ9170"]
[null,null,null,null,null,null,null,null,"Zath-Lex - P-J/DQ3470"]
[null,null,null,null,null,null,null,null,"Tin Tam"]
[null,null,null,null,null,null,null,null,"Tin Tam - V-E/DQ3168"]
[null,null,null,null,null,null,null,null,"Tin Tam - X-O/DQ7726"]
[null,null,null,null,null,null,null,null,"Tin Tam - K-Q/DQ3777"]
[null,null,null,null,null,null,null,null,"Tin Tam - G-C/DQ5626"]
[null,null,null,null,null,null,null,null,"Tin Tam - S-D/DQ7723"]
[null,null,null,null,null,null,null,null,"Tin Tam - R-X/DQ8582"]
[null,null,null,null,null,null,null,null,"Home-Fix"]
[null,null,null,null,null,null,null,null,"Home-Fix - V-K/DQ4188"]
[null,null,null,null,null,null,null,null,"Home-Fix - W-D/DQ9139"]
[null,null,null,null,null,null,null,null,"Home-Fix - S-W/DQ7140"]
[null,null,null,null,null,null,null,null,"Home-Fix - G-J/DQ2389"]
[null,null,null,null,null,null,null,null,"Home-Fix - L-J/DQ9015"]
[null,null,null,null,null,null,null,null,"Home-Fix - D-D/DQ9127"]
[null,null,null,null,null,null,null,null,"Strongtax"]
[null,null,null,null,null,null,null,null,"Strongtax - C-B/DQ7246"]
[null,null,null,null,null,null,null,null,"Strongtax - S-Z/DQ9931"]
[null,null,null,null,null,null,null,null,"Strongtax - I-U/DQ6209"]
[null,null,null,null,null,null,null,null,"Strongtax - R-D/DQ7972"]
[null,null,null,null,null,null,null,null,"Strongtax - C-N/DQ7927"]
[null,null,null,null,null,null,null,null,"Strongtax - J-I/DQ6121"]
[null,null,null,null,null,null,null,null,"Scottrax"]
[null,null,null,null,null,null,null,null,"Scottrax - V-B/DQ7247"]
[null,null,null,null,null,null,null,null,"Scottrax - R-B/DQ5325"]
[null,null,null,null,null,null,null,null,"Scottrax - Y-I/DQ1428"]
[null,null,null,null,null,null,null,null,"Scottrax - R-P/DQ3760"]
[null,null,null,null,null,null,null,null,"Scottrax - M-X/DQ6435"]
[null,null,null,null,null,null,null,null,"Scottrax - U-O/DQ2357"]
[null,null,null,null,null,null,null,null,"Home Ron"]
[null,null,null,null,null,null,null,null,"Home Ron - W-Q/DQ8964"]
[null,null,null,null,null,null,null,null,"Home Ron - B-X/DQ4767"]
[null,null,null,null,null,null,null,null,"Home Ron - A-V/DQ6228"]
[null,null,null,null,null,null,null,null,"Home Ron - I-T/DQ7745"]
[null,null,null,null,null,null,null,null,"Home Ron - R-L/DQ1239"]
[null,null,null,null,null,null,null,null,"Home Ron - Z-L/DQ1190"]
[null,null,null,null,null,null,null,null,"Mathtip"]
[null,null,null,null,null,null,null,null,"Mathtip - Q-Z/DQ9353"]
[null,null,null,null,null,null,null,null,"Mathtip - U-E/DQ3079"]
[null,null,null,null,null,null,null,null,"Mathtip - U-C/DQ9253"]
[null,null,null,null,null,null,null,null,"Mathtip - U-I/DQ9502"]
[null,null,null,null,null,null,null,null,"Mathtip - A-Z/DQ1514"]
[null,null,null,null,null,null,null,null,"Mathtip - F-H/DQ4922"]
[null,null,null,null,null,null,null,null,"Quad Joytax"]
[null,null,null,null,null,null,null,null,"Quad Joytax - U-G/DQ9961"]
[null,null,null,null,null,null,null,null,"Quad Joytax - O-N/DQ4189"]
[null,null,null,null,null,null,null,null,"Quad Joytax - R-C/DQ7978"]
[null,null,null,null,null,null,null,null,"Quad Joytax - X-B/DQ4884"]
[null,null,null,null,null,null,null,null,"Quad Joytax - V-P/DQ6114"]
[null,null,null,null,null,null,null,null,"Quad Joytax - P-B/DQ6522"]
[null,null,null,null,null,null,null,null,"Quotejob"]
[null,null,null,null,null,null,null,null,"Quotejob - A-L/DQ2468"]
[null,null,null,null,null,null,null,null,"Quotejob - G-J/DQ5678"]
[null,null,null,null,null,null,null,null,"Quotejob - H-P/DQ9164"]
[null,null,null,null,null,null,null,null,"Quotejob - C-G/DQ5033"]
[null,null,null,null,null,null,null,null,"Quotejob - H-E/DQ7018"]
[null,null,null,null,null,null,null,null,"Quotejob - X-Z/DQ7564"]
[null,null,null,null,null,null,null,null,"Zen Strong"]
[null,null,null,null,null,null,null,null,"Zen Strong - B-N/DQ7372"]
[null,null,null,null,null,null,null,null,"Zen Strong - C-E/DQ2712"]
[null,null,null,null,null,null,null,null,"Zen Strong - W-Y/DQ2767"]
[null,null,null,null,null,null,null,null,"Zen Strong - Q-K/DQ8866"]
[null,null,null,null,null,null,null,null,"Zen Strong - H-Y/DQ3836"]
[null,null,null,null,null,null,null,null,"Zen Strong - K-I/DQ2152"]
[null,null,null,null,null,null,null,null,"Stock Touch"]
[null,null,null,null,null,null,null,null,"Stock Touch - V-B/DQ6141"]
[null,null,null,null,null,null,null,null,"Stock Touch - F-K/DQ9978"]
[null,null,null,null,null,null,null,null,"Stock Touch - G-T/DQ4323"]
[null,null,null,null,null,null,null,null,"Stock Touch - E-G/DQ1291"]
[null,null,null,null,null,null,null,null,"Stock Touch - Q-N/DQ9494"]
[null,null,null,null,null,null,null,null,"Stock Touch - X-A/DQ3304"]
[null,null,null,null,null,null,null,null,"Stockdox"]
[null,null,null,null,null,null,null,null,"Stockdox - G-J/DQ1262"]
[null,null,null,null,null,null,null,null,"Stockdox - M-E/DQ9467"]
[null,null,null,null,null,null,null,null,"Stockdox - T-M/DQ6911"]
[null,null,null,null,null,null,null,null,"Stockdox - V-W/DQ3008"]
[null,null,null,null,null,null,null,null,"Stockdox - J-Q/DQ4683"]
[null,null,null,null,null,null,null,null,"Stockdox - W-D/DQ1503"]
[null,null,null,null,null,null,null,null,"Y- Lax"]
[null,null,null,null,null,null,null,null,"Y- Lax - L-W/DQ7254"]
[null,null,null,null,null,null,null,null,"Y- Lax - S-I/DQ5658"]
[null,null,null,null,null,null,null,null,"Y- Lax - V-Z/DQ8574"]
[null,null,null,null,null,null,null,null,"Y- Lax - A-L/DQ9394"]
[null,null,null,null,null,null,null,null,"Y- Lax - I-O/DQ2393"]
[null,null,null,null,null,null,null,null,"Y- Lax - E-U/DQ4627"]
[null,null,null,null,null,null,null,null,"Duolux"]
[null,null,null,null,null,null,null,null,"Duolux - W-H/DQ3557"]
[null,null,null,null,null,null,null,null,"Duolux - N-L/DQ2999"]
[null,null,null,null,null,null,null,null,"Duolux - F-C/DQ1983"]
[null,null,null,null,null,null,null,null,"Duolux - X-Q/DQ9087"]
[null,null,null,null,null,null,null,null,"Duolux - J-X/DQ8959"]
[null,null,null,null,null,null,null,null,"Duolux - Z-V/DQ3936"]
[null,null,null,null,null,null,null,null,"Biofresh"]
[null,null,null,null,null,null,null,null,"Biofresh - L-A/DQ6923"]
[null,null,null,null,null,null,null,null,"Biofresh - U-X/DQ7740"]
[null,null,null,null,null,null,null,null,"Biofresh - H-S/DQ8103"]
[null,null,null,null,null,null,null,null,"Biofresh - C-E/DQ2233"]
[null,null,null,null,null,null,null,null,"Biofresh - O-I/DQ5625"]
[null,null,null,null,null,null,null,null,"Biofresh - F-G/DQ6422"]
[null,null,null,null,null,null,null,null,"Lam-Find"]
[null,null,null,null,null,null,null,null,"Lam-Find - L-B/DQ6600"]
[null,null,null,null,null,null,null,null,"Lam-Find - J-J/DQ6636"]
[null,null,null,null,null,null,null,null,"Lam-Find - T-F/DQ7235"]
[null,null,null,null,null,null,null,null,"Lam-Find - L-E/DQ5363"]
[null,null,null,null,null,null,null,null,"Lam-Find - S-C/DQ9729"]
[null,null,null,null,null,null,null,null,"Lam-Find - K-U/DQ6401"]
[null,null,null,null,null,null,null,null,"Sanlam"]
[null,null,null,null,null,null,null,null,"Sanlam - U-G/DQ2593"]
[null,null,null,null,null,null,null,null,"Sanlam - I-N/DQ8908"]
[null,null,null,null,null,null,null,null,"Sanlam - N-K/DQ7667"]
[null,null,null,null,null,null,null,null,"Sanlam - C-X/DQ2549"]
[null,null,null,null,null,null,null,null,"Sanlam - I-I/DQ4036"]
[null,null,null,null,null,null,null,null,"Sanlam - P-F/DQ5733"]
[null,null,null,null,null,null,null,null,"Lexiair"]
[null,null,null,null,null,null,null,null,"Lexiair - N-I/DQ8055"]
[null,null,null,null,null,null,null,null,"Lexiair - B-X/DQ9278"]
[null,null,null,null,null,null,null,null,"Lexiair - B-W/DQ6317"]
[null,null,null,null,null,null,null,null,"Lexiair - P-S/DQ6855"]
[null,null,null,null,null,null,null,null,"Lexiair - C-L/DQ3860"]
[null,null,null,null,null,null,null,null,"Lexiair - Z-D/DQ9878"]
[null,null,null,null,null,null,null,null,"Stat-La"]
[null,null,null,null,null,null,null,null,"Stat-La - V-R/DQ3359"]
[null,null,null,null,null,null,null,null,"Stat-La - V-H/DQ7313"]
[null,null,null,null,null,null,null,null,"Stat-La - F-F/DQ5200"]
[null,null,null,null,null,null,null,null,"Stat-La - J-Q/DQ5746"]
[null,null,null,null,null,null,null,null,"Stat-La - A-Q/DQ5080"]
[null,null,null,null,null,null,null,null,"Stat-La - F-V/DQ2552"]
[null,null,null,null,null,null,null,null,"Move Jaytop"]
[null,null,null,null,null,null,null,null,"Move Jaytop - T-O/DQ7238"]
[null,null,null,null,null,null,null,null,"Move Jaytop - F-D/DQ6648"]
[null,null,null,null,null,null,null,null,"Move Jaytop - K-A/DQ9049"]
[null,null,null,null,null,null,null,null,"Move Jaytop - H-O/DQ2208"]
[null,null,null,null,null,null,null,null,"Move Jaytop - I-Z/DQ5486"]
[null,null,null,null,null,null,null,null,"Move Jaytop - X-Y/DQ4699"]
[null,null,null,null,null,null,null,null,"Hottrax"]
[null,null,null,null,null,null,null,null,"Hottrax - J-H/DQ6022"]
[null,null,null,null,null,null,null,null,"Hottrax - G-H/DQ5842"]
[null,null,null,null,null,null,null,null,"Hottrax - W-B/DQ2309"]
[null,null,null,null,null,null,null,null,"Hottrax - C-L/DQ5586"]
[null,null,null,null,null,null,null,null,"Hottrax - W-F/DQ3438"]
[null,null,null,null,null,null,null,null,"Hottrax - X-R/DQ3727"]
[null,null,null,null,null,null,null,null,"Doublehome"]
[null,null,null,null,null,null,null,null,"Doublehome - I-X/DQ1764"]
[null,null,null,null,null,null,null,null,"Doublehome - F-V/DQ9308"]
[null,null,null,null,null,null,null,null,"Doublehome - G-E/DQ9441"]
[null,null,null,null,null,null,null,null,"Doublehome - D-P/DQ4540"]
[null,null,null,null,null,null,null,null,"Doublehome - A-C/DQ5093"]
[null,null,null,null,null,null,null,null,"Doublehome - P-M/DQ5272"]
[null,null,null,null,null,null,null,null,"Geoeco"]
[null,null,null,null,null,null,null,null,"Geoeco - K-I/DQ6541"]
[null,null,null,null,null,null,null,null,"Geoeco - O-A/DQ4828"]
[null,null,null,null,null,null,null,null,"Geoeco - L-B/DQ5503"]
[null,null,null,null,null,null,null,null,"Geoeco - U-G/DQ1778"]
[null,null,null,null,null,null,null,null,"Geoeco - D-V/DQ5889"]
[null,null,null,null,null,null,null,null,"Geoeco - N-C/DQ6848"]
[null,null,null,null,null,null,null,null,"Nimtex"]
[null,null,null,null,null,null,null,null,"Nimtex - H-V/DQ2801"]
[null,null,null,null,null,null,null,null,"Nimtex - A-F/DQ3370"]
[null,null,null,null,null,null,null,null,"Nimtex - E-R/DQ2577"]
[null,null,null,null,null,null,null,null,"Nimtex - Y-G/DQ7693"]
[null,null,null,null,null,null,null,null,"Nimtex - P-X/DQ1156"]
[null,null,null,null,null,null,null,null,"Nimtex - Z-T/DQ1399"]
[null,null,null,null,null,null,null,null,"Roneco"]
[null,null,null,null,null,null,null,null,"Roneco - D-D/DQ9977"]
[null,null,null,null,null,null,null,null,"Roneco - W-U/DQ9156"]
[null,null,null,null,null,null,null,null,"Roneco - B-F/DQ9761"]
[null,null,null,null,null,null,null,null,"Roneco - G-J/DQ8671"]
[null,null,null,null,null,null,null,null,"Roneco - M-Z/DQ2823"]
[null,null,null,null,null,null,null,null,"Roneco - Y-S/DQ7569"]
[null,null,null,null,null,null,null,null,"Super Damlex"]
[null,null,null,null,null,null,null,null,"Super Damlex - X-K/DQ5825"]
[null,null,null,null,null,null,null,null,"Super Damlex - B-M/DQ4799"]
[null,null,null,null,null,null,null,null,"Super Damlex - F-Y/DQ7680"]
[null,null,null,null,null,null,null,null,"Super Damlex - E-K/DQ5609"]
[null,null,null,null,null,null,null,null,"Super Damlex - X-H/DQ4124"]
[null,null,null,null,null,null,null,null,"Super Damlex - T-L/DQ1506"]
[null,null,null,null,null,null,null,null,"Donlam"]
[null,null,null,null,null,null,null,null,"Donlam - I-C/DQ1599"]
[null,null,null,null,null,null,null,null,"Donlam - M-W/DQ6736"]
[null,null,null,null,null,null,null,null,"Donlam - M-U/DQ3289"]
[null,null,null,null,null,null,null,null,"Donlam - D-G/DQ9953"]
[null,null,null,null,null,null,null,null,"Donlam - M-K/DQ2272"]
[null,null,null,null,null,null,null,null,"Donlam - B-V/DQ4292"]
[null,null,null,null,null,null,null,null,"Year Quolex"]
[null,null,null,null,null,null,null,null,"Year Quolex - F-Y/DQ5679"]
[null,null,null,null,null,null,null,null,"Year Quolex - E-W/DQ8224"]
[null,null,null,null,null,null,null,null,"Year Quolex - N-X/DQ6670"]
[null,null,null,null,null,null,null,null,"Year Quolex - L-Z/DQ5606"]
[null,null,null,null,null,null,null,null,"Year Quolex - M-J/DQ6877"]
[null,null,null,null,null,null,null,null,"Year Quolex - A-H/DQ1309"]
[null,null,null,null,null,null,null,null,"Stimlax"]
[null,null,null,null,null,null,null,null,"Stimlax - B-D/DQ7855"]
[null,null,null,null,null,null,null,null,"Stimlax - K-E/DQ8332"]
[null,null,null,null,null,null,null,null,"Stimlax - A-P/DQ4738"]
[null,null,null,null,null,null,null,null,"Stimlax - V-G/DQ2524"]
[null,null,null,null,null,null,null,null,"Stimlax - Y-O/DQ9675"]
[null,null,null,null,null,null,null,null,"Stimlax - N-S/DQ6800"]
[null,null,null,null,null,null,null,null,"Duotouch"]
[null,null,null,null,null,null,null,null,"Duotouch - Z-V/DQ3753"]
[null,null,null,null,null,null,null,null,"Duotouch - F-F/DQ5074"]
[null,null,null,null,null,null,null,null,"Duotouch - A-Y/DQ2802"]
[null,null,null,null,null,null,null,null,"Duotouch - P-R/DQ8445"]
[null,null,null,null,null,null,null,null,"Duotouch - Y-H/DQ6655"]
[null,null,null,null,null,null,null,null,"Duotouch - S-L/DQ4687"]
[null,null,null,null,null,null,null,null,"Tam Cof"]
[null,null,null,null,null,null,null,null,"Tam Cof - H-V/DQ1159"]
[null,null,null,null,null,null,null,null,"Tam Cof - I-R/DQ8841"]
[null,null,null,null,null,null,null,null,"Tam Cof - V-Q/DQ8805"]
[null,null,null,null,null,null,null,null,"Tam Cof - X-X/DQ6355"]
[null,null,null,null,null,null,null,null,"Tam Cof - E-B/DQ6085"]
[null,null,null,null,null,null,null,null,"Tam Cof - V-F/DQ3156"]
[null,null,null,null,null,null,null,null,"Viafax"]
[null,null,null,null,null,null,null,null,"Viafax - C-U/DQ9402"]
[null,null,null,null,null,null,null,null,"Viafax - B-J/DQ9539"]
[null,null,null,null,null,null,null,null,"Viafax - L-F/DQ2057"]
[null,null,null,null,null,null,null,null,"Viafax - O-X/DQ7355"]
[null,null,null,null,null,null,null,null,"Viafax - V-V/DQ1752"]
[null,null,null,null,null,null,null,null,"Viafax - R-Y/DQ2556"]
[null,null,null,null,null,null,null,null,"Plus Zap"]
[null,null,null,null,null,null,null,null,"Plus Zap - F-P/DQ1528"]
[null,null,null,null,null,null,null,null,"Plus Zap - A-R/DQ8428"]
[null,null,null,null,null,null,null,null,"Plus Zap - P-J/DQ8896"]
[null,null,null,null,null,null,null,null,"Plus Zap - C-P/DQ5399"]
[null,null,null,null,null,null,null,null,"Plus Zap - X-Z/DQ5028"]
[null,null,null,null,null,null,null,null,"Plus Zap - S-C/DQ3339"]
[null,null,null,null,null,null,null,null,"Toptax"]
[null,null,null,null,null,null,null,null,"Toptax - P-P/DQ7924"]
[null,null,null,null,null,null,null,null,"Toptax - G-O/DQ6067"]
[null,null,null,null,null,null,null,null,"Toptax - Z-J/DQ8325"]
[null,null,null,null,null,null,null,null,"Toptax - U-W/DQ4138"]
[null,null,null,null,null,null,null,null,"Toptax - C-P/DQ4351"]
[null,null,null,null,null,null,null,null,"Toptax - D-U/DQ7085"]
[null,null,null,null,null,null,null,null,"Softsoft"]
[null,null,null,null,null,null,null,null,"Softsoft - K-H/DQ9934"]
[null,null,null,null,null,null,null,null,"Softsoft - Z-A/DQ9772"]
[null,null,null,null,null,null,null,null,"Softsoft - T-X/DQ3131"]
[null,null,null,null,null,null,null,null,"Softsoft - I-W/DQ1963"]
[null,null,null,null,null,null,null,null,"Softsoft - L-L/DQ3491"]
[null,null,null,null,null,null,null,null,"Softsoft - R-P/DQ4740"]
[null,null,null,null,null,null,null,null,"Sumremjob"]
[null,null,null,null,null,null,null,null,"Sumremjob - U-I/DQ5770"]
[null,null,null,null,null,null,null,null,"Sumremjob - J-V/DQ1316"]
[null,null,null,null,null,null,null,null,"Sumremjob - S-D/DQ3642"]
[null,null,null,null,null,null,null,null,"Sumremjob - M-Z/DQ8379"]
[null,null,null,null,null,null,null,null,"Sumremjob - I-B/DQ7976"]
[null,null,null,null,null,null,null,null,"Sumremjob - N-C/DQ8554"]
[null,null,null,null,null,null,null,null,"Kanflex"]
[null,null,null,null,null,null,null,null,"Kanflex - M-F/DQ2070"]
[null,null,null,null,null,null,null,null,"Kanflex - S-Y/DQ9095"]
[null,null,null,null,null,null,null,null,"Kanflex - R-W/DQ8908"]
[null,null,null,null,null,null,null,null,"Kanflex - N-L/DQ6432"]
[null,null,null,null,null,null,null,null,"Kanflex - M-L/DQ8263"]
[null,null,null,null,null,null,null,null,"Kanflex - L-O/DQ6467"]
[null,null,null,null,null,null,null,null,"Trustlex"]
[null,null,null,null,null,null,null,null,"Trustlex - Y-G/DQ3874"]
[null,null,null,null,null,null,null,null,"Trustlex - O-W/DQ1250"]
[null,null,null,null,null,null,null,null,"Trustlex - F-T/DQ7332"]
[null,null,null,null,null,null,null,null,"Trustlex - V-Q/DQ9747"]
[null,null,null,null,null,null,null,null,"Trustlex - J-W/DQ5551"]
[null,null,null,null,null,null,null,null,"Trustlex - K-Y/DQ4298"]
[null,null,null,null,null,null,null,null,"Joyis"]
[null,null,null,null,null,null,null,null,"Joyis - T-C/DQ6871"]
[null,null,null,null,null,null,null,null,"Joyis - J-D/DQ9245"]
[null,null,null,null,null,null,null,null,"Joyis - J-P/DQ4029"]
[null,null,null,null,null,null,null,null,"Joyis - G-N/DQ6122"]
[null,null,null,null,null,null,null,null,"Joyis - A-X/DQ4996"]
[null,null,null,null,null,null,null,null,"Joyis - S-J/DQ6029"]
[null,null,null,null,null,null,null,null,"Salt Damwarm"]
[null,null,null,null,null,null,null,null,"Salt Damwarm - T-F/DQ5587"]
[null,null,null,null,null,null,null,null,"Salt Damwarm - Y-L/DQ9024"]
[null,null,null,null,null,null,null,null,"Salt Damwarm - V-C/DQ9304"]
[null,null,null,null,null,null,null,null,"Salt Damwarm - U-G/DQ8743"]
[null,null,null,null,null,null,null,null,"Salt Damwarm - X-K/DQ5215"]
[null,null,null,null,null,null,null,null,"Salt Damwarm - M-N/DQ7537"]
[null,null,null,null,null,null,null,null,"Tripple Apin"]
[null,null,null,null,null,null,null,null,"Tripple Apin - J-P/DQ7429"]
[null,null,null,null,null,null,null,null,"Tripple Apin - P-G/DQ7086"]
[null,null,null,null,null,null,null,null,"Tripple Apin - Y-L/DQ6224"]
[null,null,null,null,null,null,null,null,"Tripple Apin - I-A/DQ3124"]
[null,null,null,null,null,null,null,null,"Tripple Apin - X-R/DQ2483"]
[null,null,null,null,null,null,null,null,"Tripple Apin - K-H/DQ1008"]
[null,null,null,null,null,null,null,null,"Sil It"]
[null,null,null,null,null,null,null,null,"Sil It - I-P/DQ8226"]
[null,null,null,null,null,null,null,null,"Sil It - N-P/DQ4986"]
[null,null,null,null,null,null,null,null,"Sil It - X-S/DQ9478"]
[null,null,null,null,null,null,null,null,"Sil It - J-F/DQ8109"]
[null,null,null,null,null,null,null,null,"Sil It - V-V/DQ4594"]
[null,null,null,null,null,null,null,null,"Sil It - Q-K/DQ4132"]
[null,null,null,null,null,null,null,null,"Re Zoztex"]
[null,null,null,null,null,null,null,null,"Re Zoztex - F-E/DQ4809"]
[null,null,null,null,null,null,null,null,"Re Zoztex - P-N/DQ1239"]
[null,null,null,null,null,null,null,null,"Re Zoztex - S-X/DQ6329"]
[null,null,null,null,null,null,null,null,"Re Zoztex - I-O/DQ5603"]
[null,null,null,null,null,null,null,null,"Re Zoztex - I-R/DQ4357"]
[null,null,null,null,null,null,null,null,"Re Zoztex - K-A/DQ4274"]
[null,null,null,null,null,null,null,null,"Labfan"]
[null,null,null,null,null,null,null,null,"Labfan - B-K/DQ8375"]
[null,null,null,null,null,null,null,null,"Labfan - H-F/DQ4313"]
[null,null,null,null,null,null,null,null,"Labfan - C-C/DQ1150"]
[null,null,null,null,null,null,null,null,"Labfan - L-C/DQ9449"]
[null,null,null,null,null,null,null,null,"Labfan - W-Z/DQ9017"]
[null,null,null,null,null,null,null,null,"Labfan - B-P/DQ9089"]
[null,null,null,null,null,null,null,null,"Canex"]
[null,null,null,null,null,null,null,null,"Canex - W-Q/DQ1827"]
[null,null,null,null,null,null,null,null,"Canex - Z-X/DQ5599"]
[null,null,null,null,null,null,null,null,"Canex - H-Y/DQ3392"]
[null,null,null,null,null,null,null,null,"Canex - G-O/DQ8134"]
[null,null,null,null,null,null,null,null,"Canex - P-Z/DQ1145"]
[null,null,null,null,null,null,null,null,"Canex - S-T/DQ9864"]
[null,null,null,null,null,null,null,null,"Kinsing"]
[null,null,null,null,null,null,null,null,"Kinsing - D-O/DQ9948"]
[null,null,null,null,null,null,null,null,"Kinsing - I-C/DQ8877"]
[null,null,null,null,null,null,null,null,"Kinsing - A-X/DQ1627"]
[null,null,null,null,null,null,null,null,"Kinsing - U-L/DQ6403"]
[null,null,null,null,null,null,null,null,"Kinsing - O-E/DQ6432"]
[null,null,null,null,null,null,null,null,"Kinsing - T-V/DQ6488"]
[null,null,null,null,null,null,null,null,"Geo-Dax"]
[null,null,null,null,null,null,null,null,"Geo-Dax - N-M/DQ4637"]
[null,null,null,null,null,null,null,null,"Geo-Dax - Z-F/DQ9504"]
[null,null,null,null,null,null,null,null,"Geo-Dax - R-N/DQ8726"]
[null,null,null,null,null,null,null,null,"Geo-Dax - E-Q/DQ8209"]
[null,null,null,null,null,null,null,null,"Geo-Dax - O-Z/DQ2286"]
[null,null,null,null,null,null,null,null,"Geo-Dax - I-B/DQ1744"]
[null,null,null,null,null,null,null,null,"Freesoft"]
[null,null,null,null,null,null,null,null,"Freesoft - N-Y/DQ6967"]
[null,null,null,null,null,null,null,null,"Freesoft - A-R/DQ8303"]
[null,null,null,null,null,null,null,null,"Freesoft - H-A/DQ8782"]
[null,null,null,null,null,null,null,null,"Freesoft - P-R/DQ1717"]
[null,null,null,null,null,null,null,null,"Freesoft - H-C/DQ9144"]
[null,null,null,null,null,null,null,null,"Freesoft - F-S/DQ3434"]
[null,null,null,null,null,null,null,null,"Via Kix"]
[null,null,null,null,null,null,null,null,"Via Kix - B-J/DQ8771"]
[null,null,null,null,null,null,null,null,"Via Kix - F-S/DQ3920"]
[null,null,null,null,null,null,null,null,"Via Kix - D-G/DQ8328"]
[null,null,null,null,null,null,null,null,"Via Kix - C-B/DQ1806"]
[null,null,null,null,null,null,null,null,"Via Kix - G-Z/DQ2323"]
[null,null,null,null,null,null,null,null,"Via Kix - T-T/DQ8641"]
[null,null,null,null,null,null,null,null,"Kan-Dom"]
[null,null,null,null,null,null,null,null,"Kan-Dom - I-S/DQ2111"]
[null,null,null,null,null,null,null,null,"Kan-Dom - L-J/DQ7510"]
[null,null,null,null,null,null,null,null,"Kan-Dom - C-K/DQ5503"]
[null,null,null,null,null,null,null,null,"Kan-Dom - Z-V/DQ2269"]
[null,null,null,null,null,null,null,null,"Kan-Dom - Z-N/DQ6435"]
[null,null,null,null,null,null,null,null,"Kan-Dom - S-Q/DQ1078"]

{"sheet":"Try","index":1,"n_rows":122,"n_cols":9,"rows_kept":122,"cut":false,"hidden":false,"merged":[]}
[]
[]
[]
[]
[]
[]
[]
[]
[]
[]
[]
[]
[]
[]
[]
[]
[]
[]
[]
["From This:",null,null,null,null,null,null,null,"To This:"]
[]
["Product","Sub Product 1","Sub Product 2","Sub Product 3","Sub Product 4","Sub Product 5","Sub Product 6",null,"Join Text"]
["Geo Fan","J-V/DQ1477","N-Y/DQ3773","B-Z/DQ7827","M-W/DQ6663","R-A/DQ8080","S-S/DQ4315"]
["Kin-Light","S-O/DQ9675","F-Z/DQ5663","T-Y/DQ3628","B-T/DQ6204","S-S/DQ1007","S-R/DQ3874"]
["Stock Hotex","W-F/DQ4209","K-I/DQ4485","J-O/DQ5352","Y-V/DQ1863","V-S/DQ1390","J-C/DQ8654"]
["Konk Tinstock","N-R/DQ9237","K-Q/DQ9170","W-I/DQ7389","G-Z/DQ3645","H-K/DQ8345","I-S/DQ3284"]
["Silver-Touch","F-Z/DQ7971","C-X/DQ9559","C-P/DQ9259","R-T/DQ3009","H-F/DQ9091","Z-F/DQ8491"]
["S-eco","X-O/DQ2585","R-L/DQ5437","F-G/DQ1353","Q-X/DQ3038","F-H/DQ7618","C-R/DQ6413"]
["Unoin","F-U/DQ2015","V-V/DQ1486","G-S/DQ3365","J-J/DQ8974","K-A/DQ1284","P-N/DQ7205"]
["Laeco","Y-V/DQ6202","R-T/DQ1158","F-P/DQ2866","Q-Z/DQ9290","T-D/DQ5678","V-V/DQ1452"]
["Touch-Lam","O-G/DQ1258","B-M/DQ7666","E-F/DQ8623","N-H/DQ1331","A-B/DQ3518","A-S/DQ7923"]
["Lot String","G-J/DQ7020","Z-X/DQ5056","T-X/DQ1948","O-M/DQ4209","R-X/DQ8489","K-F/DQ8350"]
["Toncore","B-Q/DQ1113","S-J/DQ8641","T-O/DQ6035","O-D/DQ2138","A-Y/DQ5852","A-P/DQ6874"]
["Greeneco","Z-D/DQ3486","V-L/DQ2156","S-W/DQ3812","O-J/DQ4817","W-U/DQ5837","K-U/DQ5815"]
["Airdex","T-Z/DQ8308","Q-Y/DQ1201","X-T/DQ3151","T-U/DQ7219","X-P/DQ1517","Q-E/DQ3131"]
["Lamhold","C-D/DQ9157","P-K/DQ1400","G-M/DQ3192","G-S/DQ5812","O-X/DQ5678","V-P/DQ8051"]
["Biosing","E-I/DQ8446","D-L/DQ9756","L-O/DQ5650","I-D/DQ6108","O-W/DQ1349","O-J/DQ3480"]
["Viais","Z-X/DQ5986","Q-X/DQ5295","B-D/DQ7046","Q-O/DQ4384","E-P/DQ1000","H-A/DQ4471"]
["Zim Lax","N-D/DQ2280","W-K/DQ4119","I-L/DQ5301","Z-M/DQ9782","M-O/DQ2381","D-X/DQ6309"]
["S-lab","Y-S/DQ3406","J-L/DQ1112","Z-Q/DQ1200","Q-E/DQ6957","K-X/DQ6856","C-W/DQ5579"]
["Stanity","R-U/DQ4312","N-X/DQ1329","M-K/DQ7985","U-T/DQ3735","A-X/DQ5877","P-Y/DQ5472"]
["Contom","H-C/DQ2317","X-V/DQ6726","C-B/DQ5190","Q-Y/DQ2021","E-E/DQ5627","A-K/DQ5855"]
["Lam-Top","T-E/DQ7702","S-M/DQ3163","B-I/DQ6623","U-G/DQ3097","V-D/DQ3996","U-N/DQ7711"]
["Trantraxbam","C-T/DQ4565","Z-F/DQ1695","V-V/DQ3074","V-P/DQ9688","S-M/DQ1541","G-E/DQ8061"]
["Silver Traxsing","N-V/DQ7788","R-O/DQ1810","E-X/DQ4308","T-D/DQ7728","Y-J/DQ5551","D-M/DQ7097"]
["Softdex","F-G/DQ1406","M-B/DQ8930","L-R/DQ1359","I-P/DQ1241","C-I/DQ3156","R-B/DQ8080"]
["Air-Trax","I-Y/DQ6462","U-B/DQ2419","Y-X/DQ9909","J-E/DQ2773","V-E/DQ6312","E-T/DQ4131"]
["Labfax","W-U/DQ4000","Z-G/DQ3343","U-F/DQ2988","T-R/DQ1925","Z-P/DQ7423","Z-P/DQ9403"]
["Konkstatis","H-T/DQ7055","V-Y/DQ8364","U-Z/DQ3697","N-H/DQ9038","L-N/DQ1973","G-T/DQ5579"]
["Touchtone","D-O/DQ4093","D-C/DQ1506","X-V/DQ3046","Z-T/DQ8406","R-G/DQ2487","O-G/DQ9131"]
["Ecotone","L-M/DQ2346","W-H/DQ7772","H-O/DQ8735","Y-R/DQ3598","E-Y/DQ1323","C-Q/DQ1220"]
["Sublax","K-Z/DQ1958","E-T/DQ1182","D-V/DQ2263","F-Q/DQ1782","F-W/DQ1945","F-J/DQ1793"]
["Donlab","M-U/DQ5037","E-B/DQ7006","R-Q/DQ3540","I-I/DQ2681","G-U/DQ4067","N-R/DQ9996"]
["Freetaming","P-U/DQ7673","D-V/DQ8854","K-H/DQ9072","G-I/DQ6806","M-M/DQ3184","B-V/DQ1806"]
["Volt Tanstock","E-V/DQ1711","D-D/DQ3113","U-H/DQ3939","V-W/DQ2342","B-C/DQ4270","J-N/DQ2005"]
["Single Zimfax","Q-K/DQ8122","X-H/DQ4021","F-K/DQ3308","H-O/DQ8072","D-Z/DQ6642","P-Q/DQ7285"]
["Nameco","A-E/DQ4006","M-L/DQ5420","A-I/DQ5311","G-N/DQ5865","O-O/DQ6738","I-O/DQ8975"]
["Canhotin","X-C/DQ7536","H-O/DQ5982","U-U/DQ6424","C-S/DQ9155","O-K/DQ2805","I-S/DQ2919"]
["Opedax","V-K/DQ5620","I-A/DQ6402","O-C/DQ1475","U-V/DQ5750","D-W/DQ9169","X-U/DQ4908"]
["Touchfresh","H-C/DQ4665","C-D/DQ6489","R-H/DQ7954","D-D/DQ1228","X-K/DQ6699","D-V/DQ9848"]
["Inhold","V-U/DQ3537","J-U/DQ9185","Y-X/DQ3832","Y-L/DQ3782","L-R/DQ2810","O-M/DQ5259"]
["Saillux","K-S/DQ7277","C-S/DQ6120","J-Y/DQ3382","E-R/DQ2393","P-M/DQ2704","C-C/DQ7661"]
["Zenjob","D-O/DQ9424","Z-X/DQ3592","E-D/DQ7789","A-P/DQ7456","M-R/DQ7298","H-S/DQ3032"]
["Sum-Home","R-Y/DQ1205","H-I/DQ6676","T-G/DQ3044","V-P/DQ4500","M-I/DQ1594","X-S/DQ9659"]
["Topair","G-H/DQ5891","B-G/DQ5422","A-L/DQ3927","F-N/DQ5639","S-Y/DQ1460","W-T/DQ2891"]
["New Cof","A-E/DQ8571","O-B/DQ2118","S-B/DQ3332","J-I/DQ4049","C-D/DQ1103","Q-Z/DQ3080"]
["Silverdom","V-Q/DQ2006","I-H/DQ3986","S-Y/DQ9987","K-W/DQ9789","M-V/DQ6609","E-G/DQ1666"]
["Black Silflex","V-T/DQ8139","M-U/DQ4261","E-M/DQ5191","U-T/DQ6381","T-V/DQ3190","M-I/DQ7893"]
["Zentom","H-O/DQ8291","U-M/DQ2997","D-V/DQ2055","S-F/DQ1630","E-Y/DQ9811","R-D/DQ1916"]
["Antex","U-V/DQ8524","H-O/DQ2807","Y-G/DQ8263","K-X/DQ7690","T-F/DQ6604","X-M/DQ8067"]
["Ranity","M-W/DQ2718","D-W/DQ8974","I-F/DQ8856","E-P/DQ3003","P-J/DQ5975","A-Y/DQ1109"]
["S-kix","K-G/DQ2749","P-J/DQ4709","N-X/DQ2600","B-T/DQ9604","R-W/DQ6294","O-U/DQ2096"]
["Zath-Lex","M-X/DQ6178","C-U/DQ1618","O-P/DQ3023","S-T/DQ8619","V-O/DQ9170","P-J/DQ3470"]
["Tin Tam","V-E/DQ3168","X-O/DQ7726","K-Q/DQ3777","G-C/DQ5626","S-D/DQ7723","R-X/DQ8582"]
["Home-Fix","V-K/DQ4188","W-D/DQ9139","S-W/DQ7140","G-J/DQ2389","L-J/DQ9015","D-D/DQ9127"]
["Strongtax","C-B/DQ7246","S-Z/DQ9931","I-U/DQ6209","R-D/DQ7972","C-N/DQ7927","J-I/DQ6121"]
["Scottrax","V-B/DQ7247","R-B/DQ5325","Y-I/DQ1428","R-P/DQ3760","M-X/DQ6435","U-O/DQ2357"]
["Home Ron","W-Q/DQ8964","B-X/DQ4767","A-V/DQ6228","I-T/DQ7745","R-L/DQ1239","Z-L/DQ1190"]
["Mathtip","Q-Z/DQ9353","U-E/DQ3079","U-C/DQ9253","U-I/DQ9502","A-Z/DQ1514","F-H/DQ4922"]
["Quad Joytax","U-G/DQ9961","O-N/DQ4189","R-C/DQ7978","X-B/DQ4884","V-P/DQ6114","P-B/DQ6522"]
["Quotejob","A-L/DQ2468","G-J/DQ5678","H-P/DQ9164","C-G/DQ5033","H-E/DQ7018","X-Z/DQ7564"]
["Zen Strong","B-N/DQ7372","C-E/DQ2712","W-Y/DQ2767","Q-K/DQ8866","H-Y/DQ3836","K-I/DQ2152"]
["Stock Touch","V-B/DQ6141","F-K/DQ9978","G-T/DQ4323","E-G/DQ1291","Q-N/DQ9494","X-A/DQ3304"]
["Stockdox","G-J/DQ1262","M-E/DQ9467","T-M/DQ6911","V-W/DQ3008","J-Q/DQ4683","W-D/DQ1503"]
["Y- Lax","L-W/DQ7254","S-I/DQ5658","V-Z/DQ8574","A-L/DQ9394","I-O/DQ2393","E-U/DQ4627"]
["Duolux","W-H/DQ3557","N-L/DQ2999","F-C/DQ1983","X-Q/DQ9087","J-X/DQ8959","Z-V/DQ3936"]
["Biofresh","L-A/DQ6923","U-X/DQ7740","H-S/DQ8103","C-E/DQ2233","O-I/DQ5625","F-G/DQ6422"]
["Lam-Find","L-B/DQ6600","J-J/DQ6636","T-F/DQ7235","L-E/DQ5363","S-C/DQ9729","K-U/DQ6401"]
["Sanlam","U-G/DQ2593","I-N/DQ8908","N-K/DQ7667","C-X/DQ2549","I-I/DQ4036","P-F/DQ5733"]
["Lexiair","N-I/DQ8055","B-X/DQ9278","B-W/DQ6317","P-S/DQ6855","C-L/DQ3860","Z-D/DQ9878"]
["Stat-La","V-R/DQ3359","V-H/DQ7313","F-F/DQ5200","J-Q/DQ5746","A-Q/DQ5080","F-V/DQ2552"]
["Move Jaytop","T-O/DQ7238","F-D/DQ6648","K-A/DQ9049","H-O/DQ2208","I-Z/DQ5486","X-Y/DQ4699"]
["Hottrax","J-H/DQ6022","G-H/DQ5842","W-B/DQ2309","C-L/DQ5586","W-F/DQ3438","X-R/DQ3727"]
["Doublehome","I-X/DQ1764","F-V/DQ9308","G-E/DQ9441","D-P/DQ4540","A-C/DQ5093","P-M/DQ5272"]
["Geoeco","K-I/DQ6541","O-A/DQ4828","L-B/DQ5503","U-G/DQ1778","D-V/DQ5889","N-C/DQ6848"]
["Nimtex","H-V/DQ2801","A-F/DQ3370","E-R/DQ2577","Y-G/DQ7693","P-X/DQ1156","Z-T/DQ1399"]
["Roneco","D-D/DQ9977","W-U/DQ9156","B-F/DQ9761","G-J/DQ8671","M-Z/DQ2823","Y-S/DQ7569"]
["Super Damlex","X-K/DQ5825","B-M/DQ4799","F-Y/DQ7680","E-K/DQ5609","X-H/DQ4124","T-L/DQ1506"]
["Donlam","I-C/DQ1599","M-W/DQ6736","M-U/DQ3289","D-G/DQ9953","M-K/DQ2272","B-V/DQ4292"]
["Year Quolex","F-Y/DQ5679","E-W/DQ8224","N-X/DQ6670","L-Z/DQ5606","M-J/DQ6877","A-H/DQ1309"]
["Stimlax","B-D/DQ7855","K-E/DQ8332","A-P/DQ4738","V-G/DQ2524","Y-O/DQ9675","N-S/DQ6800"]
["Duotouch","Z-V/DQ3753","F-F/DQ5074","A-Y/DQ2802","P-R/DQ8445","Y-H/DQ6655","S-L/DQ4687"]
["Tam Cof","H-V/DQ1159","I-R/DQ8841","V-Q/DQ8805","X-X/DQ6355","E-B/DQ6085","V-F/DQ3156"]
["Viafax","C-U/DQ9402","B-J/DQ9539","L-F/DQ2057","O-X/DQ7355","V-V/DQ1752","R-Y/DQ2556"]
["Plus Zap","F-P/DQ1528","A-R/DQ8428","P-J/DQ8896","C-P/DQ5399","X-Z/DQ5028","S-C/DQ3339"]
["Toptax","P-P/DQ7924","G-O/DQ6067","Z-J/DQ8325","U-W/DQ4138","C-P/DQ4351","D-U/DQ7085"]
["Softsoft","K-H/DQ9934","Z-A/DQ9772","T-X/DQ3131","I-W/DQ1963","L-L/DQ3491","R-P/DQ4740"]
["Sumremjob","U-I/DQ5770","J-V/DQ1316","S-D/DQ3642","M-Z/DQ8379","I-B/DQ7976","N-C/DQ8554"]
["Kanflex","M-F/DQ2070","S-Y/DQ9095","R-W/DQ8908","N-L/DQ6432","M-L/DQ8263","L-O/DQ6467"]
["Trustlex","Y-G/DQ3874","O-W/DQ1250","F-T/DQ7332","V-Q/DQ9747","J-W/DQ5551","K-Y/DQ4298"]
["Joyis","T-C/DQ6871","J-D/DQ9245","J-P/DQ4029","G-N/DQ6122","A-X/DQ4996","S-J/DQ6029"]
["Salt Damwarm","T-F/DQ5587","Y-L/DQ9024","V-C/DQ9304","U-G/DQ8743","X-K/DQ5215","M-N/DQ7537"]
["Tripple Apin","J-P/DQ7429","P-G/DQ7086","Y-L/DQ6224","I-A/DQ3124","X-R/DQ2483","K-H/DQ1008"]
["Sil It","I-P/DQ8226","N-P/DQ4986","X-S/DQ9478","J-F/DQ8109","V-V/DQ4594","Q-K/DQ4132"]
["Re Zoztex","F-E/DQ4809","P-N/DQ1239","S-X/DQ6329","I-O/DQ5603","I-R/DQ4357","K-A/DQ4274"]
["Labfan","B-K/DQ8375","H-F/DQ4313","C-C/DQ1150","L-C/DQ9449","W-Z/DQ9017","B-P/DQ9089"]
["Canex","W-Q/DQ1827","Z-X/DQ5599","H-Y/DQ3392","G-O/DQ8134","P-Z/DQ1145","S-T/DQ9864"]
["Kinsing","D-O/DQ9948","I-C/DQ8877","A-X/DQ1627","U-L/DQ6403","O-E/DQ6432","T-V/DQ6488"]
["Geo-Dax","N-M/DQ4637","Z-F/DQ9504","R-N/DQ8726","E-Q/DQ8209","O-Z/DQ2286","I-B/DQ1744"]
["Freesoft","N-Y/DQ6967","A-R/DQ8303","H-A/DQ8782","P-R/DQ1717","H-C/DQ9144","F-S/DQ3434"]
["Via Kix","B-J/DQ8771","F-S/DQ3920","D-G/DQ8328","C-B/DQ1806","G-Z/DQ2323","T-T/DQ8641"]
["Kan-Dom","I-S/DQ2111","L-J/DQ7510","C-K/DQ5503","Z-V/DQ2269","Z-N/DQ6435","S-Q/DQ1078"]

{"sheet":"MrExcel","index":2,"n_rows":722,"n_cols":9,"rows_kept":722,"cut":false,"hidden":false,"merged":[]}
[]
[]
[]
[]
[]
[]
[]
[]
[]
[]
[]
[]
[]
[]
[]
[]
[]
[]
[]
["From This:",null,null,null,null,null,null,null,"To This:"]
[]
["Product","Sub Product 1","Sub Product 2","Sub Product 3","Sub Product 4","Sub Product 5","Sub Product 6",null,"Join Text"]
["Geo Fan","J-V/DQ1477","N-Y/DQ3773","B-Z/DQ7827","M-W/DQ6663","R-A/DQ8080","S-S/DQ4315",null,"Geo Fan"]
["Kin-Light","S-O/DQ9675","F-Z/DQ5663","T-Y/DQ3628","B-T/DQ6204","S-S/DQ1007","S-R/DQ3874",null,"Geo Fan - J-V/DQ1477"]
["Stock Hotex","W-F/DQ4209","K-I/DQ4485","J-O/DQ5352","Y-V/DQ1863","V-S/DQ1390","J-C/DQ8654",null,"Geo Fan - N-Y/DQ3773"]
["Konk Tinstock","N-R/DQ9237","K-Q/DQ9170","W-I/DQ7389","G-Z/DQ3645","H-K/DQ8345","I-S/DQ3284",null,"Geo Fan - B-Z/DQ7827"]
["Silver-Touch","F-Z/DQ7971","C-X/DQ9559","C-P/DQ9259","R-T/DQ3009","H-F/DQ9091","Z-F/DQ8491",null,"Geo Fan - M-W/DQ6663"]
["S-eco","X-O/DQ2585","R-L/DQ5437","F-G/DQ1353","Q-X/DQ3038","F-H/DQ7618","C-R/DQ6413",null,"Geo Fan - R-A/DQ8080"]
["Unoin","F-U/DQ2015","V-V/DQ1486","G-S/DQ3365","J-J/DQ8974","K-A/DQ1284","P-N/DQ7205",null,"Geo Fan - S-S/DQ4315"]
["Laeco","Y-V/DQ6202","R-T/DQ1158","F-P/DQ2866","Q-Z/DQ9290","T-D/DQ5678","V-V/DQ1452",null,"Kin-Light"]
["Touch-Lam","O-G/DQ1258","B-M/DQ7666","E-F/DQ8623","N-H/DQ1331","A-B/DQ3518","A-S/DQ7923",null,"Kin-Light - S-O/DQ9675"]
["Lot String","G-J/DQ7020","Z-X/DQ5056","T-X/DQ1948","O-M/DQ4209","R-X/DQ8489","K-F/DQ8350",null,"Kin-Light - F-Z/DQ5663"]
["Toncore","B-Q/DQ1113","S-J/DQ8641","T-O/DQ6035","O-D/DQ2138","A-Y/DQ5852","A-P/DQ6874",null,"Kin-Light - T-Y/DQ3628"]
["Greeneco","Z-D/DQ3486","V-L/DQ2156","S-W/DQ3812","O-J/DQ4817","W-U/DQ5837","K-U/DQ5815",null,"Kin-Light - B-T/DQ6204"]
["Airdex","T-Z/DQ8308","Q-Y/DQ1201","X-T/DQ3151","T-U/DQ7219","X-P/DQ1517","Q-E/DQ3131",null,"Kin-Light - S-S/DQ1007"]
["Lamhold","C-D/DQ9157","P-K/DQ1400","G-M/DQ3192","G-S/DQ5812","O-X/DQ5678","V-P/DQ8051",null,"Kin-Light - S-R/DQ3874"]
["Biosing","E-I/DQ8446","D-L/DQ9756","L-O/DQ5650","I-D/DQ6108","O-W/DQ1349","O-J/DQ3480",null,"Stock Hotex"]
["Viais","Z-X/DQ5986","Q-X/DQ5295","B-D/DQ7046","Q-O/DQ4384","E-P/DQ1000","H-A/DQ4471",null,"Stock Hotex - W-F/DQ4209"]
["Zim Lax","N-D/DQ2280","W-K/DQ4119","I-L/DQ5301","Z-M/DQ9782","M-O/DQ2381","D-X/DQ6309",null,"Stock Hotex - K-I/DQ4485"]
["S-lab","Y-S/DQ3406","J-L/DQ1112","Z-Q/DQ1200","Q-E/DQ6957","K-X/DQ6856","C-W/DQ5579",null,"Stock Hotex - J-O/DQ5352"]
["Stanity","R-U/DQ4312","N-X/DQ1329","M-K/DQ7985","U-T/DQ3735","A-X/DQ5877","P-Y/DQ5472",null,"Stock Hotex - Y-V/DQ1863"]
["Contom","H-C/DQ2317","X-V/DQ6726","C-B/DQ5190","Q-Y/DQ2021","E-E/DQ5627","A-K/DQ5855",null,"Stock Hotex - V-S/DQ1390"]
["Lam-Top","T-E/DQ7702","S-M/DQ3163","B-I/DQ6623","U-G/DQ3097","V-D/DQ3996","U-N/DQ7711",null,"Stock Hotex - J-C/DQ8654"]
["Trantraxbam","C-T/DQ4565","Z-F/DQ1695","V-V/DQ3074","V-P/DQ9688","S-M/DQ1541","G-E/DQ8061",null,"Konk Tinstock"]
["Silver Traxsing","N-V/DQ7788","R-O/DQ1810","E-X/DQ4308","T-D/DQ7728","Y-J/DQ5551","D-M/DQ7097",null,"Konk Tinstock - N-R/DQ9237"]
["Softdex","F-G/DQ1406","M-B/DQ8930","L-R/DQ1359","I-P/DQ1241","C-I/DQ3156","R-B/DQ8080",null,"Konk Tinstock - K-Q/DQ9170"]
["Air-Trax","I-Y/DQ6462","U-B/DQ2419","Y-X/DQ9909","J-E/DQ2773","V-E/DQ6312","E-T/DQ4131",null,"Konk Tinstock - W-I/DQ7389"]
["Labfax","W-U/DQ4000","Z-G/DQ3343","U-F/DQ2988","T-R/DQ1925","Z-P/DQ7423","Z-P/DQ9403",null,"Konk Tinstock - G-Z/DQ3645"]
["Konkstatis","H-T/DQ7055","V-Y/DQ8364","U-Z/DQ3697","N-H/DQ9038","L-N/DQ1973","G-T/DQ5579",null,"Konk Tinstock - H-K/DQ8345"]
["Touchtone","D-O/DQ4093","D-C/DQ1506","X-V/DQ3046","Z-T/DQ8406","R-G/DQ2487","O-G/DQ9131",null,"Konk Tinstock - I-S/DQ3284"]
["Ecotone","L-M/DQ2346","W-H/DQ7772","H-O/DQ8735","Y-R/DQ3598","E-Y/DQ1323","C-Q/DQ1220",null,"Silver-Touch"]
["Sublax","K-Z/DQ1958","E-T/DQ1182","D-V/DQ2263","F-Q/DQ1782","F-W/DQ1945","F-J/DQ1793",null,"Silver-Touch - F-Z/DQ7971"]
["Donlab","M-U/DQ5037","E-B/DQ7006","R-Q/DQ3540","I-I/DQ2681","G-U/DQ4067","N-R/DQ9996",null,"Silver-Touch - C-X/DQ9559"]
["Freetaming","P-U/DQ7673","D-V/DQ8854","K-H/DQ9072","G-I/DQ6806","M-M/DQ3184","B-V/DQ1806",null,"Silver-Touch - C-P/DQ9259"]
["Volt Tanstock","E-V/DQ1711","D-D/DQ3113","U-H/DQ3939","V-W/DQ2342","B-C/DQ4270","J-N/DQ2005",null,"Silver-Touch - R-T/DQ3009"]
["Single Zimfax","Q-K/DQ8122","X-H/DQ4021","F-K/DQ3308","H-O/DQ8072","D-Z/DQ6642","P-Q/DQ7285",null,"Silver-Touch - H-F/DQ9091"]
["Nameco","A-E/DQ4006","M-L/DQ5420","A-I/DQ5311","G-N/DQ5865","O-O/DQ6738","I-O/DQ8975",null,"Silver-Touch - Z-F/DQ8491"]
["Canhotin","X-C/DQ7536","H-O/DQ5982","U-U/DQ6424","C-S/DQ9155","O-K/DQ2805","I-S/DQ2919",null,"S-eco"]
["Opedax","V-K/DQ5620","I-A/DQ6402","O-C/DQ1475","U-V/DQ5750","D-W/DQ9169","X-U/DQ4908",null,"S-eco - X-O/DQ2585"]
["Touchfresh","H-C/DQ4665","C-D/DQ6489","R-H/DQ7954","D-D/DQ1228","X-K/DQ6699","D-V/DQ9848",null,"S-eco - R-L/DQ5437"]
["Inhold","V-U/DQ3537","J-U/DQ9185","Y-X/DQ3832","Y-L/DQ3782","L-R/DQ2810","O-M/DQ5259",null,"S-eco - F-G/DQ1353"]
["Saillux","K-S/DQ7277","C-S/DQ6120","J-Y/DQ3382","E-R/DQ2393","P-M/DQ2704","C-C/DQ7661",null,"S-eco - Q-X/DQ3038"]
["Zenjob","D-O/DQ9424","Z-X/DQ3592","E-D/DQ7789","A-P/DQ7456","M-R/DQ7298","H-S/DQ3032",null,"S-eco - F-H/DQ7618"]
["Sum-Home","R-Y/DQ1205","H-I/DQ6676","T-G/DQ3044","V-P/DQ4500","M-I/DQ1594","X-S/DQ9659",null,"S-eco - C-R/DQ6413"]
["Topair","G-H/DQ5891","B-G/DQ5422","A-L/DQ3927","F-N/DQ5639","S-Y/DQ1460","W-T/DQ2891",null,"Unoin"]
["New Cof","A-E/DQ8571","O-B/DQ2118","S-B/DQ3332","J-I/DQ4049","C-D/DQ1103","Q-Z/DQ3080",null,"Unoin - F-U/DQ2015"]
["Silverdom","V-Q/DQ2006","I-H/DQ3986","S-Y/DQ9987","K-W/DQ9789","M-V/DQ6609","E-G/DQ1666",null,"Unoin - V-V/DQ1486"]
["Black Silflex","V-T/DQ8139","M-U/DQ4261","E-M/DQ5191","U-T/DQ6381","T-V/DQ3190","M-I/DQ7893",null,"Unoin - G-S/DQ3365"]
["Zentom","H-O/DQ8291","U-M/DQ2997","D-V/DQ2055","S-F/DQ1630","E-Y/DQ9811","R-D/DQ1916",null,"Unoin - J-J/DQ8974"]
["Antex","U-V/DQ8524","H-O/DQ2807","Y-G/DQ8263","K-X/DQ7690","T-F/DQ6604","X-M/DQ8067",null,"Unoin - K-A/DQ1284"]
["Ranity","M-W/DQ2718","D-W/DQ8974","I-F/DQ8856","E-P/DQ3003","P-J/DQ5975","A-Y/DQ1109",null,"Unoin - P-N/DQ7205"]
["S-kix","K-G/DQ2749","P-J/DQ4709","N-X/DQ2600","B-T/DQ9604","R-W/DQ6294","O-U/DQ2096",null,"Laeco"]
["Zath-Lex","M-X/DQ6178","C-U/DQ1618","O-P/DQ3023","S-T/DQ8619","V-O/DQ9170","P-J/DQ3470",null,"Laeco - Y-V/DQ6202"]
["Tin Tam","V-E/DQ3168","X-O/DQ7726","K-Q/DQ3777","G-C/DQ5626","S-D/DQ7723","R-X/DQ8582",null,"Laeco - R-T/DQ1158"]
["Home-Fix","V-K/DQ4188","W-D/DQ9139","S-W/DQ7140","G-J/DQ2389","L-J/DQ9015","D-D/DQ9127",null,"Laeco - F-P/DQ2866"]
["Strongtax","C-B/DQ7246","S-Z/DQ9931","I-U/DQ6209","R-D/DQ7972","C-N/DQ7927","J-I/DQ6121",null,"Laeco - Q-Z/DQ9290"]
["Scottrax","V-B/DQ7247","R-B/DQ5325","Y-I/DQ1428","R-P/DQ3760","M-X/DQ6435","U-O/DQ2357",null,"Laeco - T-D/DQ5678"]
["Home Ron","W-Q/DQ8964","B-X/DQ4767","A-V/DQ6228","I-T/DQ7745","R-L/DQ1239","Z-L/DQ1190",null,"Laeco - V-V/DQ1452"]
["Mathtip","Q-Z/DQ9353","U-E/DQ3079","U-C/DQ9253","U-I/DQ9502","A-Z/DQ1514","F-H/DQ4922",null,"Touch-Lam"]
["Quad Joytax","U-G/DQ9961","O-N/DQ4189","R-C/DQ7978","X-B/DQ4884","V-P/DQ6114","P-B/DQ6522",null,"Touch-Lam - O-G/DQ1258"]
["Quotejob","A-L/DQ2468","G-J/DQ5678","H-P/DQ9164","C-G/DQ5033","H-E/DQ7018","X-Z/DQ7564",null,"Touch-Lam - B-M/DQ7666"]
["Zen Strong","B-N/DQ7372","C-E/DQ2712","W-Y/DQ2767","Q-K/DQ8866","H-Y/DQ3836","K-I/DQ2152",null,"Touch-Lam - E-F/DQ8623"]
["Stock Touch","V-B/DQ6141","F-K/DQ9978","G-T/DQ4323","E-G/DQ1291","Q-N/DQ9494","X-A/DQ3304",null,"Touch-Lam - N-H/DQ1331"]
["Stockdox","G-J/DQ1262","M-E/DQ9467","T-M/DQ6911","V-W/DQ3008","J-Q/DQ4683","W-D/DQ1503",null,"Touch-Lam - A-B/DQ3518"]
["Y- Lax","L-W/DQ7254","S-I/DQ5658","V-Z/DQ8574","A-L/DQ9394","I-O/DQ2393","E-U/DQ4627",null,"Touch-Lam - A-S/DQ7923"]
["Duolux","W-H/DQ3557","N-L/DQ2999","F-C/DQ1983","X-Q/DQ9087","J-X/DQ8959","Z-V/DQ3936",null,"Lot String"]
["Biofresh","L-A/DQ6923","U-X/DQ7740","H-S/DQ8103","C-E/DQ2233","O-I/DQ5625","F-G/DQ6422",null,"Lot String - G-J/DQ7020"]
["Lam-Find","L-B/DQ6600","J-J/DQ6636","T-F/DQ7235","L-E/DQ5363","S-C/DQ9729","K-U/DQ6401",null,"Lot String - Z-X/DQ5056"]
["Sanlam","U-G/DQ2593","I-N/DQ8908","N-K/DQ7667","C-X/DQ2549","I-I/DQ4036","P-F/DQ5733",null,"Lot String - T-X/DQ1948"]
["Lexiair","N-I/DQ8055","B-X/DQ9278","B-W/DQ6317","P-S/DQ6855","C-L/DQ3860","Z-D/DQ9878",null,"Lot String - O-M/DQ4209"]
["Stat-La","V-R/DQ3359","V-H/DQ7313","F-F/DQ5200","J-Q/DQ5746","A-Q/DQ5080","F-V/DQ2552",null,"Lot String - R-X/DQ8489"]
["Move Jaytop","T-O/DQ7238","F-D/DQ6648","K-A/DQ9049","H-O/DQ2208","I-Z/DQ5486","X-Y/DQ4699",null,"Lot String - K-F/DQ8350"]
["Hottrax","J-H/DQ6022","G-H/DQ5842","W-B/DQ2309","C-L/DQ5586","W-F/DQ3438","X-R/DQ3727",null,"Toncore"]
["Doublehome","I-X/DQ1764","F-V/DQ9308","G-E/DQ9441","D-P/DQ4540","A-C/DQ5093","P-M/DQ5272",null,"Toncore - B-Q/DQ1113"]
["Geoeco","K-I/DQ6541","O-A/DQ4828","L-B/DQ5503","U-G/DQ1778","D-V/DQ5889","N-C/DQ6848",null,"Toncore - S-J/DQ8641"]
["Nimtex","H-V/DQ2801","A-F/DQ3370","E-R/DQ2577","Y-G/DQ7693","P-X/DQ1156","Z-T/DQ1399",null,"Toncore - T-O/DQ6035"]
["Roneco","D-D/DQ9977","W-U/DQ9156","B-F/DQ9761","G-J/DQ8671","M-Z/DQ2823","Y-S/DQ7569",null,"Toncore - O-D/DQ2138"]
["Super Damlex","X-K/DQ5825","B-M/DQ4799","F-Y/DQ7680","E-K/DQ5609","X-H/DQ4124","T-L/DQ1506",null,"Toncore - A-Y/DQ5852"]
["Donlam","I-C/DQ1599","M-W/DQ6736","M-U/DQ3289","D-G/DQ9953","M-K/DQ2272","B-V/DQ4292",null,"Toncore - A-P/DQ6874"]
["Year Quolex","F-Y/DQ5679","E-W/DQ8224","N-X/DQ6670","L-Z/DQ5606","M-J/DQ6877","A-H/DQ1309",null,"Greeneco"]
["Stimlax","B-D/DQ7855","K-E/DQ8332","A-P/DQ4738","V-G/DQ2524","Y-O/DQ9675","N-S/DQ6800",null,"Greeneco - Z-D/DQ3486"]
["Duotouch","Z-V/DQ3753","F-F/DQ5074","A-Y/DQ2802","P-R/DQ8445","Y-H/DQ6655","S-L/DQ4687",null,"Greeneco - V-L/DQ2156"]
["Tam Cof","H-V/DQ1159","I-R/DQ8841","V-Q/DQ8805","X-X/DQ6355","E-B/DQ6085","V-F/DQ3156",null,"Greeneco - S-W/DQ3812"]
["Viafax","C-U/DQ9402","B-J/DQ9539","L-F/DQ2057","O-X/DQ7355","V-V/DQ1752","R-Y/DQ2556",null,"Greeneco - O-J/DQ4817"]
["Plus Zap","F-P/DQ1528","A-R/DQ8428","P-J/DQ8896","C-P/DQ5399","X-Z/DQ5028","S-C/DQ3339",null,"Greeneco - W-U/DQ5837"]
["Toptax","P-P/DQ7924","G-O/DQ6067","Z-J/DQ8325","U-W/DQ4138","C-P/DQ4351","D-U/DQ7085",null,"Greeneco - K-U/DQ5815"]
["Softsoft","K-H/DQ9934","Z-A/DQ9772","T-X/DQ3131","I-W/DQ1963","L-L/DQ3491","R-P/DQ4740",null,"Airdex"]
["Sumremjob","U-I/DQ5770","J-V/DQ1316","S-D/DQ3642","M-Z/DQ8379","I-B/DQ7976","N-C/DQ8554",null,"Airdex - T-Z/DQ8308"]
["Kanflex","M-F/DQ2070","S-Y/DQ9095","R-W/DQ8908","N-L/DQ6432","M-L/DQ8263","L-O/DQ6467",null,"Airdex - Q-Y/DQ1201"]
["Trustlex","Y-G/DQ3874","O-W/DQ1250","F-T/DQ7332","V-Q/DQ9747","J-W/DQ5551","K-Y/DQ4298",null,"Airdex - X-T/DQ3151"]
["Joyis","T-C/DQ6871","J-D/DQ9245","J-P/DQ4029","G-N/DQ6122","A-X/DQ4996","S-J/DQ6029",null,"Airdex - T-U/DQ7219"]
["Salt Damwarm","T-F/DQ5587","Y-L/DQ9024","V-C/DQ9304","U-G/DQ8743","X-K/DQ5215","M-N/DQ7537",null,"Airdex - X-P/DQ1517"]
["Tripple Apin","J-P/DQ7429","P-G/DQ7086","Y-L/DQ6224","I-A/DQ3124","X-R/DQ2483","K-H/DQ1008",null,"Airdex - Q-E/DQ3131"]
["Sil It","I-P/DQ8226","N-P/DQ4986","X-S/DQ9478","J-F/DQ8109","V-V/DQ4594","Q-K/DQ4132",null,"Lamhold"]
["Re Zoztex","F-E/DQ4809","P-N/DQ1239","S-X/DQ6329","I-O/DQ5603","I-R/DQ4357","K-A/DQ4274",null,"Lamhold - C-D/DQ9157"]
["Labfan","B-K/DQ8375","H-F/DQ4313","C-C/DQ1150","L-C/DQ9449","W-Z/DQ9017","B-P/DQ9089",null,"Lamhold - P-K/DQ1400"]
["Canex","W-Q/DQ1827","Z-X/DQ5599","H-Y/DQ3392","G-O/DQ8134","P-Z/DQ1145","S-T/DQ9864",null,"Lamhold - G-M/DQ3192"]
["Kinsing","D-O/DQ9948","I-C/DQ8877","A-X/DQ1627","U-L/DQ6403","O-E/DQ6432","T-V/DQ6488",null,"Lamhold - G-S/DQ5812"]
["Geo-Dax","N-M/DQ4637","Z-F/DQ9504","R-N/DQ8726","E-Q/DQ8209","O-Z/DQ2286","I-B/DQ1744",null,"Lamhold - O-X/DQ5678"]
["Freesoft","N-Y/DQ6967","A-R/DQ8303","H-A/DQ8782","P-R/DQ1717","H-C/DQ9144","F-S/DQ3434",null,"Lamhold - V-P/DQ8051"]
["Via Kix","B-J/DQ8771","F-S/DQ3920","D-G/DQ8328","C-B/DQ1806","G-Z/DQ2323","T-T/DQ8641",null,"Biosing"]
["Kan-Dom","I-S/DQ2111","L-J/DQ7510","C-K/DQ5503","Z-V/DQ2269","Z-N/DQ6435","S-Q/DQ1078",null,"Biosing - E-I/DQ8446"]
[null,null,null,null,null,null,null,null,"Biosing - D-L/DQ9756"]
[null,null,null,null,null,null,null,null,"Biosing - L-O/DQ5650"]
[null,null,null,null,null,null,null,null,"Biosing - I-D/DQ6108"]
[null,null,null,null,null,null,null,null,"Biosing - O-W/DQ1349"]
[null,null,null,null,null,null,null,null,"Biosing - O-J/DQ3480"]
[null,null,null,null,null,null,null,null,"Viais"]
[null,null,null,null,null,null,null,null,"Viais - Z-X/DQ5986"]
[null,null,null,null,null,null,null,null,"Viais - Q-X/DQ5295"]
[null,null,null,null,null,null,null,null,"Viais - B-D/DQ7046"]
[null,null,null,null,null,null,null,null,"Viais - Q-O/DQ4384"]
[null,null,null,null,null,null,null,null,"Viais - E-P/DQ1000"]
[null,null,null,null,null,null,null,null,"Viais - H-A/DQ4471"]
[null,null,null,null,null,null,null,null,"Zim Lax"]
[null,null,null,null,null,null,null,null,"Zim Lax - N-D/DQ2280"]
[null,null,null,null,null,null,null,null,"Zim Lax - W-K/DQ4119"]
[null,null,null,null,null,null,null,null,"Zim Lax - I-L/DQ5301"]
[null,null,null,null,null,null,null,null,"Zim Lax - Z-M/DQ9782"]
[null,null,null,null,null,null,null,null,"Zim Lax - M-O/DQ2381"]
[null,null,null,null,null,null,null,null,"Zim Lax - D-X/DQ6309"]
[null,null,null,null,null,null,null,null,"S-lab"]
[null,null,null,null,null,null,null,null,"S-lab - Y-S/DQ3406"]
[null,null,null,null,null,null,null,null,"S-lab - J-L/DQ1112"]
[null,null,null,null,null,null,null,null,"S-lab - Z-Q/DQ1200"]
[null,null,null,null,null,null,null,null,"S-lab - Q-E/DQ6957"]
[null,null,null,null,null,null,null,null,"S-lab - K-X/DQ6856"]
[null,null,null,null,null,null,null,null,"S-lab - C-W/DQ5579"]
[null,null,null,null,null,null,null,null,"Stanity"]
[null,null,null,null,null,null,null,null,"Stanity - R-U/DQ4312"]
[null,null,null,null,null,null,null,null,"Stanity - N-X/DQ1329"]
[null,null,null,null,null,null,null,null,"Stanity - M-K/DQ7985"]
[null,null,null,null,null,null,null,null,"Stanity - U-T/DQ3735"]
[null,null,null,null,null,null,null,null,"Stanity - A-X/DQ5877"]
[null,null,null,null,null,null,null,null,"Stanity - P-Y/DQ5472"]
[null,null,null,null,null,null,null,null,"Contom"]
[null,null,null,null,null,null,null,null,"Contom - H-C/DQ2317"]
[null,null,null,null,null,null,null,null,"Contom - X-V/DQ6726"]
[null,null,null,null,null,null,null,null,"Contom - C-B/DQ5190"]
[null,null,null,null,null,null,null,null,"Contom - Q-Y/DQ2021"]
[null,null,null,null,null,null,null,null,"Contom - E-E/DQ5627"]
[null,null,null,null,null,null,null,null,"Contom - A-K/DQ5855"]
[null,null,null,null,null,null,null,null,"Lam-Top"]
[null,null,null,null,null,null,null,null,"Lam-Top - T-E/DQ7702"]
[null,null,null,null,null,null,null,null,"Lam-Top - S-M/DQ3163"]
[null,null,null,null,null,null,null,null,"Lam-Top - B-I/DQ6623"]
[null,null,null,null,null,null,null,null,"Lam-Top - U-G/DQ3097"]
[null,null,null,null,null,null,null,null,"Lam-Top - V-D/DQ3996"]
[null,null,null,null,null,null,null,null,"Lam-Top - U-N/DQ7711"]
[null,null,null,null,null,null,null,null,"Trantraxbam"]
[null,null,null,null,null,null,null,null,"Trantraxbam - C-T/DQ4565"]
[null,null,null,null,null,null,null,null,"Trantraxbam - Z-F/DQ1695"]
[null,null,null,null,null,null,null,null,"Trantraxbam - V-V/DQ3074"]
[null,null,null,null,null,null,null,null,"Trantraxbam - V-P/DQ9688"]
[null,null,null,null,null,null,null,null,"Trantraxbam - S-M/DQ1541"]
[null,null,null,null,null,null,null,null,"Trantraxbam - G-E/DQ8061"]
[null,null,null,null,null,null,null,null,"Silver Traxsing"]
[null,null,null,null,null,null,null,null,"Silver Traxsing - N-V/DQ7788"]
[null,null,null,null,null,null,null,null,"Silver Traxsing - R-O/DQ1810"]
[null,null,null,null,null,null,null,null,"Silver Traxsing - E-X/DQ4308"]
[null,null,null,null,null,null,null,null,"Silver Traxsing - T-D/DQ7728"]
[null,null,null,null,null,null,null,null,"Silver Traxsing - Y-J/DQ5551"]
[null,null,null,null,null,null,null,null,"Silver Traxsing - D-M/DQ7097"]
[null,null,null,null,null,null,null,null,"Softdex"]
[null,null,null,null,null,null,null,null,"Softdex - F-G/DQ1406"]
[null,null,null,null,null,null,null,null,"Softdex - M-B/DQ8930"]
[null,null,null,null,null,null,null,null,"Softdex - L-R/DQ1359"]
[null,null,null,null,null,null,null,null,"Softdex - I-P/DQ1241"]
[null,null,null,null,null,null,null,null,"Softdex - C-I/DQ3156"]
[null,null,null,null,null,null,null,null,"Softdex - R-B/DQ8080"]
[null,null,null,null,null,null,null,null,"Air-Trax"]
[null,null,null,null,null,null,null,null,"Air-Trax - I-Y/DQ6462"]
[null,null,null,null,null,null,null,null,"Air-Trax - U-B/DQ2419"]
[null,null,null,null,null,null,null,null,"Air-Trax - Y-X/DQ9909"]
[null,null,null,null,null,null,null,null,"Air-Trax - J-E/DQ2773"]
[null,null,null,null,null,null,null,null,"Air-Trax - V-E/DQ6312"]
[null,null,null,null,null,null,null,null,"Air-Trax - E-T/DQ4131"]
[null,null,null,null,null,null,null,null,"Labfax"]
[null,null,null,null,null,null,null,null,"Labfax - W-U/DQ4000"]
[null,null,null,null,null,null,null,null,"Labfax - Z-G/DQ3343"]
[null,null,null,null,null,null,null,null,"Labfax - U-F/DQ2988"]
[null,null,null,null,null,null,null,null,"Labfax - T-R/DQ1925"]
[null,null,null,null,null,null,null,null,"Labfax - Z-P/DQ7423"]
[null,null,null,null,null,null,null,null,"Labfax - Z-P/DQ9403"]
[null,null,null,null,null,null,null,null,"Konkstatis"]
[null,null,null,null,null,null,null,null,"Konkstatis - H-T/DQ7055"]
[null,null,null,null,null,null,null,null,"Konkstatis - V-Y/DQ8364"]
[null,null,null,null,null,null,null,null,"Konkstatis - U-Z/DQ3697"]
[null,null,null,null,null,null,null,null,"Konkstatis - N-H/DQ9038"]
[null,null,null,null,null,null,null,null,"Konkstatis - L-N/DQ1973"]
[null,null,null,null,null,null,null,null,"Konkstatis - G-T/DQ5579"]
[null,null,null,null,null,null,null,null,"Touchtone"]
[null,null,null,null,null,null,null,null,"Touchtone - D-O/DQ4093"]
[null,null,null,null,null,null,null,null,"Touchtone - D-C/DQ1506"]
[null,null,null,null,null,null,null,null,"Touchtone - X-V/DQ3046"]
[null,null,null,null,null,null,null,null,"Touchtone - Z-T/DQ8406"]
[null,null,null,null,null,null,null,null,"Touchtone - R-G/DQ2487"]
[null,null,null,null,null,null,null,null,"Touchtone - O-G/DQ9131"]
[null,null,null,null,null,null,null,null,"Ecotone"]
[null,null,null,null,null,null,null,null,"Ecotone - L-M/DQ2346"]
[null,null,null,null,null,null,null,null,"Ecotone - W-H/DQ7772"]
[null,null,null,null,null,null,null,null,"Ecotone - H-O/DQ8735"]
[null,null,null,null,null,null,null,null,"Ecotone - Y-R/DQ3598"]
[null,null,null,null,null,null,null,null,"Ecotone - E-Y/DQ1323"]
[null,null,null,null,null,null,null,null,"Ecotone - C-Q/DQ1220"]
[null,null,null,null,null,null,null,null,"Sublax"]
[null,null,null,null,null,null,null,null,"Sublax - K-Z/DQ1958"]
[null,null,null,null,null,null,null,null,"Sublax - E-T/DQ1182"]
[null,null,null,null,null,null,null,null,"Sublax - D-V/DQ2263"]
[null,null,null,null,null,null,null,null,"Sublax - F-Q/DQ1782"]
[null,null,null,null,null,null,null,null,"Sublax - F-W/DQ1945"]
[null,null,null,null,null,null,null,null,"Sublax - F-J/DQ1793"]
[null,null,null,null,null,null,null,null,"Donlab"]
[null,null,null,null,null,null,null,null,"Donlab - M-U/DQ5037"]
[null,null,null,null,null,null,null,null,"Donlab - E-B/DQ7006"]
[null,null,null,null,null,null,null,null,"Donlab - R-Q/DQ3540"]
[null,null,null,null,null,null,null,null,"Donlab - I-I/DQ2681"]
[null,null,null,null,null,null,null,null,"Donlab - G-U/DQ4067"]
[null,null,null,null,null,null,null,null,"Donlab - N-R/DQ9996"]
[null,null,null,null,null,null,null,null,"Freetaming"]
[null,null,null,null,null,null,null,null,"Freetaming - P-U/DQ7673"]
[null,null,null,null,null,null,null,null,"Freetaming - D-V/DQ8854"]
[null,null,null,null,null,null,null,null,"Freetaming - K-H/DQ9072"]
[null,null,null,null,null,null,null,null,"Freetaming - G-I/DQ6806"]
[null,null,null,null,null,null,null,null,"Freetaming - M-M/DQ3184"]
[null,null,null,null,null,null,null,null,"Freetaming - B-V/DQ1806"]
[null,null,null,null,null,null,null,null,"Volt Tanstock"]
[null,null,null,null,null,null,null,null,"Volt Tanstock - E-V/DQ1711"]
[null,null,null,null,null,null,null,null,"Volt Tanstock - D-D/DQ3113"]
[null,null,null,null,null,null,null,null,"Volt Tanstock - U-H/DQ3939"]
[null,null,null,null,null,null,null,null,"Volt Tanstock - V-W/DQ2342"]
[null,null,null,null,null,null,null,null,"Volt Tanstock - B-C/DQ4270"]
[null,null,null,null,null,null,null,null,"Volt Tanstock - J-N/DQ2005"]
[null,null,null,null,null,null,null,null,"Single Zimfax"]
[null,null,null,null,null,null,null,null,"Single Zimfax - Q-K/DQ8122"]
[null,null,null,null,null,null,null,null,"Single Zimfax - X-H/DQ4021"]
[null,null,null,null,null,null,null,null,"Single Zimfax - F-K/DQ3308"]
[null,null,null,null,null,null,null,null,"Single Zimfax - H-O/DQ8072"]
[null,null,null,null,null,null,null,null,"Single Zimfax - D-Z/DQ6642"]
[null,null,null,null,null,null,null,null,"Single Zimfax - P-Q/DQ7285"]
[null,null,null,null,null,null,null,null,"Nameco"]
[null,null,null,null,null,null,null,null,"Nameco - A-E/DQ4006"]
[null,null,null,null,null,null,null,null,"Nameco - M-L/DQ5420"]
[null,null,null,null,null,null,null,null,"Nameco - A-I/DQ5311"]
[null,null,null,null,null,null,null,null,"Nameco - G-N/DQ5865"]
[null,null,null,null,null,null,null,null,"Nameco - O-O/DQ6738"]
[null,null,null,null,null,null,null,null,"Nameco - I-O/DQ8975"]
[null,null,null,null,null,null,null,null,"Canhotin"]
[null,null,null,null,null,null,null,null,"Canhotin - X-C/DQ7536"]
[null,null,null,null,null,null,null,null,"Canhotin - H-O/DQ5982"]
[null,null,null,null,null,null,null,null,"Canhotin - U-U/DQ6424"]
[null,null,null,null,null,null,null,null,"Canhotin - C-S/DQ9155"]
[null,null,null,null,null,null,null,null,"Canhotin - O-K/DQ2805"]
[null,null,null,null,null,null,null,null,"Canhotin - I-S/DQ2919"]
[null,null,null,null,null,null,null,null,"Opedax"]
[null,null,null,null,null,null,null,null,"Opedax - V-K/DQ5620"]
[null,null,null,null,null,null,null,null,"Opedax - I-A/DQ6402"]
[null,null,null,null,null,null,null,null,"Opedax - O-C/DQ1475"]
[null,null,null,null,null,null,null,null,"Opedax - U-V/DQ5750"]
[null,null,null,null,null,null,null,null,"Opedax - D-W/DQ9169"]
[null,null,null,null,null,null,null,null,"Opedax - X-U/DQ4908"]
[null,null,null,null,null,null,null,null,"Touchfresh"]
[null,null,null,null,null,null,null,null,"Touchfresh - H-C/DQ4665"]
[null,null,null,null,null,null,null,null,"Touchfresh - C-D/DQ6489"]
[null,null,null,null,null,null,null,null,"Touchfresh - R-H/DQ7954"]
[null,null,null,null,null,null,null,null,"Touchfresh - D-D/DQ1228"]
[null,null,null,null,null,null,null,null,"Touchfresh - X-K/DQ6699"]
[null,null,null,null,null,null,null,null,"Touchfresh - D-V/DQ9848"]
[null,null,null,null,null,null,null,null,"Inhold"]
[null,null,null,null,null,null,null,null,"Inhold - V-U/DQ3537"]
[null,null,null,null,null,null,null,null,"Inhold - J-U/DQ9185"]
[null,null,null,null,null,null,null,null,"Inhold - Y-X/DQ3832"]
[null,null,null,null,null,null,null,null,"Inhold - Y-L/DQ3782"]
[null,null,null,null,null,null,null,null,"Inhold - L-R/DQ2810"]
[null,null,null,null,null,null,null,null,"Inhold - O-M/DQ5259"]
[null,null,null,null,null,null,null,null,"Saillux"]
[null,null,null,null,null,null,null,null,"Saillux - K-S/DQ7277"]
[null,null,null,null,null,null,null,null,"Saillux - C-S/DQ6120"]
[null,null,null,null,null,null,null,null,"Saillux - J-Y/DQ3382"]
[null,null,null,null,null,null,null,null,"Saillux - E-R/DQ2393"]
[null,null,null,null,null,null,null,null,"Saillux - P-M/DQ2704"]
[null,null,null,null,null,null,null,null,"Saillux - C-C/DQ7661"]
[null,null,null,null,null,null,null,null,"Zenjob"]
[null,null,null,null,null,null,null,null,"Zenjob - D-O/DQ9424"]
[null,null,null,null,null,null,null,null,"Zenjob - Z-X/DQ3592"]
[null,null,null,null,null,null,null,null,"Zenjob - E-D/DQ7789"]
[null,null,null,null,null,null,null,null,"Zenjob - A-P/DQ7456"]
[null,null,null,null,null,null,null,null,"Zenjob - M-R/DQ7298"]
[null,null,null,null,null,null,null,null,"Zenjob - H-S/DQ3032"]
[null,null,null,null,null,null,null,null,"Sum-Home"]
[null,null,null,null,null,null,null,null,"Sum-Home - R-Y/DQ1205"]
[null,null,null,null,null,null,null,null,"Sum-Home - H-I/DQ6676"]
[null,null,null,null,null,null,null,null,"Sum-Home - T-G/DQ3044"]
[null,null,null,null,null,null,null,null,"Sum-Home - V-P/DQ4500"]
[null,null,null,null,null,null,null,null,"Sum-Home - M-I/DQ1594"]
[null,null,null,null,null,null,null,null,"Sum-Home - X-S/DQ9659"]
[null,null,null,null,null,null,null,null,"Topair"]
[null,null,null,null,null,null,null,null,"Topair - G-H/DQ5891"]
[null,null,null,null,null,null,null,null,"Topair - B-G/DQ5422"]
[null,null,null,null,null,null,null,null,"Topair - A-L/DQ3927"]
[null,null,null,null,null,null,null,null,"Topair - F-N/DQ5639"]
[null,null,null,null,null,null,null,null,"Topair - S-Y/DQ1460"]
[null,null,null,null,null,null,null,null,"Topair - W-T/DQ2891"]
[null,null,null,null,null,null,null,null,"New Cof"]
[null,null,null,null,null,null,null,null,"New Cof - A-E/DQ8571"]
[null,null,null,null,null,null,null,null,"New Cof - O-B/DQ2118"]
[null,null,null,null,null,null,null,null,"New Cof - S-B/DQ3332"]
[null,null,null,null,null,null,null,null,"New Cof - J-I/DQ4049"]
[null,null,null,null,null,null,null,null,"New Cof - C-D/DQ1103"]
[null,null,null,null,null,null,null,null,"New Cof - Q-Z/DQ3080"]
[null,null,null,null,null,null,null,null,"Silverdom"]
[null,null,null,null,null,null,null,null,"Silverdom - V-Q/DQ2006"]
[null,null,null,null,null,null,null,null,"Silverdom - I-H/DQ3986"]
[null,null,null,null,null,null,null,null,"Silverdom - S-Y/DQ9987"]
[null,null,null,null,null,null,null,null,"Silverdom - K-W/DQ9789"]
[null,null,null,null,null,null,null,null,"Silverdom - M-V/DQ6609"]
[null,null,null,null,null,null,null,null,"Silverdom - E-G/DQ1666"]
[null,null,null,null,null,null,null,null,"Black Silflex"]
[null,null,null,null,null,null,null,null,"Black Silflex - V-T/DQ8139"]
[null,null,null,null,null,null,null,null,"Black Silflex - M-U/DQ4261"]
[null,null,null,null,null,null,null,null,"Black Silflex - E-M/DQ5191"]
[null,null,null,null,null,null,null,null,"Black Silflex - U-T/DQ6381"]
[null,null,null,null,null,null,null,null,"Black Silflex - T-V/DQ3190"]
[null,null,null,null,null,null,null,null,"Black Silflex - M-I/DQ7893"]
[null,null,null,null,null,null,null,null,"Zentom"]
[null,null,null,null,null,null,null,null,"Zentom - H-O/DQ8291"]
[null,null,null,null,null,null,null,null,"Zentom - U-M/DQ2997"]
[null,null,null,null,null,null,null,null,"Zentom - D-V/DQ2055"]
[null,null,null,null,null,null,null,null,"Zentom - S-F/DQ1630"]
[null,null,null,null,null,null,null,null,"Zentom - E-Y/DQ9811"]
[null,null,null,null,null,null,null,null,"Zentom - R-D/DQ1916"]
[null,null,null,null,null,null,null,null,"Antex"]
[null,null,null,null,null,null,null,null,"Antex - U-V/DQ8524"]
[null,null,null,null,null,null,null,null,"Antex - H-O/DQ2807"]
[null,null,null,null,null,null,null,null,"Antex - Y-G/DQ8263"]
[null,null,null,null,null,null,null,null,"Antex - K-X/DQ7690"]
[null,null,null,null,null,null,null,null,"Antex - T-F/DQ6604"]
[null,null,null,null,null,null,null,null,"Antex - X-M/DQ8067"]
[null,null,null,null,null,null,null,null,"Ranity"]
[null,null,null,null,null,null,null,null,"Ranity - M-W/DQ2718"]
[null,null,null,null,null,null,null,null,"Ranity - D-W/DQ8974"]
[null,null,null,null,null,null,null,null,"Ranity - I-F/DQ8856"]
[null,null,null,null,null,null,null,null,"Ranity - E-P/DQ3003"]
[null,null,null,null,null,null,null,null,"Ranity - P-J/DQ5975"]
[null,null,null,null,null,null,null,null,"Ranity - A-Y/DQ1109"]
[null,null,null,null,null,null,null,null,"S-kix"]
[null,null,null,null,null,null,null,null,"S-kix - K-G/DQ2749"]
[null,null,null,null,null,null,null,null,"S-kix - P-J/DQ4709"]
[null,null,null,null,null,null,null,null,"S-kix - N-X/DQ2600"]
[null,null,null,null,null,null,null,null,"S-kix - B-T/DQ9604"]
[null,null,null,null,null,null,null,null,"S-kix - R-W/DQ6294"]
[null,null,null,null,null,null,null,null,"S-kix - O-U/DQ2096"]
[null,null,null,null,null,null,null,null,"Zath-Lex"]
[null,null,null,null,null,null,null,null,"Zath-Lex - M-X/DQ6178"]
[null,null,null,null,null,null,null,null,"Zath-Lex - C-U/DQ1618"]
[null,null,null,null,null,null,null,null,"Zath-Lex - O-P/DQ3023"]
[null,null,null,null,null,null,null,null,"Zath-Lex - S-T/DQ8619"]
[null,null,null,null,null,null,null,null,"Zath-Lex - V-O/DQ9170"]
[null,null,null,null,null,null,null,null,"Zath-Lex - P-J/DQ3470"]
[null,null,null,null,null,null,null,null,"Tin Tam"]
[null,null,null,null,null,null,null,null,"Tin Tam - V-E/DQ3168"]
[null,null,null,null,null,null,null,null,"Tin Tam - X-O/DQ7726"]
[null,null,null,null,null,null,null,null,"Tin Tam - K-Q/DQ3777"]
[null,null,null,null,null,null,null,null,"Tin Tam - G-C/DQ5626"]
[null,null,null,null,null,null,null,null,"Tin Tam - S-D/DQ7723"]
[null,null,null,null,null,null,null,null,"Tin Tam - R-X/DQ8582"]
[null,null,null,null,null,null,null,null,"Home-Fix"]
[null,null,null,null,null,null,null,null,"Home-Fix - V-K/DQ4188"]
[null,null,null,null,null,null,null,null,"Home-Fix - W-D/DQ9139"]
[null,null,null,null,null,null,null,null,"Home-Fix - S-W/DQ7140"]
[null,null,null,null,null,null,null,null,"Home-Fix - G-J/DQ2389"]
[null,null,null,null,null,null,null,null,"Home-Fix - L-J/DQ9015"]
[null,null,null,null,null,null,null,null,"Home-Fix - D-D/DQ9127"]
[null,null,null,null,null,null,null,null,"Strongtax"]
[null,null,null,null,null,null,null,null,"Strongtax - C-B/DQ7246"]
[null,null,null,null,null,null,null,null,"Strongtax - S-Z/DQ9931"]
[null,null,null,null,null,null,null,null,"Strongtax - I-U/DQ6209"]
[null,null,null,null,null,null,null,null,"Strongtax - R-D/DQ7972"]
[null,null,null,null,null,null,null,null,"Strongtax - C-N/DQ7927"]
[null,null,null,null,null,null,null,null,"Strongtax - J-I/DQ6121"]
[null,null,null,null,null,null,null,null,"Scottrax"]
[null,null,null,null,null,null,null,null,"Scottrax - V-B/DQ7247"]
[null,null,null,null,null,null,null,null,"Scottrax - R-B/DQ5325"]
[null,null,null,null,null,null,null,null,"Scottrax - Y-I/DQ1428"]
[null,null,null,null,null,null,null,null,"Scottrax - R-P/DQ3760"]
[null,null,null,null,null,null,null,null,"Scottrax - M-X/DQ6435"]
[null,null,null,null,null,null,null,null,"Scottrax - U-O/DQ2357"]
[null,null,null,null,null,null,null,null,"Home Ron"]
[null,null,null,null,null,null,null,null,"Home Ron - W-Q/DQ8964"]
[null,null,null,null,null,null,null,null,"Home Ron - B-X/DQ4767"]
[null,null,null,null,null,null,null,null,"Home Ron - A-V/DQ6228"]
[null,null,null,null,null,null,null,null,"Home Ron - I-T/DQ7745"]
[null,null,null,null,null,null,null,null,"Home Ron - R-L/DQ1239"]
[null,null,null,null,null,null,null,null,"Home Ron - Z-L/DQ1190"]
[null,null,null,null,null,null,null,null,"Mathtip"]
[null,null,null,null,null,null,null,null,"Mathtip - Q-Z/DQ9353"]
[null,null,null,null,null,null,null,null,"Mathtip - U-E/DQ3079"]
[null,null,null,null,null,null,null,null,"Mathtip - U-C/DQ9253"]
[null,null,null,null,null,null,null,null,"Mathtip - U-I/DQ9502"]
[null,null,null,null,null,null,null,null,"Mathtip - A-Z/DQ1514"]
[null,null,null,null,null,null,null,null,"Mathtip - F-H/DQ4922"]
[null,null,null,null,null,null,null,null,"Quad Joytax"]
[null,null,null,null,null,null,null,null,"Quad Joytax - U-G/DQ9961"]
[null,null,null,null,null,null,null,null,"Quad Joytax - O-N/DQ4189"]
[null,null,null,null,null,null,null,null,"Quad Joytax - R-C/DQ7978"]
[null,null,null,null,null,null,null,null,"Quad Joytax - X-B/DQ4884"]
[null,null,null,null,null,null,null,null,"Quad Joytax - V-P/DQ6114"]
[null,null,null,null,null,null,null,null,"Quad Joytax - P-B/DQ6522"]
[null,null,null,null,null,null,null,null,"Quotejob"]
[null,null,null,null,null,null,null,null,"Quotejob - A-L/DQ2468"]
[null,null,null,null,null,null,null,null,"Quotejob - G-J/DQ5678"]
[null,null,null,null,null,null,null,null,"Quotejob - H-P/DQ9164"]
[null,null,null,null,null,null,null,null,"Quotejob - C-G/DQ5033"]
[null,null,null,null,null,null,null,null,"Quotejob - H-E/DQ7018"]
[null,null,null,null,null,null,null,null,"Quotejob - X-Z/DQ7564"]
[null,null,null,null,null,null,null,null,"Zen Strong"]
[null,null,null,null,null,null,null,null,"Zen Strong - B-N/DQ7372"]
[null,null,null,null,null,null,null,null,"Zen Strong - C-E/DQ2712"]
[null,null,null,null,null,null,null,null,"Zen Strong - W-Y/DQ2767"]
[null,null,null,null,null,null,null,null,"Zen Strong - Q-K/DQ8866"]
[null,null,null,null,null,null,null,null,"Zen Strong - H-Y/DQ3836"]
[null,null,null,null,null,null,null,null,"Zen Strong - K-I/DQ2152"]
[null,null,null,null,null,null,null,null,"Stock Touch"]
[null,null,null,null,null,null,null,null,"Stock Touch - V-B/DQ6141"]
[null,null,null,null,null,null,null,null,"Stock Touch - F-K/DQ9978"]
[null,null,null,null,null,null,null,null,"Stock Touch - G-T/DQ4323"]
[null,null,null,null,null,null,null,null,"Stock Touch - E-G/DQ1291"]
[null,null,null,null,null,null,null,null,"Stock Touch - Q-N/DQ9494"]
[null,null,null,null,null,null,null,null,"Stock Touch - X-A/DQ3304"]
[null,null,null,null,null,null,null,null,"Stockdox"]
[null,null,null,null,null,null,null,null,"Stockdox - G-J/DQ1262"]
[null,null,null,null,null,null,null,null,"Stockdox - M-E/DQ9467"]
[null,null,null,null,null,null,null,null,"Stockdox - T-M/DQ6911"]
[null,null,null,null,null,null,null,null,"Stockdox - V-W/DQ3008"]
[null,null,null,null,null,null,null,null,"Stockdox - J-Q/DQ4683"]
[null,null,null,null,null,null,null,null,"Stockdox - W-D/DQ1503"]
[null,null,null,null,null,null,null,null,"Y- Lax"]
[null,null,null,null,null,null,null,null,"Y- Lax - L-W/DQ7254"]
[null,null,null,null,null,null,null,null,"Y- Lax - S-I/DQ5658"]
[null,null,null,null,null,null,null,null,"Y- Lax - V-Z/DQ8574"]
[null,null,null,null,null,null,null,null,"Y- Lax - A-L/DQ9394"]
[null,null,null,null,null,null,null,null,"Y- Lax - I-O/DQ2393"]
[null,null,null,null,null,null,null,null,"Y- Lax - E-U/DQ4627"]
[null,null,null,null,null,null,null,null,"Duolux"]
[null,null,null,null,null,null,null,null,"Duolux - W-H/DQ3557"]
[null,null,null,null,null,null,null,null,"Duolux - N-L/DQ2999"]
[null,null,null,null,null,null,null,null,"Duolux - F-C/DQ1983"]
[null,null,null,null,null,null,null,null,"Duolux - X-Q/DQ9087"]
[null,null,null,null,null,null,null,null,"Duolux - J-X/DQ8959"]
[null,null,null,null,null,null,null,null,"Duolux - Z-V/DQ3936"]
[null,null,null,null,null,null,null,null,"Biofresh"]
[null,null,null,null,null,null,null,null,"Biofresh - L-A/DQ6923"]
[null,null,null,null,null,null,null,null,"Biofresh - U-X/DQ7740"]
[null,null,null,null,null,null,null,null,"Biofresh - H-S/DQ8103"]
[null,null,null,null,null,null,null,null,"Biofresh - C-E/DQ2233"]
[null,null,null,null,null,null,null,null,"Biofresh - O-I/DQ5625"]
[null,null,null,null,null,null,null,null,"Biofresh - F-G/DQ6422"]
[null,null,null,null,null,null,null,null,"Lam-Find"]
[null,null,null,null,null,null,null,null,"Lam-Find - L-B/DQ6600"]
[null,null,null,null,null,null,null,null,"Lam-Find - J-J/DQ6636"]
[null,null,null,null,null,null,null,null,"Lam-Find - T-F/DQ7235"]
[null,null,null,null,null,null,null,null,"Lam-Find - L-E/DQ5363"]
[null,null,null,null,null,null,null,null,"Lam-Find - S-C/DQ9729"]
[null,null,null,null,null,null,null,null,"Lam-Find - K-U/DQ6401"]
[null,null,null,null,null,null,null,null,"Sanlam"]
[null,null,null,null,null,null,null,null,"Sanlam - U-G/DQ2593"]
[null,null,null,null,null,null,null,null,"Sanlam - I-N/DQ8908"]
[null,null,null,null,null,null,null,null,"Sanlam - N-K/DQ7667"]
[null,null,null,null,null,null,null,null,"Sanlam - C-X/DQ2549"]
[null,null,null,null,null,null,null,null,"Sanlam - I-I/DQ4036"]
[null,null,null,null,null,null,null,null,"Sanlam - P-F/DQ5733"]
[null,null,null,null,null,null,null,null,"Lexiair"]
[null,null,null,null,null,null,null,null,"Lexiair - N-I/DQ8055"]
[null,null,null,null,null,null,null,null,"Lexiair - B-X/DQ9278"]
[null,null,null,null,null,null,null,null,"Lexiair - B-W/DQ6317"]
[null,null,null,null,null,null,null,null,"Lexiair - P-S/DQ6855"]
[null,null,null,null,null,null,null,null,"Lexiair - C-L/DQ3860"]
[null,null,null,null,null,null,null,null,"Lexiair - Z-D/DQ9878"]
[null,null,null,null,null,null,null,null,"Stat-La"]
[null,null,null,null,null,null,null,null,"Stat-La - V-R/DQ3359"]
[null,null,null,null,null,null,null,null,"Stat-La - V-H/DQ7313"]
[null,null,null,null,null,null,null,null,"Stat-La - F-F/DQ5200"]
[null,null,null,null,null,null,null,null,"Stat-La - J-Q/DQ5746"]
[null,null,null,null,null,null,null,null,"Stat-La - A-Q/DQ5080"]
[null,null,null,null,null,null,null,null,"Stat-La - F-V/DQ2552"]
[null,null,null,null,null,null,null,null,"Move Jaytop"]
[null,null,null,null,null,null,null,null,"Move Jaytop - T-O/DQ7238"]
[null,null,null,null,null,null,null,null,"Move Jaytop - F-D/DQ6648"]
[null,null,null,null,null,null,null,null,"Move Jaytop - K-A/DQ9049"]
[null,null,null,null,null,null,null,null,"Move Jaytop - H-O/DQ2208"]
[null,null,null,null,null,null,null,null,"Move Jaytop - I-Z/DQ5486"]
[null,null,null,null,null,null,null,null,"Move Jaytop - X-Y/DQ4699"]
[null,null,null,null,null,null,null,null,"Hottrax"]
[null,null,null,null,null,null,null,null,"Hottrax - J-H/DQ6022"]
[null,null,null,null,null,null,null,null,"Hottrax - G-H/DQ5842"]
[null,null,null,null,null,null,null,null,"Hottrax - W-B/DQ2309"]
[null,null,null,null,null,null,null,null,"Hottrax - C-L/DQ5586"]
[null,null,null,null,null,null,null,null,"Hottrax - W-F/DQ3438"]
[null,null,null,null,null,null,null,null,"Hottrax - X-R/DQ3727"]
[null,null,null,null,null,null,null,null,"Doublehome"]
[null,null,null,null,null,null,null,null,"Doublehome - I-X/DQ1764"]
[null,null,null,null,null,null,null,null,"Doublehome - F-V/DQ9308"]
[null,null,null,null,null,null,null,null,"Doublehome - G-E/DQ9441"]
[null,null,null,null,null,null,null,null,"Doublehome - D-P/DQ4540"]
[null,null,null,null,null,null,null,null,"Doublehome - A-C/DQ5093"]
[null,null,null,null,null,null,null,null,"Doublehome - P-M/DQ5272"]
[null,null,null,null,null,null,null,null,"Geoeco"]
[null,null,null,null,null,null,null,null,"Geoeco - K-I/DQ6541"]
[null,null,null,null,null,null,null,null,"Geoeco - O-A/DQ4828"]
[null,null,null,null,null,null,null,null,"Geoeco - L-B/DQ5503"]
[null,null,null,null,null,null,null,null,"Geoeco - U-G/DQ1778"]
[null,null,null,null,null,null,null,null,"Geoeco - D-V/DQ5889"]
[null,null,null,null,null,null,null,null,"Geoeco - N-C/DQ6848"]
[null,null,null,null,null,null,null,null,"Nimtex"]
[null,null,null,null,null,null,null,null,"Nimtex - H-V/DQ2801"]
[null,null,null,null,null,null,null,null,"Nimtex - A-F/DQ3370"]
[null,null,null,null,null,null,null,null,"Nimtex - E-R/DQ2577"]
[null,null,null,null,null,null,null,null,"Nimtex - Y-G/DQ7693"]
[null,null,null,null,null,null,null,null,"Nimtex - P-X/DQ1156"]
[null,null,null,null,null,null,null,null,"Nimtex - Z-T/DQ1399"]
[null,null,null,null,null,null,null,null,"Roneco"]
[null,null,null,null,null,null,null,null,"Roneco - D-D/DQ9977"]
[null,null,null,null,null,null,null,null,"Roneco - W-U/DQ9156"]
[null,null,null,null,null,null,null,null,"Roneco - B-F/DQ9761"]
[null,null,null,null,null,null,null,null,"Roneco - G-J/DQ8671"]
[null,null,null,null,null,null,null,null,"Roneco - M-Z/DQ2823"]
[null,null,null,null,null,null,null,null,"Roneco - Y-S/DQ7569"]
[null,null,null,null,null,null,null,null,"Super Damlex"]
[null,null,null,null,null,null,null,null,"Super Damlex - X-K/DQ5825"]
[null,null,null,null,null,null,null,null,"Super Damlex - B-M/DQ4799"]
[null,null,null,null,null,null,null,null,"Super Damlex - F-Y/DQ7680"]
[null,null,null,null,null,null,null,null,"Super Damlex - E-K/DQ5609"]
[null,null,null,null,null,null,null,null,"Super Damlex - X-H/DQ4124"]
[null,null,null,null,null,null,null,null,"Super Damlex - T-L/DQ1506"]
[null,null,null,null,null,null,null,null,"Donlam"]
[null,null,null,null,null,null,null,null,"Donlam - I-C/DQ1599"]
[null,null,null,null,null,null,null,null,"Donlam - M-W/DQ6736"]
[null,null,null,null,null,null,null,null,"Donlam - M-U/DQ3289"]
[null,null,null,null,null,null,null,null,"Donlam - D-G/DQ9953"]
[null,null,null,null,null,null,null,null,"Donlam - M-K/DQ2272"]
[null,null,null,null,null,null,null,null,"Donlam - B-V/DQ4292"]
[null,null,null,null,null,null,null,null,"Year Quolex"]
[null,null,null,null,null,null,null,null,"Year Quolex - F-Y/DQ5679"]
[null,null,null,null,null,null,null,null,"Year Quolex - E-W/DQ8224"]
[null,null,null,null,null,null,null,null,"Year Quolex - N-X/DQ6670"]
[null,null,null,null,null,null,null,null,"Year Quolex - L-Z/DQ5606"]
[null,null,null,null,null,null,null,null,"Year Quolex - M-J/DQ6877"]
[null,null,null,null,null,null,null,null,"Year Quolex - A-H/DQ1309"]
[null,null,null,null,null,null,null,null,"Stimlax"]
[null,null,null,null,null,null,null,null,"Stimlax - B-D/DQ7855"]
[null,null,null,null,null,null,null,null,"Stimlax - K-E/DQ8332"]
[null,null,null,null,null,null,null,null,"Stimlax - A-P/DQ4738"]
[null,null,null,null,null,null,null,null,"Stimlax - V-G/DQ2524"]
[null,null,null,null,null,null,null,null,"Stimlax - Y-O/DQ9675"]
[null,null,null,null,null,null,null,null,"Stimlax - N-S/DQ6800"]
[null,null,null,null,null,null,null,null,"Duotouch"]
[null,null,null,null,null,null,null,null,"Duotouch - Z-V/DQ3753"]
[null,null,null,null,null,null,null,null,"Duotouch - F-F/DQ5074"]
[null,null,null,null,null,null,null,null,"Duotouch - A-Y/DQ2802"]
[null,null,null,null,null,null,null,null,"Duotouch - P-R/DQ8445"]
[null,null,null,null,null,null,null,null,"Duotouch - Y-H/DQ6655"]
[null,null,null,null,null,null,null,null,"Duotouch - S-L/DQ4687"]
[null,null,null,null,null,null,null,null,"Tam Cof"]
[null,null,null,null,null,null,null,null,"Tam Cof - H-V/DQ1159"]
[null,null,null,null,null,null,null,null,"Tam Cof - I-R/DQ8841"]
[null,null,null,null,null,null,null,null,"Tam Cof - V-Q/DQ8805"]
[null,null,null,null,null,null,null,null,"Tam Cof - X-X/DQ6355"]
[null,null,null,null,null,null,null,null,"Tam Cof - E-B/DQ6085"]
[null,null,null,null,null,null,null,null,"Tam Cof - V-F/DQ3156"]
[null,null,null,null,null,null,null,null,"Viafax"]
[null,null,null,null,null,null,null,null,"Viafax - C-U/DQ9402"]
[null,null,null,null,null,null,null,null,"Viafax - B-J/DQ9539"]
[null,null,null,null,null,null,null,null,"Viafax - L-F/DQ2057"]
[null,null,null,null,null,null,null,null,"Viafax - O-X/DQ7355"]
[null,null,null,null,null,null,null,null,"Viafax - V-V/DQ1752"]
[null,null,null,null,null,null,null,null,"Viafax - R-Y/DQ2556"]
[null,null,null,null,null,null,null,null,"Plus Zap"]
[null,null,null,null,null,null,null,null,"Plus Zap - F-P/DQ1528"]
[null,null,null,null,null,null,null,null,"Plus Zap - A-R/DQ8428"]
[null,null,null,null,null,null,null,null,"Plus Zap - P-J/DQ8896"]
[null,null,null,null,null,null,null,null,"Plus Zap - C-P/DQ5399"]
[null,null,null,null,null,null,null,null,"Plus Zap - X-Z/DQ5028"]
[null,null,null,null,null,null,null,null,"Plus Zap - S-C/DQ3339"]
[null,null,null,null,null,null,null,null,"Toptax"]
[null,null,null,null,null,null,null,null,"Toptax - P-P/DQ7924"]
[null,null,null,null,null,null,null,null,"Toptax - G-O/DQ6067"]
[null,null,null,null,null,null,null,null,"Toptax - Z-J/DQ8325"]
[null,null,null,null,null,null,null,null,"Toptax - U-W/DQ4138"]
[null,null,null,null,null,null,null,null,"Toptax - C-P/DQ4351"]
[null,null,null,null,null,null,null,null,"Toptax - D-U/DQ7085"]
[null,null,null,null,null,null,null,null,"Softsoft"]
[null,null,null,null,null,null,null,null,"Softsoft - K-H/DQ9934"]
[null,null,null,null,null,null,null,null,"Softsoft - Z-A/DQ9772"]
[null,null,null,null,null,null,null,null,"Softsoft - T-X/DQ3131"]
[null,null,null,null,null,null,null,null,"Softsoft - I-W/DQ1963"]
[null,null,null,null,null,null,null,null,"Softsoft - L-L/DQ3491"]
[null,null,null,null,null,null,null,null,"Softsoft - R-P/DQ4740"]
[null,null,null,null,null,null,null,null,"Sumremjob"]
[null,null,null,null,null,null,null,null,"Sumremjob - U-I/DQ5770"]
[null,null,null,null,null,null,null,null,"Sumremjob - J-V/DQ1316"]
[null,null,null,null,null,null,null,null,"Sumremjob - S-D/DQ3642"]
[null,null,null,null,null,null,null,null,"Sumremjob - M-Z/DQ8379"]
[null,null,null,null,null,null,null,null,"Sumremjob - I-B/DQ7976"]
[null,null,null,null,null,null,null,null,"Sumremjob - N-C/DQ8554"]
[null,null,null,null,null,null,null,null,"Kanflex"]
[null,null,null,null,null,null,null,null,"Kanflex - M-F/DQ2070"]
[null,null,null,null,null,null,null,null,"Kanflex - S-Y/DQ9095"]
[null,null,null,null,null,null,null,null,"Kanflex - R-W/DQ8908"]
[null,null,null,null,null,null,null,null,"Kanflex - N-L/DQ6432"]
[null,null,null,null,null,null,null,null,"Kanflex - M-L/DQ8263"]
[null,null,null,null,null,null,null,null,"Kanflex - L-O/DQ6467"]
[null,null,null,null,null,null,null,null,"Trustlex"]
[null,null,null,null,null,null,null,null,"Trustlex - Y-G/DQ3874"]
[null,null,null,null,null,null,null,null,"Trustlex - O-W/DQ1250"]
[null,null,null,null,null,null,null,null,"Trustlex - F-T/DQ7332"]
[null,null,null,null,null,null,null,null,"Trustlex - V-Q/DQ9747"]
[null,null,null,null,null,null,null,null,"Trustlex - J-W/DQ5551"]
[null,null,null,null,null,null,null,null,"Trustlex - K-Y/DQ4298"]
[null,null,null,null,null,null,null,null,"Joyis"]
[null,null,null,null,null,null,null,null,"Joyis - T-C/DQ6871"]
[null,null,null,null,null,null,null,null,"Joyis - J-D/DQ9245"]
[null,null,null,null,null,null,null,null,"Joyis - J-P/DQ4029"]
[null,null,null,null,null,null,null,null,"Joyis - G-N/DQ6122"]
[null,null,null,null,null,null,null,null,"Joyis - A-X/DQ4996"]
[null,null,null,null,null,null,null,null,"Joyis - S-J/DQ6029"]
[null,null,null,null,null,null,null,null,"Salt Damwarm"]
[null,null,null,null,null,null,null,null,"Salt Damwarm - T-F/DQ5587"]
[null,null,null,null,null,null,null,null,"Salt Damwarm - Y-L/DQ9024"]
[null,null,null,null,null,null,null,null,"Salt Damwarm - V-C/DQ9304"]
[null,null,null,null,null,null,null,null,"Salt Damwarm - U-G/DQ8743"]
[null,null,null,null,null,null,null,null,"Salt Damwarm - X-K/DQ5215"]
[null,null,null,null,null,null,null,null,"Salt Damwarm - M-N/DQ7537"]
[null,null,null,null,null,null,null,null,"Tripple Apin"]
[null,null,null,null,null,null,null,null,"Tripple Apin - J-P/DQ7429"]
[null,null,null,null,null,null,null,null,"Tripple Apin - P-G/DQ7086"]
[null,null,null,null,null,null,null,null,"Tripple Apin - Y-L/DQ6224"]
[null,null,null,null,null,null,null,null,"Tripple Apin - I-A/DQ3124"]
[null,null,null,null,null,null,null,null,"Tripple Apin - X-R/DQ2483"]
[null,null,null,null,null,null,null,null,"Tripple Apin - K-H/DQ1008"]
[null,null,null,null,null,null,null,null,"Sil It"]
[null,null,null,null,null,null,null,null,"Sil It - I-P/DQ8226"]
[null,null,null,null,null,null,null,null,"Sil It - N-P/DQ4986"]
[null,null,null,null,null,null,null,null,"Sil It - X-S/DQ9478"]
[null,null,null,null,null,null,null,null,"Sil It - J-F/DQ8109"]
[null,null,null,null,null,null,null,null,"Sil It - V-V/DQ4594"]
[null,null,null,null,null,null,null,null,"Sil It - Q-K/DQ4132"]
[null,null,null,null,null,null,null,null,"Re Zoztex"]
[null,null,null,null,null,null,null,null,"Re Zoztex - F-E/DQ4809"]
[null,null,null,null,null,null,null,null,"Re Zoztex - P-N/DQ1239"]
[null,null,null,null,null,null,null,null,"Re Zoztex - S-X/DQ6329"]
[null,null,null,null,null,null,null,null,"Re Zoztex - I-O/DQ5603"]
[null,null,null,null,null,null,null,null,"Re Zoztex - I-R/DQ4357"]
[null,null,null,null,null,null,null,null,"Re Zoztex - K-A/DQ4274"]
[null,null,null,null,null,null,null,null,"Labfan"]
[null,null,null,null,null,null,null,null,"Labfan - B-K/DQ8375"]
[null,null,null,null,null,null,null,null,"Labfan - H-F/DQ4313"]
[null,null,null,null,null,null,null,null,"Labfan - C-C/DQ1150"]
[null,null,null,null,null,null,null,null,"Labfan - L-C/DQ9449"]
[null,null,null,null,null,null,null,null,"Labfan - W-Z/DQ9017"]
[null,null,null,null,null,null,null,null,"Labfan - B-P/DQ9089"]
[null,null,null,null,null,null,null,null,"Canex"]
[null,null,null,null,null,null,null,null,"Canex - W-Q/DQ1827"]
[null,null,null,null,null,null,null,null,"Canex - Z-X/DQ5599"]
[null,null,null,null,null,null,null,null,"Canex - H-Y/DQ3392"]
[null,null,null,null,null,null,null,null,"Canex - G-O/DQ8134"]
[null,null,null,null,null,null,null,null,"Canex - P-Z/DQ1145"]
[null,null,null,null,null,null,null,null,"Canex - S-T/DQ9864"]
[null,null,null,null,null,null,null,null,"Kinsing"]
[null,null,null,null,null,null,null,null,"Kinsing - D-O/DQ9948"]
[null,null,null,null,null,null,null,null,"Kinsing - I-C/DQ8877"]
[null,null,null,null,null,null,null,null,"Kinsing - A-X/DQ1627"]
[null,null,null,null,null,null,null,null,"Kinsing - U-L/DQ6403"]
[null,null,null,null,null,null,null,null,"Kinsing - O-E/DQ6432"]
[null,null,null,null,null,null,null,null,"Kinsing - T-V/DQ6488"]
[null,null,null,null,null,null,null,null,"Geo-Dax"]
[null,null,null,null,null,null,null,null,"Geo-Dax - N-M/DQ4637"]
[null,null,null,null,null,null,null,null,"Geo-Dax - Z-F/DQ9504"]
[null,null,null,null,null,null,null,null,"Geo-Dax - R-N/DQ8726"]
[null,null,null,null,null,null,null,null,"Geo-Dax - E-Q/DQ8209"]
[null,null,null,null,null,null,null,null,"Geo-Dax - O-Z/DQ2286"]
[null,null,null,null,null,null,null,null,"Geo-Dax - I-B/DQ1744"]
[null,null,null,null,null,null,null,null,"Freesoft"]
[null,null,null,null,null,null,null,null,"Freesoft - N-Y/DQ6967"]
[null,null,null,null,null,null,null,null,"Freesoft - A-R/DQ8303"]
[null,null,null,null,null,null,null,null,"Freesoft - H-A/DQ8782"]
[null,null,null,null,null,null,null,null,"Freesoft - P-R/DQ1717"]
[null,null,null,null,null,null,null,null,"Freesoft - H-C/DQ9144"]
[null,null,null,null,null,null,null,null,"Freesoft - F-S/DQ3434"]
[null,null,null,null,null,null,null,null,"Via Kix"]
[null,null,null,null,null,null,null,null,"Via Kix - B-J/DQ8771"]
[null,null,null,null,null,null,null,null,"Via Kix - F-S/DQ3920"]
[null,null,null,null,null,null,null,null,"Via Kix - D-G/DQ8328"]
[null,null,null,null,null,null,null,null,"Via Kix - C-B/DQ1806"]
[null,null,null,null,null,null,null,null,"Via Kix - G-Z/DQ2323"]
[null,null,null,null,null,null,null,null,"Via Kix - T-T/DQ8641"]
[null,null,null,null,null,null,null,null,"Kan-Dom"]
[null,null,null,null,null,null,null,null,"Kan-Dom - I-S/DQ2111"]
[null,null,null,null,null,null,null,null,"Kan-Dom - L-J/DQ7510"]
[null,null,null,null,null,null,null,null,"Kan-Dom - C-K/DQ5503"]
[null,null,null,null,null,null,null,null,"Kan-Dom - Z-V/DQ2269"]
[null,null,null,null,null,null,null,null,"Kan-Dom - Z-N/DQ6435"]
[null,null,null,null,null,null,null,null,"Kan-Dom - S-Q/DQ1078"]

{"sheet":"excelsifun","index":3,"n_rows":703,"n_cols":16,"rows_kept":703,"cut":false,"hidden":false,"merged":[]}
["From This:",null,null,null,null,null,null,null,"To This:"]
[]
["Product","Sub Product 1","Sub Product 2","Sub Product 3","Sub Product 4","Sub Product 5","Sub Product 6",null,"Join Text",null,null,null,null,"# for product","# for Sub P","IF logical Test"]
["Geo Fan","J-V/DQ1477","N-Y/DQ3773","B-Z/DQ7827","M-W/DQ6663","R-A/DQ8080","S-S/DQ4315",null,"Geo Fan",{"$f":"INDEX($A$4:$A$103,INT((ROWS(I$4:I4)-1)/7)+1)&IF(MOD(ROWS(I$4:I4)-1,7),\" - \"&INDEX($B$4:$G$103,INT((ROWS(I$4:I4)-1)/7)+1,MOD(ROWS(I$4:I4)-1,7)),\"\")","v":"Geo Fan"},null,null,{"$f":"INDEX($B$4:$G$103,INT((ROWS(I$4:I4)-1)/7)+1,MOD(ROWS(I$4:I4)-1,7))","v":{"$error":"#VALUE!"}},{"$f":"INT((ROWS(I$4:I4)-1)/7)+1","v":1},{"$f":"MOD(ROWS(I$4:I4)-1,7)+1","v":1},{"$f":"MOD(ROWS(I$4:I4)-1,7)","v":0}]
["Kin-Light","S-O/DQ9675","F-Z/DQ5663","T-Y/DQ3628","B-T/DQ6204","S-S/DQ1007","S-R/DQ3874",null,"Geo Fan - J-V/DQ1477",{"$f":"INDEX($A$4:$A$103,INT((ROWS(I$4:I5)-1)/7)+1)&IF(MOD(ROWS(I$4:I5)-1,7),\" - \"&INDEX($B$4:$G$103,INT((ROWS(I$4:I5)-1)/7)+1,MOD(ROWS(I$4:I5)-1,7)),\"\")","v":"Geo Fan - J-V/DQ1477"},null,null,{"$f":"INDEX($B$4:$G$103,INT((ROWS(I$4:I5)-1)/7)+1,MOD(ROWS(I$4:I5)-1,7))","v":"J-V/DQ1477"},{"$f":"INT((ROWS(I$4:I5)-1)/7)+1","v":1},{"$f":"MOD(ROWS(I$4:I5)-1,7)+1","v":2},{"$f":"MOD(ROWS(I$4:I5)-1,7)","v":1}]
["Stock Hotex","W-F/DQ4209","K-I/DQ4485","J-O/DQ5352","Y-V/DQ1863","V-S/DQ1390","J-C/DQ8654",null,"Geo Fan - N-Y/DQ3773",{"$f":"INDEX($A$4:$A$103,INT((ROWS(I$4:I6)-1)/7)+1)&IF(MOD(ROWS(I$4:I6)-1,7),\" - \"&INDEX($B$4:$G$103,INT((ROWS(I$4:I6)-1)/7)+1,MOD(ROWS(I$4:I6)-1,7)),\"\")","v":"Geo Fan - N-Y/DQ3773"},null,null,{"$f":"INDEX($B$4:$G$103,INT((ROWS(I$4:I6)-1)/7)+1,MOD(ROWS(I$4:I6)-1,7))","v":"N-Y/DQ3773"},{"$f":"INT((ROWS(I$4:I6)-1)/7)+1","v":1},{"$f":"MOD(ROWS(I$4:I6)-1,7)+1","v":3},{"$f":"MOD(ROWS(I$4:I6)-1,7)","v":2}]
["Konk Tinstock","N-R/DQ9237","K-Q/DQ9170","W-I/DQ7389","G-Z/DQ3645","H-K/DQ8345","I-S/DQ3284",null,"Geo Fan - B-Z/DQ7827",{"$f":"INDEX($A$4:$A$103,INT((ROWS(I$4:I7)-1)/7)+1)&IF(MOD(ROWS(I$4:I7)-1,7),\" - \"&INDEX($B$4:$G$103,INT((ROWS(I$4:I7)-1)/7)+1,MOD(ROWS(I$4:I7)-1,7)),\"\")","v":"Geo Fan - B-Z/DQ7827"},null,null,{"$f":"INDEX($B$4:$G$103,INT((ROWS(I$4:I7)-1)/7)+1,MOD(ROWS(I$4:I7)-1,7))","v":"B-Z/DQ7827"},{"$f":"INT((ROWS(I$4:I7)-1)/7)+1","v":1},{"$f":"MOD(ROWS(I$4:I7)-1,7)+1","v":4},{"$f":"MOD(ROWS(I$4:I7)-1,7)","v":3}]
["Silver-Touch","F-Z/DQ7971","C-X/DQ9559","C-P/DQ9259","R-T/DQ3009","H-F/DQ9091","Z-F/DQ8491",null,"Geo Fan - M-W/DQ6663",{"$f":"INDEX($A$4:$A$103,INT((ROWS(I$4:I8)-1)/7)+1)&IF(MOD(ROWS(I$4:I8)-1,7),\" - \"&INDEX($B$4:$G$103,INT((ROWS(I$4:I8)-1)/7)+1,MOD(ROWS(I$4:I8)-1,7)),\"\")","v":"Geo Fan - M-W/DQ6663"},null,null,{"$f":"INDEX($B$4:$G$103,INT((ROWS(I$4:I8)-1)/7)+1,MOD(ROWS(I$4:I8)-1,7))","v":"M-W/DQ6663"},{"$f":"INT((ROWS(I$4:I8)-1)/7)+1","v":1},{"$f":"MOD(ROWS(I$4:I8)-1,7)+1","v":5},{"$f":"MOD(ROWS(I$4:I8)-1,7)","v":4}]
["S-eco","X-O/DQ2585","R-L/DQ5437","F-G/DQ1353","Q-X/DQ3038","F-H/DQ7618","C-R/DQ6413",null,"Geo Fan - R-A/DQ8080",{"$f":"INDEX($A$4:$A$103,INT((ROWS(I$4:I9)-1)/7)+1)&IF(MOD(ROWS(I$4:I9)-1,7),\" - \"&INDEX($B$4:$G$103,INT((ROWS(I$4:I9)-1)/7)+1,MOD(ROWS(I$4:I9)-1,7)),\"\")","v":"Geo Fan - R-A/DQ8080"},null,null,{"$f":"INDEX($B$4:$G$103,INT((ROWS(I$4:I9)-1)/7)+1,MOD(ROWS(I$4:I9)-1,7))","v":"R-A/DQ8080"},{"$f":"INT((ROWS(I$4:I9)-1)/7)+1","v":1},{"$f":"MOD(ROWS(I$4:I9)-1,7)+1","v":6},{"$f":"MOD(ROWS(I$4:I9)-1,7)","v":5}]
["Unoin","F-U/DQ2015","V-V/DQ1486","G-S/DQ3365","J-J/DQ8974","K-A/DQ1284","P-N/DQ7205",null,"Geo Fan - S-S/DQ4315",{"$f":"INDEX($A$4:$A$103,INT((ROWS(I$4:I10)-1)/7)+1)&IF(MOD(ROWS(I$4:I10)-1,7),\" - \"&INDEX($B$4:$G$103,INT((ROWS(I$4:I10)-1)/7)+1,MOD(ROWS(I$4:I10)-1,7)),\"\")","v":"Geo Fan - S-S/DQ4315"},null,null,{"$f":"INDEX($B$4:$G$103,INT((ROWS(I$4:I10)-1)/7)+1,MOD(ROWS(I$4:I10)-1,7))","v":"S-S/DQ4315"},{"$f":"INT((ROWS(I$4:I10)-1)/7)+1","v":1},{"$f":"MOD(ROWS(I$4:I10)-1,7)+1","v":7},{"$f":"MOD(ROWS(I$4:I10)-1,7)","v":6}]
["Laeco","Y-V/DQ6202","R-T/DQ1158","F-P/DQ2866","Q-Z/DQ9290","T-D/DQ5678","V-V/DQ1452",null,"Kin-Light",{"$f":"INDEX($A$4:$A$103,INT((ROWS(I$4:I11)-1)/7)+1)&IF(MOD(ROWS(I$4:I11)-1,7),\" - \"&INDEX($B$4:$G$103,INT((ROWS(I$4:I11)-1)/7)+1,MOD(ROWS(I$4:I11)-1,7)),\"\")","v":"Kin-Light"},null,null,{"$f":"INDEX($B$4:$G$103,INT((ROWS(I$4:I11)-1)/7)+1,MOD(ROWS(I$4:I11)-1,7))","v":{"$error":"#VALUE!"}},{"$f":"INT((ROWS(I$4:I11)-1)/7)+1","v":2},{"$f":"MOD(ROWS(I$4:I11)-1,7)+1","v":1},{"$f":"MOD(ROWS(I$4:I11)-1,7)","v":0}]
["Touch-Lam","O-G/DQ1258","B-M/DQ7666","E-F/DQ8623","N-H/DQ1331","A-B/DQ3518","A-S/DQ7923",null,"Kin-Light - S-O/DQ9675",{"$f":"INDEX($A$4:$A$103,INT((ROWS(I$4:I12)-1)/7)+1)&IF(MOD(ROWS(I$4:I12)-1,7),\" - \"&INDEX($B$4:$G$103,INT((ROWS(I$4:I12)-1)/7)+1,MOD(ROWS(I$4:I12)-1,7)),\"\")","v":"Kin-Light - S-O/DQ9675"},null,null,{"$f":"INDEX($B$4:$G$103,INT((ROWS(I$4:I12)-1)/7)+1,MOD(ROWS(I$4:I12)-1,7))","v":"S-O/DQ9675"},{"$f":"INT((ROWS(I$4:I12)-1)/7)+1","v":2},{"$f":"MOD(ROWS(I$4:I12)-1,7)+1","v":2},{"$f":"MOD(ROWS(I$4:I12)-1,7)","v":1}]
["Lot String","G-J/DQ7020","Z-X/DQ5056","T-X/DQ1948","O-M/DQ4209","R-X/DQ8489","K-F/DQ8350",null,"Kin-Light - F-Z/DQ5663",{"$f":"INDEX($A$4:$A$103,INT((ROWS(I$4:I13)-1)/7)+1)&IF(MOD(ROWS(I$4:I13)-1,7),\" - \"&INDEX($B$4:$G$103,INT((ROWS(I$4:I13)-1)/7)+1,MOD(ROWS(I$4:I13)-1,7)),\"\")","v":"Kin-Light - F-Z/DQ5663"},null,null,{"$f":"INDEX($B$4:$G$103,INT((ROWS(I$4:I13)-1)/7)+1,MOD(ROWS(I$4:I13)-1,7))","v":"F-Z/DQ5663"},{"$f":"INT((ROWS(I$4:I13)-1)/7)+1","v":2},{"$f":"MOD(ROWS(I$4:I13)-1,7)+1","v":3},{"$f":"MOD(ROWS(I$4:I13)-1,7)","v":2}]
["Toncore","B-Q/DQ1113","S-J/DQ8641","T-O/DQ6035","O-D/DQ2138","A-Y/DQ5852","A-P/DQ6874",null,"Kin-Light - T-Y/DQ3628",{"$f":"INDEX($A$4:$A$103,INT((ROWS(I$4:I14)-1)/7)+1)&IF(MOD(ROWS(I$4:I14)-1,7),\" - \"&INDEX($B$4:$G$103,INT((ROWS(I$4:I14)-1)/7)+1,MOD(ROWS(I$4:I14)-1,7)),\"\")","v":"Kin-Light - T-Y/DQ3628"},null,null,{"$f":"INDEX($B$4:$G$103,INT((ROWS(I$4:I14)-1)/7)+1,MOD(ROWS(I$4:I14)-1,7))","v":"T-Y/DQ3628"},{"$f":"INT((ROWS(I$4:I14)-1)/7)+1","v":2},{"$f":"MOD(ROWS(I$4:I14)-1,7)+1","v":4},{"$f":"MOD(ROWS(I$4:I14)-1,7)","v":3}]
["Greeneco","Z-D/DQ3486","V-L/DQ2156","S-W/DQ3812","O-J/DQ4817","W-U/DQ5837","K-U/DQ5815",null,"Kin-Light - B-T/DQ6204",{"$f":"INDEX($A$4:$A$103,INT((ROWS(I$4:I15)-1)/7)+1)&IF(MOD(ROWS(I$4:I15)-1,7),\" - \"&INDEX($B$4:$G$103,INT((ROWS(I$4:I15)-1)/7)+1,MOD(ROWS(I$4:I15)-1,7)),\"\")","v":"Kin-Light - B-T/DQ6204"},null,null,{"$f":"INDEX($B$4:$G$103,INT((ROWS(I$4:I15)-1)/7)+1,MOD(ROWS(I$4:I15)-1,7))","v":"B-T/DQ6204"},{"$f":"INT((ROWS(I$4:I15)-1)/7)+1","v":2},{"$f":"MOD(ROWS(I$4:I15)-1,7)+1","v":5},{"$f":"MOD(ROWS(I$4:I15)-1,7)","v":4}]
["Airdex","T-Z/DQ8308","Q-Y/DQ1201","X-T/DQ3151","T-U/DQ7219","X-P/DQ1517","Q-E/DQ3131",null,"Kin-Light - S-S/DQ1007",{"$f":"INDEX($A$4:$A$103,INT((ROWS(I$4:I16)-1)/7)+1)&IF(MOD(ROWS(I$4:I16)-1,7),\" - \"&INDEX($B$4:$G$103,INT((ROWS(I$4:I16)-1)/7)+1,MOD(ROWS(I$4:I16)-1,7)),\"\")","v":"Kin-Light - S-S/DQ1007"},null,null,{"$f":"INDEX($B$4:$G$103,INT((ROWS(I$4:I16)-1)/7)+1,MOD(ROWS(I$4:I16)-1,7))","v":"S-S/DQ1007"},{"$f":"INT((ROWS(I$4:I16)-1)/7)+1","v":2},{"$f":"MOD(ROWS(I$4:I16)-1,7)+1","v":6},{"$f":"MOD(ROWS(I$4:I16)-1,7)","v":5}]
["Lamhold","C-D/DQ9157","P-K/DQ1400","G-M/DQ3192","G-S/DQ5812","O-X/DQ5678","V-P/DQ8051",null,"Kin-Light - S-R/DQ3874",{"$f":"INDEX($A$4:$A$103,INT((ROWS(I$4:I17)-1)/7)+1)&IF(MOD(ROWS(I$4:I17)-1,7),\" - \"&INDEX($B$4:$G$103,INT((ROWS(I$4:I17)-1)/7)+1,MOD(ROWS(I$4:I17)-1,7)),\"\")","v":"Kin-Light - S-R/DQ3874"},null,null,{"$f":"INDEX($B$4:$G$103,INT((ROWS(I$4:I17)-1)/7)+1,MOD(ROWS(I$4:I17)-1,7))","v":"S-R/DQ3874"},{"$f":"INT((ROWS(I$4:I17)-1)/7)+1","v":2},{"$f":"MOD(ROWS(I$4:I17)-1,7)+1","v":7},{"$f":"MOD(ROWS(I$4:I17)-1,7)","v":6}]
["Biosing","E-I/DQ8446","D-L/DQ9756","L-O/DQ5650","I-D/DQ6108","O-W/DQ1349","O-J/DQ3480",null,null,{"$f":"INDEX($A$4:$A$103,INT((ROWS(I$4:I18)-1)/7)+1)&IF(MOD(ROWS(I$4:I18)-1,7),\" - \"&INDEX($B$4:$G$103,INT((ROWS(I$4:I18)-1)/7)+1,MOD(ROWS(I$4:I18)-1,7)),\"\")","v":"Stock Hotex"},null,null,{"$f":"INDEX($B$4:$G$103,INT((ROWS(I$4:I18)-1)/7)+1,MOD(ROWS(I$4:I18)-1,7))","v":{"$error":"#VALUE!"}}]
["Viais","Z-X/DQ5986","Q-X/DQ5295","B-D/DQ7046","Q-O/DQ4384","E-P/DQ1000","H-A/DQ4471",null,null,{"$f":"INDEX($A$4:$A$103,INT((ROWS(I$4:I19)-1)/7)+1)&IF(MOD(ROWS(I$4:I19)-1,7),\" - \"&INDEX($B$4:$G$103,INT((ROWS(I$4:I19)-1)/7)+1,MOD(ROWS(I$4:I19)-1,7)),\"\")","v":"Stock Hotex - W-F/DQ4209"},null,null,{"$f":"INDEX($B$4:$G$103,INT((ROWS(I$4:I19)-1)/7)+1,MOD(ROWS(I$4:I19)-1,7))","v":"W-F/DQ4209"}]
["Zim Lax","N-D/DQ2280","W-K/DQ4119","I-L/DQ5301","Z-M/DQ9782","M-O/DQ2381","D-X/DQ6309",null,null,{"$f":"INDEX($A$4:$A$103,INT((ROWS(I$4:I20)-1)/7)+1)&IF(MOD(ROWS(I$4:I20)-1,7),\" - \"&INDEX($B$4:$G$103,INT((ROWS(I$4:I20)-1)/7)+1,MOD(ROWS(I$4:I20)-1,7)),\"\")","v":"Stock Hotex - K-I/DQ4485"},null,null,{"$f":"INDEX($B$4:$G$103,INT((ROWS(I$4:I20)-1)/7)+1,MOD(ROWS(I$4:I20)-1,7))","v":"K-I/DQ4485"}]
["S-lab","Y-S/DQ3406","J-L/DQ1112","Z-Q/DQ1200","Q-E/DQ6957","K-X/DQ6856","C-W/DQ5579",null,null,{"$f":"INDEX($A$4:$A$103,INT((ROWS(I$4:I21)-1)/7)+1)&IF(MOD(ROWS(I$4:I21)-1,7),\" - \"&INDEX($B$4:$G$103,INT((ROWS(I$4:I21)-1)/7)+1,MOD(ROWS(I$4:I21)-1,7)),\"\")","v":"Stock Hotex - J-O/DQ5352"},null,null,{"$f":"INDEX($B$4:$G$103,INT((ROWS(I$4:I21)-1)/7)+1,MOD(ROWS(I$4:I21)-1,7))","v":"J-O/DQ5352"}]
["Stanity","R-U/DQ4312","N-X/DQ1329","M-K/DQ7985","U-T/DQ3735","A-X/DQ5877","P-Y/DQ5472",null,null,{"$f":"INDEX($A$4:$A$103,INT((ROWS(I$4:I22)-1)/7)+1)&IF(MOD(ROWS(I$4:I22)-1,7),\" - \"&INDEX($B$4:$G$103,INT((ROWS(I$4:I22)-1)/7)+1,MOD(ROWS(I$4:I22)-1,7)),\"\")","v":"Stock Hotex - Y-V/DQ1863"},null,null,{"$f":"INDEX($B$4:$G$103,INT((ROWS(I$4:I22)-1)/7)+1,MOD(ROWS(I$4:I22)-1,7))","v":"Y-V/DQ1863"}]
["Contom","H-C/DQ2317","X-V/DQ6726","C-B/DQ5190","Q-Y/DQ2021","E-E/DQ5627","A-K/DQ5855",null,null,{"$f":"INDEX($A$4:$A$103,INT((ROWS(I$4:I23)-1)/7)+1)&IF(MOD(ROWS(I$4:I23)-1,7),\" - \"&INDEX($B$4:$G$103,INT((ROWS(I$4:I23)-1)/7)+1,MOD(ROWS(I$4:I23)-1,7)),\"\")","v":"Stock Hotex - V-S/DQ1390"},null,null,{"$f":"INDEX($B$4:$G$103,INT((ROWS(I$4:I23)-1)/7)+1,MOD(ROWS(I$4:I23)-1,7))","v":"V-S/DQ1390"}]
["Lam-Top","T-E/DQ7702","S-M/DQ3163","B-I/DQ6623","U-G/DQ3097","V-D/DQ3996","U-N/DQ7711",null,null,{"$f":"INDEX($A$4:$A$103,INT((ROWS(I$4:I24)-1)/7)+1)&IF(MOD(ROWS(I$4:I24)-1,7),\" - \"&INDEX($B$4:$G$103,INT((ROWS(I$4:I24)-1)/7)+1,MOD(ROWS(I$4:I24)-1,7)),\"\")","v":"Stock Hotex - J-C/DQ8654"},null,null,{"$f":"INDEX($B$4:$G$103,INT((ROWS(I$4:I24)-1)/7)+1,MOD(ROWS(I$4:I24)-1,7))","v":"J-C/DQ8654"}]
["Trantraxbam","C-T/DQ4565","Z-F/DQ1695","V-V/DQ3074","V-P/DQ9688","S-M/DQ1541","G-E/DQ8061",null,null,{"$f":"INDEX($A$4:$A$103,INT((ROWS(I$4:I25)-1)/7)+1)&IF(MOD(ROWS(I$4:I25)-1,7),\" - \"&INDEX($B$4:$G$103,INT((ROWS(I$4:I25)-1)/7)+1,MOD(ROWS(I$4:I25)-1,7)),\"\")","v":"Konk Tinstock"},null,null,{"$f":"INDEX($B$4:$G$103,INT((ROWS(I$4:I25)-1)/7)+1,MOD(ROWS(I$4:I25)-1,7))","v":{"$error":"#VALUE!"}}]
["Silver Traxsing","N-V/DQ7788","R-O/DQ1810","E-X/DQ4308","T-D/DQ7728","Y-J/DQ5551","D-M/DQ7097",null,null,{"$f":"INDEX($A$4:$A$103,INT((ROWS(I$4:I26)-1)/7)+1)&IF(MOD(ROWS(I$4:I26)-1,7),\" - \"&INDEX($B$4:$G$103,INT((ROWS(I$4:I26)-1)/7)+1,MOD(ROWS(I$4:I26)-1,7)),\"\")","v":"Konk Tinstock - N-R/DQ9237"},null,null,{"$f":"INDEX($B$4:$G$103,INT((ROWS(I$4:I26)-1)/7)+1,MOD(ROWS(I$4:I26)-1,7))","v":"N-R/DQ9237"}]
["Softdex","F-G/DQ1406","M-B/DQ8930","L-R/DQ1359","I-P/DQ1241","C-I/DQ3156","R-B/DQ8080",null,null,{"$f":"INDEX($A$4:$A$103,INT((ROWS(I$4:I27)-1)/7)+1)&IF(MOD(ROWS(I$4:I27)-1,7),\" - \"&INDEX($B$4:$G$103,INT((ROWS(I$4:I27)-1)/7)+1,MOD(ROWS(I$4:I27)-1,7)),\"\")","v":"Konk Tinstock - K-Q/DQ9170"},null,null,{"$f":"INDEX($B$4:$G$103,INT((ROWS(I$4:I27)-1)/7)+1,MOD(ROWS(I$4:I27)-1,7))","v":"K-Q/DQ9170"}]
["Air-Trax","I-Y/DQ6462","U-B/DQ2419","Y-X/DQ9909","J-E/DQ2773","V-E/DQ6312","E-T/DQ4131",null,null,{"$f":"INDEX($A$4:$A$103,INT((ROWS(I$4:I28)-1)/7)+1)&IF(MOD(ROWS(I$4:I28)-1,7),\" - \"&INDEX($B$4:$G$103,INT((ROWS(I$4:I28)-1)/7)+1,MOD(ROWS(I$4:I28)-1,7)),\"\")","v":"Konk Tinstock - W-I/DQ7389"},null,null,{"$f":"INDEX($B$4:$G$103,INT((ROWS(I$4:I28)-1)/7)+1,MOD(ROWS(I$4:I28)-1,7))","v":"W-I/DQ7389"}]
["Labfax","W-U/DQ4000","Z-G/DQ3343","U-F/DQ2988","T-R/DQ1925","Z-P/DQ7423","Z-P/DQ9403",null,null,{"$f":"INDEX($A$4:$A$103,INT((ROWS(I$4:I29)-1)/7)+1)&IF(MOD(ROWS(I$4:I29)-1,7),\" - \"&INDEX($B$4:$G$103,INT((ROWS(I$4:I29)-1)/7)+1,MOD(ROWS(I$4:I29)-1,7)),\"\")","v":"Konk Tinstock - G-Z/DQ3645"},null,null,{"$f":"INDEX($B$4:$G$103,INT((ROWS(I$4:I29)-1)/7)+1,MOD(ROWS(I$4:I29)-1,7))","v":"G-Z/DQ3645"}]
["Konkstatis","H-T/DQ7055","V-Y/DQ8364","U-Z/DQ3697","N-H/DQ9038","L-N/DQ1973","G-T/DQ5579",null,null,{"$f":"INDEX($A$4:$A$103,INT((ROWS(I$4:I30)-1)/7)+1)&IF(MOD(ROWS(I$4:I30)-1,7),\" - \"&INDEX($B$4:$G$103,INT((ROWS(I$4:I30)-1)/7)+1,MOD(ROWS(I$4:I30)-1,7)),\"\")","v":"Konk Tinstock - H-K/DQ8345"},null,null,{"$f":"INDEX($B$4:$G$103,INT((ROWS(I$4:I30)-1)/7)+1,MOD(ROWS(I$4:I30)-1,7))","v":"H-K/DQ8345"}]
["Touchtone","D-O/DQ4093","D-C/DQ1506","X-V/DQ3046","Z-T/DQ8406","R-G/DQ2487","O-G/DQ9131",null,null,{"$f":"INDEX($A$4:$A$103,INT((ROWS(I$4:I31)-1)/7)+1)&IF(MOD(ROWS(I$4:I31)-1,7),\" - \"&INDEX($B$4:$G$103,INT((ROWS(I$4:I31)-1)/7)+1,MOD(ROWS(I$4:I31)-1,7)),\"\")","v":"Konk Tinstock - I-S/DQ3284"},null,null,{"$f":"INDEX($B$4:$G$103,INT((ROWS(I$4:I31)-1)/7)+1,MOD(ROWS(I$4:I31)-1,7))","v":"I-S/DQ3284"}]
["Ecotone","L-M/DQ2346","W-H/DQ7772","H-O/DQ8735","Y-R/DQ3598","E-Y/DQ1323","C-Q/DQ1220",null,null,{"$f":"INDEX($A$4:$A$103,INT((ROWS(I$4:I32)-1)/7)+1)&IF(MOD(ROWS(I$4:I32)-1,7),\" - \"&INDEX($B$4:$G$103,INT((ROWS(I$4:I32)-1)/7)+1,MOD(ROWS(I$4:I32)-1,7)),\"\")","v":"Silver-Touch"},null,null,{"$f":"INDEX($B$4:$G$103,INT((ROWS(I$4:I32)-1)/7)+1,MOD(ROWS(I$4:I32)-1,7))","v":{"$error":"#VALUE!"}}]
["Sublax","K-Z/DQ1958","E-T/DQ1182","D-V/DQ2263","F-Q/DQ1782","F-W/DQ1945","F-J/DQ1793",null,null,{"$f":"INDEX($A$4:$A$103,INT((ROWS(I$4:I33)-1)/7)+1)&IF(MOD(ROWS(I$4:I33)-1,7),\" - \"&INDEX($B$4:$G$103,INT((ROWS(I$4:I33)-1)/7)+1,MOD(ROWS(I$4:I33)-1,7)),\"\")","v":"Silver-Touch - F-Z/DQ7971"},null,null,{"$f":"INDEX($B$4:$G$103,INT((ROWS(I$4:I33)-1)/7)+1,MOD(ROWS(I$4:I33)-1,7))","v":"F-Z/DQ7971"}]
["Donlab","M-U/DQ5037","E-B/DQ7006","R-Q/DQ3540","I-I/DQ2681","G-U/DQ4067","N-R/DQ9996",null,null,{"$f":"INDEX($A$4:$A$103,INT((ROWS(I$4:I34)-1)/7)+1)&IF(MOD(ROWS(I$4:I34)-1,7),\" - \"&INDEX($B$4:$G$103,INT((ROWS(I$4:I34)-1)/7)+1,MOD(ROWS(I$4:I34)-1,7)),\"\")","v":"Silver-Touch - C-X/DQ9559"},null,null,{"$f":"INDEX($B$4:$G$103,INT((ROWS(I$4:I34)-1)/7)+1,MOD(ROWS(I$4:I34)-1,7))","v":"C-X/DQ9559"}]
["Freetaming","P-U/DQ7673","D-V/DQ8854","K-H/DQ9072","G-I/DQ6806","M-M/DQ3184","B-V/DQ1806",null,null,{"$f":"INDEX($A$4:$A$103,INT((ROWS(I$4:I35)-1)/7)+1)&IF(MOD(ROWS(I$4:I35)-1,7),\" - \"&INDEX($B$4:$G$103,INT((ROWS(I$4:I35)-1)/7)+1,MOD(ROWS(I$4:I35)-1,7)),\"\")","v":"Silver-Touch - C-P/DQ9259"},null,null,{"$f":"INDEX($B$4:$G$103,INT((ROWS(I$4:I35)-1)/7)+1,MOD(ROWS(I$4:I35)-1,7))","v":"C-P/DQ9259"}]
["Volt Tanstock","E-V/DQ1711","D-D/DQ3113","U-H/DQ3939","V-W/DQ2342","B-C/DQ4270","J-N/DQ2005",null,null,{"$f":"INDEX($A$4:$A$103,INT((ROWS(I$4:I36)-1)/7)+1)&IF(MOD(ROWS(I$4:I36)-1,7),\" - \"&INDEX($B$4:$G$103,INT((ROWS(I$4:I36)-1)/7)+1,MOD(ROWS(I$4:I36)-1,7)),\"\")","v":"Silver-Touch - R-T/DQ3009"},null,null,{"$f":"INDEX($B$4:$G$103,INT((ROWS(I$4:I36)-1)/7)+1,MOD(ROWS(I$4:I36)-1,7))","v":"R-T/DQ3009"}]
["Single Zimfax","Q-K/DQ8122","X-H/DQ4021","F-K/DQ3308","H-O/DQ8072","D-Z/DQ6642","P-Q/DQ7285",null,null,{"$f":"INDEX($A$4:$A$103,INT((ROWS(I$4:I37)-1)/7)+1)&IF(MOD(ROWS(I$4:I37)-1,7),\" - \"&INDEX($B$4:$G$103,INT((ROWS(I$4:I37)-1)/7)+1,MOD(ROWS(I$4:I37)-1,7)),\"\")","v":"Silver-Touch - H-F/DQ9091"},null,null,{"$f":"INDEX($B$4:$G$103,INT((ROWS(I$4:I37)-1)/7)+1,MOD(ROWS(I$4:I37)-1,7))","v":"H-F/DQ9091"}]
["Nameco","A-E/DQ4006","M-L/DQ5420","A-I/DQ5311","G-N/DQ5865","O-O/DQ6738","I-O/DQ8975",null,null,{"$f":"INDEX($A$4:$A$103,INT((ROWS(I$4:I38)-1)/7)+1)&IF(MOD(ROWS(I$4:I38)-1,7),\" - \"&INDEX($B$4:$G$103,INT((ROWS(I$4:I38)-1)/7)+1,MOD(ROWS(I$4:I38)-1,7)),\"\")","v":"Silver-Touch - Z-F/DQ8491"},null,null,{"$f":"INDEX($B$4:$G$103,INT((ROWS(I$4:I38)-1)/7)+1,MOD(ROWS(I$4:I38)-1,7))","v":"Z-F/DQ8491"}]
["Canhotin","X-C/DQ7536","H-O/DQ5982","U-U/DQ6424","C-S/DQ9155","O-K/DQ2805","I-S/DQ2919",null,null,{"$f":"INDEX($A$4:$A$103,INT((ROWS(I$4:I39)-1)/7)+1)&IF(MOD(ROWS(I$4:I39)-1,7),\" - \"&INDEX($B$4:$G$103,INT((ROWS(I$4:I39)-1)/7)+1,MOD(ROWS(I$4:I39)-1,7)),\"\")","v":"S-eco"},null,null,{"$f":"INDEX($B$4:$G$103,INT((ROWS(I$4:I39)-1)/7)+1,MOD(ROWS(I$4:I39)-1,7))","v":{"$error":"#VALUE!"}}]
["Opedax","V-K/DQ5620","I-A/DQ6402","O-C/DQ1475","U-V/DQ5750","D-W/DQ9169","X-U/DQ4908",null,null,{"$f":"INDEX($A$4:$A$103,INT((ROWS(I$4:I40)-1)/7)+1)&IF(MOD(ROWS(I$4:I40)-1,7),\" - \"&INDEX($B$4:$G$103,INT((ROWS(I$4:I40)-1)/7)+1,MOD(ROWS(I$4:I40)-1,7)),\"\")","v":"S-eco - X-O/DQ2585"},null,null,{"$f":"INDEX($B$4:$G$103,INT((ROWS(I$4:I40)-1)/7)+1,MOD(ROWS(I$4:I40)-1,7))","v":"X-O/DQ2585"}]
["Touchfresh","H-C/DQ4665","C-D/DQ6489","R-H/DQ7954","D-D/DQ1228","X-K/DQ6699","D-V/DQ9848",null,null,{"$f":"INDEX($A$4:$A$103,INT((ROWS(I$4:I41)-1)/7)+1)&IF(MOD(ROWS(I$4:I41)-1,7),\" - \"&INDEX($B$4:$G$103,INT((ROWS(I$4:I41)-1)/7)+1,MOD(ROWS(I$4:I41)-1,7)),\"\")","v":"S-eco - R-L/DQ5437"},null,null,{"$f":"INDEX($B$4:$G$103,INT((ROWS(I$4:I41)-1)/7)+1,MOD(ROWS(I$4:I41)-1,7))","v":"R-L/DQ5437"}]
["Inhold","V-U/DQ3537","J-U/DQ9185","Y-X/DQ3832","Y-L/DQ3782","L-R/DQ2810","O-M/DQ5259",null,null,{"$f":"INDEX($A$4:$A$103,INT((ROWS(I$4:I42)-1)/7)+1)&IF(MOD(ROWS(I$4:I42)-1,7),\" - \"&INDEX($B$4:$G$103,INT((ROWS(I$4:I42)-1)/7)+1,MOD(ROWS(I$4:I42)-1,7)),\"\")","v":"S-eco - F-G/DQ1353"},null,null,{"$f":"INDEX($B$4:$G$103,INT((ROWS(I$4:I42)-1)/7)+1,MOD(ROWS(I$4:I42)-1,7))","v":"F-G/DQ1353"}]
["Saillux","K-S/DQ7277","C-S/DQ6120","J-Y/DQ3382","E-R/DQ2393","P-M/DQ2704","C-C/DQ7661",null,null,{"$f":"INDEX($A$4:$A$103,INT((ROWS(I$4:I43)-1)/7)+1)&IF(MOD(ROWS(I$4:I43)-1,7),\" - \"&INDEX($B$4:$G$103,INT((ROWS(I$4:I43)-1)/7)+1,MOD(ROWS(I$4:I43)-1,7)),\"\")","v":"S-eco - Q-X/DQ3038"},null,null,{"$f":"INDEX($B$4:$G$103,INT((ROWS(I$4:I43)-1)/7)+1,MOD(ROWS(I$4:I43)-1,7))","v":"Q-X/DQ3038"}]
["Zenjob","D-O/DQ9424","Z-X/DQ3592","E-D/DQ7789","A-P/DQ7456","M-R/DQ7298","H-S/DQ3032",null,null,{"$f":"INDEX($A$4:$A$103,INT((ROWS(I$4:I44)-1)/7)+1)&IF(MOD(ROWS(I$4:I44)-1,7),\" - \"&INDEX($B$4:$G$103,INT((ROWS(I$4:I44)-1)/7)+1,MOD(ROWS(I$4:I44)-1,7)),\"\")","v":"S-eco - F-H/DQ7618"},null,null,{"$f":"INDEX($B$4:$G$103,INT((ROWS(I$4:I44)-1)/7)+1,MOD(ROWS(I$4:I44)-1,7))","v":"F-H/DQ7618"}]
["Sum-Home","R-Y/DQ1205","H-I/DQ6676","T-G/DQ3044","V-P/DQ4500","M-I/DQ1594","X-S/DQ9659",null,null,{"$f":"INDEX($A$4:$A$103,INT((ROWS(I$4:I45)-1)/7)+1)&IF(MOD(ROWS(I$4:I45)-1,7),\" - \"&INDEX($B$4:$G$103,INT((ROWS(I$4:I45)-1)/7)+1,MOD(ROWS(I$4:I45)-1,7)),\"\")","v":"S-eco - C-R/DQ6413"},null,null,{"$f":"INDEX($B$4:$G$103,INT((ROWS(I$4:I45)-1)/7)+1,MOD(ROWS(I$4:I45)-1,7))","v":"C-R/DQ6413"}]
["Topair","G-H/DQ5891","B-G/DQ5422","A-L/DQ3927","F-N/DQ5639","S-Y/DQ1460","W-T/DQ2891",null,null,{"$f":"INDEX($A$4:$A$103,INT((ROWS(I$4:I46)-1)/7)+1)&IF(MOD(ROWS(I$4:I46)-1,7),\" - \"&INDEX($B$4:$G$103,INT((ROWS(I$4:I46)-1)/7)+1,MOD(ROWS(I$4:I46)-1,7)),\"\")","v":"Unoin"},null,null,{"$f":"INDEX($B$4:$G$103,INT((ROWS(I$4:I46)-1)/7)+1,MOD(ROWS(I$4:I46)-1,7))","v":{"$error":"#VALUE!"}}]
["New Cof","A-E/DQ8571","O-B/DQ2118","S-B/DQ3332","J-I/DQ4049","C-D/DQ1103","Q-Z/DQ3080",null,null,{"$f":"INDEX($A$4:$A$103,INT((ROWS(I$4:I47)-1)/7)+1)&IF(MOD(ROWS(I$4:I47)-1,7),\" - \"&INDEX($B$4:$G$103,INT((ROWS(I$4:I47)-1)/7)+1,MOD(ROWS(I$4:I47)-1,7)),\"\")","v":"Unoin - F-U/DQ2015"},null,null,{"$f":"INDEX($B$4:$G$103,INT((ROWS(I$4:I47)-1)/7)+1,MOD(ROWS(I$4:I47)-1,7))","v":"F-U/DQ2015"}]
["Silverdom","V-Q/DQ2006","I-H/DQ3986","S-Y/DQ9987","K-W/DQ9789","M-V/DQ6609","E-G/DQ1666",null,null,{"$f":"INDEX($A$4:$A$103,INT((ROWS(I$4:I48)-1)/7)+1)&IF(MOD(ROWS(I$4:I48)-1,7),\" - \"&INDEX($B$4:$G$103,INT((ROWS(I$4:I48)-1)/7)+1,MOD(ROWS(I$4:I48)-1,7)),\"\")","v":"Unoin - V-V/DQ1486"},null,null,{"$f":"INDEX($B$4:$G$103,INT((ROWS(I$4:I48)-1)/7)+1,MOD(ROWS(I$4:I48)-1,7))","v":"V-V/DQ1486"}]
["Black Silflex","V-T/DQ8139","M-U/DQ4261","E-M/DQ5191","U-T/DQ6381","T-V/DQ3190","M-I/DQ7893",null,null,{"$f":"INDEX($A$4:$A$103,INT((ROWS(I$4:I49)-1)/7)+1)&IF(MOD(ROWS(I$4:I49)-1,7),\" - \"&INDEX($B$4:$G$103,INT((ROWS(I$4:I49)-1)/7)+1,MOD(ROWS(I$4:I49)-1,7)),\"\")","v":"Unoin - G-S/DQ3365"},null,null,{"$f":"INDEX($B$4:$G$103,INT((ROWS(I$4:I49)-1)/7)+1,MOD(ROWS(I$4:I49)-1,7))","v":"G-S/DQ3365"}]
["Zentom","H-O/DQ8291","U-M/DQ2997","D-V/DQ2055","S-F/DQ1630","E-Y/DQ9811","R-D/DQ1916",null,null,{"$f":"INDEX($A$4:$A$103,INT((ROWS(I$4:I50)-1)/7)+1)&IF(MOD(ROWS(I$4:I50)-1,7),\" - \"&INDEX($B$4:$G$103,INT((ROWS(I$4:I50)-1)/7)+1,MOD(ROWS(I$4:I50)-1,7)),\"\")","v":"Unoin - J-J/DQ8974"},null,null,{"$f":"INDEX($B$4:$G$103,INT((ROWS(I$4:I50)-1)/7)+1,MOD(ROWS(I$4:I50)-1,7))","v":"J-J/DQ8974"}]
["Antex","U-V/DQ8524","H-O/DQ2807","Y-G/DQ8263","K-X/DQ7690","T-F/DQ6604","X-M/DQ8067",null,null,{"$f":"INDEX($A$4:$A$103,INT((ROWS(I$4:I51)-1)/7)+1)&IF(MOD(ROWS(I$4:I51)-1,7),\" - \"&INDEX($B$4:$G$103,INT((ROWS(I$4:I51)-1)/7)+1,MOD(ROWS(I$4:I51)-1,7)),\"\")","v":"Unoin - K-A/DQ1284"},null,null,{"$f":"INDEX($B$4:$G$103,INT((ROWS(I$4:I51)-1)/7)+1,MOD(ROWS(I$4:I51)-1,7))","v":"K-A/DQ1284"}]
["Ranity","M-W/DQ2718","D-W/DQ8974","I-F/DQ8856","E-P/DQ3003","P-J/DQ5975","A-Y/DQ1109",null,null,{"$f":"INDEX($A$4:$A$103,INT((ROWS(I$4:I52)-1)/7)+1)&IF(MOD(ROWS(I$4:I52)-1,7),\" - \"&INDEX($B$4:$G$103,INT((ROWS(I$4:I52)-1)/7)+1,MOD(ROWS(I$4:I52)-1,7)),\"\")","v":"Unoin - P-N/DQ7205"},null,null,{"$f":"INDEX($B$4:$G$103,INT((ROWS(I$4:I52)-1)/7)+1,MOD(ROWS(I$4:I52)-1,7))","v":"P-N/DQ7205"}]
["S-kix","K-G/DQ2749","P-J/DQ4709","N-X/DQ2600","B-T/DQ9604","R-W/DQ6294","O-U/DQ2096",null,null,{"$f":"INDEX($A$4:$A$103,INT((ROWS(I$4:I53)-1)/7)+1)&IF(MOD(ROWS(I$4:I53)-1,7),\" - \"&INDEX($B$4:$G$103,INT((ROWS(I$4:I53)-1)/7)+1,MOD(ROWS(I$4:I53)-1,7)),\"\")","v":"Laeco"},null,null,{"$f":"INDEX($B$4:$G$103,INT((ROWS(I$4:I53)-1)/7)+1,MOD(ROWS(I$4:I53)-1,7))","v":{"$error":"#VALUE!"}}]
["Zath-Lex","M-X/DQ6178","C-U/DQ1618","O-P/DQ3023","S-T/DQ8619","V-O/DQ9170","P-J/DQ3470",null,null,{"$f":"INDEX($A$4:$A$103,INT((ROWS(I$4:I54)-1)/7)+1)&IF(MOD(ROWS(I$4:I54)-1,7),\" - \"&INDEX($B$4:$G$103,INT((ROWS(I$4:I54)-1)/7)+1,MOD(ROWS(I$4:I54)-1,7)),\"\")","v":"Laeco - Y-V/DQ6202"},null,null,{"$f":"INDEX($B$4:$G$103,INT((ROWS(I$4:I54)-1)/7)+1,MOD(ROWS(I$4:I54)-1,7))","v":"Y-V/DQ6202"}]
["Tin Tam","V-E/DQ3168","X-O/DQ7726","K-Q/DQ3777","G-C/DQ5626","S-D/DQ7723","R-X/DQ8582",null,null,{"$f":"INDEX($A$4:$A$103,INT((ROWS(I$4:I55)-1)/7)+1)&IF(MOD(ROWS(I$4:I55)-1,7),\" - \"&INDEX($B$4:$G$103,INT((ROWS(I$4:I55)-1)/7)+1,MOD(ROWS(I$4:I55)-1,7)),\"\")","v":"Laeco - R-T/DQ1158"},null,null,{"$f":"INDEX($B$4:$G$103,INT((ROWS(I$4:I55)-1)/7)+1,MOD(ROWS(I$4:I55)-1,7))","v":"R-T/DQ1158"}]
["Home-Fix","V-K/DQ4188","W-D/DQ9139","S-W/DQ7140","G-J/DQ2389","L-J/DQ9015","D-D/DQ9127",null,null,{"$f":"INDEX($A$4:$A$103,INT((ROWS(I$4:I56)-1)/7)+1)&IF(MOD(ROWS(I$4:I56)-1,7),\" - \"&INDEX($B$4:$G$103,INT((ROWS(I$4:I56)-1)/7)+1,MOD(ROWS(I$4:I56)-1,7)),\"\")","v":"Laeco - F-P/DQ2866"},null,null,{"$f":"INDEX($B$4:$G$103,INT((ROWS(I$4:I56)-1)/7)+1,MOD(ROWS(I$4:I56)-1,7))","v":"F-P/DQ2866"}]
["Strongtax","C-B/DQ7246","S-Z/DQ9931","I-U/DQ6209","R-D/DQ7972","C-N/DQ7927","J-I/DQ6121",null,null,{"$f":"INDEX($A$4:$A$103,INT((ROWS(I$4:I57)-1)/7)+1)&IF(MOD(ROWS(I$4:I57)-1,7),\" - \"&INDEX($B$4:$G$103,INT((ROWS(I$4:I57)-1)/7)+1,MOD(ROWS(I$4:I57)-1,7)),\"\")","v":"Laeco - Q-Z/DQ9290"},null,null,{"$f":"INDEX($B$4:$G$103,INT((ROWS(I$4:I57)-1)/7)+1,MOD(ROWS(I$4:I57)-1,7))","v":"Q-Z/DQ9290"}]
["Scottrax","V-B/DQ7247","R-B/DQ5325","Y-I/DQ1428","R-P/DQ3760","M-X/DQ6435","U-O/DQ2357",null,null,{"$f":"INDEX($A$4:$A$103,INT((ROWS(I$4:I58)-1)/7)+1)&IF(MOD(ROWS(I$4:I58)-1,7),\" - \"&INDEX($B$4:$G$103,INT((ROWS(I$4:I58)-1)/7)+1,MOD(ROWS(I$4:I58)-1,7)),\"\")","v":"Laeco - T-D/DQ5678"},null,null,{"$f":"INDEX($B$4:$G$103,INT((ROWS(I$4:I58)-1)/7)+1,MOD(ROWS(I$4:I58)-1,7))","v":"T-D/DQ5678"}]
["Home Ron","W-Q/DQ8964","B-X/DQ4767","A-V/DQ6228","I-T/DQ7745","R-L/DQ1239","Z-L/DQ1190",null,null,{"$f":"INDEX($A$4:$A$103,INT((ROWS(I$4:I59)-1)/7)+1)&IF(MOD(ROWS(I$4:I59)-1,7),\" - \"&INDEX($B$4:$G$103,INT((ROWS(I$4:I59)-1)/7)+1,MOD(ROWS(I$4:I59)-1,7)),\"\")","v":"Laeco - V-V/DQ1452"},null,null,{"$f":"INDEX($B$4:$G$103,INT((ROWS(I$4:I59)-1)/7)+1,MOD(ROWS(I$4:I59)-1,7))","v":"V-V/DQ1452"}]
["Mathtip","Q-Z/DQ9353","U-E/DQ3079","U-C/DQ9253","U-I/DQ9502","A-Z/DQ1514","F-H/DQ4922",null,null,{"$f":"INDEX($A$4:$A$103,INT((ROWS(I$4:I60)-1)/7)+1)&IF(MOD(ROWS(I$4:I60)-1,7),\" - \"&INDEX($B$4:$G$103,INT((ROWS(I$4:I60)-1)/7)+1,MOD(ROWS(I$4:I60)-1,7)),\"\")","v":"Touch-Lam"},null,null,{"$f":"INDEX($B$4:$G$103,INT((ROWS(I$4:I60)-1)/7)+1,MOD(ROWS(I$4:I60)-1,7))","v":{"$error":"#VALUE!"}}]
["Quad Joytax","U-G/DQ9961","O-N/DQ4189","R-C/DQ7978","X-B/DQ4884","V-P/DQ6114","P-B/DQ6522",null,null,{"$f":"INDEX($A$4:$A$103,INT((ROWS(I$4:I61)-1)/7)+1)&IF(MOD(ROWS(I$4:I61)-1,7),\" - \"&INDEX($B$4:$G$103,INT((ROWS(I$4:I61)-1)/7)+1,MOD(ROWS(I$4:I61)-1,7)),\"\")","v":"Touch-Lam - O-G/DQ1258"},null,null,{"$f":"INDEX($B$4:$G$103,INT((ROWS(I$4:I61)-1)/7)+1,MOD(ROWS(I$4:I61)-1,7))","v":"O-G/DQ1258"}]
["Quotejob","A-L/DQ2468","G-J/DQ5678","H-P/DQ9164","C-G/DQ5033","H-E/DQ7018","X-Z/DQ7564",null,null,{"$f":"INDEX($A$4:$A$103,INT((ROWS(I$4:I62)-1)/7)+1)&IF(MOD(ROWS(I$4:I62)-1,7),\" - \"&INDEX($B$4:$G$103,INT((ROWS(I$4:I62)-1)/7)+1,MOD(ROWS(I$4:I62)-1,7)),\"\")","v":"Touch-Lam - B-M/DQ7666"},null,null,{"$f":"INDEX($B$4:$G$103,INT((ROWS(I$4:I62)-1)/7)+1,MOD(ROWS(I$4:I62)-1,7))","v":"B-M/DQ7666"}]
["Zen Strong","B-N/DQ7372","C-E/DQ2712","W-Y/DQ2767","Q-K/DQ8866","H-Y/DQ3836","K-I/DQ2152",null,null,{"$f":"INDEX($A$4:$A$103,INT((ROWS(I$4:I63)-1)/7)+1)&IF(MOD(ROWS(I$4:I63)-1,7),\" - \"&INDEX($B$4:$G$103,INT((ROWS(I$4:I63)-1)/7)+1,MOD(ROWS(I$4:I63)-1,7)),\"\")","v":"Touch-Lam - E-F/DQ8623"},null,null,{"$f":"INDEX($B$4:$G$103,INT((ROWS(I$4:I63)-1)/7)+1,MOD(ROWS(I$4:I63)-1,7))","v":"E-F/DQ8623"}]
["Stock Touch","V-B/DQ6141","F-K/DQ9978","G-T/DQ4323","E-G/DQ1291","Q-N/DQ9494","X-A/DQ3304",null,null,{"$f":"INDEX($A$4:$A$103,INT((ROWS(I$4:I64)-1)/7)+1)&IF(MOD(ROWS(I$4:I64)-1,7),\" - \"&INDEX($B$4:$G$103,INT((ROWS(I$4:I64)-1)/7)+1,MOD(ROWS(I$4:I64)-1,7)),\"\")","v":"Touch-Lam - N-H/DQ1331"},null,null,{"$f":"INDEX($B$4:$G$103,INT((ROWS(I$4:I64)-1)/7)+1,MOD(ROWS(I$4:I64)-1,7))","v":"N-H/DQ1331"}]
["Stockdox","G-J/DQ1262","M-E/DQ9467","T-M/DQ6911","V-W/DQ3008","J-Q/DQ4683","W-D/DQ1503",null,null,{"$f":"INDEX($A$4:$A$103,INT((ROWS(I$4:I65)-1)/7)+1)&IF(MOD(ROWS(I$4:I65)-1,7),\" - \"&INDEX($B$4:$G$103,INT((ROWS(I$4:I65)-1)/7)+1,MOD(ROWS(I$4:I65)-1,7)),\"\")","v":"Touch-Lam - A-B/DQ3518"},null,null,{"$f":"INDEX($B$4:$G$103,INT((ROWS(I$4:I65)-1)/7)+1,MOD(ROWS(I$4:I65)-1,7))","v":"A-B/DQ3518"}]
["Y- Lax","L-W/DQ7254","S-I/DQ5658","V-Z/DQ8574","A-L/DQ9394","I-O/DQ2393","E-U/DQ4627",null,null,{"$f":"INDEX($A$4:$A$103,INT((ROWS(I$4:I66)-1)/7)+1)&IF(MOD(ROWS(I$4:I66)-1,7),\" - \"&INDEX($B$4:$G$103,INT((ROWS(I$4:I66)-1)/7)+1,MOD(ROWS(I$4:I66)-1,7)),\"\")","v":"Touch-Lam - A-S/DQ7923"},null,null,{"$f":"INDEX($B$4:$G$103,INT((ROWS(I$4:I66)-1)/7)+1,MOD(ROWS(I$4:I66)-1,7))","v":"A-S/DQ7923"}]
["Duolux","W-H/DQ3557","N-L/DQ2999","F-C/DQ1983","X-Q/DQ9087","J-X/DQ8959","Z-V/DQ3936",null,null,{"$f":"INDEX($A$4:$A$103,INT((ROWS(I$4:I67)-1)/7)+1)&IF(MOD(ROWS(I$4:I67)-1,7),\" - \"&INDEX($B$4:$G$103,INT((ROWS(I$4:I67)-1)/7)+1,MOD(ROWS(I$4:I67)-1,7)),\"\")","v":"Lot String"},null,null,{"$f":"INDEX($B$4:$G$103,INT((ROWS(I$4:I67)-1)/7)+1,MOD(ROWS(I$4:I67)-1,7))","v":{"$error":"#VALUE!"}}]
["Biofresh","L-A/DQ6923","U-X/DQ7740","H-S/DQ8103","C-E/DQ2233","O-I/DQ5625","F-G/DQ6422",null,null,{"$f":"INDEX($A$4:$A$103,INT((ROWS(I$4:I68)-1)/7)+1)&IF(MOD(ROWS(I$4:I68)-1,7),\" - \"&INDEX($B$4:$G$103,INT((ROWS(I$4:I68)-1)/7)+1,MOD(ROWS(I$4:I68)-1,7)),\"\")","v":"Lot String - G-J/DQ7020"},null,null,{"$f":"INDEX($B$4:$G$103,INT((ROWS(I$4:I68)-1)/7)+1,MOD(ROWS(I$4:I68)-1,7))","v":"G-J/DQ7020"}]
["Lam-Find","L-B/DQ6600","J-J/DQ6636","T-F/DQ7235","L-E/DQ5363","S-C/DQ9729","K-U/DQ6401",null,null,{"$f":"INDEX($A$4:$A$103,INT((ROWS(I$4:I69)-1)/7)+1)&IF(MOD(ROWS(I$4:I69)-1,7),\" - \"&INDEX($B$4:$G$103,INT((ROWS(I$4:I69)-1)/7)+1,MOD(ROWS(I$4:I69)-1,7)),\"\")","v":"Lot String - Z-X/DQ5056"},null,null,{"$f":"INDEX($B$4:$G$103,INT((ROWS(I$4:I69)-1)/7)+1,MOD(ROWS(I$4:I69)-1,7))","v":"Z-X/DQ5056"}]
["Sanlam","U-G/DQ2593","I-N/DQ8908","N-K/DQ7667","C-X/DQ2549","I-I/DQ4036","P-F/DQ5733",null,null,{"$f":"INDEX($A$4:$A$103,INT((ROWS(I$4:I70)-1)/7)+1)&IF(MOD(ROWS(I$4:I70)-1,7),\" - \"&INDEX($B$4:$G$103,INT((ROWS(I$4:I70)-1)/7)+1,MOD(ROWS(I$4:I70)-1,7)),\"\")","v":"Lot String - T-X/DQ1948"},null,null,{"$f":"INDEX($B$4:$G$103,INT((ROWS(I$4:I70)-1)/7)+1,MOD(ROWS(I$4:I70)-1,7))","v":"T-X/DQ1948"}]
["Lexiair","N-I/DQ8055","B-X/DQ9278","B-W/DQ6317","P-S/DQ6855","C-L/DQ3860","Z-D/DQ9878",null,null,{"$f":"INDEX($A$4:$A$103,INT((ROWS(I$4:I71)-1)/7)+1)&IF(MOD(ROWS(I$4:I71)-1,7),\" - \"&INDEX($B$4:$G$103,INT((ROWS(I$4:I71)-1)/7)+1,MOD(ROWS(I$4:I71)-1,7)),\"\")","v":"Lot String - O-M/DQ4209"},null,null,{"$f":"INDEX($B$4:$G$103,INT((ROWS(I$4:I71)-1)/7)+1,MOD(ROWS(I$4:I71)-1,7))","v":"O-M/DQ4209"}]
["Stat-La","V-R/DQ3359","V-H/DQ7313","F-F/DQ5200","J-Q/DQ5746","A-Q/DQ5080","F-V/DQ2552",null,null,{"$f":"INDEX($A$4:$A$103,INT((ROWS(I$4:I72)-1)/7)+1)&IF(MOD(ROWS(I$4:I72)-1,7),\" - \"&INDEX($B$4:$G$103,INT((ROWS(I$4:I72)-1)/7)+1,MOD(ROWS(I$4:I72)-1,7)),\"\")","v":"Lot String - R-X/DQ8489"},null,null,{"$f":"INDEX($B$4:$G$103,INT((ROWS(I$4:I72)-1)/7)+1,MOD(ROWS(I$4:I72)-1,7))","v":"R-X/DQ8489"}]
["Move Jaytop","T-O/DQ7238","F-D/DQ6648","K-A/DQ9049","H-O/DQ2208","I-Z/DQ5486","X-Y/DQ4699",null,null,{"$f":"INDEX($A$4:$A$103,INT((ROWS(I$4:I73)-1)/7)+1)&IF(MOD(ROWS(I$4:I73)-1,7),\" - \"&INDEX($B$4:$G$103,INT((ROWS(I$4:I73)-1)/7)+1,MOD(ROWS(I$4:I73)-1,7)),\"\")","v":"Lot String - K-F/DQ8350"},null,null,{"$f":"INDEX($B$4:$G$103,INT((ROWS(I$4:I73)-1)/7)+1,MOD(ROWS(I$4:I73)-1,7))","v":"K-F/DQ8350"}]
["Hottrax","J-H/DQ6022","G-H/DQ5842","W-B/DQ2309","C-L/DQ5586","W-F/DQ3438","X-R/DQ3727",null,null,{"$f":"INDEX($A$4:$A$103,INT((ROWS(I$4:I74)-1)/7)+1)&IF(MOD(ROWS(I$4:I74)-1,7),\" - \"&INDEX($B$4:$G$103,INT((ROWS(I$4:I74)-1)/7)+1,MOD(ROWS(I$4:I74)-1,7)),\"\")","v":"Toncore"},null,null,{"$f":"INDEX($B$4:$G$103,INT((ROWS(I$4:I74)-1)/7)+1,MOD(ROWS(I$4:I74)-1,7))","v":{"$error":"#VALUE!"}}]
["Doublehome","I-X/DQ1764","F-V/DQ9308","G-E/DQ9441","D-P/DQ4540","A-C/DQ5093","P-M/DQ5272",null,null,{"$f":"INDEX($A$4:$A$103,INT((ROWS(I$4:I75)-1)/7)+1)&IF(MOD(ROWS(I$4:I75)-1,7),\" - \"&INDEX($B$4:$G$103,INT((ROWS(I$4:I75)-1)/7)+1,MOD(ROWS(I$4:I75)-1,7)),\"\")","v":"Toncore - B-Q/DQ1113"},null,null,{"$f":"INDEX($B$4:$G$103,INT((ROWS(I$4:I75)-1)/7)+1,MOD(ROWS(I$4:I75)-1,7))","v":"B-Q/DQ1113"}]
["Geoeco","K-I/DQ6541","O-A/DQ4828","L-B/DQ5503","U-G/DQ1778","D-V/DQ5889","N-C/DQ6848",null,null,{"$f":"INDEX($A$4:$A$103,INT((ROWS(I$4:I76)-1)/7)+1)&IF(MOD(ROWS(I$4:I76)-1,7),\" - \"&INDEX($B$4:$G$103,INT((ROWS(I$4:I76)-1)/7)+1,MOD(ROWS(I$4:I76)-1,7)),\"\")","v":"Toncore - S-J/DQ8641"},null,null,{"$f":"INDEX($B$4:$G$103,INT((ROWS(I$4:I76)-1)/7)+1,MOD(ROWS(I$4:I76)-1,7))","v":"S-J/DQ8641"}]
["Nimtex","H-V/DQ2801","A-F/DQ3370","E-R/DQ2577","Y-G/DQ7693","P-X/DQ1156","Z-T/DQ1399",null,null,{"$f":"INDEX($A$4:$A$103,INT((ROWS(I$4:I77)-1)/7)+1)&IF(MOD(ROWS(I$4:I77)-1,7),\" - \"&INDEX($B$4:$G$103,INT((ROWS(I$4:I77)-1)/7)+1,MOD(ROWS(I$4:I77)-1,7)),\"\")","v":"Toncore - T-O/DQ6035"},null,null,{"$f":"INDEX($B$4:$G$103,INT((ROWS(I$4:I77)-1)/7)+1,MOD(ROWS(I$4:I77)-1,7))","v":"T-O/DQ6035"}]
["Roneco","D-D/DQ9977","W-U/DQ9156","B-F/DQ9761","G-J/DQ8671","M-Z/DQ2823","Y-S/DQ7569",null,null,{"$f":"INDEX($A$4:$A$103,INT((ROWS(I$4:I78)-1)/7)+1)&IF(MOD(ROWS(I$4:I78)-1,7),\" - \"&INDEX($B$4:$G$103,INT((ROWS(I$4:I78)-1)/7)+1,MOD(ROWS(I$4:I78)-1,7)),\"\")","v":"Toncore - O-D/DQ2138"},null,null,{"$f":"INDEX($B$4:$G$103,INT((ROWS(I$4:I78)-1)/7)+1,MOD(ROWS(I$4:I78)-1,7))","v":"O-D/DQ2138"}]
["Super Damlex","X-K/DQ5825","B-M/DQ4799","F-Y/DQ7680","E-K/DQ5609","X-H/DQ4124","T-L/DQ1506",null,null,{"$f":"INDEX($A$4:$A$103,INT((ROWS(I$4:I79)-1)/7)+1)&IF(MOD(ROWS(I$4:I79)-1,7),\" - \"&INDEX($B$4:$G$103,INT((ROWS(I$4:I79)-1)/7)+1,MOD(ROWS(I$4:I79)-1,7)),\"\")","v":"Toncore - A-Y/DQ5852"},null,null,{"$f":"INDEX($B$4:$G$103,INT((ROWS(I$4:I79)-1)/7)+1,MOD(ROWS(I$4:I79)-1,7))","v":"A-Y/DQ5852"}]
["Donlam","I-C/DQ1599","M-W/DQ6736","M-U/DQ3289","D-G/DQ9953","M-K/DQ2272","B-V/DQ4292",null,null,{"$f":"INDEX($A$4:$A$103,INT((ROWS(I$4:I80)-1)/7)+1)&IF(MOD(ROWS(I$4:I80)-1,7),\" - \"&INDEX($B$4:$G$103,INT((ROWS(I$4:I80)-1)/7)+1,MOD(ROWS(I$4:I80)-1,7)),\"\")","v":"Toncore - A-P/DQ6874"},null,null,{"$f":"INDEX($B$4:$G$103,INT((ROWS(I$4:I80)-1)/7)+1,MOD(ROWS(I$4:I80)-1,7))","v":"A-P/DQ6874"}]
["Year Quolex","F-Y/DQ5679","E-W/DQ8224","N-X/DQ6670","L-Z/DQ5606","M-J/DQ6877","A-H/DQ1309",null,null,{"$f":"INDEX($A$4:$A$103,INT((ROWS(I$4:I81)-1)/7)+1)&IF(MOD(ROWS(I$4:I81)-1,7),\" - \"&INDEX($B$4:$G$103,INT((ROWS(I$4:I81)-1)/7)+1,MOD(ROWS(I$4:I81)-1,7)),\"\")","v":"Greeneco"},null,null,{"$f":"INDEX($B$4:$G$103,INT((ROWS(I$4:I81)-1)/7)+1,MOD(ROWS(I$4:I81)-1,7))","v":{"$error":"#VALUE!"}}]
["Stimlax","B-D/DQ7855","K-E/DQ8332","A-P/DQ4738","V-G/DQ2524","Y-O/DQ9675","N-S/DQ6800",null,null,{"$f":"INDEX($A$4:$A$103,INT((ROWS(I$4:I82)-1)/7)+1)&IF(MOD(ROWS(I$4:I82)-1,7),\" - \"&INDEX($B$4:$G$103,INT((ROWS(I$4:I82)-1)/7)+1,MOD(ROWS(I$4:I82)-1,7)),\"\")","v":"Greeneco - Z-D/DQ3486"},null,null,{"$f":"INDEX($B$4:$G$103,INT((ROWS(I$4:I82)-1)/7)+1,MOD(ROWS(I$4:I82)-1,7))","v":"Z-D/DQ3486"}]
["Duotouch","Z-V/DQ3753","F-F/DQ5074","A-Y/DQ2802","P-R/DQ8445","Y-H/DQ6655","S-L/DQ4687",null,null,{"$f":"INDEX($A$4:$A$103,INT((ROWS(I$4:I83)-1)/7)+1)&IF(MOD(ROWS(I$4:I83)-1,7),\" - \"&INDEX($B$4:$G$103,INT((ROWS(I$4:I83)-1)/7)+1,MOD(ROWS(I$4:I83)-1,7)),\"\")","v":"Greeneco - V-L/DQ2156"},null,null,{"$f":"INDEX($B$4:$G$103,INT((ROWS(I$4:I83)-1)/7)+1,MOD(ROWS(I$4:I83)-1,7))","v":"V-L/DQ2156"}]
["Tam Cof","H-V/DQ1159","I-R/DQ8841","V-Q/DQ8805","X-X/DQ6355","E-B/DQ6085","V-F/DQ3156",null,null,{"$f":"INDEX($A$4:$A$103,INT((ROWS(I$4:I84)-1)/7)+1)&IF(MOD(ROWS(I$4:I84)-1,7),\" - \"&INDEX($B$4:$G$103,INT((ROWS(I$4:I84)-1)/7)+1,MOD(ROWS(I$4:I84)-1,7)),\"\")","v":"Greeneco - S-W/DQ3812"},null,null,{"$f":"INDEX($B$4:$G$103,INT((ROWS(I$4:I84)-1)/7)+1,MOD(ROWS(I$4:I84)-1,7))","v":"S-W/DQ3812"}]
["Viafax","C-U/DQ9402","B-J/DQ9539","L-F/DQ2057","O-X/DQ7355","V-V/DQ1752","R-Y/DQ2556",null,null,{"$f":"INDEX($A$4:$A$103,INT((ROWS(I$4:I85)-1)/7)+1)&IF(MOD(ROWS(I$4:I85)-1,7),\" - \"&INDEX($B$4:$G$103,INT((ROWS(I$4:I85)-1)/7)+1,MOD(ROWS(I$4:I85)-1,7)),\"\")","v":"Greeneco - O-J/DQ4817"},null,null,{"$f":"INDEX($B$4:$G$103,INT((ROWS(I$4:I85)-1)/7)+1,MOD(ROWS(I$4:I85)-1,7))","v":"O-J/DQ4817"}]
["Plus Zap","F-P/DQ1528","A-R/DQ8428","P-J/DQ8896","C-P/DQ5399","X-Z/DQ5028","S-C/DQ3339",null,null,{"$f":"INDEX($A$4:$A$103,INT((ROWS(I$4:I86)-1)/7)+1)&IF(MOD(ROWS(I$4:I86)-1,7),\" - \"&INDEX($B$4:$G$103,INT((ROWS(I$4:I86)-1)/7)+1,MOD(ROWS(I$4:I86)-1,7)),\"\")","v":"Greeneco - W-U/DQ5837"},null,null,{"$f":"INDEX($B$4:$G$103,INT((ROWS(I$4:I86)-1)/7)+1,MOD(ROWS(I$4:I86)-1,7))","v":"W-U/DQ5837"}]
["Toptax","P-P/DQ7924","G-O/DQ6067","Z-J/DQ8325","U-W/DQ4138","C-P/DQ4351","D-U/DQ7085",null,null,{"$f":"INDEX($A$4:$A$103,INT((ROWS(I$4:I87)-1)/7)+1)&IF(MOD(ROWS(I$4:I87)-1,7),\" - \"&INDEX($B$4:$G$103,INT((ROWS(I$4:I87)-1)/7)+1,MOD(ROWS(I$4:I87)-1,7)),\"\")","v":"Greeneco - K-U/DQ5815"},null,null,{"$f":"INDEX($B$4:$G$103,INT((ROWS(I$4:I87)-1)/7)+1,MOD(ROWS(I$4:I87)-1,7))","v":"K-U/DQ5815"}]
["Softsoft","K-H/DQ9934","Z-A/DQ9772","T-X/DQ3131","I-W/DQ1963","L-L/DQ3491","R-P/DQ4740",null,null,{"$f":"INDEX($A$4:$A$103,INT((ROWS(I$4:I88)-1)/7)+1)&IF(MOD(ROWS(I$4:I88)-1,7),\" - \"&INDEX($B$4:$G$103,INT((ROWS(I$4:I88)-1)/7)+1,MOD(ROWS(I$4:I88)-1,7)),\"\")","v":"Airdex"},null,null,{"$f":"INDEX($B$4:$G$103,INT((ROWS(I$4:I88)-1)/7)+1,MOD(ROWS(I$4:I88)-1,7))","v":{"$error":"#VALUE!"}}]
["Sumremjob","U-I/DQ5770","J-V/DQ1316","S-D/DQ3642","M-Z/DQ8379","I-B/DQ7976","N-C/DQ8554",null,null,{"$f":"INDEX($A$4:$A$103,INT((ROWS(I$4:I89)-1)/7)+1)&IF(MOD(ROWS(I$4:I89)-1,7),\" - \"&INDEX($B$4:$G$103,INT((ROWS(I$4:I89)-1)/7)+1,MOD(ROWS(I$4:I89)-1,7)),\"\")","v":"Airdex - T-Z/DQ8308"},null,null,{"$f":"INDEX($B$4:$G$103,INT((ROWS(I$4:I89)-1)/7)+1,MOD(ROWS(I$4:I89)-1,7))","v":"T-Z/DQ8308"}]
["Kanflex","M-F/DQ2070","S-Y/DQ9095","R-W/DQ8908","N-L/DQ6432","M-L/DQ8263","L-O/DQ6467",null,null,{"$f":"INDEX($A$4:$A$103,INT((ROWS(I$4:I90)-1)/7)+1)&IF(MOD(ROWS(I$4:I90)-1,7),\" - \"&INDEX($B$4:$G$103,INT((ROWS(I$4:I90)-1)/7)+1,MOD(ROWS(I$4:I90)-1,7)),\"\")","v":"Airdex - Q-Y/DQ1201"},null,null,{"$f":"INDEX($B$4:$G$103,INT((ROWS(I$4:I90)-1)/7)+1,MOD(ROWS(I$4:I90)-1,7))","v":"Q-Y/DQ1201"}]
["Trustlex","Y-G/DQ3874","O-W/DQ1250","F-T/DQ7332","V-Q/DQ9747","J-W/DQ5551","K-Y/DQ4298",null,null,{"$f":"INDEX($A$4:$A$103,INT((ROWS(I$4:I91)-1)/7)+1)&IF(MOD(ROWS(I$4:I91)-1,7),\" - \"&INDEX($B$4:$G$103,INT((ROWS(I$4:I91)-1)/7)+1,MOD(ROWS(I$4:I91)-1,7)),\"\")","v":"Airdex - X-T/DQ3151"},null,null,{"$f":"INDEX($B$4:$G$103,INT((ROWS(I$4:I91)-1)/7)+1,MOD(ROWS(I$4:I91)-1,7))","v":"X-T/DQ3151"}]
["Joyis","T-C/DQ6871","J-D/DQ9245","J-P/DQ4029","G-N/DQ6122","A-X/DQ4996","S-J/DQ6029",null,null,{"$f":"INDEX($A$4:$A$103,INT((ROWS(I$4:I92)-1)/7)+1)&IF(MOD(ROWS(I$4:I92)-1,7),\" - \"&INDEX($B$4:$G$103,INT((ROWS(I$4:I92)-1)/7)+1,MOD(ROWS(I$4:I92)-1,7)),\"\")","v":"Airdex - T-U/DQ7219"},null,null,{"$f":"INDEX($B$4:$G$103,INT((ROWS(I$4:I92)-1)/7)+1,MOD(ROWS(I$4:I92)-1,7))","v":"T-U/DQ7219"}]
["Salt Damwarm","T-F/DQ5587","Y-L/DQ9024","V-C/DQ9304","U-G/DQ8743","X-K/DQ5215","M-N/DQ7537",null,null,{"$f":"INDEX($A$4:$A$103,INT((ROWS(I$4:I93)-1)/7)+1)&IF(MOD(ROWS(I$4:I93)-1,7),\" - \"&INDEX($B$4:$G$103,INT((ROWS(I$4:I93)-1)/7)+1,MOD(ROWS(I$4:I93)-1,7)),\"\")","v":"Airdex - X-P/DQ1517"},null,null,{"$f":"INDEX($B$4:$G$103,INT((ROWS(I$4:I93)-1)/7)+1,MOD(ROWS(I$4:I93)-1,7))","v":"X-P/DQ1517"}]
["Tripple Apin","J-P/DQ7429","P-G/DQ7086","Y-L/DQ6224","I-A/DQ3124","X-R/DQ2483","K-H/DQ1008",null,null,{"$f":"INDEX($A$4:$A$103,INT((ROWS(I$4:I94)-1)/7)+1)&IF(MOD(ROWS(I$4:I94)-1,7),\" - \"&INDEX($B$4:$G$103,INT((ROWS(I$4:I94)-1)/7)+1,MOD(ROWS(I$4:I94)-1,7)),\"\")","v":"Airdex - Q-E/DQ3131"},null,null,{"$f":"INDEX($B$4:$G$103,INT((ROWS(I$4:I94)-1)/7)+1,MOD(ROWS(I$4:I94)-1,7))","v":"Q-E/DQ3131"}]
["Sil It","I-P/DQ8226","N-P/DQ4986","X-S/DQ9478","J-F/DQ8109","V-V/DQ4594","Q-K/DQ4132",null,null,{"$f":"INDEX($A$4:$A$103,INT((ROWS(I$4:I95)-1)/7)+1)&IF(MOD(ROWS(I$4:I95)-1,7),\" - \"&INDEX($B$4:$G$103,INT((ROWS(I$4:I95)-1)/7)+1,MOD(ROWS(I$4:I95)-1,7)),\"\")","v":"Lamhold"},null,null,{"$f":"INDEX($B$4:$G$103,INT((ROWS(I$4:I95)-1)/7)+1,MOD(ROWS(I$4:I95)-1,7))","v":{"$error":"#VALUE!"}}]
["Re Zoztex","F-E/DQ4809","P-N/DQ1239","S-X/DQ6329","I-O/DQ5603","I-R/DQ4357","K-A/DQ4274",null,null,{"$f":"INDEX($A$4:$A$103,INT((ROWS(I$4:I96)-1)/7)+1)&IF(MOD(ROWS(I$4:I96)-1,7),\" - \"&INDEX($B$4:$G$103,INT((ROWS(I$4:I96)-1)/7)+1,MOD(ROWS(I$4:I96)-1,7)),\"\")","v":"Lamhold - C-D/DQ9157"},null,null,{"$f":"INDEX($B$4:$G$103,INT((ROWS(I$4:I96)-1)/7)+1,MOD(ROWS(I$4:I96)-1,7))","v":"C-D/DQ9157"}]
["Labfan","B-K/DQ8375","H-F/DQ4313","C-C/DQ1150","L-C/DQ9449","W-Z/DQ9017","B-P/DQ9089",null,null,{"$f":"INDEX($A$4:$A$103,INT((ROWS(I$4:I97)-1)/7)+1)&IF(MOD(ROWS(I$4:I97)-1,7),\" - \"&INDEX($B$4:$G$103,INT((ROWS(I$4:I97)-1)/7)+1,MOD(ROWS(I$4:I97)-1,7)),\"\")","v":"Lamhold - P-K/DQ1400"},null,null,{"$f":"INDEX($B$4:$G$103,INT((ROWS(I$4:I97)-1)/7)+1,MOD(ROWS(I$4:I97)-1,7))","v":"P-K/DQ1400"}]
["Canex","W-Q/DQ1827","Z-X/DQ5599","H-Y/DQ3392","G-O/DQ8134","P-Z/DQ1145","S-T/DQ9864",null,null,{"$f":"INDEX($A$4:$A$103,INT((ROWS(I$4:I98)-1)/7)+1)&IF(MOD(ROWS(I$4:I98)-1,7),\" - \"&INDEX($B$4:$G$103,INT((ROWS(I$4:I98)-1)/7)+1,MOD(ROWS(I$4:I98)-1,7)),\"\")","v":"Lamhold - G-M/DQ3192"},null,null,{"$f":"INDEX($B$4:$G$103,INT((ROWS(I$4:I98)-1)/7)+1,MOD(ROWS(I$4:I98)-1,7))","v":"G-M/DQ3192"}]
["Kinsing","D-O/DQ9948","I-C/DQ8877","A-X/DQ1627","U-L/DQ6403","O-E/DQ6432","T-V/DQ6488",null,null,{"$f":"INDEX($A$4:$A$103,INT((ROWS(I$4:I99)-1)/7)+1)&IF(MOD(ROWS(I$4:I99)-1,7),\" - \"&INDEX($B$4:$G$103,INT((ROWS(I$4:I99)-1)/7)+1,MOD(ROWS(I$4:I99)-1,7)),\"\")","v":"Lamhold - G-S/DQ5812"},null,null,{"$f":"INDEX($B$4:$G$103,INT((ROWS(I$4:I99)-1)/7)+1,MOD(ROWS(I$4:I99)-1,7))","v":"G-S/DQ5812"}]
["Geo-Dax","N-M/DQ4637","Z-F/DQ9504","R-N/DQ8726","E-Q/DQ8209","O-Z/DQ2286","I-B/DQ1744",null,null,{"$f":"INDEX($A$4:$A$103,INT((ROWS(I$4:I100)-1)/7)+1)&IF(MOD(ROWS(I$4:I100)-1,7),\" - \"&INDEX($B$4:$G$103,INT((ROWS(I$4:I100)-1)/7)+1,MOD(ROWS(I$4:I100)-1,7)),\"\")","v":"Lamhold - O-X/DQ5678"},null,null,{"$f":"INDEX($B$4:$G$103,INT((ROWS(I$4:I100)-1)/7)+1,MOD(ROWS(I$4:I100)-1,7))","v":"O-X/DQ5678"}]
["Freesoft","N-Y/DQ6967","A-R/DQ8303","H-A/DQ8782","P-R/DQ1717","H-C/DQ9144","F-S/DQ3434",null,null,{"$f":"INDEX($A$4:$A$103,INT((ROWS(I$4:I101)-1)/7)+1)&IF(MOD(ROWS(I$4:I101)-1,7),\" - \"&INDEX($B$4:$G$103,INT((ROWS(I$4:I101)-1)/7)+1,MOD(ROWS(I$4:I101)-1,7)),\"\")","v":"Lamhold - V-P/DQ8051"},null,null,{"$f":"INDEX($B$4:$G$103,INT((ROWS(I$4:I101)-1)/7)+1,MOD(ROWS(I$4:I101)-1,7))","v":"V-P/DQ8051"}]
["Via Kix","B-J/DQ8771","F-S/DQ3920","D-G/DQ8328","C-B/DQ1806","G-Z/DQ2323","T-T/DQ8641",null,null,{"$f":"INDEX($A$4:$A$103,INT((ROWS(I$4:I102)-1)/7)+1)&IF(MOD(ROWS(I$4:I102)-1,7),\" - \"&INDEX($B$4:$G$103,INT((ROWS(I$4:I102)-1)/7)+1,MOD(ROWS(I$4:I102)-1,7)),\"\")","v":"Biosing"},null,null,{"$f":"INDEX($B$4:$G$103,INT((ROWS(I$4:I102)-1)/7)+1,MOD(ROWS(I$4:I102)-1,7))","v":{"$error":"#VALUE!"}}]
["Kan-Dom","I-S/DQ2111","L-J/DQ7510","C-K/DQ5503","Z-V/DQ2269","Z-N/DQ6435","S-Q/DQ1078",null,null,{"$f":"INDEX($A$4:$A$103,INT((ROWS(I$4:I103)-1)/7)+1)&IF(MOD(ROWS(I$4:I103)-1,7),\" - \"&INDEX($B$4:$G$103,INT((ROWS(I$4:I103)-1)/7)+1,MOD(ROWS(I$4:I103)-1,7)),\"\")","v":"Biosing - E-I/DQ8446"},null,null,{"$f":"INDEX($B$4:$G$103,INT((ROWS(I$4:I103)-1)/7)+1,MOD(ROWS(I$4:I103)-1,7))","v":"E-I/DQ8446"}]
[null,null,null,null,null,null,null,null,null,{"$f":"INDEX($A$4:$A$103,INT((ROWS(I$4:I104)-1)/7)+1)&IF(MOD(ROWS(I$4:I104)-1,7),\" - \"&INDEX($B$4:$G$103,INT((ROWS(I$4:I104)-1)/7)+1,MOD(ROWS(I$4:I104)-1,7)),\"\")","v":"Biosing - D-L/DQ9756"},null,null,{"$f":"INDEX($B$4:$G$103,INT((ROWS(I$4:I104)-1)/7)+1,MOD(ROWS(I$4:I104)-1,7))","v":"D-L/DQ9756"}]
[null,null,null,null,null,null,null,null,null,{"$f":"INDEX($A$4:$A$103,INT((ROWS(I$4:I105)-1)/7)+1)&IF(MOD(ROWS(I$4:I105)-1,7),\" - \"&INDEX($B$4:$G$103,INT((ROWS(I$4:I105)-1)/7)+1,MOD(ROWS(I$4:I105)-1,7)),\"\")","v":"Biosing - L-O/DQ5650"},null,null,{"$f":"INDEX($B$4:$G$103,INT((ROWS(I$4:I105)-1)/7)+1,MOD(ROWS(I$4:I105)-1,7))","v":"L-O/DQ5650"}]
[null,null,null,null,null,null,null,null,null,{"$f":"INDEX($A$4:$A$103,INT((ROWS(I$4:I106)-1)/7)+1)&IF(MOD(ROWS(I$4:I106)-1,7),\" - \"&INDEX($B$4:$G$103,INT((ROWS(I$4:I106)-1)/7)+1,MOD(ROWS(I$4:I106)-1,7)),\"\")","v":"Biosing - I-D/DQ6108"},null,null,{"$f":"INDEX($B$4:$G$103,INT((ROWS(I$4:I106)-1)/7)+1,MOD(ROWS(I$4:I106)-1,7))","v":"I-D/DQ6108"}]
[null,null,null,null,null,null,null,null,null,{"$f":"INDEX($A$4:$A$103,INT((ROWS(I$4:I107)-1)/7)+1)&IF(MOD(ROWS(I$4:I107)-1,7),\" - \"&INDEX($B$4:$G$103,INT((ROWS(I$4:I107)-1)/7)+1,MOD(ROWS(I$4:I107)-1,7)),\"\")","v":"Biosing - O-W/DQ1349"},null,null,{"$f":"INDEX($B$4:$G$103,INT((ROWS(I$4:I107)-1)/7)+1,MOD(ROWS(I$4:I107)-1,7))","v":"O-W/DQ1349"}]
[null,null,null,null,null,null,null,null,null,{"$f":"INDEX($A$4:$A$103,INT((ROWS(I$4:I108)-1)/7)+1)&IF(MOD(ROWS(I$4:I108)-1,7),\" - \"&INDEX($B$4:$G$103,INT((ROWS(I$4:I108)-1)/7)+1,MOD(ROWS(I$4:I108)-1,7)),\"\")","v":"Biosing - O-J/DQ3480"},null,null,{"$f":"INDEX($B$4:$G$103,INT((ROWS(I$4:I108)-1)/7)+1,MOD(ROWS(I$4:I108)-1,7))","v":"O-J/DQ3480"}]
[null,null,null,null,null,null,null,null,null,{"$f":"INDEX($A$4:$A$103,INT((ROWS(I$4:I109)-1)/7)+1)&IF(MOD(ROWS(I$4:I109)-1,7),\" - \"&INDEX($B$4:$G$103,INT((ROWS(I$4:I109)-1)/7)+1,MOD(ROWS(I$4:I109)-1,7)),\"\")","v":"Viais"},null,null,{"$f":"INDEX($B$4:$G$103,INT((ROWS(I$4:I109)-1)/7)+1,MOD(ROWS(I$4:I109)-1,7))","v":{"$error":"#VALUE!"}}]
[null,null,null,null,null,null,null,null,null,{"$f":"INDEX($A$4:$A$103,INT((ROWS(I$4:I110)-1)/7)+1)&IF(MOD(ROWS(I$4:I110)-1,7),\" - \"&INDEX($B$4:$G$103,INT((ROWS(I$4:I110)-1)/7)+1,MOD(ROWS(I$4:I110)-1,7)),\"\")","v":"Viais - Z-X/DQ5986"},null,null,{"$f":"INDEX($B$4:$G$103,INT((ROWS(I$4:I110)-1)/7)+1,MOD(ROWS(I$4:I110)-1,7))","v":"Z-X/DQ5986"}]
[null,null,null,null,null,null,null,null,null,{"$f":"INDEX($A$4:$A$103,INT((ROWS(I$4:I111)-1)/7)+1)&IF(MOD(ROWS(I$4:I111)-1,7),\" - \"&INDEX($B$4:$G$103,INT((ROWS(I$4:I111)-1)/7)+1,MOD(ROWS(I$4:I111)-1,7)),\"\")","v":"Viais - Q-X/DQ5295"},null,null,{"$f":"INDEX($B$4:$G$103,INT((ROWS(I$4:I111)-1)/7)+1,MOD(ROWS(I$4:I111)-1,7))","v":"Q-X/DQ5295"}]
[null,null,null,null,null,null,null,null,null,{"$f":"INDEX($A$4:$A$103,INT((ROWS(I$4:I112)-1)/7)+1)&IF(MOD(ROWS(I$4:I112)-1,7),\" - \"&INDEX($B$4:$G$103,INT((ROWS(I$4:I112)-1)/7)+1,MOD(ROWS(I$4:I112)-1,7)),\"\")","v":"Viais - B-D/DQ7046"},null,null,{"$f":"INDEX($B$4:$G$103,INT((ROWS(I$4:I112)-1)/7)+1,MOD(ROWS(I$4:I112)-1,7))","v":"B-D/DQ7046"}]
[null,null,null,null,null,null,null,null,null,{"$f":"INDEX($A$4:$A$103,INT((ROWS(I$4:I113)-1)/7)+1)&IF(MOD(ROWS(I$4:I113)-1,7),\" - \"&INDEX($B$4:$G$103,INT((ROWS(I$4:I113)-1)/7)+1,MOD(ROWS(I$4:I113)-1,7)),\"\")","v":"Viais - Q-O/DQ4384"},null,null,{"$f":"INDEX($B$4:$G$103,INT((ROWS(I$4:I113)-1)/7)+1,MOD(ROWS(I$4:I113)-1,7))","v":"Q-O/DQ4384"}]
[null,null,null,null,null,null,null,null,null,{"$f":"INDEX($A$4:$A$103,INT((ROWS(I$4:I114)-1)/7)+1)&IF(MOD(ROWS(I$4:I114)-1,7),\" - \"&INDEX($B$4:$G$103,INT((ROWS(I$4:I114)-1)/7)+1,MOD(ROWS(I$4:I114)-1,7)),\"\")","v":"Viais - E-P/DQ1000"},null,null,{"$f":"INDEX($B$4:$G$103,INT((ROWS(I$4:I114)-1)/7)+1,MOD(ROWS(I$4:I114)-1,7))","v":"E-P/DQ1000"}]
[null,null,null,null,null,null,null,null,null,{"$f":"INDEX($A$4:$A$103,INT((ROWS(I$4:I115)-1)/7)+1)&IF(MOD(ROWS(I$4:I115)-1,7),\" - \"&INDEX($B$4:$G$103,INT((ROWS(I$4:I115)-1)/7)+1,MOD(ROWS(I$4:I115)-1,7)),\"\")","v":"Viais - H-A/DQ4471"},null,null,{"$f":"INDEX($B$4:$G$103,INT((ROWS(I$4:I115)-1)/7)+1,MOD(ROWS(I$4:I115)-1,7))","v":"H-A/DQ4471"}]
[null,null,null,null,null,null,null,null,null,{"$f":"INDEX($A$4:$A$103,INT((ROWS(I$4:I116)-1)/7)+1)&IF(MOD(ROWS(I$4:I116)-1,7),\" - \"&INDEX($B$4:$G$103,INT((ROWS(I$4:I116)-1)/7)+1,MOD(ROWS(I$4:I116)-1,7)),\"\")","v":"Zim Lax"},null,null,{"$f":"INDEX($B$4:$G$103,INT((ROWS(I$4:I116)-1)/7)+1,MOD(ROWS(I$4:I116)-1,7))","v":{"$error":"#VALUE!"}}]
[null,null,null,null,null,null,null,null,null,{"$f":"INDEX($A$4:$A$103,INT((ROWS(I$4:I117)-1)/7)+1)&IF(MOD(ROWS(I$4:I117)-1,7),\" - \"&INDEX($B$4:$G$103,INT((ROWS(I$4:I117)-1)/7)+1,MOD(ROWS(I$4:I117)-1,7)),\"\")","v":"Zim Lax - N-D/DQ2280"},null,null,{"$f":"INDEX($B$4:$G$103,INT((ROWS(I$4:I117)-1)/7)+1,MOD(ROWS(I$4:I117)-1,7))","v":"N-D/DQ2280"}]
[null,null,null,null,null,null,null,null,null,{"$f":"INDEX($A$4:$A$103,INT((ROWS(I$4:I118)-1)/7)+1)&IF(MOD(ROWS(I$4:I118)-1,7),\" - \"&INDEX($B$4:$G$103,INT((ROWS(I$4:I118)-1)/7)+1,MOD(ROWS(I$4:I118)-1,7)),\"\")","v":"Zim Lax - W-K/DQ4119"},null,null,{"$f":"INDEX($B$4:$G$103,INT((ROWS(I$4:I118)-1)/7)+1,MOD(ROWS(I$4:I118)-1,7))","v":"W-K/DQ4119"}]
[null,null,null,null,null,null,null,null,null,{"$f":"INDEX($A$4:$A$103,INT((ROWS(I$4:I119)-1)/7)+1)&IF(MOD(ROWS(I$4:I119)-1,7),\" - \"&INDEX($B$4:$G$103,INT((ROWS(I$4:I119)-1)/7)+1,MOD(ROWS(I$4:I119)-1,7)),\"\")","v":"Zim Lax - I-L/DQ5301"},null,null,{"$f":"INDEX($B$4:$G$103,INT((ROWS(I$4:I119)-1)/7)+1,MOD(ROWS(I$4:I119)-1,7))","v":"I-L/DQ5301"}]
[null,null,null,null,null,null,null,null,null,{"$f":"INDEX($A$4:$A$103,INT((ROWS(I$4:I120)-1)/7)+1)&IF(MOD(ROWS(I$4:I120)-1,7),\" - \"&INDEX($B$4:$G$103,INT((ROWS(I$4:I120)-1)/7)+1,MOD(ROWS(I$4:I120)-1,7)),\"\")","v":"Zim Lax - Z-M/DQ9782"},null,null,{"$f":"INDEX($B$4:$G$103,INT((ROWS(I$4:I120)-1)/7)+1,MOD(ROWS(I$4:I120)-1,7))","v":"Z-M/DQ9782"}]
[null,null,null,null,null,null,null,null,null,{"$f":"INDEX($A$4:$A$103,INT((ROWS(I$4:I121)-1)/7)+1)&IF(MOD(ROWS(I$4:I121)-1,7),\" - \"&INDEX($B$4:$G$103,INT((ROWS(I$4:I121)-1)/7)+1,MOD(ROWS(I$4:I121)-1,7)),\"\")","v":"Zim Lax - M-O/DQ2381"},null,null,{"$f":"INDEX($B$4:$G$103,INT((ROWS(I$4:I121)-1)/7)+1,MOD(ROWS(I$4:I121)-1,7))","v":"M-O/DQ2381"}]
[null,null,null,null,null,null,null,null,null,{"$f":"INDEX($A$4:$A$103,INT((ROWS(I$4:I122)-1)/7)+1)&IF(MOD(ROWS(I$4:I122)-1,7),\" - \"&INDEX($B$4:$G$103,INT((ROWS(I$4:I122)-1)/7)+1,MOD(ROWS(I$4:I122)-1,7)),\"\")","v":"Zim Lax - D-X/DQ6309"},null,null,{"$f":"INDEX($B$4:$G$103,INT((ROWS(I$4:I122)-1)/7)+1,MOD(ROWS(I$4:I122)-1,7))","v":"D-X/DQ6309"}]
[null,null,null,null,null,null,null,null,null,{"$f":"INDEX($A$4:$A$103,INT((ROWS(I$4:I123)-1)/7)+1)&IF(MOD(ROWS(I$4:I123)-1,7),\" - \"&INDEX($B$4:$G$103,INT((ROWS(I$4:I123)-1)/7)+1,MOD(ROWS(I$4:I123)-1,7)),\"\")","v":"S-lab"},null,null,{"$f":"INDEX($B$4:$G$103,INT((ROWS(I$4:I123)-1)/7)+1,MOD(ROWS(I$4:I123)-1,7))","v":{"$error":"#VALUE!"}}]
[null,null,null,null,null,null,null,null,null,{"$f":"INDEX($A$4:$A$103,INT((ROWS(I$4:I124)-1)/7)+1)&IF(MOD(ROWS(I$4:I124)-1,7),\" - \"&INDEX($B$4:$G$103,INT((ROWS(I$4:I124)-1)/7)+1,MOD(ROWS(I$4:I124)-1,7)),\"\")","v":"S-lab - Y-S/DQ3406"},null,null,{"$f":"INDEX($B$4:$G$103,INT((ROWS(I$4:I124)-1)/7)+1,MOD(ROWS(I$4:I124)-1,7))","v":"Y-S/DQ3406"}]
[null,null,null,null,null,null,null,null,null,{"$f":"INDEX($A$4:$A$103,INT((ROWS(I$4:I125)-1)/7)+1)&IF(MOD(ROWS(I$4:I125)-1,7),\" - \"&INDEX($B$4:$G$103,INT((ROWS(I$4:I125)-1)/7)+1,MOD(ROWS(I$4:I125)-1,7)),\"\")","v":"S-lab - J-L/DQ1112"},null,null,{"$f":"INDEX($B$4:$G$103,INT((ROWS(I$4:I125)-1)/7)+1,MOD(ROWS(I$4:I125)-1,7))","v":"J-L/DQ1112"}]
[null,null,null,null,null,null,null,null,null,{"$f":"INDEX($A$4:$A$103,INT((ROWS(I$4:I126)-1)/7)+1)&IF(MOD(ROWS(I$4:I126)-1,7),\" - \"&INDEX($B$4:$G$103,INT((ROWS(I$4:I126)-1)/7)+1,MOD(ROWS(I$4:I126)-1,7)),\"\")","v":"S-lab - Z-Q/DQ1200"},null,null,{"$f":"INDEX($B$4:$G$103,INT((ROWS(I$4:I126)-1)/7)+1,MOD(ROWS(I$4:I126)-1,7))","v":"Z-Q/DQ1200"}]
[null,null,null,null,null,null,null,null,null,{"$f":"INDEX($A$4:$A$103,INT((ROWS(I$4:I127)-1)/7)+1)&IF(MOD(ROWS(I$4:I127)-1,7),\" - \"&INDEX($B$4:$G$103,INT((ROWS(I$4:I127)-1)/7)+1,MOD(ROWS(I$4:I127)-1,7)),\"\")","v":"S-lab - Q-E/DQ6957"},null,null,{"$f":"INDEX($B$4:$G$103,INT((ROWS(I$4:I127)-1)/7)+1,MOD(ROWS(I$4:I127)-1,7))","v":"Q-E/DQ6957"}]
[null,null,null,null,null,null,null,null,null,{"$f":"INDEX($A$4:$A$103,INT((ROWS(I$4:I128)-1)/7)+1)&IF(MOD(ROWS(I$4:I128)-1,7),\" - \"&INDEX($B$4:$G$103,INT((ROWS(I$4:I128)-1)/7)+1,MOD(ROWS(I$4:I128)-1,7)),\"\")","v":"S-lab - K-X/DQ6856"},null,null,{"$f":"INDEX($B$4:$G$103,INT((ROWS(I$4:I128)-1)/7)+1,MOD(ROWS(I$4:I128)-1,7))","v":"K-X/DQ6856"}]
[null,null,null,null,null,null,null,null,null,{"$f":"INDEX($A$4:$A$103,INT((ROWS(I$4:I129)-1)/7)+1)&IF(MOD(ROWS(I$4:I129)-1,7),\" - \"&INDEX($B$4:$G$103,INT((ROWS(I$4:I129)-1)/7)+1,MOD(ROWS(I$4:I129)-1,7)),\"\")","v":"S-lab - C-W/DQ5579"},null,null,{"$f":"INDEX($B$4:$G$103,INT((ROWS(I$4:I129)-1)/7)+1,MOD(ROWS(I$4:I129)-1,7))","v":"C-W/DQ5579"}]
[null,null,null,null,null,null,null,null,null,{"$f":"INDEX($A$4:$A$103,INT((ROWS(I$4:I130)-1)/7)+1)&IF(MOD(ROWS(I$4:I130)-1,7),\" - \"&INDEX($B$4:$G$103,INT((ROWS(I$4:I130)-1)/7)+1,MOD(ROWS(I$4:I130)-1,7)),\"\")","v":"Stanity"},null,null,{"$f":"INDEX($B$4:$G$103,INT((ROWS(I$4:I130)-1)/7)+1,MOD(ROWS(I$4:I130)-1,7))","v":{"$error":"#VALUE!"}}]
[null,null,null,null,null,null,null,null,null,{"$f":"INDEX($A$4:$A$103,INT((ROWS(I$4:I131)-1)/7)+1)&IF(MOD(ROWS(I$4:I131)-1,7),\" - \"&INDEX($B$4:$G$103,INT((ROWS(I$4:I131)-1)/7)+1,MOD(ROWS(I$4:I131)-1,7)),\"\")","v":"Stanity - R-U/DQ4312"},null,null,{"$f":"INDEX($B$4:$G$103,INT((ROWS(I$4:I131)-1)/7)+1,MOD(ROWS(I$4:I131)-1,7))","v":"R-U/DQ4312"}]
[null,null,null,null,null,null,null,null,null,{"$f":"INDEX($A$4:$A$103,INT((ROWS(I$4:I132)-1)/7)+1)&IF(MOD(ROWS(I$4:I132)-1,7),\" - \"&INDEX($B$4:$G$103,INT((ROWS(I$4:I132)-1)/7)+1,MOD(ROWS(I$4:I132)-1,7)),\"\")","v":"Stanity - N-X/DQ1329"},null,null,{"$f":"INDEX($B$4:$G$103,INT((ROWS(I$4:I132)-1)/7)+1,MOD(ROWS(I$4:I132)-1,7))","v":"N-X/DQ1329"}]
[null,null,null,null,null,null,null,null,null,{"$f":"INDEX($A$4:$A$103,INT((ROWS(I$4:I133)-1)/7)+1)&IF(MOD(ROWS(I$4:I133)-1,7),\" - \"&INDEX($B$4:$G$103,INT((ROWS(I$4:I133)-1)/7)+1,MOD(ROWS(I$4:I133)-1,7)),\"\")","v":"Stanity - M-K/DQ7985"},null,null,{"$f":"INDEX($B$4:$G$103,INT((ROWS(I$4:I133)-1)/7)+1,MOD(ROWS(I$4:I133)-1,7))","v":"M-K/DQ7985"}]
[null,null,null,null,null,null,null,null,null,{"$f":"INDEX($A$4:$A$103,INT((ROWS(I$4:I134)-1)/7)+1)&IF(MOD(ROWS(I$4:I134)-1,7),\" - \"&INDEX($B$4:$G$103,INT((ROWS(I$4:I134)-1)/7)+1,MOD(ROWS(I$4:I134)-1,7)),\"\")","v":"Stanity - U-T/DQ3735"},null,null,{"$f":"INDEX($B$4:$G$103,INT((ROWS(I$4:I134)-1)/7)+1,MOD(ROWS(I$4:I134)-1,7))","v":"U-T/DQ3735"}]
[null,null,null,null,null,null,null,null,null,{"$f":"INDEX($A$4:$A$103,INT((ROWS(I$4:I135)-1)/7)+1)&IF(MOD(ROWS(I$4:I135)-1,7),\" - \"&INDEX($B$4:$G$103,INT((ROWS(I$4:I135)-1)/7)+1,MOD(ROWS(I$4:I135)-1,7)),\"\")","v":"Stanity - A-X/DQ5877"},null,null,{"$f":"INDEX($B$4:$G$103,INT((ROWS(I$4:I135)-1)/7)+1,MOD(ROWS(I$4:I135)-1,7))","v":"A-X/DQ5877"}]
[null,null,null,null,null,null,null,null,null,{"$f":"INDEX($A$4:$A$103,INT((ROWS(I$4:I136)-1)/7)+1)&IF(MOD(ROWS(I$4:I136)-1,7),\" - \"&INDEX($B$4:$G$103,INT((ROWS(I$4:I136)-1)/7)+1,MOD(ROWS(I$4:I136)-1,7)),\"\")","v":"Stanity - P-Y/DQ5472"},null,null,{"$f":"INDEX($B$4:$G$103,INT((ROWS(I$4:I136)-1)/7)+1,MOD(ROWS(I$4:I136)-1,7))","v":"P-Y/DQ5472"}]
[null,null,null,null,null,null,null,null,null,{"$f":"INDEX($A$4:$A$103,INT((ROWS(I$4:I137)-1)/7)+1)&IF(MOD(ROWS(I$4:I137)-1,7),\" - \"&INDEX($B$4:$G$103,INT((ROWS(I$4:I137)-1)/7)+1,MOD(ROWS(I$4:I137)-1,7)),\"\")","v":"Contom"},null,null,{"$f":"INDEX($B$4:$G$103,INT((ROWS(I$4:I137)-1)/7)+1,MOD(ROWS(I$4:I137)-1,7))","v":{"$error":"#VALUE!"}}]
[null,null,null,null,null,null,null,null,null,{"$f":"INDEX($A$4:$A$103,INT((ROWS(I$4:I138)-1)/7)+1)&IF(MOD(ROWS(I$4:I138)-1,7),\" - \"&INDEX($B$4:$G$103,INT((ROWS(I$4:I138)-1)/7)+1,MOD(ROWS(I$4:I138)-1,7)),\"\")","v":"Contom - H-C/DQ2317"},null,null,{"$f":"INDEX($B$4:$G$103,INT((ROWS(I$4:I138)-1)/7)+1,MOD(ROWS(I$4:I138)-1,7))","v":"H-C/DQ2317"}]
[null,null,null,null,null,null,null,null,null,{"$f":"INDEX($A$4:$A$103,INT((ROWS(I$4:I139)-1)/7)+1)&IF(MOD(ROWS(I$4:I139)-1,7),\" - \"&INDEX($B$4:$G$103,INT((ROWS(I$4:I139)-1)/7)+1,MOD(ROWS(I$4:I139)-1,7)),\"\")","v":"Contom - X-V/DQ6726"},null,null,{"$f":"INDEX($B$4:$G$103,INT((ROWS(I$4:I139)-1)/7)+1,MOD(ROWS(I$4:I139)-1,7))","v":"X-V/DQ6726"}]
[null,null,null,null,null,null,null,null,null,{"$f":"INDEX($A$4:$A$103,INT((ROWS(I$4:I140)-1)/7)+1)&IF(MOD(ROWS(I$4:I140)-1,7),\" - \"&INDEX($B$4:$G$103,INT((ROWS(I$4:I140)-1)/7)+1,MOD(ROWS(I$4:I140)-1,7)),\"\")","v":"Contom - C-B/DQ5190"},null,null,{"$f":"INDEX($B$4:$G$103,INT((ROWS(I$4:I140)-1)/7)+1,MOD(ROWS(I$4:I140)-1,7))","v":"C-B/DQ5190"}]
[null,null,null,null,null,null,null,null,null,{"$f":"INDEX($A$4:$A$103,INT((ROWS(I$4:I141)-1)/7)+1)&IF(MOD(ROWS(I$4:I141)-1,7),\" - \"&INDEX($B$4:$G$103,INT((ROWS(I$4:I141)-1)/7)+1,MOD(ROWS(I$4:I141)-1,7)),\"\")","v":"Contom - Q-Y/DQ2021"},null,null,{"$f":"INDEX($B$4:$G$103,INT((ROWS(I$4:I141)-1)/7)+1,MOD(ROWS(I$4:I141)-1,7))","v":"Q-Y/DQ2021"}]
[null,null,null,null,null,null,null,null,null,{"$f":"INDEX($A$4:$A$103,INT((ROWS(I$4:I142)-1)/7)+1)&IF(MOD(ROWS(I$4:I142)-1,7),\" - \"&INDEX($B$4:$G$103,INT((ROWS(I$4:I142)-1)/7)+1,MOD(ROWS(I$4:I142)-1,7)),\"\")","v":"Contom - E-E/DQ5627"},null,null,{"$f":"INDEX($B$4:$G$103,INT((ROWS(I$4:I142)-1)/7)+1,MOD(ROWS(I$4:I142)-1,7))","v":"E-E/DQ5627"}]
[null,null,null,null,null,null,null,null,null,{"$f":"INDEX($A$4:$A$103,INT((ROWS(I$4:I143)-1)/7)+1)&IF(MOD(ROWS(I$4:I143)-1,7),\" - \"&INDEX($B$4:$G$103,INT((ROWS(I$4:I143)-1)/7)+1,MOD(ROWS(I$4:I143)-1,7)),\"\")","v":"Contom - A-K/DQ5855"},null,null,{"$f":"INDEX($B$4:$G$103,INT((ROWS(I$4:I143)-1)/7)+1,MOD(ROWS(I$4:I143)-1,7))","v":"A-K/DQ5855"}]
[null,null,null,null,null,null,null,null,null,{"$f":"INDEX($A$4:$A$103,INT((ROWS(I$4:I144)-1)/7)+1)&IF(MOD(ROWS(I$4:I144)-1,7),\" - \"&INDEX($B$4:$G$103,INT((ROWS(I$4:I144)-1)/7)+1,MOD(ROWS(I$4:I144)-1,7)),\"\")","v":"Lam-Top"},null,null,{"$f":"INDEX($B$4:$G$103,INT((ROWS(I$4:I144)-1)/7)+1,MOD(ROWS(I$4:I144)-1,7))","v":{"$error":"#VALUE!"}}]
[null,null,null,null,null,null,null,null,null,{"$f":"INDEX($A$4:$A$103,INT((ROWS(I$4:I145)-1)/7)+1)&IF(MOD(ROWS(I$4:I145)-1,7),\" - \"&INDEX($B$4:$G$103,INT((ROWS(I$4:I145)-1)/7)+1,MOD(ROWS(I$4:I145)-1,7)),\"\")","v":"Lam-Top - T-E/DQ7702"},null,null,{"$f":"INDEX($B$4:$G$103,INT((ROWS(I$4:I145)-1)/7)+1,MOD(ROWS(I$4:I145)-1,7))","v":"T-E/DQ7702"}]
[null,null,null,null,null,null,null,null,null,{"$f":"INDEX($A$4:$A$103,INT((ROWS(I$4:I146)-1)/7)+1)&IF(MOD(ROWS(I$4:I146)-1,7),\" - \"&INDEX($B$4:$G$103,INT((ROWS(I$4:I146)-1)/7)+1,MOD(ROWS(I$4:I146)-1,7)),\"\")","v":"Lam-Top - S-M/DQ3163"},null,null,{"$f":"INDEX($B$4:$G$103,INT((ROWS(I$4:I146)-1)/7)+1,MOD(ROWS(I$4:I146)-1,7))","v":"S-M/DQ3163"}]
[null,null,null,null,null,null,null,null,null,{"$f":"INDEX($A$4:$A$103,INT((ROWS(I$4:I147)-1)/7)+1)&IF(MOD(ROWS(I$4:I147)-1,7),\" - \"&INDEX($B$4:$G$103,INT((ROWS(I$4:I147)-1)/7)+1,MOD(ROWS(I$4:I147)-1,7)),\"\")","v":"Lam-Top - B-I/DQ6623"},null,null,{"$f":"INDEX($B$4:$G$103,INT((ROWS(I$4:I147)-1)/7)+1,MOD(ROWS(I$4:I147)-1,7))","v":"B-I/DQ6623"}]
[null,null,null,null,null,null,null,null,null,{"$f":"INDEX($A$4:$A$103,INT((ROWS(I$4:I148)-1)/7)+1)&IF(MOD(ROWS(I$4:I148)-1,7),\" - \"&INDEX($B$4:$G$103,INT((ROWS(I$4:I148)-1)/7)+1,MOD(ROWS(I$4:I148)-1,7)),\"\")","v":"Lam-Top - U-G/DQ3097"},null,null,{"$f":"INDEX($B$4:$G$103,INT((ROWS(I$4:I148)-1)/7)+1,MOD(ROWS(I$4:I148)-1,7))","v":"U-G/DQ3097"}]
[null,null,null,null,null,null,null,null,null,{"$f":"INDEX($A$4:$A$103,INT((ROWS(I$4:I149)-1)/7)+1)&IF(MOD(ROWS(I$4:I149)-1,7),\" - \"&INDEX($B$4:$G$103,INT((ROWS(I$4:I149)-1)/7)+1,MOD(ROWS(I$4:I149)-1,7)),\"\")","v":"Lam-Top - V-D/DQ3996"},null,null,{"$f":"INDEX($B$4:$G$103,INT((ROWS(I$4:I149)-1)/7)+1,MOD(ROWS(I$4:I149)-1,7))","v":"V-D/DQ3996"}]
[null,null,null,null,null,null,null,null,null,{"$f":"INDEX($A$4:$A$103,INT((ROWS(I$4:I150)-1)/7)+1)&IF(MOD(ROWS(I$4:I150)-1,7),\" - \"&INDEX($B$4:$G$103,INT((ROWS(I$4:I150)-1)/7)+1,MOD(ROWS(I$4:I150)-1,7)),\"\")","v":"Lam-Top - U-N/DQ7711"},null,null,{"$f":"INDEX($B$4:$G$103,INT((ROWS(I$4:I150)-1)/7)+1,MOD(ROWS(I$4:I150)-1,7))","v":"U-N/DQ7711"}]
[null,null,null,null,null,null,null,null,null,{"$f":"INDEX($A$4:$A$103,INT((ROWS(I$4:I151)-1)/7)+1)&IF(MOD(ROWS(I$4:I151)-1,7),\" - \"&INDEX($B$4:$G$103,INT((ROWS(I$4:I151)-1)/7)+1,MOD(ROWS(I$4:I151)-1,7)),\"\")","v":"Trantraxbam"},null,null,{"$f":"INDEX($B$4:$G$103,INT((ROWS(I$4:I151)-1)/7)+1,MOD(ROWS(I$4:I151)-1,7))","v":{"$error":"#VALUE!"}}]
[null,null,null,null,null,null,null,null,null,{"$f":"INDEX($A$4:$A$103,INT((ROWS(I$4:I152)-1)/7)+1)&IF(MOD(ROWS(I$4:I152)-1,7),\" - \"&INDEX($B$4:$G$103,INT((ROWS(I$4:I152)-1)/7)+1,MOD(ROWS(I$4:I152)-1,7)),\"\")","v":"Trantraxbam - C-T/DQ4565"},null,null,{"$f":"INDEX($B$4:$G$103,INT((ROWS(I$4:I152)-1)/7)+1,MOD(ROWS(I$4:I152)-1,7))","v":"C-T/DQ4565"}]
[null,null,null,null,null,null,null,null,null,{"$f":"INDEX($A$4:$A$103,INT((ROWS(I$4:I153)-1)/7)+1)&IF(MOD(ROWS(I$4:I153)-1,7),\" - \"&INDEX($B$4:$G$103,INT((ROWS(I$4:I153)-1)/7)+1,MOD(ROWS(I$4:I153)-1,7)),\"\")","v":"Trantraxbam - Z-F/DQ1695"},null,null,{"$f":"INDEX($B$4:$G$103,INT((ROWS(I$4:I153)-1)/7)+1,MOD(ROWS(I$4:I153)-1,7))","v":"Z-F/DQ1695"}]
[null,null,null,null,null,null,null,null,null,{"$f":"INDEX($A$4:$A$103,INT((ROWS(I$4:I154)-1)/7)+1)&IF(MOD(ROWS(I$4:I154)-1,7),\" - \"&INDEX($B$4:$G$103,INT((ROWS(I$4:I154)-1)/7)+1,MOD(ROWS(I$4:I154)-1,7)),\"\")","v":"Trantraxbam - V-V/DQ3074"},null,null,{"$f":"INDEX($B$4:$G$103,INT((ROWS(I$4:I154)-1)/7)+1,MOD(ROWS(I$4:I154)-1,7))","v":"V-V/DQ3074"}]
[null,null,null,null,null,null,null,null,null,{"$f":"INDEX($A$4:$A$103,INT((ROWS(I$4:I155)-1)/7)+1)&IF(MOD(ROWS(I$4:I155)-1,7),\" - \"&INDEX($B$4:$G$103,INT((ROWS(I$4:I155)-1)/7)+1,MOD(ROWS(I$4:I155)-1,7)),\"\")","v":"Trantraxbam - V-P/DQ9688"},null,null,{"$f":"INDEX($B$4:$G$103,INT((ROWS(I$4:I155)-1)/7)+1,MOD(ROWS(I$4:I155)-1,7))","v":"V-P/DQ9688"}]
[null,null,null,null,null,null,null,null,null,{"$f":"INDEX($A$4:$A$103,INT((ROWS(I$4:I156)-1)/7)+1)&IF(MOD(ROWS(I$4:I156)-1,7),\" - \"&INDEX($B$4:$G$103,INT((ROWS(I$4:I156)-1)/7)+1,MOD(ROWS(I$4:I156)-1,7)),\"\")","v":"Trantraxbam - S-M/DQ1541"},null,null,{"$f":"INDEX($B$4:$G$103,INT((ROWS(I$4:I156)-1)/7)+1,MOD(ROWS(I$4:I156)-1,7))","v":"S-M/DQ1541"}]
[null,null,null,null,null,null,null,null,null,{"$f":"INDEX($A$4:$A$103,INT((ROWS(I$4:I157)-1)/7)+1)&IF(MOD(ROWS(I$4:I157)-1,7),\" - \"&INDEX($B$4:$G$103,INT((ROWS(I$4:I157)-1)/7)+1,MOD(ROWS(I$4:I157)-1,7)),\"\")","v":"Trantraxbam - G-E/DQ8061"},null,null,{"$f":"INDEX($B$4:$G$103,INT((ROWS(I$4:I157)-1)/7)+1,MOD(ROWS(I$4:I157)-1,7))","v":"G-E/DQ8061"}]
[null,null,null,null,null,null,null,null,null,{"$f":"INDEX($A$4:$A$103,INT((ROWS(I$4:I158)-1)/7)+1)&IF(MOD(ROWS(I$4:I158)-1,7),\" - \"&INDEX($B$4:$G$103,INT((ROWS(I$4:I158)-1)/7)+1,MOD(ROWS(I$4:I158)-1,7)),\"\")","v":"Silver Traxsing"},null,null,{"$f":"INDEX($B$4:$G$103,INT((ROWS(I$4:I158)-1)/7)+1,MOD(ROWS(I$4:I158)-1,7))","v":{"$error":"#VALUE!"}}]
[null,null,null,null,null,null,null,null,null,{"$f":"INDEX($A$4:$A$103,INT((ROWS(I$4:I159)-1)/7)+1)&IF(MOD(ROWS(I$4:I159)-1,7),\" - \"&INDEX($B$4:$G$103,INT((ROWS(I$4:I159)-1)/7)+1,MOD(ROWS(I$4:I159)-1,7)),\"\")","v":"Silver Traxsing - N-V/DQ7788"},null,null,{"$f":"INDEX($B$4:$G$103,INT((ROWS(I$4:I159)-1)/7)+1,MOD(ROWS(I$4:I159)-1,7))","v":"N-V/DQ7788"}]
[null,null,null,null,null,null,null,null,null,{"$f":"INDEX($A$4:$A$103,INT((ROWS(I$4:I160)-1)/7)+1)&IF(MOD(ROWS(I$4:I160)-1,7),\" - \"&INDEX($B$4:$G$103,INT((ROWS(I$4:I160)-1)/7)+1,MOD(ROWS(I$4:I160)-1,7)),\"\")","v":"Silver Traxsing - R-O/DQ1810"},null,null,{"$f":"INDEX($B$4:$G$103,INT((ROWS(I$4:I160)-1)/7)+1,MOD(ROWS(I$4:I160)-1,7))","v":"R-O/DQ1810"}]
[null,null,null,null,null,null,null,null,null,{"$f":"INDEX($A$4:$A$103,INT((ROWS(I$4:I161)-1)/7)+1)&IF(MOD(ROWS(I$4:I161)-1,7),\" - \"&INDEX($B$4:$G$103,INT((ROWS(I$4:I161)-1)/7)+1,MOD(ROWS(I$4:I161)-1,7)),\"\")","v":"Silver Traxsing - E-X/DQ4308"},null,null,{"$f":"INDEX($B$4:$G$103,INT((ROWS(I$4:I161)-1)/7)+1,MOD(ROWS(I$4:I161)-1,7))","v":"E-X/DQ4308"}]
[null,null,null,null,null,null,null,null,null,{"$f":"INDEX($A$4:$A$103,INT((ROWS(I$4:I162)-1)/7)+1)&IF(MOD(ROWS(I$4:I162)-1,7),\" - \"&INDEX($B$4:$G$103,INT((ROWS(I$4:I162)-1)/7)+1,MOD(ROWS(I$4:I162)-1,7)),\"\")","v":"Silver Traxsing - T-D/DQ7728"},null,null,{"$f":"INDEX($B$4:$G$103,INT((ROWS(I$4:I162)-1)/7)+1,MOD(ROWS(I$4:I162)-1,7))","v":"T-D/DQ7728"}]
[null,null,null,null,null,null,null,null,null,{"$f":"INDEX($A$4:$A$103,INT((ROWS(I$4:I163)-1)/7)+1)&IF(MOD(ROWS(I$4:I163)-1,7),\" - \"&INDEX($B$4:$G$103,INT((ROWS(I$4:I163)-1)/7)+1,MOD(ROWS(I$4:I163)-1,7)),\"\")","v":"Silver Traxsing - Y-J/DQ5551"},null,null,{"$f":"INDEX($B$4:$G$103,INT((ROWS(I$4:I163)-1)/7)+1,MOD(ROWS(I$4:I163)-1,7))","v":"Y-J/DQ5551"}]
[null,null,null,null,null,null,null,null,null,{"$f":"INDEX($A$4:$A$103,INT((ROWS(I$4:I164)-1)/7)+1)&IF(MOD(ROWS(I$4:I164)-1,7),\" - \"&INDEX($B$4:$G$103,INT((ROWS(I$4:I164)-1)/7)+1,MOD(ROWS(I$4:I164)-1,7)),\"\")","v":"Silver Traxsing - D-M/DQ7097"},null,null,{"$f":"INDEX($B$4:$G$103,INT((ROWS(I$4:I164)-1)/7)+1,MOD(ROWS(I$4:I164)-1,7))","v":"D-M/DQ7097"}]
[null,null,null,null,null,null,null,null,null,{"$f":"INDEX($A$4:$A$103,INT((ROWS(I$4:I165)-1)/7)+1)&IF(MOD(ROWS(I$4:I165)-1,7),\" - \"&INDEX($B$4:$G$103,INT((ROWS(I$4:I165)-1)/7)+1,MOD(ROWS(I$4:I165)-1,7)),\"\")","v":"Softdex"},null,null,{"$f":"INDEX($B$4:$G$103,INT((ROWS(I$4:I165)-1)/7)+1,MOD(ROWS(I$4:I165)-1,7))","v":{"$error":"#VALUE!"}}]
[null,null,null,null,null,null,null,null,null,{"$f":"INDEX($A$4:$A$103,INT((ROWS(I$4:I166)-1)/7)+1)&IF(MOD(ROWS(I$4:I166)-1,7),\" - \"&INDEX($B$4:$G$103,INT((ROWS(I$4:I166)-1)/7)+1,MOD(ROWS(I$4:I166)-1,7)),\"\")","v":"Softdex - F-G/DQ1406"},null,null,{"$f":"INDEX($B$4:$G$103,INT((ROWS(I$4:I166)-1)/7)+1,MOD(ROWS(I$4:I166)-1,7))","v":"F-G/DQ1406"}]
[null,null,null,null,null,null,null,null,null,{"$f":"INDEX($A$4:$A$103,INT((ROWS(I$4:I167)-1)/7)+1)&IF(MOD(ROWS(I$4:I167)-1,7),\" - \"&INDEX($B$4:$G$103,INT((ROWS(I$4:I167)-1)/7)+1,MOD(ROWS(I$4:I167)-1,7)),\"\")","v":"Softdex - M-B/DQ8930"},null,null,{"$f":"INDEX($B$4:$G$103,INT((ROWS(I$4:I167)-1)/7)+1,MOD(ROWS(I$4:I167)-1,7))","v":"M-B/DQ8930"}]
[null,null,null,null,null,null,null,null,null,{"$f":"INDEX($A$4:$A$103,INT((ROWS(I$4:I168)-1)/7)+1)&IF(MOD(ROWS(I$4:I168)-1,7),\" - \"&INDEX($B$4:$G$103,INT((ROWS(I$4:I168)-1)/7)+1,MOD(ROWS(I$4:I168)-1,7)),\"\")","v":"Softdex - L-R/DQ1359"},null,null,{"$f":"INDEX($B$4:$G$103,INT((ROWS(I$4:I168)-1)/7)+1,MOD(ROWS(I$4:I168)-1,7))","v":"L-R/DQ1359"}]
[null,null,null,null,null,null,null,null,null,{"$f":"INDEX($A$4:$A$103,INT((ROWS(I$4:I169)-1)/7)+1)&IF(MOD(ROWS(I$4:I169)-1,7),\" - \"&INDEX($B$4:$G$103,INT((ROWS(I$4:I169)-1)/7)+1,MOD(ROWS(I$4:I169)-1,7)),\"\")","v":"Softdex - I-P/DQ1241"},null,null,{"$f":"INDEX($B$4:$G$103,INT((ROWS(I$4:I169)-1)/7)+1,MOD(ROWS(I$4:I169)-1,7))","v":"I-P/DQ1241"}]
[null,null,null,null,null,null,null,null,null,{"$f":"INDEX($A$4:$A$103,INT((ROWS(I$4:I170)-1)/7)+1)&IF(MOD(ROWS(I$4:I170)-1,7),\" - \"&INDEX($B$4:$G$103,INT((ROWS(I$4:I170)-1)/7)+1,MOD(ROWS(I$4:I170)-1,7)),\"\")","v":"Softdex - C-I/DQ3156"},null,null,{"$f":"INDEX($B$4:$G$103,INT((ROWS(I$4:I170)-1)/7)+1,MOD(ROWS(I$4:I170)-1,7))","v":"C-I/DQ3156"}]
[null,null,null,null,null,null,null,null,null,{"$f":"INDEX($A$4:$A$103,INT((ROWS(I$4:I171)-1)/7)+1)&IF(MOD(ROWS(I$4:I171)-1,7),\" - \"&INDEX($B$4:$G$103,INT((ROWS(I$4:I171)-1)/7)+1,MOD(ROWS(I$4:I171)-1,7)),\"\")","v":"Softdex - R-B/DQ8080"},null,null,{"$f":"INDEX($B$4:$G$103,INT((ROWS(I$4:I171)-1)/7)+1,MOD(ROWS(I$4:I171)-1,7))","v":"R-B/DQ8080"}]
[null,null,null,null,null,null,null,null,null,{"$f":"INDEX($A$4:$A$103,INT((ROWS(I$4:I172)-1)/7)+1)&IF(MOD(ROWS(I$4:I172)-1,7),\" - \"&INDEX($B$4:$G$103,INT((ROWS(I$4:I172)-1)/7)+1,MOD(ROWS(I$4:I172)-1,7)),\"\")","v":"Air-Trax"},null,null,{"$f":"INDEX($B$4:$G$103,INT((ROWS(I$4:I172)-1)/7)+1,MOD(ROWS(I$4:I172)-1,7))","v":{"$error":"#VALUE!"}}]
[null,null,null,null,null,null,null,null,null,{"$f":"INDEX($A$4:$A$103,INT((ROWS(I$4:I173)-1)/7)+1)&IF(MOD(ROWS(I$4:I173)-1,7),\" - \"&INDEX($B$4:$G$103,INT((ROWS(I$4:I173)-1)/7)+1,MOD(ROWS(I$4:I173)-1,7)),\"\")","v":"Air-Trax - I-Y/DQ6462"},null,null,{"$f":"INDEX($B$4:$G$103,INT((ROWS(I$4:I173)-1)/7)+1,MOD(ROWS(I$4:I173)-1,7))","v":"I-Y/DQ6462"}]
[null,null,null,null,null,null,null,null,null,{"$f":"INDEX($A$4:$A$103,INT((ROWS(I$4:I174)-1)/7)+1)&IF(MOD(ROWS(I$4:I174)-1,7),\" - \"&INDEX($B$4:$G$103,INT((ROWS(I$4:I174)-1)/7)+1,MOD(ROWS(I$4:I174)-1,7)),\"\")","v":"Air-Trax - U-B/DQ2419"},null,null,{"$f":"INDEX($B$4:$G$103,INT((ROWS(I$4:I174)-1)/7)+1,MOD(ROWS(I$4:I174)-1,7))","v":"U-B/DQ2419"}]
[null,null,null,null,null,null,null,null,null,{"$f":"INDEX($A$4:$A$103,INT((ROWS(I$4:I175)-1)/7)+1)&IF(MOD(ROWS(I$4:I175)-1,7),\" - \"&INDEX($B$4:$G$103,INT((ROWS(I$4:I175)-1)/7)+1,MOD(ROWS(I$4:I175)-1,7)),\"\")","v":"Air-Trax - Y-X/DQ9909"},null,null,{"$f":"INDEX($B$4:$G$103,INT((ROWS(I$4:I175)-1)/7)+1,MOD(ROWS(I$4:I175)-1,7))","v":"Y-X/DQ9909"}]
[null,null,null,null,null,null,null,null,null,{"$f":"INDEX($A$4:$A$103,INT((ROWS(I$4:I176)-1)/7)+1)&IF(MOD(ROWS(I$4:I176)-1,7),\" - \"&INDEX($B$4:$G$103,INT((ROWS(I$4:I176)-1)/7)+1,MOD(ROWS(I$4:I176)-1,7)),\"\")","v":"Air-Trax - J-E/DQ2773"},null,null,{"$f":"INDEX($B$4:$G$103,INT((ROWS(I$4:I176)-1)/7)+1,MOD(ROWS(I$4:I176)-1,7))","v":"J-E/DQ2773"}]
[null,null,null,null,null,null,null,null,null,{"$f":"INDEX($A$4:$A$103,INT((ROWS(I$4:I177)-1)/7)+1)&IF(MOD(ROWS(I$4:I177)-1,7),\" - \"&INDEX($B$4:$G$103,INT((ROWS(I$4:I177)-1)/7)+1,MOD(ROWS(I$4:I177)-1,7)),\"\")","v":"Air-Trax - V-E/DQ6312"},null,null,{"$f":"INDEX($B$4:$G$103,INT((ROWS(I$4:I177)-1)/7)+1,MOD(ROWS(I$4:I177)-1,7))","v":"V-E/DQ6312"}]
[null,null,null,null,null,null,null,null,null,{"$f":"INDEX($A$4:$A$103,INT((ROWS(I$4:I178)-1)/7)+1)&IF(MOD(ROWS(I$4:I178)-1,7),\" - \"&INDEX($B$4:$G$103,INT((ROWS(I$4:I178)-1)/7)+1,MOD(ROWS(I$4:I178)-1,7)),\"\")","v":"Air-Trax - E-T/DQ4131"},null,null,{"$f":"INDEX($B$4:$G$103,INT((ROWS(I$4:I178)-1)/7)+1,MOD(ROWS(I$4:I178)-1,7))","v":"E-T/DQ4131"}]
[null,null,null,null,null,null,null,null,null,{"$f":"INDEX($A$4:$A$103,INT((ROWS(I$4:I179)-1)/7)+1)&IF(MOD(ROWS(I$4:I179)-1,7),\" - \"&INDEX($B$4:$G$103,INT((ROWS(I$4:I179)-1)/7)+1,MOD(ROWS(I$4:I179)-1,7)),\"\")","v":"Labfax"},null,null,{"$f":"INDEX($B$4:$G$103,INT((ROWS(I$4:I179)-1)/7)+1,MOD(ROWS(I$4:I179)-1,7))","v":{"$error":"#VALUE!"}}]
[null,null,null,null,null,null,null,null,null,{"$f":"INDEX($A$4:$A$103,INT((ROWS(I$4:I180)-1)/7)+1)&IF(MOD(ROWS(I$4:I180)-1,7),\" - \"&INDEX($B$4:$G$103,INT((ROWS(I$4:I180)-1)/7)+1,MOD(ROWS(I$4:I180)-1,7)),\"\")","v":"Labfax - W-U/DQ4000"},null,null,{"$f":"INDEX($B$4:$G$103,INT((ROWS(I$4:I180)-1)/7)+1,MOD(ROWS(I$4:I180)-1,7))","v":"W-U/DQ4000"}]
[null,null,null,null,null,null,null,null,null,{"$f":"INDEX($A$4:$A$103,INT((ROWS(I$4:I181)-1)/7)+1)&IF(MOD(ROWS(I$4:I181)-1,7),\" - \"&INDEX($B$4:$G$103,INT((ROWS(I$4:I181)-1)/7)+1,MOD(ROWS(I$4:I181)-1,7)),\"\")","v":"Labfax - Z-G/DQ3343"},null,null,{"$f":"INDEX($B$4:$G$103,INT((ROWS(I$4:I181)-1)/7)+1,MOD(ROWS(I$4:I181)-1,7))","v":"Z-G/DQ3343"}]
[null,null,null,null,null,null,null,null,null,{"$f":"INDEX($A$4:$A$103,INT((ROWS(I$4:I182)-1)/7)+1)&IF(MOD(ROWS(I$4:I182)-1,7),\" - \"&INDEX($B$4:$G$103,INT((ROWS(I$4:I182)-1)/7)+1,MOD(ROWS(I$4:I182)-1,7)),\"\")","v":"Labfax - U-F/DQ2988"},null,null,{"$f":"INDEX($B$4:$G$103,INT((ROWS(I$4:I182)-1)/7)+1,MOD(ROWS(I$4:I182)-1,7))","v":"U-F/DQ2988"}]
[null,null,null,null,null,null,null,null,null,{"$f":"INDEX($A$4:$A$103,INT((ROWS(I$4:I183)-1)/7)+1)&IF(MOD(ROWS(I$4:I183)-1,7),\" - \"&INDEX($B$4:$G$103,INT((ROWS(I$4:I183)-1)/7)+1,MOD(ROWS(I$4:I183)-1,7)),\"\")","v":"Labfax - T-R/DQ1925"},null,null,{"$f":"INDEX($B$4:$G$103,INT((ROWS(I$4:I183)-1)/7)+1,MOD(ROWS(I$4:I183)-1,7))","v":"T-R/DQ1925"}]
[null,null,null,null,null,null,null,null,null,{"$f":"INDEX($A$4:$A$103,INT((ROWS(I$4:I184)-1)/7)+1)&IF(MOD(ROWS(I$4:I184)-1,7),\" - \"&INDEX($B$4:$G$103,INT((ROWS(I$4:I184)-1)/7)+1,MOD(ROWS(I$4:I184)-1,7)),\"\")","v":"Labfax - Z-P/DQ7423"},null,null,{"$f":"INDEX($B$4:$G$103,INT((ROWS(I$4:I184)-1)/7)+1,MOD(ROWS(I$4:I184)-1,7))","v":"Z-P/DQ7423"}]
[null,null,null,null,null,null,null,null,null,{"$f":"INDEX($A$4:$A$103,INT((ROWS(I$4:I185)-1)/7)+1)&IF(MOD(ROWS(I$4:I185)-1,7),\" - \"&INDEX($B$4:$G$103,INT((ROWS(I$4:I185)-1)/7)+1,MOD(ROWS(I$4:I185)-1,7)),\"\")","v":"Labfax - Z-P/DQ9403"},null,null,{"$f":"INDEX($B$4:$G$103,INT((ROWS(I$4:I185)-1)/7)+1,MOD(ROWS(I$4:I185)-1,7))","v":"Z-P/DQ9403"}]
[null,null,null,null,null,null,null,null,null,{"$f":"INDEX($A$4:$A$103,INT((ROWS(I$4:I186)-1)/7)+1)&IF(MOD(ROWS(I$4:I186)-1,7),\" - \"&INDEX($B$4:$G$103,INT((ROWS(I$4:I186)-1)/7)+1,MOD(ROWS(I$4:I186)-1,7)),\"\")","v":"Konkstatis"},null,null,{"$f":"INDEX($B$4:$G$103,INT((ROWS(I$4:I186)-1)/7)+1,MOD(ROWS(I$4:I186)-1,7))","v":{"$error":"#VALUE!"}}]
[null,null,null,null,null,null,null,null,null,{"$f":"INDEX($A$4:$A$103,INT((ROWS(I$4:I187)-1)/7)+1)&IF(MOD(ROWS(I$4:I187)-1,7),\" - \"&INDEX($B$4:$G$103,INT((ROWS(I$4:I187)-1)/7)+1,MOD(ROWS(I$4:I187)-1,7)),\"\")","v":"Konkstatis - H-T/DQ7055"},null,null,{"$f":"INDEX($B$4:$G$103,INT((ROWS(I$4:I187)-1)/7)+1,MOD(ROWS(I$4:I187)-1,7))","v":"H-T/DQ7055"}]
[null,null,null,null,null,null,null,null,null,{"$f":"INDEX($A$4:$A$103,INT((ROWS(I$4:I188)-1)/7)+1)&IF(MOD(ROWS(I$4:I188)-1,7),\" - \"&INDEX($B$4:$G$103,INT((ROWS(I$4:I188)-1)/7)+1,MOD(ROWS(I$4:I188)-1,7)),\"\")","v":"Konkstatis - V-Y/DQ8364"},null,null,{"$f":"INDEX($B$4:$G$103,INT((ROWS(I$4:I188)-1)/7)+1,MOD(ROWS(I$4:I188)-1,7))","v":"V-Y/DQ8364"}]
[null,null,null,null,null,null,null,null,null,{"$f":"INDEX($A$4:$A$103,INT((ROWS(I$4:I189)-1)/7)+1)&IF(MOD(ROWS(I$4:I189)-1,7),\" - \"&INDEX($B$4:$G$103,INT((ROWS(I$4:I189)-1)/7)+1,MOD(ROWS(I$4:I189)-1,7)),\"\")","v":"Konkstatis - U-Z/DQ3697"},null,null,{"$f":"INDEX($B$4:$G$103,INT((ROWS(I$4:I189)-1)/7)+1,MOD(ROWS(I$4:I189)-1,7))","v":"U-Z/DQ3697"}]
[null,null,null,null,null,null,null,null,null,{"$f":"INDEX($A$4:$A$103,INT((ROWS(I$4:I190)-1)/7)+1)&IF(MOD(ROWS(I$4:I190)-1,7),\" - \"&INDEX($B$4:$G$103,INT((ROWS(I$4:I190)-1)/7)+1,MOD(ROWS(I$4:I190)-1,7)),\"\")","v":"Konkstatis - N-H/DQ9038"},null,null,{"$f":"INDEX($B$4:$G$103,INT((ROWS(I$4:I190)-1)/7)+1,MOD(ROWS(I$4:I190)-1,7))","v":"N-H/DQ9038"}]
[null,null,null,null,null,null,null,null,null,{"$f":"INDEX($A$4:$A$103,INT((ROWS(I$4:I191)-1)/7)+1)&IF(MOD(ROWS(I$4:I191)-1,7),\" - \"&INDEX($B$4:$G$103,INT((ROWS(I$4:I191)-1)/7)+1,MOD(ROWS(I$4:I191)-1,7)),\"\")","v":"Konkstatis - L-N/DQ1973"},null,null,{"$f":"INDEX($B$4:$G$103,INT((ROWS(I$4:I191)-1)/7)+1,MOD(ROWS(I$4:I191)-1,7))","v":"L-N/DQ1973"}]
[null,null,null,null,null,null,null,null,null,{"$f":"INDEX($A$4:$A$103,INT((ROWS(I$4:I192)-1)/7)+1)&IF(MOD(ROWS(I$4:I192)-1,7),\" - \"&INDEX($B$4:$G$103,INT((ROWS(I$4:I192)-1)/7)+1,MOD(ROWS(I$4:I192)-1,7)),\"\")","v":"Konkstatis - G-T/DQ5579"},null,null,{"$f":"INDEX($B$4:$G$103,INT((ROWS(I$4:I192)-1)/7)+1,MOD(ROWS(I$4:I192)-1,7))","v":"G-T/DQ5579"}]
[null,null,null,null,null,null,null,null,null,{"$f":"INDEX($A$4:$A$103,INT((ROWS(I$4:I193)-1)/7)+1)&IF(MOD(ROWS(I$4:I193)-1,7),\" - \"&INDEX($B$4:$G$103,INT((ROWS(I$4:I193)-1)/7)+1,MOD(ROWS(I$4:I193)-1,7)),\"\")","v":"Touchtone"},null,null,{"$f":"INDEX($B$4:$G$103,INT((ROWS(I$4:I193)-1)/7)+1,MOD(ROWS(I$4:I193)-1,7))","v":{"$error":"#VALUE!"}}]
[null,null,null,null,null,null,null,null,null,{"$f":"INDEX($A$4:$A$103,INT((ROWS(I$4:I194)-1)/7)+1)&IF(MOD(ROWS(I$4:I194)-1,7),\" - \"&INDEX($B$4:$G$103,INT((ROWS(I$4:I194)-1)/7)+1,MOD(ROWS(I$4:I194)-1,7)),\"\")","v":"Touchtone - D-O/DQ4093"},null,null,{"$f":"INDEX($B$4:$G$103,INT((ROWS(I$4:I194)-1)/7)+1,MOD(ROWS(I$4:I194)-1,7))","v":"D-O/DQ4093"}]
[null,null,null,null,null,null,null,null,null,{"$f":"INDEX($A$4:$A$103,INT((ROWS(I$4:I195)-1)/7)+1)&IF(MOD(ROWS(I$4:I195)-1,7),\" - \"&INDEX($B$4:$G$103,INT((ROWS(I$4:I195)-1)/7)+1,MOD(ROWS(I$4:I195)-1,7)),\"\")","v":"Touchtone - D-C/DQ1506"},null,null,{"$f":"INDEX($B$4:$G$103,INT((ROWS(I$4:I195)-1)/7)+1,MOD(ROWS(I$4:I195)-1,7))","v":"D-C/DQ1506"}]
[null,null,null,null,null,null,null,null,null,{"$f":"INDEX($A$4:$A$103,INT((ROWS(I$4:I196)-1)/7)+1)&IF(MOD(ROWS(I$4:I196)-1,7),\" - \"&INDEX($B$4:$G$103,INT((ROWS(I$4:I196)-1)/7)+1,MOD(ROWS(I$4:I196)-1,7)),\"\")","v":"Touchtone - X-V/DQ3046"},null,null,{"$f":"INDEX($B$4:$G$103,INT((ROWS(I$4:I196)-1)/7)+1,MOD(ROWS(I$4:I196)-1,7))","v":"X-V/DQ3046"}]
[null,null,null,null,null,null,null,null,null,{"$f":"INDEX($A$4:$A$103,INT((ROWS(I$4:I197)-1)/7)+1)&IF(MOD(ROWS(I$4:I197)-1,7),\" - \"&INDEX($B$4:$G$103,INT((ROWS(I$4:I197)-1)/7)+1,MOD(ROWS(I$4:I197)-1,7)),\"\")","v":"Touchtone - Z-T/DQ8406"},null,null,{"$f":"INDEX($B$4:$G$103,INT((ROWS(I$4:I197)-1)/7)+1,MOD(ROWS(I$4:I197)-1,7))","v":"Z-T/DQ8406"}]
[null,null,null,null,null,null,null,null,null,{"$f":"INDEX($A$4:$A$103,INT((ROWS(I$4:I198)-1)/7)+1)&IF(MOD(ROWS(I$4:I198)-1,7),\" - \"&INDEX($B$4:$G$103,INT((ROWS(I$4:I198)-1)/7)+1,MOD(ROWS(I$4:I198)-1,7)),\"\")","v":"Touchtone - R-G/DQ2487"},null,null,{"$f":"INDEX($B$4:$G$103,INT((ROWS(I$4:I198)-1)/7)+1,MOD(ROWS(I$4:I198)-1,7))","v":"R-G/DQ2487"}]
[null,null,null,null,null,null,null,null,null,{"$f":"INDEX($A$4:$A$103,INT((ROWS(I$4:I199)-1)/7)+1)&IF(MOD(ROWS(I$4:I199)-1,7),\" - \"&INDEX($B$4:$G$103,INT((ROWS(I$4:I199)-1)/7)+1,MOD(ROWS(I$4:I199)-1,7)),\"\")","v":"Touchtone - O-G/DQ9131"},null,null,{"$f":"INDEX($B$4:$G$103,INT((ROWS(I$4:I199)-1)/7)+1,MOD(ROWS(I$4:I199)-1,7))","v":"O-G/DQ9131"}]
[null,null,null,null,null,null,null,null,null,{"$f":"INDEX($A$4:$A$103,INT((ROWS(I$4:I200)-1)/7)+1)&IF(MOD(ROWS(I$4:I200)-1,7),\" - \"&INDEX($B$4:$G$103,INT((ROWS(I$4:I200)-1)/7)+1,MOD(ROWS(I$4:I200)-1,7)),\"\")","v":"Ecotone"},null,null,{"$f":"INDEX($B$4:$G$103,INT((ROWS(I$4:I200)-1)/7)+1,MOD(ROWS(I$4:I200)-1,7))","v":{"$error":"#VALUE!"}}]
[null,null,null,null,null,null,null,null,null,{"$f":"INDEX($A$4:$A$103,INT((ROWS(I$4:I201)-1)/7)+1)&IF(MOD(ROWS(I$4:I201)-1,7),\" - \"&INDEX($B$4:$G$103,INT((ROWS(I$4:I201)-1)/7)+1,MOD(ROWS(I$4:I201)-1,7)),\"\")","v":"Ecotone - L-M/DQ2346"},null,null,{"$f":"INDEX($B$4:$G$103,INT((ROWS(I$4:I201)-1)/7)+1,MOD(ROWS(I$4:I201)-1,7))","v":"L-M/DQ2346"}]
[null,null,null,null,null,null,null,null,null,{"$f":"INDEX($A$4:$A$103,INT((ROWS(I$4:I202)-1)/7)+1)&IF(MOD(ROWS(I$4:I202)-1,7),\" - \"&INDEX($B$4:$G$103,INT((ROWS(I$4:I202)-1)/7)+1,MOD(ROWS(I$4:I202)-1,7)),\"\")","v":"Ecotone - W-H/DQ7772"},null,null,{"$f":"INDEX($B$4:$G$103,INT((ROWS(I$4:I202)-1)/7)+1,MOD(ROWS(I$4:I202)-1,7))","v":"W-H/DQ7772"}]
[null,null,null,null,null,null,null,null,null,{"$f":"INDEX($A$4:$A$103,INT((ROWS(I$4:I203)-1)/7)+1)&IF(MOD(ROWS(I$4:I203)-1,7),\" - \"&INDEX($B$4:$G$103,INT((ROWS(I$4:I203)-1)/7)+1,MOD(ROWS(I$4:I203)-1,7)),\"\")","v":"Ecotone - H-O/DQ8735"},null,null,{"$f":"INDEX($B$4:$G$103,INT((ROWS(I$4:I203)-1)/7)+1,MOD(ROWS(I$4:I203)-1,7))","v":"H-O/DQ8735"}]
[null,null,null,null,null,null,null,null,null,{"$f":"INDEX($A$4:$A$103,INT((ROWS(I$4:I204)-1)/7)+1)&IF(MOD(ROWS(I$4:I204)-1,7),\" - \"&INDEX($B$4:$G$103,INT((ROWS(I$4:I204)-1)/7)+1,MOD(ROWS(I$4:I204)-1,7)),\"\")","v":"Ecotone - Y-R/DQ3598"},null,null,{"$f":"INDEX($B$4:$G$103,INT((ROWS(I$4:I204)-1)/7)+1,MOD(ROWS(I$4:I204)-1,7))","v":"Y-R/DQ3598"}]
[null,null,null,null,null,null,null,null,null,{"$f":"INDEX($A$4:$A$103,INT((ROWS(I$4:I205)-1)/7)+1)&IF(MOD(ROWS(I$4:I205)-1,7),\" - \"&INDEX($B$4:$G$103,INT((ROWS(I$4:I205)-1)/7)+1,MOD(ROWS(I$4:I205)-1,7)),\"\")","v":"Ecotone - E-Y/DQ1323"},null,null,{"$f":"INDEX($B$4:$G$103,INT((ROWS(I$4:I205)-1)/7)+1,MOD(ROWS(I$4:I205)-1,7))","v":"E-Y/DQ1323"}]
[null,null,null,null,null,null,null,null,null,{"$f":"INDEX($A$4:$A$103,INT((ROWS(I$4:I206)-1)/7)+1)&IF(MOD(ROWS(I$4:I206)-1,7),\" - \"&INDEX($B$4:$G$103,INT((ROWS(I$4:I206)-1)/7)+1,MOD(ROWS(I$4:I206)-1,7)),\"\")","v":"Ecotone - C-Q/DQ1220"},null,null,{"$f":"INDEX($B$4:$G$103,INT((ROWS(I$4:I206)-1)/7)+1,MOD(ROWS(I$4:I206)-1,7))","v":"C-Q/DQ1220"}]
[null,null,null,null,null,null,null,null,null,{"$f":"INDEX($A$4:$A$103,INT((ROWS(I$4:I207)-1)/7)+1)&IF(MOD(ROWS(I$4:I207)-1,7),\" - \"&INDEX($B$4:$G$103,INT((ROWS(I$4:I207)-1)/7)+1,MOD(ROWS(I$4:I207)-1,7)),\"\")","v":"Sublax"},null,null,{"$f":"INDEX($B$4:$G$103,INT((ROWS(I$4:I207)-1)/7)+1,MOD(ROWS(I$4:I207)-1,7))","v":{"$error":"#VALUE!"}}]
[null,null,null,null,null,null,null,null,null,{"$f":"INDEX($A$4:$A$103,INT((ROWS(I$4:I208)-1)/7)+1)&IF(MOD(ROWS(I$4:I208)-1,7),\" - \"&INDEX($B$4:$G$103,INT((ROWS(I$4:I208)-1)/7)+1,MOD(ROWS(I$4:I208)-1,7)),\"\")","v":"Sublax - K-Z/DQ1958"},null,null,{"$f":"INDEX($B$4:$G$103,INT((ROWS(I$4:I208)-1)/7)+1,MOD(ROWS(I$4:I208)-1,7))","v":"K-Z/DQ1958"}]
[null,null,null,null,null,null,null,null,null,{"$f":"INDEX($A$4:$A$103,INT((ROWS(I$4:I209)-1)/7)+1)&IF(MOD(ROWS(I$4:I209)-1,7),\" - \"&INDEX($B$4:$G$103,INT((ROWS(I$4:I209)-1)/7)+1,MOD(ROWS(I$4:I209)-1,7)),\"\")","v":"Sublax - E-T/DQ1182"},null,null,{"$f":"INDEX($B$4:$G$103,INT((ROWS(I$4:I209)-1)/7)+1,MOD(ROWS(I$4:I209)-1,7))","v":"E-T/DQ1182"}]
[null,null,null,null,null,null,null,null,null,{"$f":"INDEX($A$4:$A$103,INT((ROWS(I$4:I210)-1)/7)+1)&IF(MOD(ROWS(I$4:I210)-1,7),\" - \"&INDEX($B$4:$G$103,INT((ROWS(I$4:I210)-1)/7)+1,MOD(ROWS(I$4:I210)-1,7)),\"\")","v":"Sublax - D-V/DQ2263"},null,null,{"$f":"INDEX($B$4:$G$103,INT((ROWS(I$4:I210)-1)/7)+1,MOD(ROWS(I$4:I210)-1,7))","v":"D-V/DQ2263"}]
[null,null,null,null,null,null,null,null,null,{"$f":"INDEX($A$4:$A$103,INT((ROWS(I$4:I211)-1)/7)+1)&IF(MOD(ROWS(I$4:I211)-1,7),\" - \"&INDEX($B$4:$G$103,INT((ROWS(I$4:I211)-1)/7)+1,MOD(ROWS(I$4:I211)-1,7)),\"\")","v":"Sublax - F-Q/DQ1782"},null,null,{"$f":"INDEX($B$4:$G$103,INT((ROWS(I$4:I211)-1)/7)+1,MOD(ROWS(I$4:I211)-1,7))","v":"F-Q/DQ1782"}]
[null,null,null,null,null,null,null,null,null,{"$f":"INDEX($A$4:$A$103,INT((ROWS(I$4:I212)-1)/7)+1)&IF(MOD(ROWS(I$4:I212)-1,7),\" - \"&INDEX($B$4:$G$103,INT((ROWS(I$4:I212)-1)/7)+1,MOD(ROWS(I$4:I212)-1,7)),\"\")","v":"Sublax - F-W/DQ1945"},null,null,{"$f":"INDEX($B$4:$G$103,INT((ROWS(I$4:I212)-1)/7)+1,MOD(ROWS(I$4:I212)-1,7))","v":"F-W/DQ1945"}]
[null,null,null,null,null,null,null,null,null,{"$f":"INDEX($A$4:$A$103,INT((ROWS(I$4:I213)-1)/7)+1)&IF(MOD(ROWS(I$4:I213)-1,7),\" - \"&INDEX($B$4:$G$103,INT((ROWS(I$4:I213)-1)/7)+1,MOD(ROWS(I$4:I213)-1,7)),\"\")","v":"Sublax - F-J/DQ1793"},null,null,{"$f":"INDEX($B$4:$G$103,INT((ROWS(I$4:I213)-1)/7)+1,MOD(ROWS(I$4:I213)-1,7))","v":"F-J/DQ1793"}]
[null,null,null,null,null,null,null,null,null,{"$f":"INDEX($A$4:$A$103,INT((ROWS(I$4:I214)-1)/7)+1)&IF(MOD(ROWS(I$4:I214)-1,7),\" - \"&INDEX($B$4:$G$103,INT((ROWS(I$4:I214)-1)/7)+1,MOD(ROWS(I$4:I214)-1,7)),\"\")","v":"Donlab"},null,null,{"$f":"INDEX($B$4:$G$103,INT((ROWS(I$4:I214)-1)/7)+1,MOD(ROWS(I$4:I214)-1,7))","v":{"$error":"#VALUE!"}}]
[null,null,null,null,null,null,null,null,null,{"$f":"INDEX($A$4:$A$103,INT((ROWS(I$4:I215)-1)/7)+1)&IF(MOD(ROWS(I$4:I215)-1,7),\" - \"&INDEX($B$4:$G$103,INT((ROWS(I$4:I215)-1)/7)+1,MOD(ROWS(I$4:I215)-1,7)),\"\")","v":"Donlab - M-U/DQ5037"},null,null,{"$f":"INDEX($B$4:$G$103,INT((ROWS(I$4:I215)-1)/7)+1,MOD(ROWS(I$4:I215)-1,7))","v":"M-U/DQ5037"}]
[null,null,null,null,null,null,null,null,null,{"$f":"INDEX($A$4:$A$103,INT((ROWS(I$4:I216)-1)/7)+1)&IF(MOD(ROWS(I$4:I216)-1,7),\" - \"&INDEX($B$4:$G$103,INT((ROWS(I$4:I216)-1)/7)+1,MOD(ROWS(I$4:I216)-1,7)),\"\")","v":"Donlab - E-B/DQ7006"},null,null,{"$f":"INDEX($B$4:$G$103,INT((ROWS(I$4:I216)-1)/7)+1,MOD(ROWS(I$4:I216)-1,7))","v":"E-B/DQ7006"}]
[null,null,null,null,null,null,null,null,null,{"$f":"INDEX($A$4:$A$103,INT((ROWS(I$4:I217)-1)/7)+1)&IF(MOD(ROWS(I$4:I217)-1,7),\" - \"&INDEX($B$4:$G$103,INT((ROWS(I$4:I217)-1)/7)+1,MOD(ROWS(I$4:I217)-1,7)),\"\")","v":"Donlab - R-Q/DQ3540"},null,null,{"$f":"INDEX($B$4:$G$103,INT((ROWS(I$4:I217)-1)/7)+1,MOD(ROWS(I$4:I217)-1,7))","v":"R-Q/DQ3540"}]
[null,null,null,null,null,null,null,null,null,{"$f":"INDEX($A$4:$A$103,INT((ROWS(I$4:I218)-1)/7)+1)&IF(MOD(ROWS(I$4:I218)-1,7),\" - \"&INDEX($B$4:$G$103,INT((ROWS(I$4:I218)-1)/7)+1,MOD(ROWS(I$4:I218)-1,7)),\"\")","v":"Donlab - I-I/DQ2681"},null,null,{"$f":"INDEX($B$4:$G$103,INT((ROWS(I$4:I218)-1)/7)+1,MOD(ROWS(I$4:I218)-1,7))","v":"I-I/DQ2681"}]
[null,null,null,null,null,null,null,null,null,{"$f":"INDEX($A$4:$A$103,INT((ROWS(I$4:I219)-1)/7)+1)&IF(MOD(ROWS(I$4:I219)-1,7),\" - \"&INDEX($B$4:$G$103,INT((ROWS(I$4:I219)-1)/7)+1,MOD(ROWS(I$4:I219)-1,7)),\"\")","v":"Donlab - G-U/DQ4067"},null,null,{"$f":"INDEX($B$4:$G$103,INT((ROWS(I$4:I219)-1)/7)+1,MOD(ROWS(I$4:I219)-1,7))","v":"G-U/DQ4067"}]
[null,null,null,null,null,null,null,null,null,{"$f":"INDEX($A$4:$A$103,INT((ROWS(I$4:I220)-1)/7)+1)&IF(MOD(ROWS(I$4:I220)-1,7),\" - \"&INDEX($B$4:$G$103,INT((ROWS(I$4:I220)-1)/7)+1,MOD(ROWS(I$4:I220)-1,7)),\"\")","v":"Donlab - N-R/DQ9996"},null,null,{"$f":"INDEX($B$4:$G$103,INT((ROWS(I$4:I220)-1)/7)+1,MOD(ROWS(I$4:I220)-1,7))","v":"N-R/DQ9996"}]
[null,null,null,null,null,null,null,null,null,{"$f":"INDEX($A$4:$A$103,INT((ROWS(I$4:I221)-1)/7)+1)&IF(MOD(ROWS(I$4:I221)-1,7),\" - \"&INDEX($B$4:$G$103,INT((ROWS(I$4:I221)-1)/7)+1,MOD(ROWS(I$4:I221)-1,7)),\"\")","v":"Freetaming"},null,null,{"$f":"INDEX($B$4:$G$103,INT((ROWS(I$4:I221)-1)/7)+1,MOD(ROWS(I$4:I221)-1,7))","v":{"$error":"#VALUE!"}}]
[null,null,null,null,null,null,null,null,null,{"$f":"INDEX($A$4:$A$103,INT((ROWS(I$4:I222)-1)/7)+1)&IF(MOD(ROWS(I$4:I222)-1,7),\" - \"&INDEX($B$4:$G$103,INT((ROWS(I$4:I222)-1)/7)+1,MOD(ROWS(I$4:I222)-1,7)),\"\")","v":"Freetaming - P-U/DQ7673"},null,null,{"$f":"INDEX($B$4:$G$103,INT((ROWS(I$4:I222)-1)/7)+1,MOD(ROWS(I$4:I222)-1,7))","v":"P-U/DQ7673"}]
[null,null,null,null,null,null,null,null,null,{"$f":"INDEX($A$4:$A$103,INT((ROWS(I$4:I223)-1)/7)+1)&IF(MOD(ROWS(I$4:I223)-1,7),\" - \"&INDEX($B$4:$G$103,INT((ROWS(I$4:I223)-1)/7)+1,MOD(ROWS(I$4:I223)-1,7)),\"\")","v":"Freetaming - D-V/DQ8854"},null,null,{"$f":"INDEX($B$4:$G$103,INT((ROWS(I$4:I223)-1)/7)+1,MOD(ROWS(I$4:I223)-1,7))","v":"D-V/DQ8854"}]
[null,null,null,null,null,null,null,null,null,{"$f":"INDEX($A$4:$A$103,INT((ROWS(I$4:I224)-1)/7)+1)&IF(MOD(ROWS(I$4:I224)-1,7),\" - \"&INDEX($B$4:$G$103,INT((ROWS(I$4:I224)-1)/7)+1,MOD(ROWS(I$4:I224)-1,7)),\"\")","v":"Freetaming - K-H/DQ9072"},null,null,{"$f":"INDEX($B$4:$G$103,INT((ROWS(I$4:I224)-1)/7)+1,MOD(ROWS(I$4:I224)-1,7))","v":"K-H/DQ9072"}]
[null,null,null,null,null,null,null,null,null,{"$f":"INDEX($A$4:$A$103,INT((ROWS(I$4:I225)-1)/7)+1)&IF(MOD(ROWS(I$4:I225)-1,7),\" - \"&INDEX($B$4:$G$103,INT((ROWS(I$4:I225)-1)/7)+1,MOD(ROWS(I$4:I225)-1,7)),\"\")","v":"Freetaming - G-I/DQ6806"},null,null,{"$f":"INDEX($B$4:$G$103,INT((ROWS(I$4:I225)-1)/7)+1,MOD(ROWS(I$4:I225)-1,7))","v":"G-I/DQ6806"}]
[null,null,null,null,null,null,null,null,null,{"$f":"INDEX($A$4:$A$103,INT((ROWS(I$4:I226)-1)/7)+1)&IF(MOD(ROWS(I$4:I226)-1,7),\" - \"&INDEX($B$4:$G$103,INT((ROWS(I$4:I226)-1)/7)+1,MOD(ROWS(I$4:I226)-1,7)),\"\")","v":"Freetaming - M-M/DQ3184"},null,null,{"$f":"INDEX($B$4:$G$103,INT((ROWS(I$4:I226)-1)/7)+1,MOD(ROWS(I$4:I226)-1,7))","v":"M-M/DQ3184"}]
[null,null,null,null,null,null,null,null,null,{"$f":"INDEX($A$4:$A$103,INT((ROWS(I$4:I227)-1)/7)+1)&IF(MOD(ROWS(I$4:I227)-1,7),\" - \"&INDEX($B$4:$G$103,INT((ROWS(I$4:I227)-1)/7)+1,MOD(ROWS(I$4:I227)-1,7)),\"\")","v":"Freetaming - B-V/DQ1806"},null,null,{"$f":"INDEX($B$4:$G$103,INT((ROWS(I$4:I227)-1)/7)+1,MOD(ROWS(I$4:I227)-1,7))","v":"B-V/DQ1806"}]
[null,null,null,null,null,null,null,null,null,{"$f":"INDEX($A$4:$A$103,INT((ROWS(I$4:I228)-1)/7)+1)&IF(MOD(ROWS(I$4:I228)-1,7),\" - \"&INDEX($B$4:$G$103,INT((ROWS(I$4:I228)-1)/7)+1,MOD(ROWS(I$4:I228)-1,7)),\"\")","v":"Volt Tanstock"},null,null,{"$f":"INDEX($B$4:$G$103,INT((ROWS(I$4:I228)-1)/7)+1,MOD(ROWS(I$4:I228)-1,7))","v":{"$error":"#VALUE!"}}]
[null,null,null,null,null,null,null,null,null,{"$f":"INDEX($A$4:$A$103,INT((ROWS(I$4:I229)-1)/7)+1)&IF(MOD(ROWS(I$4:I229)-1,7),\" - \"&INDEX($B$4:$G$103,INT((ROWS(I$4:I229)-1)/7)+1,MOD(ROWS(I$4:I229)-1,7)),\"\")","v":"Volt Tanstock - E-V/DQ1711"},null,null,{"$f":"INDEX($B$4:$G$103,INT((ROWS(I$4:I229)-1)/7)+1,MOD(ROWS(I$4:I229)-1,7))","v":"E-V/DQ1711"}]
[null,null,null,null,null,null,null,null,null,{"$f":"INDEX($A$4:$A$103,INT((ROWS(I$4:I230)-1)/7)+1)&IF(MOD(ROWS(I$4:I230)-1,7),\" - \"&INDEX($B$4:$G$103,INT((ROWS(I$4:I230)-1)/7)+1,MOD(ROWS(I$4:I230)-1,7)),\"\")","v":"Volt Tanstock - D-D/DQ3113"},null,null,{"$f":"INDEX($B$4:$G$103,INT((ROWS(I$4:I230)-1)/7)+1,MOD(ROWS(I$4:I230)-1,7))","v":"D-D/DQ3113"}]
[null,null,null,null,null,null,null,null,null,{"$f":"INDEX($A$4:$A$103,INT((ROWS(I$4:I231)-1)/7)+1)&IF(MOD(ROWS(I$4:I231)-1,7),\" - \"&INDEX($B$4:$G$103,INT((ROWS(I$4:I231)-1)/7)+1,MOD(ROWS(I$4:I231)-1,7)),\"\")","v":"Volt Tanstock - U-H/DQ3939"},null,null,{"$f":"INDEX($B$4:$G$103,INT((ROWS(I$4:I231)-1)/7)+1,MOD(ROWS(I$4:I231)-1,7))","v":"U-H/DQ3939"}]
[null,null,null,null,null,null,null,null,null,{"$f":"INDEX($A$4:$A$103,INT((ROWS(I$4:I232)-1)/7)+1)&IF(MOD(ROWS(I$4:I232)-1,7),\" - \"&INDEX($B$4:$G$103,INT((ROWS(I$4:I232)-1)/7)+1,MOD(ROWS(I$4:I232)-1,7)),\"\")","v":"Volt Tanstock - V-W/DQ2342"},null,null,{"$f":"INDEX($B$4:$G$103,INT((ROWS(I$4:I232)-1)/7)+1,MOD(ROWS(I$4:I232)-1,7))","v":"V-W/DQ2342"}]
[null,null,null,null,null,null,null,null,null,{"$f":"INDEX($A$4:$A$103,INT((ROWS(I$4:I233)-1)/7)+1)&IF(MOD(ROWS(I$4:I233)-1,7),\" - \"&INDEX($B$4:$G$103,INT((ROWS(I$4:I233)-1)/7)+1,MOD(ROWS(I$4:I233)-1,7)),\"\")","v":"Volt Tanstock - B-C/DQ4270"},null,null,{"$f":"INDEX($B$4:$G$103,INT((ROWS(I$4:I233)-1)/7)+1,MOD(ROWS(I$4:I233)-1,7))","v":"B-C/DQ4270"}]
[null,null,null,null,null,null,null,null,null,{"$f":"INDEX($A$4:$A$103,INT((ROWS(I$4:I234)-1)/7)+1)&IF(MOD(ROWS(I$4:I234)-1,7),\" - \"&INDEX($B$4:$G$103,INT((ROWS(I$4:I234)-1)/7)+1,MOD(ROWS(I$4:I234)-1,7)),\"\")","v":"Volt Tanstock - J-N/DQ2005"},null,null,{"$f":"INDEX($B$4:$G$103,INT((ROWS(I$4:I234)-1)/7)+1,MOD(ROWS(I$4:I234)-1,7))","v":"J-N/DQ2005"}]
[null,null,null,null,null,null,null,null,null,{"$f":"INDEX($A$4:$A$103,INT((ROWS(I$4:I235)-1)/7)+1)&IF(MOD(ROWS(I$4:I235)-1,7),\" - \"&INDEX($B$4:$G$103,INT((ROWS(I$4:I235)-1)/7)+1,MOD(ROWS(I$4:I235)-1,7)),\"\")","v":"Single Zimfax"},null,null,{"$f":"INDEX($B$4:$G$103,INT((ROWS(I$4:I235)-1)/7)+1,MOD(ROWS(I$4:I235)-1,7))","v":{"$error":"#VALUE!"}}]
[null,null,null,null,null,null,null,null,null,{"$f":"INDEX($A$4:$A$103,INT((ROWS(I$4:I236)-1)/7)+1)&IF(MOD(ROWS(I$4:I236)-1,7),\" - \"&INDEX($B$4:$G$103,INT((ROWS(I$4:I236)-1)/7)+1,MOD(ROWS(I$4:I236)-1,7)),\"\")","v":"Single Zimfax - Q-K/DQ8122"},null,null,{"$f":"INDEX($B$4:$G$103,INT((ROWS(I$4:I236)-1)/7)+1,MOD(ROWS(I$4:I236)-1,7))","v":"Q-K/DQ8122"}]
[null,null,null,null,null,null,null,null,null,{"$f":"INDEX($A$4:$A$103,INT((ROWS(I$4:I237)-1)/7)+1)&IF(MOD(ROWS(I$4:I237)-1,7),\" - \"&INDEX($B$4:$G$103,INT((ROWS(I$4:I237)-1)/7)+1,MOD(ROWS(I$4:I237)-1,7)),\"\")","v":"Single Zimfax - X-H/DQ4021"},null,null,{"$f":"INDEX($B$4:$G$103,INT((ROWS(I$4:I237)-1)/7)+1,MOD(ROWS(I$4:I237)-1,7))","v":"X-H/DQ4021"}]
[null,null,null,null,null,null,null,null,null,{"$f":"INDEX($A$4:$A$103,INT((ROWS(I$4:I238)-1)/7)+1)&IF(MOD(ROWS(I$4:I238)-1,7),\" - \"&INDEX($B$4:$G$103,INT((ROWS(I$4:I238)-1)/7)+1,MOD(ROWS(I$4:I238)-1,7)),\"\")","v":"Single Zimfax - F-K/DQ3308"},null,null,{"$f":"INDEX($B$4:$G$103,INT((ROWS(I$4:I238)-1)/7)+1,MOD(ROWS(I$4:I238)-1,7))","v":"F-K/DQ3308"}]
[null,null,null,null,null,null,null,null,null,{"$f":"INDEX($A$4:$A$103,INT((ROWS(I$4:I239)-1)/7)+1)&IF(MOD(ROWS(I$4:I239)-1,7),\" - \"&INDEX($B$4:$G$103,INT((ROWS(I$4:I239)-1)/7)+1,MOD(ROWS(I$4:I239)-1,7)),\"\")","v":"Single Zimfax - H-O/DQ8072"},null,null,{"$f":"INDEX($B$4:$G$103,INT((ROWS(I$4:I239)-1)/7)+1,MOD(ROWS(I$4:I239)-1,7))","v":"H-O/DQ8072"}]
[null,null,null,null,null,null,null,null,null,{"$f":"INDEX($A$4:$A$103,INT((ROWS(I$4:I240)-1)/7)+1)&IF(MOD(ROWS(I$4:I240)-1,7),\" - \"&INDEX($B$4:$G$103,INT((ROWS(I$4:I240)-1)/7)+1,MOD(ROWS(I$4:I240)-1,7)),\"\")","v":"Single Zimfax - D-Z/DQ6642"},null,null,{"$f":"INDEX($B$4:$G$103,INT((ROWS(I$4:I240)-1)/7)+1,MOD(ROWS(I$4:I240)-1,7))","v":"D-Z/DQ6642"}]
[null,null,null,null,null,null,null,null,null,{"$f":"INDEX($A$4:$A$103,INT((ROWS(I$4:I241)-1)/7)+1)&IF(MOD(ROWS(I$4:I241)-1,7),\" - \"&INDEX($B$4:$G$103,INT((ROWS(I$4:I241)-1)/7)+1,MOD(ROWS(I$4:I241)-1,7)),\"\")","v":"Single Zimfax - P-Q/DQ7285"},null,null,{"$f":"INDEX($B$4:$G$103,INT((ROWS(I$4:I241)-1)/7)+1,MOD(ROWS(I$4:I241)-1,7))","v":"P-Q/DQ7285"}]
[null,null,null,null,null,null,null,null,null,{"$f":"INDEX($A$4:$A$103,INT((ROWS(I$4:I242)-1)/7)+1)&IF(MOD(ROWS(I$4:I242)-1,7),\" - \"&INDEX($B$4:$G$103,INT((ROWS(I$4:I242)-1)/7)+1,MOD(ROWS(I$4:I242)-1,7)),\"\")","v":"Nameco"},null,null,{"$f":"INDEX($B$4:$G$103,INT((ROWS(I$4:I242)-1)/7)+1,MOD(ROWS(I$4:I242)-1,7))","v":{"$error":"#VALUE!"}}]
[null,null,null,null,null,null,null,null,null,{"$f":"INDEX($A$4:$A$103,INT((ROWS(I$4:I243)-1)/7)+1)&IF(MOD(ROWS(I$4:I243)-1,7),\" - \"&INDEX($B$4:$G$103,INT((ROWS(I$4:I243)-1)/7)+1,MOD(ROWS(I$4:I243)-1,7)),\"\")","v":"Nameco - A-E/DQ4006"},null,null,{"$f":"INDEX($B$4:$G$103,INT((ROWS(I$4:I243)-1)/7)+1,MOD(ROWS(I$4:I243)-1,7))","v":"A-E/DQ4006"}]
[null,null,null,null,null,null,null,null,null,{"$f":"INDEX($A$4:$A$103,INT((ROWS(I$4:I244)-1)/7)+1)&IF(MOD(ROWS(I$4:I244)-1,7),\" - \"&INDEX($B$4:$G$103,INT((ROWS(I$4:I244)-1)/7)+1,MOD(ROWS(I$4:I244)-1,7)),\"\")","v":"Nameco - M-L/DQ5420"},null,null,{"$f":"INDEX($B$4:$G$103,INT((ROWS(I$4:I244)-1)/7)+1,MOD(ROWS(I$4:I244)-1,7))","v":"M-L/DQ5420"}]
[null,null,null,null,null,null,null,null,null,{"$f":"INDEX($A$4:$A$103,INT((ROWS(I$4:I245)-1)/7)+1)&IF(MOD(ROWS(I$4:I245)-1,7),\" - \"&INDEX($B$4:$G$103,INT((ROWS(I$4:I245)-1)/7)+1,MOD(ROWS(I$4:I245)-1,7)),\"\")","v":"Nameco - A-I/DQ5311"},null,null,{"$f":"INDEX($B$4:$G$103,INT((ROWS(I$4:I245)-1)/7)+1,MOD(ROWS(I$4:I245)-1,7))","v":"A-I/DQ5311"}]
[null,null,null,null,null,null,null,null,null,{"$f":"INDEX($A$4:$A$103,INT((ROWS(I$4:I246)-1)/7)+1)&IF(MOD(ROWS(I$4:I246)-1,7),\" - \"&INDEX($B$4:$G$103,INT((ROWS(I$4:I246)-1)/7)+1,MOD(ROWS(I$4:I246)-1,7)),\"\")","v":"Nameco - G-N/DQ5865"},null,null,{"$f":"INDEX($B$4:$G$103,INT((ROWS(I$4:I246)-1)/7)+1,MOD(ROWS(I$4:I246)-1,7))","v":"G-N/DQ5865"}]
[null,null,null,null,null,null,null,null,null,{"$f":"INDEX($A$4:$A$103,INT((ROWS(I$4:I247)-1)/7)+1)&IF(MOD(ROWS(I$4:I247)-1,7),\" - \"&INDEX($B$4:$G$103,INT((ROWS(I$4:I247)-1)/7)+1,MOD(ROWS(I$4:I247)-1,7)),\"\")","v":"Nameco - O-O/DQ6738"},null,null,{"$f":"INDEX($B$4:$G$103,INT((ROWS(I$4:I247)-1)/7)+1,MOD(ROWS(I$4:I247)-1,7))","v":"O-O/DQ6738"}]
[null,null,null,null,null,null,null,null,null,{"$f":"INDEX($A$4:$A$103,INT((ROWS(I$4:I248)-1)/7)+1)&IF(MOD(ROWS(I$4:I248)-1,7),\" - \"&INDEX($B$4:$G$103,INT((ROWS(I$4:I248)-1)/7)+1,MOD(ROWS(I$4:I248)-1,7)),\"\")","v":"Nameco - I-O/DQ8975"},null,null,{"$f":"INDEX($B$4:$G$103,INT((ROWS(I$4:I248)-1)/7)+1,MOD(ROWS(I$4:I248)-1,7))","v":"I-O/DQ8975"}]
[null,null,null,null,null,null,null,null,null,{"$f":"INDEX($A$4:$A$103,INT((ROWS(I$4:I249)-1)/7)+1)&IF(MOD(ROWS(I$4:I249)-1,7),\" - \"&INDEX($B$4:$G$103,INT((ROWS(I$4:I249)-1)/7)+1,MOD(ROWS(I$4:I249)-1,7)),\"\")","v":"Canhotin"},null,null,{"$f":"INDEX($B$4:$G$103,INT((ROWS(I$4:I249)-1)/7)+1,MOD(ROWS(I$4:I249)-1,7))","v":{"$error":"#VALUE!"}}]
[null,null,null,null,null,null,null,null,null,{"$f":"INDEX($A$4:$A$103,INT((ROWS(I$4:I250)-1)/7)+1)&IF(MOD(ROWS(I$4:I250)-1,7),\" - \"&INDEX($B$4:$G$103,INT((ROWS(I$4:I250)-1)/7)+1,MOD(ROWS(I$4:I250)-1,7)),\"\")","v":"Canhotin - X-C/DQ7536"},null,null,{"$f":"INDEX($B$4:$G$103,INT((ROWS(I$4:I250)-1)/7)+1,MOD(ROWS(I$4:I250)-1,7))","v":"X-C/DQ7536"}]
[null,null,null,null,null,null,null,null,null,{"$f":"INDEX($A$4:$A$103,INT((ROWS(I$4:I251)-1)/7)+1)&IF(MOD(ROWS(I$4:I251)-1,7),\" - \"&INDEX($B$4:$G$103,INT((ROWS(I$4:I251)-1)/7)+1,MOD(ROWS(I$4:I251)-1,7)),\"\")","v":"Canhotin - H-O/DQ5982"},null,null,{"$f":"INDEX($B$4:$G$103,INT((ROWS(I$4:I251)-1)/7)+1,MOD(ROWS(I$4:I251)-1,7))","v":"H-O/DQ5982"}]
[null,null,null,null,null,null,null,null,null,{"$f":"INDEX($A$4:$A$103,INT((ROWS(I$4:I252)-1)/7)+1)&IF(MOD(ROWS(I$4:I252)-1,7),\" - \"&INDEX($B$4:$G$103,INT((ROWS(I$4:I252)-1)/7)+1,MOD(ROWS(I$4:I252)-1,7)),\"\")","v":"Canhotin - U-U/DQ6424"},null,null,{"$f":"INDEX($B$4:$G$103,INT((ROWS(I$4:I252)-1)/7)+1,MOD(ROWS(I$4:I252)-1,7))","v":"U-U/DQ6424"}]
[null,null,null,null,null,null,null,null,null,{"$f":"INDEX($A$4:$A$103,INT((ROWS(I$4:I253)-1)/7)+1)&IF(MOD(ROWS(I$4:I253)-1,7),\" - \"&INDEX($B$4:$G$103,INT((ROWS(I$4:I253)-1)/7)+1,MOD(ROWS(I$4:I253)-1,7)),\"\")","v":"Canhotin - C-S/DQ9155"},null,null,{"$f":"INDEX($B$4:$G$103,INT((ROWS(I$4:I253)-1)/7)+1,MOD(ROWS(I$4:I253)-1,7))","v":"C-S/DQ9155"}]
[null,null,null,null,null,null,null,null,null,{"$f":"INDEX($A$4:$A$103,INT((ROWS(I$4:I254)-1)/7)+1)&IF(MOD(ROWS(I$4:I254)-1,7),\" - \"&INDEX($B$4:$G$103,INT((ROWS(I$4:I254)-1)/7)+1,MOD(ROWS(I$4:I254)-1,7)),\"\")","v":"Canhotin - O-K/DQ2805"},null,null,{"$f":"INDEX($B$4:$G$103,INT((ROWS(I$4:I254)-1)/7)+1,MOD(ROWS(I$4:I254)-1,7))","v":"O-K/DQ2805"}]
[null,null,null,null,null,null,null,null,null,{"$f":"INDEX($A$4:$A$103,INT((ROWS(I$4:I255)-1)/7)+1)&IF(MOD(ROWS(I$4:I255)-1,7),\" - \"&INDEX($B$4:$G$103,INT((ROWS(I$4:I255)-1)/7)+1,MOD(ROWS(I$4:I255)-1,7)),\"\")","v":"Canhotin - I-S/DQ2919"},null,null,{"$f":"INDEX($B$4:$G$103,INT((ROWS(I$4:I255)-1)/7)+1,MOD(ROWS(I$4:I255)-1,7))","v":"I-S/DQ2919"}]
[null,null,null,null,null,null,null,null,null,{"$f":"INDEX($A$4:$A$103,INT((ROWS(I$4:I256)-1)/7)+1)&IF(MOD(ROWS(I$4:I256)-1,7),\" - \"&INDEX($B$4:$G$103,INT((ROWS(I$4:I256)-1)/7)+1,MOD(ROWS(I$4:I256)-1,7)),\"\")","v":"Opedax"},null,null,{"$f":"INDEX($B$4:$G$103,INT((ROWS(I$4:I256)-1)/7)+1,MOD(ROWS(I$4:I256)-1,7))","v":{"$error":"#VALUE!"}}]
[null,null,null,null,null,null,null,null,null,{"$f":"INDEX($A$4:$A$103,INT((ROWS(I$4:I257)-1)/7)+1)&IF(MOD(ROWS(I$4:I257)-1,7),\" - \"&INDEX($B$4:$G$103,INT((ROWS(I$4:I257)-1)/7)+1,MOD(ROWS(I$4:I257)-1,7)),\"\")","v":"Opedax - V-K/DQ5620"},null,null,{"$f":"INDEX($B$4:$G$103,INT((ROWS(I$4:I257)-1)/7)+1,MOD(ROWS(I$4:I257)-1,7))","v":"V-K/DQ5620"}]
[null,null,null,null,null,null,null,null,null,{"$f":"INDEX($A$4:$A$103,INT((ROWS(I$4:I258)-1)/7)+1)&IF(MOD(ROWS(I$4:I258)-1,7),\" - \"&INDEX($B$4:$G$103,INT((ROWS(I$4:I258)-1)/7)+1,MOD(ROWS(I$4:I258)-1,7)),\"\")","v":"Opedax - I-A/DQ6402"},null,null,{"$f":"INDEX($B$4:$G$103,INT((ROWS(I$4:I258)-1)/7)+1,MOD(ROWS(I$4:I258)-1,7))","v":"I-A/DQ6402"}]
[null,null,null,null,null,null,null,null,null,{"$f":"INDEX($A$4:$A$103,INT((ROWS(I$4:I259)-1)/7)+1)&IF(MOD(ROWS(I$4:I259)-1,7),\" - \"&INDEX($B$4:$G$103,INT((ROWS(I$4:I259)-1)/7)+1,MOD(ROWS(I$4:I259)-1,7)),\"\")","v":"Opedax - O-C/DQ1475"},null,null,{"$f":"INDEX($B$4:$G$103,INT((ROWS(I$4:I259)-1)/7)+1,MOD(ROWS(I$4:I259)-1,7))","v":"O-C/DQ1475"}]
[null,null,null,null,null,null,null,null,null,{"$f":"INDEX($A$4:$A$103,INT((ROWS(I$4:I260)-1)/7)+1)&IF(MOD(ROWS(I$4:I260)-1,7),\" - \"&INDEX($B$4:$G$103,INT((ROWS(I$4:I260)-1)/7)+1,MOD(ROWS(I$4:I260)-1,7)),\"\")","v":"Opedax - U-V/DQ5750"},null,null,{"$f":"INDEX($B$4:$G$103,INT((ROWS(I$4:I260)-1)/7)+1,MOD(ROWS(I$4:I260)-1,7))","v":"U-V/DQ5750"}]
[null,null,null,null,null,null,null,null,null,{"$f":"INDEX($A$4:$A$103,INT((ROWS(I$4:I261)-1)/7)+1)&IF(MOD(ROWS(I$4:I261)-1,7),\" - \"&INDEX($B$4:$G$103,INT((ROWS(I$4:I261)-1)/7)+1,MOD(ROWS(I$4:I261)-1,7)),\"\")","v":"Opedax - D-W/DQ9169"},null,null,{"$f":"INDEX($B$4:$G$103,INT((ROWS(I$4:I261)-1)/7)+1,MOD(ROWS(I$4:I261)-1,7))","v":"D-W/DQ9169"}]
[null,null,null,null,null,null,null,null,null,{"$f":"INDEX($A$4:$A$103,INT((ROWS(I$4:I262)-1)/7)+1)&IF(MOD(ROWS(I$4:I262)-1,7),\" - \"&INDEX($B$4:$G$103,INT((ROWS(I$4:I262)-1)/7)+1,MOD(ROWS(I$4:I262)-1,7)),\"\")","v":"Opedax - X-U/DQ4908"},null,null,{"$f":"INDEX($B$4:$G$103,INT((ROWS(I$4:I262)-1)/7)+1,MOD(ROWS(I$4:I262)-1,7))","v":"X-U/DQ4908"}]
[null,null,null,null,null,null,null,null,null,{"$f":"INDEX($A$4:$A$103,INT((ROWS(I$4:I263)-1)/7)+1)&IF(MOD(ROWS(I$4:I263)-1,7),\" - \"&INDEX($B$4:$G$103,INT((ROWS(I$4:I263)-1)/7)+1,MOD(ROWS(I$4:I263)-1,7)),\"\")","v":"Touchfresh"},null,null,{"$f":"INDEX($B$4:$G$103,INT((ROWS(I$4:I263)-1)/7)+1,MOD(ROWS(I$4:I263)-1,7))","v":{"$error":"#VALUE!"}}]
[null,null,null,null,null,null,null,null,null,{"$f":"INDEX($A$4:$A$103,INT((ROWS(I$4:I264)-1)/7)+1)&IF(MOD(ROWS(I$4:I264)-1,7),\" - \"&INDEX($B$4:$G$103,INT((ROWS(I$4:I264)-1)/7)+1,MOD(ROWS(I$4:I264)-1,7)),\"\")","v":"Touchfresh - H-C/DQ4665"},null,null,{"$f":"INDEX($B$4:$G$103,INT((ROWS(I$4:I264)-1)/7)+1,MOD(ROWS(I$4:I264)-1,7))","v":"H-C/DQ4665"}]
[null,null,null,null,null,null,null,null,null,{"$f":"INDEX($A$4:$A$103,INT((ROWS(I$4:I265)-1)/7)+1)&IF(MOD(ROWS(I$4:I265)-1,7),\" - \"&INDEX($B$4:$G$103,INT((ROWS(I$4:I265)-1)/7)+1,MOD(ROWS(I$4:I265)-1,7)),\"\")","v":"Touchfresh - C-D/DQ6489"},null,null,{"$f":"INDEX($B$4:$G$103,INT((ROWS(I$4:I265)-1)/7)+1,MOD(ROWS(I$4:I265)-1,7))","v":"C-D/DQ6489"}]
[null,null,null,null,null,null,null,null,null,{"$f":"INDEX($A$4:$A$103,INT((ROWS(I$4:I266)-1)/7)+1)&IF(MOD(ROWS(I$4:I266)-1,7),\" - \"&INDEX($B$4:$G$103,INT((ROWS(I$4:I266)-1)/7)+1,MOD(ROWS(I$4:I266)-1,7)),\"\")","v":"Touchfresh - R-H/DQ7954"},null,null,{"$f":"INDEX($B$4:$G$103,INT((ROWS(I$4:I266)-1)/7)+1,MOD(ROWS(I$4:I266)-1,7))","v":"R-H/DQ7954"}]
[null,null,null,null,null,null,null,null,null,{"$f":"INDEX($A$4:$A$103,INT((ROWS(I$4:I267)-1)/7)+1)&IF(MOD(ROWS(I$4:I267)-1,7),\" - \"&INDEX($B$4:$G$103,INT((ROWS(I$4:I267)-1)/7)+1,MOD(ROWS(I$4:I267)-1,7)),\"\")","v":"Touchfresh - D-D/DQ1228"},null,null,{"$f":"INDEX($B$4:$G$103,INT((ROWS(I$4:I267)-1)/7)+1,MOD(ROWS(I$4:I267)-1,7))","v":"D-D/DQ1228"}]
[null,null,null,null,null,null,null,null,null,{"$f":"INDEX($A$4:$A$103,INT((ROWS(I$4:I268)-1)/7)+1)&IF(MOD(ROWS(I$4:I268)-1,7),\" - \"&INDEX($B$4:$G$103,INT((ROWS(I$4:I268)-1)/7)+1,MOD(ROWS(I$4:I268)-1,7)),\"\")","v":"Touchfresh - X-K/DQ6699"},null,null,{"$f":"INDEX($B$4:$G$103,INT((ROWS(I$4:I268)-1)/7)+1,MOD(ROWS(I$4:I268)-1,7))","v":"X-K/DQ6699"}]
[null,null,null,null,null,null,null,null,null,{"$f":"INDEX($A$4:$A$103,INT((ROWS(I$4:I269)-1)/7)+1)&IF(MOD(ROWS(I$4:I269)-1,7),\" - \"&INDEX($B$4:$G$103,INT((ROWS(I$4:I269)-1)/7)+1,MOD(ROWS(I$4:I269)-1,7)),\"\")","v":"Touchfresh - D-V/DQ9848"},null,null,{"$f":"INDEX($B$4:$G$103,INT((ROWS(I$4:I269)-1)/7)+1,MOD(ROWS(I$4:I269)-1,7))","v":"D-V/DQ9848"}]
[null,null,null,null,null,null,null,null,null,{"$f":"INDEX($A$4:$A$103,INT((ROWS(I$4:I270)-1)/7)+1)&IF(MOD(ROWS(I$4:I270)-1,7),\" - \"&INDEX($B$4:$G$103,INT((ROWS(I$4:I270)-1)/7)+1,MOD(ROWS(I$4:I270)-1,7)),\"\")","v":"Inhold"},null,null,{"$f":"INDEX($B$4:$G$103,INT((ROWS(I$4:I270)-1)/7)+1,MOD(ROWS(I$4:I270)-1,7))","v":{"$error":"#VALUE!"}}]
[null,null,null,null,null,null,null,null,null,{"$f":"INDEX($A$4:$A$103,INT((ROWS(I$4:I271)-1)/7)+1)&IF(MOD(ROWS(I$4:I271)-1,7),\" - \"&INDEX($B$4:$G$103,INT((ROWS(I$4:I271)-1)/7)+1,MOD(ROWS(I$4:I271)-1,7)),\"\")","v":"Inhold - V-U/DQ3537"},null,null,{"$f":"INDEX($B$4:$G$103,INT((ROWS(I$4:I271)-1)/7)+1,MOD(ROWS(I$4:I271)-1,7))","v":"V-U/DQ3537"}]
[null,null,null,null,null,null,null,null,null,{"$f":"INDEX($A$4:$A$103,INT((ROWS(I$4:I272)-1)/7)+1)&IF(MOD(ROWS(I$4:I272)-1,7),\" - \"&INDEX($B$4:$G$103,INT((ROWS(I$4:I272)-1)/7)+1,MOD(ROWS(I$4:I272)-1,7)),\"\")","v":"Inhold - J-U/DQ9185"},null,null,{"$f":"INDEX($B$4:$G$103,INT((ROWS(I$4:I272)-1)/7)+1,MOD(ROWS(I$4:I272)-1,7))","v":"J-U/DQ9185"}]
[null,null,null,null,null,null,null,null,null,{"$f":"INDEX($A$4:$A$103,INT((ROWS(I$4:I273)-1)/7)+1)&IF(MOD(ROWS(I$4:I273)-1,7),\" - \"&INDEX($B$4:$G$103,INT((ROWS(I$4:I273)-1)/7)+1,MOD(ROWS(I$4:I273)-1,7)),\"\")","v":"Inhold - Y-X/DQ3832"},null,null,{"$f":"INDEX($B$4:$G$103,INT((ROWS(I$4:I273)-1)/7)+1,MOD(ROWS(I$4:I273)-1,7))","v":"Y-X/DQ3832"}]
[null,null,null,null,null,null,null,null,null,{"$f":"INDEX($A$4:$A$103,INT((ROWS(I$4:I274)-1)/7)+1)&IF(MOD(ROWS(I$4:I274)-1,7),\" - \"&INDEX($B$4:$G$103,INT((ROWS(I$4:I274)-1)/7)+1,MOD(ROWS(I$4:I274)-1,7)),\"\")","v":"Inhold - Y-L/DQ3782"},null,null,{"$f":"INDEX($B$4:$G$103,INT((ROWS(I$4:I274)-1)/7)+1,MOD(ROWS(I$4:I274)-1,7))","v":"Y-L/DQ3782"}]
[null,null,null,null,null,null,null,null,null,{"$f":"INDEX($A$4:$A$103,INT((ROWS(I$4:I275)-1)/7)+1)&IF(MOD(ROWS(I$4:I275)-1,7),\" - \"&INDEX($B$4:$G$103,INT((ROWS(I$4:I275)-1)/7)+1,MOD(ROWS(I$4:I275)-1,7)),\"\")","v":"Inhold - L-R/DQ2810"},null,null,{"$f":"INDEX($B$4:$G$103,INT((ROWS(I$4:I275)-1)/7)+1,MOD(ROWS(I$4:I275)-1,7))","v":"L-R/DQ2810"}]
[null,null,null,null,null,null,null,null,null,{"$f":"INDEX($A$4:$A$103,INT((ROWS(I$4:I276)-1)/7)+1)&IF(MOD(ROWS(I$4:I276)-1,7),\" - \"&INDEX($B$4:$G$103,INT((ROWS(I$4:I276)-1)/7)+1,MOD(ROWS(I$4:I276)-1,7)),\"\")","v":"Inhold - O-M/DQ5259"},null,null,{"$f":"INDEX($B$4:$G$103,INT((ROWS(I$4:I276)-1)/7)+1,MOD(ROWS(I$4:I276)-1,7))","v":"O-M/DQ5259"}]
[null,null,null,null,null,null,null,null,null,{"$f":"INDEX($A$4:$A$103,INT((ROWS(I$4:I277)-1)/7)+1)&IF(MOD(ROWS(I$4:I277)-1,7),\" - \"&INDEX($B$4:$G$103,INT((ROWS(I$4:I277)-1)/7)+1,MOD(ROWS(I$4:I277)-1,7)),\"\")","v":"Saillux"},null,null,{"$f":"INDEX($B$4:$G$103,INT((ROWS(I$4:I277)-1)/7)+1,MOD(ROWS(I$4:I277)-1,7))","v":{"$error":"#VALUE!"}}]
[null,null,null,null,null,null,null,null,null,{"$f":"INDEX($A$4:$A$103,INT((ROWS(I$4:I278)-1)/7)+1)&IF(MOD(ROWS(I$4:I278)-1,7),\" - \"&INDEX($B$4:$G$103,INT((ROWS(I$4:I278)-1)/7)+1,MOD(ROWS(I$4:I278)-1,7)),\"\")","v":"Saillux - K-S/DQ7277"},null,null,{"$f":"INDEX($B$4:$G$103,INT((ROWS(I$4:I278)-1)/7)+1,MOD(ROWS(I$4:I278)-1,7))","v":"K-S/DQ7277"}]
[null,null,null,null,null,null,null,null,null,{"$f":"INDEX($A$4:$A$103,INT((ROWS(I$4:I279)-1)/7)+1)&IF(MOD(ROWS(I$4:I279)-1,7),\" - \"&INDEX($B$4:$G$103,INT((ROWS(I$4:I279)-1)/7)+1,MOD(ROWS(I$4:I279)-1,7)),\"\")","v":"Saillux - C-S/DQ6120"},null,null,{"$f":"INDEX($B$4:$G$103,INT((ROWS(I$4:I279)-1)/7)+1,MOD(ROWS(I$4:I279)-1,7))","v":"C-S/DQ6120"}]
[null,null,null,null,null,null,null,null,null,{"$f":"INDEX($A$4:$A$103,INT((ROWS(I$4:I280)-1)/7)+1)&IF(MOD(ROWS(I$4:I280)-1,7),\" - \"&INDEX($B$4:$G$103,INT((ROWS(I$4:I280)-1)/7)+1,MOD(ROWS(I$4:I280)-1,7)),\"\")","v":"Saillux - J-Y/DQ3382"},null,null,{"$f":"INDEX($B$4:$G$103,INT((ROWS(I$4:I280)-1)/7)+1,MOD(ROWS(I$4:I280)-1,7))","v":"J-Y/DQ3382"}]
[null,null,null,null,null,null,null,null,null,{"$f":"INDEX($A$4:$A$103,INT((ROWS(I$4:I281)-1)/7)+1)&IF(MOD(ROWS(I$4:I281)-1,7),\" - \"&INDEX($B$4:$G$103,INT((ROWS(I$4:I281)-1)/7)+1,MOD(ROWS(I$4:I281)-1,7)),\"\")","v":"Saillux - E-R/DQ2393"},null,null,{"$f":"INDEX($B$4:$G$103,INT((ROWS(I$4:I281)-1)/7)+1,MOD(ROWS(I$4:I281)-1,7))","v":"E-R/DQ2393"}]
[null,null,null,null,null,null,null,null,null,{"$f":"INDEX($A$4:$A$103,INT((ROWS(I$4:I282)-1)/7)+1)&IF(MOD(ROWS(I$4:I282)-1,7),\" - \"&INDEX($B$4:$G$103,INT((ROWS(I$4:I282)-1)/7)+1,MOD(ROWS(I$4:I282)-1,7)),\"\")","v":"Saillux - P-M/DQ2704"},null,null,{"$f":"INDEX($B$4:$G$103,INT((ROWS(I$4:I282)-1)/7)+1,MOD(ROWS(I$4:I282)-1,7))","v":"P-M/DQ2704"}]
[null,null,null,null,null,null,null,null,null,{"$f":"INDEX($A$4:$A$103,INT((ROWS(I$4:I283)-1)/7)+1)&IF(MOD(ROWS(I$4:I283)-1,7),\" - \"&INDEX($B$4:$G$103,INT((ROWS(I$4:I283)-1)/7)+1,MOD(ROWS(I$4:I283)-1,7)),\"\")","v":"Saillux - C-C/DQ7661"},null,null,{"$f":"INDEX($B$4:$G$103,INT((ROWS(I$4:I283)-1)/7)+1,MOD(ROWS(I$4:I283)-1,7))","v":"C-C/DQ7661"}]
[null,null,null,null,null,null,null,null,null,{"$f":"INDEX($A$4:$A$103,INT((ROWS(I$4:I284)-1)/7)+1)&IF(MOD(ROWS(I$4:I284)-1,7),\" - \"&INDEX($B$4:$G$103,INT((ROWS(I$4:I284)-1)/7)+1,MOD(ROWS(I$4:I284)-1,7)),\"\")","v":"Zenjob"},null,null,{"$f":"INDEX($B$4:$G$103,INT((ROWS(I$4:I284)-1)/7)+1,MOD(ROWS(I$4:I284)-1,7))","v":{"$error":"#VALUE!"}}]
[null,null,null,null,null,null,null,null,null,{"$f":"INDEX($A$4:$A$103,INT((ROWS(I$4:I285)-1)/7)+1)&IF(MOD(ROWS(I$4:I285)-1,7),\" - \"&INDEX($B$4:$G$103,INT((ROWS(I$4:I285)-1)/7)+1,MOD(ROWS(I$4:I285)-1,7)),\"\")","v":"Zenjob - D-O/DQ9424"},null,null,{"$f":"INDEX($B$4:$G$103,INT((ROWS(I$4:I285)-1)/7)+1,MOD(ROWS(I$4:I285)-1,7))","v":"D-O/DQ9424"}]
[null,null,null,null,null,null,null,null,null,{"$f":"INDEX($A$4:$A$103,INT((ROWS(I$4:I286)-1)/7)+1)&IF(MOD(ROWS(I$4:I286)-1,7),\" - \"&INDEX($B$4:$G$103,INT((ROWS(I$4:I286)-1)/7)+1,MOD(ROWS(I$4:I286)-1,7)),\"\")","v":"Zenjob - Z-X/DQ3592"},null,null,{"$f":"INDEX($B$4:$G$103,INT((ROWS(I$4:I286)-1)/7)+1,MOD(ROWS(I$4:I286)-1,7))","v":"Z-X/DQ3592"}]
[null,null,null,null,null,null,null,null,null,{"$f":"INDEX($A$4:$A$103,INT((ROWS(I$4:I287)-1)/7)+1)&IF(MOD(ROWS(I$4:I287)-1,7),\" - \"&INDEX($B$4:$G$103,INT((ROWS(I$4:I287)-1)/7)+1,MOD(ROWS(I$4:I287)-1,7)),\"\")","v":"Zenjob - E-D/DQ7789"},null,null,{"$f":"INDEX($B$4:$G$103,INT((ROWS(I$4:I287)-1)/7)+1,MOD(ROWS(I$4:I287)-1,7))","v":"E-D/DQ7789"}]
[null,null,null,null,null,null,null,null,null,{"$f":"INDEX($A$4:$A$103,INT((ROWS(I$4:I288)-1)/7)+1)&IF(MOD(ROWS(I$4:I288)-1,7),\" - \"&INDEX($B$4:$G$103,INT((ROWS(I$4:I288)-1)/7)+1,MOD(ROWS(I$4:I288)-1,7)),\"\")","v":"Zenjob - A-P/DQ7456"},null,null,{"$f":"INDEX($B$4:$G$103,INT((ROWS(I$4:I288)-1)/7)+1,MOD(ROWS(I$4:I288)-1,7))","v":"A-P/DQ7456"}]
[null,null,null,null,null,null,null,null,null,{"$f":"INDEX($A$4:$A$103,INT((ROWS(I$4:I289)-1)/7)+1)&IF(MOD(ROWS(I$4:I289)-1,7),\" - \"&INDEX($B$4:$G$103,INT((ROWS(I$4:I289)-1)/7)+1,MOD(ROWS(I$4:I289)-1,7)),\"\")","v":"Zenjob - M-R/DQ7298"},null,null,{"$f":"INDEX($B$4:$G$103,INT((ROWS(I$4:I289)-1)/7)+1,MOD(ROWS(I$4:I289)-1,7))","v":"M-R/DQ7298"}]
[null,null,null,null,null,null,null,null,null,{"$f":"INDEX($A$4:$A$103,INT((ROWS(I$4:I290)-1)/7)+1)&IF(MOD(ROWS(I$4:I290)-1,7),\" - \"&INDEX($B$4:$G$103,INT((ROWS(I$4:I290)-1)/7)+1,MOD(ROWS(I$4:I290)-1,7)),\"\")","v":"Zenjob - H-S/DQ3032"},null,null,{"$f":"INDEX($B$4:$G$103,INT((ROWS(I$4:I290)-1)/7)+1,MOD(ROWS(I$4:I290)-1,7))","v":"H-S/DQ3032"}]
[null,null,null,null,null,null,null,null,null,{"$f":"INDEX($A$4:$A$103,INT((ROWS(I$4:I291)-1)/7)+1)&IF(MOD(ROWS(I$4:I291)-1,7),\" - \"&INDEX($B$4:$G$103,INT((ROWS(I$4:I291)-1)/7)+1,MOD(ROWS(I$4:I291)-1,7)),\"\")","v":"Sum-Home"},null,null,{"$f":"INDEX($B$4:$G$103,INT((ROWS(I$4:I291)-1)/7)+1,MOD(ROWS(I$4:I291)-1,7))","v":{"$error":"#VALUE!"}}]
[null,null,null,null,null,null,null,null,null,{"$f":"INDEX($A$4:$A$103,INT((ROWS(I$4:I292)-1)/7)+1)&IF(MOD(ROWS(I$4:I292)-1,7),\" - \"&INDEX($B$4:$G$103,INT((ROWS(I$4:I292)-1)/7)+1,MOD(ROWS(I$4:I292)-1,7)),\"\")","v":"Sum-Home - R-Y/DQ1205"},null,null,{"$f":"INDEX($B$4:$G$103,INT((ROWS(I$4:I292)-1)/7)+1,MOD(ROWS(I$4:I292)-1,7))","v":"R-Y/DQ1205"}]
[null,null,null,null,null,null,null,null,null,{"$f":"INDEX($A$4:$A$103,INT((ROWS(I$4:I293)-1)/7)+1)&IF(MOD(ROWS(I$4:I293)-1,7),\" - \"&INDEX($B$4:$G$103,INT((ROWS(I$4:I293)-1)/7)+1,MOD(ROWS(I$4:I293)-1,7)),\"\")","v":"Sum-Home - H-I/DQ6676"},null,null,{"$f":"INDEX($B$4:$G$103,INT((ROWS(I$4:I293)-1)/7)+1,MOD(ROWS(I$4:I293)-1,7))","v":"H-I/DQ6676"}]
[null,null,null,null,null,null,null,null,null,{"$f":"INDEX($A$4:$A$103,INT((ROWS(I$4:I294)-1)/7)+1)&IF(MOD(ROWS(I$4:I294)-1,7),\" - \"&INDEX($B$4:$G$103,INT((ROWS(I$4:I294)-1)/7)+1,MOD(ROWS(I$4:I294)-1,7)),\"\")","v":"Sum-Home - T-G/DQ3044"},null,null,{"$f":"INDEX($B$4:$G$103,INT((ROWS(I$4:I294)-1)/7)+1,MOD(ROWS(I$4:I294)-1,7))","v":"T-G/DQ3044"}]
[null,null,null,null,null,null,null,null,null,{"$f":"INDEX($A$4:$A$103,INT((ROWS(I$4:I295)-1)/7)+1)&IF(MOD(ROWS(I$4:I295)-1,7),\" - \"&INDEX($B$4:$G$103,INT((ROWS(I$4:I295)-1)/7)+1,MOD(ROWS(I$4:I295)-1,7)),\"\")","v":"Sum-Home - V-P/DQ4500"},null,null,{"$f":"INDEX($B$4:$G$103,INT((ROWS(I$4:I295)-1)/7)+1,MOD(ROWS(I$4:I295)-1,7))","v":"V-P/DQ4500"}]
[null,null,null,null,null,null,null,null,null,{"$f":"INDEX($A$4:$A$103,INT((ROWS(I$4:I296)-1)/7)+1)&IF(MOD(ROWS(I$4:I296)-1,7),\" - \"&INDEX($B$4:$G$103,INT((ROWS(I$4:I296)-1)/7)+1,MOD(ROWS(I$4:I296)-1,7)),\"\")","v":"Sum-Home - M-I/DQ1594"},null,null,{"$f":"INDEX($B$4:$G$103,INT((ROWS(I$4:I296)-1)/7)+1,MOD(ROWS(I$4:I296)-1,7))","v":"M-I/DQ1594"}]
[null,null,null,null,null,null,null,null,null,{"$f":"INDEX($A$4:$A$103,INT((ROWS(I$4:I297)-1)/7)+1)&IF(MOD(ROWS(I$4:I297)-1,7),\" - \"&INDEX($B$4:$G$103,INT((ROWS(I$4:I297)-1)/7)+1,MOD(ROWS(I$4:I297)-1,7)),\"\")","v":"Sum-Home - X-S/DQ9659"},null,null,{"$f":"INDEX($B$4:$G$103,INT((ROWS(I$4:I297)-1)/7)+1,MOD(ROWS(I$4:I297)-1,7))","v":"X-S/DQ9659"}]
[null,null,null,null,null,null,null,null,null,{"$f":"INDEX($A$4:$A$103,INT((ROWS(I$4:I298)-1)/7)+1)&IF(MOD(ROWS(I$4:I298)-1,7),\" - \"&INDEX($B$4:$G$103,INT((ROWS(I$4:I298)-1)/7)+1,MOD(ROWS(I$4:I298)-1,7)),\"\")","v":"Topair"},null,null,{"$f":"INDEX($B$4:$G$103,INT((ROWS(I$4:I298)-1)/7)+1,MOD(ROWS(I$4:I298)-1,7))","v":{"$error":"#VALUE!"}}]
[null,null,null,null,null,null,null,null,null,{"$f":"INDEX($A$4:$A$103,INT((ROWS(I$4:I299)-1)/7)+1)&IF(MOD(ROWS(I$4:I299)-1,7),\" - \"&INDEX($B$4:$G$103,INT((ROWS(I$4:I299)-1)/7)+1,MOD(ROWS(I$4:I299)-1,7)),\"\")","v":"Topair - G-H/DQ5891"},null,null,{"$f":"INDEX($B$4:$G$103,INT((ROWS(I$4:I299)-1)/7)+1,MOD(ROWS(I$4:I299)-1,7))","v":"G-H/DQ5891"}]
[null,null,null,null,null,null,null,null,null,{"$f":"INDEX($A$4:$A$103,INT((ROWS(I$4:I300)-1)/7)+1)&IF(MOD(ROWS(I$4:I300)-1,7),\" - \"&INDEX($B$4:$G$103,INT((ROWS(I$4:I300)-1)/7)+1,MOD(ROWS(I$4:I300)-1,7)),\"\")","v":"Topair - B-G/DQ5422"},null,null,{"$f":"INDEX($B$4:$G$103,INT((ROWS(I$4:I300)-1)/7)+1,MOD(ROWS(I$4:I300)-1,7))","v":"B-G/DQ5422"}]
[null,null,null,null,null,null,null,null,null,{"$f":"INDEX($A$4:$A$103,INT((ROWS(I$4:I301)-1)/7)+1)&IF(MOD(ROWS(I$4:I301)-1,7),\" - \"&INDEX($B$4:$G$103,INT((ROWS(I$4:I301)-1)/7)+1,MOD(ROWS(I$4:I301)-1,7)),\"\")","v":"Topair - A-L/DQ3927"},null,null,{"$f":"INDEX($B$4:$G$103,INT((ROWS(I$4:I301)-1)/7)+1,MOD(ROWS(I$4:I301)-1,7))","v":"A-L/DQ3927"}]
[null,null,null,null,null,null,null,null,null,{"$f":"INDEX($A$4:$A$103,INT((ROWS(I$4:I302)-1)/7)+1)&IF(MOD(ROWS(I$4:I302)-1,7),\" - \"&INDEX($B$4:$G$103,INT((ROWS(I$4:I302)-1)/7)+1,MOD(ROWS(I$4:I302)-1,7)),\"\")","v":"Topair - F-N/DQ5639"},null,null,{"$f":"INDEX($B$4:$G$103,INT((ROWS(I$4:I302)-1)/7)+1,MOD(ROWS(I$4:I302)-1,7))","v":"F-N/DQ5639"}]
[null,null,null,null,null,null,null,null,null,{"$f":"INDEX($A$4:$A$103,INT((ROWS(I$4:I303)-1)/7)+1)&IF(MOD(ROWS(I$4:I303)-1,7),\" - \"&INDEX($B$4:$G$103,INT((ROWS(I$4:I303)-1)/7)+1,MOD(ROWS(I$4:I303)-1,7)),\"\")","v":"Topair - S-Y/DQ1460"},null,null,{"$f":"INDEX($B$4:$G$103,INT((ROWS(I$4:I303)-1)/7)+1,MOD(ROWS(I$4:I303)-1,7))","v":"S-Y/DQ1460"}]
[null,null,null,null,null,null,null,null,null,{"$f":"INDEX($A$4:$A$103,INT((ROWS(I$4:I304)-1)/7)+1)&IF(MOD(ROWS(I$4:I304)-1,7),\" - \"&INDEX($B$4:$G$103,INT((ROWS(I$4:I304)-1)/7)+1,MOD(ROWS(I$4:I304)-1,7)),\"\")","v":"Topair - W-T/DQ2891"},null,null,{"$f":"INDEX($B$4:$G$103,INT((ROWS(I$4:I304)-1)/7)+1,MOD(ROWS(I$4:I304)-1,7))","v":"W-T/DQ2891"}]
[null,null,null,null,null,null,null,null,null,{"$f":"INDEX($A$4:$A$103,INT((ROWS(I$4:I305)-1)/7)+1)&IF(MOD(ROWS(I$4:I305)-1,7),\" - \"&INDEX($B$4:$G$103,INT((ROWS(I$4:I305)-1)/7)+1,MOD(ROWS(I$4:I305)-1,7)),\"\")","v":"New Cof"},null,null,{"$f":"INDEX($B$4:$G$103,INT((ROWS(I$4:I305)-1)/7)+1,MOD(ROWS(I$4:I305)-1,7))","v":{"$error":"#VALUE!"}}]
[null,null,null,null,null,null,null,null,null,{"$f":"INDEX($A$4:$A$103,INT((ROWS(I$4:I306)-1)/7)+1)&IF(MOD(ROWS(I$4:I306)-1,7),\" - \"&INDEX($B$4:$G$103,INT((ROWS(I$4:I306)-1)/7)+1,MOD(ROWS(I$4:I306)-1,7)),\"\")","v":"New Cof - A-E/DQ8571"},null,null,{"$f":"INDEX($B$4:$G$103,INT((ROWS(I$4:I306)-1)/7)+1,MOD(ROWS(I$4:I306)-1,7))","v":"A-E/DQ8571"}]
[null,null,null,null,null,null,null,null,null,{"$f":"INDEX($A$4:$A$103,INT((ROWS(I$4:I307)-1)/7)+1)&IF(MOD(ROWS(I$4:I307)-1,7),\" - \"&INDEX($B$4:$G$103,INT((ROWS(I$4:I307)-1)/7)+1,MOD(ROWS(I$4:I307)-1,7)),\"\")","v":"New Cof - O-B/DQ2118"},null,null,{"$f":"INDEX($B$4:$G$103,INT((ROWS(I$4:I307)-1)/7)+1,MOD(ROWS(I$4:I307)-1,7))","v":"O-B/DQ2118"}]
[null,null,null,null,null,null,null,null,null,{"$f":"INDEX($A$4:$A$103,INT((ROWS(I$4:I308)-1)/7)+1)&IF(MOD(ROWS(I$4:I308)-1,7),\" - \"&INDEX($B$4:$G$103,INT((ROWS(I$4:I308)-1)/7)+1,MOD(ROWS(I$4:I308)-1,7)),\"\")","v":"New Cof - S-B/DQ3332"},null,null,{"$f":"INDEX($B$4:$G$103,INT((ROWS(I$4:I308)-1)/7)+1,MOD(ROWS(I$4:I308)-1,7))","v":"S-B/DQ3332"}]
[null,null,null,null,null,null,null,null,null,{"$f":"INDEX($A$4:$A$103,INT((ROWS(I$4:I309)-1)/7)+1)&IF(MOD(ROWS(I$4:I309)-1,7),\" - \"&INDEX($B$4:$G$103,INT((ROWS(I$4:I309)-1)/7)+1,MOD(ROWS(I$4:I309)-1,7)),\"\")","v":"New Cof - J-I/DQ4049"},null,null,{"$f":"INDEX($B$4:$G$103,INT((ROWS(I$4:I309)-1)/7)+1,MOD(ROWS(I$4:I309)-1,7))","v":"J-I/DQ4049"}]
[null,null,null,null,null,null,null,null,null,{"$f":"INDEX($A$4:$A$103,INT((ROWS(I$4:I310)-1)/7)+1)&IF(MOD(ROWS(I$4:I310)-1,7),\" - \"&INDEX($B$4:$G$103,INT((ROWS(I$4:I310)-1)/7)+1,MOD(ROWS(I$4:I310)-1,7)),\"\")","v":"New Cof - C-D/DQ1103"},null,null,{"$f":"INDEX($B$4:$G$103,INT((ROWS(I$4:I310)-1)/7)+1,MOD(ROWS(I$4:I310)-1,7))","v":"C-D/DQ1103"}]
[null,null,null,null,null,null,null,null,null,{"$f":"INDEX($A$4:$A$103,INT((ROWS(I$4:I311)-1)/7)+1)&IF(MOD(ROWS(I$4:I311)-1,7),\" - \"&INDEX($B$4:$G$103,INT((ROWS(I$4:I311)-1)/7)+1,MOD(ROWS(I$4:I311)-1,7)),\"\")","v":"New Cof - Q-Z/DQ3080"},null,null,{"$f":"INDEX($B$4:$G$103,INT((ROWS(I$4:I311)-1)/7)+1,MOD(ROWS(I$4:I311)-1,7))","v":"Q-Z/DQ3080"}]
[null,null,null,null,null,null,null,null,null,{"$f":"INDEX($A$4:$A$103,INT((ROWS(I$4:I312)-1)/7)+1)&IF(MOD(ROWS(I$4:I312)-1,7),\" - \"&INDEX($B$4:$G$103,INT((ROWS(I$4:I312)-1)/7)+1,MOD(ROWS(I$4:I312)-1,7)),\"\")","v":"Silverdom"},null,null,{"$f":"INDEX($B$4:$G$103,INT((ROWS(I$4:I312)-1)/7)+1,MOD(ROWS(I$4:I312)-1,7))","v":{"$error":"#VALUE!"}}]
[null,null,null,null,null,null,null,null,null,{"$f":"INDEX($A$4:$A$103,INT((ROWS(I$4:I313)-1)/7)+1)&IF(MOD(ROWS(I$4:I313)-1,7),\" - \"&INDEX($B$4:$G$103,INT((ROWS(I$4:I313)-1)/7)+1,MOD(ROWS(I$4:I313)-1,7)),\"\")","v":"Silverdom - V-Q/DQ2006"},null,null,{"$f":"INDEX($B$4:$G$103,INT((ROWS(I$4:I313)-1)/7)+1,MOD(ROWS(I$4:I313)-1,7))","v":"V-Q/DQ2006"}]
[null,null,null,null,null,null,null,null,null,{"$f":"INDEX($A$4:$A$103,INT((ROWS(I$4:I314)-1)/7)+1)&IF(MOD(ROWS(I$4:I314)-1,7),\" - \"&INDEX($B$4:$G$103,INT((ROWS(I$4:I314)-1)/7)+1,MOD(ROWS(I$4:I314)-1,7)),\"\")","v":"Silverdom - I-H/DQ3986"},null,null,{"$f":"INDEX($B$4:$G$103,INT((ROWS(I$4:I314)-1)/7)+1,MOD(ROWS(I$4:I314)-1,7))","v":"I-H/DQ3986"}]
[null,null,null,null,null,null,null,null,null,{"$f":"INDEX($A$4:$A$103,INT((ROWS(I$4:I315)-1)/7)+1)&IF(MOD(ROWS(I$4:I315)-1,7),\" - \"&INDEX($B$4:$G$103,INT((ROWS(I$4:I315)-1)/7)+1,MOD(ROWS(I$4:I315)-1,7)),\"\")","v":"Silverdom - S-Y/DQ9987"},null,null,{"$f":"INDEX($B$4:$G$103,INT((ROWS(I$4:I315)-1)/7)+1,MOD(ROWS(I$4:I315)-1,7))","v":"S-Y/DQ9987"}]
[null,null,null,null,null,null,null,null,null,{"$f":"INDEX($A$4:$A$103,INT((ROWS(I$4:I316)-1)/7)+1)&IF(MOD(ROWS(I$4:I316)-1,7),\" - \"&INDEX($B$4:$G$103,INT((ROWS(I$4:I316)-1)/7)+1,MOD(ROWS(I$4:I316)-1,7)),\"\")","v":"Silverdom - K-W/DQ9789"},null,null,{"$f":"INDEX($B$4:$G$103,INT((ROWS(I$4:I316)-1)/7)+1,MOD(ROWS(I$4:I316)-1,7))","v":"K-W/DQ9789"}]
[null,null,null,null,null,null,null,null,null,{"$f":"INDEX($A$4:$A$103,INT((ROWS(I$4:I317)-1)/7)+1)&IF(MOD(ROWS(I$4:I317)-1,7),\" - \"&INDEX($B$4:$G$103,INT((ROWS(I$4:I317)-1)/7)+1,MOD(ROWS(I$4:I317)-1,7)),\"\")","v":"Silverdom - M-V/DQ6609"},null,null,{"$f":"INDEX($B$4:$G$103,INT((ROWS(I$4:I317)-1)/7)+1,MOD(ROWS(I$4:I317)-1,7))","v":"M-V/DQ6609"}]
[null,null,null,null,null,null,null,null,null,{"$f":"INDEX($A$4:$A$103,INT((ROWS(I$4:I318)-1)/7)+1)&IF(MOD(ROWS(I$4:I318)-1,7),\" - \"&INDEX($B$4:$G$103,INT((ROWS(I$4:I318)-1)/7)+1,MOD(ROWS(I$4:I318)-1,7)),\"\")","v":"Silverdom - E-G/DQ1666"},null,null,{"$f":"INDEX($B$4:$G$103,INT((ROWS(I$4:I318)-1)/7)+1,MOD(ROWS(I$4:I318)-1,7))","v":"E-G/DQ1666"}]
[null,null,null,null,null,null,null,null,null,{"$f":"INDEX($A$4:$A$103,INT((ROWS(I$4:I319)-1)/7)+1)&IF(MOD(ROWS(I$4:I319)-1,7),\" - \"&INDEX($B$4:$G$103,INT((ROWS(I$4:I319)-1)/7)+1,MOD(ROWS(I$4:I319)-1,7)),\"\")","v":"Black Silflex"},null,null,{"$f":"INDEX($B$4:$G$103,INT((ROWS(I$4:I319)-1)/7)+1,MOD(ROWS(I$4:I319)-1,7))","v":{"$error":"#VALUE!"}}]
[null,null,null,null,null,null,null,null,null,{"$f":"INDEX($A$4:$A$103,INT((ROWS(I$4:I320)-1)/7)+1)&IF(MOD(ROWS(I$4:I320)-1,7),\" - \"&INDEX($B$4:$G$103,INT((ROWS(I$4:I320)-1)/7)+1,MOD(ROWS(I$4:I320)-1,7)),\"\")","v":"Black Silflex - V-T/DQ8139"},null,null,{"$f":"INDEX($B$4:$G$103,INT((ROWS(I$4:I320)-1)/7)+1,MOD(ROWS(I$4:I320)-1,7))","v":"V-T/DQ8139"}]
[null,null,null,null,null,null,null,null,null,{"$f":"INDEX($A$4:$A$103,INT((ROWS(I$4:I321)-1)/7)+1)&IF(MOD(ROWS(I$4:I321)-1,7),\" - \"&INDEX($B$4:$G$103,INT((ROWS(I$4:I321)-1)/7)+1,MOD(ROWS(I$4:I321)-1,7)),\"\")","v":"Black Silflex - M-U/DQ4261"},null,null,{"$f":"INDEX($B$4:$G$103,INT((ROWS(I$4:I321)-1)/7)+1,MOD(ROWS(I$4:I321)-1,7))","v":"M-U/DQ4261"}]
[null,null,null,null,null,null,null,null,null,{"$f":"INDEX($A$4:$A$103,INT((ROWS(I$4:I322)-1)/7)+1)&IF(MOD(ROWS(I$4:I322)-1,7),\" - \"&INDEX($B$4:$G$103,INT((ROWS(I$4:I322)-1)/7)+1,MOD(ROWS(I$4:I322)-1,7)),\"\")","v":"Black Silflex - E-M/DQ5191"},null,null,{"$f":"INDEX($B$4:$G$103,INT((ROWS(I$4:I322)-1)/7)+1,MOD(ROWS(I$4:I322)-1,7))","v":"E-M/DQ5191"}]
[null,null,null,null,null,null,null,null,null,{"$f":"INDEX($A$4:$A$103,INT((ROWS(I$4:I323)-1)/7)+1)&IF(MOD(ROWS(I$4:I323)-1,7),\" - \"&INDEX($B$4:$G$103,INT((ROWS(I$4:I323)-1)/7)+1,MOD(ROWS(I$4:I323)-1,7)),\"\")","v":"Black Silflex - U-T/DQ6381"},null,null,{"$f":"INDEX($B$4:$G$103,INT((ROWS(I$4:I323)-1)/7)+1,MOD(ROWS(I$4:I323)-1,7))","v":"U-T/DQ6381"}]
[null,null,null,null,null,null,null,null,null,{"$f":"INDEX($A$4:$A$103,INT((ROWS(I$4:I324)-1)/7)+1)&IF(MOD(ROWS(I$4:I324)-1,7),\" - \"&INDEX($B$4:$G$103,INT((ROWS(I$4:I324)-1)/7)+1,MOD(ROWS(I$4:I324)-1,7)),\"\")","v":"Black Silflex - T-V/DQ3190"},null,null,{"$f":"INDEX($B$4:$G$103,INT((ROWS(I$4:I324)-1)/7)+1,MOD(ROWS(I$4:I324)-1,7))","v":"T-V/DQ3190"}]
[null,null,null,null,null,null,null,null,null,{"$f":"INDEX($A$4:$A$103,INT((ROWS(I$4:I325)-1)/7)+1)&IF(MOD(ROWS(I$4:I325)-1,7),\" - \"&INDEX($B$4:$G$103,INT((ROWS(I$4:I325)-1)/7)+1,MOD(ROWS(I$4:I325)-1,7)),\"\")","v":"Black Silflex - M-I/DQ7893"},null,null,{"$f":"INDEX($B$4:$G$103,INT((ROWS(I$4:I325)-1)/7)+1,MOD(ROWS(I$4:I325)-1,7))","v":"M-I/DQ7893"}]
[null,null,null,null,null,null,null,null,null,{"$f":"INDEX($A$4:$A$103,INT((ROWS(I$4:I326)-1)/7)+1)&IF(MOD(ROWS(I$4:I326)-1,7),\" - \"&INDEX($B$4:$G$103,INT((ROWS(I$4:I326)-1)/7)+1,MOD(ROWS(I$4:I326)-1,7)),\"\")","v":"Zentom"},null,null,{"$f":"INDEX($B$4:$G$103,INT((ROWS(I$4:I326)-1)/7)+1,MOD(ROWS(I$4:I326)-1,7))","v":{"$error":"#VALUE!"}}]
[null,null,null,null,null,null,null,null,null,{"$f":"INDEX($A$4:$A$103,INT((ROWS(I$4:I327)-1)/7)+1)&IF(MOD(ROWS(I$4:I327)-1,7),\" - \"&INDEX($B$4:$G$103,INT((ROWS(I$4:I327)-1)/7)+1,MOD(ROWS(I$4:I327)-1,7)),\"\")","v":"Zentom - H-O/DQ8291"},null,null,{"$f":"INDEX($B$4:$G$103,INT((ROWS(I$4:I327)-1)/7)+1,MOD(ROWS(I$4:I327)-1,7))","v":"H-O/DQ8291"}]
[null,null,null,null,null,null,null,null,null,{"$f":"INDEX($A$4:$A$103,INT((ROWS(I$4:I328)-1)/7)+1)&IF(MOD(ROWS(I$4:I328)-1,7),\" - \"&INDEX($B$4:$G$103,INT((ROWS(I$4:I328)-1)/7)+1,MOD(ROWS(I$4:I328)-1,7)),\"\")","v":"Zentom - U-M/DQ2997"},null,null,{"$f":"INDEX($B$4:$G$103,INT((ROWS(I$4:I328)-1)/7)+1,MOD(ROWS(I$4:I328)-1,7))","v":"U-M/DQ2997"}]
[null,null,null,null,null,null,null,null,null,{"$f":"INDEX($A$4:$A$103,INT((ROWS(I$4:I329)-1)/7)+1)&IF(MOD(ROWS(I$4:I329)-1,7),\" - \"&INDEX($B$4:$G$103,INT((ROWS(I$4:I329)-1)/7)+1,MOD(ROWS(I$4:I329)-1,7)),\"\")","v":"Zentom - D-V/DQ2055"},null,null,{"$f":"INDEX($B$4:$G$103,INT((ROWS(I$4:I329)-1)/7)+1,MOD(ROWS(I$4:I329)-1,7))","v":"D-V/DQ2055"}]
[null,null,null,null,null,null,null,null,null,{"$f":"INDEX($A$4:$A$103,INT((ROWS(I$4:I330)-1)/7)+1)&IF(MOD(ROWS(I$4:I330)-1,7),\" - \"&INDEX($B$4:$G$103,INT((ROWS(I$4:I330)-1)/7)+1,MOD(ROWS(I$4:I330)-1,7)),\"\")","v":"Zentom - S-F/DQ1630"},null,null,{"$f":"INDEX($B$4:$G$103,INT((ROWS(I$4:I330)-1)/7)+1,MOD(ROWS(I$4:I330)-1,7))","v":"S-F/DQ1630"}]
[null,null,null,null,null,null,null,null,null,{"$f":"INDEX($A$4:$A$103,INT((ROWS(I$4:I331)-1)/7)+1)&IF(MOD(ROWS(I$4:I331)-1,7),\" - \"&INDEX($B$4:$G$103,INT((ROWS(I$4:I331)-1)/7)+1,MOD(ROWS(I$4:I331)-1,7)),\"\")","v":"Zentom - E-Y/DQ9811"},null,null,{"$f":"INDEX($B$4:$G$103,INT((ROWS(I$4:I331)-1)/7)+1,MOD(ROWS(I$4:I331)-1,7))","v":"E-Y/DQ9811"}]
[null,null,null,null,null,null,null,null,null,{"$f":"INDEX($A$4:$A$103,INT((ROWS(I$4:I332)-1)/7)+1)&IF(MOD(ROWS(I$4:I332)-1,7),\" - \"&INDEX($B$4:$G$103,INT((ROWS(I$4:I332)-1)/7)+1,MOD(ROWS(I$4:I332)-1,7)),\"\")","v":"Zentom - R-D/DQ1916"},null,null,{"$f":"INDEX($B$4:$G$103,INT((ROWS(I$4:I332)-1)/7)+1,MOD(ROWS(I$4:I332)-1,7))","v":"R-D/DQ1916"}]
[null,null,null,null,null,null,null,null,null,{"$f":"INDEX($A$4:$A$103,INT((ROWS(I$4:I333)-1)/7)+1)&IF(MOD(ROWS(I$4:I333)-1,7),\" - \"&INDEX($B$4:$G$103,INT((ROWS(I$4:I333)-1)/7)+1,MOD(ROWS(I$4:I333)-1,7)),\"\")","v":"Antex"},null,null,{"$f":"INDEX($B$4:$G$103,INT((ROWS(I$4:I333)-1)/7)+1,MOD(ROWS(I$4:I333)-1,7))","v":{"$error":"#VALUE!"}}]
[null,null,null,null,null,null,null,null,null,{"$f":"INDEX($A$4:$A$103,INT((ROWS(I$4:I334)-1)/7)+1)&IF(MOD(ROWS(I$4:I334)-1,7),\" - \"&INDEX($B$4:$G$103,INT((ROWS(I$4:I334)-1)/7)+1,MOD(ROWS(I$4:I334)-1,7)),\"\")","v":"Antex - U-V/DQ8524"},null,null,{"$f":"INDEX($B$4:$G$103,INT((ROWS(I$4:I334)-1)/7)+1,MOD(ROWS(I$4:I334)-1,7))","v":"U-V/DQ8524"}]
[null,null,null,null,null,null,null,null,null,{"$f":"INDEX($A$4:$A$103,INT((ROWS(I$4:I335)-1)/7)+1)&IF(MOD(ROWS(I$4:I335)-1,7),\" - \"&INDEX($B$4:$G$103,INT((ROWS(I$4:I335)-1)/7)+1,MOD(ROWS(I$4:I335)-1,7)),\"\")","v":"Antex - H-O/DQ2807"},null,null,{"$f":"INDEX($B$4:$G$103,INT((ROWS(I$4:I335)-1)/7)+1,MOD(ROWS(I$4:I335)-1,7))","v":"H-O/DQ2807"}]
[null,null,null,null,null,null,null,null,null,{"$f":"INDEX($A$4:$A$103,INT((ROWS(I$4:I336)-1)/7)+1)&IF(MOD(ROWS(I$4:I336)-1,7),\" - \"&INDEX($B$4:$G$103,INT((ROWS(I$4:I336)-1)/7)+1,MOD(ROWS(I$4:I336)-1,7)),\"\")","v":"Antex - Y-G/DQ8263"},null,null,{"$f":"INDEX($B$4:$G$103,INT((ROWS(I$4:I336)-1)/7)+1,MOD(ROWS(I$4:I336)-1,7))","v":"Y-G/DQ8263"}]
[null,null,null,null,null,null,null,null,null,{"$f":"INDEX($A$4:$A$103,INT((ROWS(I$4:I337)-1)/7)+1)&IF(MOD(ROWS(I$4:I337)-1,7),\" - \"&INDEX($B$4:$G$103,INT((ROWS(I$4:I337)-1)/7)+1,MOD(ROWS(I$4:I337)-1,7)),\"\")","v":"Antex - K-X/DQ7690"},null,null,{"$f":"INDEX($B$4:$G$103,INT((ROWS(I$4:I337)-1)/7)+1,MOD(ROWS(I$4:I337)-1,7))","v":"K-X/DQ7690"}]
[null,null,null,null,null,null,null,null,null,{"$f":"INDEX($A$4:$A$103,INT((ROWS(I$4:I338)-1)/7)+1)&IF(MOD(ROWS(I$4:I338)-1,7),\" - \"&INDEX($B$4:$G$103,INT((ROWS(I$4:I338)-1)/7)+1,MOD(ROWS(I$4:I338)-1,7)),\"\")","v":"Antex - T-F/DQ6604"},null,null,{"$f":"INDEX($B$4:$G$103,INT((ROWS(I$4:I338)-1)/7)+1,MOD(ROWS(I$4:I338)-1,7))","v":"T-F/DQ6604"}]
[null,null,null,null,null,null,null,null,null,{"$f":"INDEX($A$4:$A$103,INT((ROWS(I$4:I339)-1)/7)+1)&IF(MOD(ROWS(I$4:I339)-1,7),\" - \"&INDEX($B$4:$G$103,INT((ROWS(I$4:I339)-1)/7)+1,MOD(ROWS(I$4:I339)-1,7)),\"\")","v":"Antex - X-M/DQ8067"},null,null,{"$f":"INDEX($B$4:$G$103,INT((ROWS(I$4:I339)-1)/7)+1,MOD(ROWS(I$4:I339)-1,7))","v":"X-M/DQ8067"}]
[null,null,null,null,null,null,null,null,null,{"$f":"INDEX($A$4:$A$103,INT((ROWS(I$4:I340)-1)/7)+1)&IF(MOD(ROWS(I$4:I340)-1,7),\" - \"&INDEX($B$4:$G$103,INT((ROWS(I$4:I340)-1)/7)+1,MOD(ROWS(I$4:I340)-1,7)),\"\")","v":"Ranity"},null,null,{"$f":"INDEX($B$4:$G$103,INT((ROWS(I$4:I340)-1)/7)+1,MOD(ROWS(I$4:I340)-1,7))","v":{"$error":"#VALUE!"}}]
[null,null,null,null,null,null,null,null,null,{"$f":"INDEX($A$4:$A$103,INT((ROWS(I$4:I341)-1)/7)+1)&IF(MOD(ROWS(I$4:I341)-1,7),\" - \"&INDEX($B$4:$G$103,INT((ROWS(I$4:I341)-1)/7)+1,MOD(ROWS(I$4:I341)-1,7)),\"\")","v":"Ranity - M-W/DQ2718"},null,null,{"$f":"INDEX($B$4:$G$103,INT((ROWS(I$4:I341)-1)/7)+1,MOD(ROWS(I$4:I341)-1,7))","v":"M-W/DQ2718"}]
[null,null,null,null,null,null,null,null,null,{"$f":"INDEX($A$4:$A$103,INT((ROWS(I$4:I342)-1)/7)+1)&IF(MOD(ROWS(I$4:I342)-1,7),\" - \"&INDEX($B$4:$G$103,INT((ROWS(I$4:I342)-1)/7)+1,MOD(ROWS(I$4:I342)-1,7)),\"\")","v":"Ranity - D-W/DQ8974"},null,null,{"$f":"INDEX($B$4:$G$103,INT((ROWS(I$4:I342)-1)/7)+1,MOD(ROWS(I$4:I342)-1,7))","v":"D-W/DQ8974"}]
[null,null,null,null,null,null,null,null,null,{"$f":"INDEX($A$4:$A$103,INT((ROWS(I$4:I343)-1)/7)+1)&IF(MOD(ROWS(I$4:I343)-1,7),\" - \"&INDEX($B$4:$G$103,INT((ROWS(I$4:I343)-1)/7)+1,MOD(ROWS(I$4:I343)-1,7)),\"\")","v":"Ranity - I-F/DQ8856"},null,null,{"$f":"INDEX($B$4:$G$103,INT((ROWS(I$4:I343)-1)/7)+1,MOD(ROWS(I$4:I343)-1,7))","v":"I-F/DQ8856"}]
[null,null,null,null,null,null,null,null,null,{"$f":"INDEX($A$4:$A$103,INT((ROWS(I$4:I344)-1)/7)+1)&IF(MOD(ROWS(I$4:I344)-1,7),\" - \"&INDEX($B$4:$G$103,INT((ROWS(I$4:I344)-1)/7)+1,MOD(ROWS(I$4:I344)-1,7)),\"\")","v":"Ranity - E-P/DQ3003"},null,null,{"$f":"INDEX($B$4:$G$103,INT((ROWS(I$4:I344)-1)/7)+1,MOD(ROWS(I$4:I344)-1,7))","v":"E-P/DQ3003"}]
[null,null,null,null,null,null,null,null,null,{"$f":"INDEX($A$4:$A$103,INT((ROWS(I$4:I345)-1)/7)+1)&IF(MOD(ROWS(I$4:I345)-1,7),\" - \"&INDEX($B$4:$G$103,INT((ROWS(I$4:I345)-1)/7)+1,MOD(ROWS(I$4:I345)-1,7)),\"\")","v":"Ranity - P-J/DQ5975"},null,null,{"$f":"INDEX($B$4:$G$103,INT((ROWS(I$4:I345)-1)/7)+1,MOD(ROWS(I$4:I345)-1,7))","v":"P-J/DQ5975"}]
[null,null,null,null,null,null,null,null,null,{"$f":"INDEX($A$4:$A$103,INT((ROWS(I$4:I346)-1)/7)+1)&IF(MOD(ROWS(I$4:I346)-1,7),\" - \"&INDEX($B$4:$G$103,INT((ROWS(I$4:I346)-1)/7)+1,MOD(ROWS(I$4:I346)-1,7)),\"\")","v":"Ranity - A-Y/DQ1109"},null,null,{"$f":"INDEX($B$4:$G$103,INT((ROWS(I$4:I346)-1)/7)+1,MOD(ROWS(I$4:I346)-1,7))","v":"A-Y/DQ1109"}]
[null,null,null,null,null,null,null,null,null,{"$f":"INDEX($A$4:$A$103,INT((ROWS(I$4:I347)-1)/7)+1)&IF(MOD(ROWS(I$4:I347)-1,7),\" - \"&INDEX($B$4:$G$103,INT((ROWS(I$4:I347)-1)/7)+1,MOD(ROWS(I$4:I347)-1,7)),\"\")","v":"S-kix"},null,null,{"$f":"INDEX($B$4:$G$103,INT((ROWS(I$4:I347)-1)/7)+1,MOD(ROWS(I$4:I347)-1,7))","v":{"$error":"#VALUE!"}}]
[null,null,null,null,null,null,null,null,null,{"$f":"INDEX($A$4:$A$103,INT((ROWS(I$4:I348)-1)/7)+1)&IF(MOD(ROWS(I$4:I348)-1,7),\" - \"&INDEX($B$4:$G$103,INT((ROWS(I$4:I348)-1)/7)+1,MOD(ROWS(I$4:I348)-1,7)),\"\")","v":"S-kix - K-G/DQ2749"},null,null,{"$f":"INDEX($B$4:$G$103,INT((ROWS(I$4:I348)-1)/7)+1,MOD(ROWS(I$4:I348)-1,7))","v":"K-G/DQ2749"}]
[null,null,null,null,null,null,null,null,null,{"$f":"INDEX($A$4:$A$103,INT((ROWS(I$4:I349)-1)/7)+1)&IF(MOD(ROWS(I$4:I349)-1,7),\" - \"&INDEX($B$4:$G$103,INT((ROWS(I$4:I349)-1)/7)+1,MOD(ROWS(I$4:I349)-1,7)),\"\")","v":"S-kix - P-J/DQ4709"},null,null,{"$f":"INDEX($B$4:$G$103,INT((ROWS(I$4:I349)-1)/7)+1,MOD(ROWS(I$4:I349)-1,7))","v":"P-J/DQ4709"}]
[null,null,null,null,null,null,null,null,null,{"$f":"INDEX($A$4:$A$103,INT((ROWS(I$4:I350)-1)/7)+1)&IF(MOD(ROWS(I$4:I350)-1,7),\" - \"&INDEX($B$4:$G$103,INT((ROWS(I$4:I350)-1)/7)+1,MOD(ROWS(I$4:I350)-1,7)),\"\")","v":"S-kix - N-X/DQ2600"},null,null,{"$f":"INDEX($B$4:$G$103,INT((ROWS(I$4:I350)-1)/7)+1,MOD(ROWS(I$4:I350)-1,7))","v":"N-X/DQ2600"}]
[null,null,null,null,null,null,null,null,null,{"$f":"INDEX($A$4:$A$103,INT((ROWS(I$4:I351)-1)/7)+1)&IF(MOD(ROWS(I$4:I351)-1,7),\" - \"&INDEX($B$4:$G$103,INT((ROWS(I$4:I351)-1)/7)+1,MOD(ROWS(I$4:I351)-1,7)),\"\")","v":"S-kix - B-T/DQ9604"},null,null,{"$f":"INDEX($B$4:$G$103,INT((ROWS(I$4:I351)-1)/7)+1,MOD(ROWS(I$4:I351)-1,7))","v":"B-T/DQ9604"}]
[null,null,null,null,null,null,null,null,null,{"$f":"INDEX($A$4:$A$103,INT((ROWS(I$4:I352)-1)/7)+1)&IF(MOD(ROWS(I$4:I352)-1,7),\" - \"&INDEX($B$4:$G$103,INT((ROWS(I$4:I352)-1)/7)+1,MOD(ROWS(I$4:I352)-1,7)),\"\")","v":"S-kix - R-W/DQ6294"},null,null,{"$f":"INDEX($B$4:$G$103,INT((ROWS(I$4:I352)-1)/7)+1,MOD(ROWS(I$4:I352)-1,7))","v":"R-W/DQ6294"}]
[null,null,null,null,null,null,null,null,null,{"$f":"INDEX($A$4:$A$103,INT((ROWS(I$4:I353)-1)/7)+1)&IF(MOD(ROWS(I$4:I353)-1,7),\" - \"&INDEX($B$4:$G$103,INT((ROWS(I$4:I353)-1)/7)+1,MOD(ROWS(I$4:I353)-1,7)),\"\")","v":"S-kix - O-U/DQ2096"},null,null,{"$f":"INDEX($B$4:$G$103,INT((ROWS(I$4:I353)-1)/7)+1,MOD(ROWS(I$4:I353)-1,7))","v":"O-U/DQ2096"}]
[null,null,null,null,null,null,null,null,null,{"$f":"INDEX($A$4:$A$103,INT((ROWS(I$4:I354)-1)/7)+1)&IF(MOD(ROWS(I$4:I354)-1,7),\" - \"&INDEX($B$4:$G$103,INT((ROWS(I$4:I354)-1)/7)+1,MOD(ROWS(I$4:I354)-1,7)),\"\")","v":"Zath-Lex"},null,null,{"$f":"INDEX($B$4:$G$103,INT((ROWS(I$4:I354)-1)/7)+1,MOD(ROWS(I$4:I354)-1,7))","v":{"$error":"#VALUE!"}}]
[null,null,null,null,null,null,null,null,null,{"$f":"INDEX($A$4:$A$103,INT((ROWS(I$4:I355)-1)/7)+1)&IF(MOD(ROWS(I$4:I355)-1,7),\" - \"&INDEX($B$4:$G$103,INT((ROWS(I$4:I355)-1)/7)+1,MOD(ROWS(I$4:I355)-1,7)),\"\")","v":"Zath-Lex - M-X/DQ6178"},null,null,{"$f":"INDEX($B$4:$G$103,INT((ROWS(I$4:I355)-1)/7)+1,MOD(ROWS(I$4:I355)-1,7))","v":"M-X/DQ6178"}]
[null,null,null,null,null,null,null,null,null,{"$f":"INDEX($A$4:$A$103,INT((ROWS(I$4:I356)-1)/7)+1)&IF(MOD(ROWS(I$4:I356)-1,7),\" - \"&INDEX($B$4:$G$103,INT((ROWS(I$4:I356)-1)/7)+1,MOD(ROWS(I$4:I356)-1,7)),\"\")","v":"Zath-Lex - C-U/DQ1618"},null,null,{"$f":"INDEX($B$4:$G$103,INT((ROWS(I$4:I356)-1)/7)+1,MOD(ROWS(I$4:I356)-1,7))","v":"C-U/DQ1618"}]
[null,null,null,null,null,null,null,null,null,{"$f":"INDEX($A$4:$A$103,INT((ROWS(I$4:I357)-1)/7)+1)&IF(MOD(ROWS(I$4:I357)-1,7),\" - \"&INDEX($B$4:$G$103,INT((ROWS(I$4:I357)-1)/7)+1,MOD(ROWS(I$4:I357)-1,7)),\"\")","v":"Zath-Lex - O-P/DQ3023"},null,null,{"$f":"INDEX($B$4:$G$103,INT((ROWS(I$4:I357)-1)/7)+1,MOD(ROWS(I$4:I357)-1,7))","v":"O-P/DQ3023"}]
[null,null,null,null,null,null,null,null,null,{"$f":"INDEX($A$4:$A$103,INT((ROWS(I$4:I358)-1)/7)+1)&IF(MOD(ROWS(I$4:I358)-1,7),\" - \"&INDEX($B$4:$G$103,INT((ROWS(I$4:I358)-1)/7)+1,MOD(ROWS(I$4:I358)-1,7)),\"\")","v":"Zath-Lex - S-T/DQ8619"},null,null,{"$f":"INDEX($B$4:$G$103,INT((ROWS(I$4:I358)-1)/7)+1,MOD(ROWS(I$4:I358)-1,7))","v":"S-T/DQ8619"}]
[null,null,null,null,null,null,null,null,null,{"$f":"INDEX($A$4:$A$103,INT((ROWS(I$4:I359)-1)/7)+1)&IF(MOD(ROWS(I$4:I359)-1,7),\" - \"&INDEX($B$4:$G$103,INT((ROWS(I$4:I359)-1)/7)+1,MOD(ROWS(I$4:I359)-1,7)),\"\")","v":"Zath-Lex - V-O/DQ9170"},null,null,{"$f":"INDEX($B$4:$G$103,INT((ROWS(I$4:I359)-1)/7)+1,MOD(ROWS(I$4:I359)-1,7))","v":"V-O/DQ9170"}]
[null,null,null,null,null,null,null,null,null,{"$f":"INDEX($A$4:$A$103,INT((ROWS(I$4:I360)-1)/7)+1)&IF(MOD(ROWS(I$4:I360)-1,7),\" - \"&INDEX($B$4:$G$103,INT((ROWS(I$4:I360)-1)/7)+1,MOD(ROWS(I$4:I360)-1,7)),\"\")","v":"Zath-Lex - P-J/DQ3470"},null,null,{"$f":"INDEX($B$4:$G$103,INT((ROWS(I$4:I360)-1)/7)+1,MOD(ROWS(I$4:I360)-1,7))","v":"P-J/DQ3470"}]
[null,null,null,null,null,null,null,null,null,{"$f":"INDEX($A$4:$A$103,INT((ROWS(I$4:I361)-1)/7)+1)&IF(MOD(ROWS(I$4:I361)-1,7),\" - \"&INDEX($B$4:$G$103,INT((ROWS(I$4:I361)-1)/7)+1,MOD(ROWS(I$4:I361)-1,7)),\"\")","v":"Tin Tam"},null,null,{"$f":"INDEX($B$4:$G$103,INT((ROWS(I$4:I361)-1)/7)+1,MOD(ROWS(I$4:I361)-1,7))","v":{"$error":"#VALUE!"}}]
[null,null,null,null,null,null,null,null,null,{"$f":"INDEX($A$4:$A$103,INT((ROWS(I$4:I362)-1)/7)+1)&IF(MOD(ROWS(I$4:I362)-1,7),\" - \"&INDEX($B$4:$G$103,INT((ROWS(I$4:I362)-1)/7)+1,MOD(ROWS(I$4:I362)-1,7)),\"\")","v":"Tin Tam - V-E/DQ3168"},null,null,{"$f":"INDEX($B$4:$G$103,INT((ROWS(I$4:I362)-1)/7)+1,MOD(ROWS(I$4:I362)-1,7))","v":"V-E/DQ3168"}]
[null,null,null,null,null,null,null,null,null,{"$f":"INDEX($A$4:$A$103,INT((ROWS(I$4:I363)-1)/7)+1)&IF(MOD(ROWS(I$4:I363)-1,7),\" - \"&INDEX($B$4:$G$103,INT((ROWS(I$4:I363)-1)/7)+1,MOD(ROWS(I$4:I363)-1,7)),\"\")","v":"Tin Tam - X-O/DQ7726"},null,null,{"$f":"INDEX($B$4:$G$103,INT((ROWS(I$4:I363)-1)/7)+1,MOD(ROWS(I$4:I363)-1,7))","v":"X-O/DQ7726"}]
[null,null,null,null,null,null,null,null,null,{"$f":"INDEX($A$4:$A$103,INT((ROWS(I$4:I364)-1)/7)+1)&IF(MOD(ROWS(I$4:I364)-1,7),\" - \"&INDEX($B$4:$G$103,INT((ROWS(I$4:I364)-1)/7)+1,MOD(ROWS(I$4:I364)-1,7)),\"\")","v":"Tin Tam - K-Q/DQ3777"},null,null,{"$f":"INDEX($B$4:$G$103,INT((ROWS(I$4:I364)-1)/7)+1,MOD(ROWS(I$4:I364)-1,7))","v":"K-Q/DQ3777"}]
[null,null,null,null,null,null,null,null,null,{"$f":"INDEX($A$4:$A$103,INT((ROWS(I$4:I365)-1)/7)+1)&IF(MOD(ROWS(I$4:I365)-1,7),\" - \"&INDEX($B$4:$G$103,INT((ROWS(I$4:I365)-1)/7)+1,MOD(ROWS(I$4:I365)-1,7)),\"\")","v":"Tin Tam - G-C/DQ5626"},null,null,{"$f":"INDEX($B$4:$G$103,INT((ROWS(I$4:I365)-1)/7)+1,MOD(ROWS(I$4:I365)-1,7))","v":"G-C/DQ5626"}]
[null,null,null,null,null,null,null,null,null,{"$f":"INDEX($A$4:$A$103,INT((ROWS(I$4:I366)-1)/7)+1)&IF(MOD(ROWS(I$4:I366)-1,7),\" - \"&INDEX($B$4:$G$103,INT((ROWS(I$4:I366)-1)/7)+1,MOD(ROWS(I$4:I366)-1,7)),\"\")","v":"Tin Tam - S-D/DQ7723"},null,null,{"$f":"INDEX($B$4:$G$103,INT((ROWS(I$4:I366)-1)/7)+1,MOD(ROWS(I$4:I366)-1,7))","v":"S-D/DQ7723"}]
[null,null,null,null,null,null,null,null,null,{"$f":"INDEX($A$4:$A$103,INT((ROWS(I$4:I367)-1)/7)+1)&IF(MOD(ROWS(I$4:I367)-1,7),\" - \"&INDEX($B$4:$G$103,INT((ROWS(I$4:I367)-1)/7)+1,MOD(ROWS(I$4:I367)-1,7)),\"\")","v":"Tin Tam - R-X/DQ8582"},null,null,{"$f":"INDEX($B$4:$G$103,INT((ROWS(I$4:I367)-1)/7)+1,MOD(ROWS(I$4:I367)-1,7))","v":"R-X/DQ8582"}]
[null,null,null,null,null,null,null,null,null,{"$f":"INDEX($A$4:$A$103,INT((ROWS(I$4:I368)-1)/7)+1)&IF(MOD(ROWS(I$4:I368)-1,7),\" - \"&INDEX($B$4:$G$103,INT((ROWS(I$4:I368)-1)/7)+1,MOD(ROWS(I$4:I368)-1,7)),\"\")","v":"Home-Fix"},null,null,{"$f":"INDEX($B$4:$G$103,INT((ROWS(I$4:I368)-1)/7)+1,MOD(ROWS(I$4:I368)-1,7))","v":{"$error":"#VALUE!"}}]
[null,null,null,null,null,null,null,null,null,{"$f":"INDEX($A$4:$A$103,INT((ROWS(I$4:I369)-1)/7)+1)&IF(MOD(ROWS(I$4:I369)-1,7),\" - \"&INDEX($B$4:$G$103,INT((ROWS(I$4:I369)-1)/7)+1,MOD(ROWS(I$4:I369)-1,7)),\"\")","v":"Home-Fix - V-K/DQ4188"},null,null,{"$f":"INDEX($B$4:$G$103,INT((ROWS(I$4:I369)-1)/7)+1,MOD(ROWS(I$4:I369)-1,7))","v":"V-K/DQ4188"}]
[null,null,null,null,null,null,null,null,null,{"$f":"INDEX($A$4:$A$103,INT((ROWS(I$4:I370)-1)/7)+1)&IF(MOD(ROWS(I$4:I370)-1,7),\" - \"&INDEX($B$4:$G$103,INT((ROWS(I$4:I370)-1)/7)+1,MOD(ROWS(I$4:I370)-1,7)),\"\")","v":"Home-Fix - W-D/DQ9139"},null,null,{"$f":"INDEX($B$4:$G$103,INT((ROWS(I$4:I370)-1)/7)+1,MOD(ROWS(I$4:I370)-1,7))","v":"W-D/DQ9139"}]
[null,null,null,null,null,null,null,null,null,{"$f":"INDEX($A$4:$A$103,INT((ROWS(I$4:I371)-1)/7)+1)&IF(MOD(ROWS(I$4:I371)-1,7),\" - \"&INDEX($B$4:$G$103,INT((ROWS(I$4:I371)-1)/7)+1,MOD(ROWS(I$4:I371)-1,7)),\"\")","v":"Home-Fix - S-W/DQ7140"},null,null,{"$f":"INDEX($B$4:$G$103,INT((ROWS(I$4:I371)-1)/7)+1,MOD(ROWS(I$4:I371)-1,7))","v":"S-W/DQ7140"}]
[null,null,null,null,null,null,null,null,null,{"$f":"INDEX($A$4:$A$103,INT((ROWS(I$4:I372)-1)/7)+1)&IF(MOD(ROWS(I$4:I372)-1,7),\" - \"&INDEX($B$4:$G$103,INT((ROWS(I$4:I372)-1)/7)+1,MOD(ROWS(I$4:I372)-1,7)),\"\")","v":"Home-Fix - G-J/DQ2389"},null,null,{"$f":"INDEX($B$4:$G$103,INT((ROWS(I$4:I372)-1)/7)+1,MOD(ROWS(I$4:I372)-1,7))","v":"G-J/DQ2389"}]
[null,null,null,null,null,null,null,null,null,{"$f":"INDEX($A$4:$A$103,INT((ROWS(I$4:I373)-1)/7)+1)&IF(MOD(ROWS(I$4:I373)-1,7),\" - \"&INDEX($B$4:$G$103,INT((ROWS(I$4:I373)-1)/7)+1,MOD(ROWS(I$4:I373)-1,7)),\"\")","v":"Home-Fix - L-J/DQ9015"},null,null,{"$f":"INDEX($B$4:$G$103,INT((ROWS(I$4:I373)-1)/7)+1,MOD(ROWS(I$4:I373)-1,7))","v":"L-J/DQ9015"}]
[null,null,null,null,null,null,null,null,null,{"$f":"INDEX($A$4:$A$103,INT((ROWS(I$4:I374)-1)/7)+1)&IF(MOD(ROWS(I$4:I374)-1,7),\" - \"&INDEX($B$4:$G$103,INT((ROWS(I$4:I374)-1)/7)+1,MOD(ROWS(I$4:I374)-1,7)),\"\")","v":"Home-Fix - D-D/DQ9127"},null,null,{"$f":"INDEX($B$4:$G$103,INT((ROWS(I$4:I374)-1)/7)+1,MOD(ROWS(I$4:I374)-1,7))","v":"D-D/DQ9127"}]
[null,null,null,null,null,null,null,null,null,{"$f":"INDEX($A$4:$A$103,INT((ROWS(I$4:I375)-1)/7)+1)&IF(MOD(ROWS(I$4:I375)-1,7),\" - \"&INDEX($B$4:$G$103,INT((ROWS(I$4:I375)-1)/7)+1,MOD(ROWS(I$4:I375)-1,7)),\"\")","v":"Strongtax"},null,null,{"$f":"INDEX($B$4:$G$103,INT((ROWS(I$4:I375)-1)/7)+1,MOD(ROWS(I$4:I375)-1,7))","v":{"$error":"#VALUE!"}}]
[null,null,null,null,null,null,null,null,null,{"$f":"INDEX($A$4:$A$103,INT((ROWS(I$4:I376)-1)/7)+1)&IF(MOD(ROWS(I$4:I376)-1,7),\" - \"&INDEX($B$4:$G$103,INT((ROWS(I$4:I376)-1)/7)+1,MOD(ROWS(I$4:I376)-1,7)),\"\")","v":"Strongtax - C-B/DQ7246"},null,null,{"$f":"INDEX($B$4:$G$103,INT((ROWS(I$4:I376)-1)/7)+1,MOD(ROWS(I$4:I376)-1,7))","v":"C-B/DQ7246"}]
[null,null,null,null,null,null,null,null,null,{"$f":"INDEX($A$4:$A$103,INT((ROWS(I$4:I377)-1)/7)+1)&IF(MOD(ROWS(I$4:I377)-1,7),\" - \"&INDEX($B$4:$G$103,INT((ROWS(I$4:I377)-1)/7)+1,MOD(ROWS(I$4:I377)-1,7)),\"\")","v":"Strongtax - S-Z/DQ9931"},null,null,{"$f":"INDEX($B$4:$G$103,INT((ROWS(I$4:I377)-1)/7)+1,MOD(ROWS(I$4:I377)-1,7))","v":"S-Z/DQ9931"}]
[null,null,null,null,null,null,null,null,null,{"$f":"INDEX($A$4:$A$103,INT((ROWS(I$4:I378)-1)/7)+1)&IF(MOD(ROWS(I$4:I378)-1,7),\" - \"&INDEX($B$4:$G$103,INT((ROWS(I$4:I378)-1)/7)+1,MOD(ROWS(I$4:I378)-1,7)),\"\")","v":"Strongtax - I-U/DQ6209"},null,null,{"$f":"INDEX($B$4:$G$103,INT((ROWS(I$4:I378)-1)/7)+1,MOD(ROWS(I$4:I378)-1,7))","v":"I-U/DQ6209"}]
[null,null,null,null,null,null,null,null,null,{"$f":"INDEX($A$4:$A$103,INT((ROWS(I$4:I379)-1)/7)+1)&IF(MOD(ROWS(I$4:I379)-1,7),\" - \"&INDEX($B$4:$G$103,INT((ROWS(I$4:I379)-1)/7)+1,MOD(ROWS(I$4:I379)-1,7)),\"\")","v":"Strongtax - R-D/DQ7972"},null,null,{"$f":"INDEX($B$4:$G$103,INT((ROWS(I$4:I379)-1)/7)+1,MOD(ROWS(I$4:I379)-1,7))","v":"R-D/DQ7972"}]
[null,null,null,null,null,null,null,null,null,{"$f":"INDEX($A$4:$A$103,INT((ROWS(I$4:I380)-1)/7)+1)&IF(MOD(ROWS(I$4:I380)-1,7),\" - \"&INDEX($B$4:$G$103,INT((ROWS(I$4:I380)-1)/7)+1,MOD(ROWS(I$4:I380)-1,7)),\"\")","v":"Strongtax - C-N/DQ7927"},null,null,{"$f":"INDEX($B$4:$G$103,INT((ROWS(I$4:I380)-1)/7)+1,MOD(ROWS(I$4:I380)-1,7))","v":"C-N/DQ7927"}]
[null,null,null,null,null,null,null,null,null,{"$f":"INDEX($A$4:$A$103,INT((ROWS(I$4:I381)-1)/7)+1)&IF(MOD(ROWS(I$4:I381)-1,7),\" - \"&INDEX($B$4:$G$103,INT((ROWS(I$4:I381)-1)/7)+1,MOD(ROWS(I$4:I381)-1,7)),\"\")","v":"Strongtax - J-I/DQ6121"},null,null,{"$f":"INDEX($B$4:$G$103,INT((ROWS(I$4:I381)-1)/7)+1,MOD(ROWS(I$4:I381)-1,7))","v":"J-I/DQ6121"}]
[null,null,null,null,null,null,null,null,null,{"$f":"INDEX($A$4:$A$103,INT((ROWS(I$4:I382)-1)/7)+1)&IF(MOD(ROWS(I$4:I382)-1,7),\" - \"&INDEX($B$4:$G$103,INT((ROWS(I$4:I382)-1)/7)+1,MOD(ROWS(I$4:I382)-1,7)),\"\")","v":"Scottrax"},null,null,{"$f":"INDEX($B$4:$G$103,INT((ROWS(I$4:I382)-1)/7)+1,MOD(ROWS(I$4:I382)-1,7))","v":{"$error":"#VALUE!"}}]
[null,null,null,null,null,null,null,null,null,{"$f":"INDEX($A$4:$A$103,INT((ROWS(I$4:I383)-1)/7)+1)&IF(MOD(ROWS(I$4:I383)-1,7),\" - \"&INDEX($B$4:$G$103,INT((ROWS(I$4:I383)-1)/7)+1,MOD(ROWS(I$4:I383)-1,7)),\"\")","v":"Scottrax - V-B/DQ7247"},null,null,{"$f":"INDEX($B$4:$G$103,INT((ROWS(I$4:I383)-1)/7)+1,MOD(ROWS(I$4:I383)-1,7))","v":"V-B/DQ7247"}]
[null,null,null,null,null,null,null,null,null,{"$f":"INDEX($A$4:$A$103,INT((ROWS(I$4:I384)-1)/7)+1)&IF(MOD(ROWS(I$4:I384)-1,7),\" - \"&INDEX($B$4:$G$103,INT((ROWS(I$4:I384)-1)/7)+1,MOD(ROWS(I$4:I384)-1,7)),\"\")","v":"Scottrax - R-B/DQ5325"},null,null,{"$f":"INDEX($B$4:$G$103,INT((ROWS(I$4:I384)-1)/7)+1,MOD(ROWS(I$4:I384)-1,7))","v":"R-B/DQ5325"}]
[null,null,null,null,null,null,null,null,null,{"$f":"INDEX($A$4:$A$103,INT((ROWS(I$4:I385)-1)/7)+1)&IF(MOD(ROWS(I$4:I385)-1,7),\" - \"&INDEX($B$4:$G$103,INT((ROWS(I$4:I385)-1)/7)+1,MOD(ROWS(I$4:I385)-1,7)),\"\")","v":"Scottrax - Y-I/DQ1428"},null,null,{"$f":"INDEX($B$4:$G$103,INT((ROWS(I$4:I385)-1)/7)+1,MOD(ROWS(I$4:I385)-1,7))","v":"Y-I/DQ1428"}]
[null,null,null,null,null,null,null,null,null,{"$f":"INDEX($A$4:$A$103,INT((ROWS(I$4:I386)-1)/7)+1)&IF(MOD(ROWS(I$4:I386)-1,7),\" - \"&INDEX($B$4:$G$103,INT((ROWS(I$4:I386)-1)/7)+1,MOD(ROWS(I$4:I386)-1,7)),\"\")","v":"Scottrax - R-P/DQ3760"},null,null,{"$f":"INDEX($B$4:$G$103,INT((ROWS(I$4:I386)-1)/7)+1,MOD(ROWS(I$4:I386)-1,7))","v":"R-P/DQ3760"}]
[null,null,null,null,null,null,null,null,null,{"$f":"INDEX($A$4:$A$103,INT((ROWS(I$4:I387)-1)/7)+1)&IF(MOD(ROWS(I$4:I387)-1,7),\" - \"&INDEX($B$4:$G$103,INT((ROWS(I$4:I387)-1)/7)+1,MOD(ROWS(I$4:I387)-1,7)),\"\")","v":"Scottrax - M-X/DQ6435"},null,null,{"$f":"INDEX($B$4:$G$103,INT((ROWS(I$4:I387)-1)/7)+1,MOD(ROWS(I$4:I387)-1,7))","v":"M-X/DQ6435"}]
[null,null,null,null,null,null,null,null,null,{"$f":"INDEX($A$4:$A$103,INT((ROWS(I$4:I388)-1)/7)+1)&IF(MOD(ROWS(I$4:I388)-1,7),\" - \"&INDEX($B$4:$G$103,INT((ROWS(I$4:I388)-1)/7)+1,MOD(ROWS(I$4:I388)-1,7)),\"\")","v":"Scottrax - U-O/DQ2357"},null,null,{"$f":"INDEX($B$4:$G$103,INT((ROWS(I$4:I388)-1)/7)+1,MOD(ROWS(I$4:I388)-1,7))","v":"U-O/DQ2357"}]
[null,null,null,null,null,null,null,null,null,{"$f":"INDEX($A$4:$A$103,INT((ROWS(I$4:I389)-1)/7)+1)&IF(MOD(ROWS(I$4:I389)-1,7),\" - \"&INDEX($B$4:$G$103,INT((ROWS(I$4:I389)-1)/7)+1,MOD(ROWS(I$4:I389)-1,7)),\"\")","v":"Home Ron"},null,null,{"$f":"INDEX($B$4:$G$103,INT((ROWS(I$4:I389)-1)/7)+1,MOD(ROWS(I$4:I389)-1,7))","v":{"$error":"#VALUE!"}}]
[null,null,null,null,null,null,null,null,null,{"$f":"INDEX($A$4:$A$103,INT((ROWS(I$4:I390)-1)/7)+1)&IF(MOD(ROWS(I$4:I390)-1,7),\" - \"&INDEX($B$4:$G$103,INT((ROWS(I$4:I390)-1)/7)+1,MOD(ROWS(I$4:I390)-1,7)),\"\")","v":"Home Ron - W-Q/DQ8964"},null,null,{"$f":"INDEX($B$4:$G$103,INT((ROWS(I$4:I390)-1)/7)+1,MOD(ROWS(I$4:I390)-1,7))","v":"W-Q/DQ8964"}]
[null,null,null,null,null,null,null,null,null,{"$f":"INDEX($A$4:$A$103,INT((ROWS(I$4:I391)-1)/7)+1)&IF(MOD(ROWS(I$4:I391)-1,7),\" - \"&INDEX($B$4:$G$103,INT((ROWS(I$4:I391)-1)/7)+1,MOD(ROWS(I$4:I391)-1,7)),\"\")","v":"Home Ron - B-X/DQ4767"},null,null,{"$f":"INDEX($B$4:$G$103,INT((ROWS(I$4:I391)-1)/7)+1,MOD(ROWS(I$4:I391)-1,7))","v":"B-X/DQ4767"}]
[null,null,null,null,null,null,null,null,null,{"$f":"INDEX($A$4:$A$103,INT((ROWS(I$4:I392)-1)/7)+1)&IF(MOD(ROWS(I$4:I392)-1,7),\" - \"&INDEX($B$4:$G$103,INT((ROWS(I$4:I392)-1)/7)+1,MOD(ROWS(I$4:I392)-1,7)),\"\")","v":"Home Ron - A-V/DQ6228"},null,null,{"$f":"INDEX($B$4:$G$103,INT((ROWS(I$4:I392)-1)/7)+1,MOD(ROWS(I$4:I392)-1,7))","v":"A-V/DQ6228"}]
[null,null,null,null,null,null,null,null,null,{"$f":"INDEX($A$4:$A$103,INT((ROWS(I$4:I393)-1)/7)+1)&IF(MOD(ROWS(I$4:I393)-1,7),\" - \"&INDEX($B$4:$G$103,INT((ROWS(I$4:I393)-1)/7)+1,MOD(ROWS(I$4:I393)-1,7)),\"\")","v":"Home Ron - I-T/DQ7745"},null,null,{"$f":"INDEX($B$4:$G$103,INT((ROWS(I$4:I393)-1)/7)+1,MOD(ROWS(I$4:I393)-1,7))","v":"I-T/DQ7745"}]
[null,null,null,null,null,null,null,null,null,{"$f":"INDEX($A$4:$A$103,INT((ROWS(I$4:I394)-1)/7)+1)&IF(MOD(ROWS(I$4:I394)-1,7),\" - \"&INDEX($B$4:$G$103,INT((ROWS(I$4:I394)-1)/7)+1,MOD(ROWS(I$4:I394)-1,7)),\"\")","v":"Home Ron - R-L/DQ1239"},null,null,{"$f":"INDEX($B$4:$G$103,INT((ROWS(I$4:I394)-1)/7)+1,MOD(ROWS(I$4:I394)-1,7))","v":"R-L/DQ1239"}]
[null,null,null,null,null,null,null,null,null,{"$f":"INDEX($A$4:$A$103,INT((ROWS(I$4:I395)-1)/7)+1)&IF(MOD(ROWS(I$4:I395)-1,7),\" - \"&INDEX($B$4:$G$103,INT((ROWS(I$4:I395)-1)/7)+1,MOD(ROWS(I$4:I395)-1,7)),\"\")","v":"Home Ron - Z-L/DQ1190"},null,null,{"$f":"INDEX($B$4:$G$103,INT((ROWS(I$4:I395)-1)/7)+1,MOD(ROWS(I$4:I395)-1,7))","v":"Z-L/DQ1190"}]
[null,null,null,null,null,null,null,null,null,{"$f":"INDEX($A$4:$A$103,INT((ROWS(I$4:I396)-1)/7)+1)&IF(MOD(ROWS(I$4:I396)-1,7),\" - \"&INDEX($B$4:$G$103,INT((ROWS(I$4:I396)-1)/7)+1,MOD(ROWS(I$4:I396)-1,7)),\"\")","v":"Mathtip"},null,null,{"$f":"INDEX($B$4:$G$103,INT((ROWS(I$4:I396)-1)/7)+1,MOD(ROWS(I$4:I396)-1,7))","v":{"$error":"#VALUE!"}}]
[null,null,null,null,null,null,null,null,null,{"$f":"INDEX($A$4:$A$103,INT((ROWS(I$4:I397)-1)/7)+1)&IF(MOD(ROWS(I$4:I397)-1,7),\" - \"&INDEX($B$4:$G$103,INT((ROWS(I$4:I397)-1)/7)+1,MOD(ROWS(I$4:I397)-1,7)),\"\")","v":"Mathtip - Q-Z/DQ9353"},null,null,{"$f":"INDEX($B$4:$G$103,INT((ROWS(I$4:I397)-1)/7)+1,MOD(ROWS(I$4:I397)-1,7))","v":"Q-Z/DQ9353"}]
[null,null,null,null,null,null,null,null,null,{"$f":"INDEX($A$4:$A$103,INT((ROWS(I$4:I398)-1)/7)+1)&IF(MOD(ROWS(I$4:I398)-1,7),\" - \"&INDEX($B$4:$G$103,INT((ROWS(I$4:I398)-1)/7)+1,MOD(ROWS(I$4:I398)-1,7)),\"\")","v":"Mathtip - U-E/DQ3079"},null,null,{"$f":"INDEX($B$4:$G$103,INT((ROWS(I$4:I398)-1)/7)+1,MOD(ROWS(I$4:I398)-1,7))","v":"U-E/DQ3079"}]
[null,null,null,null,null,null,null,null,null,{"$f":"INDEX($A$4:$A$103,INT((ROWS(I$4:I399)-1)/7)+1)&IF(MOD(ROWS(I$4:I399)-1,7),\" - \"&INDEX($B$4:$G$103,INT((ROWS(I$4:I399)-1)/7)+1,MOD(ROWS(I$4:I399)-1,7)),\"\")","v":"Mathtip - U-C/DQ9253"},null,null,{"$f":"INDEX($B$4:$G$103,INT((ROWS(I$4:I399)-1)/7)+1,MOD(ROWS(I$4:I399)-1,7))","v":"U-C/DQ9253"}]
[null,null,null,null,null,null,null,null,null,{"$f":"INDEX($A$4:$A$103,INT((ROWS(I$4:I400)-1)/7)+1)&IF(MOD(ROWS(I$4:I400)-1,7),\" - \"&INDEX($B$4:$G$103,INT((ROWS(I$4:I400)-1)/7)+1,MOD(ROWS(I$4:I400)-1,7)),\"\")","v":"Mathtip - U-I/DQ9502"},null,null,{"$f":"INDEX($B$4:$G$103,INT((ROWS(I$4:I400)-1)/7)+1,MOD(ROWS(I$4:I400)-1,7))","v":"U-I/DQ9502"}]
[null,null,null,null,null,null,null,null,null,{"$f":"INDEX($A$4:$A$103,INT((ROWS(I$4:I401)-1)/7)+1)&IF(MOD(ROWS(I$4:I401)-1,7),\" - \"&INDEX($B$4:$G$103,INT((ROWS(I$4:I401)-1)/7)+1,MOD(ROWS(I$4:I401)-1,7)),\"\")","v":"Mathtip - A-Z/DQ1514"},null,null,{"$f":"INDEX($B$4:$G$103,INT((ROWS(I$4:I401)-1)/7)+1,MOD(ROWS(I$4:I401)-1,7))","v":"A-Z/DQ1514"}]
[null,null,null,null,null,null,null,null,null,{"$f":"INDEX($A$4:$A$103,INT((ROWS(I$4:I402)-1)/7)+1)&IF(MOD(ROWS(I$4:I402)-1,7),\" - \"&INDEX($B$4:$G$103,INT((ROWS(I$4:I402)-1)/7)+1,MOD(ROWS(I$4:I402)-1,7)),\"\")","v":"Mathtip - F-H/DQ4922"},null,null,{"$f":"INDEX($B$4:$G$103,INT((ROWS(I$4:I402)-1)/7)+1,MOD(ROWS(I$4:I402)-1,7))","v":"F-H/DQ4922"}]
[null,null,null,null,null,null,null,null,null,{"$f":"INDEX($A$4:$A$103,INT((ROWS(I$4:I403)-1)/7)+1)&IF(MOD(ROWS(I$4:I403)-1,7),\" - \"&INDEX($B$4:$G$103,INT((ROWS(I$4:I403)-1)/7)+1,MOD(ROWS(I$4:I403)-1,7)),\"\")","v":"Quad Joytax"},null,null,{"$f":"INDEX($B$4:$G$103,INT((ROWS(I$4:I403)-1)/7)+1,MOD(ROWS(I$4:I403)-1,7))","v":{"$error":"#VALUE!"}}]
[null,null,null,null,null,null,null,null,null,{"$f":"INDEX($A$4:$A$103,INT((ROWS(I$4:I404)-1)/7)+1)&IF(MOD(ROWS(I$4:I404)-1,7),\" - \"&INDEX($B$4:$G$103,INT((ROWS(I$4:I404)-1)/7)+1,MOD(ROWS(I$4:I404)-1,7)),\"\")","v":"Quad Joytax - U-G/DQ9961"},null,null,{"$f":"INDEX($B$4:$G$103,INT((ROWS(I$4:I404)-1)/7)+1,MOD(ROWS(I$4:I404)-1,7))","v":"U-G/DQ9961"}]
[null,null,null,null,null,null,null,null,null,{"$f":"INDEX($A$4:$A$103,INT((ROWS(I$4:I405)-1)/7)+1)&IF(MOD(ROWS(I$4:I405)-1,7),\" - \"&INDEX($B$4:$G$103,INT((ROWS(I$4:I405)-1)/7)+1,MOD(ROWS(I$4:I405)-1,7)),\"\")","v":"Quad Joytax - O-N/DQ4189"},null,null,{"$f":"INDEX($B$4:$G$103,INT((ROWS(I$4:I405)-1)/7)+1,MOD(ROWS(I$4:I405)-1,7))","v":"O-N/DQ4189"}]
[null,null,null,null,null,null,null,null,null,{"$f":"INDEX($A$4:$A$103,INT((ROWS(I$4:I406)-1)/7)+1)&IF(MOD(ROWS(I$4:I406)-1,7),\" - \"&INDEX($B$4:$G$103,INT((ROWS(I$4:I406)-1)/7)+1,MOD(ROWS(I$4:I406)-1,7)),\"\")","v":"Quad Joytax - R-C/DQ7978"},null,null,{"$f":"INDEX($B$4:$G$103,INT((ROWS(I$4:I406)-1)/7)+1,MOD(ROWS(I$4:I406)-1,7))","v":"R-C/DQ7978"}]
[null,null,null,null,null,null,null,null,null,{"$f":"INDEX($A$4:$A$103,INT((ROWS(I$4:I407)-1)/7)+1)&IF(MOD(ROWS(I$4:I407)-1,7),\" - \"&INDEX($B$4:$G$103,INT((ROWS(I$4:I407)-1)/7)+1,MOD(ROWS(I$4:I407)-1,7)),\"\")","v":"Quad Joytax - X-B/DQ4884"},null,null,{"$f":"INDEX($B$4:$G$103,INT((ROWS(I$4:I407)-1)/7)+1,MOD(ROWS(I$4:I407)-1,7))","v":"X-B/DQ4884"}]
[null,null,null,null,null,null,null,null,null,{"$f":"INDEX($A$4:$A$103,INT((ROWS(I$4:I408)-1)/7)+1)&IF(MOD(ROWS(I$4:I408)-1,7),\" - \"&INDEX($B$4:$G$103,INT((ROWS(I$4:I408)-1)/7)+1,MOD(ROWS(I$4:I408)-1,7)),\"\")","v":"Quad Joytax - V-P/DQ6114"},null,null,{"$f":"INDEX($B$4:$G$103,INT((ROWS(I$4:I408)-1)/7)+1,MOD(ROWS(I$4:I408)-1,7))","v":"V-P/DQ6114"}]
[null,null,null,null,null,null,null,null,null,{"$f":"INDEX($A$4:$A$103,INT((ROWS(I$4:I409)-1)/7)+1)&IF(MOD(ROWS(I$4:I409)-1,7),\" - \"&INDEX($B$4:$G$103,INT((ROWS(I$4:I409)-1)/7)+1,MOD(ROWS(I$4:I409)-1,7)),\"\")","v":"Quad Joytax - P-B/DQ6522"},null,null,{"$f":"INDEX($B$4:$G$103,INT((ROWS(I$4:I409)-1)/7)+1,MOD(ROWS(I$4:I409)-1,7))","v":"P-B/DQ6522"}]
[null,null,null,null,null,null,null,null,null,{"$f":"INDEX($A$4:$A$103,INT((ROWS(I$4:I410)-1)/7)+1)&IF(MOD(ROWS(I$4:I410)-1,7),\" - \"&INDEX($B$4:$G$103,INT((ROWS(I$4:I410)-1)/7)+1,MOD(ROWS(I$4:I410)-1,7)),\"\")","v":"Quotejob"},null,null,{"$f":"INDEX($B$4:$G$103,INT((ROWS(I$4:I410)-1)/7)+1,MOD(ROWS(I$4:I410)-1,7))","v":{"$error":"#VALUE!"}}]
[null,null,null,null,null,null,null,null,null,{"$f":"INDEX($A$4:$A$103,INT((ROWS(I$4:I411)-1)/7)+1)&IF(MOD(ROWS(I$4:I411)-1,7),\" - \"&INDEX($B$4:$G$103,INT((ROWS(I$4:I411)-1)/7)+1,MOD(ROWS(I$4:I411)-1,7)),\"\")","v":"Quotejob - A-L/DQ2468"},null,null,{"$f":"INDEX($B$4:$G$103,INT((ROWS(I$4:I411)-1)/7)+1,MOD(ROWS(I$4:I411)-1,7))","v":"A-L/DQ2468"}]
[null,null,null,null,null,null,null,null,null,{"$f":"INDEX($A$4:$A$103,INT((ROWS(I$4:I412)-1)/7)+1)&IF(MOD(ROWS(I$4:I412)-1,7),\" - \"&INDEX($B$4:$G$103,INT((ROWS(I$4:I412)-1)/7)+1,MOD(ROWS(I$4:I412)-1,7)),\"\")","v":"Quotejob - G-J/DQ5678"},null,null,{"$f":"INDEX($B$4:$G$103,INT((ROWS(I$4:I412)-1)/7)+1,MOD(ROWS(I$4:I412)-1,7))","v":"G-J/DQ5678"}]
[null,null,null,null,null,null,null,null,null,{"$f":"INDEX($A$4:$A$103,INT((ROWS(I$4:I413)-1)/7)+1)&IF(MOD(ROWS(I$4:I413)-1,7),\" - \"&INDEX($B$4:$G$103,INT((ROWS(I$4:I413)-1)/7)+1,MOD(ROWS(I$4:I413)-1,7)),\"\")","v":"Quotejob - H-P/DQ9164"},null,null,{"$f":"INDEX($B$4:$G$103,INT((ROWS(I$4:I413)-1)/7)+1,MOD(ROWS(I$4:I413)-1,7))","v":"H-P/DQ9164"}]
[null,null,null,null,null,null,null,null,null,{"$f":"INDEX($A$4:$A$103,INT((ROWS(I$4:I414)-1)/7)+1)&IF(MOD(ROWS(I$4:I414)-1,7),\" - \"&INDEX($B$4:$G$103,INT((ROWS(I$4:I414)-1)/7)+1,MOD(ROWS(I$4:I414)-1,7)),\"\")","v":"Quotejob - C-G/DQ5033"},null,null,{"$f":"INDEX($B$4:$G$103,INT((ROWS(I$4:I414)-1)/7)+1,MOD(ROWS(I$4:I414)-1,7))","v":"C-G/DQ5033"}]
[null,null,null,null,null,null,null,null,null,{"$f":"INDEX($A$4:$A$103,INT((ROWS(I$4:I415)-1)/7)+1)&IF(MOD(ROWS(I$4:I415)-1,7),\" - \"&INDEX($B$4:$G$103,INT((ROWS(I$4:I415)-1)/7)+1,MOD(ROWS(I$4:I415)-1,7)),\"\")","v":"Quotejob - H-E/DQ7018"},null,null,{"$f":"INDEX($B$4:$G$103,INT((ROWS(I$4:I415)-1)/7)+1,MOD(ROWS(I$4:I415)-1,7))","v":"H-E/DQ7018"}]
[null,null,null,null,null,null,null,null,null,{"$f":"INDEX($A$4:$A$103,INT((ROWS(I$4:I416)-1)/7)+1)&IF(MOD(ROWS(I$4:I416)-1,7),\" - \"&INDEX($B$4:$G$103,INT((ROWS(I$4:I416)-1)/7)+1,MOD(ROWS(I$4:I416)-1,7)),\"\")","v":"Quotejob - X-Z/DQ7564"},null,null,{"$f":"INDEX($B$4:$G$103,INT((ROWS(I$4:I416)-1)/7)+1,MOD(ROWS(I$4:I416)-1,7))","v":"X-Z/DQ7564"}]
[null,null,null,null,null,null,null,null,null,{"$f":"INDEX($A$4:$A$103,INT((ROWS(I$4:I417)-1)/7)+1)&IF(MOD(ROWS(I$4:I417)-1,7),\" - \"&INDEX($B$4:$G$103,INT((ROWS(I$4:I417)-1)/7)+1,MOD(ROWS(I$4:I417)-1,7)),\"\")","v":"Zen Strong"},null,null,{"$f":"INDEX($B$4:$G$103,INT((ROWS(I$4:I417)-1)/7)+1,MOD(ROWS(I$4:I417)-1,7))","v":{"$error":"#VALUE!"}}]
[null,null,null,null,null,null,null,null,null,{"$f":"INDEX($A$4:$A$103,INT((ROWS(I$4:I418)-1)/7)+1)&IF(MOD(ROWS(I$4:I418)-1,7),\" - \"&INDEX($B$4:$G$103,INT((ROWS(I$4:I418)-1)/7)+1,MOD(ROWS(I$4:I418)-1,7)),\"\")","v":"Zen Strong - B-N/DQ7372"},null,null,{"$f":"INDEX($B$4:$G$103,INT((ROWS(I$4:I418)-1)/7)+1,MOD(ROWS(I$4:I418)-1,7))","v":"B-N/DQ7372"}]
[null,null,null,null,null,null,null,null,null,{"$f":"INDEX($A$4:$A$103,INT((ROWS(I$4:I419)-1)/7)+1)&IF(MOD(ROWS(I$4:I419)-1,7),\" - \"&INDEX($B$4:$G$103,INT((ROWS(I$4:I419)-1)/7)+1,MOD(ROWS(I$4:I419)-1,7)),\"\")","v":"Zen Strong - C-E/DQ2712"},null,null,{"$f":"INDEX($B$4:$G$103,INT((ROWS(I$4:I419)-1)/7)+1,MOD(ROWS(I$4:I419)-1,7))","v":"C-E/DQ2712"}]
[null,null,null,null,null,null,null,null,null,{"$f":"INDEX($A$4:$A$103,INT((ROWS(I$4:I420)-1)/7)+1)&IF(MOD(ROWS(I$4:I420)-1,7),\" - \"&INDEX($B$4:$G$103,INT((ROWS(I$4:I420)-1)/7)+1,MOD(ROWS(I$4:I420)-1,7)),\"\")","v":"Zen Strong - W-Y/DQ2767"},null,null,{"$f":"INDEX($B$4:$G$103,INT((ROWS(I$4:I420)-1)/7)+1,MOD(ROWS(I$4:I420)-1,7))","v":"W-Y/DQ2767"}]
[null,null,null,null,null,null,null,null,null,{"$f":"INDEX($A$4:$A$103,INT((ROWS(I$4:I421)-1)/7)+1)&IF(MOD(ROWS(I$4:I421)-1,7),\" - \"&INDEX($B$4:$G$103,INT((ROWS(I$4:I421)-1)/7)+1,MOD(ROWS(I$4:I421)-1,7)),\"\")","v":"Zen Strong - Q-K/DQ8866"},null,null,{"$f":"INDEX($B$4:$G$103,INT((ROWS(I$4:I421)-1)/7)+1,MOD(ROWS(I$4:I421)-1,7))","v":"Q-K/DQ8866"}]
[null,null,null,null,null,null,null,null,null,{"$f":"INDEX($A$4:$A$103,INT((ROWS(I$4:I422)-1)/7)+1)&IF(MOD(ROWS(I$4:I422)-1,7),\" - \"&INDEX($B$4:$G$103,INT((ROWS(I$4:I422)-1)/7)+1,MOD(ROWS(I$4:I422)-1,7)),\"\")","v":"Zen Strong - H-Y/DQ3836"},null,null,{"$f":"INDEX($B$4:$G$103,INT((ROWS(I$4:I422)-1)/7)+1,MOD(ROWS(I$4:I422)-1,7))","v":"H-Y/DQ3836"}]
[null,null,null,null,null,null,null,null,null,{"$f":"INDEX($A$4:$A$103,INT((ROWS(I$4:I423)-1)/7)+1)&IF(MOD(ROWS(I$4:I423)-1,7),\" - \"&INDEX($B$4:$G$103,INT((ROWS(I$4:I423)-1)/7)+1,MOD(ROWS(I$4:I423)-1,7)),\"\")","v":"Zen Strong - K-I/DQ2152"},null,null,{"$f":"INDEX($B$4:$G$103,INT((ROWS(I$4:I423)-1)/7)+1,MOD(ROWS(I$4:I423)-1,7))","v":"K-I/DQ2152"}]
[null,null,null,null,null,null,null,null,null,{"$f":"INDEX($A$4:$A$103,INT((ROWS(I$4:I424)-1)/7)+1)&IF(MOD(ROWS(I$4:I424)-1,7),\" - \"&INDEX($B$4:$G$103,INT((ROWS(I$4:I424)-1)/7)+1,MOD(ROWS(I$4:I424)-1,7)),\"\")","v":"Stock Touch"},null,null,{"$f":"INDEX($B$4:$G$103,INT((ROWS(I$4:I424)-1)/7)+1,MOD(ROWS(I$4:I424)-1,7))","v":{"$error":"#VALUE!"}}]
[null,null,null,null,null,null,null,null,null,{"$f":"INDEX($A$4:$A$103,INT((ROWS(I$4:I425)-1)/7)+1)&IF(MOD(ROWS(I$4:I425)-1,7),\" - \"&INDEX($B$4:$G$103,INT((ROWS(I$4:I425)-1)/7)+1,MOD(ROWS(I$4:I425)-1,7)),\"\")","v":"Stock Touch - V-B/DQ6141"},null,null,{"$f":"INDEX($B$4:$G$103,INT((ROWS(I$4:I425)-1)/7)+1,MOD(ROWS(I$4:I425)-1,7))","v":"V-B/DQ6141"}]
[null,null,null,null,null,null,null,null,null,{"$f":"INDEX($A$4:$A$103,INT((ROWS(I$4:I426)-1)/7)+1)&IF(MOD(ROWS(I$4:I426)-1,7),\" - \"&INDEX($B$4:$G$103,INT((ROWS(I$4:I426)-1)/7)+1,MOD(ROWS(I$4:I426)-1,7)),\"\")","v":"Stock Touch - F-K/DQ9978"},null,null,{"$f":"INDEX($B$4:$G$103,INT((ROWS(I$4:I426)-1)/7)+1,MOD(ROWS(I$4:I426)-1,7))","v":"F-K/DQ9978"}]
[null,null,null,null,null,null,null,null,null,{"$f":"INDEX($A$4:$A$103,INT((ROWS(I$4:I427)-1)/7)+1)&IF(MOD(ROWS(I$4:I427)-1,7),\" - \"&INDEX($B$4:$G$103,INT((ROWS(I$4:I427)-1)/7)+1,MOD(ROWS(I$4:I427)-1,7)),\"\")","v":"Stock Touch - G-T/DQ4323"},null,null,{"$f":"INDEX($B$4:$G$103,INT((ROWS(I$4:I427)-1)/7)+1,MOD(ROWS(I$4:I427)-1,7))","v":"G-T/DQ4323"}]
[null,null,null,null,null,null,null,null,null,{"$f":"INDEX($A$4:$A$103,INT((ROWS(I$4:I428)-1)/7)+1)&IF(MOD(ROWS(I$4:I428)-1,7),\" - \"&INDEX($B$4:$G$103,INT((ROWS(I$4:I428)-1)/7)+1,MOD(ROWS(I$4:I428)-1,7)),\"\")","v":"Stock Touch - E-G/DQ1291"},null,null,{"$f":"INDEX($B$4:$G$103,INT((ROWS(I$4:I428)-1)/7)+1,MOD(ROWS(I$4:I428)-1,7))","v":"E-G/DQ1291"}]
[null,null,null,null,null,null,null,null,null,{"$f":"INDEX($A$4:$A$103,INT((ROWS(I$4:I429)-1)/7)+1)&IF(MOD(ROWS(I$4:I429)-1,7),\" - \"&INDEX($B$4:$G$103,INT((ROWS(I$4:I429)-1)/7)+1,MOD(ROWS(I$4:I429)-1,7)),\"\")","v":"Stock Touch - Q-N/DQ9494"},null,null,{"$f":"INDEX($B$4:$G$103,INT((ROWS(I$4:I429)-1)/7)+1,MOD(ROWS(I$4:I429)-1,7))","v":"Q-N/DQ9494"}]
[null,null,null,null,null,null,null,null,null,{"$f":"INDEX($A$4:$A$103,INT((ROWS(I$4:I430)-1)/7)+1)&IF(MOD(ROWS(I$4:I430)-1,7),\" - \"&INDEX($B$4:$G$103,INT((ROWS(I$4:I430)-1)/7)+1,MOD(ROWS(I$4:I430)-1,7)),\"\")","v":"Stock Touch - X-A/DQ3304"},null,null,{"$f":"INDEX($B$4:$G$103,INT((ROWS(I$4:I430)-1)/7)+1,MOD(ROWS(I$4:I430)-1,7))","v":"X-A/DQ3304"}]
[null,null,null,null,null,null,null,null,null,{"$f":"INDEX($A$4:$A$103,INT((ROWS(I$4:I431)-1)/7)+1)&IF(MOD(ROWS(I$4:I431)-1,7),\" - \"&INDEX($B$4:$G$103,INT((ROWS(I$4:I431)-1)/7)+1,MOD(ROWS(I$4:I431)-1,7)),\"\")","v":"Stockdox"},null,null,{"$f":"INDEX($B$4:$G$103,INT((ROWS(I$4:I431)-1)/7)+1,MOD(ROWS(I$4:I431)-1,7))","v":{"$error":"#VALUE!"}}]
[null,null,null,null,null,null,null,null,null,{"$f":"INDEX($A$4:$A$103,INT((ROWS(I$4:I432)-1)/7)+1)&IF(MOD(ROWS(I$4:I432)-1,7),\" - \"&INDEX($B$4:$G$103,INT((ROWS(I$4:I432)-1)/7)+1,MOD(ROWS(I$4:I432)-1,7)),\"\")","v":"Stockdox - G-J/DQ1262"},null,null,{"$f":"INDEX($B$4:$G$103,INT((ROWS(I$4:I432)-1)/7)+1,MOD(ROWS(I$4:I432)-1,7))","v":"G-J/DQ1262"}]
[null,null,null,null,null,null,null,null,null,{"$f":"INDEX($A$4:$A$103,INT((ROWS(I$4:I433)-1)/7)+1)&IF(MOD(ROWS(I$4:I433)-1,7),\" - \"&INDEX($B$4:$G$103,INT((ROWS(I$4:I433)-1)/7)+1,MOD(ROWS(I$4:I433)-1,7)),\"\")","v":"Stockdox - M-E/DQ9467"},null,null,{"$f":"INDEX($B$4:$G$103,INT((ROWS(I$4:I433)-1)/7)+1,MOD(ROWS(I$4:I433)-1,7))","v":"M-E/DQ9467"}]
[null,null,null,null,null,null,null,null,null,{"$f":"INDEX($A$4:$A$103,INT((ROWS(I$4:I434)-1)/7)+1)&IF(MOD(ROWS(I$4:I434)-1,7),\" - \"&INDEX($B$4:$G$103,INT((ROWS(I$4:I434)-1)/7)+1,MOD(ROWS(I$4:I434)-1,7)),\"\")","v":"Stockdox - T-M/DQ6911"},null,null,{"$f":"INDEX($B$4:$G$103,INT((ROWS(I$4:I434)-1)/7)+1,MOD(ROWS(I$4:I434)-1,7))","v":"T-M/DQ6911"}]
[null,null,null,null,null,null,null,null,null,{"$f":"INDEX($A$4:$A$103,INT((ROWS(I$4:I435)-1)/7)+1)&IF(MOD(ROWS(I$4:I435)-1,7),\" - \"&INDEX($B$4:$G$103,INT((ROWS(I$4:I435)-1)/7)+1,MOD(ROWS(I$4:I435)-1,7)),\"\")","v":"Stockdox - V-W/DQ3008"},null,null,{"$f":"INDEX($B$4:$G$103,INT((ROWS(I$4:I435)-1)/7)+1,MOD(ROWS(I$4:I435)-1,7))","v":"V-W/DQ3008"}]
[null,null,null,null,null,null,null,null,null,{"$f":"INDEX($A$4:$A$103,INT((ROWS(I$4:I436)-1)/7)+1)&IF(MOD(ROWS(I$4:I436)-1,7),\" - \"&INDEX($B$4:$G$103,INT((ROWS(I$4:I436)-1)/7)+1,MOD(ROWS(I$4:I436)-1,7)),\"\")","v":"Stockdox - J-Q/DQ4683"},null,null,{"$f":"INDEX($B$4:$G$103,INT((ROWS(I$4:I436)-1)/7)+1,MOD(ROWS(I$4:I436)-1,7))","v":"J-Q/DQ4683"}]
[null,null,null,null,null,null,null,null,null,{"$f":"INDEX($A$4:$A$103,INT((ROWS(I$4:I437)-1)/7)+1)&IF(MOD(ROWS(I$4:I437)-1,7),\" - \"&INDEX($B$4:$G$103,INT((ROWS(I$4:I437)-1)/7)+1,MOD(ROWS(I$4:I437)-1,7)),\"\")","v":"Stockdox - W-D/DQ1503"},null,null,{"$f":"INDEX($B$4:$G$103,INT((ROWS(I$4:I437)-1)/7)+1,MOD(ROWS(I$4:I437)-1,7))","v":"W-D/DQ1503"}]
[null,null,null,null,null,null,null,null,null,{"$f":"INDEX($A$4:$A$103,INT((ROWS(I$4:I438)-1)/7)+1)&IF(MOD(ROWS(I$4:I438)-1,7),\" - \"&INDEX($B$4:$G$103,INT((ROWS(I$4:I438)-1)/7)+1,MOD(ROWS(I$4:I438)-1,7)),\"\")","v":"Y- Lax"},null,null,{"$f":"INDEX($B$4:$G$103,INT((ROWS(I$4:I438)-1)/7)+1,MOD(ROWS(I$4:I438)-1,7))","v":{"$error":"#VALUE!"}}]
[null,null,null,null,null,null,null,null,null,{"$f":"INDEX($A$4:$A$103,INT((ROWS(I$4:I439)-1)/7)+1)&IF(MOD(ROWS(I$4:I439)-1,7),\" - \"&INDEX($B$4:$G$103,INT((ROWS(I$4:I439)-1)/7)+1,MOD(ROWS(I$4:I439)-1,7)),\"\")","v":"Y- Lax - L-W/DQ7254"},null,null,{"$f":"INDEX($B$4:$G$103,INT((ROWS(I$4:I439)-1)/7)+1,MOD(ROWS(I$4:I439)-1,7))","v":"L-W/DQ7254"}]
[null,null,null,null,null,null,null,null,null,{"$f":"INDEX($A$4:$A$103,INT((ROWS(I$4:I440)-1)/7)+1)&IF(MOD(ROWS(I$4:I440)-1,7),\" - \"&INDEX($B$4:$G$103,INT((ROWS(I$4:I440)-1)/7)+1,MOD(ROWS(I$4:I440)-1,7)),\"\")","v":"Y- Lax - S-I/DQ5658"},null,null,{"$f":"INDEX($B$4:$G$103,INT((ROWS(I$4:I440)-1)/7)+1,MOD(ROWS(I$4:I440)-1,7))","v":"S-I/DQ5658"}]
[null,null,null,null,null,null,null,null,null,{"$f":"INDEX($A$4:$A$103,INT((ROWS(I$4:I441)-1)/7)+1)&IF(MOD(ROWS(I$4:I441)-1,7),\" - \"&INDEX($B$4:$G$103,INT((ROWS(I$4:I441)-1)/7)+1,MOD(ROWS(I$4:I441)-1,7)),\"\")","v":"Y- Lax - V-Z/DQ8574"},null,null,{"$f":"INDEX($B$4:$G$103,INT((ROWS(I$4:I441)-1)/7)+1,MOD(ROWS(I$4:I441)-1,7))","v":"V-Z/DQ8574"}]
[null,null,null,null,null,null,null,null,null,{"$f":"INDEX($A$4:$A$103,INT((ROWS(I$4:I442)-1)/7)+1)&IF(MOD(ROWS(I$4:I442)-1,7),\" - \"&INDEX($B$4:$G$103,INT((ROWS(I$4:I442)-1)/7)+1,MOD(ROWS(I$4:I442)-1,7)),\"\")","v":"Y- Lax - A-L/DQ9394"},null,null,{"$f":"INDEX($B$4:$G$103,INT((ROWS(I$4:I442)-1)/7)+1,MOD(ROWS(I$4:I442)-1,7))","v":"A-L/DQ9394"}]
[null,null,null,null,null,null,null,null,null,{"$f":"INDEX($A$4:$A$103,INT((ROWS(I$4:I443)-1)/7)+1)&IF(MOD(ROWS(I$4:I443)-1,7),\" - \"&INDEX($B$4:$G$103,INT((ROWS(I$4:I443)-1)/7)+1,MOD(ROWS(I$4:I443)-1,7)),\"\")","v":"Y- Lax - I-O/DQ2393"},null,null,{"$f":"INDEX($B$4:$G$103,INT((ROWS(I$4:I443)-1)/7)+1,MOD(ROWS(I$4:I443)-1,7))","v":"I-O/DQ2393"}]
[null,null,null,null,null,null,null,null,null,{"$f":"INDEX($A$4:$A$103,INT((ROWS(I$4:I444)-1)/7)+1)&IF(MOD(ROWS(I$4:I444)-1,7),\" - \"&INDEX($B$4:$G$103,INT((ROWS(I$4:I444)-1)/7)+1,MOD(ROWS(I$4:I444)-1,7)),\"\")","v":"Y- Lax - E-U/DQ4627"},null,null,{"$f":"INDEX($B$4:$G$103,INT((ROWS(I$4:I444)-1)/7)+1,MOD(ROWS(I$4:I444)-1,7))","v":"E-U/DQ4627"}]
[null,null,null,null,null,null,null,null,null,{"$f":"INDEX($A$4:$A$103,INT((ROWS(I$4:I445)-1)/7)+1)&IF(MOD(ROWS(I$4:I445)-1,7),\" - \"&INDEX($B$4:$G$103,INT((ROWS(I$4:I445)-1)/7)+1,MOD(ROWS(I$4:I445)-1,7)),\"\")","v":"Duolux"},null,null,{"$f":"INDEX($B$4:$G$103,INT((ROWS(I$4:I445)-1)/7)+1,MOD(ROWS(I$4:I445)-1,7))","v":{"$error":"#VALUE!"}}]
[null,null,null,null,null,null,null,null,null,{"$f":"INDEX($A$4:$A$103,INT((ROWS(I$4:I446)-1)/7)+1)&IF(MOD(ROWS(I$4:I446)-1,7),\" - \"&INDEX($B$4:$G$103,INT((ROWS(I$4:I446)-1)/7)+1,MOD(ROWS(I$4:I446)-1,7)),\"\")","v":"Duolux - W-H/DQ3557"},null,null,{"$f":"INDEX($B$4:$G$103,INT((ROWS(I$4:I446)-1)/7)+1,MOD(ROWS(I$4:I446)-1,7))","v":"W-H/DQ3557"}]
[null,null,null,null,null,null,null,null,null,{"$f":"INDEX($A$4:$A$103,INT((ROWS(I$4:I447)-1)/7)+1)&IF(MOD(ROWS(I$4:I447)-1,7),\" - \"&INDEX($B$4:$G$103,INT((ROWS(I$4:I447)-1)/7)+1,MOD(ROWS(I$4:I447)-1,7)),\"\")","v":"Duolux - N-L/DQ2999"},null,null,{"$f":"INDEX($B$4:$G$103,INT((ROWS(I$4:I447)-1)/7)+1,MOD(ROWS(I$4:I447)-1,7))","v":"N-L/DQ2999"}]
[null,null,null,null,null,null,null,null,null,{"$f":"INDEX($A$4:$A$103,INT((ROWS(I$4:I448)-1)/7)+1)&IF(MOD(ROWS(I$4:I448)-1,7),\" - \"&INDEX($B$4:$G$103,INT((ROWS(I$4:I448)-1)/7)+1,MOD(ROWS(I$4:I448)-1,7)),\"\")","v":"Duolux - F-C/DQ1983"},null,null,{"$f":"INDEX($B$4:$G$103,INT((ROWS(I$4:I448)-1)/7)+1,MOD(ROWS(I$4:I448)-1,7))","v":"F-C/DQ1983"}]
[null,null,null,null,null,null,null,null,null,{"$f":"INDEX($A$4:$A$103,INT((ROWS(I$4:I449)-1)/7)+1)&IF(MOD(ROWS(I$4:I449)-1,7),\" - \"&INDEX($B$4:$G$103,INT((ROWS(I$4:I449)-1)/7)+1,MOD(ROWS(I$4:I449)-1,7)),\"\")","v":"Duolux - X-Q/DQ9087"},null,null,{"$f":"INDEX($B$4:$G$103,INT((ROWS(I$4:I449)-1)/7)+1,MOD(ROWS(I$4:I449)-1,7))","v":"X-Q/DQ9087"}]
[null,null,null,null,null,null,null,null,null,{"$f":"INDEX($A$4:$A$103,INT((ROWS(I$4:I450)-1)/7)+1)&IF(MOD(ROWS(I$4:I450)-1,7),\" - \"&INDEX($B$4:$G$103,INT((ROWS(I$4:I450)-1)/7)+1,MOD(ROWS(I$4:I450)-1,7)),\"\")","v":"Duolux - J-X/DQ8959"},null,null,{"$f":"INDEX($B$4:$G$103,INT((ROWS(I$4:I450)-1)/7)+1,MOD(ROWS(I$4:I450)-1,7))","v":"J-X/DQ8959"}]
[null,null,null,null,null,null,null,null,null,{"$f":"INDEX($A$4:$A$103,INT((ROWS(I$4:I451)-1)/7)+1)&IF(MOD(ROWS(I$4:I451)-1,7),\" - \"&INDEX($B$4:$G$103,INT((ROWS(I$4:I451)-1)/7)+1,MOD(ROWS(I$4:I451)-1,7)),\"\")","v":"Duolux - Z-V/DQ3936"},null,null,{"$f":"INDEX($B$4:$G$103,INT((ROWS(I$4:I451)-1)/7)+1,MOD(ROWS(I$4:I451)-1,7))","v":"Z-V/DQ3936"}]
[null,null,null,null,null,null,null,null,null,{"$f":"INDEX($A$4:$A$103,INT((ROWS(I$4:I452)-1)/7)+1)&IF(MOD(ROWS(I$4:I452)-1,7),\" - \"&INDEX($B$4:$G$103,INT((ROWS(I$4:I452)-1)/7)+1,MOD(ROWS(I$4:I452)-1,7)),\"\")","v":"Biofresh"},null,null,{"$f":"INDEX($B$4:$G$103,INT((ROWS(I$4:I452)-1)/7)+1,MOD(ROWS(I$4:I452)-1,7))","v":{"$error":"#VALUE!"}}]
[null,null,null,null,null,null,null,null,null,{"$f":"INDEX($A$4:$A$103,INT((ROWS(I$4:I453)-1)/7)+1)&IF(MOD(ROWS(I$4:I453)-1,7),\" - \"&INDEX($B$4:$G$103,INT((ROWS(I$4:I453)-1)/7)+1,MOD(ROWS(I$4:I453)-1,7)),\"\")","v":"Biofresh - L-A/DQ6923"},null,null,{"$f":"INDEX($B$4:$G$103,INT((ROWS(I$4:I453)-1)/7)+1,MOD(ROWS(I$4:I453)-1,7))","v":"L-A/DQ6923"}]
[null,null,null,null,null,null,null,null,null,{"$f":"INDEX($A$4:$A$103,INT((ROWS(I$4:I454)-1)/7)+1)&IF(MOD(ROWS(I$4:I454)-1,7),\" - \"&INDEX($B$4:$G$103,INT((ROWS(I$4:I454)-1)/7)+1,MOD(ROWS(I$4:I454)-1,7)),\"\")","v":"Biofresh - U-X/DQ7740"},null,null,{"$f":"INDEX($B$4:$G$103,INT((ROWS(I$4:I454)-1)/7)+1,MOD(ROWS(I$4:I454)-1,7))","v":"U-X/DQ7740"}]
[null,null,null,null,null,null,null,null,null,{"$f":"INDEX($A$4:$A$103,INT((ROWS(I$4:I455)-1)/7)+1)&IF(MOD(ROWS(I$4:I455)-1,7),\" - \"&INDEX($B$4:$G$103,INT((ROWS(I$4:I455)-1)/7)+1,MOD(ROWS(I$4:I455)-1,7)),\"\")","v":"Biofresh - H-S/DQ8103"},null,null,{"$f":"INDEX($B$4:$G$103,INT((ROWS(I$4:I455)-1)/7)+1,MOD(ROWS(I$4:I455)-1,7))","v":"H-S/DQ8103"}]
[null,null,null,null,null,null,null,null,null,{"$f":"INDEX($A$4:$A$103,INT((ROWS(I$4:I456)-1)/7)+1)&IF(MOD(ROWS(I$4:I456)-1,7),\" - \"&INDEX($B$4:$G$103,INT((ROWS(I$4:I456)-1)/7)+1,MOD(ROWS(I$4:I456)-1,7)),\"\")","v":"Biofresh - C-E/DQ2233"},null,null,{"$f":"INDEX($B$4:$G$103,INT((ROWS(I$4:I456)-1)/7)+1,MOD(ROWS(I$4:I456)-1,7))","v":"C-E/DQ2233"}]
[null,null,null,null,null,null,null,null,null,{"$f":"INDEX($A$4:$A$103,INT((ROWS(I$4:I457)-1)/7)+1)&IF(MOD(ROWS(I$4:I457)-1,7),\" - \"&INDEX($B$4:$G$103,INT((ROWS(I$4:I457)-1)/7)+1,MOD(ROWS(I$4:I457)-1,7)),\"\")","v":"Biofresh - O-I/DQ5625"},null,null,{"$f":"INDEX($B$4:$G$103,INT((ROWS(I$4:I457)-1)/7)+1,MOD(ROWS(I$4:I457)-1,7))","v":"O-I/DQ5625"}]
[null,null,null,null,null,null,null,null,null,{"$f":"INDEX($A$4:$A$103,INT((ROWS(I$4:I458)-1)/7)+1)&IF(MOD(ROWS(I$4:I458)-1,7),\" - \"&INDEX($B$4:$G$103,INT((ROWS(I$4:I458)-1)/7)+1,MOD(ROWS(I$4:I458)-1,7)),\"\")","v":"Biofresh - F-G/DQ6422"},null,null,{"$f":"INDEX($B$4:$G$103,INT((ROWS(I$4:I458)-1)/7)+1,MOD(ROWS(I$4:I458)-1,7))","v":"F-G/DQ6422"}]
[null,null,null,null,null,null,null,null,null,{"$f":"INDEX($A$4:$A$103,INT((ROWS(I$4:I459)-1)/7)+1)&IF(MOD(ROWS(I$4:I459)-1,7),\" - \"&INDEX($B$4:$G$103,INT((ROWS(I$4:I459)-1)/7)+1,MOD(ROWS(I$4:I459)-1,7)),\"\")","v":"Lam-Find"},null,null,{"$f":"INDEX($B$4:$G$103,INT((ROWS(I$4:I459)-1)/7)+1,MOD(ROWS(I$4:I459)-1,7))","v":{"$error":"#VALUE!"}}]
[null,null,null,null,null,null,null,null,null,{"$f":"INDEX($A$4:$A$103,INT((ROWS(I$4:I460)-1)/7)+1)&IF(MOD(ROWS(I$4:I460)-1,7),\" - \"&INDEX($B$4:$G$103,INT((ROWS(I$4:I460)-1)/7)+1,MOD(ROWS(I$4:I460)-1,7)),\"\")","v":"Lam-Find - L-B/DQ6600"},null,null,{"$f":"INDEX($B$4:$G$103,INT((ROWS(I$4:I460)-1)/7)+1,MOD(ROWS(I$4:I460)-1,7))","v":"L-B/DQ6600"}]
[null,null,null,null,null,null,null,null,null,{"$f":"INDEX($A$4:$A$103,INT((ROWS(I$4:I461)-1)/7)+1)&IF(MOD(ROWS(I$4:I461)-1,7),\" - \"&INDEX($B$4:$G$103,INT((ROWS(I$4:I461)-1)/7)+1,MOD(ROWS(I$4:I461)-1,7)),\"\")","v":"Lam-Find - J-J/DQ6636"},null,null,{"$f":"INDEX($B$4:$G$103,INT((ROWS(I$4:I461)-1)/7)+1,MOD(ROWS(I$4:I461)-1,7))","v":"J-J/DQ6636"}]
[null,null,null,null,null,null,null,null,null,{"$f":"INDEX($A$4:$A$103,INT((ROWS(I$4:I462)-1)/7)+1)&IF(MOD(ROWS(I$4:I462)-1,7),\" - \"&INDEX($B$4:$G$103,INT((ROWS(I$4:I462)-1)/7)+1,MOD(ROWS(I$4:I462)-1,7)),\"\")","v":"Lam-Find - T-F/DQ7235"},null,null,{"$f":"INDEX($B$4:$G$103,INT((ROWS(I$4:I462)-1)/7)+1,MOD(ROWS(I$4:I462)-1,7))","v":"T-F/DQ7235"}]
[null,null,null,null,null,null,null,null,null,{"$f":"INDEX($A$4:$A$103,INT((ROWS(I$4:I463)-1)/7)+1)&IF(MOD(ROWS(I$4:I463)-1,7),\" - \"&INDEX($B$4:$G$103,INT((ROWS(I$4:I463)-1)/7)+1,MOD(ROWS(I$4:I463)-1,7)),\"\")","v":"Lam-Find - L-E/DQ5363"},null,null,{"$f":"INDEX($B$4:$G$103,INT((ROWS(I$4:I463)-1)/7)+1,MOD(ROWS(I$4:I463)-1,7))","v":"L-E/DQ5363"}]
[null,null,null,null,null,null,null,null,null,{"$f":"INDEX($A$4:$A$103,INT((ROWS(I$4:I464)-1)/7)+1)&IF(MOD(ROWS(I$4:I464)-1,7),\" - \"&INDEX($B$4:$G$103,INT((ROWS(I$4:I464)-1)/7)+1,MOD(ROWS(I$4:I464)-1,7)),\"\")","v":"Lam-Find - S-C/DQ9729"},null,null,{"$f":"INDEX($B$4:$G$103,INT((ROWS(I$4:I464)-1)/7)+1,MOD(ROWS(I$4:I464)-1,7))","v":"S-C/DQ9729"}]
[null,null,null,null,null,null,null,null,null,{"$f":"INDEX($A$4:$A$103,INT((ROWS(I$4:I465)-1)/7)+1)&IF(MOD(ROWS(I$4:I465)-1,7),\" - \"&INDEX($B$4:$G$103,INT((ROWS(I$4:I465)-1)/7)+1,MOD(ROWS(I$4:I465)-1,7)),\"\")","v":"Lam-Find - K-U/DQ6401"},null,null,{"$f":"INDEX($B$4:$G$103,INT((ROWS(I$4:I465)-1)/7)+1,MOD(ROWS(I$4:I465)-1,7))","v":"K-U/DQ6401"}]
[null,null,null,null,null,null,null,null,null,{"$f":"INDEX($A$4:$A$103,INT((ROWS(I$4:I466)-1)/7)+1)&IF(MOD(ROWS(I$4:I466)-1,7),\" - \"&INDEX($B$4:$G$103,INT((ROWS(I$4:I466)-1)/7)+1,MOD(ROWS(I$4:I466)-1,7)),\"\")","v":"Sanlam"},null,null,{"$f":"INDEX($B$4:$G$103,INT((ROWS(I$4:I466)-1)/7)+1,MOD(ROWS(I$4:I466)-1,7))","v":{"$error":"#VALUE!"}}]
[null,null,null,null,null,null,null,null,null,{"$f":"INDEX($A$4:$A$103,INT((ROWS(I$4:I467)-1)/7)+1)&IF(MOD(ROWS(I$4:I467)-1,7),\" - \"&INDEX($B$4:$G$103,INT((ROWS(I$4:I467)-1)/7)+1,MOD(ROWS(I$4:I467)-1,7)),\"\")","v":"Sanlam - U-G/DQ2593"},null,null,{"$f":"INDEX($B$4:$G$103,INT((ROWS(I$4:I467)-1)/7)+1,MOD(ROWS(I$4:I467)-1,7))","v":"U-G/DQ2593"}]
[null,null,null,null,null,null,null,null,null,{"$f":"INDEX($A$4:$A$103,INT((ROWS(I$4:I468)-1)/7)+1)&IF(MOD(ROWS(I$4:I468)-1,7),\" - \"&INDEX($B$4:$G$103,INT((ROWS(I$4:I468)-1)/7)+1,MOD(ROWS(I$4:I468)-1,7)),\"\")","v":"Sanlam - I-N/DQ8908"},null,null,{"$f":"INDEX($B$4:$G$103,INT((ROWS(I$4:I468)-1)/7)+1,MOD(ROWS(I$4:I468)-1,7))","v":"I-N/DQ8908"}]
[null,null,null,null,null,null,null,null,null,{"$f":"INDEX($A$4:$A$103,INT((ROWS(I$4:I469)-1)/7)+1)&IF(MOD(ROWS(I$4:I469)-1,7),\" - \"&INDEX($B$4:$G$103,INT((ROWS(I$4:I469)-1)/7)+1,MOD(ROWS(I$4:I469)-1,7)),\"\")","v":"Sanlam - N-K/DQ7667"},null,null,{"$f":"INDEX($B$4:$G$103,INT((ROWS(I$4:I469)-1)/7)+1,MOD(ROWS(I$4:I469)-1,7))","v":"N-K/DQ7667"}]
[null,null,null,null,null,null,null,null,null,{"$f":"INDEX($A$4:$A$103,INT((ROWS(I$4:I470)-1)/7)+1)&IF(MOD(ROWS(I$4:I470)-1,7),\" - \"&INDEX($B$4:$G$103,INT((ROWS(I$4:I470)-1)/7)+1,MOD(ROWS(I$4:I470)-1,7)),\"\")","v":"Sanlam - C-X/DQ2549"},null,null,{"$f":"INDEX($B$4:$G$103,INT((ROWS(I$4:I470)-1)/7)+1,MOD(ROWS(I$4:I470)-1,7))","v":"C-X/DQ2549"}]
[null,null,null,null,null,null,null,null,null,{"$f":"INDEX($A$4:$A$103,INT((ROWS(I$4:I471)-1)/7)+1)&IF(MOD(ROWS(I$4:I471)-1,7),\" - \"&INDEX($B$4:$G$103,INT((ROWS(I$4:I471)-1)/7)+1,MOD(ROWS(I$4:I471)-1,7)),\"\")","v":"Sanlam - I-I/DQ4036"},null,null,{"$f":"INDEX($B$4:$G$103,INT((ROWS(I$4:I471)-1)/7)+1,MOD(ROWS(I$4:I471)-1,7))","v":"I-I/DQ4036"}]
[null,null,null,null,null,null,null,null,null,{"$f":"INDEX($A$4:$A$103,INT((ROWS(I$4:I472)-1)/7)+1)&IF(MOD(ROWS(I$4:I472)-1,7),\" - \"&INDEX($B$4:$G$103,INT((ROWS(I$4:I472)-1)/7)+1,MOD(ROWS(I$4:I472)-1,7)),\"\")","v":"Sanlam - P-F/DQ5733"},null,null,{"$f":"INDEX($B$4:$G$103,INT((ROWS(I$4:I472)-1)/7)+1,MOD(ROWS(I$4:I472)-1,7))","v":"P-F/DQ5733"}]
[null,null,null,null,null,null,null,null,null,{"$f":"INDEX($A$4:$A$103,INT((ROWS(I$4:I473)-1)/7)+1)&IF(MOD(ROWS(I$4:I473)-1,7),\" - \"&INDEX($B$4:$G$103,INT((ROWS(I$4:I473)-1)/7)+1,MOD(ROWS(I$4:I473)-1,7)),\"\")","v":"Lexiair"},null,null,{"$f":"INDEX($B$4:$G$103,INT((ROWS(I$4:I473)-1)/7)+1,MOD(ROWS(I$4:I473)-1,7))","v":{"$error":"#VALUE!"}}]
[null,null,null,null,null,null,null,null,null,{"$f":"INDEX($A$4:$A$103,INT((ROWS(I$4:I474)-1)/7)+1)&IF(MOD(ROWS(I$4:I474)-1,7),\" - \"&INDEX($B$4:$G$103,INT((ROWS(I$4:I474)-1)/7)+1,MOD(ROWS(I$4:I474)-1,7)),\"\")","v":"Lexiair - N-I/DQ8055"},null,null,{"$f":"INDEX($B$4:$G$103,INT((ROWS(I$4:I474)-1)/7)+1,MOD(ROWS(I$4:I474)-1,7))","v":"N-I/DQ8055"}]
[null,null,null,null,null,null,null,null,null,{"$f":"INDEX($A$4:$A$103,INT((ROWS(I$4:I475)-1)/7)+1)&IF(MOD(ROWS(I$4:I475)-1,7),\" - \"&INDEX($B$4:$G$103,INT((ROWS(I$4:I475)-1)/7)+1,MOD(ROWS(I$4:I475)-1,7)),\"\")","v":"Lexiair - B-X/DQ9278"},null,null,{"$f":"INDEX($B$4:$G$103,INT((ROWS(I$4:I475)-1)/7)+1,MOD(ROWS(I$4:I475)-1,7))","v":"B-X/DQ9278"}]
[null,null,null,null,null,null,null,null,null,{"$f":"INDEX($A$4:$A$103,INT((ROWS(I$4:I476)-1)/7)+1)&IF(MOD(ROWS(I$4:I476)-1,7),\" - \"&INDEX($B$4:$G$103,INT((ROWS(I$4:I476)-1)/7)+1,MOD(ROWS(I$4:I476)-1,7)),\"\")","v":"Lexiair - B-W/DQ6317"},null,null,{"$f":"INDEX($B$4:$G$103,INT((ROWS(I$4:I476)-1)/7)+1,MOD(ROWS(I$4:I476)-1,7))","v":"B-W/DQ6317"}]
[null,null,null,null,null,null,null,null,null,{"$f":"INDEX($A$4:$A$103,INT((ROWS(I$4:I477)-1)/7)+1)&IF(MOD(ROWS(I$4:I477)-1,7),\" - \"&INDEX($B$4:$G$103,INT((ROWS(I$4:I477)-1)/7)+1,MOD(ROWS(I$4:I477)-1,7)),\"\")","v":"Lexiair - P-S/DQ6855"},null,null,{"$f":"INDEX($B$4:$G$103,INT((ROWS(I$4:I477)-1)/7)+1,MOD(ROWS(I$4:I477)-1,7))","v":"P-S/DQ6855"}]
[null,null,null,null,null,null,null,null,null,{"$f":"INDEX($A$4:$A$103,INT((ROWS(I$4:I478)-1)/7)+1)&IF(MOD(ROWS(I$4:I478)-1,7),\" - \"&INDEX($B$4:$G$103,INT((ROWS(I$4:I478)-1)/7)+1,MOD(ROWS(I$4:I478)-1,7)),\"\")","v":"Lexiair - C-L/DQ3860"},null,null,{"$f":"INDEX($B$4:$G$103,INT((ROWS(I$4:I478)-1)/7)+1,MOD(ROWS(I$4:I478)-1,7))","v":"C-L/DQ3860"}]
[null,null,null,null,null,null,null,null,null,{"$f":"INDEX($A$4:$A$103,INT((ROWS(I$4:I479)-1)/7)+1)&IF(MOD(ROWS(I$4:I479)-1,7),\" - \"&INDEX($B$4:$G$103,INT((ROWS(I$4:I479)-1)/7)+1,MOD(ROWS(I$4:I479)-1,7)),\"\")","v":"Lexiair - Z-D/DQ9878"},null,null,{"$f":"INDEX($B$4:$G$103,INT((ROWS(I$4:I479)-1)/7)+1,MOD(ROWS(I$4:I479)-1,7))","v":"Z-D/DQ9878"}]
[null,null,null,null,null,null,null,null,null,{"$f":"INDEX($A$4:$A$103,INT((ROWS(I$4:I480)-1)/7)+1)&IF(MOD(ROWS(I$4:I480)-1,7),\" - \"&INDEX($B$4:$G$103,INT((ROWS(I$4:I480)-1)/7)+1,MOD(ROWS(I$4:I480)-1,7)),\"\")","v":"Stat-La"},null,null,{"$f":"INDEX($B$4:$G$103,INT((ROWS(I$4:I480)-1)/7)+1,MOD(ROWS(I$4:I480)-1,7))","v":{"$error":"#VALUE!"}}]
[null,null,null,null,null,null,null,null,null,{"$f":"INDEX($A$4:$A$103,INT((ROWS(I$4:I481)-1)/7)+1)&IF(MOD(ROWS(I$4:I481)-1,7),\" - \"&INDEX($B$4:$G$103,INT((ROWS(I$4:I481)-1)/7)+1,MOD(ROWS(I$4:I481)-1,7)),\"\")","v":"Stat-La - V-R/DQ3359"},null,null,{"$f":"INDEX($B$4:$G$103,INT((ROWS(I$4:I481)-1)/7)+1,MOD(ROWS(I$4:I481)-1,7))","v":"V-R/DQ3359"}]
[null,null,null,null,null,null,null,null,null,{"$f":"INDEX($A$4:$A$103,INT((ROWS(I$4:I482)-1)/7)+1)&IF(MOD(ROWS(I$4:I482)-1,7),\" - \"&INDEX($B$4:$G$103,INT((ROWS(I$4:I482)-1)/7)+1,MOD(ROWS(I$4:I482)-1,7)),\"\")","v":"Stat-La - V-H/DQ7313"},null,null,{"$f":"INDEX($B$4:$G$103,INT((ROWS(I$4:I482)-1)/7)+1,MOD(ROWS(I$4:I482)-1,7))","v":"V-H/DQ7313"}]
[null,null,null,null,null,null,null,null,null,{"$f":"INDEX($A$4:$A$103,INT((ROWS(I$4:I483)-1)/7)+1)&IF(MOD(ROWS(I$4:I483)-1,7),\" - \"&INDEX($B$4:$G$103,INT((ROWS(I$4:I483)-1)/7)+1,MOD(ROWS(I$4:I483)-1,7)),\"\")","v":"Stat-La - F-F/DQ5200"},null,null,{"$f":"INDEX($B$4:$G$103,INT((ROWS(I$4:I483)-1)/7)+1,MOD(ROWS(I$4:I483)-1,7))","v":"F-F/DQ5200"}]
[null,null,null,null,null,null,null,null,null,{"$f":"INDEX($A$4:$A$103,INT((ROWS(I$4:I484)-1)/7)+1)&IF(MOD(ROWS(I$4:I484)-1,7),\" - \"&INDEX($B$4:$G$103,INT((ROWS(I$4:I484)-1)/7)+1,MOD(ROWS(I$4:I484)-1,7)),\"\")","v":"Stat-La - J-Q/DQ5746"},null,null,{"$f":"INDEX($B$4:$G$103,INT((ROWS(I$4:I484)-1)/7)+1,MOD(ROWS(I$4:I484)-1,7))","v":"J-Q/DQ5746"}]
[null,null,null,null,null,null,null,null,null,{"$f":"INDEX($A$4:$A$103,INT((ROWS(I$4:I485)-1)/7)+1)&IF(MOD(ROWS(I$4:I485)-1,7),\" - \"&INDEX($B$4:$G$103,INT((ROWS(I$4:I485)-1)/7)+1,MOD(ROWS(I$4:I485)-1,7)),\"\")","v":"Stat-La - A-Q/DQ5080"},null,null,{"$f":"INDEX($B$4:$G$103,INT((ROWS(I$4:I485)-1)/7)+1,MOD(ROWS(I$4:I485)-1,7))","v":"A-Q/DQ5080"}]
[null,null,null,null,null,null,null,null,null,{"$f":"INDEX($A$4:$A$103,INT((ROWS(I$4:I486)-1)/7)+1)&IF(MOD(ROWS(I$4:I486)-1,7),\" - \"&INDEX($B$4:$G$103,INT((ROWS(I$4:I486)-1)/7)+1,MOD(ROWS(I$4:I486)-1,7)),\"\")","v":"Stat-La - F-V/DQ2552"},null,null,{"$f":"INDEX($B$4:$G$103,INT((ROWS(I$4:I486)-1)/7)+1,MOD(ROWS(I$4:I486)-1,7))","v":"F-V/DQ2552"}]
[null,null,null,null,null,null,null,null,null,{"$f":"INDEX($A$4:$A$103,INT((ROWS(I$4:I487)-1)/7)+1)&IF(MOD(ROWS(I$4:I487)-1,7),\" - \"&INDEX($B$4:$G$103,INT((ROWS(I$4:I487)-1)/7)+1,MOD(ROWS(I$4:I487)-1,7)),\"\")","v":"Move Jaytop"},null,null,{"$f":"INDEX($B$4:$G$103,INT((ROWS(I$4:I487)-1)/7)+1,MOD(ROWS(I$4:I487)-1,7))","v":{"$error":"#VALUE!"}}]
[null,null,null,null,null,null,null,null,null,{"$f":"INDEX($A$4:$A$103,INT((ROWS(I$4:I488)-1)/7)+1)&IF(MOD(ROWS(I$4:I488)-1,7),\" - \"&INDEX($B$4:$G$103,INT((ROWS(I$4:I488)-1)/7)+1,MOD(ROWS(I$4:I488)-1,7)),\"\")","v":"Move Jaytop - T-O/DQ7238"},null,null,{"$f":"INDEX($B$4:$G$103,INT((ROWS(I$4:I488)-1)/7)+1,MOD(ROWS(I$4:I488)-1,7))","v":"T-O/DQ7238"}]
[null,null,null,null,null,null,null,null,null,{"$f":"INDEX($A$4:$A$103,INT((ROWS(I$4:I489)-1)/7)+1)&IF(MOD(ROWS(I$4:I489)-1,7),\" - \"&INDEX($B$4:$G$103,INT((ROWS(I$4:I489)-1)/7)+1,MOD(ROWS(I$4:I489)-1,7)),\"\")","v":"Move Jaytop - F-D/DQ6648"},null,null,{"$f":"INDEX($B$4:$G$103,INT((ROWS(I$4:I489)-1)/7)+1,MOD(ROWS(I$4:I489)-1,7))","v":"F-D/DQ6648"}]
[null,null,null,null,null,null,null,null,null,{"$f":"INDEX($A$4:$A$103,INT((ROWS(I$4:I490)-1)/7)+1)&IF(MOD(ROWS(I$4:I490)-1,7),\" - \"&INDEX($B$4:$G$103,INT((ROWS(I$4:I490)-1)/7)+1,MOD(ROWS(I$4:I490)-1,7)),\"\")","v":"Move Jaytop - K-A/DQ9049"},null,null,{"$f":"INDEX($B$4:$G$103,INT((ROWS(I$4:I490)-1)/7)+1,MOD(ROWS(I$4:I490)-1,7))","v":"K-A/DQ9049"}]
[null,null,null,null,null,null,null,null,null,{"$f":"INDEX($A$4:$A$103,INT((ROWS(I$4:I491)-1)/7)+1)&IF(MOD(ROWS(I$4:I491)-1,7),\" - \"&INDEX($B$4:$G$103,INT((ROWS(I$4:I491)-1)/7)+1,MOD(ROWS(I$4:I491)-1,7)),\"\")","v":"Move Jaytop - H-O/DQ2208"},null,null,{"$f":"INDEX($B$4:$G$103,INT((ROWS(I$4:I491)-1)/7)+1,MOD(ROWS(I$4:I491)-1,7))","v":"H-O/DQ2208"}]
[null,null,null,null,null,null,null,null,null,{"$f":"INDEX($A$4:$A$103,INT((ROWS(I$4:I492)-1)/7)+1)&IF(MOD(ROWS(I$4:I492)-1,7),\" - \"&INDEX($B$4:$G$103,INT((ROWS(I$4:I492)-1)/7)+1,MOD(ROWS(I$4:I492)-1,7)),\"\")","v":"Move Jaytop - I-Z/DQ5486"},null,null,{"$f":"INDEX($B$4:$G$103,INT((ROWS(I$4:I492)-1)/7)+1,MOD(ROWS(I$4:I492)-1,7))","v":"I-Z/DQ5486"}]
[null,null,null,null,null,null,null,null,null,{"$f":"INDEX($A$4:$A$103,INT((ROWS(I$4:I493)-1)/7)+1)&IF(MOD(ROWS(I$4:I493)-1,7),\" - \"&INDEX($B$4:$G$103,INT((ROWS(I$4:I493)-1)/7)+1,MOD(ROWS(I$4:I493)-1,7)),\"\")","v":"Move Jaytop - X-Y/DQ4699"},null,null,{"$f":"INDEX($B$4:$G$103,INT((ROWS(I$4:I493)-1)/7)+1,MOD(ROWS(I$4:I493)-1,7))","v":"X-Y/DQ4699"}]
[null,null,null,null,null,null,null,null,null,{"$f":"INDEX($A$4:$A$103,INT((ROWS(I$4:I494)-1)/7)+1)&IF(MOD(ROWS(I$4:I494)-1,7),\" - \"&INDEX($B$4:$G$103,INT((ROWS(I$4:I494)-1)/7)+1,MOD(ROWS(I$4:I494)-1,7)),\"\")","v":"Hottrax"},null,null,{"$f":"INDEX($B$4:$G$103,INT((ROWS(I$4:I494)-1)/7)+1,MOD(ROWS(I$4:I494)-1,7))","v":{"$error":"#VALUE!"}}]
[null,null,null,null,null,null,null,null,null,{"$f":"INDEX($A$4:$A$103,INT((ROWS(I$4:I495)-1)/7)+1)&IF(MOD(ROWS(I$4:I495)-1,7),\" - \"&INDEX($B$4:$G$103,INT((ROWS(I$4:I495)-1)/7)+1,MOD(ROWS(I$4:I495)-1,7)),\"\")","v":"Hottrax - J-H/DQ6022"},null,null,{"$f":"INDEX($B$4:$G$103,INT((ROWS(I$4:I495)-1)/7)+1,MOD(ROWS(I$4:I495)-1,7))","v":"J-H/DQ6022"}]
[null,null,null,null,null,null,null,null,null,{"$f":"INDEX($A$4:$A$103,INT((ROWS(I$4:I496)-1)/7)+1)&IF(MOD(ROWS(I$4:I496)-1,7),\" - \"&INDEX($B$4:$G$103,INT((ROWS(I$4:I496)-1)/7)+1,MOD(ROWS(I$4:I496)-1,7)),\"\")","v":"Hottrax - G-H/DQ5842"},null,null,{"$f":"INDEX($B$4:$G$103,INT((ROWS(I$4:I496)-1)/7)+1,MOD(ROWS(I$4:I496)-1,7))","v":"G-H/DQ5842"}]
[null,null,null,null,null,null,null,null,null,{"$f":"INDEX($A$4:$A$103,INT((ROWS(I$4:I497)-1)/7)+1)&IF(MOD(ROWS(I$4:I497)-1,7),\" - \"&INDEX($B$4:$G$103,INT((ROWS(I$4:I497)-1)/7)+1,MOD(ROWS(I$4:I497)-1,7)),\"\")","v":"Hottrax - W-B/DQ2309"},null,null,{"$f":"INDEX($B$4:$G$103,INT((ROWS(I$4:I497)-1)/7)+1,MOD(ROWS(I$4:I497)-1,7))","v":"W-B/DQ2309"}]
[null,null,null,null,null,null,null,null,null,{"$f":"INDEX($A$4:$A$103,INT((ROWS(I$4:I498)-1)/7)+1)&IF(MOD(ROWS(I$4:I498)-1,7),\" - \"&INDEX($B$4:$G$103,INT((ROWS(I$4:I498)-1)/7)+1,MOD(ROWS(I$4:I498)-1,7)),\"\")","v":"Hottrax - C-L/DQ5586"},null,null,{"$f":"INDEX($B$4:$G$103,INT((ROWS(I$4:I498)-1)/7)+1,MOD(ROWS(I$4:I498)-1,7))","v":"C-L/DQ5586"}]
[null,null,null,null,null,null,null,null,null,{"$f":"INDEX($A$4:$A$103,INT((ROWS(I$4:I499)-1)/7)+1)&IF(MOD(ROWS(I$4:I499)-1,7),\" - \"&INDEX($B$4:$G$103,INT((ROWS(I$4:I499)-1)/7)+1,MOD(ROWS(I$4:I499)-1,7)),\"\")","v":"Hottrax - W-F/DQ3438"},null,null,{"$f":"INDEX($B$4:$G$103,INT((ROWS(I$4:I499)-1)/7)+1,MOD(ROWS(I$4:I499)-1,7))","v":"W-F/DQ3438"}]
[null,null,null,null,null,null,null,null,null,{"$f":"INDEX($A$4:$A$103,INT((ROWS(I$4:I500)-1)/7)+1)&IF(MOD(ROWS(I$4:I500)-1,7),\" - \"&INDEX($B$4:$G$103,INT((ROWS(I$4:I500)-1)/7)+1,MOD(ROWS(I$4:I500)-1,7)),\"\")","v":"Hottrax - X-R/DQ3727"},null,null,{"$f":"INDEX($B$4:$G$103,INT((ROWS(I$4:I500)-1)/7)+1,MOD(ROWS(I$4:I500)-1,7))","v":"X-R/DQ3727"}]
[null,null,null,null,null,null,null,null,null,{"$f":"INDEX($A$4:$A$103,INT((ROWS(I$4:I501)-1)/7)+1)&IF(MOD(ROWS(I$4:I501)-1,7),\" - \"&INDEX($B$4:$G$103,INT((ROWS(I$4:I501)-1)/7)+1,MOD(ROWS(I$4:I501)-1,7)),\"\")","v":"Doublehome"},null,null,{"$f":"INDEX($B$4:$G$103,INT((ROWS(I$4:I501)-1)/7)+1,MOD(ROWS(I$4:I501)-1,7))","v":{"$error":"#VALUE!"}}]
[null,null,null,null,null,null,null,null,null,{"$f":"INDEX($A$4:$A$103,INT((ROWS(I$4:I502)-1)/7)+1)&IF(MOD(ROWS(I$4:I502)-1,7),\" - \"&INDEX($B$4:$G$103,INT((ROWS(I$4:I502)-1)/7)+1,MOD(ROWS(I$4:I502)-1,7)),\"\")","v":"Doublehome - I-X/DQ1764"},null,null,{"$f":"INDEX($B$4:$G$103,INT((ROWS(I$4:I502)-1)/7)+1,MOD(ROWS(I$4:I502)-1,7))","v":"I-X/DQ1764"}]
[null,null,null,null,null,null,null,null,null,{"$f":"INDEX($A$4:$A$103,INT((ROWS(I$4:I503)-1)/7)+1)&IF(MOD(ROWS(I$4:I503)-1,7),\" - \"&INDEX($B$4:$G$103,INT((ROWS(I$4:I503)-1)/7)+1,MOD(ROWS(I$4:I503)-1,7)),\"\")","v":"Doublehome - F-V/DQ9308"},null,null,{"$f":"INDEX($B$4:$G$103,INT((ROWS(I$4:I503)-1)/7)+1,MOD(ROWS(I$4:I503)-1,7))","v":"F-V/DQ9308"}]
[null,null,null,null,null,null,null,null,null,{"$f":"INDEX($A$4:$A$103,INT((ROWS(I$4:I504)-1)/7)+1)&IF(MOD(ROWS(I$4:I504)-1,7),\" - \"&INDEX($B$4:$G$103,INT((ROWS(I$4:I504)-1)/7)+1,MOD(ROWS(I$4:I504)-1,7)),\"\")","v":"Doublehome - G-E/DQ9441"},null,null,{"$f":"INDEX($B$4:$G$103,INT((ROWS(I$4:I504)-1)/7)+1,MOD(ROWS(I$4:I504)-1,7))","v":"G-E/DQ9441"}]
[null,null,null,null,null,null,null,null,null,{"$f":"INDEX($A$4:$A$103,INT((ROWS(I$4:I505)-1)/7)+1)&IF(MOD(ROWS(I$4:I505)-1,7),\" - \"&INDEX($B$4:$G$103,INT((ROWS(I$4:I505)-1)/7)+1,MOD(ROWS(I$4:I505)-1,7)),\"\")","v":"Doublehome - D-P/DQ4540"},null,null,{"$f":"INDEX($B$4:$G$103,INT((ROWS(I$4:I505)-1)/7)+1,MOD(ROWS(I$4:I505)-1,7))","v":"D-P/DQ4540"}]
[null,null,null,null,null,null,null,null,null,{"$f":"INDEX($A$4:$A$103,INT((ROWS(I$4:I506)-1)/7)+1)&IF(MOD(ROWS(I$4:I506)-1,7),\" - \"&INDEX($B$4:$G$103,INT((ROWS(I$4:I506)-1)/7)+1,MOD(ROWS(I$4:I506)-1,7)),\"\")","v":"Doublehome - A-C/DQ5093"},null,null,{"$f":"INDEX($B$4:$G$103,INT((ROWS(I$4:I506)-1)/7)+1,MOD(ROWS(I$4:I506)-1,7))","v":"A-C/DQ5093"}]
[null,null,null,null,null,null,null,null,null,{"$f":"INDEX($A$4:$A$103,INT((ROWS(I$4:I507)-1)/7)+1)&IF(MOD(ROWS(I$4:I507)-1,7),\" - \"&INDEX($B$4:$G$103,INT((ROWS(I$4:I507)-1)/7)+1,MOD(ROWS(I$4:I507)-1,7)),\"\")","v":"Doublehome - P-M/DQ5272"},null,null,{"$f":"INDEX($B$4:$G$103,INT((ROWS(I$4:I507)-1)/7)+1,MOD(ROWS(I$4:I507)-1,7))","v":"P-M/DQ5272"}]
[null,null,null,null,null,null,null,null,null,{"$f":"INDEX($A$4:$A$103,INT((ROWS(I$4:I508)-1)/7)+1)&IF(MOD(ROWS(I$4:I508)-1,7),\" - \"&INDEX($B$4:$G$103,INT((ROWS(I$4:I508)-1)/7)+1,MOD(ROWS(I$4:I508)-1,7)),\"\")","v":"Geoeco"},null,null,{"$f":"INDEX($B$4:$G$103,INT((ROWS(I$4:I508)-1)/7)+1,MOD(ROWS(I$4:I508)-1,7))","v":{"$error":"#VALUE!"}}]
[null,null,null,null,null,null,null,null,null,{"$f":"INDEX($A$4:$A$103,INT((ROWS(I$4:I509)-1)/7)+1)&IF(MOD(ROWS(I$4:I509)-1,7),\" - \"&INDEX($B$4:$G$103,INT((ROWS(I$4:I509)-1)/7)+1,MOD(ROWS(I$4:I509)-1,7)),\"\")","v":"Geoeco - K-I/DQ6541"},null,null,{"$f":"INDEX($B$4:$G$103,INT((ROWS(I$4:I509)-1)/7)+1,MOD(ROWS(I$4:I509)-1,7))","v":"K-I/DQ6541"}]
[null,null,null,null,null,null,null,null,null,{"$f":"INDEX($A$4:$A$103,INT((ROWS(I$4:I510)-1)/7)+1)&IF(MOD(ROWS(I$4:I510)-1,7),\" - \"&INDEX($B$4:$G$103,INT((ROWS(I$4:I510)-1)/7)+1,MOD(ROWS(I$4:I510)-1,7)),\"\")","v":"Geoeco - O-A/DQ4828"},null,null,{"$f":"INDEX($B$4:$G$103,INT((ROWS(I$4:I510)-1)/7)+1,MOD(ROWS(I$4:I510)-1,7))","v":"O-A/DQ4828"}]
[null,null,null,null,null,null,null,null,null,{"$f":"INDEX($A$4:$A$103,INT((ROWS(I$4:I511)-1)/7)+1)&IF(MOD(ROWS(I$4:I511)-1,7),\" - \"&INDEX($B$4:$G$103,INT((ROWS(I$4:I511)-1)/7)+1,MOD(ROWS(I$4:I511)-1,7)),\"\")","v":"Geoeco - L-B/DQ5503"},null,null,{"$f":"INDEX($B$4:$G$103,INT((ROWS(I$4:I511)-1)/7)+1,MOD(ROWS(I$4:I511)-1,7))","v":"L-B/DQ5503"}]
[null,null,null,null,null,null,null,null,null,{"$f":"INDEX($A$4:$A$103,INT((ROWS(I$4:I512)-1)/7)+1)&IF(MOD(ROWS(I$4:I512)-1,7),\" - \"&INDEX($B$4:$G$103,INT((ROWS(I$4:I512)-1)/7)+1,MOD(ROWS(I$4:I512)-1,7)),\"\")","v":"Geoeco - U-G/DQ1778"},null,null,{"$f":"INDEX($B$4:$G$103,INT((ROWS(I$4:I512)-1)/7)+1,MOD(ROWS(I$4:I512)-1,7))","v":"U-G/DQ1778"}]
[null,null,null,null,null,null,null,null,null,{"$f":"INDEX($A$4:$A$103,INT((ROWS(I$4:I513)-1)/7)+1)&IF(MOD(ROWS(I$4:I513)-1,7),\" - \"&INDEX($B$4:$G$103,INT((ROWS(I$4:I513)-1)/7)+1,MOD(ROWS(I$4:I513)-1,7)),\"\")","v":"Geoeco - D-V/DQ5889"},null,null,{"$f":"INDEX($B$4:$G$103,INT((ROWS(I$4:I513)-1)/7)+1,MOD(ROWS(I$4:I513)-1,7))","v":"D-V/DQ5889"}]
[null,null,null,null,null,null,null,null,null,{"$f":"INDEX($A$4:$A$103,INT((ROWS(I$4:I514)-1)/7)+1)&IF(MOD(ROWS(I$4:I514)-1,7),\" - \"&INDEX($B$4:$G$103,INT((ROWS(I$4:I514)-1)/7)+1,MOD(ROWS(I$4:I514)-1,7)),\"\")","v":"Geoeco - N-C/DQ6848"},null,null,{"$f":"INDEX($B$4:$G$103,INT((ROWS(I$4:I514)-1)/7)+1,MOD(ROWS(I$4:I514)-1,7))","v":"N-C/DQ6848"}]
[null,null,null,null,null,null,null,null,null,{"$f":"INDEX($A$4:$A$103,INT((ROWS(I$4:I515)-1)/7)+1)&IF(MOD(ROWS(I$4:I515)-1,7),\" - \"&INDEX($B$4:$G$103,INT((ROWS(I$4:I515)-1)/7)+1,MOD(ROWS(I$4:I515)-1,7)),\"\")","v":"Nimtex"},null,null,{"$f":"INDEX($B$4:$G$103,INT((ROWS(I$4:I515)-1)/7)+1,MOD(ROWS(I$4:I515)-1,7))","v":{"$error":"#VALUE!"}}]
[null,null,null,null,null,null,null,null,null,{"$f":"INDEX($A$4:$A$103,INT((ROWS(I$4:I516)-1)/7)+1)&IF(MOD(ROWS(I$4:I516)-1,7),\" - \"&INDEX($B$4:$G$103,INT((ROWS(I$4:I516)-1)/7)+1,MOD(ROWS(I$4:I516)-1,7)),\"\")","v":"Nimtex - H-V/DQ2801"},null,null,{"$f":"INDEX($B$4:$G$103,INT((ROWS(I$4:I516)-1)/7)+1,MOD(ROWS(I$4:I516)-1,7))","v":"H-V/DQ2801"}]
[null,null,null,null,null,null,null,null,null,{"$f":"INDEX($A$4:$A$103,INT((ROWS(I$4:I517)-1)/7)+1)&IF(MOD(ROWS(I$4:I517)-1,7),\" - \"&INDEX($B$4:$G$103,INT((ROWS(I$4:I517)-1)/7)+1,MOD(ROWS(I$4:I517)-1,7)),\"\")","v":"Nimtex - A-F/DQ3370"},null,null,{"$f":"INDEX($B$4:$G$103,INT((ROWS(I$4:I517)-1)/7)+1,MOD(ROWS(I$4:I517)-1,7))","v":"A-F/DQ3370"}]
[null,null,null,null,null,null,null,null,null,{"$f":"INDEX($A$4:$A$103,INT((ROWS(I$4:I518)-1)/7)+1)&IF(MOD(ROWS(I$4:I518)-1,7),\" - \"&INDEX($B$4:$G$103,INT((ROWS(I$4:I518)-1)/7)+1,MOD(ROWS(I$4:I518)-1,7)),\"\")","v":"Nimtex - E-R/DQ2577"},null,null,{"$f":"INDEX($B$4:$G$103,INT((ROWS(I$4:I518)-1)/7)+1,MOD(ROWS(I$4:I518)-1,7))","v":"E-R/DQ2577"}]
[null,null,null,null,null,null,null,null,null,{"$f":"INDEX($A$4:$A$103,INT((ROWS(I$4:I519)-1)/7)+1)&IF(MOD(ROWS(I$4:I519)-1,7),\" - \"&INDEX($B$4:$G$103,INT((ROWS(I$4:I519)-1)/7)+1,MOD(ROWS(I$4:I519)-1,7)),\"\")","v":"Nimtex - Y-G/DQ7693"},null,null,{"$f":"INDEX($B$4:$G$103,INT((ROWS(I$4:I519)-1)/7)+1,MOD(ROWS(I$4:I519)-1,7))","v":"Y-G/DQ7693"}]
[null,null,null,null,null,null,null,null,null,{"$f":"INDEX($A$4:$A$103,INT((ROWS(I$4:I520)-1)/7)+1)&IF(MOD(ROWS(I$4:I520)-1,7),\" - \"&INDEX($B$4:$G$103,INT((ROWS(I$4:I520)-1)/7)+1,MOD(ROWS(I$4:I520)-1,7)),\"\")","v":"Nimtex - P-X/DQ1156"},null,null,{"$f":"INDEX($B$4:$G$103,INT((ROWS(I$4:I520)-1)/7)+1,MOD(ROWS(I$4:I520)-1,7))","v":"P-X/DQ1156"}]
[null,null,null,null,null,null,null,null,null,{"$f":"INDEX($A$4:$A$103,INT((ROWS(I$4:I521)-1)/7)+1)&IF(MOD(ROWS(I$4:I521)-1,7),\" - \"&INDEX($B$4:$G$103,INT((ROWS(I$4:I521)-1)/7)+1,MOD(ROWS(I$4:I521)-1,7)),\"\")","v":"Nimtex - Z-T/DQ1399"},null,null,{"$f":"INDEX($B$4:$G$103,INT((ROWS(I$4:I521)-1)/7)+1,MOD(ROWS(I$4:I521)-1,7))","v":"Z-T/DQ1399"}]
[null,null,null,null,null,null,null,null,null,{"$f":"INDEX($A$4:$A$103,INT((ROWS(I$4:I522)-1)/7)+1)&IF(MOD(ROWS(I$4:I522)-1,7),\" - \"&INDEX($B$4:$G$103,INT((ROWS(I$4:I522)-1)/7)+1,MOD(ROWS(I$4:I522)-1,7)),\"\")","v":"Roneco"},null,null,{"$f":"INDEX($B$4:$G$103,INT((ROWS(I$4:I522)-1)/7)+1,MOD(ROWS(I$4:I522)-1,7))","v":{"$error":"#VALUE!"}}]
[null,null,null,null,null,null,null,null,null,{"$f":"INDEX($A$4:$A$103,INT((ROWS(I$4:I523)-1)/7)+1)&IF(MOD(ROWS(I$4:I523)-1,7),\" - \"&INDEX($B$4:$G$103,INT((ROWS(I$4:I523)-1)/7)+1,MOD(ROWS(I$4:I523)-1,7)),\"\")","v":"Roneco - D-D/DQ9977"},null,null,{"$f":"INDEX($B$4:$G$103,INT((ROWS(I$4:I523)-1)/7)+1,MOD(ROWS(I$4:I523)-1,7))","v":"D-D/DQ9977"}]
[null,null,null,null,null,null,null,null,null,{"$f":"INDEX($A$4:$A$103,INT((ROWS(I$4:I524)-1)/7)+1)&IF(MOD(ROWS(I$4:I524)-1,7),\" - \"&INDEX($B$4:$G$103,INT((ROWS(I$4:I524)-1)/7)+1,MOD(ROWS(I$4:I524)-1,7)),\"\")","v":"Roneco - W-U/DQ9156"},null,null,{"$f":"INDEX($B$4:$G$103,INT((ROWS(I$4:I524)-1)/7)+1,MOD(ROWS(I$4:I524)-1,7))","v":"W-U/DQ9156"}]
[null,null,null,null,null,null,null,null,null,{"$f":"INDEX($A$4:$A$103,INT((ROWS(I$4:I525)-1)/7)+1)&IF(MOD(ROWS(I$4:I525)-1,7),\" - \"&INDEX($B$4:$G$103,INT((ROWS(I$4:I525)-1)/7)+1,MOD(ROWS(I$4:I525)-1,7)),\"\")","v":"Roneco - B-F/DQ9761"},null,null,{"$f":"INDEX($B$4:$G$103,INT((ROWS(I$4:I525)-1)/7)+1,MOD(ROWS(I$4:I525)-1,7))","v":"B-F/DQ9761"}]
[null,null,null,null,null,null,null,null,null,{"$f":"INDEX($A$4:$A$103,INT((ROWS(I$4:I526)-1)/7)+1)&IF(MOD(ROWS(I$4:I526)-1,7),\" - \"&INDEX($B$4:$G$103,INT((ROWS(I$4:I526)-1)/7)+1,MOD(ROWS(I$4:I526)-1,7)),\"\")","v":"Roneco - G-J/DQ8671"},null,null,{"$f":"INDEX($B$4:$G$103,INT((ROWS(I$4:I526)-1)/7)+1,MOD(ROWS(I$4:I526)-1,7))","v":"G-J/DQ8671"}]
[null,null,null,null,null,null,null,null,null,{"$f":"INDEX($A$4:$A$103,INT((ROWS(I$4:I527)-1)/7)+1)&IF(MOD(ROWS(I$4:I527)-1,7),\" - \"&INDEX($B$4:$G$103,INT((ROWS(I$4:I527)-1)/7)+1,MOD(ROWS(I$4:I527)-1,7)),\"\")","v":"Roneco - M-Z/DQ2823"},null,null,{"$f":"INDEX($B$4:$G$103,INT((ROWS(I$4:I527)-1)/7)+1,MOD(ROWS(I$4:I527)-1,7))","v":"M-Z/DQ2823"}]
[null,null,null,null,null,null,null,null,null,{"$f":"INDEX($A$4:$A$103,INT((ROWS(I$4:I528)-1)/7)+1)&IF(MOD(ROWS(I$4:I528)-1,7),\" - \"&INDEX($B$4:$G$103,INT((ROWS(I$4:I528)-1)/7)+1,MOD(ROWS(I$4:I528)-1,7)),\"\")","v":"Roneco - Y-S/DQ7569"},null,null,{"$f":"INDEX($B$4:$G$103,INT((ROWS(I$4:I528)-1)/7)+1,MOD(ROWS(I$4:I528)-1,7))","v":"Y-S/DQ7569"}]
[null,null,null,null,null,null,null,null,null,{"$f":"INDEX($A$4:$A$103,INT((ROWS(I$4:I529)-1)/7)+1)&IF(MOD(ROWS(I$4:I529)-1,7),\" - \"&INDEX($B$4:$G$103,INT((ROWS(I$4:I529)-1)/7)+1,MOD(ROWS(I$4:I529)-1,7)),\"\")","v":"Super Damlex"},null,null,{"$f":"INDEX($B$4:$G$103,INT((ROWS(I$4:I529)-1)/7)+1,MOD(ROWS(I$4:I529)-1,7))","v":{"$error":"#VALUE!"}}]
[null,null,null,null,null,null,null,null,null,{"$f":"INDEX($A$4:$A$103,INT((ROWS(I$4:I530)-1)/7)+1)&IF(MOD(ROWS(I$4:I530)-1,7),\" - \"&INDEX($B$4:$G$103,INT((ROWS(I$4:I530)-1)/7)+1,MOD(ROWS(I$4:I530)-1,7)),\"\")","v":"Super Damlex - X-K/DQ5825"},null,null,{"$f":"INDEX($B$4:$G$103,INT((ROWS(I$4:I530)-1)/7)+1,MOD(ROWS(I$4:I530)-1,7))","v":"X-K/DQ5825"}]
[null,null,null,null,null,null,null,null,null,{"$f":"INDEX($A$4:$A$103,INT((ROWS(I$4:I531)-1)/7)+1)&IF(MOD(ROWS(I$4:I531)-1,7),\" - \"&INDEX($B$4:$G$103,INT((ROWS(I$4:I531)-1)/7)+1,MOD(ROWS(I$4:I531)-1,7)),\"\")","v":"Super Damlex - B-M/DQ4799"},null,null,{"$f":"INDEX($B$4:$G$103,INT((ROWS(I$4:I531)-1)/7)+1,MOD(ROWS(I$4:I531)-1,7))","v":"B-M/DQ4799"}]
[null,null,null,null,null,null,null,null,null,{"$f":"INDEX($A$4:$A$103,INT((ROWS(I$4:I532)-1)/7)+1)&IF(MOD(ROWS(I$4:I532)-1,7),\" - \"&INDEX($B$4:$G$103,INT((ROWS(I$4:I532)-1)/7)+1,MOD(ROWS(I$4:I532)-1,7)),\"\")","v":"Super Damlex - F-Y/DQ7680"},null,null,{"$f":"INDEX($B$4:$G$103,INT((ROWS(I$4:I532)-1)/7)+1,MOD(ROWS(I$4:I532)-1,7))","v":"F-Y/DQ7680"}]
[null,null,null,null,null,null,null,null,null,{"$f":"INDEX($A$4:$A$103,INT((ROWS(I$4:I533)-1)/7)+1)&IF(MOD(ROWS(I$4:I533)-1,7),\" - \"&INDEX($B$4:$G$103,INT((ROWS(I$4:I533)-1)/7)+1,MOD(ROWS(I$4:I533)-1,7)),\"\")","v":"Super Damlex - E-K/DQ5609"},null,null,{"$f":"INDEX($B$4:$G$103,INT((ROWS(I$4:I533)-1)/7)+1,MOD(ROWS(I$4:I533)-1,7))","v":"E-K/DQ5609"}]
[null,null,null,null,null,null,null,null,null,{"$f":"INDEX($A$4:$A$103,INT((ROWS(I$4:I534)-1)/7)+1)&IF(MOD(ROWS(I$4:I534)-1,7),\" - \"&INDEX($B$4:$G$103,INT((ROWS(I$4:I534)-1)/7)+1,MOD(ROWS(I$4:I534)-1,7)),\"\")","v":"Super Damlex - X-H/DQ4124"},null,null,{"$f":"INDEX($B$4:$G$103,INT((ROWS(I$4:I534)-1)/7)+1,MOD(ROWS(I$4:I534)-1,7))","v":"X-H/DQ4124"}]
[null,null,null,null,null,null,null,null,null,{"$f":"INDEX($A$4:$A$103,INT((ROWS(I$4:I535)-1)/7)+1)&IF(MOD(ROWS(I$4:I535)-1,7),\" - \"&INDEX($B$4:$G$103,INT((ROWS(I$4:I535)-1)/7)+1,MOD(ROWS(I$4:I535)-1,7)),\"\")","v":"Super Damlex - T-L/DQ1506"},null,null,{"$f":"INDEX($B$4:$G$103,INT((ROWS(I$4:I535)-1)/7)+1,MOD(ROWS(I$4:I535)-1,7))","v":"T-L/DQ1506"}]
[null,null,null,null,null,null,null,null,null,{"$f":"INDEX($A$4:$A$103,INT((ROWS(I$4:I536)-1)/7)+1)&IF(MOD(ROWS(I$4:I536)-1,7),\" - \"&INDEX($B$4:$G$103,INT((ROWS(I$4:I536)-1)/7)+1,MOD(ROWS(I$4:I536)-1,7)),\"\")","v":"Donlam"},null,null,{"$f":"INDEX($B$4:$G$103,INT((ROWS(I$4:I536)-1)/7)+1,MOD(ROWS(I$4:I536)-1,7))","v":{"$error":"#VALUE!"}}]
[null,null,null,null,null,null,null,null,null,{"$f":"INDEX($A$4:$A$103,INT((ROWS(I$4:I537)-1)/7)+1)&IF(MOD(ROWS(I$4:I537)-1,7),\" - \"&INDEX($B$4:$G$103,INT((ROWS(I$4:I537)-1)/7)+1,MOD(ROWS(I$4:I537)-1,7)),\"\")","v":"Donlam - I-C/DQ1599"},null,null,{"$f":"INDEX($B$4:$G$103,INT((ROWS(I$4:I537)-1)/7)+1,MOD(ROWS(I$4:I537)-1,7))","v":"I-C/DQ1599"}]
[null,null,null,null,null,null,null,null,null,{"$f":"INDEX($A$4:$A$103,INT((ROWS(I$4:I538)-1)/7)+1)&IF(MOD(ROWS(I$4:I538)-1,7),\" - \"&INDEX($B$4:$G$103,INT((ROWS(I$4:I538)-1)/7)+1,MOD(ROWS(I$4:I538)-1,7)),\"\")","v":"Donlam - M-W/DQ6736"},null,null,{"$f":"INDEX($B$4:$G$103,INT((ROWS(I$4:I538)-1)/7)+1,MOD(ROWS(I$4:I538)-1,7))","v":"M-W/DQ6736"}]
[null,null,null,null,null,null,null,null,null,{"$f":"INDEX($A$4:$A$103,INT((ROWS(I$4:I539)-1)/7)+1)&IF(MOD(ROWS(I$4:I539)-1,7),\" - \"&INDEX($B$4:$G$103,INT((ROWS(I$4:I539)-1)/7)+1,MOD(ROWS(I$4:I539)-1,7)),\"\")","v":"Donlam - M-U/DQ3289"},null,null,{"$f":"INDEX($B$4:$G$103,INT((ROWS(I$4:I539)-1)/7)+1,MOD(ROWS(I$4:I539)-1,7))","v":"M-U/DQ3289"}]
[null,null,null,null,null,null,null,null,null,{"$f":"INDEX($A$4:$A$103,INT((ROWS(I$4:I540)-1)/7)+1)&IF(MOD(ROWS(I$4:I540)-1,7),\" - \"&INDEX($B$4:$G$103,INT((ROWS(I$4:I540)-1)/7)+1,MOD(ROWS(I$4:I540)-1,7)),\"\")","v":"Donlam - D-G/DQ9953"},null,null,{"$f":"INDEX($B$4:$G$103,INT((ROWS(I$4:I540)-1)/7)+1,MOD(ROWS(I$4:I540)-1,7))","v":"D-G/DQ9953"}]
[null,null,null,null,null,null,null,null,null,{"$f":"INDEX($A$4:$A$103,INT((ROWS(I$4:I541)-1)/7)+1)&IF(MOD(ROWS(I$4:I541)-1,7),\" - \"&INDEX($B$4:$G$103,INT((ROWS(I$4:I541)-1)/7)+1,MOD(ROWS(I$4:I541)-1,7)),\"\")","v":"Donlam - M-K/DQ2272"},null,null,{"$f":"INDEX($B$4:$G$103,INT((ROWS(I$4:I541)-1)/7)+1,MOD(ROWS(I$4:I541)-1,7))","v":"M-K/DQ2272"}]
[null,null,null,null,null,null,null,null,null,{"$f":"INDEX($A$4:$A$103,INT((ROWS(I$4:I542)-1)/7)+1)&IF(MOD(ROWS(I$4:I542)-1,7),\" - \"&INDEX($B$4:$G$103,INT((ROWS(I$4:I542)-1)/7)+1,MOD(ROWS(I$4:I542)-1,7)),\"\")","v":"Donlam - B-V/DQ4292"},null,null,{"$f":"INDEX($B$4:$G$103,INT((ROWS(I$4:I542)-1)/7)+1,MOD(ROWS(I$4:I542)-1,7))","v":"B-V/DQ4292"}]
[null,null,null,null,null,null,null,null,null,{"$f":"INDEX($A$4:$A$103,INT((ROWS(I$4:I543)-1)/7)+1)&IF(MOD(ROWS(I$4:I543)-1,7),\" - \"&INDEX($B$4:$G$103,INT((ROWS(I$4:I543)-1)/7)+1,MOD(ROWS(I$4:I543)-1,7)),\"\")","v":"Year Quolex"},null,null,{"$f":"INDEX($B$4:$G$103,INT((ROWS(I$4:I543)-1)/7)+1,MOD(ROWS(I$4:I543)-1,7))","v":{"$error":"#VALUE!"}}]
[null,null,null,null,null,null,null,null,null,{"$f":"INDEX($A$4:$A$103,INT((ROWS(I$4:I544)-1)/7)+1)&IF(MOD(ROWS(I$4:I544)-1,7),\" - \"&INDEX($B$4:$G$103,INT((ROWS(I$4:I544)-1)/7)+1,MOD(ROWS(I$4:I544)-1,7)),\"\")","v":"Year Quolex - F-Y/DQ5679"},null,null,{"$f":"INDEX($B$4:$G$103,INT((ROWS(I$4:I544)-1)/7)+1,MOD(ROWS(I$4:I544)-1,7))","v":"F-Y/DQ5679"}]
[null,null,null,null,null,null,null,null,null,{"$f":"INDEX($A$4:$A$103,INT((ROWS(I$4:I545)-1)/7)+1)&IF(MOD(ROWS(I$4:I545)-1,7),\" - \"&INDEX($B$4:$G$103,INT((ROWS(I$4:I545)-1)/7)+1,MOD(ROWS(I$4:I545)-1,7)),\"\")","v":"Year Quolex - E-W/DQ8224"},null,null,{"$f":"INDEX($B$4:$G$103,INT((ROWS(I$4:I545)-1)/7)+1,MOD(ROWS(I$4:I545)-1,7))","v":"E-W/DQ8224"}]
[null,null,null,null,null,null,null,null,null,{"$f":"INDEX($A$4:$A$103,INT((ROWS(I$4:I546)-1)/7)+1)&IF(MOD(ROWS(I$4:I546)-1,7),\" - \"&INDEX($B$4:$G$103,INT((ROWS(I$4:I546)-1)/7)+1,MOD(ROWS(I$4:I546)-1,7)),\"\")","v":"Year Quolex - N-X/DQ6670"},null,null,{"$f":"INDEX($B$4:$G$103,INT((ROWS(I$4:I546)-1)/7)+1,MOD(ROWS(I$4:I546)-1,7))","v":"N-X/DQ6670"}]
[null,null,null,null,null,null,null,null,null,{"$f":"INDEX($A$4:$A$103,INT((ROWS(I$4:I547)-1)/7)+1)&IF(MOD(ROWS(I$4:I547)-1,7),\" - \"&INDEX($B$4:$G$103,INT((ROWS(I$4:I547)-1)/7)+1,MOD(ROWS(I$4:I547)-1,7)),\"\")","v":"Year Quolex - L-Z/DQ5606"},null,null,{"$f":"INDEX($B$4:$G$103,INT((ROWS(I$4:I547)-1)/7)+1,MOD(ROWS(I$4:I547)-1,7))","v":"L-Z/DQ5606"}]
[null,null,null,null,null,null,null,null,null,{"$f":"INDEX($A$4:$A$103,INT((ROWS(I$4:I548)-1)/7)+1)&IF(MOD(ROWS(I$4:I548)-1,7),\" - \"&INDEX($B$4:$G$103,INT((ROWS(I$4:I548)-1)/7)+1,MOD(ROWS(I$4:I548)-1,7)),\"\")","v":"Year Quolex - M-J/DQ6877"},null,null,{"$f":"INDEX($B$4:$G$103,INT((ROWS(I$4:I548)-1)/7)+1,MOD(ROWS(I$4:I548)-1,7))","v":"M-J/DQ6877"}]
[null,null,null,null,null,null,null,null,null,{"$f":"INDEX($A$4:$A$103,INT((ROWS(I$4:I549)-1)/7)+1)&IF(MOD(ROWS(I$4:I549)-1,7),\" - \"&INDEX($B$4:$G$103,INT((ROWS(I$4:I549)-1)/7)+1,MOD(ROWS(I$4:I549)-1,7)),\"\")","v":"Year Quolex - A-H/DQ1309"},null,null,{"$f":"INDEX($B$4:$G$103,INT((ROWS(I$4:I549)-1)/7)+1,MOD(ROWS(I$4:I549)-1,7))","v":"A-H/DQ1309"}]
[null,null,null,null,null,null,null,null,null,{"$f":"INDEX($A$4:$A$103,INT((ROWS(I$4:I550)-1)/7)+1)&IF(MOD(ROWS(I$4:I550)-1,7),\" - \"&INDEX($B$4:$G$103,INT((ROWS(I$4:I550)-1)/7)+1,MOD(ROWS(I$4:I550)-1,7)),\"\")","v":"Stimlax"},null,null,{"$f":"INDEX($B$4:$G$103,INT((ROWS(I$4:I550)-1)/7)+1,MOD(ROWS(I$4:I550)-1,7))","v":{"$error":"#VALUE!"}}]
[null,null,null,null,null,null,null,null,null,{"$f":"INDEX($A$4:$A$103,INT((ROWS(I$4:I551)-1)/7)+1)&IF(MOD(ROWS(I$4:I551)-1,7),\" - \"&INDEX($B$4:$G$103,INT((ROWS(I$4:I551)-1)/7)+1,MOD(ROWS(I$4:I551)-1,7)),\"\")","v":"Stimlax - B-D/DQ7855"},null,null,{"$f":"INDEX($B$4:$G$103,INT((ROWS(I$4:I551)-1)/7)+1,MOD(ROWS(I$4:I551)-1,7))","v":"B-D/DQ7855"}]
[null,null,null,null,null,null,null,null,null,{"$f":"INDEX($A$4:$A$103,INT((ROWS(I$4:I552)-1)/7)+1)&IF(MOD(ROWS(I$4:I552)-1,7),\" - \"&INDEX($B$4:$G$103,INT((ROWS(I$4:I552)-1)/7)+1,MOD(ROWS(I$4:I552)-1,7)),\"\")","v":"Stimlax - K-E/DQ8332"},null,null,{"$f":"INDEX($B$4:$G$103,INT((ROWS(I$4:I552)-1)/7)+1,MOD(ROWS(I$4:I552)-1,7))","v":"K-E/DQ8332"}]
[null,null,null,null,null,null,null,null,null,{"$f":"INDEX($A$4:$A$103,INT((ROWS(I$4:I553)-1)/7)+1)&IF(MOD(ROWS(I$4:I553)-1,7),\" - \"&INDEX($B$4:$G$103,INT((ROWS(I$4:I553)-1)/7)+1,MOD(ROWS(I$4:I553)-1,7)),\"\")","v":"Stimlax - A-P/DQ4738"},null,null,{"$f":"INDEX($B$4:$G$103,INT((ROWS(I$4:I553)-1)/7)+1,MOD(ROWS(I$4:I553)-1,7))","v":"A-P/DQ4738"}]
[null,null,null,null,null,null,null,null,null,{"$f":"INDEX($A$4:$A$103,INT((ROWS(I$4:I554)-1)/7)+1)&IF(MOD(ROWS(I$4:I554)-1,7),\" - \"&INDEX($B$4:$G$103,INT((ROWS(I$4:I554)-1)/7)+1,MOD(ROWS(I$4:I554)-1,7)),\"\")","v":"Stimlax - V-G/DQ2524"},null,null,{"$f":"INDEX($B$4:$G$103,INT((ROWS(I$4:I554)-1)/7)+1,MOD(ROWS(I$4:I554)-1,7))","v":"V-G/DQ2524"}]
[null,null,null,null,null,null,null,null,null,{"$f":"INDEX($A$4:$A$103,INT((ROWS(I$4:I555)-1)/7)+1)&IF(MOD(ROWS(I$4:I555)-1,7),\" - \"&INDEX($B$4:$G$103,INT((ROWS(I$4:I555)-1)/7)+1,MOD(ROWS(I$4:I555)-1,7)),\"\")","v":"Stimlax - Y-O/DQ9675"},null,null,{"$f":"INDEX($B$4:$G$103,INT((ROWS(I$4:I555)-1)/7)+1,MOD(ROWS(I$4:I555)-1,7))","v":"Y-O/DQ9675"}]
[null,null,null,null,null,null,null,null,null,{"$f":"INDEX($A$4:$A$103,INT((ROWS(I$4:I556)-1)/7)+1)&IF(MOD(ROWS(I$4:I556)-1,7),\" - \"&INDEX($B$4:$G$103,INT((ROWS(I$4:I556)-1)/7)+1,MOD(ROWS(I$4:I556)-1,7)),\"\")","v":"Stimlax - N-S/DQ6800"},null,null,{"$f":"INDEX($B$4:$G$103,INT((ROWS(I$4:I556)-1)/7)+1,MOD(ROWS(I$4:I556)-1,7))","v":"N-S/DQ6800"}]
[null,null,null,null,null,null,null,null,null,{"$f":"INDEX($A$4:$A$103,INT((ROWS(I$4:I557)-1)/7)+1)&IF(MOD(ROWS(I$4:I557)-1,7),\" - \"&INDEX($B$4:$G$103,INT((ROWS(I$4:I557)-1)/7)+1,MOD(ROWS(I$4:I557)-1,7)),\"\")","v":"Duotouch"},null,null,{"$f":"INDEX($B$4:$G$103,INT((ROWS(I$4:I557)-1)/7)+1,MOD(ROWS(I$4:I557)-1,7))","v":{"$error":"#VALUE!"}}]
[null,null,null,null,null,null,null,null,null,{"$f":"INDEX($A$4:$A$103,INT((ROWS(I$4:I558)-1)/7)+1)&IF(MOD(ROWS(I$4:I558)-1,7),\" - \"&INDEX($B$4:$G$103,INT((ROWS(I$4:I558)-1)/7)+1,MOD(ROWS(I$4:I558)-1,7)),\"\")","v":"Duotouch - Z-V/DQ3753"},null,null,{"$f":"INDEX($B$4:$G$103,INT((ROWS(I$4:I558)-1)/7)+1,MOD(ROWS(I$4:I558)-1,7))","v":"Z-V/DQ3753"}]
[null,null,null,null,null,null,null,null,null,{"$f":"INDEX($A$4:$A$103,INT((ROWS(I$4:I559)-1)/7)+1)&IF(MOD(ROWS(I$4:I559)-1,7),\" - \"&INDEX($B$4:$G$103,INT((ROWS(I$4:I559)-1)/7)+1,MOD(ROWS(I$4:I559)-1,7)),\"\")","v":"Duotouch - F-F/DQ5074"},null,null,{"$f":"INDEX($B$4:$G$103,INT((ROWS(I$4:I559)-1)/7)+1,MOD(ROWS(I$4:I559)-1,7))","v":"F-F/DQ5074"}]
[null,null,null,null,null,null,null,null,null,{"$f":"INDEX($A$4:$A$103,INT((ROWS(I$4:I560)-1)/7)+1)&IF(MOD(ROWS(I$4:I560)-1,7),\" - \"&INDEX($B$4:$G$103,INT((ROWS(I$4:I560)-1)/7)+1,MOD(ROWS(I$4:I560)-1,7)),\"\")","v":"Duotouch - A-Y/DQ2802"},null,null,{"$f":"INDEX($B$4:$G$103,INT((ROWS(I$4:I560)-1)/7)+1,MOD(ROWS(I$4:I560)-1,7))","v":"A-Y/DQ2802"}]
[null,null,null,null,null,null,null,null,null,{"$f":"INDEX($A$4:$A$103,INT((ROWS(I$4:I561)-1)/7)+1)&IF(MOD(ROWS(I$4:I561)-1,7),\" - \"&INDEX($B$4:$G$103,INT((ROWS(I$4:I561)-1)/7)+1,MOD(ROWS(I$4:I561)-1,7)),\"\")","v":"Duotouch - P-R/DQ8445"},null,null,{"$f":"INDEX($B$4:$G$103,INT((ROWS(I$4:I561)-1)/7)+1,MOD(ROWS(I$4:I561)-1,7))","v":"P-R/DQ8445"}]
[null,null,null,null,null,null,null,null,null,{"$f":"INDEX($A$4:$A$103,INT((ROWS(I$4:I562)-1)/7)+1)&IF(MOD(ROWS(I$4:I562)-1,7),\" - \"&INDEX($B$4:$G$103,INT((ROWS(I$4:I562)-1)/7)+1,MOD(ROWS(I$4:I562)-1,7)),\"\")","v":"Duotouch - Y-H/DQ6655"},null,null,{"$f":"INDEX($B$4:$G$103,INT((ROWS(I$4:I562)-1)/7)+1,MOD(ROWS(I$4:I562)-1,7))","v":"Y-H/DQ6655"}]
[null,null,null,null,null,null,null,null,null,{"$f":"INDEX($A$4:$A$103,INT((ROWS(I$4:I563)-1)/7)+1)&IF(MOD(ROWS(I$4:I563)-1,7),\" - \"&INDEX($B$4:$G$103,INT((ROWS(I$4:I563)-1)/7)+1,MOD(ROWS(I$4:I563)-1,7)),\"\")","v":"Duotouch - S-L/DQ4687"},null,null,{"$f":"INDEX($B$4:$G$103,INT((ROWS(I$4:I563)-1)/7)+1,MOD(ROWS(I$4:I563)-1,7))","v":"S-L/DQ4687"}]
[null,null,null,null,null,null,null,null,null,{"$f":"INDEX($A$4:$A$103,INT((ROWS(I$4:I564)-1)/7)+1)&IF(MOD(ROWS(I$4:I564)-1,7),\" - \"&INDEX($B$4:$G$103,INT((ROWS(I$4:I564)-1)/7)+1,MOD(ROWS(I$4:I564)-1,7)),\"\")","v":"Tam Cof"},null,null,{"$f":"INDEX($B$4:$G$103,INT((ROWS(I$4:I564)-1)/7)+1,MOD(ROWS(I$4:I564)-1,7))","v":{"$error":"#VALUE!"}}]
[null,null,null,null,null,null,null,null,null,{"$f":"INDEX($A$4:$A$103,INT((ROWS(I$4:I565)-1)/7)+1)&IF(MOD(ROWS(I$4:I565)-1,7),\" - \"&INDEX($B$4:$G$103,INT((ROWS(I$4:I565)-1)/7)+1,MOD(ROWS(I$4:I565)-1,7)),\"\")","v":"Tam Cof - H-V/DQ1159"},null,null,{"$f":"INDEX($B$4:$G$103,INT((ROWS(I$4:I565)-1)/7)+1,MOD(ROWS(I$4:I565)-1,7))","v":"H-V/DQ1159"}]
[null,null,null,null,null,null,null,null,null,{"$f":"INDEX($A$4:$A$103,INT((ROWS(I$4:I566)-1)/7)+1)&IF(MOD(ROWS(I$4:I566)-1,7),\" - \"&INDEX($B$4:$G$103,INT((ROWS(I$4:I566)-1)/7)+1,MOD(ROWS(I$4:I566)-1,7)),\"\")","v":"Tam Cof - I-R/DQ8841"},null,null,{"$f":"INDEX($B$4:$G$103,INT((ROWS(I$4:I566)-1)/7)+1,MOD(ROWS(I$4:I566)-1,7))","v":"I-R/DQ8841"}]
[null,null,null,null,null,null,null,null,null,{"$f":"INDEX($A$4:$A$103,INT((ROWS(I$4:I567)-1)/7)+1)&IF(MOD(ROWS(I$4:I567)-1,7),\" - \"&INDEX($B$4:$G$103,INT((ROWS(I$4:I567)-1)/7)+1,MOD(ROWS(I$4:I567)-1,7)),\"\")","v":"Tam Cof - V-Q/DQ8805"},null,null,{"$f":"INDEX($B$4:$G$103,INT((ROWS(I$4:I567)-1)/7)+1,MOD(ROWS(I$4:I567)-1,7))","v":"V-Q/DQ8805"}]
[null,null,null,null,null,null,null,null,null,{"$f":"INDEX($A$4:$A$103,INT((ROWS(I$4:I568)-1)/7)+1)&IF(MOD(ROWS(I$4:I568)-1,7),\" - \"&INDEX($B$4:$G$103,INT((ROWS(I$4:I568)-1)/7)+1,MOD(ROWS(I$4:I568)-1,7)),\"\")","v":"Tam Cof - X-X/DQ6355"},null,null,{"$f":"INDEX($B$4:$G$103,INT((ROWS(I$4:I568)-1)/7)+1,MOD(ROWS(I$4:I568)-1,7))","v":"X-X/DQ6355"}]
[null,null,null,null,null,null,null,null,null,{"$f":"INDEX($A$4:$A$103,INT((ROWS(I$4:I569)-1)/7)+1)&IF(MOD(ROWS(I$4:I569)-1,7),\" - \"&INDEX($B$4:$G$103,INT((ROWS(I$4:I569)-1)/7)+1,MOD(ROWS(I$4:I569)-1,7)),\"\")","v":"Tam Cof - E-B/DQ6085"},null,null,{"$f":"INDEX($B$4:$G$103,INT((ROWS(I$4:I569)-1)/7)+1,MOD(ROWS(I$4:I569)-1,7))","v":"E-B/DQ6085"}]
[null,null,null,null,null,null,null,null,null,{"$f":"INDEX($A$4:$A$103,INT((ROWS(I$4:I570)-1)/7)+1)&IF(MOD(ROWS(I$4:I570)-1,7),\" - \"&INDEX($B$4:$G$103,INT((ROWS(I$4:I570)-1)/7)+1,MOD(ROWS(I$4:I570)-1,7)),\"\")","v":"Tam Cof - V-F/DQ3156"},null,null,{"$f":"INDEX($B$4:$G$103,INT((ROWS(I$4:I570)-1)/7)+1,MOD(ROWS(I$4:I570)-1,7))","v":"V-F/DQ3156"}]
[null,null,null,null,null,null,null,null,null,{"$f":"INDEX($A$4:$A$103,INT((ROWS(I$4:I571)-1)/7)+1)&IF(MOD(ROWS(I$4:I571)-1,7),\" - \"&INDEX($B$4:$G$103,INT((ROWS(I$4:I571)-1)/7)+1,MOD(ROWS(I$4:I571)-1,7)),\"\")","v":"Viafax"},null,null,{"$f":"INDEX($B$4:$G$103,INT((ROWS(I$4:I571)-1)/7)+1,MOD(ROWS(I$4:I571)-1,7))","v":{"$error":"#VALUE!"}}]
[null,null,null,null,null,null,null,null,null,{"$f":"INDEX($A$4:$A$103,INT((ROWS(I$4:I572)-1)/7)+1)&IF(MOD(ROWS(I$4:I572)-1,7),\" - \"&INDEX($B$4:$G$103,INT((ROWS(I$4:I572)-1)/7)+1,MOD(ROWS(I$4:I572)-1,7)),\"\")","v":"Viafax - C-U/DQ9402"},null,null,{"$f":"INDEX($B$4:$G$103,INT((ROWS(I$4:I572)-1)/7)+1,MOD(ROWS(I$4:I572)-1,7))","v":"C-U/DQ9402"}]
[null,null,null,null,null,null,null,null,null,{"$f":"INDEX($A$4:$A$103,INT((ROWS(I$4:I573)-1)/7)+1)&IF(MOD(ROWS(I$4:I573)-1,7),\" - \"&INDEX($B$4:$G$103,INT((ROWS(I$4:I573)-1)/7)+1,MOD(ROWS(I$4:I573)-1,7)),\"\")","v":"Viafax - B-J/DQ9539"},null,null,{"$f":"INDEX($B$4:$G$103,INT((ROWS(I$4:I573)-1)/7)+1,MOD(ROWS(I$4:I573)-1,7))","v":"B-J/DQ9539"}]
[null,null,null,null,null,null,null,null,null,{"$f":"INDEX($A$4:$A$103,INT((ROWS(I$4:I574)-1)/7)+1)&IF(MOD(ROWS(I$4:I574)-1,7),\" - \"&INDEX($B$4:$G$103,INT((ROWS(I$4:I574)-1)/7)+1,MOD(ROWS(I$4:I574)-1,7)),\"\")","v":"Viafax - L-F/DQ2057"},null,null,{"$f":"INDEX($B$4:$G$103,INT((ROWS(I$4:I574)-1)/7)+1,MOD(ROWS(I$4:I574)-1,7))","v":"L-F/DQ2057"}]
[null,null,null,null,null,null,null,null,null,{"$f":"INDEX($A$4:$A$103,INT((ROWS(I$4:I575)-1)/7)+1)&IF(MOD(ROWS(I$4:I575)-1,7),\" - \"&INDEX($B$4:$G$103,INT((ROWS(I$4:I575)-1)/7)+1,MOD(ROWS(I$4:I575)-1,7)),\"\")","v":"Viafax - O-X/DQ7355"},null,null,{"$f":"INDEX($B$4:$G$103,INT((ROWS(I$4:I575)-1)/7)+1,MOD(ROWS(I$4:I575)-1,7))","v":"O-X/DQ7355"}]
[null,null,null,null,null,null,null,null,null,{"$f":"INDEX($A$4:$A$103,INT((ROWS(I$4:I576)-1)/7)+1)&IF(MOD(ROWS(I$4:I576)-1,7),\" - \"&INDEX($B$4:$G$103,INT((ROWS(I$4:I576)-1)/7)+1,MOD(ROWS(I$4:I576)-1,7)),\"\")","v":"Viafax - V-V/DQ1752"},null,null,{"$f":"INDEX($B$4:$G$103,INT((ROWS(I$4:I576)-1)/7)+1,MOD(ROWS(I$4:I576)-1,7))","v":"V-V/DQ1752"}]
[null,null,null,null,null,null,null,null,null,{"$f":"INDEX($A$4:$A$103,INT((ROWS(I$4:I577)-1)/7)+1)&IF(MOD(ROWS(I$4:I577)-1,7),\" - \"&INDEX($B$4:$G$103,INT((ROWS(I$4:I577)-1)/7)+1,MOD(ROWS(I$4:I577)-1,7)),\"\")","v":"Viafax - R-Y/DQ2556"},null,null,{"$f":"INDEX($B$4:$G$103,INT((ROWS(I$4:I577)-1)/7)+1,MOD(ROWS(I$4:I577)-1,7))","v":"R-Y/DQ2556"}]
[null,null,null,null,null,null,null,null,null,{"$f":"INDEX($A$4:$A$103,INT((ROWS(I$4:I578)-1)/7)+1)&IF(MOD(ROWS(I$4:I578)-1,7),\" - \"&INDEX($B$4:$G$103,INT((ROWS(I$4:I578)-1)/7)+1,MOD(ROWS(I$4:I578)-1,7)),\"\")","v":"Plus Zap"},null,null,{"$f":"INDEX($B$4:$G$103,INT((ROWS(I$4:I578)-1)/7)+1,MOD(ROWS(I$4:I578)-1,7))","v":{"$error":"#VALUE!"}}]
[null,null,null,null,null,null,null,null,null,{"$f":"INDEX($A$4:$A$103,INT((ROWS(I$4:I579)-1)/7)+1)&IF(MOD(ROWS(I$4:I579)-1,7),\" - \"&INDEX($B$4:$G$103,INT((ROWS(I$4:I579)-1)/7)+1,MOD(ROWS(I$4:I579)-1,7)),\"\")","v":"Plus Zap - F-P/DQ1528"},null,null,{"$f":"INDEX($B$4:$G$103,INT((ROWS(I$4:I579)-1)/7)+1,MOD(ROWS(I$4:I579)-1,7))","v":"F-P/DQ1528"}]
[null,null,null,null,null,null,null,null,null,{"$f":"INDEX($A$4:$A$103,INT((ROWS(I$4:I580)-1)/7)+1)&IF(MOD(ROWS(I$4:I580)-1,7),\" - \"&INDEX($B$4:$G$103,INT((ROWS(I$4:I580)-1)/7)+1,MOD(ROWS(I$4:I580)-1,7)),\"\")","v":"Plus Zap - A-R/DQ8428"},null,null,{"$f":"INDEX($B$4:$G$103,INT((ROWS(I$4:I580)-1)/7)+1,MOD(ROWS(I$4:I580)-1,7))","v":"A-R/DQ8428"}]
[null,null,null,null,null,null,null,null,null,{"$f":"INDEX($A$4:$A$103,INT((ROWS(I$4:I581)-1)/7)+1)&IF(MOD(ROWS(I$4:I581)-1,7),\" - \"&INDEX($B$4:$G$103,INT((ROWS(I$4:I581)-1)/7)+1,MOD(ROWS(I$4:I581)-1,7)),\"\")","v":"Plus Zap - P-J/DQ8896"},null,null,{"$f":"INDEX($B$4:$G$103,INT((ROWS(I$4:I581)-1)/7)+1,MOD(ROWS(I$4:I581)-1,7))","v":"P-J/DQ8896"}]
[null,null,null,null,null,null,null,null,null,{"$f":"INDEX($A$4:$A$103,INT((ROWS(I$4:I582)-1)/7)+1)&IF(MOD(ROWS(I$4:I582)-1,7),\" - \"&INDEX($B$4:$G$103,INT((ROWS(I$4:I582)-1)/7)+1,MOD(ROWS(I$4:I582)-1,7)),\"\")","v":"Plus Zap - C-P/DQ5399"},null,null,{"$f":"INDEX($B$4:$G$103,INT((ROWS(I$4:I582)-1)/7)+1,MOD(ROWS(I$4:I582)-1,7))","v":"C-P/DQ5399"}]
[null,null,null,null,null,null,null,null,null,{"$f":"INDEX($A$4:$A$103,INT((ROWS(I$4:I583)-1)/7)+1)&IF(MOD(ROWS(I$4:I583)-1,7),\" - \"&INDEX($B$4:$G$103,INT((ROWS(I$4:I583)-1)/7)+1,MOD(ROWS(I$4:I583)-1,7)),\"\")","v":"Plus Zap - X-Z/DQ5028"},null,null,{"$f":"INDEX($B$4:$G$103,INT((ROWS(I$4:I583)-1)/7)+1,MOD(ROWS(I$4:I583)-1,7))","v":"X-Z/DQ5028"}]
[null,null,null,null,null,null,null,null,null,{"$f":"INDEX($A$4:$A$103,INT((ROWS(I$4:I584)-1)/7)+1)&IF(MOD(ROWS(I$4:I584)-1,7),\" - \"&INDEX($B$4:$G$103,INT((ROWS(I$4:I584)-1)/7)+1,MOD(ROWS(I$4:I584)-1,7)),\"\")","v":"Plus Zap - S-C/DQ3339"},null,null,{"$f":"INDEX($B$4:$G$103,INT((ROWS(I$4:I584)-1)/7)+1,MOD(ROWS(I$4:I584)-1,7))","v":"S-C/DQ3339"}]
[null,null,null,null,null,null,null,null,null,{"$f":"INDEX($A$4:$A$103,INT((ROWS(I$4:I585)-1)/7)+1)&IF(MOD(ROWS(I$4:I585)-1,7),\" - \"&INDEX($B$4:$G$103,INT((ROWS(I$4:I585)-1)/7)+1,MOD(ROWS(I$4:I585)-1,7)),\"\")","v":"Toptax"},null,null,{"$f":"INDEX($B$4:$G$103,INT((ROWS(I$4:I585)-1)/7)+1,MOD(ROWS(I$4:I585)-1,7))","v":{"$error":"#VALUE!"}}]
[null,null,null,null,null,null,null,null,null,{"$f":"INDEX($A$4:$A$103,INT((ROWS(I$4:I586)-1)/7)+1)&IF(MOD(ROWS(I$4:I586)-1,7),\" - \"&INDEX($B$4:$G$103,INT((ROWS(I$4:I586)-1)/7)+1,MOD(ROWS(I$4:I586)-1,7)),\"\")","v":"Toptax - P-P/DQ7924"},null,null,{"$f":"INDEX($B$4:$G$103,INT((ROWS(I$4:I586)-1)/7)+1,MOD(ROWS(I$4:I586)-1,7))","v":"P-P/DQ7924"}]
[null,null,null,null,null,null,null,null,null,{"$f":"INDEX($A$4:$A$103,INT((ROWS(I$4:I587)-1)/7)+1)&IF(MOD(ROWS(I$4:I587)-1,7),\" - \"&INDEX($B$4:$G$103,INT((ROWS(I$4:I587)-1)/7)+1,MOD(ROWS(I$4:I587)-1,7)),\"\")","v":"Toptax - G-O/DQ6067"},null,null,{"$f":"INDEX($B$4:$G$103,INT((ROWS(I$4:I587)-1)/7)+1,MOD(ROWS(I$4:I587)-1,7))","v":"G-O/DQ6067"}]
[null,null,null,null,null,null,null,null,null,{"$f":"INDEX($A$4:$A$103,INT((ROWS(I$4:I588)-1)/7)+1)&IF(MOD(ROWS(I$4:I588)-1,7),\" - \"&INDEX($B$4:$G$103,INT((ROWS(I$4:I588)-1)/7)+1,MOD(ROWS(I$4:I588)-1,7)),\"\")","v":"Toptax - Z-J/DQ8325"},null,null,{"$f":"INDEX($B$4:$G$103,INT((ROWS(I$4:I588)-1)/7)+1,MOD(ROWS(I$4:I588)-1,7))","v":"Z-J/DQ8325"}]
[null,null,null,null,null,null,null,null,null,{"$f":"INDEX($A$4:$A$103,INT((ROWS(I$4:I589)-1)/7)+1)&IF(MOD(ROWS(I$4:I589)-1,7),\" - \"&INDEX($B$4:$G$103,INT((ROWS(I$4:I589)-1)/7)+1,MOD(ROWS(I$4:I589)-1,7)),\"\")","v":"Toptax - U-W/DQ4138"},null,null,{"$f":"INDEX($B$4:$G$103,INT((ROWS(I$4:I589)-1)/7)+1,MOD(ROWS(I$4:I589)-1,7))","v":"U-W/DQ4138"}]
[null,null,null,null,null,null,null,null,null,{"$f":"INDEX($A$4:$A$103,INT((ROWS(I$4:I590)-1)/7)+1)&IF(MOD(ROWS(I$4:I590)-1,7),\" - \"&INDEX($B$4:$G$103,INT((ROWS(I$4:I590)-1)/7)+1,MOD(ROWS(I$4:I590)-1,7)),\"\")","v":"Toptax - C-P/DQ4351"},null,null,{"$f":"INDEX($B$4:$G$103,INT((ROWS(I$4:I590)-1)/7)+1,MOD(ROWS(I$4:I590)-1,7))","v":"C-P/DQ4351"}]
[null,null,null,null,null,null,null,null,null,{"$f":"INDEX($A$4:$A$103,INT((ROWS(I$4:I591)-1)/7)+1)&IF(MOD(ROWS(I$4:I591)-1,7),\" - \"&INDEX($B$4:$G$103,INT((ROWS(I$4:I591)-1)/7)+1,MOD(ROWS(I$4:I591)-1,7)),\"\")","v":"Toptax - D-U/DQ7085"},null,null,{"$f":"INDEX($B$4:$G$103,INT((ROWS(I$4:I591)-1)/7)+1,MOD(ROWS(I$4:I591)-1,7))","v":"D-U/DQ7085"}]
[null,null,null,null,null,null,null,null,null,{"$f":"INDEX($A$4:$A$103,INT((ROWS(I$4:I592)-1)/7)+1)&IF(MOD(ROWS(I$4:I592)-1,7),\" - \"&INDEX($B$4:$G$103,INT((ROWS(I$4:I592)-1)/7)+1,MOD(ROWS(I$4:I592)-1,7)),\"\")","v":"Softsoft"},null,null,{"$f":"INDEX($B$4:$G$103,INT((ROWS(I$4:I592)-1)/7)+1,MOD(ROWS(I$4:I592)-1,7))","v":{"$error":"#VALUE!"}}]
[null,null,null,null,null,null,null,null,null,{"$f":"INDEX($A$4:$A$103,INT((ROWS(I$4:I593)-1)/7)+1)&IF(MOD(ROWS(I$4:I593)-1,7),\" - \"&INDEX($B$4:$G$103,INT((ROWS(I$4:I593)-1)/7)+1,MOD(ROWS(I$4:I593)-1,7)),\"\")","v":"Softsoft - K-H/DQ9934"},null,null,{"$f":"INDEX($B$4:$G$103,INT((ROWS(I$4:I593)-1)/7)+1,MOD(ROWS(I$4:I593)-1,7))","v":"K-H/DQ9934"}]
[null,null,null,null,null,null,null,null,null,{"$f":"INDEX($A$4:$A$103,INT((ROWS(I$4:I594)-1)/7)+1)&IF(MOD(ROWS(I$4:I594)-1,7),\" - \"&INDEX($B$4:$G$103,INT((ROWS(I$4:I594)-1)/7)+1,MOD(ROWS(I$4:I594)-1,7)),\"\")","v":"Softsoft - Z-A/DQ9772"},null,null,{"$f":"INDEX($B$4:$G$103,INT((ROWS(I$4:I594)-1)/7)+1,MOD(ROWS(I$4:I594)-1,7))","v":"Z-A/DQ9772"}]
[null,null,null,null,null,null,null,null,null,{"$f":"INDEX($A$4:$A$103,INT((ROWS(I$4:I595)-1)/7)+1)&IF(MOD(ROWS(I$4:I595)-1,7),\" - \"&INDEX($B$4:$G$103,INT((ROWS(I$4:I595)-1)/7)+1,MOD(ROWS(I$4:I595)-1,7)),\"\")","v":"Softsoft - T-X/DQ3131"},null,null,{"$f":"INDEX($B$4:$G$103,INT((ROWS(I$4:I595)-1)/7)+1,MOD(ROWS(I$4:I595)-1,7))","v":"T-X/DQ3131"}]
[null,null,null,null,null,null,null,null,null,{"$f":"INDEX($A$4:$A$103,INT((ROWS(I$4:I596)-1)/7)+1)&IF(MOD(ROWS(I$4:I596)-1,7),\" - \"&INDEX($B$4:$G$103,INT((ROWS(I$4:I596)-1)/7)+1,MOD(ROWS(I$4:I596)-1,7)),\"\")","v":"Softsoft - I-W/DQ1963"},null,null,{"$f":"INDEX($B$4:$G$103,INT((ROWS(I$4:I596)-1)/7)+1,MOD(ROWS(I$4:I596)-1,7))","v":"I-W/DQ1963"}]
[null,null,null,null,null,null,null,null,null,{"$f":"INDEX($A$4:$A$103,INT((ROWS(I$4:I597)-1)/7)+1)&IF(MOD(ROWS(I$4:I597)-1,7),\" - \"&INDEX($B$4:$G$103,INT((ROWS(I$4:I597)-1)/7)+1,MOD(ROWS(I$4:I597)-1,7)),\"\")","v":"Softsoft - L-L/DQ3491"},null,null,{"$f":"INDEX($B$4:$G$103,INT((ROWS(I$4:I597)-1)/7)+1,MOD(ROWS(I$4:I597)-1,7))","v":"L-L/DQ3491"}]
[null,null,null,null,null,null,null,null,null,{"$f":"INDEX($A$4:$A$103,INT((ROWS(I$4:I598)-1)/7)+1)&IF(MOD(ROWS(I$4:I598)-1,7),\" - \"&INDEX($B$4:$G$103,INT((ROWS(I$4:I598)-1)/7)+1,MOD(ROWS(I$4:I598)-1,7)),\"\")","v":"Softsoft - R-P/DQ4740"},null,null,{"$f":"INDEX($B$4:$G$103,INT((ROWS(I$4:I598)-1)/7)+1,MOD(ROWS(I$4:I598)-1,7))","v":"R-P/DQ4740"}]
[null,null,null,null,null,null,null,null,null,{"$f":"INDEX($A$4:$A$103,INT((ROWS(I$4:I599)-1)/7)+1)&IF(MOD(ROWS(I$4:I599)-1,7),\" - \"&INDEX($B$4:$G$103,INT((ROWS(I$4:I599)-1)/7)+1,MOD(ROWS(I$4:I599)-1,7)),\"\")","v":"Sumremjob"},null,null,{"$f":"INDEX($B$4:$G$103,INT((ROWS(I$4:I599)-1)/7)+1,MOD(ROWS(I$4:I599)-1,7))","v":{"$error":"#VALUE!"}}]
[null,null,null,null,null,null,null,null,null,{"$f":"INDEX($A$4:$A$103,INT((ROWS(I$4:I600)-1)/7)+1)&IF(MOD(ROWS(I$4:I600)-1,7),\" - \"&INDEX($B$4:$G$103,INT((ROWS(I$4:I600)-1)/7)+1,MOD(ROWS(I$4:I600)-1,7)),\"\")","v":"Sumremjob - U-I/DQ5770"},null,null,{"$f":"INDEX($B$4:$G$103,INT((ROWS(I$4:I600)-1)/7)+1,MOD(ROWS(I$4:I600)-1,7))","v":"U-I/DQ5770"}]
[null,null,null,null,null,null,null,null,null,{"$f":"INDEX($A$4:$A$103,INT((ROWS(I$4:I601)-1)/7)+1)&IF(MOD(ROWS(I$4:I601)-1,7),\" - \"&INDEX($B$4:$G$103,INT((ROWS(I$4:I601)-1)/7)+1,MOD(ROWS(I$4:I601)-1,7)),\"\")","v":"Sumremjob - J-V/DQ1316"},null,null,{"$f":"INDEX($B$4:$G$103,INT((ROWS(I$4:I601)-1)/7)+1,MOD(ROWS(I$4:I601)-1,7))","v":"J-V/DQ1316"}]
[null,null,null,null,null,null,null,null,null,{"$f":"INDEX($A$4:$A$103,INT((ROWS(I$4:I602)-1)/7)+1)&IF(MOD(ROWS(I$4:I602)-1,7),\" - \"&INDEX($B$4:$G$103,INT((ROWS(I$4:I602)-1)/7)+1,MOD(ROWS(I$4:I602)-1,7)),\"\")","v":"Sumremjob - S-D/DQ3642"},null,null,{"$f":"INDEX($B$4:$G$103,INT((ROWS(I$4:I602)-1)/7)+1,MOD(ROWS(I$4:I602)-1,7))","v":"S-D/DQ3642"}]
[null,null,null,null,null,null,null,null,null,{"$f":"INDEX($A$4:$A$103,INT((ROWS(I$4:I603)-1)/7)+1)&IF(MOD(ROWS(I$4:I603)-1,7),\" - \"&INDEX($B$4:$G$103,INT((ROWS(I$4:I603)-1)/7)+1,MOD(ROWS(I$4:I603)-1,7)),\"\")","v":"Sumremjob - M-Z/DQ8379"},null,null,{"$f":"INDEX($B$4:$G$103,INT((ROWS(I$4:I603)-1)/7)+1,MOD(ROWS(I$4:I603)-1,7))","v":"M-Z/DQ8379"}]
[null,null,null,null,null,null,null,null,null,{"$f":"INDEX($A$4:$A$103,INT((ROWS(I$4:I604)-1)/7)+1)&IF(MOD(ROWS(I$4:I604)-1,7),\" - \"&INDEX($B$4:$G$103,INT((ROWS(I$4:I604)-1)/7)+1,MOD(ROWS(I$4:I604)-1,7)),\"\")","v":"Sumremjob - I-B/DQ7976"},null,null,{"$f":"INDEX($B$4:$G$103,INT((ROWS(I$4:I604)-1)/7)+1,MOD(ROWS(I$4:I604)-1,7))","v":"I-B/DQ7976"}]
[null,null,null,null,null,null,null,null,null,{"$f":"INDEX($A$4:$A$103,INT((ROWS(I$4:I605)-1)/7)+1)&IF(MOD(ROWS(I$4:I605)-1,7),\" - \"&INDEX($B$4:$G$103,INT((ROWS(I$4:I605)-1)/7)+1,MOD(ROWS(I$4:I605)-1,7)),\"\")","v":"Sumremjob - N-C/DQ8554"},null,null,{"$f":"INDEX($B$4:$G$103,INT((ROWS(I$4:I605)-1)/7)+1,MOD(ROWS(I$4:I605)-1,7))","v":"N-C/DQ8554"}]
[null,null,null,null,null,null,null,null,null,{"$f":"INDEX($A$4:$A$103,INT((ROWS(I$4:I606)-1)/7)+1)&IF(MOD(ROWS(I$4:I606)-1,7),\" - \"&INDEX($B$4:$G$103,INT((ROWS(I$4:I606)-1)/7)+1,MOD(ROWS(I$4:I606)-1,7)),\"\")","v":"Kanflex"},null,null,{"$f":"INDEX($B$4:$G$103,INT((ROWS(I$4:I606)-1)/7)+1,MOD(ROWS(I$4:I606)-1,7))","v":{"$error":"#VALUE!"}}]
[null,null,null,null,null,null,null,null,null,{"$f":"INDEX($A$4:$A$103,INT((ROWS(I$4:I607)-1)/7)+1)&IF(MOD(ROWS(I$4:I607)-1,7),\" - \"&INDEX($B$4:$G$103,INT((ROWS(I$4:I607)-1)/7)+1,MOD(ROWS(I$4:I607)-1,7)),\"\")","v":"Kanflex - M-F/DQ2070"},null,null,{"$f":"INDEX($B$4:$G$103,INT((ROWS(I$4:I607)-1)/7)+1,MOD(ROWS(I$4:I607)-1,7))","v":"M-F/DQ2070"}]
[null,null,null,null,null,null,null,null,null,{"$f":"INDEX($A$4:$A$103,INT((ROWS(I$4:I608)-1)/7)+1)&IF(MOD(ROWS(I$4:I608)-1,7),\" - \"&INDEX($B$4:$G$103,INT((ROWS(I$4:I608)-1)/7)+1,MOD(ROWS(I$4:I608)-1,7)),\"\")","v":"Kanflex - S-Y/DQ9095"},null,null,{"$f":"INDEX($B$4:$G$103,INT((ROWS(I$4:I608)-1)/7)+1,MOD(ROWS(I$4:I608)-1,7))","v":"S-Y/DQ9095"}]
[null,null,null,null,null,null,null,null,null,{"$f":"INDEX($A$4:$A$103,INT((ROWS(I$4:I609)-1)/7)+1)&IF(MOD(ROWS(I$4:I609)-1,7),\" - \"&INDEX($B$4:$G$103,INT((ROWS(I$4:I609)-1)/7)+1,MOD(ROWS(I$4:I609)-1,7)),\"\")","v":"Kanflex - R-W/DQ8908"},null,null,{"$f":"INDEX($B$4:$G$103,INT((ROWS(I$4:I609)-1)/7)+1,MOD(ROWS(I$4:I609)-1,7))","v":"R-W/DQ8908"}]
[null,null,null,null,null,null,null,null,null,{"$f":"INDEX($A$4:$A$103,INT((ROWS(I$4:I610)-1)/7)+1)&IF(MOD(ROWS(I$4:I610)-1,7),\" - \"&INDEX($B$4:$G$103,INT((ROWS(I$4:I610)-1)/7)+1,MOD(ROWS(I$4:I610)-1,7)),\"\")","v":"Kanflex - N-L/DQ6432"},null,null,{"$f":"INDEX($B$4:$G$103,INT((ROWS(I$4:I610)-1)/7)+1,MOD(ROWS(I$4:I610)-1,7))","v":"N-L/DQ6432"}]
[null,null,null,null,null,null,null,null,null,{"$f":"INDEX($A$4:$A$103,INT((ROWS(I$4:I611)-1)/7)+1)&IF(MOD(ROWS(I$4:I611)-1,7),\" - \"&INDEX($B$4:$G$103,INT((ROWS(I$4:I611)-1)/7)+1,MOD(ROWS(I$4:I611)-1,7)),\"\")","v":"Kanflex - M-L/DQ8263"},null,null,{"$f":"INDEX($B$4:$G$103,INT((ROWS(I$4:I611)-1)/7)+1,MOD(ROWS(I$4:I611)-1,7))","v":"M-L/DQ8263"}]
[null,null,null,null,null,null,null,null,null,{"$f":"INDEX($A$4:$A$103,INT((ROWS(I$4:I612)-1)/7)+1)&IF(MOD(ROWS(I$4:I612)-1,7),\" - \"&INDEX($B$4:$G$103,INT((ROWS(I$4:I612)-1)/7)+1,MOD(ROWS(I$4:I612)-1,7)),\"\")","v":"Kanflex - L-O/DQ6467"},null,null,{"$f":"INDEX($B$4:$G$103,INT((ROWS(I$4:I612)-1)/7)+1,MOD(ROWS(I$4:I612)-1,7))","v":"L-O/DQ6467"}]
[null,null,null,null,null,null,null,null,null,{"$f":"INDEX($A$4:$A$103,INT((ROWS(I$4:I613)-1)/7)+1)&IF(MOD(ROWS(I$4:I613)-1,7),\" - \"&INDEX($B$4:$G$103,INT((ROWS(I$4:I613)-1)/7)+1,MOD(ROWS(I$4:I613)-1,7)),\"\")","v":"Trustlex"},null,null,{"$f":"INDEX($B$4:$G$103,INT((ROWS(I$4:I613)-1)/7)+1,MOD(ROWS(I$4:I613)-1,7))","v":{"$error":"#VALUE!"}}]
[null,null,null,null,null,null,null,null,null,{"$f":"INDEX($A$4:$A$103,INT((ROWS(I$4:I614)-1)/7)+1)&IF(MOD(ROWS(I$4:I614)-1,7),\" - \"&INDEX($B$4:$G$103,INT((ROWS(I$4:I614)-1)/7)+1,MOD(ROWS(I$4:I614)-1,7)),\"\")","v":"Trustlex - Y-G/DQ3874"},null,null,{"$f":"INDEX($B$4:$G$103,INT((ROWS(I$4:I614)-1)/7)+1,MOD(ROWS(I$4:I614)-1,7))","v":"Y-G/DQ3874"}]
[null,null,null,null,null,null,null,null,null,{"$f":"INDEX($A$4:$A$103,INT((ROWS(I$4:I615)-1)/7)+1)&IF(MOD(ROWS(I$4:I615)-1,7),\" - \"&INDEX($B$4:$G$103,INT((ROWS(I$4:I615)-1)/7)+1,MOD(ROWS(I$4:I615)-1,7)),\"\")","v":"Trustlex - O-W/DQ1250"},null,null,{"$f":"INDEX($B$4:$G$103,INT((ROWS(I$4:I615)-1)/7)+1,MOD(ROWS(I$4:I615)-1,7))","v":"O-W/DQ1250"}]
[null,null,null,null,null,null,null,null,null,{"$f":"INDEX($A$4:$A$103,INT((ROWS(I$4:I616)-1)/7)+1)&IF(MOD(ROWS(I$4:I616)-1,7),\" - \"&INDEX($B$4:$G$103,INT((ROWS(I$4:I616)-1)/7)+1,MOD(ROWS(I$4:I616)-1,7)),\"\")","v":"Trustlex - F-T/DQ7332"},null,null,{"$f":"INDEX($B$4:$G$103,INT((ROWS(I$4:I616)-1)/7)+1,MOD(ROWS(I$4:I616)-1,7))","v":"F-T/DQ7332"}]
[null,null,null,null,null,null,null,null,null,{"$f":"INDEX($A$4:$A$103,INT((ROWS(I$4:I617)-1)/7)+1)&IF(MOD(ROWS(I$4:I617)-1,7),\" - \"&INDEX($B$4:$G$103,INT((ROWS(I$4:I617)-1)/7)+1,MOD(ROWS(I$4:I617)-1,7)),\"\")","v":"Trustlex - V-Q/DQ9747"},null,null,{"$f":"INDEX($B$4:$G$103,INT((ROWS(I$4:I617)-1)/7)+1,MOD(ROWS(I$4:I617)-1,7))","v":"V-Q/DQ9747"}]
[null,null,null,null,null,null,null,null,null,{"$f":"INDEX($A$4:$A$103,INT((ROWS(I$4:I618)-1)/7)+1)&IF(MOD(ROWS(I$4:I618)-1,7),\" - \"&INDEX($B$4:$G$103,INT((ROWS(I$4:I618)-1)/7)+1,MOD(ROWS(I$4:I618)-1,7)),\"\")","v":"Trustlex - J-W/DQ5551"},null,null,{"$f":"INDEX($B$4:$G$103,INT((ROWS(I$4:I618)-1)/7)+1,MOD(ROWS(I$4:I618)-1,7))","v":"J-W/DQ5551"}]
[null,null,null,null,null,null,null,null,null,{"$f":"INDEX($A$4:$A$103,INT((ROWS(I$4:I619)-1)/7)+1)&IF(MOD(ROWS(I$4:I619)-1,7),\" - \"&INDEX($B$4:$G$103,INT((ROWS(I$4:I619)-1)/7)+1,MOD(ROWS(I$4:I619)-1,7)),\"\")","v":"Trustlex - K-Y/DQ4298"},null,null,{"$f":"INDEX($B$4:$G$103,INT((ROWS(I$4:I619)-1)/7)+1,MOD(ROWS(I$4:I619)-1,7))","v":"K-Y/DQ4298"}]
[null,null,null,null,null,null,null,null,null,{"$f":"INDEX($A$4:$A$103,INT((ROWS(I$4:I620)-1)/7)+1)&IF(MOD(ROWS(I$4:I620)-1,7),\" - \"&INDEX($B$4:$G$103,INT((ROWS(I$4:I620)-1)/7)+1,MOD(ROWS(I$4:I620)-1,7)),\"\")","v":"Joyis"},null,null,{"$f":"INDEX($B$4:$G$103,INT((ROWS(I$4:I620)-1)/7)+1,MOD(ROWS(I$4:I620)-1,7))","v":{"$error":"#VALUE!"}}]
[null,null,null,null,null,null,null,null,null,{"$f":"INDEX($A$4:$A$103,INT((ROWS(I$4:I621)-1)/7)+1)&IF(MOD(ROWS(I$4:I621)-1,7),\" - \"&INDEX($B$4:$G$103,INT((ROWS(I$4:I621)-1)/7)+1,MOD(ROWS(I$4:I621)-1,7)),\"\")","v":"Joyis - T-C/DQ6871"},null,null,{"$f":"INDEX($B$4:$G$103,INT((ROWS(I$4:I621)-1)/7)+1,MOD(ROWS(I$4:I621)-1,7))","v":"T-C/DQ6871"}]
[null,null,null,null,null,null,null,null,null,{"$f":"INDEX($A$4:$A$103,INT((ROWS(I$4:I622)-1)/7)+1)&IF(MOD(ROWS(I$4:I622)-1,7),\" - \"&INDEX($B$4:$G$103,INT((ROWS(I$4:I622)-1)/7)+1,MOD(ROWS(I$4:I622)-1,7)),\"\")","v":"Joyis - J-D/DQ9245"},null,null,{"$f":"INDEX($B$4:$G$103,INT((ROWS(I$4:I622)-1)/7)+1,MOD(ROWS(I$4:I622)-1,7))","v":"J-D/DQ9245"}]
[null,null,null,null,null,null,null,null,null,{"$f":"INDEX($A$4:$A$103,INT((ROWS(I$4:I623)-1)/7)+1)&IF(MOD(ROWS(I$4:I623)-1,7),\" - \"&INDEX($B$4:$G$103,INT((ROWS(I$4:I623)-1)/7)+1,MOD(ROWS(I$4:I623)-1,7)),\"\")","v":"Joyis - J-P/DQ4029"},null,null,{"$f":"INDEX($B$4:$G$103,INT((ROWS(I$4:I623)-1)/7)+1,MOD(ROWS(I$4:I623)-1,7))","v":"J-P/DQ4029"}]
[null,null,null,null,null,null,null,null,null,{"$f":"INDEX($A$4:$A$103,INT((ROWS(I$4:I624)-1)/7)+1)&IF(MOD(ROWS(I$4:I624)-1,7),\" - \"&INDEX($B$4:$G$103,INT((ROWS(I$4:I624)-1)/7)+1,MOD(ROWS(I$4:I624)-1,7)),\"\")","v":"Joyis - G-N/DQ6122"},null,null,{"$f":"INDEX($B$4:$G$103,INT((ROWS(I$4:I624)-1)/7)+1,MOD(ROWS(I$4:I624)-1,7))","v":"G-N/DQ6122"}]
[null,null,null,null,null,null,null,null,null,{"$f":"INDEX($A$4:$A$103,INT((ROWS(I$4:I625)-1)/7)+1)&IF(MOD(ROWS(I$4:I625)-1,7),\" - \"&INDEX($B$4:$G$103,INT((ROWS(I$4:I625)-1)/7)+1,MOD(ROWS(I$4:I625)-1,7)),\"\")","v":"Joyis - A-X/DQ4996"},null,null,{"$f":"INDEX($B$4:$G$103,INT((ROWS(I$4:I625)-1)/7)+1,MOD(ROWS(I$4:I625)-1,7))","v":"A-X/DQ4996"}]
[null,null,null,null,null,null,null,null,null,{"$f":"INDEX($A$4:$A$103,INT((ROWS(I$4:I626)-1)/7)+1)&IF(MOD(ROWS(I$4:I626)-1,7),\" - \"&INDEX($B$4:$G$103,INT((ROWS(I$4:I626)-1)/7)+1,MOD(ROWS(I$4:I626)-1,7)),\"\")","v":"Joyis - S-J/DQ6029"},null,null,{"$f":"INDEX($B$4:$G$103,INT((ROWS(I$4:I626)-1)/7)+1,MOD(ROWS(I$4:I626)-1,7))","v":"S-J/DQ6029"}]
[null,null,null,null,null,null,null,null,null,{"$f":"INDEX($A$4:$A$103,INT((ROWS(I$4:I627)-1)/7)+1)&IF(MOD(ROWS(I$4:I627)-1,7),\" - \"&INDEX($B$4:$G$103,INT((ROWS(I$4:I627)-1)/7)+1,MOD(ROWS(I$4:I627)-1,7)),\"\")","v":"Salt Damwarm"},null,null,{"$f":"INDEX($B$4:$G$103,INT((ROWS(I$4:I627)-1)/7)+1,MOD(ROWS(I$4:I627)-1,7))","v":{"$error":"#VALUE!"}}]
[null,null,null,null,null,null,null,null,null,{"$f":"INDEX($A$4:$A$103,INT((ROWS(I$4:I628)-1)/7)+1)&IF(MOD(ROWS(I$4:I628)-1,7),\" - \"&INDEX($B$4:$G$103,INT((ROWS(I$4:I628)-1)/7)+1,MOD(ROWS(I$4:I628)-1,7)),\"\")","v":"Salt Damwarm - T-F/DQ5587"},null,null,{"$f":"INDEX($B$4:$G$103,INT((ROWS(I$4:I628)-1)/7)+1,MOD(ROWS(I$4:I628)-1,7))","v":"T-F/DQ5587"}]
[null,null,null,null,null,null,null,null,null,{"$f":"INDEX($A$4:$A$103,INT((ROWS(I$4:I629)-1)/7)+1)&IF(MOD(ROWS(I$4:I629)-1,7),\" - \"&INDEX($B$4:$G$103,INT((ROWS(I$4:I629)-1)/7)+1,MOD(ROWS(I$4:I629)-1,7)),\"\")","v":"Salt Damwarm - Y-L/DQ9024"},null,null,{"$f":"INDEX($B$4:$G$103,INT((ROWS(I$4:I629)-1)/7)+1,MOD(ROWS(I$4:I629)-1,7))","v":"Y-L/DQ9024"}]
[null,null,null,null,null,null,null,null,null,{"$f":"INDEX($A$4:$A$103,INT((ROWS(I$4:I630)-1)/7)+1)&IF(MOD(ROWS(I$4:I630)-1,7),\" - \"&INDEX($B$4:$G$103,INT((ROWS(I$4:I630)-1)/7)+1,MOD(ROWS(I$4:I630)-1,7)),\"\")","v":"Salt Damwarm - V-C/DQ9304"},null,null,{"$f":"INDEX($B$4:$G$103,INT((ROWS(I$4:I630)-1)/7)+1,MOD(ROWS(I$4:I630)-1,7))","v":"V-C/DQ9304"}]
[null,null,null,null,null,null,null,null,null,{"$f":"INDEX($A$4:$A$103,INT((ROWS(I$4:I631)-1)/7)+1)&IF(MOD(ROWS(I$4:I631)-1,7),\" - \"&INDEX($B$4:$G$103,INT((ROWS(I$4:I631)-1)/7)+1,MOD(ROWS(I$4:I631)-1,7)),\"\")","v":"Salt Damwarm - U-G/DQ8743"},null,null,{"$f":"INDEX($B$4:$G$103,INT((ROWS(I$4:I631)-1)/7)+1,MOD(ROWS(I$4:I631)-1,7))","v":"U-G/DQ8743"}]
[null,null,null,null,null,null,null,null,null,{"$f":"INDEX($A$4:$A$103,INT((ROWS(I$4:I632)-1)/7)+1)&IF(MOD(ROWS(I$4:I632)-1,7),\" - \"&INDEX($B$4:$G$103,INT((ROWS(I$4:I632)-1)/7)+1,MOD(ROWS(I$4:I632)-1,7)),\"\")","v":"Salt Damwarm - X-K/DQ5215"},null,null,{"$f":"INDEX($B$4:$G$103,INT((ROWS(I$4:I632)-1)/7)+1,MOD(ROWS(I$4:I632)-1,7))","v":"X-K/DQ5215"}]
[null,null,null,null,null,null,null,null,null,{"$f":"INDEX($A$4:$A$103,INT((ROWS(I$4:I633)-1)/7)+1)&IF(MOD(ROWS(I$4:I633)-1,7),\" - \"&INDEX($B$4:$G$103,INT((ROWS(I$4:I633)-1)/7)+1,MOD(ROWS(I$4:I633)-1,7)),\"\")","v":"Salt Damwarm - M-N/DQ7537"},null,null,{"$f":"INDEX($B$4:$G$103,INT((ROWS(I$4:I633)-1)/7)+1,MOD(ROWS(I$4:I633)-1,7))","v":"M-N/DQ7537"}]
[null,null,null,null,null,null,null,null,null,{"$f":"INDEX($A$4:$A$103,INT((ROWS(I$4:I634)-1)/7)+1)&IF(MOD(ROWS(I$4:I634)-1,7),\" - \"&INDEX($B$4:$G$103,INT((ROWS(I$4:I634)-1)/7)+1,MOD(ROWS(I$4:I634)-1,7)),\"\")","v":"Tripple Apin"},null,null,{"$f":"INDEX($B$4:$G$103,INT((ROWS(I$4:I634)-1)/7)+1,MOD(ROWS(I$4:I634)-1,7))","v":{"$error":"#VALUE!"}}]
[null,null,null,null,null,null,null,null,null,{"$f":"INDEX($A$4:$A$103,INT((ROWS(I$4:I635)-1)/7)+1)&IF(MOD(ROWS(I$4:I635)-1,7),\" - \"&INDEX($B$4:$G$103,INT((ROWS(I$4:I635)-1)/7)+1,MOD(ROWS(I$4:I635)-1,7)),\"\")","v":"Tripple Apin - J-P/DQ7429"},null,null,{"$f":"INDEX($B$4:$G$103,INT((ROWS(I$4:I635)-1)/7)+1,MOD(ROWS(I$4:I635)-1,7))","v":"J-P/DQ7429"}]
[null,null,null,null,null,null,null,null,null,{"$f":"INDEX($A$4:$A$103,INT((ROWS(I$4:I636)-1)/7)+1)&IF(MOD(ROWS(I$4:I636)-1,7),\" - \"&INDEX($B$4:$G$103,INT((ROWS(I$4:I636)-1)/7)+1,MOD(ROWS(I$4:I636)-1,7)),\"\")","v":"Tripple Apin - P-G/DQ7086"},null,null,{"$f":"INDEX($B$4:$G$103,INT((ROWS(I$4:I636)-1)/7)+1,MOD(ROWS(I$4:I636)-1,7))","v":"P-G/DQ7086"}]
[null,null,null,null,null,null,null,null,null,{"$f":"INDEX($A$4:$A$103,INT((ROWS(I$4:I637)-1)/7)+1)&IF(MOD(ROWS(I$4:I637)-1,7),\" - \"&INDEX($B$4:$G$103,INT((ROWS(I$4:I637)-1)/7)+1,MOD(ROWS(I$4:I637)-1,7)),\"\")","v":"Tripple Apin - Y-L/DQ6224"},null,null,{"$f":"INDEX($B$4:$G$103,INT((ROWS(I$4:I637)-1)/7)+1,MOD(ROWS(I$4:I637)-1,7))","v":"Y-L/DQ6224"}]
[null,null,null,null,null,null,null,null,null,{"$f":"INDEX($A$4:$A$103,INT((ROWS(I$4:I638)-1)/7)+1)&IF(MOD(ROWS(I$4:I638)-1,7),\" - \"&INDEX($B$4:$G$103,INT((ROWS(I$4:I638)-1)/7)+1,MOD(ROWS(I$4:I638)-1,7)),\"\")","v":"Tripple Apin - I-A/DQ3124"},null,null,{"$f":"INDEX($B$4:$G$103,INT((ROWS(I$4:I638)-1)/7)+1,MOD(ROWS(I$4:I638)-1,7))","v":"I-A/DQ3124"}]
[null,null,null,null,null,null,null,null,null,{"$f":"INDEX($A$4:$A$103,INT((ROWS(I$4:I639)-1)/7)+1)&IF(MOD(ROWS(I$4:I639)-1,7),\" - \"&INDEX($B$4:$G$103,INT((ROWS(I$4:I639)-1)/7)+1,MOD(ROWS(I$4:I639)-1,7)),\"\")","v":"Tripple Apin - X-R/DQ2483"},null,null,{"$f":"INDEX($B$4:$G$103,INT((ROWS(I$4:I639)-1)/7)+1,MOD(ROWS(I$4:I639)-1,7))","v":"X-R/DQ2483"}]
[null,null,null,null,null,null,null,null,null,{"$f":"INDEX($A$4:$A$103,INT((ROWS(I$4:I640)-1)/7)+1)&IF(MOD(ROWS(I$4:I640)-1,7),\" - \"&INDEX($B$4:$G$103,INT((ROWS(I$4:I640)-1)/7)+1,MOD(ROWS(I$4:I640)-1,7)),\"\")","v":"Tripple Apin - K-H/DQ1008"},null,null,{"$f":"INDEX($B$4:$G$103,INT((ROWS(I$4:I640)-1)/7)+1,MOD(ROWS(I$4:I640)-1,7))","v":"K-H/DQ1008"}]
[null,null,null,null,null,null,null,null,null,{"$f":"INDEX($A$4:$A$103,INT((ROWS(I$4:I641)-1)/7)+1)&IF(MOD(ROWS(I$4:I641)-1,7),\" - \"&INDEX($B$4:$G$103,INT((ROWS(I$4:I641)-1)/7)+1,MOD(ROWS(I$4:I641)-1,7)),\"\")","v":"Sil It"},null,null,{"$f":"INDEX($B$4:$G$103,INT((ROWS(I$4:I641)-1)/7)+1,MOD(ROWS(I$4:I641)-1,7))","v":{"$error":"#VALUE!"}}]
[null,null,null,null,null,null,null,null,null,{"$f":"INDEX($A$4:$A$103,INT((ROWS(I$4:I642)-1)/7)+1)&IF(MOD(ROWS(I$4:I642)-1,7),\" - \"&INDEX($B$4:$G$103,INT((ROWS(I$4:I642)-1)/7)+1,MOD(ROWS(I$4:I642)-1,7)),\"\")","v":"Sil It - I-P/DQ8226"},null,null,{"$f":"INDEX($B$4:$G$103,INT((ROWS(I$4:I642)-1)/7)+1,MOD(ROWS(I$4:I642)-1,7))","v":"I-P/DQ8226"}]
[null,null,null,null,null,null,null,null,null,{"$f":"INDEX($A$4:$A$103,INT((ROWS(I$4:I643)-1)/7)+1)&IF(MOD(ROWS(I$4:I643)-1,7),\" - \"&INDEX($B$4:$G$103,INT((ROWS(I$4:I643)-1)/7)+1,MOD(ROWS(I$4:I643)-1,7)),\"\")","v":"Sil It - N-P/DQ4986"},null,null,{"$f":"INDEX($B$4:$G$103,INT((ROWS(I$4:I643)-1)/7)+1,MOD(ROWS(I$4:I643)-1,7))","v":"N-P/DQ4986"}]
[null,null,null,null,null,null,null,null,null,{"$f":"INDEX($A$4:$A$103,INT((ROWS(I$4:I644)-1)/7)+1)&IF(MOD(ROWS(I$4:I644)-1,7),\" - \"&INDEX($B$4:$G$103,INT((ROWS(I$4:I644)-1)/7)+1,MOD(ROWS(I$4:I644)-1,7)),\"\")","v":"Sil It - X-S/DQ9478"},null,null,{"$f":"INDEX($B$4:$G$103,INT((ROWS(I$4:I644)-1)/7)+1,MOD(ROWS(I$4:I644)-1,7))","v":"X-S/DQ9478"}]
[null,null,null,null,null,null,null,null,null,{"$f":"INDEX($A$4:$A$103,INT((ROWS(I$4:I645)-1)/7)+1)&IF(MOD(ROWS(I$4:I645)-1,7),\" - \"&INDEX($B$4:$G$103,INT((ROWS(I$4:I645)-1)/7)+1,MOD(ROWS(I$4:I645)-1,7)),\"\")","v":"Sil It - J-F/DQ8109"},null,null,{"$f":"INDEX($B$4:$G$103,INT((ROWS(I$4:I645)-1)/7)+1,MOD(ROWS(I$4:I645)-1,7))","v":"J-F/DQ8109"}]
[null,null,null,null,null,null,null,null,null,{"$f":"INDEX($A$4:$A$103,INT((ROWS(I$4:I646)-1)/7)+1)&IF(MOD(ROWS(I$4:I646)-1,7),\" - \"&INDEX($B$4:$G$103,INT((ROWS(I$4:I646)-1)/7)+1,MOD(ROWS(I$4:I646)-1,7)),\"\")","v":"Sil It - V-V/DQ4594"},null,null,{"$f":"INDEX($B$4:$G$103,INT((ROWS(I$4:I646)-1)/7)+1,MOD(ROWS(I$4:I646)-1,7))","v":"V-V/DQ4594"}]
[null,null,null,null,null,null,null,null,null,{"$f":"INDEX($A$4:$A$103,INT((ROWS(I$4:I647)-1)/7)+1)&IF(MOD(ROWS(I$4:I647)-1,7),\" - \"&INDEX($B$4:$G$103,INT((ROWS(I$4:I647)-1)/7)+1,MOD(ROWS(I$4:I647)-1,7)),\"\")","v":"Sil It - Q-K/DQ4132"},null,null,{"$f":"INDEX($B$4:$G$103,INT((ROWS(I$4:I647)-1)/7)+1,MOD(ROWS(I$4:I647)-1,7))","v":"Q-K/DQ4132"}]
[null,null,null,null,null,null,null,null,null,{"$f":"INDEX($A$4:$A$103,INT((ROWS(I$4:I648)-1)/7)+1)&IF(MOD(ROWS(I$4:I648)-1,7),\" - \"&INDEX($B$4:$G$103,INT((ROWS(I$4:I648)-1)/7)+1,MOD(ROWS(I$4:I648)-1,7)),\"\")","v":"Re Zoztex"},null,null,{"$f":"INDEX($B$4:$G$103,INT((ROWS(I$4:I648)-1)/7)+1,MOD(ROWS(I$4:I648)-1,7))","v":{"$error":"#VALUE!"}}]
[null,null,null,null,null,null,null,null,null,{"$f":"INDEX($A$4:$A$103,INT((ROWS(I$4:I649)-1)/7)+1)&IF(MOD(ROWS(I$4:I649)-1,7),\" - \"&INDEX($B$4:$G$103,INT((ROWS(I$4:I649)-1)/7)+1,MOD(ROWS(I$4:I649)-1,7)),\"\")","v":"Re Zoztex - F-E/DQ4809"},null,null,{"$f":"INDEX($B$4:$G$103,INT((ROWS(I$4:I649)-1)/7)+1,MOD(ROWS(I$4:I649)-1,7))","v":"F-E/DQ4809"}]
[null,null,null,null,null,null,null,null,null,{"$f":"INDEX($A$4:$A$103,INT((ROWS(I$4:I650)-1)/7)+1)&IF(MOD(ROWS(I$4:I650)-1,7),\" - \"&INDEX($B$4:$G$103,INT((ROWS(I$4:I650)-1)/7)+1,MOD(ROWS(I$4:I650)-1,7)),\"\")","v":"Re Zoztex - P-N/DQ1239"},null,null,{"$f":"INDEX($B$4:$G$103,INT((ROWS(I$4:I650)-1)/7)+1,MOD(ROWS(I$4:I650)-1,7))","v":"P-N/DQ1239"}]
[null,null,null,null,null,null,null,null,null,{"$f":"INDEX($A$4:$A$103,INT((ROWS(I$4:I651)-1)/7)+1)&IF(MOD(ROWS(I$4:I651)-1,7),\" - \"&INDEX($B$4:$G$103,INT((ROWS(I$4:I651)-1)/7)+1,MOD(ROWS(I$4:I651)-1,7)),\"\")","v":"Re Zoztex - S-X/DQ6329"},null,null,{"$f":"INDEX($B$4:$G$103,INT((ROWS(I$4:I651)-1)/7)+1,MOD(ROWS(I$4:I651)-1,7))","v":"S-X/DQ6329"}]
[null,null,null,null,null,null,null,null,null,{"$f":"INDEX($A$4:$A$103,INT((ROWS(I$4:I652)-1)/7)+1)&IF(MOD(ROWS(I$4:I652)-1,7),\" - \"&INDEX($B$4:$G$103,INT((ROWS(I$4:I652)-1)/7)+1,MOD(ROWS(I$4:I652)-1,7)),\"\")","v":"Re Zoztex - I-O/DQ5603"},null,null,{"$f":"INDEX($B$4:$G$103,INT((ROWS(I$4:I652)-1)/7)+1,MOD(ROWS(I$4:I652)-1,7))","v":"I-O/DQ5603"}]
[null,null,null,null,null,null,null,null,null,{"$f":"INDEX($A$4:$A$103,INT((ROWS(I$4:I653)-1)/7)+1)&IF(MOD(ROWS(I$4:I653)-1,7),\" - \"&INDEX($B$4:$G$103,INT((ROWS(I$4:I653)-1)/7)+1,MOD(ROWS(I$4:I653)-1,7)),\"\")","v":"Re Zoztex - I-R/DQ4357"},null,null,{"$f":"INDEX($B$4:$G$103,INT((ROWS(I$4:I653)-1)/7)+1,MOD(ROWS(I$4:I653)-1,7))","v":"I-R/DQ4357"}]
[null,null,null,null,null,null,null,null,null,{"$f":"INDEX($A$4:$A$103,INT((ROWS(I$4:I654)-1)/7)+1)&IF(MOD(ROWS(I$4:I654)-1,7),\" - \"&INDEX($B$4:$G$103,INT((ROWS(I$4:I654)-1)/7)+1,MOD(ROWS(I$4:I654)-1,7)),\"\")","v":"Re Zoztex - K-A/DQ4274"},null,null,{"$f":"INDEX($B$4:$G$103,INT((ROWS(I$4:I654)-1)/7)+1,MOD(ROWS(I$4:I654)-1,7))","v":"K-A/DQ4274"}]
[null,null,null,null,null,null,null,null,null,{"$f":"INDEX($A$4:$A$103,INT((ROWS(I$4:I655)-1)/7)+1)&IF(MOD(ROWS(I$4:I655)-1,7),\" - \"&INDEX($B$4:$G$103,INT((ROWS(I$4:I655)-1)/7)+1,MOD(ROWS(I$4:I655)-1,7)),\"\")","v":"Labfan"},null,null,{"$f":"INDEX($B$4:$G$103,INT((ROWS(I$4:I655)-1)/7)+1,MOD(ROWS(I$4:I655)-1,7))","v":{"$error":"#VALUE!"}}]
[null,null,null,null,null,null,null,null,null,{"$f":"INDEX($A$4:$A$103,INT((ROWS(I$4:I656)-1)/7)+1)&IF(MOD(ROWS(I$4:I656)-1,7),\" - \"&INDEX($B$4:$G$103,INT((ROWS(I$4:I656)-1)/7)+1,MOD(ROWS(I$4:I656)-1,7)),\"\")","v":"Labfan - B-K/DQ8375"},null,null,{"$f":"INDEX($B$4:$G$103,INT((ROWS(I$4:I656)-1)/7)+1,MOD(ROWS(I$4:I656)-1,7))","v":"B-K/DQ8375"}]
[null,null,null,null,null,null,null,null,null,{"$f":"INDEX($A$4:$A$103,INT((ROWS(I$4:I657)-1)/7)+1)&IF(MOD(ROWS(I$4:I657)-1,7),\" - \"&INDEX($B$4:$G$103,INT((ROWS(I$4:I657)-1)/7)+1,MOD(ROWS(I$4:I657)-1,7)),\"\")","v":"Labfan - H-F/DQ4313"},null,null,{"$f":"INDEX($B$4:$G$103,INT((ROWS(I$4:I657)-1)/7)+1,MOD(ROWS(I$4:I657)-1,7))","v":"H-F/DQ4313"}]
[null,null,null,null,null,null,null,null,null,{"$f":"INDEX($A$4:$A$103,INT((ROWS(I$4:I658)-1)/7)+1)&IF(MOD(ROWS(I$4:I658)-1,7),\" - \"&INDEX($B$4:$G$103,INT((ROWS(I$4:I658)-1)/7)+1,MOD(ROWS(I$4:I658)-1,7)),\"\")","v":"Labfan - C-C/DQ1150"},null,null,{"$f":"INDEX($B$4:$G$103,INT((ROWS(I$4:I658)-1)/7)+1,MOD(ROWS(I$4:I658)-1,7))","v":"C-C/DQ1150"}]
[null,null,null,null,null,null,null,null,null,{"$f":"INDEX($A$4:$A$103,INT((ROWS(I$4:I659)-1)/7)+1)&IF(MOD(ROWS(I$4:I659)-1,7),\" - \"&INDEX($B$4:$G$103,INT((ROWS(I$4:I659)-1)/7)+1,MOD(ROWS(I$4:I659)-1,7)),\"\")","v":"Labfan - L-C/DQ9449"},null,null,{"$f":"INDEX($B$4:$G$103,INT((ROWS(I$4:I659)-1)/7)+1,MOD(ROWS(I$4:I659)-1,7))","v":"L-C/DQ9449"}]
[null,null,null,null,null,null,null,null,null,{"$f":"INDEX($A$4:$A$103,INT((ROWS(I$4:I660)-1)/7)+1)&IF(MOD(ROWS(I$4:I660)-1,7),\" - \"&INDEX($B$4:$G$103,INT((ROWS(I$4:I660)-1)/7)+1,MOD(ROWS(I$4:I660)-1,7)),\"\")","v":"Labfan - W-Z/DQ9017"},null,null,{"$f":"INDEX($B$4:$G$103,INT((ROWS(I$4:I660)-1)/7)+1,MOD(ROWS(I$4:I660)-1,7))","v":"W-Z/DQ9017"}]
[null,null,null,null,null,null,null,null,null,{"$f":"INDEX($A$4:$A$103,INT((ROWS(I$4:I661)-1)/7)+1)&IF(MOD(ROWS(I$4:I661)-1,7),\" - \"&INDEX($B$4:$G$103,INT((ROWS(I$4:I661)-1)/7)+1,MOD(ROWS(I$4:I661)-1,7)),\"\")","v":"Labfan - B-P/DQ9089"},null,null,{"$f":"INDEX($B$4:$G$103,INT((ROWS(I$4:I661)-1)/7)+1,MOD(ROWS(I$4:I661)-1,7))","v":"B-P/DQ9089"}]
[null,null,null,null,null,null,null,null,null,{"$f":"INDEX($A$4:$A$103,INT((ROWS(I$4:I662)-1)/7)+1)&IF(MOD(ROWS(I$4:I662)-1,7),\" - \"&INDEX($B$4:$G$103,INT((ROWS(I$4:I662)-1)/7)+1,MOD(ROWS(I$4:I662)-1,7)),\"\")","v":"Canex"},null,null,{"$f":"INDEX($B$4:$G$103,INT((ROWS(I$4:I662)-1)/7)+1,MOD(ROWS(I$4:I662)-1,7))","v":{"$error":"#VALUE!"}}]
[null,null,null,null,null,null,null,null,null,{"$f":"INDEX($A$4:$A$103,INT((ROWS(I$4:I663)-1)/7)+1)&IF(MOD(ROWS(I$4:I663)-1,7),\" - \"&INDEX($B$4:$G$103,INT((ROWS(I$4:I663)-1)/7)+1,MOD(ROWS(I$4:I663)-1,7)),\"\")","v":"Canex - W-Q/DQ1827"},null,null,{"$f":"INDEX($B$4:$G$103,INT((ROWS(I$4:I663)-1)/7)+1,MOD(ROWS(I$4:I663)-1,7))","v":"W-Q/DQ1827"}]
[null,null,null,null,null,null,null,null,null,{"$f":"INDEX($A$4:$A$103,INT((ROWS(I$4:I664)-1)/7)+1)&IF(MOD(ROWS(I$4:I664)-1,7),\" - \"&INDEX($B$4:$G$103,INT((ROWS(I$4:I664)-1)/7)+1,MOD(ROWS(I$4:I664)-1,7)),\"\")","v":"Canex - Z-X/DQ5599"},null,null,{"$f":"INDEX($B$4:$G$103,INT((ROWS(I$4:I664)-1)/7)+1,MOD(ROWS(I$4:I664)-1,7))","v":"Z-X/DQ5599"}]
[null,null,null,null,null,null,null,null,null,{"$f":"INDEX($A$4:$A$103,INT((ROWS(I$4:I665)-1)/7)+1)&IF(MOD(ROWS(I$4:I665)-1,7),\" - \"&INDEX($B$4:$G$103,INT((ROWS(I$4:I665)-1)/7)+1,MOD(ROWS(I$4:I665)-1,7)),\"\")","v":"Canex - H-Y/DQ3392"},null,null,{"$f":"INDEX($B$4:$G$103,INT((ROWS(I$4:I665)-1)/7)+1,MOD(ROWS(I$4:I665)-1,7))","v":"H-Y/DQ3392"}]
[null,null,null,null,null,null,null,null,null,{"$f":"INDEX($A$4:$A$103,INT((ROWS(I$4:I666)-1)/7)+1)&IF(MOD(ROWS(I$4:I666)-1,7),\" - \"&INDEX($B$4:$G$103,INT((ROWS(I$4:I666)-1)/7)+1,MOD(ROWS(I$4:I666)-1,7)),\"\")","v":"Canex - G-O/DQ8134"},null,null,{"$f":"INDEX($B$4:$G$103,INT((ROWS(I$4:I666)-1)/7)+1,MOD(ROWS(I$4:I666)-1,7))","v":"G-O/DQ8134"}]
[null,null,null,null,null,null,null,null,null,{"$f":"INDEX($A$4:$A$103,INT((ROWS(I$4:I667)-1)/7)+1)&IF(MOD(ROWS(I$4:I667)-1,7),\" - \"&INDEX($B$4:$G$103,INT((ROWS(I$4:I667)-1)/7)+1,MOD(ROWS(I$4:I667)-1,7)),\"\")","v":"Canex - P-Z/DQ1145"},null,null,{"$f":"INDEX($B$4:$G$103,INT((ROWS(I$4:I667)-1)/7)+1,MOD(ROWS(I$4:I667)-1,7))","v":"P-Z/DQ1145"}]
[null,null,null,null,null,null,null,null,null,{"$f":"INDEX($A$4:$A$103,INT((ROWS(I$4:I668)-1)/7)+1)&IF(MOD(ROWS(I$4:I668)-1,7),\" - \"&INDEX($B$4:$G$103,INT((ROWS(I$4:I668)-1)/7)+1,MOD(ROWS(I$4:I668)-1,7)),\"\")","v":"Canex - S-T/DQ9864"},null,null,{"$f":"INDEX($B$4:$G$103,INT((ROWS(I$4:I668)-1)/7)+1,MOD(ROWS(I$4:I668)-1,7))","v":"S-T/DQ9864"}]
[null,null,null,null,null,null,null,null,null,{"$f":"INDEX($A$4:$A$103,INT((ROWS(I$4:I669)-1)/7)+1)&IF(MOD(ROWS(I$4:I669)-1,7),\" - \"&INDEX($B$4:$G$103,INT((ROWS(I$4:I669)-1)/7)+1,MOD(ROWS(I$4:I669)-1,7)),\"\")","v":"Kinsing"},null,null,{"$f":"INDEX($B$4:$G$103,INT((ROWS(I$4:I669)-1)/7)+1,MOD(ROWS(I$4:I669)-1,7))","v":{"$error":"#VALUE!"}}]
[null,null,null,null,null,null,null,null,null,{"$f":"INDEX($A$4:$A$103,INT((ROWS(I$4:I670)-1)/7)+1)&IF(MOD(ROWS(I$4:I670)-1,7),\" - \"&INDEX($B$4:$G$103,INT((ROWS(I$4:I670)-1)/7)+1,MOD(ROWS(I$4:I670)-1,7)),\"\")","v":"Kinsing - D-O/DQ9948"},null,null,{"$f":"INDEX($B$4:$G$103,INT((ROWS(I$4:I670)-1)/7)+1,MOD(ROWS(I$4:I670)-1,7))","v":"D-O/DQ9948"}]
[null,null,null,null,null,null,null,null,null,{"$f":"INDEX($A$4:$A$103,INT((ROWS(I$4:I671)-1)/7)+1)&IF(MOD(ROWS(I$4:I671)-1,7),\" - \"&INDEX($B$4:$G$103,INT((ROWS(I$4:I671)-1)/7)+1,MOD(ROWS(I$4:I671)-1,7)),\"\")","v":"Kinsing - I-C/DQ8877"},null,null,{"$f":"INDEX($B$4:$G$103,INT((ROWS(I$4:I671)-1)/7)+1,MOD(ROWS(I$4:I671)-1,7))","v":"I-C/DQ8877"}]
[null,null,null,null,null,null,null,null,null,{"$f":"INDEX($A$4:$A$103,INT((ROWS(I$4:I672)-1)/7)+1)&IF(MOD(ROWS(I$4:I672)-1,7),\" - \"&INDEX($B$4:$G$103,INT((ROWS(I$4:I672)-1)/7)+1,MOD(ROWS(I$4:I672)-1,7)),\"\")","v":"Kinsing - A-X/DQ1627"},null,null,{"$f":"INDEX($B$4:$G$103,INT((ROWS(I$4:I672)-1)/7)+1,MOD(ROWS(I$4:I672)-1,7))","v":"A-X/DQ1627"}]
[null,null,null,null,null,null,null,null,null,{"$f":"INDEX($A$4:$A$103,INT((ROWS(I$4:I673)-1)/7)+1)&IF(MOD(ROWS(I$4:I673)-1,7),\" - \"&INDEX($B$4:$G$103,INT((ROWS(I$4:I673)-1)/7)+1,MOD(ROWS(I$4:I673)-1,7)),\"\")","v":"Kinsing - U-L/DQ6403"},null,null,{"$f":"INDEX($B$4:$G$103,INT((ROWS(I$4:I673)-1)/7)+1,MOD(ROWS(I$4:I673)-1,7))","v":"U-L/DQ6403"}]
[null,null,null,null,null,null,null,null,null,{"$f":"INDEX($A$4:$A$103,INT((ROWS(I$4:I674)-1)/7)+1)&IF(MOD(ROWS(I$4:I674)-1,7),\" - \"&INDEX($B$4:$G$103,INT((ROWS(I$4:I674)-1)/7)+1,MOD(ROWS(I$4:I674)-1,7)),\"\")","v":"Kinsing - O-E/DQ6432"},null,null,{"$f":"INDEX($B$4:$G$103,INT((ROWS(I$4:I674)-1)/7)+1,MOD(ROWS(I$4:I674)-1,7))","v":"O-E/DQ6432"}]
[null,null,null,null,null,null,null,null,null,{"$f":"INDEX($A$4:$A$103,INT((ROWS(I$4:I675)-1)/7)+1)&IF(MOD(ROWS(I$4:I675)-1,7),\" - \"&INDEX($B$4:$G$103,INT((ROWS(I$4:I675)-1)/7)+1,MOD(ROWS(I$4:I675)-1,7)),\"\")","v":"Kinsing - T-V/DQ6488"},null,null,{"$f":"INDEX($B$4:$G$103,INT((ROWS(I$4:I675)-1)/7)+1,MOD(ROWS(I$4:I675)-1,7))","v":"T-V/DQ6488"}]
[null,null,null,null,null,null,null,null,null,{"$f":"INDEX($A$4:$A$103,INT((ROWS(I$4:I676)-1)/7)+1)&IF(MOD(ROWS(I$4:I676)-1,7),\" - \"&INDEX($B$4:$G$103,INT((ROWS(I$4:I676)-1)/7)+1,MOD(ROWS(I$4:I676)-1,7)),\"\")","v":"Geo-Dax"},null,null,{"$f":"INDEX($B$4:$G$103,INT((ROWS(I$4:I676)-1)/7)+1,MOD(ROWS(I$4:I676)-1,7))","v":{"$error":"#VALUE!"}}]
[null,null,null,null,null,null,null,null,null,{"$f":"INDEX($A$4:$A$103,INT((ROWS(I$4:I677)-1)/7)+1)&IF(MOD(ROWS(I$4:I677)-1,7),\" - \"&INDEX($B$4:$G$103,INT((ROWS(I$4:I677)-1)/7)+1,MOD(ROWS(I$4:I677)-1,7)),\"\")","v":"Geo-Dax - N-M/DQ4637"},null,null,{"$f":"INDEX($B$4:$G$103,INT((ROWS(I$4:I677)-1)/7)+1,MOD(ROWS(I$4:I677)-1,7))","v":"N-M/DQ4637"}]
[null,null,null,null,null,null,null,null,null,{"$f":"INDEX($A$4:$A$103,INT((ROWS(I$4:I678)-1)/7)+1)&IF(MOD(ROWS(I$4:I678)-1,7),\" - \"&INDEX($B$4:$G$103,INT((ROWS(I$4:I678)-1)/7)+1,MOD(ROWS(I$4:I678)-1,7)),\"\")","v":"Geo-Dax - Z-F/DQ9504"},null,null,{"$f":"INDEX($B$4:$G$103,INT((ROWS(I$4:I678)-1)/7)+1,MOD(ROWS(I$4:I678)-1,7))","v":"Z-F/DQ9504"}]
[null,null,null,null,null,null,null,null,null,{"$f":"INDEX($A$4:$A$103,INT((ROWS(I$4:I679)-1)/7)+1)&IF(MOD(ROWS(I$4:I679)-1,7),\" - \"&INDEX($B$4:$G$103,INT((ROWS(I$4:I679)-1)/7)+1,MOD(ROWS(I$4:I679)-1,7)),\"\")","v":"Geo-Dax - R-N/DQ8726"},null,null,{"$f":"INDEX($B$4:$G$103,INT((ROWS(I$4:I679)-1)/7)+1,MOD(ROWS(I$4:I679)-1,7))","v":"R-N/DQ8726"}]
[null,null,null,null,null,null,null,null,null,{"$f":"INDEX($A$4:$A$103,INT((ROWS(I$4:I680)-1)/7)+1)&IF(MOD(ROWS(I$4:I680)-1,7),\" - \"&INDEX($B$4:$G$103,INT((ROWS(I$4:I680)-1)/7)+1,MOD(ROWS(I$4:I680)-1,7)),\"\")","v":"Geo-Dax - E-Q/DQ8209"},null,null,{"$f":"INDEX($B$4:$G$103,INT((ROWS(I$4:I680)-1)/7)+1,MOD(ROWS(I$4:I680)-1,7))","v":"E-Q/DQ8209"}]
[null,null,null,null,null,null,null,null,null,{"$f":"INDEX($A$4:$A$103,INT((ROWS(I$4:I681)-1)/7)+1)&IF(MOD(ROWS(I$4:I681)-1,7),\" - \"&INDEX($B$4:$G$103,INT((ROWS(I$4:I681)-1)/7)+1,MOD(ROWS(I$4:I681)-1,7)),\"\")","v":"Geo-Dax - O-Z/DQ2286"},null,null,{"$f":"INDEX($B$4:$G$103,INT((ROWS(I$4:I681)-1)/7)+1,MOD(ROWS(I$4:I681)-1,7))","v":"O-Z/DQ2286"}]
[null,null,null,null,null,null,null,null,null,{"$f":"INDEX($A$4:$A$103,INT((ROWS(I$4:I682)-1)/7)+1)&IF(MOD(ROWS(I$4:I682)-1,7),\" - \"&INDEX($B$4:$G$103,INT((ROWS(I$4:I682)-1)/7)+1,MOD(ROWS(I$4:I682)-1,7)),\"\")","v":"Geo-Dax - I-B/DQ1744"},null,null,{"$f":"INDEX($B$4:$G$103,INT((ROWS(I$4:I682)-1)/7)+1,MOD(ROWS(I$4:I682)-1,7))","v":"I-B/DQ1744"}]
[null,null,null,null,null,null,null,null,null,{"$f":"INDEX($A$4:$A$103,INT((ROWS(I$4:I683)-1)/7)+1)&IF(MOD(ROWS(I$4:I683)-1,7),\" - \"&INDEX($B$4:$G$103,INT((ROWS(I$4:I683)-1)/7)+1,MOD(ROWS(I$4:I683)-1,7)),\"\")","v":"Freesoft"},null,null,{"$f":"INDEX($B$4:$G$103,INT((ROWS(I$4:I683)-1)/7)+1,MOD(ROWS(I$4:I683)-1,7))","v":{"$error":"#VALUE!"}}]
[null,null,null,null,null,null,null,null,null,{"$f":"INDEX($A$4:$A$103,INT((ROWS(I$4:I684)-1)/7)+1)&IF(MOD(ROWS(I$4:I684)-1,7),\" - \"&INDEX($B$4:$G$103,INT((ROWS(I$4:I684)-1)/7)+1,MOD(ROWS(I$4:I684)-1,7)),\"\")","v":"Freesoft - N-Y/DQ6967"},null,null,{"$f":"INDEX($B$4:$G$103,INT((ROWS(I$4:I684)-1)/7)+1,MOD(ROWS(I$4:I684)-1,7))","v":"N-Y/DQ6967"}]
[null,null,null,null,null,null,null,null,null,{"$f":"INDEX($A$4:$A$103,INT((ROWS(I$4:I685)-1)/7)+1)&IF(MOD(ROWS(I$4:I685)-1,7),\" - \"&INDEX($B$4:$G$103,INT((ROWS(I$4:I685)-1)/7)+1,MOD(ROWS(I$4:I685)-1,7)),\"\")","v":"Freesoft - A-R/DQ8303"},null,null,{"$f":"INDEX($B$4:$G$103,INT((ROWS(I$4:I685)-1)/7)+1,MOD(ROWS(I$4:I685)-1,7))","v":"A-R/DQ8303"}]
[null,null,null,null,null,null,null,null,null,{"$f":"INDEX($A$4:$A$103,INT((ROWS(I$4:I686)-1)/7)+1)&IF(MOD(ROWS(I$4:I686)-1,7),\" - \"&INDEX($B$4:$G$103,INT((ROWS(I$4:I686)-1)/7)+1,MOD(ROWS(I$4:I686)-1,7)),\"\")","v":"Freesoft - H-A/DQ8782"},null,null,{"$f":"INDEX($B$4:$G$103,INT((ROWS(I$4:I686)-1)/7)+1,MOD(ROWS(I$4:I686)-1,7))","v":"H-A/DQ8782"}]
[null,null,null,null,null,null,null,null,null,{"$f":"INDEX($A$4:$A$103,INT((ROWS(I$4:I687)-1)/7)+1)&IF(MOD(ROWS(I$4:I687)-1,7),\" - \"&INDEX($B$4:$G$103,INT((ROWS(I$4:I687)-1)/7)+1,MOD(ROWS(I$4:I687)-1,7)),\"\")","v":"Freesoft - P-R/DQ1717"},null,null,{"$f":"INDEX($B$4:$G$103,INT((ROWS(I$4:I687)-1)/7)+1,MOD(ROWS(I$4:I687)-1,7))","v":"P-R/DQ1717"}]
[null,null,null,null,null,null,null,null,null,{"$f":"INDEX($A$4:$A$103,INT((ROWS(I$4:I688)-1)/7)+1)&IF(MOD(ROWS(I$4:I688)-1,7),\" - \"&INDEX($B$4:$G$103,INT((ROWS(I$4:I688)-1)/7)+1,MOD(ROWS(I$4:I688)-1,7)),\"\")","v":"Freesoft - H-C/DQ9144"},null,null,{"$f":"INDEX($B$4:$G$103,INT((ROWS(I$4:I688)-1)/7)+1,MOD(ROWS(I$4:I688)-1,7))","v":"H-C/DQ9144"}]
[null,null,null,null,null,null,null,null,null,{"$f":"INDEX($A$4:$A$103,INT((ROWS(I$4:I689)-1)/7)+1)&IF(MOD(ROWS(I$4:I689)-1,7),\" - \"&INDEX($B$4:$G$103,INT((ROWS(I$4:I689)-1)/7)+1,MOD(ROWS(I$4:I689)-1,7)),\"\")","v":"Freesoft - F-S/DQ3434"},null,null,{"$f":"INDEX($B$4:$G$103,INT((ROWS(I$4:I689)-1)/7)+1,MOD(ROWS(I$4:I689)-1,7))","v":"F-S/DQ3434"}]
[null,null,null,null,null,null,null,null,null,{"$f":"INDEX($A$4:$A$103,INT((ROWS(I$4:I690)-1)/7)+1)&IF(MOD(ROWS(I$4:I690)-1,7),\" - \"&INDEX($B$4:$G$103,INT((ROWS(I$4:I690)-1)/7)+1,MOD(ROWS(I$4:I690)-1,7)),\"\")","v":"Via Kix"},null,null,{"$f":"INDEX($B$4:$G$103,INT((ROWS(I$4:I690)-1)/7)+1,MOD(ROWS(I$4:I690)-1,7))","v":{"$error":"#VALUE!"}}]
[null,null,null,null,null,null,null,null,null,{"$f":"INDEX($A$4:$A$103,INT((ROWS(I$4:I691)-1)/7)+1)&IF(MOD(ROWS(I$4:I691)-1,7),\" - \"&INDEX($B$4:$G$103,INT((ROWS(I$4:I691)-1)/7)+1,MOD(ROWS(I$4:I691)-1,7)),\"\")","v":"Via Kix - B-J/DQ8771"},null,null,{"$f":"INDEX($B$4:$G$103,INT((ROWS(I$4:I691)-1)/7)+1,MOD(ROWS(I$4:I691)-1,7))","v":"B-J/DQ8771"}]
[null,null,null,null,null,null,null,null,null,{"$f":"INDEX($A$4:$A$103,INT((ROWS(I$4:I692)-1)/7)+1)&IF(MOD(ROWS(I$4:I692)-1,7),\" - \"&INDEX($B$4:$G$103,INT((ROWS(I$4:I692)-1)/7)+1,MOD(ROWS(I$4:I692)-1,7)),\"\")","v":"Via Kix - F-S/DQ3920"},null,null,{"$f":"INDEX($B$4:$G$103,INT((ROWS(I$4:I692)-1)/7)+1,MOD(ROWS(I$4:I692)-1,7))","v":"F-S/DQ3920"}]
[null,null,null,null,null,null,null,null,null,{"$f":"INDEX($A$4:$A$103,INT((ROWS(I$4:I693)-1)/7)+1)&IF(MOD(ROWS(I$4:I693)-1,7),\" - \"&INDEX($B$4:$G$103,INT((ROWS(I$4:I693)-1)/7)+1,MOD(ROWS(I$4:I693)-1,7)),\"\")","v":"Via Kix - D-G/DQ8328"},null,null,{"$f":"INDEX($B$4:$G$103,INT((ROWS(I$4:I693)-1)/7)+1,MOD(ROWS(I$4:I693)-1,7))","v":"D-G/DQ8328"}]
[null,null,null,null,null,null,null,null,null,{"$f":"INDEX($A$4:$A$103,INT((ROWS(I$4:I694)-1)/7)+1)&IF(MOD(ROWS(I$4:I694)-1,7),\" - \"&INDEX($B$4:$G$103,INT((ROWS(I$4:I694)-1)/7)+1,MOD(ROWS(I$4:I694)-1,7)),\"\")","v":"Via Kix - C-B/DQ1806"},null,null,{"$f":"INDEX($B$4:$G$103,INT((ROWS(I$4:I694)-1)/7)+1,MOD(ROWS(I$4:I694)-1,7))","v":"C-B/DQ1806"}]
[null,null,null,null,null,null,null,null,null,{"$f":"INDEX($A$4:$A$103,INT((ROWS(I$4:I695)-1)/7)+1)&IF(MOD(ROWS(I$4:I695)-1,7),\" - \"&INDEX($B$4:$G$103,INT((ROWS(I$4:I695)-1)/7)+1,MOD(ROWS(I$4:I695)-1,7)),\"\")","v":"Via Kix - G-Z/DQ2323"},null,null,{"$f":"INDEX($B$4:$G$103,INT((ROWS(I$4:I695)-1)/7)+1,MOD(ROWS(I$4:I695)-1,7))","v":"G-Z/DQ2323"}]
[null,null,null,null,null,null,null,null,null,{"$f":"INDEX($A$4:$A$103,INT((ROWS(I$4:I696)-1)/7)+1)&IF(MOD(ROWS(I$4:I696)-1,7),\" - \"&INDEX($B$4:$G$103,INT((ROWS(I$4:I696)-1)/7)+1,MOD(ROWS(I$4:I696)-1,7)),\"\")","v":"Via Kix - T-T/DQ8641"},null,null,{"$f":"INDEX($B$4:$G$103,INT((ROWS(I$4:I696)-1)/7)+1,MOD(ROWS(I$4:I696)-1,7))","v":"T-T/DQ8641"}]
[null,null,null,null,null,null,null,null,null,{"$f":"INDEX($A$4:$A$103,INT((ROWS(I$4:I697)-1)/7)+1)&IF(MOD(ROWS(I$4:I697)-1,7),\" - \"&INDEX($B$4:$G$103,INT((ROWS(I$4:I697)-1)/7)+1,MOD(ROWS(I$4:I697)-1,7)),\"\")","v":"Kan-Dom"},null,null,{"$f":"INDEX($B$4:$G$103,INT((ROWS(I$4:I697)-1)/7)+1,MOD(ROWS(I$4:I697)-1,7))","v":{"$error":"#VALUE!"}}]
[null,null,null,null,null,null,null,null,null,{"$f":"INDEX($A$4:$A$103,INT((ROWS(I$4:I698)-1)/7)+1)&IF(MOD(ROWS(I$4:I698)-1,7),\" - \"&INDEX($B$4:$G$103,INT((ROWS(I$4:I698)-1)/7)+1,MOD(ROWS(I$4:I698)-1,7)),\"\")","v":"Kan-Dom - I-S/DQ2111"},null,null,{"$f":"INDEX($B$4:$G$103,INT((ROWS(I$4:I698)-1)/7)+1,MOD(ROWS(I$4:I698)-1,7))","v":"I-S/DQ2111"}]
[null,null,null,null,null,null,null,null,null,{"$f":"INDEX($A$4:$A$103,INT((ROWS(I$4:I699)-1)/7)+1)&IF(MOD(ROWS(I$4:I699)-1,7),\" - \"&INDEX($B$4:$G$103,INT((ROWS(I$4:I699)-1)/7)+1,MOD(ROWS(I$4:I699)-1,7)),\"\")","v":"Kan-Dom - L-J/DQ7510"},null,null,{"$f":"INDEX($B$4:$G$103,INT((ROWS(I$4:I699)-1)/7)+1,MOD(ROWS(I$4:I699)-1,7))","v":"L-J/DQ7510"}]
[null,null,null,null,null,null,null,null,null,{"$f":"INDEX($A$4:$A$103,INT((ROWS(I$4:I700)-1)/7)+1)&IF(MOD(ROWS(I$4:I700)-1,7),\" - \"&INDEX($B$4:$G$103,INT((ROWS(I$4:I700)-1)/7)+1,MOD(ROWS(I$4:I700)-1,7)),\"\")","v":"Kan-Dom - C-K/DQ5503"},null,null,{"$f":"INDEX($B$4:$G$103,INT((ROWS(I$4:I700)-1)/7)+1,MOD(ROWS(I$4:I700)-1,7))","v":"C-K/DQ5503"}]
[null,null,null,null,null,null,null,null,null,{"$f":"INDEX($A$4:$A$103,INT((ROWS(I$4:I701)-1)/7)+1)&IF(MOD(ROWS(I$4:I701)-1,7),\" - \"&INDEX($B$4:$G$103,INT((ROWS(I$4:I701)-1)/7)+1,MOD(ROWS(I$4:I701)-1,7)),\"\")","v":"Kan-Dom - Z-V/DQ2269"},null,null,{"$f":"INDEX($B$4:$G$103,INT((ROWS(I$4:I701)-1)/7)+1,MOD(ROWS(I$4:I701)-1,7))","v":"Z-V/DQ2269"}]
[null,null,null,null,null,null,null,null,null,{"$f":"INDEX($A$4:$A$103,INT((ROWS(I$4:I702)-1)/7)+1)&IF(MOD(ROWS(I$4:I702)-1,7),\" - \"&INDEX($B$4:$G$103,INT((ROWS(I$4:I702)-1)/7)+1,MOD(ROWS(I$4:I702)-1,7)),\"\")","v":"Kan-Dom - Z-N/DQ6435"},null,null,{"$f":"INDEX($B$4:$G$103,INT((ROWS(I$4:I702)-1)/7)+1,MOD(ROWS(I$4:I702)-1,7))","v":"Z-N/DQ6435"}]
[null,null,null,null,null,null,null,null,null,{"$f":"INDEX($A$4:$A$103,INT((ROWS(I$4:I703)-1)/7)+1)&IF(MOD(ROWS(I$4:I703)-1,7),\" - \"&INDEX($B$4:$G$103,INT((ROWS(I$4:I703)-1)/7)+1,MOD(ROWS(I$4:I703)-1,7)),\"\")","v":"Kan-Dom - S-Q/DQ1078"},null,null,{"$f":"INDEX($B$4:$G$103,INT((ROWS(I$4:I703)-1)/7)+1,MOD(ROWS(I$4:I703)-1,7))","v":"S-Q/DQ1078"}]

{"sheet":"Sheet2","index":4,"n_rows":701,"n_cols":6,"rows_kept":701,"cut":false,"hidden":false,"merged":[]}
["Row","Column","Value","New List",null,"New List"]
["Geo Fan","Sub Product 1",null,{"$f":"Table1[[#This Row],[Row]]&IF(Table1[[#This Row],[Value]]=\"\",\"\",\" - \"&Table1[[#This Row],[Value]])","v":"Geo Fan"},null,{"$f":"Table1[[#This Row],[Row]]&IF(Table1[[#This Row],[Value]]=\"\",\"\",\" - \"&Table1[[#This Row],[Value]])","v":"Geo Fan"}]
["Geo Fan","Sub Product 2","J-V/DQ1477",{"$f":"Table1[[#This Row],[Row]]&IF(Table1[[#This Row],[Value]]=\"\",\"\",\" - \"&Table1[[#This Row],[Value]])","v":"Geo Fan - J-V/DQ1477"},null,{"$f":"Table1[[#This Row],[Row]]&IF(Table1[[#This Row],[Value]]=\"\",\"\",\" - \"&Table1[[#This Row],[Value]])","v":"Geo Fan - J-V/DQ1477"}]
["Geo Fan","Sub Product 3","N-Y/DQ3773",{"$f":"Table1[[#This Row],[Row]]&IF(Table1[[#This Row],[Value]]=\"\",\"\",\" - \"&Table1[[#This Row],[Value]])","v":"Geo Fan - N-Y/DQ3773"}]
["Geo Fan","Sub Product 4","B-Z/DQ7827",{"$f":"Table1[[#This Row],[Row]]&IF(Table1[[#This Row],[Value]]=\"\",\"\",\" - \"&Table1[[#This Row],[Value]])","v":"Geo Fan - B-Z/DQ7827"}]
["Geo Fan","Sub Product 5","M-W/DQ6663",{"$f":"Table1[[#This Row],[Row]]&IF(Table1[[#This Row],[Value]]=\"\",\"\",\" - \"&Table1[[#This Row],[Value]])","v":"Geo Fan - M-W/DQ6663"}]
["Geo Fan","Sub Product 6","R-A/DQ8080",{"$f":"Table1[[#This Row],[Row]]&IF(Table1[[#This Row],[Value]]=\"\",\"\",\" - \"&Table1[[#This Row],[Value]])","v":"Geo Fan - R-A/DQ8080"}]
["Geo Fan","Sub Product 7","S-S/DQ4315",{"$f":"Table1[[#This Row],[Row]]&IF(Table1[[#This Row],[Value]]=\"\",\"\",\" - \"&Table1[[#This Row],[Value]])","v":"Geo Fan - S-S/DQ4315"}]
["Kin-Light","Sub Product 1",null,{"$f":"Table1[[#This Row],[Row]]&IF(Table1[[#This Row],[Value]]=\"\",\"\",\" - \"&Table1[[#This Row],[Value]])","v":"Kin-Light"}]
["Kin-Light","Sub Product 2","S-O/DQ9675",{"$f":"Table1[[#This Row],[Row]]&IF(Table1[[#This Row],[Value]]=\"\",\"\",\" - \"&Table1[[#This Row],[Value]])","v":"Kin-Light - S-O/DQ9675"}]
["Kin-Light","Sub Product 3","F-Z/DQ5663",{"$f":"Table1[[#This Row],[Row]]&IF(Table1[[#This Row],[Value]]=\"\",\"\",\" - \"&Table1[[#This Row],[Value]])","v":"Kin-Light - F-Z/DQ5663"}]
["Kin-Light","Sub Product 4","T-Y/DQ3628",{"$f":"Table1[[#This Row],[Row]]&IF(Table1[[#This Row],[Value]]=\"\",\"\",\" - \"&Table1[[#This Row],[Value]])","v":"Kin-Light - T-Y/DQ3628"}]
["Kin-Light","Sub Product 5","B-T/DQ6204",{"$f":"Table1[[#This Row],[Row]]&IF(Table1[[#This Row],[Value]]=\"\",\"\",\" - \"&Table1[[#This Row],[Value]])","v":"Kin-Light - B-T/DQ6204"}]
["Kin-Light","Sub Product 6","S-S/DQ1007",{"$f":"Table1[[#This Row],[Row]]&IF(Table1[[#This Row],[Value]]=\"\",\"\",\" - \"&Table1[[#This Row],[Value]])","v":"Kin-Light - S-S/DQ1007"}]
["Kin-Light","Sub Product 7","S-R/DQ3874",{"$f":"Table1[[#This Row],[Row]]&IF(Table1[[#This Row],[Value]]=\"\",\"\",\" - \"&Table1[[#This Row],[Value]])","v":"Kin-Light - S-R/DQ3874"}]
["Stock Hotex","Sub Product 1",null,{"$f":"Table1[[#This Row],[Row]]&IF(Table1[[#This Row],[Value]]=\"\",\"\",\" - \"&Table1[[#This Row],[Value]])","v":"Stock Hotex"}]
["Stock Hotex","Sub Product 2","W-F/DQ4209",{"$f":"Table1[[#This Row],[Row]]&IF(Table1[[#This Row],[Value]]=\"\",\"\",\" - \"&Table1[[#This Row],[Value]])","v":"Stock Hotex - W-F/DQ4209"}]
["Stock Hotex","Sub Product 3","K-I/DQ4485",{"$f":"Table1[[#This Row],[Row]]&IF(Table1[[#This Row],[Value]]=\"\",\"\",\" - \"&Table1[[#This Row],[Value]])","v":"Stock Hotex - K-I/DQ4485"}]
["Stock Hotex","Sub Product 4","J-O/DQ5352",{"$f":"Table1[[#This Row],[Row]]&IF(Table1[[#This Row],[Value]]=\"\",\"\",\" - \"&Table1[[#This Row],[Value]])","v":"Stock Hotex - J-O/DQ5352"}]
["Stock Hotex","Sub Product 5","Y-V/DQ1863",{"$f":"Table1[[#This Row],[Row]]&IF(Table1[[#This Row],[Value]]=\"\",\"\",\" - \"&Table1[[#This Row],[Value]])","v":"Stock Hotex - Y-V/DQ1863"}]
["Stock Hotex","Sub Product 6","V-S/DQ1390",{"$f":"Table1[[#This Row],[Row]]&IF(Table1[[#This Row],[Value]]=\"\",\"\",\" - \"&Table1[[#This Row],[Value]])","v":"Stock Hotex - V-S/DQ1390"}]
["Stock Hotex","Sub Product 7","J-C/DQ8654",{"$f":"Table1[[#This Row],[Row]]&IF(Table1[[#This Row],[Value]]=\"\",\"\",\" - \"&Table1[[#This Row],[Value]])","v":"Stock Hotex - J-C/DQ8654"}]
["Konk Tinstock","Sub Product 1",null,{"$f":"Table1[[#This Row],[Row]]&IF(Table1[[#This Row],[Value]]=\"\",\"\",\" - \"&Table1[[#This Row],[Value]])","v":"Konk Tinstock"}]
["Konk Tinstock","Sub Product 2","N-R/DQ9237",{"$f":"Table1[[#This Row],[Row]]&IF(Table1[[#This Row],[Value]]=\"\",\"\",\" - \"&Table1[[#This Row],[Value]])","v":"Konk Tinstock - N-R/DQ9237"}]
["Konk Tinstock","Sub Product 3","K-Q/DQ9170",{"$f":"Table1[[#This Row],[Row]]&IF(Table1[[#This Row],[Value]]=\"\",\"\",\" - \"&Table1[[#This Row],[Value]])","v":"Konk Tinstock - K-Q/DQ9170"}]
["Konk Tinstock","Sub Product 4","W-I/DQ7389",{"$f":"Table1[[#This Row],[Row]]&IF(Table1[[#This Row],[Value]]=\"\",\"\",\" - \"&Table1[[#This Row],[Value]])","v":"Konk Tinstock - W-I/DQ7389"}]
["Konk Tinstock","Sub Product 5","G-Z/DQ3645",{"$f":"Table1[[#This Row],[Row]]&IF(Table1[[#This Row],[Value]]=\"\",\"\",\" - \"&Table1[[#This Row],[Value]])","v":"Konk Tinstock - G-Z/DQ3645"}]
["Konk Tinstock","Sub Product 6","H-K/DQ8345",{"$f":"Table1[[#This Row],[Row]]&IF(Table1[[#This Row],[Value]]=\"\",\"\",\" - \"&Table1[[#This Row],[Value]])","v":"Konk Tinstock - H-K/DQ8345"}]
["Konk Tinstock","Sub Product 7","I-S/DQ3284",{"$f":"Table1[[#This Row],[Row]]&IF(Table1[[#This Row],[Value]]=\"\",\"\",\" - \"&Table1[[#This Row],[Value]])","v":"Konk Tinstock - I-S/DQ3284"}]
["Silver-Touch","Sub Product 1",null,{"$f":"Table1[[#This Row],[Row]]&IF(Table1[[#This Row],[Value]]=\"\",\"\",\" - \"&Table1[[#This Row],[Value]])","v":"Silver-Touch"}]
["Silver-Touch","Sub Product 2","F-Z/DQ7971",{"$f":"Table1[[#This Row],[Row]]&IF(Table1[[#This Row],[Value]]=\"\",\"\",\" - \"&Table1[[#This Row],[Value]])","v":"Silver-Touch - F-Z/DQ7971"}]
["Silver-Touch","Sub Product 3","C-X/DQ9559",{"$f":"Table1[[#This Row],[Row]]&IF(Table1[[#This Row],[Value]]=\"\",\"\",\" - \"&Table1[[#This Row],[Value]])","v":"Silver-Touch - C-X/DQ9559"}]
["Silver-Touch","Sub Product 4","C-P/DQ9259",{"$f":"Table1[[#This Row],[Row]]&IF(Table1[[#This Row],[Value]]=\"\",\"\",\" - \"&Table1[[#This Row],[Value]])","v":"Silver-Touch - C-P/DQ9259"}]
["Silver-Touch","Sub Product 5","R-T/DQ3009",{"$f":"Table1[[#This Row],[Row]]&IF(Table1[[#This Row],[Value]]=\"\",\"\",\" - \"&Table1[[#This Row],[Value]])","v":"Silver-Touch - R-T/DQ3009"}]
["Silver-Touch","Sub Product 6","H-F/DQ9091",{"$f":"Table1[[#This Row],[Row]]&IF(Table1[[#This Row],[Value]]=\"\",\"\",\" - \"&Table1[[#This Row],[Value]])","v":"Silver-Touch - H-F/DQ9091"}]
["Silver-Touch","Sub Product 7","Z-F/DQ8491",{"$f":"Table1[[#This Row],[Row]]&IF(Table1[[#This Row],[Value]]=\"\",\"\",\" - \"&Table1[[#This Row],[Value]])","v":"Silver-Touch - Z-F/DQ8491"}]
["S-eco","Sub Product 1",null,{"$f":"Table1[[#This Row],[Row]]&IF(Table1[[#This Row],[Value]]=\"\",\"\",\" - \"&Table1[[#This Row],[Value]])","v":"S-eco"}]
["S-eco","Sub Product 2","X-O/DQ2585",{"$f":"Table1[[#This Row],[Row]]&IF(Table1[[#This Row],[Value]]=\"\",\"\",\" - \"&Table1[[#This Row],[Value]])","v":"S-eco - X-O/DQ2585"}]
["S-eco","Sub Product 3","R-L/DQ5437",{"$f":"Table1[[#This Row],[Row]]&IF(Table1[[#This Row],[Value]]=\"\",\"\",\" - \"&Table1[[#This Row],[Value]])","v":"S-eco - R-L/DQ5437"}]
["S-eco","Sub Product 4","F-G/DQ1353",{"$f":"Table1[[#This Row],[Row]]&IF(Table1[[#This Row],[Value]]=\"\",\"\",\" - \"&Table1[[#This Row],[Value]])","v":"S-eco - F-G/DQ1353"}]
["S-eco","Sub Product 5","Q-X/DQ3038",{"$f":"Table1[[#This Row],[Row]]&IF(Table1[[#This Row],[Value]]=\"\",\"\",\" - \"&Table1[[#This Row],[Value]])","v":"S-eco - Q-X/DQ3038"}]
["S-eco","Sub Product 6","F-H/DQ7618",{"$f":"Table1[[#This Row],[Row]]&IF(Table1[[#This Row],[Value]]=\"\",\"\",\" - \"&Table1[[#This Row],[Value]])","v":"S-eco - F-H/DQ7618"}]
["S-eco","Sub Product 7","C-R/DQ6413",{"$f":"Table1[[#This Row],[Row]]&IF(Table1[[#This Row],[Value]]=\"\",\"\",\" - \"&Table1[[#This Row],[Value]])","v":"S-eco - C-R/DQ6413"}]
["Unoin","Sub Product 1",null,{"$f":"Table1[[#This Row],[Row]]&IF(Table1[[#This Row],[Value]]=\"\",\"\",\" - \"&Table1[[#This Row],[Value]])","v":"Unoin"}]
["Unoin","Sub Product 2","F-U/DQ2015",{"$f":"Table1[[#This Row],[Row]]&IF(Table1[[#This Row],[Value]]=\"\",\"\",\" - \"&Table1[[#This Row],[Value]])","v":"Unoin - F-U/DQ2015"}]
["Unoin","Sub Product 3","V-V/DQ1486",{"$f":"Table1[[#This Row],[Row]]&IF(Table1[[#This Row],[Value]]=\"\",\"\",\" - \"&Table1[[#This Row],[Value]])","v":"Unoin - V-V/DQ1486"}]
["Unoin","Sub Product 4","G-S/DQ3365",{"$f":"Table1[[#This Row],[Row]]&IF(Table1[[#This Row],[Value]]=\"\",\"\",\" - \"&Table1[[#This Row],[Value]])","v":"Unoin - G-S/DQ3365"}]
["Unoin","Sub Product 5","J-J/DQ8974",{"$f":"Table1[[#This Row],[Row]]&IF(Table1[[#This Row],[Value]]=\"\",\"\",\" - \"&Table1[[#This Row],[Value]])","v":"Unoin - J-J/DQ8974"}]
["Unoin","Sub Product 6","K-A/DQ1284",{"$f":"Table1[[#This Row],[Row]]&IF(Table1[[#This Row],[Value]]=\"\",\"\",\" - \"&Table1[[#This Row],[Value]])","v":"Unoin - K-A/DQ1284"}]
["Unoin","Sub Product 7","P-N/DQ7205",{"$f":"Table1[[#This Row],[Row]]&IF(Table1[[#This Row],[Value]]=\"\",\"\",\" - \"&Table1[[#This Row],[Value]])","v":"Unoin - P-N/DQ7205"}]
["Laeco","Sub Product 1",null,{"$f":"Table1[[#This Row],[Row]]&IF(Table1[[#This Row],[Value]]=\"\",\"\",\" - \"&Table1[[#This Row],[Value]])","v":"Laeco"}]
["Laeco","Sub Product 2","Y-V/DQ6202",{"$f":"Table1[[#This Row],[Row]]&IF(Table1[[#This Row],[Value]]=\"\",\"\",\" - \"&Table1[[#This Row],[Value]])","v":"Laeco - Y-V/DQ6202"}]
["Laeco","Sub Product 3","R-T/DQ1158",{"$f":"Table1[[#This Row],[Row]]&IF(Table1[[#This Row],[Value]]=\"\",\"\",\" - \"&Table1[[#This Row],[Value]])","v":"Laeco - R-T/DQ1158"}]
["Laeco","Sub Product 4","F-P/DQ2866",{"$f":"Table1[[#This Row],[Row]]&IF(Table1[[#This Row],[Value]]=\"\",\"\",\" - \"&Table1[[#This Row],[Value]])","v":"Laeco - F-P/DQ2866"}]
["Laeco","Sub Product 5","Q-Z/DQ9290",{"$f":"Table1[[#This Row],[Row]]&IF(Table1[[#This Row],[Value]]=\"\",\"\",\" - \"&Table1[[#This Row],[Value]])","v":"Laeco - Q-Z/DQ9290"}]
["Laeco","Sub Product 6","T-D/DQ5678",{"$f":"Table1[[#This Row],[Row]]&IF(Table1[[#This Row],[Value]]=\"\",\"\",\" - \"&Table1[[#This Row],[Value]])","v":"Laeco - T-D/DQ5678"}]
["Laeco","Sub Product 7","V-V/DQ1452",{"$f":"Table1[[#This Row],[Row]]&IF(Table1[[#This Row],[Value]]=\"\",\"\",\" - \"&Table1[[#This Row],[Value]])","v":"Laeco - V-V/DQ1452"}]
["Touch-Lam","Sub Product 1",null,{"$f":"Table1[[#This Row],[Row]]&IF(Table1[[#This Row],[Value]]=\"\",\"\",\" - \"&Table1[[#This Row],[Value]])","v":"Touch-Lam"}]
["Touch-Lam","Sub Product 2","O-G/DQ1258",{"$f":"Table1[[#This Row],[Row]]&IF(Table1[[#This Row],[Value]]=\"\",\"\",\" - \"&Table1[[#This Row],[Value]])","v":"Touch-Lam - O-G/DQ1258"}]
["Touch-Lam","Sub Product 3","B-M/DQ7666",{"$f":"Table1[[#This Row],[Row]]&IF(Table1[[#This Row],[Value]]=\"\",\"\",\" - \"&Table1[[#This Row],[Value]])","v":"Touch-Lam - B-M/DQ7666"}]
["Touch-Lam","Sub Product 4","E-F/DQ8623",{"$f":"Table1[[#This Row],[Row]]&IF(Table1[[#This Row],[Value]]=\"\",\"\",\" - \"&Table1[[#This Row],[Value]])","v":"Touch-Lam - E-F/DQ8623"}]
["Touch-Lam","Sub Product 5","N-H/DQ1331",{"$f":"Table1[[#This Row],[Row]]&IF(Table1[[#This Row],[Value]]=\"\",\"\",\" - \"&Table1[[#This Row],[Value]])","v":"Touch-Lam - N-H/DQ1331"}]
["Touch-Lam","Sub Product 6","A-B/DQ3518",{"$f":"Table1[[#This Row],[Row]]&IF(Table1[[#This Row],[Value]]=\"\",\"\",\" - \"&Table1[[#This Row],[Value]])","v":"Touch-Lam - A-B/DQ3518"}]
["Touch-Lam","Sub Product 7","A-S/DQ7923",{"$f":"Table1[[#This Row],[Row]]&IF(Table1[[#This Row],[Value]]=\"\",\"\",\" - \"&Table1[[#This Row],[Value]])","v":"Touch-Lam - A-S/DQ7923"}]
["Lot String","Sub Product 1",null,{"$f":"Table1[[#This Row],[Row]]&IF(Table1[[#This Row],[Value]]=\"\",\"\",\" - \"&Table1[[#This Row],[Value]])","v":"Lot String"}]
["Lot String","Sub Product 2","G-J/DQ7020",{"$f":"Table1[[#This Row],[Row]]&IF(Table1[[#This Row],[Value]]=\"\",\"\",\" - \"&Table1[[#This Row],[Value]])","v":"Lot String - G-J/DQ7020"}]
["Lot String","Sub Product 3","Z-X/DQ5056",{"$f":"Table1[[#This Row],[Row]]&IF(Table1[[#This Row],[Value]]=\"\",\"\",\" - \"&Table1[[#This Row],[Value]])","v":"Lot String - Z-X/DQ5056"}]
["Lot String","Sub Product 4","T-X/DQ1948",{"$f":"Table1[[#This Row],[Row]]&IF(Table1[[#This Row],[Value]]=\"\",\"\",\" - \"&Table1[[#This Row],[Value]])","v":"Lot String - T-X/DQ1948"}]
["Lot String","Sub Product 5","O-M/DQ4209",{"$f":"Table1[[#This Row],[Row]]&IF(Table1[[#This Row],[Value]]=\"\",\"\",\" - \"&Table1[[#This Row],[Value]])","v":"Lot String - O-M/DQ4209"}]
["Lot String","Sub Product 6","R-X/DQ8489",{"$f":"Table1[[#This Row],[Row]]&IF(Table1[[#This Row],[Value]]=\"\",\"\",\" - \"&Table1[[#This Row],[Value]])","v":"Lot String - R-X/DQ8489"}]
["Lot String","Sub Product 7","K-F/DQ8350",{"$f":"Table1[[#This Row],[Row]]&IF(Table1[[#This Row],[Value]]=\"\",\"\",\" - \"&Table1[[#This Row],[Value]])","v":"Lot String - K-F/DQ8350"}]
["Toncore","Sub Product 1",null,{"$f":"Table1[[#This Row],[Row]]&IF(Table1[[#This Row],[Value]]=\"\",\"\",\" - \"&Table1[[#This Row],[Value]])","v":"Toncore"}]
["Toncore","Sub Product 2","B-Q/DQ1113",{"$f":"Table1[[#This Row],[Row]]&IF(Table1[[#This Row],[Value]]=\"\",\"\",\" - \"&Table1[[#This Row],[Value]])","v":"Toncore - B-Q/DQ1113"}]
["Toncore","Sub Product 3","S-J/DQ8641",{"$f":"Table1[[#This Row],[Row]]&IF(Table1[[#This Row],[Value]]=\"\",\"\",\" - \"&Table1[[#This Row],[Value]])","v":"Toncore - S-J/DQ8641"}]
["Toncore","Sub Product 4","T-O/DQ6035",{"$f":"Table1[[#This Row],[Row]]&IF(Table1[[#This Row],[Value]]=\"\",\"\",\" - \"&Table1[[#This Row],[Value]])","v":"Toncore - T-O/DQ6035"}]
["Toncore","Sub Product 5","O-D/DQ2138",{"$f":"Table1[[#This Row],[Row]]&IF(Table1[[#This Row],[Value]]=\"\",\"\",\" - \"&Table1[[#This Row],[Value]])","v":"Toncore - O-D/DQ2138"}]
["Toncore","Sub Product 6","A-Y/DQ5852",{"$f":"Table1[[#This Row],[Row]]&IF(Table1[[#This Row],[Value]]=\"\",\"\",\" - \"&Table1[[#This Row],[Value]])","v":"Toncore - A-Y/DQ5852"}]
["Toncore","Sub Product 7","A-P/DQ6874",{"$f":"Table1[[#This Row],[Row]]&IF(Table1[[#This Row],[Value]]=\"\",\"\",\" - \"&Table1[[#This Row],[Value]])","v":"Toncore - A-P/DQ6874"}]
["Greeneco","Sub Product 1",null,{"$f":"Table1[[#This Row],[Row]]&IF(Table1[[#This Row],[Value]]=\"\",\"\",\" - \"&Table1[[#This Row],[Value]])","v":"Greeneco"}]
["Greeneco","Sub Product 2","Z-D/DQ3486",{"$f":"Table1[[#This Row],[Row]]&IF(Table1[[#This Row],[Value]]=\"\",\"\",\" - \"&Table1[[#This Row],[Value]])","v":"Greeneco - Z-D/DQ3486"}]
["Greeneco","Sub Product 3","V-L/DQ2156",{"$f":"Table1[[#This Row],[Row]]&IF(Table1[[#This Row],[Value]]=\"\",\"\",\" - \"&Table1[[#This Row],[Value]])","v":"Greeneco - V-L/DQ2156"}]
["Greeneco","Sub Product 4","S-W/DQ3812",{"$f":"Table1[[#This Row],[Row]]&IF(Table1[[#This Row],[Value]]=\"\",\"\",\" - \"&Table1[[#This Row],[Value]])","v":"Greeneco - S-W/DQ3812"}]
["Greeneco","Sub Product 5","O-J/DQ4817",{"$f":"Table1[[#This Row],[Row]]&IF(Table1[[#This Row],[Value]]=\"\",\"\",\" - \"&Table1[[#This Row],[Value]])","v":"Greeneco - O-J/DQ4817"}]
["Greeneco","Sub Product 6","W-U/DQ5837",{"$f":"Table1[[#This Row],[Row]]&IF(Table1[[#This Row],[Value]]=\"\",\"\",\" - \"&Table1[[#This Row],[Value]])","v":"Greeneco - W-U/DQ5837"}]
["Greeneco","Sub Product 7","K-U/DQ5815",{"$f":"Table1[[#This Row],[Row]]&IF(Table1[[#This Row],[Value]]=\"\",\"\",\" - \"&Table1[[#This Row],[Value]])","v":"Greeneco - K-U/DQ5815"}]
["Airdex","Sub Product 1",null,{"$f":"Table1[[#This Row],[Row]]&IF(Table1[[#This Row],[Value]]=\"\",\"\",\" - \"&Table1[[#This Row],[Value]])","v":"Airdex"}]
["Airdex","Sub Product 2","T-Z/DQ8308",{"$f":"Table1[[#This Row],[Row]]&IF(Table1[[#This Row],[Value]]=\"\",\"\",\" - \"&Table1[[#This Row],[Value]])","v":"Airdex - T-Z/DQ8308"}]
["Airdex","Sub Product 3","Q-Y/DQ1201",{"$f":"Table1[[#This Row],[Row]]&IF(Table1[[#This Row],[Value]]=\"\",\"\",\" - \"&Table1[[#This Row],[Value]])","v":"Airdex - Q-Y/DQ1201"}]
["Airdex","Sub Product 4","X-T/DQ3151",{"$f":"Table1[[#This Row],[Row]]&IF(Table1[[#This Row],[Value]]=\"\",\"\",\" - \"&Table1[[#This Row],[Value]])","v":"Airdex - X-T/DQ3151"}]
["Airdex","Sub Product 5","T-U/DQ7219",{"$f":"Table1[[#This Row],[Row]]&IF(Table1[[#This Row],[Value]]=\"\",\"\",\" - \"&Table1[[#This Row],[Value]])","v":"Airdex - T-U/DQ7219"}]
["Airdex","Sub Product 6","X-P/DQ1517",{"$f":"Table1[[#This Row],[Row]]&IF(Table1[[#This Row],[Value]]=\"\",\"\",\" - \"&Table1[[#This Row],[Value]])","v":"Airdex - X-P/DQ1517"}]
["Airdex","Sub Product 7","Q-E/DQ3131",{"$f":"Table1[[#This Row],[Row]]&IF(Table1[[#This Row],[Value]]=\"\",\"\",\" - \"&Table1[[#This Row],[Value]])","v":"Airdex - Q-E/DQ3131"}]
["Lamhold","Sub Product 1",null,{"$f":"Table1[[#This Row],[Row]]&IF(Table1[[#This Row],[Value]]=\"\",\"\",\" - \"&Table1[[#This Row],[Value]])","v":"Lamhold"}]
["Lamhold","Sub Product 2","C-D/DQ9157",{"$f":"Table1[[#This Row],[Row]]&IF(Table1[[#This Row],[Value]]=\"\",\"\",\" - \"&Table1[[#This Row],[Value]])","v":"Lamhold - C-D/DQ9157"}]
["Lamhold","Sub Product 3","P-K/DQ1400",{"$f":"Table1[[#This Row],[Row]]&IF(Table1[[#This Row],[Value]]=\"\",\"\",\" - \"&Table1[[#This Row],[Value]])","v":"Lamhold - P-K/DQ1400"}]
["Lamhold","Sub Product 4","G-M/DQ3192",{"$f":"Table1[[#This Row],[Row]]&IF(Table1[[#This Row],[Value]]=\"\",\"\",\" - \"&Table1[[#This Row],[Value]])","v":"Lamhold - G-M/DQ3192"}]
["Lamhold","Sub Product 5","G-S/DQ5812",{"$f":"Table1[[#This Row],[Row]]&IF(Table1[[#This Row],[Value]]=\"\",\"\",\" - \"&Table1[[#This Row],[Value]])","v":"Lamhold - G-S/DQ5812"}]
["Lamhold","Sub Product 6","O-X/DQ5678",{"$f":"Table1[[#This Row],[Row]]&IF(Table1[[#This Row],[Value]]=\"\",\"\",\" - \"&Table1[[#This Row],[Value]])","v":"Lamhold - O-X/DQ5678"}]
["Lamhold","Sub Product 7","V-P/DQ8051",{"$f":"Table1[[#This Row],[Row]]&IF(Table1[[#This Row],[Value]]=\"\",\"\",\" - \"&Table1[[#This Row],[Value]])","v":"Lamhold - V-P/DQ8051"}]
["Biosing","Sub Product 1",null,{"$f":"Table1[[#This Row],[Row]]&IF(Table1[[#This Row],[Value]]=\"\",\"\",\" - \"&Table1[[#This Row],[Value]])","v":"Biosing"}]
["Biosing","Sub Product 2","E-I/DQ8446",{"$f":"Table1[[#This Row],[Row]]&IF(Table1[[#This Row],[Value]]=\"\",\"\",\" - \"&Table1[[#This Row],[Value]])","v":"Biosing - E-I/DQ8446"}]
["Biosing","Sub Product 3","D-L/DQ9756",{"$f":"Table1[[#This Row],[Row]]&IF(Table1[[#This Row],[Value]]=\"\",\"\",\" - \"&Table1[[#This Row],[Value]])","v":"Biosing - D-L/DQ9756"}]
["Biosing","Sub Product 4","L-O/DQ5650",{"$f":"Table1[[#This Row],[Row]]&IF(Table1[[#This Row],[Value]]=\"\",\"\",\" - \"&Table1[[#This Row],[Value]])","v":"Biosing - L-O/DQ5650"}]
["Biosing","Sub Product 5","I-D/DQ6108",{"$f":"Table1[[#This Row],[Row]]&IF(Table1[[#This Row],[Value]]=\"\",\"\",\" - \"&Table1[[#This Row],[Value]])","v":"Biosing - I-D/DQ6108"}]
["Biosing","Sub Product 6","O-W/DQ1349",{"$f":"Table1[[#This Row],[Row]]&IF(Table1[[#This Row],[Value]]=\"\",\"\",\" - \"&Table1[[#This Row],[Value]])","v":"Biosing - O-W/DQ1349"}]
["Biosing","Sub Product 7","O-J/DQ3480",{"$f":"Table1[[#This Row],[Row]]&IF(Table1[[#This Row],[Value]]=\"\",\"\",\" - \"&Table1[[#This Row],[Value]])","v":"Biosing - O-J/DQ3480"}]
["Viais","Sub Product 1",null,{"$f":"Table1[[#This Row],[Row]]&IF(Table1[[#This Row],[Value]]=\"\",\"\",\" - \"&Table1[[#This Row],[Value]])","v":"Viais"}]
["Viais","Sub Product 2","Z-X/DQ5986",{"$f":"Table1[[#This Row],[Row]]&IF(Table1[[#This Row],[Value]]=\"\",\"\",\" - \"&Table1[[#This Row],[Value]])","v":"Viais - Z-X/DQ5986"}]
["Viais","Sub Product 3","Q-X/DQ5295",{"$f":"Table1[[#This Row],[Row]]&IF(Table1[[#This Row],[Value]]=\"\",\"\",\" - \"&Table1[[#This Row],[Value]])","v":"Viais - Q-X/DQ5295"}]
["Viais","Sub Product 4","B-D/DQ7046",{"$f":"Table1[[#This Row],[Row]]&IF(Table1[[#This Row],[Value]]=\"\",\"\",\" - \"&Table1[[#This Row],[Value]])","v":"Viais - B-D/DQ7046"}]
["Viais","Sub Product 5","Q-O/DQ4384",{"$f":"Table1[[#This Row],[Row]]&IF(Table1[[#This Row],[Value]]=\"\",\"\",\" - \"&Table1[[#This Row],[Value]])","v":"Viais - Q-O/DQ4384"}]
["Viais","Sub Product 6","E-P/DQ1000",{"$f":"Table1[[#This Row],[Row]]&IF(Table1[[#This Row],[Value]]=\"\",\"\",\" - \"&Table1[[#This Row],[Value]])","v":"Viais - E-P/DQ1000"}]
["Viais","Sub Product 7","H-A/DQ4471",{"$f":"Table1[[#This Row],[Row]]&IF(Table1[[#This Row],[Value]]=\"\",\"\",\" - \"&Table1[[#This Row],[Value]])","v":"Viais - H-A/DQ4471"}]
["Zim Lax","Sub Product 1",null,{"$f":"Table1[[#This Row],[Row]]&IF(Table1[[#This Row],[Value]]=\"\",\"\",\" - \"&Table1[[#This Row],[Value]])","v":"Zim Lax"}]
["Zim Lax","Sub Product 2","N-D/DQ2280",{"$f":"Table1[[#This Row],[Row]]&IF(Table1[[#This Row],[Value]]=\"\",\"\",\" - \"&Table1[[#This Row],[Value]])","v":"Zim Lax - N-D/DQ2280"}]
["Zim Lax","Sub Product 3","W-K/DQ4119",{"$f":"Table1[[#This Row],[Row]]&IF(Table1[[#This Row],[Value]]=\"\",\"\",\" - \"&Table1[[#This Row],[Value]])","v":"Zim Lax - W-K/DQ4119"}]
["Zim Lax","Sub Product 4","I-L/DQ5301",{"$f":"Table1[[#This Row],[Row]]&IF(Table1[[#This Row],[Value]]=\"\",\"\",\" - \"&Table1[[#This Row],[Value]])","v":"Zim Lax - I-L/DQ5301"}]
["Zim Lax","Sub Product 5","Z-M/DQ9782",{"$f":"Table1[[#This Row],[Row]]&IF(Table1[[#This Row],[Value]]=\"\",\"\",\" - \"&Table1[[#This Row],[Value]])","v":"Zim Lax - Z-M/DQ9782"}]
["Zim Lax","Sub Product 6","M-O/DQ2381",{"$f":"Table1[[#This Row],[Row]]&IF(Table1[[#This Row],[Value]]=\"\",\"\",\" - \"&Table1[[#This Row],[Value]])","v":"Zim Lax - M-O/DQ2381"}]
["Zim Lax","Sub Product 7","D-X/DQ6309",{"$f":"Table1[[#This Row],[Row]]&IF(Table1[[#This Row],[Value]]=\"\",\"\",\" - \"&Table1[[#This Row],[Value]])","v":"Zim Lax - D-X/DQ6309"}]
["S-lab","Sub Product 1",null,{"$f":"Table1[[#This Row],[Row]]&IF(Table1[[#This Row],[Value]]=\"\",\"\",\" - \"&Table1[[#This Row],[Value]])","v":"S-lab"}]
["S-lab","Sub Product 2","Y-S/DQ3406",{"$f":"Table1[[#This Row],[Row]]&IF(Table1[[#This Row],[Value]]=\"\",\"\",\" - \"&Table1[[#This Row],[Value]])","v":"S-lab - Y-S/DQ3406"}]
["S-lab","Sub Product 3","J-L/DQ1112",{"$f":"Table1[[#This Row],[Row]]&IF(Table1[[#This Row],[Value]]=\"\",\"\",\" - \"&Table1[[#This Row],[Value]])","v":"S-lab - J-L/DQ1112"}]
["S-lab","Sub Product 4","Z-Q/DQ1200",{"$f":"Table1[[#This Row],[Row]]&IF(Table1[[#This Row],[Value]]=\"\",\"\",\" - \"&Table1[[#This Row],[Value]])","v":"S-lab - Z-Q/DQ1200"}]
["S-lab","Sub Product 5","Q-E/DQ6957",{"$f":"Table1[[#This Row],[Row]]&IF(Table1[[#This Row],[Value]]=\"\",\"\",\" - \"&Table1[[#This Row],[Value]])","v":"S-lab - Q-E/DQ6957"}]
["S-lab","Sub Product 6","K-X/DQ6856",{"$f":"Table1[[#This Row],[Row]]&IF(Table1[[#This Row],[Value]]=\"\",\"\",\" - \"&Table1[[#This Row],[Value]])","v":"S-lab - K-X/DQ6856"}]
["S-lab","Sub Product 7","C-W/DQ5579",{"$f":"Table1[[#This Row],[Row]]&IF(Table1[[#This Row],[Value]]=\"\",\"\",\" - \"&Table1[[#This Row],[Value]])","v":"S-lab - C-W/DQ5579"}]
["Stanity","Sub Product 1",null,{"$f":"Table1[[#This Row],[Row]]&IF(Table1[[#This Row],[Value]]=\"\",\"\",\" - \"&Table1[[#This Row],[Value]])","v":"Stanity"}]
["Stanity","Sub Product 2","R-U/DQ4312",{"$f":"Table1[[#This Row],[Row]]&IF(Table1[[#This Row],[Value]]=\"\",\"\",\" - \"&Table1[[#This Row],[Value]])","v":"Stanity - R-U/DQ4312"}]
["Stanity","Sub Product 3","N-X/DQ1329",{"$f":"Table1[[#This Row],[Row]]&IF(Table1[[#This Row],[Value]]=\"\",\"\",\" - \"&Table1[[#This Row],[Value]])","v":"Stanity - N-X/DQ1329"}]
["Stanity","Sub Product 4","M-K/DQ7985",{"$f":"Table1[[#This Row],[Row]]&IF(Table1[[#This Row],[Value]]=\"\",\"\",\" - \"&Table1[[#This Row],[Value]])","v":"Stanity - M-K/DQ7985"}]
["Stanity","Sub Product 5","U-T/DQ3735",{"$f":"Table1[[#This Row],[Row]]&IF(Table1[[#This Row],[Value]]=\"\",\"\",\" - \"&Table1[[#This Row],[Value]])","v":"Stanity - U-T/DQ3735"}]
["Stanity","Sub Product 6","A-X/DQ5877",{"$f":"Table1[[#This Row],[Row]]&IF(Table1[[#This Row],[Value]]=\"\",\"\",\" - \"&Table1[[#This Row],[Value]])","v":"Stanity - A-X/DQ5877"}]
["Stanity","Sub Product 7","P-Y/DQ5472",{"$f":"Table1[[#This Row],[Row]]&IF(Table1[[#This Row],[Value]]=\"\",\"\",\" - \"&Table1[[#This Row],[Value]])","v":"Stanity - P-Y/DQ5472"}]
["Contom","Sub Product 1",null,{"$f":"Table1[[#This Row],[Row]]&IF(Table1[[#This Row],[Value]]=\"\",\"\",\" - \"&Table1[[#This Row],[Value]])","v":"Contom"}]
["Contom","Sub Product 2","H-C/DQ2317",{"$f":"Table1[[#This Row],[Row]]&IF(Table1[[#This Row],[Value]]=\"\",\"\",\" - \"&Table1[[#This Row],[Value]])","v":"Contom - H-C/DQ2317"}]
["Contom","Sub Product 3","X-V/DQ6726",{"$f":"Table1[[#This Row],[Row]]&IF(Table1[[#This Row],[Value]]=\"\",\"\",\" - \"&Table1[[#This Row],[Value]])","v":"Contom - X-V/DQ6726"}]
["Contom","Sub Product 4","C-B/DQ5190",{"$f":"Table1[[#This Row],[Row]]&IF(Table1[[#This Row],[Value]]=\"\",\"\",\" - \"&Table1[[#This Row],[Value]])","v":"Contom - C-B/DQ5190"}]
["Contom","Sub Product 5","Q-Y/DQ2021",{"$f":"Table1[[#This Row],[Row]]&IF(Table1[[#This Row],[Value]]=\"\",\"\",\" - \"&Table1[[#This Row],[Value]])","v":"Contom - Q-Y/DQ2021"}]
["Contom","Sub Product 6","E-E/DQ5627",{"$f":"Table1[[#This Row],[Row]]&IF(Table1[[#This Row],[Value]]=\"\",\"\",\" - \"&Table1[[#This Row],[Value]])","v":"Contom - E-E/DQ5627"}]
["Contom","Sub Product 7","A-K/DQ5855",{"$f":"Table1[[#This Row],[Row]]&IF(Table1[[#This Row],[Value]]=\"\",\"\",\" - \"&Table1[[#This Row],[Value]])","v":"Contom - A-K/DQ5855"}]
["Lam-Top","Sub Product 1",null,{"$f":"Table1[[#This Row],[Row]]&IF(Table1[[#This Row],[Value]]=\"\",\"\",\" - \"&Table1[[#This Row],[Value]])","v":"Lam-Top"}]
["Lam-Top","Sub Product 2","T-E/DQ7702",{"$f":"Table1[[#This Row],[Row]]&IF(Table1[[#This Row],[Value]]=\"\",\"\",\" - \"&Table1[[#This Row],[Value]])","v":"Lam-Top - T-E/DQ7702"}]
["Lam-Top","Sub Product 3","S-M/DQ3163",{"$f":"Table1[[#This Row],[Row]]&IF(Table1[[#This Row],[Value]]=\"\",\"\",\" - \"&Table1[[#This Row],[Value]])","v":"Lam-Top - S-M/DQ3163"}]
["Lam-Top","Sub Product 4","B-I/DQ6623",{"$f":"Table1[[#This Row],[Row]]&IF(Table1[[#This Row],[Value]]=\"\",\"\",\" - \"&Table1[[#This Row],[Value]])","v":"Lam-Top - B-I/DQ6623"}]
["Lam-Top","Sub Product 5","U-G/DQ3097",{"$f":"Table1[[#This Row],[Row]]&IF(Table1[[#This Row],[Value]]=\"\",\"\",\" - \"&Table1[[#This Row],[Value]])","v":"Lam-Top - U-G/DQ3097"}]
["Lam-Top","Sub Product 6","V-D/DQ3996",{"$f":"Table1[[#This Row],[Row]]&IF(Table1[[#This Row],[Value]]=\"\",\"\",\" - \"&Table1[[#This Row],[Value]])","v":"Lam-Top - V-D/DQ3996"}]
["Lam-Top","Sub Product 7","U-N/DQ7711",{"$f":"Table1[[#This Row],[Row]]&IF(Table1[[#This Row],[Value]]=\"\",\"\",\" - \"&Table1[[#This Row],[Value]])","v":"Lam-Top - U-N/DQ7711"}]
["Trantraxbam","Sub Product 1",null,{"$f":"Table1[[#This Row],[Row]]&IF(Table1[[#This Row],[Value]]=\"\",\"\",\" - \"&Table1[[#This Row],[Value]])","v":"Trantraxbam"}]
["Trantraxbam","Sub Product 2","C-T/DQ4565",{"$f":"Table1[[#This Row],[Row]]&IF(Table1[[#This Row],[Value]]=\"\",\"\",\" - \"&Table1[[#This Row],[Value]])","v":"Trantraxbam - C-T/DQ4565"}]
["Trantraxbam","Sub Product 3","Z-F/DQ1695",{"$f":"Table1[[#This Row],[Row]]&IF(Table1[[#This Row],[Value]]=\"\",\"\",\" - \"&Table1[[#This Row],[Value]])","v":"Trantraxbam - Z-F/DQ1695"}]
["Trantraxbam","Sub Product 4","V-V/DQ3074",{"$f":"Table1[[#This Row],[Row]]&IF(Table1[[#This Row],[Value]]=\"\",\"\",\" - \"&Table1[[#This Row],[Value]])","v":"Trantraxbam - V-V/DQ3074"}]
["Trantraxbam","Sub Product 5","V-P/DQ9688",{"$f":"Table1[[#This Row],[Row]]&IF(Table1[[#This Row],[Value]]=\"\",\"\",\" - \"&Table1[[#This Row],[Value]])","v":"Trantraxbam - V-P/DQ9688"}]
["Trantraxbam","Sub Product 6","S-M/DQ1541",{"$f":"Table1[[#This Row],[Row]]&IF(Table1[[#This Row],[Value]]=\"\",\"\",\" - \"&Table1[[#This Row],[Value]])","v":"Trantraxbam - S-M/DQ1541"}]
["Trantraxbam","Sub Product 7","G-E/DQ8061",{"$f":"Table1[[#This Row],[Row]]&IF(Table1[[#This Row],[Value]]=\"\",\"\",\" - \"&Table1[[#This Row],[Value]])","v":"Trantraxbam - G-E/DQ8061"}]
["Silver Traxsing","Sub Product 1",null,{"$f":"Table1[[#This Row],[Row]]&IF(Table1[[#This Row],[Value]]=\"\",\"\",\" - \"&Table1[[#This Row],[Value]])","v":"Silver Traxsing"}]
["Silver Traxsing","Sub Product 2","N-V/DQ7788",{"$f":"Table1[[#This Row],[Row]]&IF(Table1[[#This Row],[Value]]=\"\",\"\",\" - \"&Table1[[#This Row],[Value]])","v":"Silver Traxsing - N-V/DQ7788"}]
["Silver Traxsing","Sub Product 3","R-O/DQ1810",{"$f":"Table1[[#This Row],[Row]]&IF(Table1[[#This Row],[Value]]=\"\",\"\",\" - \"&Table1[[#This Row],[Value]])","v":"Silver Traxsing - R-O/DQ1810"}]
["Silver Traxsing","Sub Product 4","E-X/DQ4308",{"$f":"Table1[[#This Row],[Row]]&IF(Table1[[#This Row],[Value]]=\"\",\"\",\" - \"&Table1[[#This Row],[Value]])","v":"Silver Traxsing - E-X/DQ4308"}]
["Silver Traxsing","Sub Product 5","T-D/DQ7728",{"$f":"Table1[[#This Row],[Row]]&IF(Table1[[#This Row],[Value]]=\"\",\"\",\" - \"&Table1[[#This Row],[Value]])","v":"Silver Traxsing - T-D/DQ7728"}]
["Silver Traxsing","Sub Product 6","Y-J/DQ5551",{"$f":"Table1[[#This Row],[Row]]&IF(Table1[[#This Row],[Value]]=\"\",\"\",\" - \"&Table1[[#This Row],[Value]])","v":"Silver Traxsing - Y-J/DQ5551"}]
["Silver Traxsing","Sub Product 7","D-M/DQ7097",{"$f":"Table1[[#This Row],[Row]]&IF(Table1[[#This Row],[Value]]=\"\",\"\",\" - \"&Table1[[#This Row],[Value]])","v":"Silver Traxsing - D-M/DQ7097"}]
["Softdex","Sub Product 1",null,{"$f":"Table1[[#This Row],[Row]]&IF(Table1[[#This Row],[Value]]=\"\",\"\",\" - \"&Table1[[#This Row],[Value]])","v":"Softdex"}]
["Softdex","Sub Product 2","F-G/DQ1406",{"$f":"Table1[[#This Row],[Row]]&IF(Table1[[#This Row],[Value]]=\"\",\"\",\" - \"&Table1[[#This Row],[Value]])","v":"Softdex - F-G/DQ1406"}]
["Softdex","Sub Product 3","M-B/DQ8930",{"$f":"Table1[[#This Row],[Row]]&IF(Table1[[#This Row],[Value]]=\"\",\"\",\" - \"&Table1[[#This Row],[Value]])","v":"Softdex - M-B/DQ8930"}]
["Softdex","Sub Product 4","L-R/DQ1359",{"$f":"Table1[[#This Row],[Row]]&IF(Table1[[#This Row],[Value]]=\"\",\"\",\" - \"&Table1[[#This Row],[Value]])","v":"Softdex - L-R/DQ1359"}]
["Softdex","Sub Product 5","I-P/DQ1241",{"$f":"Table1[[#This Row],[Row]]&IF(Table1[[#This Row],[Value]]=\"\",\"\",\" - \"&Table1[[#This Row],[Value]])","v":"Softdex - I-P/DQ1241"}]
["Softdex","Sub Product 6","C-I/DQ3156",{"$f":"Table1[[#This Row],[Row]]&IF(Table1[[#This Row],[Value]]=\"\",\"\",\" - \"&Table1[[#This Row],[Value]])","v":"Softdex - C-I/DQ3156"}]
["Softdex","Sub Product 7","R-B/DQ8080",{"$f":"Table1[[#This Row],[Row]]&IF(Table1[[#This Row],[Value]]=\"\",\"\",\" - \"&Table1[[#This Row],[Value]])","v":"Softdex - R-B/DQ8080"}]
["Air-Trax","Sub Product 1",null,{"$f":"Table1[[#This Row],[Row]]&IF(Table1[[#This Row],[Value]]=\"\",\"\",\" - \"&Table1[[#This Row],[Value]])","v":"Air-Trax"}]
["Air-Trax","Sub Product 2","I-Y/DQ6462",{"$f":"Table1[[#This Row],[Row]]&IF(Table1[[#This Row],[Value]]=\"\",\"\",\" - \"&Table1[[#This Row],[Value]])","v":"Air-Trax - I-Y/DQ6462"}]
["Air-Trax","Sub Product 3","U-B/DQ2419",{"$f":"Table1[[#This Row],[Row]]&IF(Table1[[#This Row],[Value]]=\"\",\"\",\" - \"&Table1[[#This Row],[Value]])","v":"Air-Trax - U-B/DQ2419"}]
["Air-Trax","Sub Product 4","Y-X/DQ9909",{"$f":"Table1[[#This Row],[Row]]&IF(Table1[[#This Row],[Value]]=\"\",\"\",\" - \"&Table1[[#This Row],[Value]])","v":"Air-Trax - Y-X/DQ9909"}]
["Air-Trax","Sub Product 5","J-E/DQ2773",{"$f":"Table1[[#This Row],[Row]]&IF(Table1[[#This Row],[Value]]=\"\",\"\",\" - \"&Table1[[#This Row],[Value]])","v":"Air-Trax - J-E/DQ2773"}]
["Air-Trax","Sub Product 6","V-E/DQ6312",{"$f":"Table1[[#This Row],[Row]]&IF(Table1[[#This Row],[Value]]=\"\",\"\",\" - \"&Table1[[#This Row],[Value]])","v":"Air-Trax - V-E/DQ6312"}]
["Air-Trax","Sub Product 7","E-T/DQ4131",{"$f":"Table1[[#This Row],[Row]]&IF(Table1[[#This Row],[Value]]=\"\",\"\",\" - \"&Table1[[#This Row],[Value]])","v":"Air-Trax - E-T/DQ4131"}]
["Labfax","Sub Product 1",null,{"$f":"Table1[[#This Row],[Row]]&IF(Table1[[#This Row],[Value]]=\"\",\"\",\" - \"&Table1[[#This Row],[Value]])","v":"Labfax"}]
["Labfax","Sub Product 2","W-U/DQ4000",{"$f":"Table1[[#This Row],[Row]]&IF(Table1[[#This Row],[Value]]=\"\",\"\",\" - \"&Table1[[#This Row],[Value]])","v":"Labfax - W-U/DQ4000"}]
["Labfax","Sub Product 3","Z-G/DQ3343",{"$f":"Table1[[#This Row],[Row]]&IF(Table1[[#This Row],[Value]]=\"\",\"\",\" - \"&Table1[[#This Row],[Value]])","v":"Labfax - Z-G/DQ3343"}]
["Labfax","Sub Product 4","U-F/DQ2988",{"$f":"Table1[[#This Row],[Row]]&IF(Table1[[#This Row],[Value]]=\"\",\"\",\" - \"&Table1[[#This Row],[Value]])","v":"Labfax - U-F/DQ2988"}]
["Labfax","Sub Product 5","T-R/DQ1925",{"$f":"Table1[[#This Row],[Row]]&IF(Table1[[#This Row],[Value]]=\"\",\"\",\" - \"&Table1[[#This Row],[Value]])","v":"Labfax - T-R/DQ1925"}]
["Labfax","Sub Product 6","Z-P/DQ7423",{"$f":"Table1[[#This Row],[Row]]&IF(Table1[[#This Row],[Value]]=\"\",\"\",\" - \"&Table1[[#This Row],[Value]])","v":"Labfax - Z-P/DQ7423"}]
["Labfax","Sub Product 7","Z-P/DQ9403",{"$f":"Table1[[#This Row],[Row]]&IF(Table1[[#This Row],[Value]]=\"\",\"\",\" - \"&Table1[[#This Row],[Value]])","v":"Labfax - Z-P/DQ9403"}]
["Konkstatis","Sub Product 1",null,{"$f":"Table1[[#This Row],[Row]]&IF(Table1[[#This Row],[Value]]=\"\",\"\",\" - \"&Table1[[#This Row],[Value]])","v":"Konkstatis"}]
["Konkstatis","Sub Product 2","H-T/DQ7055",{"$f":"Table1[[#This Row],[Row]]&IF(Table1[[#This Row],[Value]]=\"\",\"\",\" - \"&Table1[[#This Row],[Value]])","v":"Konkstatis - H-T/DQ7055"}]
["Konkstatis","Sub Product 3","V-Y/DQ8364",{"$f":"Table1[[#This Row],[Row]]&IF(Table1[[#This Row],[Value]]=\"\",\"\",\" - \"&Table1[[#This Row],[Value]])","v":"Konkstatis - V-Y/DQ8364"}]
["Konkstatis","Sub Product 4","U-Z/DQ3697",{"$f":"Table1[[#This Row],[Row]]&IF(Table1[[#This Row],[Value]]=\"\",\"\",\" - \"&Table1[[#This Row],[Value]])","v":"Konkstatis - U-Z/DQ3697"}]
["Konkstatis","Sub Product 5","N-H/DQ9038",{"$f":"Table1[[#This Row],[Row]]&IF(Table1[[#This Row],[Value]]=\"\",\"\",\" - \"&Table1[[#This Row],[Value]])","v":"Konkstatis - N-H/DQ9038"}]
["Konkstatis","Sub Product 6","L-N/DQ1973",{"$f":"Table1[[#This Row],[Row]]&IF(Table1[[#This Row],[Value]]=\"\",\"\",\" - \"&Table1[[#This Row],[Value]])","v":"Konkstatis - L-N/DQ1973"}]
["Konkstatis","Sub Product 7","G-T/DQ5579",{"$f":"Table1[[#This Row],[Row]]&IF(Table1[[#This Row],[Value]]=\"\",\"\",\" - \"&Table1[[#This Row],[Value]])","v":"Konkstatis - G-T/DQ5579"}]
["Touchtone","Sub Product 1",null,{"$f":"Table1[[#This Row],[Row]]&IF(Table1[[#This Row],[Value]]=\"\",\"\",\" - \"&Table1[[#This Row],[Value]])","v":"Touchtone"}]
["Touchtone","Sub Product 2","D-O/DQ4093",{"$f":"Table1[[#This Row],[Row]]&IF(Table1[[#This Row],[Value]]=\"\",\"\",\" - \"&Table1[[#This Row],[Value]])","v":"Touchtone - D-O/DQ4093"}]
["Touchtone","Sub Product 3","D-C/DQ1506",{"$f":"Table1[[#This Row],[Row]]&IF(Table1[[#This Row],[Value]]=\"\",\"\",\" - \"&Table1[[#This Row],[Value]])","v":"Touchtone - D-C/DQ1506"}]
["Touchtone","Sub Product 4","X-V/DQ3046",{"$f":"Table1[[#This Row],[Row]]&IF(Table1[[#This Row],[Value]]=\"\",\"\",\" - \"&Table1[[#This Row],[Value]])","v":"Touchtone - X-V/DQ3046"}]
["Touchtone","Sub Product 5","Z-T/DQ8406",{"$f":"Table1[[#This Row],[Row]]&IF(Table1[[#This Row],[Value]]=\"\",\"\",\" - \"&Table1[[#This Row],[Value]])","v":"Touchtone - Z-T/DQ8406"}]
["Touchtone","Sub Product 6","R-G/DQ2487",{"$f":"Table1[[#This Row],[Row]]&IF(Table1[[#This Row],[Value]]=\"\",\"\",\" - \"&Table1[[#This Row],[Value]])","v":"Touchtone - R-G/DQ2487"}]
["Touchtone","Sub Product 7","O-G/DQ9131",{"$f":"Table1[[#This Row],[Row]]&IF(Table1[[#This Row],[Value]]=\"\",\"\",\" - \"&Table1[[#This Row],[Value]])","v":"Touchtone - O-G/DQ9131"}]
["Ecotone","Sub Product 1",null,{"$f":"Table1[[#This Row],[Row]]&IF(Table1[[#This Row],[Value]]=\"\",\"\",\" - \"&Table1[[#This Row],[Value]])","v":"Ecotone"}]
["Ecotone","Sub Product 2","L-M/DQ2346",{"$f":"Table1[[#This Row],[Row]]&IF(Table1[[#This Row],[Value]]=\"\",\"\",\" - \"&Table1[[#This Row],[Value]])","v":"Ecotone - L-M/DQ2346"}]
["Ecotone","Sub Product 3","W-H/DQ7772",{"$f":"Table1[[#This Row],[Row]]&IF(Table1[[#This Row],[Value]]=\"\",\"\",\" - \"&Table1[[#This Row],[Value]])","v":"Ecotone - W-H/DQ7772"}]
["Ecotone","Sub Product 4","H-O/DQ8735",{"$f":"Table1[[#This Row],[Row]]&IF(Table1[[#This Row],[Value]]=\"\",\"\",\" - \"&Table1[[#This Row],[Value]])","v":"Ecotone - H-O/DQ8735"}]
["Ecotone","Sub Product 5","Y-R/DQ3598",{"$f":"Table1[[#This Row],[Row]]&IF(Table1[[#This Row],[Value]]=\"\",\"\",\" - \"&Table1[[#This Row],[Value]])","v":"Ecotone - Y-R/DQ3598"}]
["Ecotone","Sub Product 6","E-Y/DQ1323",{"$f":"Table1[[#This Row],[Row]]&IF(Table1[[#This Row],[Value]]=\"\",\"\",\" - \"&Table1[[#This Row],[Value]])","v":"Ecotone - E-Y/DQ1323"}]
["Ecotone","Sub Product 7","C-Q/DQ1220",{"$f":"Table1[[#This Row],[Row]]&IF(Table1[[#This Row],[Value]]=\"\",\"\",\" - \"&Table1[[#This Row],[Value]])","v":"Ecotone - C-Q/DQ1220"}]
["Sublax","Sub Product 1",null,{"$f":"Table1[[#This Row],[Row]]&IF(Table1[[#This Row],[Value]]=\"\",\"\",\" - \"&Table1[[#This Row],[Value]])","v":"Sublax"}]
["Sublax","Sub Product 2","K-Z/DQ1958",{"$f":"Table1[[#This Row],[Row]]&IF(Table1[[#This Row],[Value]]=\"\",\"\",\" - \"&Table1[[#This Row],[Value]])","v":"Sublax - K-Z/DQ1958"}]
["Sublax","Sub Product 3","E-T/DQ1182",{"$f":"Table1[[#This Row],[Row]]&IF(Table1[[#This Row],[Value]]=\"\",\"\",\" - \"&Table1[[#This Row],[Value]])","v":"Sublax - E-T/DQ1182"}]
["Sublax","Sub Product 4","D-V/DQ2263",{"$f":"Table1[[#This Row],[Row]]&IF(Table1[[#This Row],[Value]]=\"\",\"\",\" - \"&Table1[[#This Row],[Value]])","v":"Sublax - D-V/DQ2263"}]
["Sublax","Sub Product 5","F-Q/DQ1782",{"$f":"Table1[[#This Row],[Row]]&IF(Table1[[#This Row],[Value]]=\"\",\"\",\" - \"&Table1[[#This Row],[Value]])","v":"Sublax - F-Q/DQ1782"}]
["Sublax","Sub Product 6","F-W/DQ1945",{"$f":"Table1[[#This Row],[Row]]&IF(Table1[[#This Row],[Value]]=\"\",\"\",\" - \"&Table1[[#This Row],[Value]])","v":"Sublax - F-W/DQ1945"}]
["Sublax","Sub Product 7","F-J/DQ1793",{"$f":"Table1[[#This Row],[Row]]&IF(Table1[[#This Row],[Value]]=\"\",\"\",\" - \"&Table1[[#This Row],[Value]])","v":"Sublax - F-J/DQ1793"}]
["Donlab","Sub Product 1",null,{"$f":"Table1[[#This Row],[Row]]&IF(Table1[[#This Row],[Value]]=\"\",\"\",\" - \"&Table1[[#This Row],[Value]])","v":"Donlab"}]
["Donlab","Sub Product 2","M-U/DQ5037",{"$f":"Table1[[#This Row],[Row]]&IF(Table1[[#This Row],[Value]]=\"\",\"\",\" - \"&Table1[[#This Row],[Value]])","v":"Donlab - M-U/DQ5037"}]
["Donlab","Sub Product 3","E-B/DQ7006",{"$f":"Table1[[#This Row],[Row]]&IF(Table1[[#This Row],[Value]]=\"\",\"\",\" - \"&Table1[[#This Row],[Value]])","v":"Donlab - E-B/DQ7006"}]
["Donlab","Sub Product 4","R-Q/DQ3540",{"$f":"Table1[[#This Row],[Row]]&IF(Table1[[#This Row],[Value]]=\"\",\"\",\" - \"&Table1[[#This Row],[Value]])","v":"Donlab - R-Q/DQ3540"}]
["Donlab","Sub Product 5","I-I/DQ2681",{"$f":"Table1[[#This Row],[Row]]&IF(Table1[[#This Row],[Value]]=\"\",\"\",\" - \"&Table1[[#This Row],[Value]])","v":"Donlab - I-I/DQ2681"}]
["Donlab","Sub Product 6","G-U/DQ4067",{"$f":"Table1[[#This Row],[Row]]&IF(Table1[[#This Row],[Value]]=\"\",\"\",\" - \"&Table1[[#This Row],[Value]])","v":"Donlab - G-U/DQ4067"}]
["Donlab","Sub Product 7","N-R/DQ9996",{"$f":"Table1[[#This Row],[Row]]&IF(Table1[[#This Row],[Value]]=\"\",\"\",\" - \"&Table1[[#This Row],[Value]])","v":"Donlab - N-R/DQ9996"}]
["Freetaming","Sub Product 1",null,{"$f":"Table1[[#This Row],[Row]]&IF(Table1[[#This Row],[Value]]=\"\",\"\",\" - \"&Table1[[#This Row],[Value]])","v":"Freetaming"}]
["Freetaming","Sub Product 2","P-U/DQ7673",{"$f":"Table1[[#This Row],[Row]]&IF(Table1[[#This Row],[Value]]=\"\",\"\",\" - \"&Table1[[#This Row],[Value]])","v":"Freetaming - P-U/DQ7673"}]
["Freetaming","Sub Product 3","D-V/DQ8854",{"$f":"Table1[[#This Row],[Row]]&IF(Table1[[#This Row],[Value]]=\"\",\"\",\" - \"&Table1[[#This Row],[Value]])","v":"Freetaming - D-V/DQ8854"}]
["Freetaming","Sub Product 4","K-H/DQ9072",{"$f":"Table1[[#This Row],[Row]]&IF(Table1[[#This Row],[Value]]=\"\",\"\",\" - \"&Table1[[#This Row],[Value]])","v":"Freetaming - K-H/DQ9072"}]
["Freetaming","Sub Product 5","G-I/DQ6806",{"$f":"Table1[[#This Row],[Row]]&IF(Table1[[#This Row],[Value]]=\"\",\"\",\" - \"&Table1[[#This Row],[Value]])","v":"Freetaming - G-I/DQ6806"}]
["Freetaming","Sub Product 6","M-M/DQ3184",{"$f":"Table1[[#This Row],[Row]]&IF(Table1[[#This Row],[Value]]=\"\",\"\",\" - \"&Table1[[#This Row],[Value]])","v":"Freetaming - M-M/DQ3184"}]
["Freetaming","Sub Product 7","B-V/DQ1806",{"$f":"Table1[[#This Row],[Row]]&IF(Table1[[#This Row],[Value]]=\"\",\"\",\" - \"&Table1[[#This Row],[Value]])","v":"Freetaming - B-V/DQ1806"}]
["Volt Tanstock","Sub Product 1",null,{"$f":"Table1[[#This Row],[Row]]&IF(Table1[[#This Row],[Value]]=\"\",\"\",\" - \"&Table1[[#This Row],[Value]])","v":"Volt Tanstock"}]
["Volt Tanstock","Sub Product 2","E-V/DQ1711",{"$f":"Table1[[#This Row],[Row]]&IF(Table1[[#This Row],[Value]]=\"\",\"\",\" - \"&Table1[[#This Row],[Value]])","v":"Volt Tanstock - E-V/DQ1711"}]
["Volt Tanstock","Sub Product 3","D-D/DQ3113",{"$f":"Table1[[#This Row],[Row]]&IF(Table1[[#This Row],[Value]]=\"\",\"\",\" - \"&Table1[[#This Row],[Value]])","v":"Volt Tanstock - D-D/DQ3113"}]
["Volt Tanstock","Sub Product 4","U-H/DQ3939",{"$f":"Table1[[#This Row],[Row]]&IF(Table1[[#This Row],[Value]]=\"\",\"\",\" - \"&Table1[[#This Row],[Value]])","v":"Volt Tanstock - U-H/DQ3939"}]
["Volt Tanstock","Sub Product 5","V-W/DQ2342",{"$f":"Table1[[#This Row],[Row]]&IF(Table1[[#This Row],[Value]]=\"\",\"\",\" - \"&Table1[[#This Row],[Value]])","v":"Volt Tanstock - V-W/DQ2342"}]
["Volt Tanstock","Sub Product 6","B-C/DQ4270",{"$f":"Table1[[#This Row],[Row]]&IF(Table1[[#This Row],[Value]]=\"\",\"\",\" - \"&Table1[[#This Row],[Value]])","v":"Volt Tanstock - B-C/DQ4270"}]
["Volt Tanstock","Sub Product 7","J-N/DQ2005",{"$f":"Table1[[#This Row],[Row]]&IF(Table1[[#This Row],[Value]]=\"\",\"\",\" - \"&Table1[[#This Row],[Value]])","v":"Volt Tanstock - J-N/DQ2005"}]
["Single Zimfax","Sub Product 1",null,{"$f":"Table1[[#This Row],[Row]]&IF(Table1[[#This Row],[Value]]=\"\",\"\",\" - \"&Table1[[#This Row],[Value]])","v":"Single Zimfax"}]
["Single Zimfax","Sub Product 2","Q-K/DQ8122",{"$f":"Table1[[#This Row],[Row]]&IF(Table1[[#This Row],[Value]]=\"\",\"\",\" - \"&Table1[[#This Row],[Value]])","v":"Single Zimfax - Q-K/DQ8122"}]
["Single Zimfax","Sub Product 3","X-H/DQ4021",{"$f":"Table1[[#This Row],[Row]]&IF(Table1[[#This Row],[Value]]=\"\",\"\",\" - \"&Table1[[#This Row],[Value]])","v":"Single Zimfax - X-H/DQ4021"}]
["Single Zimfax","Sub Product 4","F-K/DQ3308",{"$f":"Table1[[#This Row],[Row]]&IF(Table1[[#This Row],[Value]]=\"\",\"\",\" - \"&Table1[[#This Row],[Value]])","v":"Single Zimfax - F-K/DQ3308"}]
["Single Zimfax","Sub Product 5","H-O/DQ8072",{"$f":"Table1[[#This Row],[Row]]&IF(Table1[[#This Row],[Value]]=\"\",\"\",\" - \"&Table1[[#This Row],[Value]])","v":"Single Zimfax - H-O/DQ8072"}]
["Single Zimfax","Sub Product 6","D-Z/DQ6642",{"$f":"Table1[[#This Row],[Row]]&IF(Table1[[#This Row],[Value]]=\"\",\"\",\" - \"&Table1[[#This Row],[Value]])","v":"Single Zimfax - D-Z/DQ6642"}]
["Single Zimfax","Sub Product 7","P-Q/DQ7285",{"$f":"Table1[[#This Row],[Row]]&IF(Table1[[#This Row],[Value]]=\"\",\"\",\" - \"&Table1[[#This Row],[Value]])","v":"Single Zimfax - P-Q/DQ7285"}]
["Nameco","Sub Product 1",null,{"$f":"Table1[[#This Row],[Row]]&IF(Table1[[#This Row],[Value]]=\"\",\"\",\" - \"&Table1[[#This Row],[Value]])","v":"Nameco"}]
["Nameco","Sub Product 2","A-E/DQ4006",{"$f":"Table1[[#This Row],[Row]]&IF(Table1[[#This Row],[Value]]=\"\",\"\",\" - \"&Table1[[#This Row],[Value]])","v":"Nameco - A-E/DQ4006"}]
["Nameco","Sub Product 3","M-L/DQ5420",{"$f":"Table1[[#This Row],[Row]]&IF(Table1[[#This Row],[Value]]=\"\",\"\",\" - \"&Table1[[#This Row],[Value]])","v":"Nameco - M-L/DQ5420"}]
["Nameco","Sub Product 4","A-I/DQ5311",{"$f":"Table1[[#This Row],[Row]]&IF(Table1[[#This Row],[Value]]=\"\",\"\",\" - \"&Table1[[#This Row],[Value]])","v":"Nameco - A-I/DQ5311"}]
["Nameco","Sub Product 5","G-N/DQ5865",{"$f":"Table1[[#This Row],[Row]]&IF(Table1[[#This Row],[Value]]=\"\",\"\",\" - \"&Table1[[#This Row],[Value]])","v":"Nameco - G-N/DQ5865"}]
["Nameco","Sub Product 6","O-O/DQ6738",{"$f":"Table1[[#This Row],[Row]]&IF(Table1[[#This Row],[Value]]=\"\",\"\",\" - \"&Table1[[#This Row],[Value]])","v":"Nameco - O-O/DQ6738"}]
["Nameco","Sub Product 7","I-O/DQ8975",{"$f":"Table1[[#This Row],[Row]]&IF(Table1[[#This Row],[Value]]=\"\",\"\",\" - \"&Table1[[#This Row],[Value]])","v":"Nameco - I-O/DQ8975"}]
["Canhotin","Sub Product 1",null,{"$f":"Table1[[#This Row],[Row]]&IF(Table1[[#This Row],[Value]]=\"\",\"\",\" - \"&Table1[[#This Row],[Value]])","v":"Canhotin"}]
["Canhotin","Sub Product 2","X-C/DQ7536",{"$f":"Table1[[#This Row],[Row]]&IF(Table1[[#This Row],[Value]]=\"\",\"\",\" - \"&Table1[[#This Row],[Value]])","v":"Canhotin - X-C/DQ7536"}]
["Canhotin","Sub Product 3","H-O/DQ5982",{"$f":"Table1[[#This Row],[Row]]&IF(Table1[[#This Row],[Value]]=\"\",\"\",\" - \"&Table1[[#This Row],[Value]])","v":"Canhotin - H-O/DQ5982"}]
["Canhotin","Sub Product 4","U-U/DQ6424",{"$f":"Table1[[#This Row],[Row]]&IF(Table1[[#This Row],[Value]]=\"\",\"\",\" - \"&Table1[[#This Row],[Value]])","v":"Canhotin - U-U/DQ6424"}]
["Canhotin","Sub Product 5","C-S/DQ9155",{"$f":"Table1[[#This Row],[Row]]&IF(Table1[[#This Row],[Value]]=\"\",\"\",\" - \"&Table1[[#This Row],[Value]])","v":"Canhotin - C-S/DQ9155"}]
["Canhotin","Sub Product 6","O-K/DQ2805",{"$f":"Table1[[#This Row],[Row]]&IF(Table1[[#This Row],[Value]]=\"\",\"\",\" - \"&Table1[[#This Row],[Value]])","v":"Canhotin - O-K/DQ2805"}]
["Canhotin","Sub Product 7","I-S/DQ2919",{"$f":"Table1[[#This Row],[Row]]&IF(Table1[[#This Row],[Value]]=\"\",\"\",\" - \"&Table1[[#This Row],[Value]])","v":"Canhotin - I-S/DQ2919"}]
["Opedax","Sub Product 1",null,{"$f":"Table1[[#This Row],[Row]]&IF(Table1[[#This Row],[Value]]=\"\",\"\",\" - \"&Table1[[#This Row],[Value]])","v":"Opedax"}]
["Opedax","Sub Product 2","V-K/DQ5620",{"$f":"Table1[[#This Row],[Row]]&IF(Table1[[#This Row],[Value]]=\"\",\"\",\" - \"&Table1[[#This Row],[Value]])","v":"Opedax - V-K/DQ5620"}]
["Opedax","Sub Product 3","I-A/DQ6402",{"$f":"Table1[[#This Row],[Row]]&IF(Table1[[#This Row],[Value]]=\"\",\"\",\" - \"&Table1[[#This Row],[Value]])","v":"Opedax - I-A/DQ6402"}]
["Opedax","Sub Product 4","O-C/DQ1475",{"$f":"Table1[[#This Row],[Row]]&IF(Table1[[#This Row],[Value]]=\"\",\"\",\" - \"&Table1[[#This Row],[Value]])","v":"Opedax - O-C/DQ1475"}]
["Opedax","Sub Product 5","U-V/DQ5750",{"$f":"Table1[[#This Row],[Row]]&IF(Table1[[#This Row],[Value]]=\"\",\"\",\" - \"&Table1[[#This Row],[Value]])","v":"Opedax - U-V/DQ5750"}]
["Opedax","Sub Product 6","D-W/DQ9169",{"$f":"Table1[[#This Row],[Row]]&IF(Table1[[#This Row],[Value]]=\"\",\"\",\" - \"&Table1[[#This Row],[Value]])","v":"Opedax - D-W/DQ9169"}]
["Opedax","Sub Product 7","X-U/DQ4908",{"$f":"Table1[[#This Row],[Row]]&IF(Table1[[#This Row],[Value]]=\"\",\"\",\" - \"&Table1[[#This Row],[Value]])","v":"Opedax - X-U/DQ4908"}]
["Touchfresh","Sub Product 1",null,{"$f":"Table1[[#This Row],[Row]]&IF(Table1[[#This Row],[Value]]=\"\",\"\",\" - \"&Table1[[#This Row],[Value]])","v":"Touchfresh"}]
["Touchfresh","Sub Product 2","H-C/DQ4665",{"$f":"Table1[[#This Row],[Row]]&IF(Table1[[#This Row],[Value]]=\"\",\"\",\" - \"&Table1[[#This Row],[Value]])","v":"Touchfresh - H-C/DQ4665"}]
["Touchfresh","Sub Product 3","C-D/DQ6489",{"$f":"Table1[[#This Row],[Row]]&IF(Table1[[#This Row],[Value]]=\"\",\"\",\" - \"&Table1[[#This Row],[Value]])","v":"Touchfresh - C-D/DQ6489"}]
["Touchfresh","Sub Product 4","R-H/DQ7954",{"$f":"Table1[[#This Row],[Row]]&IF(Table1[[#This Row],[Value]]=\"\",\"\",\" - \"&Table1[[#This Row],[Value]])","v":"Touchfresh - R-H/DQ7954"}]
["Touchfresh","Sub Product 5","D-D/DQ1228",{"$f":"Table1[[#This Row],[Row]]&IF(Table1[[#This Row],[Value]]=\"\",\"\",\" - \"&Table1[[#This Row],[Value]])","v":"Touchfresh - D-D/DQ1228"}]
["Touchfresh","Sub Product 6","X-K/DQ6699",{"$f":"Table1[[#This Row],[Row]]&IF(Table1[[#This Row],[Value]]=\"\",\"\",\" - \"&Table1[[#This Row],[Value]])","v":"Touchfresh - X-K/DQ6699"}]
["Touchfresh","Sub Product 7","D-V/DQ9848",{"$f":"Table1[[#This Row],[Row]]&IF(Table1[[#This Row],[Value]]=\"\",\"\",\" - \"&Table1[[#This Row],[Value]])","v":"Touchfresh - D-V/DQ9848"}]
["Inhold","Sub Product 1",null,{"$f":"Table1[[#This Row],[Row]]&IF(Table1[[#This Row],[Value]]=\"\",\"\",\" - \"&Table1[[#This Row],[Value]])","v":"Inhold"}]
["Inhold","Sub Product 2","V-U/DQ3537",{"$f":"Table1[[#This Row],[Row]]&IF(Table1[[#This Row],[Value]]=\"\",\"\",\" - \"&Table1[[#This Row],[Value]])","v":"Inhold - V-U/DQ3537"}]
["Inhold","Sub Product 3","J-U/DQ9185",{"$f":"Table1[[#This Row],[Row]]&IF(Table1[[#This Row],[Value]]=\"\",\"\",\" - \"&Table1[[#This Row],[Value]])","v":"Inhold - J-U/DQ9185"}]
["Inhold","Sub Product 4","Y-X/DQ3832",{"$f":"Table1[[#This Row],[Row]]&IF(Table1[[#This Row],[Value]]=\"\",\"\",\" - \"&Table1[[#This Row],[Value]])","v":"Inhold - Y-X/DQ3832"}]
["Inhold","Sub Product 5","Y-L/DQ3782",{"$f":"Table1[[#This Row],[Row]]&IF(Table1[[#This Row],[Value]]=\"\",\"\",\" - \"&Table1[[#This Row],[Value]])","v":"Inhold - Y-L/DQ3782"}]
["Inhold","Sub Product 6","L-R/DQ2810",{"$f":"Table1[[#This Row],[Row]]&IF(Table1[[#This Row],[Value]]=\"\",\"\",\" - \"&Table1[[#This Row],[Value]])","v":"Inhold - L-R/DQ2810"}]
["Inhold","Sub Product 7","O-M/DQ5259",{"$f":"Table1[[#This Row],[Row]]&IF(Table1[[#This Row],[Value]]=\"\",\"\",\" - \"&Table1[[#This Row],[Value]])","v":"Inhold - O-M/DQ5259"}]
["Saillux","Sub Product 1",null,{"$f":"Table1[[#This Row],[Row]]&IF(Table1[[#This Row],[Value]]=\"\",\"\",\" - \"&Table1[[#This Row],[Value]])","v":"Saillux"}]
["Saillux","Sub Product 2","K-S/DQ7277",{"$f":"Table1[[#This Row],[Row]]&IF(Table1[[#This Row],[Value]]=\"\",\"\",\" - \"&Table1[[#This Row],[Value]])","v":"Saillux - K-S/DQ7277"}]
["Saillux","Sub Product 3","C-S/DQ6120",{"$f":"Table1[[#This Row],[Row]]&IF(Table1[[#This Row],[Value]]=\"\",\"\",\" - \"&Table1[[#This Row],[Value]])","v":"Saillux - C-S/DQ6120"}]
["Saillux","Sub Product 4","J-Y/DQ3382",{"$f":"Table1[[#This Row],[Row]]&IF(Table1[[#This Row],[Value]]=\"\",\"\",\" - \"&Table1[[#This Row],[Value]])","v":"Saillux - J-Y/DQ3382"}]
["Saillux","Sub Product 5","E-R/DQ2393",{"$f":"Table1[[#This Row],[Row]]&IF(Table1[[#This Row],[Value]]=\"\",\"\",\" - \"&Table1[[#This Row],[Value]])","v":"Saillux - E-R/DQ2393"}]
["Saillux","Sub Product 6","P-M/DQ2704",{"$f":"Table1[[#This Row],[Row]]&IF(Table1[[#This Row],[Value]]=\"\",\"\",\" - \"&Table1[[#This Row],[Value]])","v":"Saillux - P-M/DQ2704"}]
["Saillux","Sub Product 7","C-C/DQ7661",{"$f":"Table1[[#This Row],[Row]]&IF(Table1[[#This Row],[Value]]=\"\",\"\",\" - \"&Table1[[#This Row],[Value]])","v":"Saillux - C-C/DQ7661"}]
["Zenjob","Sub Product 1",null,{"$f":"Table1[[#This Row],[Row]]&IF(Table1[[#This Row],[Value]]=\"\",\"\",\" - \"&Table1[[#This Row],[Value]])","v":"Zenjob"}]
["Zenjob","Sub Product 2","D-O/DQ9424",{"$f":"Table1[[#This Row],[Row]]&IF(Table1[[#This Row],[Value]]=\"\",\"\",\" - \"&Table1[[#This Row],[Value]])","v":"Zenjob - D-O/DQ9424"}]
["Zenjob","Sub Product 3","Z-X/DQ3592",{"$f":"Table1[[#This Row],[Row]]&IF(Table1[[#This Row],[Value]]=\"\",\"\",\" - \"&Table1[[#This Row],[Value]])","v":"Zenjob - Z-X/DQ3592"}]
["Zenjob","Sub Product 4","E-D/DQ7789",{"$f":"Table1[[#This Row],[Row]]&IF(Table1[[#This Row],[Value]]=\"\",\"\",\" - \"&Table1[[#This Row],[Value]])","v":"Zenjob - E-D/DQ7789"}]
["Zenjob","Sub Product 5","A-P/DQ7456",{"$f":"Table1[[#This Row],[Row]]&IF(Table1[[#This Row],[Value]]=\"\",\"\",\" - \"&Table1[[#This Row],[Value]])","v":"Zenjob - A-P/DQ7456"}]
["Zenjob","Sub Product 6","M-R/DQ7298",{"$f":"Table1[[#This Row],[Row]]&IF(Table1[[#This Row],[Value]]=\"\",\"\",\" - \"&Table1[[#This Row],[Value]])","v":"Zenjob - M-R/DQ7298"}]
["Zenjob","Sub Product 7","H-S/DQ3032",{"$f":"Table1[[#This Row],[Row]]&IF(Table1[[#This Row],[Value]]=\"\",\"\",\" - \"&Table1[[#This Row],[Value]])","v":"Zenjob - H-S/DQ3032"}]
["Sum-Home","Sub Product 1",null,{"$f":"Table1[[#This Row],[Row]]&IF(Table1[[#This Row],[Value]]=\"\",\"\",\" - \"&Table1[[#This Row],[Value]])","v":"Sum-Home"}]
["Sum-Home","Sub Product 2","R-Y/DQ1205",{"$f":"Table1[[#This Row],[Row]]&IF(Table1[[#This Row],[Value]]=\"\",\"\",\" - \"&Table1[[#This Row],[Value]])","v":"Sum-Home - R-Y/DQ1205"}]
["Sum-Home","Sub Product 3","H-I/DQ6676",{"$f":"Table1[[#This Row],[Row]]&IF(Table1[[#This Row],[Value]]=\"\",\"\",\" - \"&Table1[[#This Row],[Value]])","v":"Sum-Home - H-I/DQ6676"}]
["Sum-Home","Sub Product 4","T-G/DQ3044",{"$f":"Table1[[#This Row],[Row]]&IF(Table1[[#This Row],[Value]]=\"\",\"\",\" - \"&Table1[[#This Row],[Value]])","v":"Sum-Home - T-G/DQ3044"}]
["Sum-Home","Sub Product 5","V-P/DQ4500",{"$f":"Table1[[#This Row],[Row]]&IF(Table1[[#This Row],[Value]]=\"\",\"\",\" - \"&Table1[[#This Row],[Value]])","v":"Sum-Home - V-P/DQ4500"}]
["Sum-Home","Sub Product 6","M-I/DQ1594",{"$f":"Table1[[#This Row],[Row]]&IF(Table1[[#This Row],[Value]]=\"\",\"\",\" - \"&Table1[[#This Row],[Value]])","v":"Sum-Home - M-I/DQ1594"}]
["Sum-Home","Sub Product 7","X-S/DQ9659",{"$f":"Table1[[#This Row],[Row]]&IF(Table1[[#This Row],[Value]]=\"\",\"\",\" - \"&Table1[[#This Row],[Value]])","v":"Sum-Home - X-S/DQ9659"}]
["Topair","Sub Product 1",null,{"$f":"Table1[[#This Row],[Row]]&IF(Table1[[#This Row],[Value]]=\"\",\"\",\" - \"&Table1[[#This Row],[Value]])","v":"Topair"}]
["Topair","Sub Product 2","G-H/DQ5891",{"$f":"Table1[[#This Row],[Row]]&IF(Table1[[#This Row],[Value]]=\"\",\"\",\" - \"&Table1[[#This Row],[Value]])","v":"Topair - G-H/DQ5891"}]
["Topair","Sub Product 3","B-G/DQ5422",{"$f":"Table1[[#This Row],[Row]]&IF(Table1[[#This Row],[Value]]=\"\",\"\",\" - \"&Table1[[#This Row],[Value]])","v":"Topair - B-G/DQ5422"}]
["Topair","Sub Product 4","A-L/DQ3927",{"$f":"Table1[[#This Row],[Row]]&IF(Table1[[#This Row],[Value]]=\"\",\"\",\" - \"&Table1[[#This Row],[Value]])","v":"Topair - A-L/DQ3927"}]
["Topair","Sub Product 5","F-N/DQ5639",{"$f":"Table1[[#This Row],[Row]]&IF(Table1[[#This Row],[Value]]=\"\",\"\",\" - \"&Table1[[#This Row],[Value]])","v":"Topair - F-N/DQ5639"}]
["Topair","Sub Product 6","S-Y/DQ1460",{"$f":"Table1[[#This Row],[Row]]&IF(Table1[[#This Row],[Value]]=\"\",\"\",\" - \"&Table1[[#This Row],[Value]])","v":"Topair - S-Y/DQ1460"}]
["Topair","Sub Product 7","W-T/DQ2891",{"$f":"Table1[[#This Row],[Row]]&IF(Table1[[#This Row],[Value]]=\"\",\"\",\" - \"&Table1[[#This Row],[Value]])","v":"Topair - W-T/DQ2891"}]
["New Cof","Sub Product 1",null,{"$f":"Table1[[#This Row],[Row]]&IF(Table1[[#This Row],[Value]]=\"\",\"\",\" - \"&Table1[[#This Row],[Value]])","v":"New Cof"}]
["New Cof","Sub Product 2","A-E/DQ8571",{"$f":"Table1[[#This Row],[Row]]&IF(Table1[[#This Row],[Value]]=\"\",\"\",\" - \"&Table1[[#This Row],[Value]])","v":"New Cof - A-E/DQ8571"}]
["New Cof","Sub Product 3","O-B/DQ2118",{"$f":"Table1[[#This Row],[Row]]&IF(Table1[[#This Row],[Value]]=\"\",\"\",\" - \"&Table1[[#This Row],[Value]])","v":"New Cof - O-B/DQ2118"}]
["New Cof","Sub Product 4","S-B/DQ3332",{"$f":"Table1[[#This Row],[Row]]&IF(Table1[[#This Row],[Value]]=\"\",\"\",\" - \"&Table1[[#This Row],[Value]])","v":"New Cof - S-B/DQ3332"}]
["New Cof","Sub Product 5","J-I/DQ4049",{"$f":"Table1[[#This Row],[Row]]&IF(Table1[[#This Row],[Value]]=\"\",\"\",\" - \"&Table1[[#This Row],[Value]])","v":"New Cof - J-I/DQ4049"}]
["New Cof","Sub Product 6","C-D/DQ1103",{"$f":"Table1[[#This Row],[Row]]&IF(Table1[[#This Row],[Value]]=\"\",\"\",\" - \"&Table1[[#This Row],[Value]])","v":"New Cof - C-D/DQ1103"}]
["New Cof","Sub Product 7","Q-Z/DQ3080",{"$f":"Table1[[#This Row],[Row]]&IF(Table1[[#This Row],[Value]]=\"\",\"\",\" - \"&Table1[[#This Row],[Value]])","v":"New Cof - Q-Z/DQ3080"}]
["Silverdom","Sub Product 1",null,{"$f":"Table1[[#This Row],[Row]]&IF(Table1[[#This Row],[Value]]=\"\",\"\",\" - \"&Table1[[#This Row],[Value]])","v":"Silverdom"}]
["Silverdom","Sub Product 2","V-Q/DQ2006",{"$f":"Table1[[#This Row],[Row]]&IF(Table1[[#This Row],[Value]]=\"\",\"\",\" - \"&Table1[[#This Row],[Value]])","v":"Silverdom - V-Q/DQ2006"}]
["Silverdom","Sub Product 3","I-H/DQ3986",{"$f":"Table1[[#This Row],[Row]]&IF(Table1[[#This Row],[Value]]=\"\",\"\",\" - \"&Table1[[#This Row],[Value]])","v":"Silverdom - I-H/DQ3986"}]
["Silverdom","Sub Product 4","S-Y/DQ9987",{"$f":"Table1[[#This Row],[Row]]&IF(Table1[[#This Row],[Value]]=\"\",\"\",\" - \"&Table1[[#This Row],[Value]])","v":"Silverdom - S-Y/DQ9987"}]
["Silverdom","Sub Product 5","K-W/DQ9789",{"$f":"Table1[[#This Row],[Row]]&IF(Table1[[#This Row],[Value]]=\"\",\"\",\" - \"&Table1[[#This Row],[Value]])","v":"Silverdom - K-W/DQ9789"}]
["Silverdom","Sub Product 6","M-V/DQ6609",{"$f":"Table1[[#This Row],[Row]]&IF(Table1[[#This Row],[Value]]=\"\",\"\",\" - \"&Table1[[#This Row],[Value]])","v":"Silverdom - M-V/DQ6609"}]
["Silverdom","Sub Product 7","E-G/DQ1666",{"$f":"Table1[[#This Row],[Row]]&IF(Table1[[#This Row],[Value]]=\"\",\"\",\" - \"&Table1[[#This Row],[Value]])","v":"Silverdom - E-G/DQ1666"}]
["Black Silflex","Sub Product 1",null,{"$f":"Table1[[#This Row],[Row]]&IF(Table1[[#This Row],[Value]]=\"\",\"\",\" - \"&Table1[[#This Row],[Value]])","v":"Black Silflex"}]
["Black Silflex","Sub Product 2","V-T/DQ8139",{"$f":"Table1[[#This Row],[Row]]&IF(Table1[[#This Row],[Value]]=\"\",\"\",\" - \"&Table1[[#This Row],[Value]])","v":"Black Silflex - V-T/DQ8139"}]
["Black Silflex","Sub Product 3","M-U/DQ4261",{"$f":"Table1[[#This Row],[Row]]&IF(Table1[[#This Row],[Value]]=\"\",\"\",\" - \"&Table1[[#This Row],[Value]])","v":"Black Silflex - M-U/DQ4261"}]
["Black Silflex","Sub Product 4","E-M/DQ5191",{"$f":"Table1[[#This Row],[Row]]&IF(Table1[[#This Row],[Value]]=\"\",\"\",\" - \"&Table1[[#This Row],[Value]])","v":"Black Silflex - E-M/DQ5191"}]
["Black Silflex","Sub Product 5","U-T/DQ6381",{"$f":"Table1[[#This Row],[Row]]&IF(Table1[[#This Row],[Value]]=\"\",\"\",\" - \"&Table1[[#This Row],[Value]])","v":"Black Silflex - U-T/DQ6381"}]
["Black Silflex","Sub Product 6","T-V/DQ3190",{"$f":"Table1[[#This Row],[Row]]&IF(Table1[[#This Row],[Value]]=\"\",\"\",\" - \"&Table1[[#This Row],[Value]])","v":"Black Silflex - T-V/DQ3190"}]
["Black Silflex","Sub Product 7","M-I/DQ7893",{"$f":"Table1[[#This Row],[Row]]&IF(Table1[[#This Row],[Value]]=\"\",\"\",\" - \"&Table1[[#This Row],[Value]])","v":"Black Silflex - M-I/DQ7893"}]
["Zentom","Sub Product 1",null,{"$f":"Table1[[#This Row],[Row]]&IF(Table1[[#This Row],[Value]]=\"\",\"\",\" - \"&Table1[[#This Row],[Value]])","v":"Zentom"}]
["Zentom","Sub Product 2","H-O/DQ8291",{"$f":"Table1[[#This Row],[Row]]&IF(Table1[[#This Row],[Value]]=\"\",\"\",\" - \"&Table1[[#This Row],[Value]])","v":"Zentom - H-O/DQ8291"}]
["Zentom","Sub Product 3","U-M/DQ2997",{"$f":"Table1[[#This Row],[Row]]&IF(Table1[[#This Row],[Value]]=\"\",\"\",\" - \"&Table1[[#This Row],[Value]])","v":"Zentom - U-M/DQ2997"}]
["Zentom","Sub Product 4","D-V/DQ2055",{"$f":"Table1[[#This Row],[Row]]&IF(Table1[[#This Row],[Value]]=\"\",\"\",\" - \"&Table1[[#This Row],[Value]])","v":"Zentom - D-V/DQ2055"}]
["Zentom","Sub Product 5","S-F/DQ1630",{"$f":"Table1[[#This Row],[Row]]&IF(Table1[[#This Row],[Value]]=\"\",\"\",\" - \"&Table1[[#This Row],[Value]])","v":"Zentom - S-F/DQ1630"}]
["Zentom","Sub Product 6","E-Y/DQ9811",{"$f":"Table1[[#This Row],[Row]]&IF(Table1[[#This Row],[Value]]=\"\",\"\",\" - \"&Table1[[#This Row],[Value]])","v":"Zentom - E-Y/DQ9811"}]
["Zentom","Sub Product 7","R-D/DQ1916",{"$f":"Table1[[#This Row],[Row]]&IF(Table1[[#This Row],[Value]]=\"\",\"\",\" - \"&Table1[[#This Row],[Value]])","v":"Zentom - R-D/DQ1916"}]
["Antex","Sub Product 1",null,{"$f":"Table1[[#This Row],[Row]]&IF(Table1[[#This Row],[Value]]=\"\",\"\",\" - \"&Table1[[#This Row],[Value]])","v":"Antex"}]
["Antex","Sub Product 2","U-V/DQ8524",{"$f":"Table1[[#This Row],[Row]]&IF(Table1[[#This Row],[Value]]=\"\",\"\",\" - \"&Table1[[#This Row],[Value]])","v":"Antex - U-V/DQ8524"}]
["Antex","Sub Product 3","H-O/DQ2807",{"$f":"Table1[[#This Row],[Row]]&IF(Table1[[#This Row],[Value]]=\"\",\"\",\" - \"&Table1[[#This Row],[Value]])","v":"Antex - H-O/DQ2807"}]
["Antex","Sub Product 4","Y-G/DQ8263",{"$f":"Table1[[#This Row],[Row]]&IF(Table1[[#This Row],[Value]]=\"\",\"\",\" - \"&Table1[[#This Row],[Value]])","v":"Antex - Y-G/DQ8263"}]
["Antex","Sub Product 5","K-X/DQ7690",{"$f":"Table1[[#This Row],[Row]]&IF(Table1[[#This Row],[Value]]=\"\",\"\",\" - \"&Table1[[#This Row],[Value]])","v":"Antex - K-X/DQ7690"}]
["Antex","Sub Product 6","T-F/DQ6604",{"$f":"Table1[[#This Row],[Row]]&IF(Table1[[#This Row],[Value]]=\"\",\"\",\" - \"&Table1[[#This Row],[Value]])","v":"Antex - T-F/DQ6604"}]
["Antex","Sub Product 7","X-M/DQ8067",{"$f":"Table1[[#This Row],[Row]]&IF(Table1[[#This Row],[Value]]=\"\",\"\",\" - \"&Table1[[#This Row],[Value]])","v":"Antex - X-M/DQ8067"}]
["Ranity","Sub Product 1",null,{"$f":"Table1[[#This Row],[Row]]&IF(Table1[[#This Row],[Value]]=\"\",\"\",\" - \"&Table1[[#This Row],[Value]])","v":"Ranity"}]
["Ranity","Sub Product 2","M-W/DQ2718",{"$f":"Table1[[#This Row],[Row]]&IF(Table1[[#This Row],[Value]]=\"\",\"\",\" - \"&Table1[[#This Row],[Value]])","v":"Ranity - M-W/DQ2718"}]
["Ranity","Sub Product 3","D-W/DQ8974",{"$f":"Table1[[#This Row],[Row]]&IF(Table1[[#This Row],[Value]]=\"\",\"\",\" - \"&Table1[[#This Row],[Value]])","v":"Ranity - D-W/DQ8974"}]
["Ranity","Sub Product 4","I-F/DQ8856",{"$f":"Table1[[#This Row],[Row]]&IF(Table1[[#This Row],[Value]]=\"\",\"\",\" - \"&Table1[[#This Row],[Value]])","v":"Ranity - I-F/DQ8856"}]
["Ranity","Sub Product 5","E-P/DQ3003",{"$f":"Table1[[#This Row],[Row]]&IF(Table1[[#This Row],[Value]]=\"\",\"\",\" - \"&Table1[[#This Row],[Value]])","v":"Ranity - E-P/DQ3003"}]
["Ranity","Sub Product 6","P-J/DQ5975",{"$f":"Table1[[#This Row],[Row]]&IF(Table1[[#This Row],[Value]]=\"\",\"\",\" - \"&Table1[[#This Row],[Value]])","v":"Ranity - P-J/DQ5975"}]
["Ranity","Sub Product 7","A-Y/DQ1109",{"$f":"Table1[[#This Row],[Row]]&IF(Table1[[#This Row],[Value]]=\"\",\"\",\" - \"&Table1[[#This Row],[Value]])","v":"Ranity - A-Y/DQ1109"}]
["S-kix","Sub Product 1",null,{"$f":"Table1[[#This Row],[Row]]&IF(Table1[[#This Row],[Value]]=\"\",\"\",\" - \"&Table1[[#This Row],[Value]])","v":"S-kix"}]
["S-kix","Sub Product 2","K-G/DQ2749",{"$f":"Table1[[#This Row],[Row]]&IF(Table1[[#This Row],[Value]]=\"\",\"\",\" - \"&Table1[[#This Row],[Value]])","v":"S-kix - K-G/DQ2749"}]
["S-kix","Sub Product 3","P-J/DQ4709",{"$f":"Table1[[#This Row],[Row]]&IF(Table1[[#This Row],[Value]]=\"\",\"\",\" - \"&Table1[[#This Row],[Value]])","v":"S-kix - P-J/DQ4709"}]
["S-kix","Sub Product 4","N-X/DQ2600",{"$f":"Table1[[#This Row],[Row]]&IF(Table1[[#This Row],[Value]]=\"\",\"\",\" - \"&Table1[[#This Row],[Value]])","v":"S-kix - N-X/DQ2600"}]
["S-kix","Sub Product 5","B-T/DQ9604",{"$f":"Table1[[#This Row],[Row]]&IF(Table1[[#This Row],[Value]]=\"\",\"\",\" - \"&Table1[[#This Row],[Value]])","v":"S-kix - B-T/DQ9604"}]
["S-kix","Sub Product 6","R-W/DQ6294",{"$f":"Table1[[#This Row],[Row]]&IF(Table1[[#This Row],[Value]]=\"\",\"\",\" - \"&Table1[[#This Row],[Value]])","v":"S-kix - R-W/DQ6294"}]
["S-kix","Sub Product 7","O-U/DQ2096",{"$f":"Table1[[#This Row],[Row]]&IF(Table1[[#This Row],[Value]]=\"\",\"\",\" - \"&Table1[[#This Row],[Value]])","v":"S-kix - O-U/DQ2096"}]
["Zath-Lex","Sub Product 1",null,{"$f":"Table1[[#This Row],[Row]]&IF(Table1[[#This Row],[Value]]=\"\",\"\",\" - \"&Table1[[#This Row],[Value]])","v":"Zath-Lex"}]
["Zath-Lex","Sub Product 2","M-X/DQ6178",{"$f":"Table1[[#This Row],[Row]]&IF(Table1[[#This Row],[Value]]=\"\",\"\",\" - \"&Table1[[#This Row],[Value]])","v":"Zath-Lex - M-X/DQ6178"}]
["Zath-Lex","Sub Product 3","C-U/DQ1618",{"$f":"Table1[[#This Row],[Row]]&IF(Table1[[#This Row],[Value]]=\"\",\"\",\" - \"&Table1[[#This Row],[Value]])","v":"Zath-Lex - C-U/DQ1618"}]
["Zath-Lex","Sub Product 4","O-P/DQ3023",{"$f":"Table1[[#This Row],[Row]]&IF(Table1[[#This Row],[Value]]=\"\",\"\",\" - \"&Table1[[#This Row],[Value]])","v":"Zath-Lex - O-P/DQ3023"}]
["Zath-Lex","Sub Product 5","S-T/DQ8619",{"$f":"Table1[[#This Row],[Row]]&IF(Table1[[#This Row],[Value]]=\"\",\"\",\" - \"&Table1[[#This Row],[Value]])","v":"Zath-Lex - S-T/DQ8619"}]
["Zath-Lex","Sub Product 6","V-O/DQ9170",{"$f":"Table1[[#This Row],[Row]]&IF(Table1[[#This Row],[Value]]=\"\",\"\",\" - \"&Table1[[#This Row],[Value]])","v":"Zath-Lex - V-O/DQ9170"}]
["Zath-Lex","Sub Product 7","P-J/DQ3470",{"$f":"Table1[[#This Row],[Row]]&IF(Table1[[#This Row],[Value]]=\"\",\"\",\" - \"&Table1[[#This Row],[Value]])","v":"Zath-Lex - P-J/DQ3470"}]
["Tin Tam","Sub Product 1",null,{"$f":"Table1[[#This Row],[Row]]&IF(Table1[[#This Row],[Value]]=\"\",\"\",\" - \"&Table1[[#This Row],[Value]])","v":"Tin Tam"}]
["Tin Tam","Sub Product 2","V-E/DQ3168",{"$f":"Table1[[#This Row],[Row]]&IF(Table1[[#This Row],[Value]]=\"\",\"\",\" - \"&Table1[[#This Row],[Value]])","v":"Tin Tam - V-E/DQ3168"}]
["Tin Tam","Sub Product 3","X-O/DQ7726",{"$f":"Table1[[#This Row],[Row]]&IF(Table1[[#This Row],[Value]]=\"\",\"\",\" - \"&Table1[[#This Row],[Value]])","v":"Tin Tam - X-O/DQ7726"}]
["Tin Tam","Sub Product 4","K-Q/DQ3777",{"$f":"Table1[[#This Row],[Row]]&IF(Table1[[#This Row],[Value]]=\"\",\"\",\" - \"&Table1[[#This Row],[Value]])","v":"Tin Tam - K-Q/DQ3777"}]
["Tin Tam","Sub Product 5","G-C/DQ5626",{"$f":"Table1[[#This Row],[Row]]&IF(Table1[[#This Row],[Value]]=\"\",\"\",\" - \"&Table1[[#This Row],[Value]])","v":"Tin Tam - G-C/DQ5626"}]
["Tin Tam","Sub Product 6","S-D/DQ7723",{"$f":"Table1[[#This Row],[Row]]&IF(Table1[[#This Row],[Value]]=\"\",\"\",\" - \"&Table1[[#This Row],[Value]])","v":"Tin Tam - S-D/DQ7723"}]
["Tin Tam","Sub Product 7","R-X/DQ8582",{"$f":"Table1[[#This Row],[Row]]&IF(Table1[[#This Row],[Value]]=\"\",\"\",\" - \"&Table1[[#This Row],[Value]])","v":"Tin Tam - R-X/DQ8582"}]
["Home-Fix","Sub Product 1",null,{"$f":"Table1[[#This Row],[Row]]&IF(Table1[[#This Row],[Value]]=\"\",\"\",\" - \"&Table1[[#This Row],[Value]])","v":"Home-Fix"}]
["Home-Fix","Sub Product 2","V-K/DQ4188",{"$f":"Table1[[#This Row],[Row]]&IF(Table1[[#This Row],[Value]]=\"\",\"\",\" - \"&Table1[[#This Row],[Value]])","v":"Home-Fix - V-K/DQ4188"}]
["Home-Fix","Sub Product 3","W-D/DQ9139",{"$f":"Table1[[#This Row],[Row]]&IF(Table1[[#This Row],[Value]]=\"\",\"\",\" - \"&Table1[[#This Row],[Value]])","v":"Home-Fix - W-D/DQ9139"}]
["Home-Fix","Sub Product 4","S-W/DQ7140",{"$f":"Table1[[#This Row],[Row]]&IF(Table1[[#This Row],[Value]]=\"\",\"\",\" - \"&Table1[[#This Row],[Value]])","v":"Home-Fix - S-W/DQ7140"}]
["Home-Fix","Sub Product 5","G-J/DQ2389",{"$f":"Table1[[#This Row],[Row]]&IF(Table1[[#This Row],[Value]]=\"\",\"\",\" - \"&Table1[[#This Row],[Value]])","v":"Home-Fix - G-J/DQ2389"}]
["Home-Fix","Sub Product 6","L-J/DQ9015",{"$f":"Table1[[#This Row],[Row]]&IF(Table1[[#This Row],[Value]]=\"\",\"\",\" - \"&Table1[[#This Row],[Value]])","v":"Home-Fix - L-J/DQ9015"}]
["Home-Fix","Sub Product 7","D-D/DQ9127",{"$f":"Table1[[#This Row],[Row]]&IF(Table1[[#This Row],[Value]]=\"\",\"\",\" - \"&Table1[[#This Row],[Value]])","v":"Home-Fix - D-D/DQ9127"}]
["Strongtax","Sub Product 1",null,{"$f":"Table1[[#This Row],[Row]]&IF(Table1[[#This Row],[Value]]=\"\",\"\",\" - \"&Table1[[#This Row],[Value]])","v":"Strongtax"}]
["Strongtax","Sub Product 2","C-B/DQ7246",{"$f":"Table1[[#This Row],[Row]]&IF(Table1[[#This Row],[Value]]=\"\",\"\",\" - \"&Table1[[#This Row],[Value]])","v":"Strongtax - C-B/DQ7246"}]
["Strongtax","Sub Product 3","S-Z/DQ9931",{"$f":"Table1[[#This Row],[Row]]&IF(Table1[[#This Row],[Value]]=\"\",\"\",\" - \"&Table1[[#This Row],[Value]])","v":"Strongtax - S-Z/DQ9931"}]
["Strongtax","Sub Product 4","I-U/DQ6209",{"$f":"Table1[[#This Row],[Row]]&IF(Table1[[#This Row],[Value]]=\"\",\"\",\" - \"&Table1[[#This Row],[Value]])","v":"Strongtax - I-U/DQ6209"}]
["Strongtax","Sub Product 5","R-D/DQ7972",{"$f":"Table1[[#This Row],[Row]]&IF(Table1[[#This Row],[Value]]=\"\",\"\",\" - \"&Table1[[#This Row],[Value]])","v":"Strongtax - R-D/DQ7972"}]
["Strongtax","Sub Product 6","C-N/DQ7927",{"$f":"Table1[[#This Row],[Row]]&IF(Table1[[#This Row],[Value]]=\"\",\"\",\" - \"&Table1[[#This Row],[Value]])","v":"Strongtax - C-N/DQ7927"}]
["Strongtax","Sub Product 7","J-I/DQ6121",{"$f":"Table1[[#This Row],[Row]]&IF(Table1[[#This Row],[Value]]=\"\",\"\",\" - \"&Table1[[#This Row],[Value]])","v":"Strongtax - J-I/DQ6121"}]
["Scottrax","Sub Product 1",null,{"$f":"Table1[[#This Row],[Row]]&IF(Table1[[#This Row],[Value]]=\"\",\"\",\" - \"&Table1[[#This Row],[Value]])","v":"Scottrax"}]
["Scottrax","Sub Product 2","V-B/DQ7247",{"$f":"Table1[[#This Row],[Row]]&IF(Table1[[#This Row],[Value]]=\"\",\"\",\" - \"&Table1[[#This Row],[Value]])","v":"Scottrax - V-B/DQ7247"}]
["Scottrax","Sub Product 3","R-B/DQ5325",{"$f":"Table1[[#This Row],[Row]]&IF(Table1[[#This Row],[Value]]=\"\",\"\",\" - \"&Table1[[#This Row],[Value]])","v":"Scottrax - R-B/DQ5325"}]
["Scottrax","Sub Product 4","Y-I/DQ1428",{"$f":"Table1[[#This Row],[Row]]&IF(Table1[[#This Row],[Value]]=\"\",\"\",\" - \"&Table1[[#This Row],[Value]])","v":"Scottrax - Y-I/DQ1428"}]
["Scottrax","Sub Product 5","R-P/DQ3760",{"$f":"Table1[[#This Row],[Row]]&IF(Table1[[#This Row],[Value]]=\"\",\"\",\" - \"&Table1[[#This Row],[Value]])","v":"Scottrax - R-P/DQ3760"}]
["Scottrax","Sub Product 6","M-X/DQ6435",{"$f":"Table1[[#This Row],[Row]]&IF(Table1[[#This Row],[Value]]=\"\",\"\",\" - \"&Table1[[#This Row],[Value]])","v":"Scottrax - M-X/DQ6435"}]
["Scottrax","Sub Product 7","U-O/DQ2357",{"$f":"Table1[[#This Row],[Row]]&IF(Table1[[#This Row],[Value]]=\"\",\"\",\" - \"&Table1[[#This Row],[Value]])","v":"Scottrax - U-O/DQ2357"}]
["Home Ron","Sub Product 1",null,{"$f":"Table1[[#This Row],[Row]]&IF(Table1[[#This Row],[Value]]=\"\",\"\",\" - \"&Table1[[#This Row],[Value]])","v":"Home Ron"}]
["Home Ron","Sub Product 2","W-Q/DQ8964",{"$f":"Table1[[#This Row],[Row]]&IF(Table1[[#This Row],[Value]]=\"\",\"\",\" - \"&Table1[[#This Row],[Value]])","v":"Home Ron - W-Q/DQ8964"}]
["Home Ron","Sub Product 3","B-X/DQ4767",{"$f":"Table1[[#This Row],[Row]]&IF(Table1[[#This Row],[Value]]=\"\",\"\",\" - \"&Table1[[#This Row],[Value]])","v":"Home Ron - B-X/DQ4767"}]
["Home Ron","Sub Product 4","A-V/DQ6228",{"$f":"Table1[[#This Row],[Row]]&IF(Table1[[#This Row],[Value]]=\"\",\"\",\" - \"&Table1[[#This Row],[Value]])","v":"Home Ron - A-V/DQ6228"}]
["Home Ron","Sub Product 5","I-T/DQ7745",{"$f":"Table1[[#This Row],[Row]]&IF(Table1[[#This Row],[Value]]=\"\",\"\",\" - \"&Table1[[#This Row],[Value]])","v":"Home Ron - I-T/DQ7745"}]
["Home Ron","Sub Product 6","R-L/DQ1239",{"$f":"Table1[[#This Row],[Row]]&IF(Table1[[#This Row],[Value]]=\"\",\"\",\" - \"&Table1[[#This Row],[Value]])","v":"Home Ron - R-L/DQ1239"}]
["Home Ron","Sub Product 7","Z-L/DQ1190",{"$f":"Table1[[#This Row],[Row]]&IF(Table1[[#This Row],[Value]]=\"\",\"\",\" - \"&Table1[[#This Row],[Value]])","v":"Home Ron - Z-L/DQ1190"}]
["Mathtip","Sub Product 1",null,{"$f":"Table1[[#This Row],[Row]]&IF(Table1[[#This Row],[Value]]=\"\",\"\",\" - \"&Table1[[#This Row],[Value]])","v":"Mathtip"}]
["Mathtip","Sub Product 2","Q-Z/DQ9353",{"$f":"Table1[[#This Row],[Row]]&IF(Table1[[#This Row],[Value]]=\"\",\"\",\" - \"&Table1[[#This Row],[Value]])","v":"Mathtip - Q-Z/DQ9353"}]
["Mathtip","Sub Product 3","U-E/DQ3079",{"$f":"Table1[[#This Row],[Row]]&IF(Table1[[#This Row],[Value]]=\"\",\"\",\" - \"&Table1[[#This Row],[Value]])","v":"Mathtip - U-E/DQ3079"}]
["Mathtip","Sub Product 4","U-C/DQ9253",{"$f":"Table1[[#This Row],[Row]]&IF(Table1[[#This Row],[Value]]=\"\",\"\",\" - \"&Table1[[#This Row],[Value]])","v":"Mathtip - U-C/DQ9253"}]
["Mathtip","Sub Product 5","U-I/DQ9502",{"$f":"Table1[[#This Row],[Row]]&IF(Table1[[#This Row],[Value]]=\"\",\"\",\" - \"&Table1[[#This Row],[Value]])","v":"Mathtip - U-I/DQ9502"}]
["Mathtip","Sub Product 6","A-Z/DQ1514",{"$f":"Table1[[#This Row],[Row]]&IF(Table1[[#This Row],[Value]]=\"\",\"\",\" - \"&Table1[[#This Row],[Value]])","v":"Mathtip - A-Z/DQ1514"}]
["Mathtip","Sub Product 7","F-H/DQ4922",{"$f":"Table1[[#This Row],[Row]]&IF(Table1[[#This Row],[Value]]=\"\",\"\",\" - \"&Table1[[#This Row],[Value]])","v":"Mathtip - F-H/DQ4922"}]
["Quad Joytax","Sub Product 1",null,{"$f":"Table1[[#This Row],[Row]]&IF(Table1[[#This Row],[Value]]=\"\",\"\",\" - \"&Table1[[#This Row],[Value]])","v":"Quad Joytax"}]
["Quad Joytax","Sub Product 2","U-G/DQ9961",{"$f":"Table1[[#This Row],[Row]]&IF(Table1[[#This Row],[Value]]=\"\",\"\",\" - \"&Table1[[#This Row],[Value]])","v":"Quad Joytax - U-G/DQ9961"}]
["Quad Joytax","Sub Product 3","O-N/DQ4189",{"$f":"Table1[[#This Row],[Row]]&IF(Table1[[#This Row],[Value]]=\"\",\"\",\" - \"&Table1[[#This Row],[Value]])","v":"Quad Joytax - O-N/DQ4189"}]
["Quad Joytax","Sub Product 4","R-C/DQ7978",{"$f":"Table1[[#This Row],[Row]]&IF(Table1[[#This Row],[Value]]=\"\",\"\",\" - \"&Table1[[#This Row],[Value]])","v":"Quad Joytax - R-C/DQ7978"}]
["Quad Joytax","Sub Product 5","X-B/DQ4884",{"$f":"Table1[[#This Row],[Row]]&IF(Table1[[#This Row],[Value]]=\"\",\"\",\" - \"&Table1[[#This Row],[Value]])","v":"Quad Joytax - X-B/DQ4884"}]
["Quad Joytax","Sub Product 6","V-P/DQ6114",{"$f":"Table1[[#This Row],[Row]]&IF(Table1[[#This Row],[Value]]=\"\",\"\",\" - \"&Table1[[#This Row],[Value]])","v":"Quad Joytax - V-P/DQ6114"}]
["Quad Joytax","Sub Product 7","P-B/DQ6522",{"$f":"Table1[[#This Row],[Row]]&IF(Table1[[#This Row],[Value]]=\"\",\"\",\" - \"&Table1[[#This Row],[Value]])","v":"Quad Joytax - P-B/DQ6522"}]
["Quotejob","Sub Product 1",null,{"$f":"Table1[[#This Row],[Row]]&IF(Table1[[#This Row],[Value]]=\"\",\"\",\" - \"&Table1[[#This Row],[Value]])","v":"Quotejob"}]
["Quotejob","Sub Product 2","A-L/DQ2468",{"$f":"Table1[[#This Row],[Row]]&IF(Table1[[#This Row],[Value]]=\"\",\"\",\" - \"&Table1[[#This Row],[Value]])","v":"Quotejob - A-L/DQ2468"}]
["Quotejob","Sub Product 3","G-J/DQ5678",{"$f":"Table1[[#This Row],[Row]]&IF(Table1[[#This Row],[Value]]=\"\",\"\",\" - \"&Table1[[#This Row],[Value]])","v":"Quotejob - G-J/DQ5678"}]
["Quotejob","Sub Product 4","H-P/DQ9164",{"$f":"Table1[[#This Row],[Row]]&IF(Table1[[#This Row],[Value]]=\"\",\"\",\" - \"&Table1[[#This Row],[Value]])","v":"Quotejob - H-P/DQ9164"}]
["Quotejob","Sub Product 5","C-G/DQ5033",{"$f":"Table1[[#This Row],[Row]]&IF(Table1[[#This Row],[Value]]=\"\",\"\",\" - \"&Table1[[#This Row],[Value]])","v":"Quotejob - C-G/DQ5033"}]
["Quotejob","Sub Product 6","H-E/DQ7018",{"$f":"Table1[[#This Row],[Row]]&IF(Table1[[#This Row],[Value]]=\"\",\"\",\" - \"&Table1[[#This Row],[Value]])","v":"Quotejob - H-E/DQ7018"}]
["Quotejob","Sub Product 7","X-Z/DQ7564",{"$f":"Table1[[#This Row],[Row]]&IF(Table1[[#This Row],[Value]]=\"\",\"\",\" - \"&Table1[[#This Row],[Value]])","v":"Quotejob - X-Z/DQ7564"}]
["Zen Strong","Sub Product 1",null,{"$f":"Table1[[#This Row],[Row]]&IF(Table1[[#This Row],[Value]]=\"\",\"\",\" - \"&Table1[[#This Row],[Value]])","v":"Zen Strong"}]
["Zen Strong","Sub Product 2","B-N/DQ7372",{"$f":"Table1[[#This Row],[Row]]&IF(Table1[[#This Row],[Value]]=\"\",\"\",\" - \"&Table1[[#This Row],[Value]])","v":"Zen Strong - B-N/DQ7372"}]
["Zen Strong","Sub Product 3","C-E/DQ2712",{"$f":"Table1[[#This Row],[Row]]&IF(Table1[[#This Row],[Value]]=\"\",\"\",\" - \"&Table1[[#This Row],[Value]])","v":"Zen Strong - C-E/DQ2712"}]
["Zen Strong","Sub Product 4","W-Y/DQ2767",{"$f":"Table1[[#This Row],[Row]]&IF(Table1[[#This Row],[Value]]=\"\",\"\",\" - \"&Table1[[#This Row],[Value]])","v":"Zen Strong - W-Y/DQ2767"}]
["Zen Strong","Sub Product 5","Q-K/DQ8866",{"$f":"Table1[[#This Row],[Row]]&IF(Table1[[#This Row],[Value]]=\"\",\"\",\" - \"&Table1[[#This Row],[Value]])","v":"Zen Strong - Q-K/DQ8866"}]
["Zen Strong","Sub Product 6","H-Y/DQ3836",{"$f":"Table1[[#This Row],[Row]]&IF(Table1[[#This Row],[Value]]=\"\",\"\",\" - \"&Table1[[#This Row],[Value]])","v":"Zen Strong - H-Y/DQ3836"}]
["Zen Strong","Sub Product 7","K-I/DQ2152",{"$f":"Table1[[#This Row],[Row]]&IF(Table1[[#This Row],[Value]]=\"\",\"\",\" - \"&Table1[[#This Row],[Value]])","v":"Zen Strong - K-I/DQ2152"}]
["Stock Touch","Sub Product 1",null,{"$f":"Table1[[#This Row],[Row]]&IF(Table1[[#This Row],[Value]]=\"\",\"\",\" - \"&Table1[[#This Row],[Value]])","v":"Stock Touch"}]
["Stock Touch","Sub Product 2","V-B/DQ6141",{"$f":"Table1[[#This Row],[Row]]&IF(Table1[[#This Row],[Value]]=\"\",\"\",\" - \"&Table1[[#This Row],[Value]])","v":"Stock Touch - V-B/DQ6141"}]
["Stock Touch","Sub Product 3","F-K/DQ9978",{"$f":"Table1[[#This Row],[Row]]&IF(Table1[[#This Row],[Value]]=\"\",\"\",\" - \"&Table1[[#This Row],[Value]])","v":"Stock Touch - F-K/DQ9978"}]
["Stock Touch","Sub Product 4","G-T/DQ4323",{"$f":"Table1[[#This Row],[Row]]&IF(Table1[[#This Row],[Value]]=\"\",\"\",\" - \"&Table1[[#This Row],[Value]])","v":"Stock Touch - G-T/DQ4323"}]
["Stock Touch","Sub Product 5","E-G/DQ1291",{"$f":"Table1[[#This Row],[Row]]&IF(Table1[[#This Row],[Value]]=\"\",\"\",\" - \"&Table1[[#This Row],[Value]])","v":"Stock Touch - E-G/DQ1291"}]
["Stock Touch","Sub Product 6","Q-N/DQ9494",{"$f":"Table1[[#This Row],[Row]]&IF(Table1[[#This Row],[Value]]=\"\",\"\",\" - \"&Table1[[#This Row],[Value]])","v":"Stock Touch - Q-N/DQ9494"}]
["Stock Touch","Sub Product 7","X-A/DQ3304",{"$f":"Table1[[#This Row],[Row]]&IF(Table1[[#This Row],[Value]]=\"\",\"\",\" - \"&Table1[[#This Row],[Value]])","v":"Stock Touch - X-A/DQ3304"}]
["Stockdox","Sub Product 1",null,{"$f":"Table1[[#This Row],[Row]]&IF(Table1[[#This Row],[Value]]=\"\",\"\",\" - \"&Table1[[#This Row],[Value]])","v":"Stockdox"}]
["Stockdox","Sub Product 2","G-J/DQ1262",{"$f":"Table1[[#This Row],[Row]]&IF(Table1[[#This Row],[Value]]=\"\",\"\",\" - \"&Table1[[#This Row],[Value]])","v":"Stockdox - G-J/DQ1262"}]
["Stockdox","Sub Product 3","M-E/DQ9467",{"$f":"Table1[[#This Row],[Row]]&IF(Table1[[#This Row],[Value]]=\"\",\"\",\" - \"&Table1[[#This Row],[Value]])","v":"Stockdox - M-E/DQ9467"}]
["Stockdox","Sub Product 4","T-M/DQ6911",{"$f":"Table1[[#This Row],[Row]]&IF(Table1[[#This Row],[Value]]=\"\",\"\",\" - \"&Table1[[#This Row],[Value]])","v":"Stockdox - T-M/DQ6911"}]
["Stockdox","Sub Product 5","V-W/DQ3008",{"$f":"Table1[[#This Row],[Row]]&IF(Table1[[#This Row],[Value]]=\"\",\"\",\" - \"&Table1[[#This Row],[Value]])","v":"Stockdox - V-W/DQ3008"}]
["Stockdox","Sub Product 6","J-Q/DQ4683",{"$f":"Table1[[#This Row],[Row]]&IF(Table1[[#This Row],[Value]]=\"\",\"\",\" - \"&Table1[[#This Row],[Value]])","v":"Stockdox - J-Q/DQ4683"}]
["Stockdox","Sub Product 7","W-D/DQ1503",{"$f":"Table1[[#This Row],[Row]]&IF(Table1[[#This Row],[Value]]=\"\",\"\",\" - \"&Table1[[#This Row],[Value]])","v":"Stockdox - W-D/DQ1503"}]
["Y- Lax","Sub Product 1",null,{"$f":"Table1[[#This Row],[Row]]&IF(Table1[[#This Row],[Value]]=\"\",\"\",\" - \"&Table1[[#This Row],[Value]])","v":"Y- Lax"}]
["Y- Lax","Sub Product 2","L-W/DQ7254",{"$f":"Table1[[#This Row],[Row]]&IF(Table1[[#This Row],[Value]]=\"\",\"\",\" - \"&Table1[[#This Row],[Value]])","v":"Y- Lax - L-W/DQ7254"}]
["Y- Lax","Sub Product 3","S-I/DQ5658",{"$f":"Table1[[#This Row],[Row]]&IF(Table1[[#This Row],[Value]]=\"\",\"\",\" - \"&Table1[[#This Row],[Value]])","v":"Y- Lax - S-I/DQ5658"}]
["Y- Lax","Sub Product 4","V-Z/DQ8574",{"$f":"Table1[[#This Row],[Row]]&IF(Table1[[#This Row],[Value]]=\"\",\"\",\" - \"&Table1[[#This Row],[Value]])","v":"Y- Lax - V-Z/DQ8574"}]
["Y- Lax","Sub Product 5","A-L/DQ9394",{"$f":"Table1[[#This Row],[Row]]&IF(Table1[[#This Row],[Value]]=\"\",\"\",\" - \"&Table1[[#This Row],[Value]])","v":"Y- Lax - A-L/DQ9394"}]
["Y- Lax","Sub Product 6","I-O/DQ2393",{"$f":"Table1[[#This Row],[Row]]&IF(Table1[[#This Row],[Value]]=\"\",\"\",\" - \"&Table1[[#This Row],[Value]])","v":"Y- Lax - I-O/DQ2393"}]
["Y- Lax","Sub Product 7","E-U/DQ4627",{"$f":"Table1[[#This Row],[Row]]&IF(Table1[[#This Row],[Value]]=\"\",\"\",\" - \"&Table1[[#This Row],[Value]])","v":"Y- Lax - E-U/DQ4627"}]
["Duolux","Sub Product 1",null,{"$f":"Table1[[#This Row],[Row]]&IF(Table1[[#This Row],[Value]]=\"\",\"\",\" - \"&Table1[[#This Row],[Value]])","v":"Duolux"}]
["Duolux","Sub Product 2","W-H/DQ3557",{"$f":"Table1[[#This Row],[Row]]&IF(Table1[[#This Row],[Value]]=\"\",\"\",\" - \"&Table1[[#This Row],[Value]])","v":"Duolux - W-H/DQ3557"}]
["Duolux","Sub Product 3","N-L/DQ2999",{"$f":"Table1[[#This Row],[Row]]&IF(Table1[[#This Row],[Value]]=\"\",\"\",\" - \"&Table1[[#This Row],[Value]])","v":"Duolux - N-L/DQ2999"}]
["Duolux","Sub Product 4","F-C/DQ1983",{"$f":"Table1[[#This Row],[Row]]&IF(Table1[[#This Row],[Value]]=\"\",\"\",\" - \"&Table1[[#This Row],[Value]])","v":"Duolux - F-C/DQ1983"}]
["Duolux","Sub Product 5","X-Q/DQ9087",{"$f":"Table1[[#This Row],[Row]]&IF(Table1[[#This Row],[Value]]=\"\",\"\",\" - \"&Table1[[#This Row],[Value]])","v":"Duolux - X-Q/DQ9087"}]
["Duolux","Sub Product 6","J-X/DQ8959",{"$f":"Table1[[#This Row],[Row]]&IF(Table1[[#This Row],[Value]]=\"\",\"\",\" - \"&Table1[[#This Row],[Value]])","v":"Duolux - J-X/DQ8959"}]
["Duolux","Sub Product 7","Z-V/DQ3936",{"$f":"Table1[[#This Row],[Row]]&IF(Table1[[#This Row],[Value]]=\"\",\"\",\" - \"&Table1[[#This Row],[Value]])","v":"Duolux - Z-V/DQ3936"}]
["Biofresh","Sub Product 1",null,{"$f":"Table1[[#This Row],[Row]]&IF(Table1[[#This Row],[Value]]=\"\",\"\",\" - \"&Table1[[#This Row],[Value]])","v":"Biofresh"}]
["Biofresh","Sub Product 2","L-A/DQ6923",{"$f":"Table1[[#This Row],[Row]]&IF(Table1[[#This Row],[Value]]=\"\",\"\",\" - \"&Table1[[#This Row],[Value]])","v":"Biofresh - L-A/DQ6923"}]
["Biofresh","Sub Product 3","U-X/DQ7740",{"$f":"Table1[[#This Row],[Row]]&IF(Table1[[#This Row],[Value]]=\"\",\"\",\" - \"&Table1[[#This Row],[Value]])","v":"Biofresh - U-X/DQ7740"}]
["Biofresh","Sub Product 4","H-S/DQ8103",{"$f":"Table1[[#This Row],[Row]]&IF(Table1[[#This Row],[Value]]=\"\",\"\",\" - \"&Table1[[#This Row],[Value]])","v":"Biofresh - H-S/DQ8103"}]
["Biofresh","Sub Product 5","C-E/DQ2233",{"$f":"Table1[[#This Row],[Row]]&IF(Table1[[#This Row],[Value]]=\"\",\"\",\" - \"&Table1[[#This Row],[Value]])","v":"Biofresh - C-E/DQ2233"}]
["Biofresh","Sub Product 6","O-I/DQ5625",{"$f":"Table1[[#This Row],[Row]]&IF(Table1[[#This Row],[Value]]=\"\",\"\",\" - \"&Table1[[#This Row],[Value]])","v":"Biofresh - O-I/DQ5625"}]
["Biofresh","Sub Product 7","F-G/DQ6422",{"$f":"Table1[[#This Row],[Row]]&IF(Table1[[#This Row],[Value]]=\"\",\"\",\" - \"&Table1[[#This Row],[Value]])","v":"Biofresh - F-G/DQ6422"}]
["Lam-Find","Sub Product 1",null,{"$f":"Table1[[#This Row],[Row]]&IF(Table1[[#This Row],[Value]]=\"\",\"\",\" - \"&Table1[[#This Row],[Value]])","v":"Lam-Find"}]
["Lam-Find","Sub Product 2","L-B/DQ6600",{"$f":"Table1[[#This Row],[Row]]&IF(Table1[[#This Row],[Value]]=\"\",\"\",\" - \"&Table1[[#This Row],[Value]])","v":"Lam-Find - L-B/DQ6600"}]
["Lam-Find","Sub Product 3","J-J/DQ6636",{"$f":"Table1[[#This Row],[Row]]&IF(Table1[[#This Row],[Value]]=\"\",\"\",\" - \"&Table1[[#This Row],[Value]])","v":"Lam-Find - J-J/DQ6636"}]
["Lam-Find","Sub Product 4","T-F/DQ7235",{"$f":"Table1[[#This Row],[Row]]&IF(Table1[[#This Row],[Value]]=\"\",\"\",\" - \"&Table1[[#This Row],[Value]])","v":"Lam-Find - T-F/DQ7235"}]
["Lam-Find","Sub Product 5","L-E/DQ5363",{"$f":"Table1[[#This Row],[Row]]&IF(Table1[[#This Row],[Value]]=\"\",\"\",\" - \"&Table1[[#This Row],[Value]])","v":"Lam-Find - L-E/DQ5363"}]
["Lam-Find","Sub Product 6","S-C/DQ9729",{"$f":"Table1[[#This Row],[Row]]&IF(Table1[[#This Row],[Value]]=\"\",\"\",\" - \"&Table1[[#This Row],[Value]])","v":"Lam-Find - S-C/DQ9729"}]
["Lam-Find","Sub Product 7","K-U/DQ6401",{"$f":"Table1[[#This Row],[Row]]&IF(Table1[[#This Row],[Value]]=\"\",\"\",\" - \"&Table1[[#This Row],[Value]])","v":"Lam-Find - K-U/DQ6401"}]
["Sanlam","Sub Product 1",null,{"$f":"Table1[[#This Row],[Row]]&IF(Table1[[#This Row],[Value]]=\"\",\"\",\" - \"&Table1[[#This Row],[Value]])","v":"Sanlam"}]
["Sanlam","Sub Product 2","U-G/DQ2593",{"$f":"Table1[[#This Row],[Row]]&IF(Table1[[#This Row],[Value]]=\"\",\"\",\" - \"&Table1[[#This Row],[Value]])","v":"Sanlam - U-G/DQ2593"}]
["Sanlam","Sub Product 3","I-N/DQ8908",{"$f":"Table1[[#This Row],[Row]]&IF(Table1[[#This Row],[Value]]=\"\",\"\",\" - \"&Table1[[#This Row],[Value]])","v":"Sanlam - I-N/DQ8908"}]
["Sanlam","Sub Product 4","N-K/DQ7667",{"$f":"Table1[[#This Row],[Row]]&IF(Table1[[#This Row],[Value]]=\"\",\"\",\" - \"&Table1[[#This Row],[Value]])","v":"Sanlam - N-K/DQ7667"}]
["Sanlam","Sub Product 5","C-X/DQ2549",{"$f":"Table1[[#This Row],[Row]]&IF(Table1[[#This Row],[Value]]=\"\",\"\",\" - \"&Table1[[#This Row],[Value]])","v":"Sanlam - C-X/DQ2549"}]
["Sanlam","Sub Product 6","I-I/DQ4036",{"$f":"Table1[[#This Row],[Row]]&IF(Table1[[#This Row],[Value]]=\"\",\"\",\" - \"&Table1[[#This Row],[Value]])","v":"Sanlam - I-I/DQ4036"}]
["Sanlam","Sub Product 7","P-F/DQ5733",{"$f":"Table1[[#This Row],[Row]]&IF(Table1[[#This Row],[Value]]=\"\",\"\",\" - \"&Table1[[#This Row],[Value]])","v":"Sanlam - P-F/DQ5733"}]
["Lexiair","Sub Product 1",null,{"$f":"Table1[[#This Row],[Row]]&IF(Table1[[#This Row],[Value]]=\"\",\"\",\" - \"&Table1[[#This Row],[Value]])","v":"Lexiair"}]
["Lexiair","Sub Product 2","N-I/DQ8055",{"$f":"Table1[[#This Row],[Row]]&IF(Table1[[#This Row],[Value]]=\"\",\"\",\" - \"&Table1[[#This Row],[Value]])","v":"Lexiair - N-I/DQ8055"}]
["Lexiair","Sub Product 3","B-X/DQ9278",{"$f":"Table1[[#This Row],[Row]]&IF(Table1[[#This Row],[Value]]=\"\",\"\",\" - \"&Table1[[#This Row],[Value]])","v":"Lexiair - B-X/DQ9278"}]
["Lexiair","Sub Product 4","B-W/DQ6317",{"$f":"Table1[[#This Row],[Row]]&IF(Table1[[#This Row],[Value]]=\"\",\"\",\" - \"&Table1[[#This Row],[Value]])","v":"Lexiair - B-W/DQ6317"}]
["Lexiair","Sub Product 5","P-S/DQ6855",{"$f":"Table1[[#This Row],[Row]]&IF(Table1[[#This Row],[Value]]=\"\",\"\",\" - \"&Table1[[#This Row],[Value]])","v":"Lexiair - P-S/DQ6855"}]
["Lexiair","Sub Product 6","C-L/DQ3860",{"$f":"Table1[[#This Row],[Row]]&IF(Table1[[#This Row],[Value]]=\"\",\"\",\" - \"&Table1[[#This Row],[Value]])","v":"Lexiair - C-L/DQ3860"}]
["Lexiair","Sub Product 7","Z-D/DQ9878",{"$f":"Table1[[#This Row],[Row]]&IF(Table1[[#This Row],[Value]]=\"\",\"\",\" - \"&Table1[[#This Row],[Value]])","v":"Lexiair - Z-D/DQ9878"}]
["Stat-La","Sub Product 1",null,{"$f":"Table1[[#This Row],[Row]]&IF(Table1[[#This Row],[Value]]=\"\",\"\",\" - \"&Table1[[#This Row],[Value]])","v":"Stat-La"}]
["Stat-La","Sub Product 2","V-R/DQ3359",{"$f":"Table1[[#This Row],[Row]]&IF(Table1[[#This Row],[Value]]=\"\",\"\",\" - \"&Table1[[#This Row],[Value]])","v":"Stat-La - V-R/DQ3359"}]
["Stat-La","Sub Product 3","V-H/DQ7313",{"$f":"Table1[[#This Row],[Row]]&IF(Table1[[#This Row],[Value]]=\"\",\"\",\" - \"&Table1[[#This Row],[Value]])","v":"Stat-La - V-H/DQ7313"}]
["Stat-La","Sub Product 4","F-F/DQ5200",{"$f":"Table1[[#This Row],[Row]]&IF(Table1[[#This Row],[Value]]=\"\",\"\",\" - \"&Table1[[#This Row],[Value]])","v":"Stat-La - F-F/DQ5200"}]
["Stat-La","Sub Product 5","J-Q/DQ5746",{"$f":"Table1[[#This Row],[Row]]&IF(Table1[[#This Row],[Value]]=\"\",\"\",\" - \"&Table1[[#This Row],[Value]])","v":"Stat-La - J-Q/DQ5746"}]
["Stat-La","Sub Product 6","A-Q/DQ5080",{"$f":"Table1[[#This Row],[Row]]&IF(Table1[[#This Row],[Value]]=\"\",\"\",\" - \"&Table1[[#This Row],[Value]])","v":"Stat-La - A-Q/DQ5080"}]
["Stat-La","Sub Product 7","F-V/DQ2552",{"$f":"Table1[[#This Row],[Row]]&IF(Table1[[#This Row],[Value]]=\"\",\"\",\" - \"&Table1[[#This Row],[Value]])","v":"Stat-La - F-V/DQ2552"}]
["Move Jaytop","Sub Product 1",null,{"$f":"Table1[[#This Row],[Row]]&IF(Table1[[#This Row],[Value]]=\"\",\"\",\" - \"&Table1[[#This Row],[Value]])","v":"Move Jaytop"}]
["Move Jaytop","Sub Product 2","T-O/DQ7238",{"$f":"Table1[[#This Row],[Row]]&IF(Table1[[#This Row],[Value]]=\"\",\"\",\" - \"&Table1[[#This Row],[Value]])","v":"Move Jaytop - T-O/DQ7238"}]
["Move Jaytop","Sub Product 3","F-D/DQ6648",{"$f":"Table1[[#This Row],[Row]]&IF(Table1[[#This Row],[Value]]=\"\",\"\",\" - \"&Table1[[#This Row],[Value]])","v":"Move Jaytop - F-D/DQ6648"}]
["Move Jaytop","Sub Product 4","K-A/DQ9049",{"$f":"Table1[[#This Row],[Row]]&IF(Table1[[#This Row],[Value]]=\"\",\"\",\" - \"&Table1[[#This Row],[Value]])","v":"Move Jaytop - K-A/DQ9049"}]
["Move Jaytop","Sub Product 5","H-O/DQ2208",{"$f":"Table1[[#This Row],[Row]]&IF(Table1[[#This Row],[Value]]=\"\",\"\",\" - \"&Table1[[#This Row],[Value]])","v":"Move Jaytop - H-O/DQ2208"}]
["Move Jaytop","Sub Product 6","I-Z/DQ5486",{"$f":"Table1[[#This Row],[Row]]&IF(Table1[[#This Row],[Value]]=\"\",\"\",\" - \"&Table1[[#This Row],[Value]])","v":"Move Jaytop - I-Z/DQ5486"}]
["Move Jaytop","Sub Product 7","X-Y/DQ4699",{"$f":"Table1[[#This Row],[Row]]&IF(Table1[[#This Row],[Value]]=\"\",\"\",\" - \"&Table1[[#This Row],[Value]])","v":"Move Jaytop - X-Y/DQ4699"}]
["Hottrax","Sub Product 1",null,{"$f":"Table1[[#This Row],[Row]]&IF(Table1[[#This Row],[Value]]=\"\",\"\",\" - \"&Table1[[#This Row],[Value]])","v":"Hottrax"}]
["Hottrax","Sub Product 2","J-H/DQ6022",{"$f":"Table1[[#This Row],[Row]]&IF(Table1[[#This Row],[Value]]=\"\",\"\",\" - \"&Table1[[#This Row],[Value]])","v":"Hottrax - J-H/DQ6022"}]
["Hottrax","Sub Product 3","G-H/DQ5842",{"$f":"Table1[[#This Row],[Row]]&IF(Table1[[#This Row],[Value]]=\"\",\"\",\" - \"&Table1[[#This Row],[Value]])","v":"Hottrax - G-H/DQ5842"}]
["Hottrax","Sub Product 4","W-B/DQ2309",{"$f":"Table1[[#This Row],[Row]]&IF(Table1[[#This Row],[Value]]=\"\",\"\",\" - \"&Table1[[#This Row],[Value]])","v":"Hottrax - W-B/DQ2309"}]
["Hottrax","Sub Product 5","C-L/DQ5586",{"$f":"Table1[[#This Row],[Row]]&IF(Table1[[#This Row],[Value]]=\"\",\"\",\" - \"&Table1[[#This Row],[Value]])","v":"Hottrax - C-L/DQ5586"}]
["Hottrax","Sub Product 6","W-F/DQ3438",{"$f":"Table1[[#This Row],[Row]]&IF(Table1[[#This Row],[Value]]=\"\",\"\",\" - \"&Table1[[#This Row],[Value]])","v":"Hottrax - W-F/DQ3438"}]
["Hottrax","Sub Product 7","X-R/DQ3727",{"$f":"Table1[[#This Row],[Row]]&IF(Table1[[#This Row],[Value]]=\"\",\"\",\" - \"&Table1[[#This Row],[Value]])","v":"Hottrax - X-R/DQ3727"}]
["Doublehome","Sub Product 1",null,{"$f":"Table1[[#This Row],[Row]]&IF(Table1[[#This Row],[Value]]=\"\",\"\",\" - \"&Table1[[#This Row],[Value]])","v":"Doublehome"}]
["Doublehome","Sub Product 2","I-X/DQ1764",{"$f":"Table1[[#This Row],[Row]]&IF(Table1[[#This Row],[Value]]=\"\",\"\",\" - \"&Table1[[#This Row],[Value]])","v":"Doublehome - I-X/DQ1764"}]
["Doublehome","Sub Product 3","F-V/DQ9308",{"$f":"Table1[[#This Row],[Row]]&IF(Table1[[#This Row],[Value]]=\"\",\"\",\" - \"&Table1[[#This Row],[Value]])","v":"Doublehome - F-V/DQ9308"}]
["Doublehome","Sub Product 4","G-E/DQ9441",{"$f":"Table1[[#This Row],[Row]]&IF(Table1[[#This Row],[Value]]=\"\",\"\",\" - \"&Table1[[#This Row],[Value]])","v":"Doublehome - G-E/DQ9441"}]
["Doublehome","Sub Product 5","D-P/DQ4540",{"$f":"Table1[[#This Row],[Row]]&IF(Table1[[#This Row],[Value]]=\"\",\"\",\" - \"&Table1[[#This Row],[Value]])","v":"Doublehome - D-P/DQ4540"}]
["Doublehome","Sub Product 6","A-C/DQ5093",{"$f":"Table1[[#This Row],[Row]]&IF(Table1[[#This Row],[Value]]=\"\",\"\",\" - \"&Table1[[#This Row],[Value]])","v":"Doublehome - A-C/DQ5093"}]
["Doublehome","Sub Product 7","P-M/DQ5272",{"$f":"Table1[[#This Row],[Row]]&IF(Table1[[#This Row],[Value]]=\"\",\"\",\" - \"&Table1[[#This Row],[Value]])","v":"Doublehome - P-M/DQ5272"}]
["Geoeco","Sub Product 1",null,{"$f":"Table1[[#This Row],[Row]]&IF(Table1[[#This Row],[Value]]=\"\",\"\",\" - \"&Table1[[#This Row],[Value]])","v":"Geoeco"}]
["Geoeco","Sub Product 2","K-I/DQ6541",{"$f":"Table1[[#This Row],[Row]]&IF(Table1[[#This Row],[Value]]=\"\",\"\",\" - \"&Table1[[#This Row],[Value]])","v":"Geoeco - K-I/DQ6541"}]
["Geoeco","Sub Product 3","O-A/DQ4828",{"$f":"Table1[[#This Row],[Row]]&IF(Table1[[#This Row],[Value]]=\"\",\"\",\" - \"&Table1[[#This Row],[Value]])","v":"Geoeco - O-A/DQ4828"}]
["Geoeco","Sub Product 4","L-B/DQ5503",{"$f":"Table1[[#This Row],[Row]]&IF(Table1[[#This Row],[Value]]=\"\",\"\",\" - \"&Table1[[#This Row],[Value]])","v":"Geoeco - L-B/DQ5503"}]
["Geoeco","Sub Product 5","U-G/DQ1778",{"$f":"Table1[[#This Row],[Row]]&IF(Table1[[#This Row],[Value]]=\"\",\"\",\" - \"&Table1[[#This Row],[Value]])","v":"Geoeco - U-G/DQ1778"}]
["Geoeco","Sub Product 6","D-V/DQ5889",{"$f":"Table1[[#This Row],[Row]]&IF(Table1[[#This Row],[Value]]=\"\",\"\",\" - \"&Table1[[#This Row],[Value]])","v":"Geoeco - D-V/DQ5889"}]
["Geoeco","Sub Product 7","N-C/DQ6848",{"$f":"Table1[[#This Row],[Row]]&IF(Table1[[#This Row],[Value]]=\"\",\"\",\" - \"&Table1[[#This Row],[Value]])","v":"Geoeco - N-C/DQ6848"}]
["Nimtex","Sub Product 1",null,{"$f":"Table1[[#This Row],[Row]]&IF(Table1[[#This Row],[Value]]=\"\",\"\",\" - \"&Table1[[#This Row],[Value]])","v":"Nimtex"}]
["Nimtex","Sub Product 2","H-V/DQ2801",{"$f":"Table1[[#This Row],[Row]]&IF(Table1[[#This Row],[Value]]=\"\",\"\",\" - \"&Table1[[#This Row],[Value]])","v":"Nimtex - H-V/DQ2801"}]
["Nimtex","Sub Product 3","A-F/DQ3370",{"$f":"Table1[[#This Row],[Row]]&IF(Table1[[#This Row],[Value]]=\"\",\"\",\" - \"&Table1[[#This Row],[Value]])","v":"Nimtex - A-F/DQ3370"}]
["Nimtex","Sub Product 4","E-R/DQ2577",{"$f":"Table1[[#This Row],[Row]]&IF(Table1[[#This Row],[Value]]=\"\",\"\",\" - \"&Table1[[#This Row],[Value]])","v":"Nimtex - E-R/DQ2577"}]
["Nimtex","Sub Product 5","Y-G/DQ7693",{"$f":"Table1[[#This Row],[Row]]&IF(Table1[[#This Row],[Value]]=\"\",\"\",\" - \"&Table1[[#This Row],[Value]])","v":"Nimtex - Y-G/DQ7693"}]
["Nimtex","Sub Product 6","P-X/DQ1156",{"$f":"Table1[[#This Row],[Row]]&IF(Table1[[#This Row],[Value]]=\"\",\"\",\" - \"&Table1[[#This Row],[Value]])","v":"Nimtex - P-X/DQ1156"}]
["Nimtex","Sub Product 7","Z-T/DQ1399",{"$f":"Table1[[#This Row],[Row]]&IF(Table1[[#This Row],[Value]]=\"\",\"\",\" - \"&Table1[[#This Row],[Value]])","v":"Nimtex - Z-T/DQ1399"}]
["Roneco","Sub Product 1",null,{"$f":"Table1[[#This Row],[Row]]&IF(Table1[[#This Row],[Value]]=\"\",\"\",\" - \"&Table1[[#This Row],[Value]])","v":"Roneco"}]
["Roneco","Sub Product 2","D-D/DQ9977",{"$f":"Table1[[#This Row],[Row]]&IF(Table1[[#This Row],[Value]]=\"\",\"\",\" - \"&Table1[[#This Row],[Value]])","v":"Roneco - D-D/DQ9977"}]
["Roneco","Sub Product 3","W-U/DQ9156",{"$f":"Table1[[#This Row],[Row]]&IF(Table1[[#This Row],[Value]]=\"\",\"\",\" - \"&Table1[[#This Row],[Value]])","v":"Roneco - W-U/DQ9156"}]
["Roneco","Sub Product 4","B-F/DQ9761",{"$f":"Table1[[#This Row],[Row]]&IF(Table1[[#This Row],[Value]]=\"\",\"\",\" - \"&Table1[[#This Row],[Value]])","v":"Roneco - B-F/DQ9761"}]
["Roneco","Sub Product 5","G-J/DQ8671",{"$f":"Table1[[#This Row],[Row]]&IF(Table1[[#This Row],[Value]]=\"\",\"\",\" - \"&Table1[[#This Row],[Value]])","v":"Roneco - G-J/DQ8671"}]
["Roneco","Sub Product 6","M-Z/DQ2823",{"$f":"Table1[[#This Row],[Row]]&IF(Table1[[#This Row],[Value]]=\"\",\"\",\" - \"&Table1[[#This Row],[Value]])","v":"Roneco - M-Z/DQ2823"}]
["Roneco","Sub Product 7","Y-S/DQ7569",{"$f":"Table1[[#This Row],[Row]]&IF(Table1[[#This Row],[Value]]=\"\",\"\",\" - \"&Table1[[#This Row],[Value]])","v":"Roneco - Y-S/DQ7569"}]
["Super Damlex","Sub Product 1",null,{"$f":"Table1[[#This Row],[Row]]&IF(Table1[[#This Row],[Value]]=\"\",\"\",\" - \"&Table1[[#This Row],[Value]])","v":"Super Damlex"}]
["Super Damlex","Sub Product 2","X-K/DQ5825",{"$f":"Table1[[#This Row],[Row]]&IF(Table1[[#This Row],[Value]]=\"\",\"\",\" - \"&Table1[[#This Row],[Value]])","v":"Super Damlex - X-K/DQ5825"}]
["Super Damlex","Sub Product 3","B-M/DQ4799",{"$f":"Table1[[#This Row],[Row]]&IF(Table1[[#This Row],[Value]]=\"\",\"\",\" - \"&Table1[[#This Row],[Value]])","v":"Super Damlex - B-M/DQ4799"}]
["Super Damlex","Sub Product 4","F-Y/DQ7680",{"$f":"Table1[[#This Row],[Row]]&IF(Table1[[#This Row],[Value]]=\"\",\"\",\" - \"&Table1[[#This Row],[Value]])","v":"Super Damlex - F-Y/DQ7680"}]
["Super Damlex","Sub Product 5","E-K/DQ5609",{"$f":"Table1[[#This Row],[Row]]&IF(Table1[[#This Row],[Value]]=\"\",\"\",\" - \"&Table1[[#This Row],[Value]])","v":"Super Damlex - E-K/DQ5609"}]
["Super Damlex","Sub Product 6","X-H/DQ4124",{"$f":"Table1[[#This Row],[Row]]&IF(Table1[[#This Row],[Value]]=\"\",\"\",\" - \"&Table1[[#This Row],[Value]])","v":"Super Damlex - X-H/DQ4124"}]
["Super Damlex","Sub Product 7","T-L/DQ1506",{"$f":"Table1[[#This Row],[Row]]&IF(Table1[[#This Row],[Value]]=\"\",\"\",\" - \"&Table1[[#This Row],[Value]])","v":"Super Damlex - T-L/DQ1506"}]
["Donlam","Sub Product 1",null,{"$f":"Table1[[#This Row],[Row]]&IF(Table1[[#This Row],[Value]]=\"\",\"\",\" - \"&Table1[[#This Row],[Value]])","v":"Donlam"}]
["Donlam","Sub Product 2","I-C/DQ1599",{"$f":"Table1[[#This Row],[Row]]&IF(Table1[[#This Row],[Value]]=\"\",\"\",\" - \"&Table1[[#This Row],[Value]])","v":"Donlam - I-C/DQ1599"}]
["Donlam","Sub Product 3","M-W/DQ6736",{"$f":"Table1[[#This Row],[Row]]&IF(Table1[[#This Row],[Value]]=\"\",\"\",\" - \"&Table1[[#This Row],[Value]])","v":"Donlam - M-W/DQ6736"}]
["Donlam","Sub Product 4","M-U/DQ3289",{"$f":"Table1[[#This Row],[Row]]&IF(Table1[[#This Row],[Value]]=\"\",\"\",\" - \"&Table1[[#This Row],[Value]])","v":"Donlam - M-U/DQ3289"}]
["Donlam","Sub Product 5","D-G/DQ9953",{"$f":"Table1[[#This Row],[Row]]&IF(Table1[[#This Row],[Value]]=\"\",\"\",\" - \"&Table1[[#This Row],[Value]])","v":"Donlam - D-G/DQ9953"}]
["Donlam","Sub Product 6","M-K/DQ2272",{"$f":"Table1[[#This Row],[Row]]&IF(Table1[[#This Row],[Value]]=\"\",\"\",\" - \"&Table1[[#This Row],[Value]])","v":"Donlam - M-K/DQ2272"}]
["Donlam","Sub Product 7","B-V/DQ4292",{"$f":"Table1[[#This Row],[Row]]&IF(Table1[[#This Row],[Value]]=\"\",\"\",\" - \"&Table1[[#This Row],[Value]])","v":"Donlam - B-V/DQ4292"}]
["Year Quolex","Sub Product 1",null,{"$f":"Table1[[#This Row],[Row]]&IF(Table1[[#This Row],[Value]]=\"\",\"\",\" - \"&Table1[[#This Row],[Value]])","v":"Year Quolex"}]
["Year Quolex","Sub Product 2","F-Y/DQ5679",{"$f":"Table1[[#This Row],[Row]]&IF(Table1[[#This Row],[Value]]=\"\",\"\",\" - \"&Table1[[#This Row],[Value]])","v":"Year Quolex - F-Y/DQ5679"}]
["Year Quolex","Sub Product 3","E-W/DQ8224",{"$f":"Table1[[#This Row],[Row]]&IF(Table1[[#This Row],[Value]]=\"\",\"\",\" - \"&Table1[[#This Row],[Value]])","v":"Year Quolex - E-W/DQ8224"}]
["Year Quolex","Sub Product 4","N-X/DQ6670",{"$f":"Table1[[#This Row],[Row]]&IF(Table1[[#This Row],[Value]]=\"\",\"\",\" - \"&Table1[[#This Row],[Value]])","v":"Year Quolex - N-X/DQ6670"}]
["Year Quolex","Sub Product 5","L-Z/DQ5606",{"$f":"Table1[[#This Row],[Row]]&IF(Table1[[#This Row],[Value]]=\"\",\"\",\" - \"&Table1[[#This Row],[Value]])","v":"Year Quolex - L-Z/DQ5606"}]
["Year Quolex","Sub Product 6","M-J/DQ6877",{"$f":"Table1[[#This Row],[Row]]&IF(Table1[[#This Row],[Value]]=\"\",\"\",\" - \"&Table1[[#This Row],[Value]])","v":"Year Quolex - M-J/DQ6877"}]
["Year Quolex","Sub Product 7","A-H/DQ1309",{"$f":"Table1[[#This Row],[Row]]&IF(Table1[[#This Row],[Value]]=\"\",\"\",\" - \"&Table1[[#This Row],[Value]])","v":"Year Quolex - A-H/DQ1309"}]
["Stimlax","Sub Product 1",null,{"$f":"Table1[[#This Row],[Row]]&IF(Table1[[#This Row],[Value]]=\"\",\"\",\" - \"&Table1[[#This Row],[Value]])","v":"Stimlax"}]
["Stimlax","Sub Product 2","B-D/DQ7855",{"$f":"Table1[[#This Row],[Row]]&IF(Table1[[#This Row],[Value]]=\"\",\"\",\" - \"&Table1[[#This Row],[Value]])","v":"Stimlax - B-D/DQ7855"}]
["Stimlax","Sub Product 3","K-E/DQ8332",{"$f":"Table1[[#This Row],[Row]]&IF(Table1[[#This Row],[Value]]=\"\",\"\",\" - \"&Table1[[#This Row],[Value]])","v":"Stimlax - K-E/DQ8332"}]
["Stimlax","Sub Product 4","A-P/DQ4738",{"$f":"Table1[[#This Row],[Row]]&IF(Table1[[#This Row],[Value]]=\"\",\"\",\" - \"&Table1[[#This Row],[Value]])","v":"Stimlax - A-P/DQ4738"}]
["Stimlax","Sub Product 5","V-G/DQ2524",{"$f":"Table1[[#This Row],[Row]]&IF(Table1[[#This Row],[Value]]=\"\",\"\",\" - \"&Table1[[#This Row],[Value]])","v":"Stimlax - V-G/DQ2524"}]
["Stimlax","Sub Product 6","Y-O/DQ9675",{"$f":"Table1[[#This Row],[Row]]&IF(Table1[[#This Row],[Value]]=\"\",\"\",\" - \"&Table1[[#This Row],[Value]])","v":"Stimlax - Y-O/DQ9675"}]
["Stimlax","Sub Product 7","N-S/DQ6800",{"$f":"Table1[[#This Row],[Row]]&IF(Table1[[#This Row],[Value]]=\"\",\"\",\" - \"&Table1[[#This Row],[Value]])","v":"Stimlax - N-S/DQ6800"}]
["Duotouch","Sub Product 1",null,{"$f":"Table1[[#This Row],[Row]]&IF(Table1[[#This Row],[Value]]=\"\",\"\",\" - \"&Table1[[#This Row],[Value]])","v":"Duotouch"}]
["Duotouch","Sub Product 2","Z-V/DQ3753",{"$f":"Table1[[#This Row],[Row]]&IF(Table1[[#This Row],[Value]]=\"\",\"\",\" - \"&Table1[[#This Row],[Value]])","v":"Duotouch - Z-V/DQ3753"}]
["Duotouch","Sub Product 3","F-F/DQ5074",{"$f":"Table1[[#This Row],[Row]]&IF(Table1[[#This Row],[Value]]=\"\",\"\",\" - \"&Table1[[#This Row],[Value]])","v":"Duotouch - F-F/DQ5074"}]
["Duotouch","Sub Product 4","A-Y/DQ2802",{"$f":"Table1[[#This Row],[Row]]&IF(Table1[[#This Row],[Value]]=\"\",\"\",\" - \"&Table1[[#This Row],[Value]])","v":"Duotouch - A-Y/DQ2802"}]
["Duotouch","Sub Product 5","P-R/DQ8445",{"$f":"Table1[[#This Row],[Row]]&IF(Table1[[#This Row],[Value]]=\"\",\"\",\" - \"&Table1[[#This Row],[Value]])","v":"Duotouch - P-R/DQ8445"}]
["Duotouch","Sub Product 6","Y-H/DQ6655",{"$f":"Table1[[#This Row],[Row]]&IF(Table1[[#This Row],[Value]]=\"\",\"\",\" - \"&Table1[[#This Row],[Value]])","v":"Duotouch - Y-H/DQ6655"}]
["Duotouch","Sub Product 7","S-L/DQ4687",{"$f":"Table1[[#This Row],[Row]]&IF(Table1[[#This Row],[Value]]=\"\",\"\",\" - \"&Table1[[#This Row],[Value]])","v":"Duotouch - S-L/DQ4687"}]
["Tam Cof","Sub Product 1",null,{"$f":"Table1[[#This Row],[Row]]&IF(Table1[[#This Row],[Value]]=\"\",\"\",\" - \"&Table1[[#This Row],[Value]])","v":"Tam Cof"}]
["Tam Cof","Sub Product 2","H-V/DQ1159",{"$f":"Table1[[#This Row],[Row]]&IF(Table1[[#This Row],[Value]]=\"\",\"\",\" - \"&Table1[[#This Row],[Value]])","v":"Tam Cof - H-V/DQ1159"}]
["Tam Cof","Sub Product 3","I-R/DQ8841",{"$f":"Table1[[#This Row],[Row]]&IF(Table1[[#This Row],[Value]]=\"\",\"\",\" - \"&Table1[[#This Row],[Value]])","v":"Tam Cof - I-R/DQ8841"}]
["Tam Cof","Sub Product 4","V-Q/DQ8805",{"$f":"Table1[[#This Row],[Row]]&IF(Table1[[#This Row],[Value]]=\"\",\"\",\" - \"&Table1[[#This Row],[Value]])","v":"Tam Cof - V-Q/DQ8805"}]
["Tam Cof","Sub Product 5","X-X/DQ6355",{"$f":"Table1[[#This Row],[Row]]&IF(Table1[[#This Row],[Value]]=\"\",\"\",\" - \"&Table1[[#This Row],[Value]])","v":"Tam Cof - X-X/DQ6355"}]
["Tam Cof","Sub Product 6","E-B/DQ6085",{"$f":"Table1[[#This Row],[Row]]&IF(Table1[[#This Row],[Value]]=\"\",\"\",\" - \"&Table1[[#This Row],[Value]])","v":"Tam Cof - E-B/DQ6085"}]
["Tam Cof","Sub Product 7","V-F/DQ3156",{"$f":"Table1[[#This Row],[Row]]&IF(Table1[[#This Row],[Value]]=\"\",\"\",\" - \"&Table1[[#This Row],[Value]])","v":"Tam Cof - V-F/DQ3156"}]
["Viafax","Sub Product 1",null,{"$f":"Table1[[#This Row],[Row]]&IF(Table1[[#This Row],[Value]]=\"\",\"\",\" - \"&Table1[[#This Row],[Value]])","v":"Viafax"}]
["Viafax","Sub Product 2","C-U/DQ9402",{"$f":"Table1[[#This Row],[Row]]&IF(Table1[[#This Row],[Value]]=\"\",\"\",\" - \"&Table1[[#This Row],[Value]])","v":"Viafax - C-U/DQ9402"}]
["Viafax","Sub Product 3","B-J/DQ9539",{"$f":"Table1[[#This Row],[Row]]&IF(Table1[[#This Row],[Value]]=\"\",\"\",\" - \"&Table1[[#This Row],[Value]])","v":"Viafax - B-J/DQ9539"}]
["Viafax","Sub Product 4","L-F/DQ2057",{"$f":"Table1[[#This Row],[Row]]&IF(Table1[[#This Row],[Value]]=\"\",\"\",\" - \"&Table1[[#This Row],[Value]])","v":"Viafax - L-F/DQ2057"}]
["Viafax","Sub Product 5","O-X/DQ7355",{"$f":"Table1[[#This Row],[Row]]&IF(Table1[[#This Row],[Value]]=\"\",\"\",\" - \"&Table1[[#This Row],[Value]])","v":"Viafax - O-X/DQ7355"}]
["Viafax","Sub Product 6","V-V/DQ1752",{"$f":"Table1[[#This Row],[Row]]&IF(Table1[[#This Row],[Value]]=\"\",\"\",\" - \"&Table1[[#This Row],[Value]])","v":"Viafax - V-V/DQ1752"}]
["Viafax","Sub Product 7","R-Y/DQ2556",{"$f":"Table1[[#This Row],[Row]]&IF(Table1[[#This Row],[Value]]=\"\",\"\",\" - \"&Table1[[#This Row],[Value]])","v":"Viafax - R-Y/DQ2556"}]
["Plus Zap","Sub Product 1",null,{"$f":"Table1[[#This Row],[Row]]&IF(Table1[[#This Row],[Value]]=\"\",\"\",\" - \"&Table1[[#This Row],[Value]])","v":"Plus Zap"}]
["Plus Zap","Sub Product 2","F-P/DQ1528",{"$f":"Table1[[#This Row],[Row]]&IF(Table1[[#This Row],[Value]]=\"\",\"\",\" - \"&Table1[[#This Row],[Value]])","v":"Plus Zap - F-P/DQ1528"}]
["Plus Zap","Sub Product 3","A-R/DQ8428",{"$f":"Table1[[#This Row],[Row]]&IF(Table1[[#This Row],[Value]]=\"\",\"\",\" - \"&Table1[[#This Row],[Value]])","v":"Plus Zap - A-R/DQ8428"}]
["Plus Zap","Sub Product 4","P-J/DQ8896",{"$f":"Table1[[#This Row],[Row]]&IF(Table1[[#This Row],[Value]]=\"\",\"\",\" - \"&Table1[[#This Row],[Value]])","v":"Plus Zap - P-J/DQ8896"}]
["Plus Zap","Sub Product 5","C-P/DQ5399",{"$f":"Table1[[#This Row],[Row]]&IF(Table1[[#This Row],[Value]]=\"\",\"\",\" - \"&Table1[[#This Row],[Value]])","v":"Plus Zap - C-P/DQ5399"}]
["Plus Zap","Sub Product 6","X-Z/DQ5028",{"$f":"Table1[[#This Row],[Row]]&IF(Table1[[#This Row],[Value]]=\"\",\"\",\" - \"&Table1[[#This Row],[Value]])","v":"Plus Zap - X-Z/DQ5028"}]
["Plus Zap","Sub Product 7","S-C/DQ3339",{"$f":"Table1[[#This Row],[Row]]&IF(Table1[[#This Row],[Value]]=\"\",\"\",\" - \"&Table1[[#This Row],[Value]])","v":"Plus Zap - S-C/DQ3339"}]
["Toptax","Sub Product 1",null,{"$f":"Table1[[#This Row],[Row]]&IF(Table1[[#This Row],[Value]]=\"\",\"\",\" - \"&Table1[[#This Row],[Value]])","v":"Toptax"}]
["Toptax","Sub Product 2","P-P/DQ7924",{"$f":"Table1[[#This Row],[Row]]&IF(Table1[[#This Row],[Value]]=\"\",\"\",\" - \"&Table1[[#This Row],[Value]])","v":"Toptax - P-P/DQ7924"}]
["Toptax","Sub Product 3","G-O/DQ6067",{"$f":"Table1[[#This Row],[Row]]&IF(Table1[[#This Row],[Value]]=\"\",\"\",\" - \"&Table1[[#This Row],[Value]])","v":"Toptax - G-O/DQ6067"}]
["Toptax","Sub Product 4","Z-J/DQ8325",{"$f":"Table1[[#This Row],[Row]]&IF(Table1[[#This Row],[Value]]=\"\",\"\",\" - \"&Table1[[#This Row],[Value]])","v":"Toptax - Z-J/DQ8325"}]
["Toptax","Sub Product 5","U-W/DQ4138",{"$f":"Table1[[#This Row],[Row]]&IF(Table1[[#This Row],[Value]]=\"\",\"\",\" - \"&Table1[[#This Row],[Value]])","v":"Toptax - U-W/DQ4138"}]
["Toptax","Sub Product 6","C-P/DQ4351",{"$f":"Table1[[#This Row],[Row]]&IF(Table1[[#This Row],[Value]]=\"\",\"\",\" - \"&Table1[[#This Row],[Value]])","v":"Toptax - C-P/DQ4351"}]
["Toptax","Sub Product 7","D-U/DQ7085",{"$f":"Table1[[#This Row],[Row]]&IF(Table1[[#This Row],[Value]]=\"\",\"\",\" - \"&Table1[[#This Row],[Value]])","v":"Toptax - D-U/DQ7085"}]
["Softsoft","Sub Product 1",null,{"$f":"Table1[[#This Row],[Row]]&IF(Table1[[#This Row],[Value]]=\"\",\"\",\" - \"&Table1[[#This Row],[Value]])","v":"Softsoft"}]
["Softsoft","Sub Product 2","K-H/DQ9934",{"$f":"Table1[[#This Row],[Row]]&IF(Table1[[#This Row],[Value]]=\"\",\"\",\" - \"&Table1[[#This Row],[Value]])","v":"Softsoft - K-H/DQ9934"}]
["Softsoft","Sub Product 3","Z-A/DQ9772",{"$f":"Table1[[#This Row],[Row]]&IF(Table1[[#This Row],[Value]]=\"\",\"\",\" - \"&Table1[[#This Row],[Value]])","v":"Softsoft - Z-A/DQ9772"}]
["Softsoft","Sub Product 4","T-X/DQ3131",{"$f":"Table1[[#This Row],[Row]]&IF(Table1[[#This Row],[Value]]=\"\",\"\",\" - \"&Table1[[#This Row],[Value]])","v":"Softsoft - T-X/DQ3131"}]
["Softsoft","Sub Product 5","I-W/DQ1963",{"$f":"Table1[[#This Row],[Row]]&IF(Table1[[#This Row],[Value]]=\"\",\"\",\" - \"&Table1[[#This Row],[Value]])","v":"Softsoft - I-W/DQ1963"}]
["Softsoft","Sub Product 6","L-L/DQ3491",{"$f":"Table1[[#This Row],[Row]]&IF(Table1[[#This Row],[Value]]=\"\",\"\",\" - \"&Table1[[#This Row],[Value]])","v":"Softsoft - L-L/DQ3491"}]
["Softsoft","Sub Product 7","R-P/DQ4740",{"$f":"Table1[[#This Row],[Row]]&IF(Table1[[#This Row],[Value]]=\"\",\"\",\" - \"&Table1[[#This Row],[Value]])","v":"Softsoft - R-P/DQ4740"}]
["Sumremjob","Sub Product 1",null,{"$f":"Table1[[#This Row],[Row]]&IF(Table1[[#This Row],[Value]]=\"\",\"\",\" - \"&Table1[[#This Row],[Value]])","v":"Sumremjob"}]
["Sumremjob","Sub Product 2","U-I/DQ5770",{"$f":"Table1[[#This Row],[Row]]&IF(Table1[[#This Row],[Value]]=\"\",\"\",\" - \"&Table1[[#This Row],[Value]])","v":"Sumremjob - U-I/DQ5770"}]
["Sumremjob","Sub Product 3","J-V/DQ1316",{"$f":"Table1[[#This Row],[Row]]&IF(Table1[[#This Row],[Value]]=\"\",\"\",\" - \"&Table1[[#This Row],[Value]])","v":"Sumremjob - J-V/DQ1316"}]
["Sumremjob","Sub Product 4","S-D/DQ3642",{"$f":"Table1[[#This Row],[Row]]&IF(Table1[[#This Row],[Value]]=\"\",\"\",\" - \"&Table1[[#This Row],[Value]])","v":"Sumremjob - S-D/DQ3642"}]
["Sumremjob","Sub Product 5","M-Z/DQ8379",{"$f":"Table1[[#This Row],[Row]]&IF(Table1[[#This Row],[Value]]=\"\",\"\",\" - \"&Table1[[#This Row],[Value]])","v":"Sumremjob - M-Z/DQ8379"}]
["Sumremjob","Sub Product 6","I-B/DQ7976",{"$f":"Table1[[#This Row],[Row]]&IF(Table1[[#This Row],[Value]]=\"\",\"\",\" - \"&Table1[[#This Row],[Value]])","v":"Sumremjob - I-B/DQ7976"}]
["Sumremjob","Sub Product 7","N-C/DQ8554",{"$f":"Table1[[#This Row],[Row]]&IF(Table1[[#This Row],[Value]]=\"\",\"\",\" - \"&Table1[[#This Row],[Value]])","v":"Sumremjob - N-C/DQ8554"}]
["Kanflex","Sub Product 1",null,{"$f":"Table1[[#This Row],[Row]]&IF(Table1[[#This Row],[Value]]=\"\",\"\",\" - \"&Table1[[#This Row],[Value]])","v":"Kanflex"}]
["Kanflex","Sub Product 2","M-F/DQ2070",{"$f":"Table1[[#This Row],[Row]]&IF(Table1[[#This Row],[Value]]=\"\",\"\",\" - \"&Table1[[#This Row],[Value]])","v":"Kanflex - M-F/DQ2070"}]
["Kanflex","Sub Product 3","S-Y/DQ9095",{"$f":"Table1[[#This Row],[Row]]&IF(Table1[[#This Row],[Value]]=\"\",\"\",\" - \"&Table1[[#This Row],[Value]])","v":"Kanflex - S-Y/DQ9095"}]
["Kanflex","Sub Product 4","R-W/DQ8908",{"$f":"Table1[[#This Row],[Row]]&IF(Table1[[#This Row],[Value]]=\"\",\"\",\" - \"&Table1[[#This Row],[Value]])","v":"Kanflex - R-W/DQ8908"}]
["Kanflex","Sub Product 5","N-L/DQ6432",{"$f":"Table1[[#This Row],[Row]]&IF(Table1[[#This Row],[Value]]=\"\",\"\",\" - \"&Table1[[#This Row],[Value]])","v":"Kanflex - N-L/DQ6432"}]
["Kanflex","Sub Product 6","M-L/DQ8263",{"$f":"Table1[[#This Row],[Row]]&IF(Table1[[#This Row],[Value]]=\"\",\"\",\" - \"&Table1[[#This Row],[Value]])","v":"Kanflex - M-L/DQ8263"}]
["Kanflex","Sub Product 7","L-O/DQ6467",{"$f":"Table1[[#This Row],[Row]]&IF(Table1[[#This Row],[Value]]=\"\",\"\",\" - \"&Table1[[#This Row],[Value]])","v":"Kanflex - L-O/DQ6467"}]
["Trustlex","Sub Product 1",null,{"$f":"Table1[[#This Row],[Row]]&IF(Table1[[#This Row],[Value]]=\"\",\"\",\" - \"&Table1[[#This Row],[Value]])","v":"Trustlex"}]
["Trustlex","Sub Product 2","Y-G/DQ3874",{"$f":"Table1[[#This Row],[Row]]&IF(Table1[[#This Row],[Value]]=\"\",\"\",\" - \"&Table1[[#This Row],[Value]])","v":"Trustlex - Y-G/DQ3874"}]
["Trustlex","Sub Product 3","O-W/DQ1250",{"$f":"Table1[[#This Row],[Row]]&IF(Table1[[#This Row],[Value]]=\"\",\"\",\" - \"&Table1[[#This Row],[Value]])","v":"Trustlex - O-W/DQ1250"}]
["Trustlex","Sub Product 4","F-T/DQ7332",{"$f":"Table1[[#This Row],[Row]]&IF(Table1[[#This Row],[Value]]=\"\",\"\",\" - \"&Table1[[#This Row],[Value]])","v":"Trustlex - F-T/DQ7332"}]
["Trustlex","Sub Product 5","V-Q/DQ9747",{"$f":"Table1[[#This Row],[Row]]&IF(Table1[[#This Row],[Value]]=\"\",\"\",\" - \"&Table1[[#This Row],[Value]])","v":"Trustlex - V-Q/DQ9747"}]
["Trustlex","Sub Product 6","J-W/DQ5551",{"$f":"Table1[[#This Row],[Row]]&IF(Table1[[#This Row],[Value]]=\"\",\"\",\" - \"&Table1[[#This Row],[Value]])","v":"Trustlex - J-W/DQ5551"}]
["Trustlex","Sub Product 7","K-Y/DQ4298",{"$f":"Table1[[#This Row],[Row]]&IF(Table1[[#This Row],[Value]]=\"\",\"\",\" - \"&Table1[[#This Row],[Value]])","v":"Trustlex - K-Y/DQ4298"}]
["Joyis","Sub Product 1",null,{"$f":"Table1[[#This Row],[Row]]&IF(Table1[[#This Row],[Value]]=\"\",\"\",\" - \"&Table1[[#This Row],[Value]])","v":"Joyis"}]
["Joyis","Sub Product 2","T-C/DQ6871",{"$f":"Table1[[#This Row],[Row]]&IF(Table1[[#This Row],[Value]]=\"\",\"\",\" - \"&Table1[[#This Row],[Value]])","v":"Joyis - T-C/DQ6871"}]
["Joyis","Sub Product 3","J-D/DQ9245",{"$f":"Table1[[#This Row],[Row]]&IF(Table1[[#This Row],[Value]]=\"\",\"\",\" - \"&Table1[[#This Row],[Value]])","v":"Joyis - J-D/DQ9245"}]
["Joyis","Sub Product 4","J-P/DQ4029",{"$f":"Table1[[#This Row],[Row]]&IF(Table1[[#This Row],[Value]]=\"\",\"\",\" - \"&Table1[[#This Row],[Value]])","v":"Joyis - J-P/DQ4029"}]
["Joyis","Sub Product 5","G-N/DQ6122",{"$f":"Table1[[#This Row],[Row]]&IF(Table1[[#This Row],[Value]]=\"\",\"\",\" - \"&Table1[[#This Row],[Value]])","v":"Joyis - G-N/DQ6122"}]
["Joyis","Sub Product 6","A-X/DQ4996",{"$f":"Table1[[#This Row],[Row]]&IF(Table1[[#This Row],[Value]]=\"\",\"\",\" - \"&Table1[[#This Row],[Value]])","v":"Joyis - A-X/DQ4996"}]
["Joyis","Sub Product 7","S-J/DQ6029",{"$f":"Table1[[#This Row],[Row]]&IF(Table1[[#This Row],[Value]]=\"\",\"\",\" - \"&Table1[[#This Row],[Value]])","v":"Joyis - S-J/DQ6029"}]
["Salt Damwarm","Sub Product 1",null,{"$f":"Table1[[#This Row],[Row]]&IF(Table1[[#This Row],[Value]]=\"\",\"\",\" - \"&Table1[[#This Row],[Value]])","v":"Salt Damwarm"}]
["Salt Damwarm","Sub Product 2","T-F/DQ5587",{"$f":"Table1[[#This Row],[Row]]&IF(Table1[[#This Row],[Value]]=\"\",\"\",\" - \"&Table1[[#This Row],[Value]])","v":"Salt Damwarm - T-F/DQ5587"}]
["Salt Damwarm","Sub Product 3","Y-L/DQ9024",{"$f":"Table1[[#This Row],[Row]]&IF(Table1[[#This Row],[Value]]=\"\",\"\",\" - \"&Table1[[#This Row],[Value]])","v":"Salt Damwarm - Y-L/DQ9024"}]
["Salt Damwarm","Sub Product 4","V-C/DQ9304",{"$f":"Table1[[#This Row],[Row]]&IF(Table1[[#This Row],[Value]]=\"\",\"\",\" - \"&Table1[[#This Row],[Value]])","v":"Salt Damwarm - V-C/DQ9304"}]
["Salt Damwarm","Sub Product 5","U-G/DQ8743",{"$f":"Table1[[#This Row],[Row]]&IF(Table1[[#This Row],[Value]]=\"\",\"\",\" - \"&Table1[[#This Row],[Value]])","v":"Salt Damwarm - U-G/DQ8743"}]
["Salt Damwarm","Sub Product 6","X-K/DQ5215",{"$f":"Table1[[#This Row],[Row]]&IF(Table1[[#This Row],[Value]]=\"\",\"\",\" - \"&Table1[[#This Row],[Value]])","v":"Salt Damwarm - X-K/DQ5215"}]
["Salt Damwarm","Sub Product 7","M-N/DQ7537",{"$f":"Table1[[#This Row],[Row]]&IF(Table1[[#This Row],[Value]]=\"\",\"\",\" - \"&Table1[[#This Row],[Value]])","v":"Salt Damwarm - M-N/DQ7537"}]
["Tripple Apin","Sub Product 1",null,{"$f":"Table1[[#This Row],[Row]]&IF(Table1[[#This Row],[Value]]=\"\",\"\",\" - \"&Table1[[#This Row],[Value]])","v":"Tripple Apin"}]
["Tripple Apin","Sub Product 2","J-P/DQ7429",{"$f":"Table1[[#This Row],[Row]]&IF(Table1[[#This Row],[Value]]=\"\",\"\",\" - \"&Table1[[#This Row],[Value]])","v":"Tripple Apin - J-P/DQ7429"}]
["Tripple Apin","Sub Product 3","P-G/DQ7086",{"$f":"Table1[[#This Row],[Row]]&IF(Table1[[#This Row],[Value]]=\"\",\"\",\" - \"&Table1[[#This Row],[Value]])","v":"Tripple Apin - P-G/DQ7086"}]
["Tripple Apin","Sub Product 4","Y-L/DQ6224",{"$f":"Table1[[#This Row],[Row]]&IF(Table1[[#This Row],[Value]]=\"\",\"\",\" - \"&Table1[[#This Row],[Value]])","v":"Tripple Apin - Y-L/DQ6224"}]
["Tripple Apin","Sub Product 5","I-A/DQ3124",{"$f":"Table1[[#This Row],[Row]]&IF(Table1[[#This Row],[Value]]=\"\",\"\",\" - \"&Table1[[#This Row],[Value]])","v":"Tripple Apin - I-A/DQ3124"}]
["Tripple Apin","Sub Product 6","X-R/DQ2483",{"$f":"Table1[[#This Row],[Row]]&IF(Table1[[#This Row],[Value]]=\"\",\"\",\" - \"&Table1[[#This Row],[Value]])","v":"Tripple Apin - X-R/DQ2483"}]
["Tripple Apin","Sub Product 7","K-H/DQ1008",{"$f":"Table1[[#This Row],[Row]]&IF(Table1[[#This Row],[Value]]=\"\",\"\",\" - \"&Table1[[#This Row],[Value]])","v":"Tripple Apin - K-H/DQ1008"}]
["Sil It","Sub Product 1",null,{"$f":"Table1[[#This Row],[Row]]&IF(Table1[[#This Row],[Value]]=\"\",\"\",\" - \"&Table1[[#This Row],[Value]])","v":"Sil It"}]
["Sil It","Sub Product 2","I-P/DQ8226",{"$f":"Table1[[#This Row],[Row]]&IF(Table1[[#This Row],[Value]]=\"\",\"\",\" - \"&Table1[[#This Row],[Value]])","v":"Sil It - I-P/DQ8226"}]
["Sil It","Sub Product 3","N-P/DQ4986",{"$f":"Table1[[#This Row],[Row]]&IF(Table1[[#This Row],[Value]]=\"\",\"\",\" - \"&Table1[[#This Row],[Value]])","v":"Sil It - N-P/DQ4986"}]
["Sil It","Sub Product 4","X-S/DQ9478",{"$f":"Table1[[#This Row],[Row]]&IF(Table1[[#This Row],[Value]]=\"\",\"\",\" - \"&Table1[[#This Row],[Value]])","v":"Sil It - X-S/DQ9478"}]
["Sil It","Sub Product 5","J-F/DQ8109",{"$f":"Table1[[#This Row],[Row]]&IF(Table1[[#This Row],[Value]]=\"\",\"\",\" - \"&Table1[[#This Row],[Value]])","v":"Sil It - J-F/DQ8109"}]
["Sil It","Sub Product 6","V-V/DQ4594",{"$f":"Table1[[#This Row],[Row]]&IF(Table1[[#This Row],[Value]]=\"\",\"\",\" - \"&Table1[[#This Row],[Value]])","v":"Sil It - V-V/DQ4594"}]
["Sil It","Sub Product 7","Q-K/DQ4132",{"$f":"Table1[[#This Row],[Row]]&IF(Table1[[#This Row],[Value]]=\"\",\"\",\" - \"&Table1[[#This Row],[Value]])","v":"Sil It - Q-K/DQ4132"}]
["Re Zoztex","Sub Product 1",null,{"$f":"Table1[[#This Row],[Row]]&IF(Table1[[#This Row],[Value]]=\"\",\"\",\" - \"&Table1[[#This Row],[Value]])","v":"Re Zoztex"}]
["Re Zoztex","Sub Product 2","F-E/DQ4809",{"$f":"Table1[[#This Row],[Row]]&IF(Table1[[#This Row],[Value]]=\"\",\"\",\" - \"&Table1[[#This Row],[Value]])","v":"Re Zoztex - F-E/DQ4809"}]
["Re Zoztex","Sub Product 3","P-N/DQ1239",{"$f":"Table1[[#This Row],[Row]]&IF(Table1[[#This Row],[Value]]=\"\",\"\",\" - \"&Table1[[#This Row],[Value]])","v":"Re Zoztex - P-N/DQ1239"}]
["Re Zoztex","Sub Product 4","S-X/DQ6329",{"$f":"Table1[[#This Row],[Row]]&IF(Table1[[#This Row],[Value]]=\"\",\"\",\" - \"&Table1[[#This Row],[Value]])","v":"Re Zoztex - S-X/DQ6329"}]
["Re Zoztex","Sub Product 5","I-O/DQ5603",{"$f":"Table1[[#This Row],[Row]]&IF(Table1[[#This Row],[Value]]=\"\",\"\",\" - \"&Table1[[#This Row],[Value]])","v":"Re Zoztex - I-O/DQ5603"}]
["Re Zoztex","Sub Product 6","I-R/DQ4357",{"$f":"Table1[[#This Row],[Row]]&IF(Table1[[#This Row],[Value]]=\"\",\"\",\" - \"&Table1[[#This Row],[Value]])","v":"Re Zoztex - I-R/DQ4357"}]
["Re Zoztex","Sub Product 7","K-A/DQ4274",{"$f":"Table1[[#This Row],[Row]]&IF(Table1[[#This Row],[Value]]=\"\",\"\",\" - \"&Table1[[#This Row],[Value]])","v":"Re Zoztex - K-A/DQ4274"}]
["Labfan","Sub Product 1",null,{"$f":"Table1[[#This Row],[Row]]&IF(Table1[[#This Row],[Value]]=\"\",\"\",\" - \"&Table1[[#This Row],[Value]])","v":"Labfan"}]
["Labfan","Sub Product 2","B-K/DQ8375",{"$f":"Table1[[#This Row],[Row]]&IF(Table1[[#This Row],[Value]]=\"\",\"\",\" - \"&Table1[[#This Row],[Value]])","v":"Labfan - B-K/DQ8375"}]
["Labfan","Sub Product 3","H-F/DQ4313",{"$f":"Table1[[#This Row],[Row]]&IF(Table1[[#This Row],[Value]]=\"\",\"\",\" - \"&Table1[[#This Row],[Value]])","v":"Labfan - H-F/DQ4313"}]
["Labfan","Sub Product 4","C-C/DQ1150",{"$f":"Table1[[#This Row],[Row]]&IF(Table1[[#This Row],[Value]]=\"\",\"\",\" - \"&Table1[[#This Row],[Value]])","v":"Labfan - C-C/DQ1150"}]
["Labfan","Sub Product 5","L-C/DQ9449",{"$f":"Table1[[#This Row],[Row]]&IF(Table1[[#This Row],[Value]]=\"\",\"\",\" - \"&Table1[[#This Row],[Value]])","v":"Labfan - L-C/DQ9449"}]
["Labfan","Sub Product 6","W-Z/DQ9017",{"$f":"Table1[[#This Row],[Row]]&IF(Table1[[#This Row],[Value]]=\"\",\"\",\" - \"&Table1[[#This Row],[Value]])","v":"Labfan - W-Z/DQ9017"}]
["Labfan","Sub Product 7","B-P/DQ9089",{"$f":"Table1[[#This Row],[Row]]&IF(Table1[[#This Row],[Value]]=\"\",\"\",\" - \"&Table1[[#This Row],[Value]])","v":"Labfan - B-P/DQ9089"}]
["Canex","Sub Product 1",null,{"$f":"Table1[[#This Row],[Row]]&IF(Table1[[#This Row],[Value]]=\"\",\"\",\" - \"&Table1[[#This Row],[Value]])","v":"Canex"}]
["Canex","Sub Product 2","W-Q/DQ1827",{"$f":"Table1[[#This Row],[Row]]&IF(Table1[[#This Row],[Value]]=\"\",\"\",\" - \"&Table1[[#This Row],[Value]])","v":"Canex - W-Q/DQ1827"}]
["Canex","Sub Product 3","Z-X/DQ5599",{"$f":"Table1[[#This Row],[Row]]&IF(Table1[[#This Row],[Value]]=\"\",\"\",\" - \"&Table1[[#This Row],[Value]])","v":"Canex - Z-X/DQ5599"}]
["Canex","Sub Product 4","H-Y/DQ3392",{"$f":"Table1[[#This Row],[Row]]&IF(Table1[[#This Row],[Value]]=\"\",\"\",\" - \"&Table1[[#This Row],[Value]])","v":"Canex - H-Y/DQ3392"}]
["Canex","Sub Product 5","G-O/DQ8134",{"$f":"Table1[[#This Row],[Row]]&IF(Table1[[#This Row],[Value]]=\"\",\"\",\" - \"&Table1[[#This Row],[Value]])","v":"Canex - G-O/DQ8134"}]
["Canex","Sub Product 6","P-Z/DQ1145",{"$f":"Table1[[#This Row],[Row]]&IF(Table1[[#This Row],[Value]]=\"\",\"\",\" - \"&Table1[[#This Row],[Value]])","v":"Canex - P-Z/DQ1145"}]
["Canex","Sub Product 7","S-T/DQ9864",{"$f":"Table1[[#This Row],[Row]]&IF(Table1[[#This Row],[Value]]=\"\",\"\",\" - \"&Table1[[#This Row],[Value]])","v":"Canex - S-T/DQ9864"}]
["Kinsing","Sub Product 1",null,{"$f":"Table1[[#This Row],[Row]]&IF(Table1[[#This Row],[Value]]=\"\",\"\",\" - \"&Table1[[#This Row],[Value]])","v":"Kinsing"}]
["Kinsing","Sub Product 2","D-O/DQ9948",{"$f":"Table1[[#This Row],[Row]]&IF(Table1[[#This Row],[Value]]=\"\",\"\",\" - \"&Table1[[#This Row],[Value]])","v":"Kinsing - D-O/DQ9948"}]
["Kinsing","Sub Product 3","I-C/DQ8877",{"$f":"Table1[[#This Row],[Row]]&IF(Table1[[#This Row],[Value]]=\"\",\"\",\" - \"&Table1[[#This Row],[Value]])","v":"Kinsing - I-C/DQ8877"}]
["Kinsing","Sub Product 4","A-X/DQ1627",{"$f":"Table1[[#This Row],[Row]]&IF(Table1[[#This Row],[Value]]=\"\",\"\",\" - \"&Table1[[#This Row],[Value]])","v":"Kinsing - A-X/DQ1627"}]
["Kinsing","Sub Product 5","U-L/DQ6403",{"$f":"Table1[[#This Row],[Row]]&IF(Table1[[#This Row],[Value]]=\"\",\"\",\" - \"&Table1[[#This Row],[Value]])","v":"Kinsing - U-L/DQ6403"}]
["Kinsing","Sub Product 6","O-E/DQ6432",{"$f":"Table1[[#This Row],[Row]]&IF(Table1[[#This Row],[Value]]=\"\",\"\",\" - \"&Table1[[#This Row],[Value]])","v":"Kinsing - O-E/DQ6432"}]
["Kinsing","Sub Product 7","T-V/DQ6488",{"$f":"Table1[[#This Row],[Row]]&IF(Table1[[#This Row],[Value]]=\"\",\"\",\" - \"&Table1[[#This Row],[Value]])","v":"Kinsing - T-V/DQ6488"}]
["Geo-Dax","Sub Product 1",null,{"$f":"Table1[[#This Row],[Row]]&IF(Table1[[#This Row],[Value]]=\"\",\"\",\" - \"&Table1[[#This Row],[Value]])","v":"Geo-Dax"}]
["Geo-Dax","Sub Product 2","N-M/DQ4637",{"$f":"Table1[[#This Row],[Row]]&IF(Table1[[#This Row],[Value]]=\"\",\"\",\" - \"&Table1[[#This Row],[Value]])","v":"Geo-Dax - N-M/DQ4637"}]
["Geo-Dax","Sub Product 3","Z-F/DQ9504",{"$f":"Table1[[#This Row],[Row]]&IF(Table1[[#This Row],[Value]]=\"\",\"\",\" - \"&Table1[[#This Row],[Value]])","v":"Geo-Dax - Z-F/DQ9504"}]
["Geo-Dax","Sub Product 4","R-N/DQ8726",{"$f":"Table1[[#This Row],[Row]]&IF(Table1[[#This Row],[Value]]=\"\",\"\",\" - \"&Table1[[#This Row],[Value]])","v":"Geo-Dax - R-N/DQ8726"}]
["Geo-Dax","Sub Product 5","E-Q/DQ8209",{"$f":"Table1[[#This Row],[Row]]&IF(Table1[[#This Row],[Value]]=\"\",\"\",\" - \"&Table1[[#This Row],[Value]])","v":"Geo-Dax - E-Q/DQ8209"}]
["Geo-Dax","Sub Product 6","O-Z/DQ2286",{"$f":"Table1[[#This Row],[Row]]&IF(Table1[[#This Row],[Value]]=\"\",\"\",\" - \"&Table1[[#This Row],[Value]])","v":"Geo-Dax - O-Z/DQ2286"}]
["Geo-Dax","Sub Product 7","I-B/DQ1744",{"$f":"Table1[[#This Row],[Row]]&IF(Table1[[#This Row],[Value]]=\"\",\"\",\" - \"&Table1[[#This Row],[Value]])","v":"Geo-Dax - I-B/DQ1744"}]
["Freesoft","Sub Product 1",null,{"$f":"Table1[[#This Row],[Row]]&IF(Table1[[#This Row],[Value]]=\"\",\"\",\" - \"&Table1[[#This Row],[Value]])","v":"Freesoft"}]
["Freesoft","Sub Product 2","N-Y/DQ6967",{"$f":"Table1[[#This Row],[Row]]&IF(Table1[[#This Row],[Value]]=\"\",\"\",\" - \"&Table1[[#This Row],[Value]])","v":"Freesoft - N-Y/DQ6967"}]
["Freesoft","Sub Product 3","A-R/DQ8303",{"$f":"Table1[[#This Row],[Row]]&IF(Table1[[#This Row],[Value]]=\"\",\"\",\" - \"&Table1[[#This Row],[Value]])","v":"Freesoft - A-R/DQ8303"}]
["Freesoft","Sub Product 4","H-A/DQ8782",{"$f":"Table1[[#This Row],[Row]]&IF(Table1[[#This Row],[Value]]=\"\",\"\",\" - \"&Table1[[#This Row],[Value]])","v":"Freesoft - H-A/DQ8782"}]
["Freesoft","Sub Product 5","P-R/DQ1717",{"$f":"Table1[[#This Row],[Row]]&IF(Table1[[#This Row],[Value]]=\"\",\"\",\" - \"&Table1[[#This Row],[Value]])","v":"Freesoft - P-R/DQ1717"}]
["Freesoft","Sub Product 6","H-C/DQ9144",{"$f":"Table1[[#This Row],[Row]]&IF(Table1[[#This Row],[Value]]=\"\",\"\",\" - \"&Table1[[#This Row],[Value]])","v":"Freesoft - H-C/DQ9144"}]
["Freesoft","Sub Product 7","F-S/DQ3434",{"$f":"Table1[[#This Row],[Row]]&IF(Table1[[#This Row],[Value]]=\"\",\"\",\" - \"&Table1[[#This Row],[Value]])","v":"Freesoft - F-S/DQ3434"}]
["Via Kix","Sub Product 1",null,{"$f":"Table1[[#This Row],[Row]]&IF(Table1[[#This Row],[Value]]=\"\",\"\",\" - \"&Table1[[#This Row],[Value]])","v":"Via Kix"}]
["Via Kix","Sub Product 2","B-J/DQ8771",{"$f":"Table1[[#This Row],[Row]]&IF(Table1[[#This Row],[Value]]=\"\",\"\",\" - \"&Table1[[#This Row],[Value]])","v":"Via Kix - B-J/DQ8771"}]
["Via Kix","Sub Product 3","F-S/DQ3920",{"$f":"Table1[[#This Row],[Row]]&IF(Table1[[#This Row],[Value]]=\"\",\"\",\" - \"&Table1[[#This Row],[Value]])","v":"Via Kix - F-S/DQ3920"}]
["Via Kix","Sub Product 4","D-G/DQ8328",{"$f":"Table1[[#This Row],[Row]]&IF(Table1[[#This Row],[Value]]=\"\",\"\",\" - \"&Table1[[#This Row],[Value]])","v":"Via Kix - D-G/DQ8328"}]
["Via Kix","Sub Product 5","C-B/DQ1806",{"$f":"Table1[[#This Row],[Row]]&IF(Table1[[#This Row],[Value]]=\"\",\"\",\" - \"&Table1[[#This Row],[Value]])","v":"Via Kix - C-B/DQ1806"}]
["Via Kix","Sub Product 6","G-Z/DQ2323",{"$f":"Table1[[#This Row],[Row]]&IF(Table1[[#This Row],[Value]]=\"\",\"\",\" - \"&Table1[[#This Row],[Value]])","v":"Via Kix - G-Z/DQ2323"}]
["Via Kix","Sub Product 7","T-T/DQ8641",{"$f":"Table1[[#This Row],[Row]]&IF(Table1[[#This Row],[Value]]=\"\",\"\",\" - \"&Table1[[#This Row],[Value]])","v":"Via Kix - T-T/DQ8641"}]
["Kan-Dom","Sub Product 1",null,{"$f":"Table1[[#This Row],[Row]]&IF(Table1[[#This Row],[Value]]=\"\",\"\",\" - \"&Table1[[#This Row],[Value]])","v":"Kan-Dom"}]
["Kan-Dom","Sub Product 2","I-S/DQ2111",{"$f":"Table1[[#This Row],[Row]]&IF(Table1[[#This Row],[Value]]=\"\",\"\",\" - \"&Table1[[#This Row],[Value]])","v":"Kan-Dom - I-S/DQ2111"}]
["Kan-Dom","Sub Product 3","L-J/DQ7510",{"$f":"Table1[[#This Row],[Row]]&IF(Table1[[#This Row],[Value]]=\"\",\"\",\" - \"&Table1[[#This Row],[Value]])","v":"Kan-Dom - L-J/DQ7510"}]
["Kan-Dom","Sub Product 4","C-K/DQ5503",{"$f":"Table1[[#This Row],[Row]]&IF(Table1[[#This Row],[Value]]=\"\",\"\",\" - \"&Table1[[#This Row],[Value]])","v":"Kan-Dom - C-K/DQ5503"}]
["Kan-Dom","Sub Product 5","Z-V/DQ2269",{"$f":"Table1[[#This Row],[Row]]&IF(Table1[[#This Row],[Value]]=\"\",\"\",\" - \"&Table1[[#This Row],[Value]])","v":"Kan-Dom - Z-V/DQ2269"}]
["Kan-Dom","Sub Product 6","Z-N/DQ6435",{"$f":"Table1[[#This Row],[Row]]&IF(Table1[[#This Row],[Value]]=\"\",\"\",\" - \"&Table1[[#This Row],[Value]])","v":"Kan-Dom - Z-N/DQ6435"}]
["Kan-Dom","Sub Product 7","S-Q/DQ1078",{"$f":"Table1[[#This Row],[Row]]&IF(Table1[[#This Row],[Value]]=\"\",\"\",\" - \"&Table1[[#This Row],[Value]])","v":"Kan-Dom - S-Q/DQ1078"}]

{"sheet":"Sheet1","index":5,"n_rows":105,"n_cols":9,"rows_kept":105,"cut":false,"hidden":false,"merged":[]}
[]
[]
["Count of Value","Column Labels"]
["Row Labels","Sub Product 1","Sub Product 2","Sub Product 3","Sub Product 4","Sub Product 5","Sub Product 6","Sub Product 7","Grand Total"]
["Airdex",null,1,1,1,1,1,1,6]
["Air-Trax",null,1,1,1,1,1,1,6]
["Antex",null,1,1,1,1,1,1,6]
["Biofresh",null,1,1,1,1,1,1,6]
["Biosing",null,1,1,1,1,1,1,6]
["Black Silflex",null,1,1,1,1,1,1,6]
["Canex",null,1,1,1,1,1,1,6]
["Canhotin",null,1,1,1,1,1,1,6]
["Contom",null,1,1,1,1,1,1,6]
["Donlab",null,1,1,1,1,1,1,6]
["Donlam",null,1,1,1,1,1,1,6]
["Doublehome",null,1,1,1,1,1,1,6]
["Duolux",null,1,1,1,1,1,1,6]
["Duotouch",null,1,1,1,1,1,1,6]
["Ecotone",null,1,1,1,1,1,1,6]
["Freesoft",null,1,1,1,1,1,1,6]
["Freetaming",null,1,1,1,1,1,1,6]
["Geo Fan",null,1,1,1,1,1,1,6]
["Geo-Dax",null,1,1,1,1,1,1,6]
["Geoeco",null,1,1,1,1,1,1,6]
["Greeneco",null,1,1,1,1,1,1,6]
["Home Ron",null,1,1,1,1,1,1,6]
["Home-Fix",null,1,1,1,1,1,1,6]
["Hottrax",null,1,1,1,1,1,1,6]
["Inhold",null,1,1,1,1,1,1,6]
["Joyis",null,1,1,1,1,1,1,6]
["Kan-Dom",null,1,1,1,1,1,1,6]
["Kanflex",null,1,1,1,1,1,1,6]
["Kin-Light",null,1,1,1,1,1,1,6]
["Kinsing",null,1,1,1,1,1,1,6]
["Konk Tinstock",null,1,1,1,1,1,1,6]
["Konkstatis",null,1,1,1,1,1,1,6]
["Labfan",null,1,1,1,1,1,1,6]
["Labfax",null,1,1,1,1,1,1,6]
["Laeco",null,1,1,1,1,1,1,6]
["Lam-Find",null,1,1,1,1,1,1,6]
["Lamhold",null,1,1,1,1,1,1,6]
["Lam-Top",null,1,1,1,1,1,1,6]
["Lexiair",null,1,1,1,1,1,1,6]
["Lot String",null,1,1,1,1,1,1,6]
["Mathtip",null,1,1,1,1,1,1,6]
["Move Jaytop",null,1,1,1,1,1,1,6]
["Nameco",null,1,1,1,1,1,1,6]
["New Cof",null,1,1,1,1,1,1,6]
["Nimtex",null,1,1,1,1,1,1,6]
["Opedax",null,1,1,1,1,1,1,6]
["Plus Zap",null,1,1,1,1,1,1,6]
["Quad Joytax",null,1,1,1,1,1,1,6]
["Quotejob",null,1,1,1,1,1,1,6]
["Ranity",null,1,1,1,1,1,1,6]
["Re Zoztex",null,1,1,1,1,1,1,6]
["Roneco",null,1,1,1,1,1,1,6]
["Saillux",null,1,1,1,1,1,1,6]
["Salt Damwarm",null,1,1,1,1,1,1,6]
["Sanlam",null,1,1,1,1,1,1,6]
["Scottrax",null,1,1,1,1,1,1,6]
["S-eco",null,1,1,1,1,1,1,6]
["Sil It",null,1,1,1,1,1,1,6]
["Silver Traxsing",null,1,1,1,1,1,1,6]
["Silverdom",null,1,1,1,1,1,1,6]
["Silver-Touch",null,1,1,1,1,1,1,6]
["Single Zimfax",null,1,1,1,1,1,1,6]
["S-kix",null,1,1,1,1,1,1,6]
["S-lab",null,1,1,1,1,1,1,6]
["Softdex",null,1,1,1,1,1,1,6]
["Softsoft",null,1,1,1,1,1,1,6]
["Stanity",null,1,1,1,1,1,1,6]
["Stat-La",null,1,1,1,1,1,1,6]
["Stimlax",null,1,1,1,1,1,1,6]
["Stock Hotex",null,1,1,1,1,1,1,6]
["Stock Touch",null,1,1,1,1,1,1,6]
["Stockdox",null,1,1,1,1,1,1,6]
["Strongtax",null,1,1,1,1,1,1,6]
["Sublax",null,1,1,1,1,1,1,6]
["Sum-Home",null,1,1,1,1,1,1,6]
["Sumremjob",null,1,1,1,1,1,1,6]
["Super Damlex",null,1,1,1,1,1,1,6]
["Tam Cof",null,1,1,1,1,1,1,6]
["Tin Tam",null,1,1,1,1,1,1,6]
["Toncore",null,1,1,1,1,1,1,6]
["Topair",null,1,1,1,1,1,1,6]
["Toptax",null,1,1,1,1,1,1,6]
["Touchfresh",null,1,1,1,1,1,1,6]
["Touch-Lam",null,1,1,1,1,1,1,6]
["Touchtone",null,1,1,1,1,1,1,6]
["Trantraxbam",null,1,1,1,1,1,1,6]
["Tripple Apin",null,1,1,1,1,1,1,6]
["Trustlex",null,1,1,1,1,1,1,6]
["Unoin",null,1,1,1,1,1,1,6]
["Via Kix",null,1,1,1,1,1,1,6]
["Viafax",null,1,1,1,1,1,1,6]
["Viais",null,1,1,1,1,1,1,6]
["Volt Tanstock",null,1,1,1,1,1,1,6]
["Y- Lax",null,1,1,1,1,1,1,6]
["Year Quolex",null,1,1,1,1,1,1,6]
["Zath-Lex",null,1,1,1,1,1,1,6]
["Zen Strong",null,1,1,1,1,1,1,6]
["Zenjob",null,1,1,1,1,1,1,6]
["Zentom",null,1,1,1,1,1,1,6]
["Zim Lax",null,1,1,1,1,1,1,6]
["Grand Total",null,100,100,100,100,100,100,600]

{"sheet":"(1033)","index":6,"n_rows":109,"n_cols":10,"rows_kept":109,"cut":false,"hidden":false,"merged":[]}
["Original Post:"]
["Mr Excel & excelisfun Trick 134: Merge Product and Sub-Product Text; VBA or Wild INDEX Formula "]
["https://www.youtube.com/watch?v=i8Q8V9M_cRc"]
[]
["Maartenmarsje at YouTube in comments"]
[]
["From This:",null,null,null,null,null,null,null,null,"To This:"]
[]
["Product","Sub Product 1","Sub Product 2","Sub Product 3","Sub Product 4","Sub Product 5","Sub Product 6","Sub Product 7",null,"Join Text"]
["Geo Fan",null,"J-V/DQ1477","N-Y/DQ3773","B-Z/DQ7827","M-W/DQ6663","R-A/DQ8080","S-S/DQ4315",null,"Geo Fan"]
["Kin-Light",null,"S-O/DQ9675","F-Z/DQ5663","T-Y/DQ3628","B-T/DQ6204","S-S/DQ1007","S-R/DQ3874",null,"Geo Fan - J-V/DQ1477"]
["Stock Hotex",null,"W-F/DQ4209","K-I/DQ4485","J-O/DQ5352","Y-V/DQ1863","V-S/DQ1390","J-C/DQ8654",null,"Geo Fan - N-Y/DQ3773"]
["Konk Tinstock",null,"N-R/DQ9237","K-Q/DQ9170","W-I/DQ7389","G-Z/DQ3645","H-K/DQ8345","I-S/DQ3284",null,"Geo Fan - B-Z/DQ7827"]
["Silver-Touch",null,"F-Z/DQ7971","C-X/DQ9559","C-P/DQ9259","R-T/DQ3009","H-F/DQ9091","Z-F/DQ8491",null,"Geo Fan - M-W/DQ6663"]
["S-eco",null,"X-O/DQ2585","R-L/DQ5437","F-G/DQ1353","Q-X/DQ3038","F-H/DQ7618","C-R/DQ6413",null,"Geo Fan - R-A/DQ8080"]
["Unoin",null,"F-U/DQ2015","V-V/DQ1486","G-S/DQ3365","J-J/DQ8974","K-A/DQ1284","P-N/DQ7205",null,"Geo Fan - S-S/DQ4315"]
["Laeco",null,"Y-V/DQ6202","R-T/DQ1158","F-P/DQ2866","Q-Z/DQ9290","T-D/DQ5678","V-V/DQ1452",null,"Kin-Light"]
["Touch-Lam",null,"O-G/DQ1258","B-M/DQ7666","E-F/DQ8623","N-H/DQ1331","A-B/DQ3518","A-S/DQ7923",null,"Kin-Light - S-O/DQ9675"]
["Lot String",null,"G-J/DQ7020","Z-X/DQ5056","T-X/DQ1948","O-M/DQ4209","R-X/DQ8489","K-F/DQ8350",null,"Kin-Light - F-Z/DQ5663"]
["Toncore",null,"B-Q/DQ1113","S-J/DQ8641","T-O/DQ6035","O-D/DQ2138","A-Y/DQ5852","A-P/DQ6874",null,"Kin-Light - T-Y/DQ3628"]
["Greeneco",null,"Z-D/DQ3486","V-L/DQ2156","S-W/DQ3812","O-J/DQ4817","W-U/DQ5837","K-U/DQ5815",null,"Kin-Light - B-T/DQ6204"]
["Airdex",null,"T-Z/DQ8308","Q-Y/DQ1201","X-T/DQ3151","T-U/DQ7219","X-P/DQ1517","Q-E/DQ3131",null,"Kin-Light - S-S/DQ1007"]
["Lamhold",null,"C-D/DQ9157","P-K/DQ1400","G-M/DQ3192","G-S/DQ5812","O-X/DQ5678","V-P/DQ8051",null,"Kin-Light - S-R/DQ3874"]
["Biosing",null,"E-I/DQ8446","D-L/DQ9756","L-O/DQ5650","I-D/DQ6108","O-W/DQ1349","O-J/DQ3480"]
["Viais",null,"Z-X/DQ5986","Q-X/DQ5295","B-D/DQ7046","Q-O/DQ4384","E-P/DQ1000","H-A/DQ4471"]
["Zim Lax",null,"N-D/DQ2280","W-K/DQ4119","I-L/DQ5301","Z-M/DQ9782","M-O/DQ2381","D-X/DQ6309"]
["S-lab",null,"Y-S/DQ3406","J-L/DQ1112","Z-Q/DQ1200","Q-E/DQ6957","K-X/DQ6856","C-W/DQ5579"]
["Stanity",null,"R-U/DQ4312","N-X/DQ1329","M-K/DQ7985","U-T/DQ3735","A-X/DQ5877","P-Y/DQ5472"]
["Contom",null,"H-C/DQ2317","X-V/DQ6726","C-B/DQ5190","Q-Y/DQ2021","E-E/DQ5627","A-K/DQ5855"]
["Lam-Top",null,"T-E/DQ7702","S-M/DQ3163","B-I/DQ6623","U-G/DQ3097","V-D/DQ3996","U-N/DQ7711"]
["Trantraxbam",null,"C-T/DQ4565","Z-F/DQ1695","V-V/DQ3074","V-P/DQ9688","S-M/DQ1541","G-E/DQ8061"]
["Silver Traxsing",null,"N-V/DQ7788","R-O/DQ1810","E-X/DQ4308","T-D/DQ7728","Y-J/DQ5551","D-M/DQ7097"]
["Softdex",null,"F-G/DQ1406","M-B/DQ8930","L-R/DQ1359","I-P/DQ1241","C-I/DQ3156","R-B/DQ8080"]
["Air-Trax",null,"I-Y/DQ6462","U-B/DQ2419","Y-X/DQ9909","J-E/DQ2773","V-E/DQ6312","E-T/DQ4131"]
["Labfax",null,"W-U/DQ4000","Z-G/DQ3343","U-F/DQ2988","T-R/DQ1925","Z-P/DQ7423","Z-P/DQ9403"]
["Konkstatis",null,"H-T/DQ7055","V-Y/DQ8364","U-Z/DQ3697","N-H/DQ9038","L-N/DQ1973","G-T/DQ5579"]
["Touchtone",null,"D-O/DQ4093","D-C/DQ1506","X-V/DQ3046","Z-T/DQ8406","R-G/DQ2487","O-G/DQ9131"]
["Ecotone",null,"L-M/DQ2346","W-H/DQ7772","H-O/DQ8735","Y-R/DQ3598","E-Y/DQ1323","C-Q/DQ1220"]
["Sublax",null,"K-Z/DQ1958","E-T/DQ1182","D-V/DQ2263","F-Q/DQ1782","F-W/DQ1945","F-J/DQ1793"]
["Donlab",null,"M-U/DQ5037","E-B/DQ7006","R-Q/DQ3540","I-I/DQ2681","G-U/DQ4067","N-R/DQ9996"]
["Freetaming",null,"P-U/DQ7673","D-V/DQ8854","K-H/DQ9072","G-I/DQ6806","M-M/DQ3184","B-V/DQ1806"]
["Volt Tanstock",null,"E-V/DQ1711","D-D/DQ3113","U-H/DQ3939","V-W/DQ2342","B-C/DQ4270","J-N/DQ2005"]
["Single Zimfax",null,"Q-K/DQ8122","X-H/DQ4021","F-K/DQ3308","H-O/DQ8072","D-Z/DQ6642","P-Q/DQ7285"]
["Nameco",null,"A-E/DQ4006","M-L/DQ5420","A-I/DQ5311","G-N/DQ5865","O-O/DQ6738","I-O/DQ8975"]
["Canhotin",null,"X-C/DQ7536","H-O/DQ5982","U-U/DQ6424","C-S/DQ9155","O-K/DQ2805","I-S/DQ2919"]
["Opedax",null,"V-K/DQ5620","I-A/DQ6402","O-C/DQ1475","U-V/DQ5750","D-W/DQ9169","X-U/DQ4908"]
["Touchfresh",null,"H-C/DQ4665","C-D/DQ6489","R-H/DQ7954","D-D/DQ1228","X-K/DQ6699","D-V/DQ9848"]
["Inhold",null,"V-U/DQ3537","J-U/DQ9185","Y-X/DQ3832","Y-L/DQ3782","L-R/DQ2810","O-M/DQ5259"]
["Saillux",null,"K-S/DQ7277","C-S/DQ6120","J-Y/DQ3382","E-R/DQ2393","P-M/DQ2704","C-C/DQ7661"]
["Zenjob",null,"D-O/DQ9424","Z-X/DQ3592","E-D/DQ7789","A-P/DQ7456","M-R/DQ7298","H-S/DQ3032"]
["Sum-Home",null,"R-Y/DQ1205","H-I/DQ6676","T-G/DQ3044","V-P/DQ4500","M-I/DQ1594","X-S/DQ9659"]
["Topair",null,"G-H/DQ5891","B-G/DQ5422","A-L/DQ3927","F-N/DQ5639","S-Y/DQ1460","W-T/DQ2891"]
["New Cof",null,"A-E/DQ8571","O-B/DQ2118","S-B/DQ3332","J-I/DQ4049","C-D/DQ1103","Q-Z/DQ3080"]
["Silverdom",null,"V-Q/DQ2006","I-H/DQ3986","S-Y/DQ9987","K-W/DQ9789","M-V/DQ6609","E-G/DQ1666"]
["Black Silflex",null,"V-T/DQ8139","M-U/DQ4261","E-M/DQ5191","U-T/DQ6381","T-V/DQ3190","M-I/DQ7893"]
["Zentom",null,"H-O/DQ8291","U-M/DQ2997","D-V/DQ2055","S-F/DQ1630","E-Y/DQ9811","R-D/DQ1916"]
["Antex",null,"U-V/DQ8524","H-O/DQ2807","Y-G/DQ8263","K-X/DQ7690","T-F/DQ6604","X-M/DQ8067"]
["Ranity",null,"M-W/DQ2718","D-W/DQ8974","I-F/DQ8856","E-P/DQ3003","P-J/DQ5975","A-Y/DQ1109"]
["S-kix",null,"K-G/DQ2749","P-J/DQ4709","N-X/DQ2600","B-T/DQ9604","R-W/DQ6294","O-U/DQ2096"]
["Zath-Lex",null,"M-X/DQ6178","C-U/DQ1618","O-P/DQ3023","S-T/DQ8619","V-O/DQ9170","P-J/DQ3470"]
["Tin Tam",null,"V-E/DQ3168","X-O/DQ7726","K-Q/DQ3777","G-C/DQ5626","S-D/DQ7723","R-X/DQ8582"]
["Home-Fix",null,"V-K/DQ4188","W-D/DQ9139","S-W/DQ7140","G-J/DQ2389","L-J/DQ9015","D-D/DQ9127"]
["Strongtax",null,"C-B/DQ7246","S-Z/DQ9931","I-U/DQ6209","R-D/DQ7972","C-N/DQ7927","J-I/DQ6121"]
["Scottrax",null,"V-B/DQ7247","R-B/DQ5325","Y-I/DQ1428","R-P/DQ3760","M-X/DQ6435","U-O/DQ2357"]
["Home Ron",null,"W-Q/DQ8964","B-X/DQ4767","A-V/DQ6228","I-T/DQ7745","R-L/DQ1239","Z-L/DQ1190"]
["Mathtip",null,"Q-Z/DQ9353","U-E/DQ3079","U-C/DQ9253","U-I/DQ9502","A-Z/DQ1514","F-H/DQ4922"]
["Quad Joytax",null,"U-G/DQ9961","O-N/DQ4189","R-C/DQ7978","X-B/DQ4884","V-P/DQ6114","P-B/DQ6522"]
["Quotejob",null,"A-L/DQ2468","G-J/DQ5678","H-P/DQ9164","C-G/DQ5033","H-E/DQ7018","X-Z/DQ7564"]
["Zen Strong",null,"B-N/DQ7372","C-E/DQ2712","W-Y/DQ2767","Q-K/DQ8866","H-Y/DQ3836","K-I/DQ2152"]
["Stock Touch",null,"V-B/DQ6141","F-K/DQ9978","G-T/DQ4323","E-G/DQ1291","Q-N/DQ9494","X-A/DQ3304"]
["Stockdox",null,"G-J/DQ1262","M-E/DQ9467","T-M/DQ6911","V-W/DQ3008","J-Q/DQ4683","W-D/DQ1503"]
["Y- Lax",null,"L-W/DQ7254","S-I/DQ5658","V-Z/DQ8574","A-L/DQ9394","I-O/DQ2393","E-U/DQ4627"]
["Duolux",null,"W-H/DQ3557","N-L/DQ2999","F-C/DQ1983","X-Q/DQ9087","J-X/DQ8959","Z-V/DQ3936"]
["Biofresh",null,"L-A/DQ6923","U-X/DQ7740","H-S/DQ8103","C-E/DQ2233","O-I/DQ5625","F-G/DQ6422"]
["Lam-Find",null,"L-B/DQ6600","J-J/DQ6636","T-F/DQ7235","L-E/DQ5363","S-C/DQ9729","K-U/DQ6401"]
["Sanlam",null,"U-G/DQ2593","I-N/DQ8908","N-K/DQ7667","C-X/DQ2549","I-I/DQ4036","P-F/DQ5733"]
["Lexiair",null,"N-I/DQ8055","B-X/DQ9278","B-W/DQ6317","P-S/DQ6855","C-L/DQ3860","Z-D/DQ9878"]
["Stat-La",null,"V-R/DQ3359","V-H/DQ7313","F-F/DQ5200","J-Q/DQ5746","A-Q/DQ5080","F-V/DQ2552"]
["Move Jaytop",null,"T-O/DQ7238","F-D/DQ6648","K-A/DQ9049","H-O/DQ2208","I-Z/DQ5486","X-Y/DQ4699"]
["Hottrax",null,"J-H/DQ6022","G-H/DQ5842","W-B/DQ2309","C-L/DQ5586","W-F/DQ3438","X-R/DQ3727"]
["Doublehome",null,"I-X/DQ1764","F-V/DQ9308","G-E/DQ9441","D-P/DQ4540","A-C/DQ5093","P-M/DQ5272"]
["Geoeco",null,"K-I/DQ6541","O-A/DQ4828","L-B/DQ5503","U-G/DQ1778","D-V/DQ5889","N-C/DQ6848"]
["Nimtex",null,"H-V/DQ2801","A-F/DQ3370","E-R/DQ2577","Y-G/DQ7693","P-X/DQ1156","Z-T/DQ1399"]
["Roneco",null,"D-D/DQ9977","W-U/DQ9156","B-F/DQ9761","G-J/DQ8671","M-Z/DQ2823","Y-S/DQ7569"]
["Super Damlex",null,"X-K/DQ5825","B-M/DQ4799","F-Y/DQ7680","E-K/DQ5609","X-H/DQ4124","T-L/DQ1506"]
["Donlam",null,"I-C/DQ1599","M-W/DQ6736","M-U/DQ3289","D-G/DQ9953","M-K/DQ2272","B-V/DQ4292"]
["Year Quolex",null,"F-Y/DQ5679","E-W/DQ8224","N-X/DQ6670","L-Z/DQ5606","M-J/DQ6877","A-H/DQ1309"]
["Stimlax",null,"B-D/DQ7855","K-E/DQ8332","A-P/DQ4738","V-G/DQ2524","Y-O/DQ9675","N-S/DQ6800"]
["Duotouch",null,"Z-V/DQ3753","F-F/DQ5074","A-Y/DQ2802","P-R/DQ8445","Y-H/DQ6655","S-L/DQ4687"]
["Tam Cof",null,"H-V/DQ1159","I-R/DQ8841","V-Q/DQ8805","X-X/DQ6355","E-B/DQ6085","V-F/DQ3156"]
["Viafax",null,"C-U/DQ9402","B-J/DQ9539","L-F/DQ2057","O-X/DQ7355","V-V/DQ1752","R-Y/DQ2556"]
["Plus Zap",null,"F-P/DQ1528","A-R/DQ8428","P-J/DQ8896","C-P/DQ5399","X-Z/DQ5028","S-C/DQ3339"]
["Toptax",null,"P-P/DQ7924","G-O/DQ6067","Z-J/DQ8325","U-W/DQ4138","C-P/DQ4351","D-U/DQ7085"]
["Softsoft",null,"K-H/DQ9934","Z-A/DQ9772","T-X/DQ3131","I-W/DQ1963","L-L/DQ3491","R-P/DQ4740"]
["Sumremjob",null,"U-I/DQ5770","J-V/DQ1316","S-D/DQ3642","M-Z/DQ8379","I-B/DQ7976","N-C/DQ8554"]
["Kanflex",null,"M-F/DQ2070","S-Y/DQ9095","R-W/DQ8908","N-L/DQ6432","M-L/DQ8263","L-O/DQ6467"]
["Trustlex",null,"Y-G/DQ3874","O-W/DQ1250","F-T/DQ7332","V-Q/DQ9747","J-W/DQ5551","K-Y/DQ4298"]
["Joyis",null,"T-C/DQ6871","J-D/DQ9245","J-P/DQ4029","G-N/DQ6122","A-X/DQ4996","S-J/DQ6029"]
["Salt Damwarm",null,"T-F/DQ5587","Y-L/DQ9024","V-C/DQ9304","U-G/DQ8743","X-K/DQ5215","M-N/DQ7537"]
["Tripple Apin",null,"J-P/DQ7429","P-G/DQ7086","Y-L/DQ6224","I-A/DQ3124","X-R/DQ2483","K-H/DQ1008"]
["Sil It",null,"I-P/DQ8226","N-P/DQ4986","X-S/DQ9478","J-F/DQ8109","V-V/DQ4594","Q-K/DQ4132"]
["Re Zoztex",null,"F-E/DQ4809","P-N/DQ1239","S-X/DQ6329","I-O/DQ5603","I-R/DQ4357","K-A/DQ4274"]
["Labfan",null,"B-K/DQ8375","H-F/DQ4313","C-C/DQ1150","L-C/DQ9449","W-Z/DQ9017","B-P/DQ9089"]
["Canex",null,"W-Q/DQ1827","Z-X/DQ5599","H-Y/DQ3392","G-O/DQ8134","P-Z/DQ1145","S-T/DQ9864"]
["Kinsing",null,"D-O/DQ9948","I-C/DQ8877","A-X/DQ1627","U-L/DQ6403","O-E/DQ6432","T-V/DQ6488"]
["Geo-Dax",null,"N-M/DQ4637","Z-F/DQ9504","R-N/DQ8726","E-Q/DQ8209","O-Z/DQ2286","I-B/DQ1744"]
["Freesoft",null,"N-Y/DQ6967","A-R/DQ8303","H-A/DQ8782","P-R/DQ1717","H-C/DQ9144","F-S/DQ3434"]
["Via Kix",null,"B-J/DQ8771","F-S/DQ3920","D-G/DQ8328","C-B/DQ1806","G-Z/DQ2323","T-T/DQ8641"]
["Kan-Dom",null,"I-S/DQ2111","L-J/DQ7510","C-K/DQ5503","Z-V/DQ2269","Z-N/DQ6435","S-Q/DQ1078"]