{"text_format":"1","workbook":"xlsx","n_sheets":5,"sheets":["Score","P(1)","Seattle2020ComplaintDashboard","P(2)","Ave Revenue Reports"],"not_rendered":{"charts":0,"images":3,"macros":1,"external_links":0,"defined_names":0,"comments":0,"pivot_tables":0},"unopened":[],"bounds":{"document_bytes":16777216,"sheet_cells":100000,"rows_first":2000,"rows_last":500,"rows_between":2000,"halvings":0,"cell_chars":16384,"cell_head_chars":4096},"cells_cut":0,"cells_raw":0,"read":"whole","date_system":"1900"}

{"sheet":"Score","index":0,"n_rows":60,"n_cols":5,"rows_kept":60,"cut":false,"hidden":true,"merged":[[3,0,29,0],[30,0,52,0]]}
[]
[]
["Problem","Graded Element","Possible Points","Earned Points","Comment"]
[1,"Did you create dashboard on the sheet named Seattle2020ComplaintDashboard?",1,{"$f":"C4","v":1}]
[null,"Did you use worksheet function like VLOOKUP or XLOOKUP to look up Neighborhood name?",2,2]
[null,"Did you deal with the fact that the first column in lookup table had zip code numbers, but zip codes in fact table were text numbers?",6,6]
[null,"Did you create a title # 1 for your Dashboard?",1,1]
[null,"Does the title contribute to message and make the Dashboard easy to understand?",1,1]
[null,"Is the year 2020 indicated somewhere?",1,1]
[null,"For Cross Tab Pivot, Did you group dates by month in PivotTable, rather than adding column to Fact Table?",4,4]
[null,"For Cross Tab Pivot, Is Neighborhood in Rows area?",1,1]
[null,"For Cross Tab Pivot, Is Month in Columns area?",2,2]
[null,"For Cross Tab Pivot, Is the value calculation COUNT?",2,2]
[null,"For Cross Tab Pivot, Did you change the name of the calculation to \"Count of Complaints\"?",2,2]
[null,"For Cross Tab Pivot, Did you add Slicer for the \"Complaints-Violations-Short-Description\" field?",2,2]
[null,"For Cross Tab Pivot, Did you add Conditional Formatting - Color Scales to show biggest (dark blue) to middle (white) to smallest (red)?",2,2]
[null,"Is Conditional Formatting applied only to the inside of report (not to total cells)?",2,2]
[null,"Did you show multiple columns in Slicer?",2,2]
[null,"Did you create a title # 2 for your Dashboard?",1,1]
[null,"For 2nd PivotTable, is Neighborhood in Rows?",2,2]
[null,"For 2nd PivotTable, In aggregate Calculation COUNT?",2,2]
[null,"For 2nd PivotTable, did you use Show Values As % of Column Total?",4,4]
[null,"For 2nd PivotTable, Did you add Conditional Formatting - Color Scales to show biggest (dark blue) to middle (white) to smallest (red)?",2,2]
[null,"Is Conditional Formatting applied only to the inside of report (not to total cells)?",2,2]
[null,"Did you attach Slicer to second PivotTable?",2,2]
[null,"Is the Dashboard neat, for example, edges of report and slicer and title all lined up?",2,2]
[null,"Did you name both PivotTables?",2,2]
[null,"Did you add Number Formatting to both PivotTables?",2,2]
[null,"Did you use Show in Tabular Layout in both PivotTable to show Field Names?",2,2]
[null,"For 2nd PivotTable, did you name calculation \"% of Complaint Count Total\"?",1,1]
[2,"Did you Import Excel Table into the Power Pivot Data Model using Power Query?",2,2]
[null,"Did you Import CSV file into the Power Pivot Data Model using Power Query?",2,2]
[null,"Are Power Query Datya Types correct?",2,2]
[null,"Did you load to the Data Model?",2,2]
[null,"Did you NOT load data to worksheet?",2,2]
[null,"Did you create a Date Table In the Data Model?",2,2]
[null,"Did you Create Relationships between the Tables?",2,2]
[null,"Did you Create the DAX Measures:",1,{"$f":"C38","v":1}]
[null,"Total Revenue?",2,2]
[null,"Total COGS?",2,2]
[null,"Average Monthly Revenue?",5,5]
[null,"Average Daily Revenue (you can use the dDate table in 1st argument of AVERAGEX)?",5,5]
[null,"Add number format to DAX Measure for Total Revenue?",1,1]
[null,"Add number format to DAX Measure for Total COGS?",1,1]
[null,"Add number format to DAX Measure for Average Monthly Revenue?",1,1]
[null,"Add number format to DAX Measure for Average Daily Revenue (you can use the dDate table in 1st argument of AVERAGEX)?",1,1]
[null,"Indicate $ Unit in Measure name for Total Revenue?",1,1]
[null,"Indicate $ Unit in Measure name for Total COGS?",1,1]
[null,"Indicate $ Unit in Measure name for Average Monthly Revenue?",1,1]
[null,"Indicate $ Unit in Measure name for Average Daily Revenue (you can use the dDate table in 1st argument of AVERAGEX)?",1,1]
[null,"Did you Hide any fields that you do not need in the Reporting area?",2,2]
[null,"Did you name things with names that communicate their meaning?",2,2]
[null,"Did you sort the 2nd report (Ave. Rev by Day of Week) to show averages biggest to smallest?",4,4]
[]
[null,"Late?","No"]
[]
[null,"Total Possible Points",{"$f":"SUM(C4:C53)","v":100}]
[null,"Total Earned Points",null,{"$f":"IF(C55=\"No\",1,0.75)*SUM(D4:D53)","v":100}]
[]
[null,"Be Sure to Scroll Up To See Full Score Sheet"]

{"sheet":"P(1)","index":1,"n_rows":3218,"n_cols":10,"rows_kept":3218,"cut":false,"hidden":false,"merged":[]}
[]
["Instructions:"]
["Imagine that you work for the City of Seattle and you need to see how many complaints are filed by the different neighborhoods in Seattle for each month in the year 2020."]
["To do this you will create the dashboard that is seen to the right on the sheet named Seattle2020ComplaintDashboard =>"]
["The two tables of data that are needed to create this dashboard are below in this sheet in the ranges:"]
["A45:E3208 = fSeattle2020Complaints Fact table."]
["I45:J72 = dZipNeighborhood Dimension (lookup) table."]
["Because there are only about 3,000 rows of data, use worksheet formulas and a Standard PivotTable to create the Dashboard."]
["When you lookup neighborhood based on zip code in the Fact table, you will encounter a problem zip codes."]
["If you can not figure out how to resolve the problem with the zip codes, you can e-mail Michael Girvin and ask for a hint."]
["There are 8 main parts to this Dashboard:"]
["Title at top for Neighborhood and Month showing the Count of Complaints-Violations PivotTable."]
["Cross Tabulated PivotTable by Neighborhood and Month showing the Count of Complaints-Violations."]
["Conditional Formatting - Color Scales to show biggest (dark blue) to middle (white) to smallest (red). Called a \"heat map\"."]
["Slicer to show elements from \"Complaints-Violations-Short-Description\" field."]
["Title at top for % of Complaints by Neighborhood PivotTable."]
["PivotTable to show % of Complaint Count Total by Neighborhood."]
["Conditional Formatting - Color Scales to show biggest (dark blue) to middle (white) to smallest (red). Called a \"heat map\"."]
["Attach already established Slicer to 2nd PivotTable (Right-click Sliver, Report Connections)."]
["If you want to stop the PivotTable from automatically changing column widths anytime you change something:"]
["Right-click in PivotTable, PivotTable options, Layout & Format tab, uncheck \"autofit column widths on update\"."]
["Name each PivotTable: Right-click in PivotTable, PivotTable options, Layout & Format tab, textbox at top."]
["Be sure to attach Slicer to both PivotTable (Right-click Sliver, Report Connections)."]
["Hint: steps to create Conditional Formatting - Color Scales for Cross Tab PivotTable:"]
["1) Select one cell in Values area inside cross tabulated PivotTable."]
["2) Go to Home tab in Ribbon, Styles group, Conditional Formatting dropdown, Color Scales, select Blue-White-Red Color Scale."]
["3) As seen in below picture, from the Formatting Smart Tag,"]
["click dialog button for \"All cells showing \"Count of Complaints\" values for \"Neighborhood\" and \"Months\"."]
["4) Do not include Total Cells in formatting."]
[]
[]
[]
[]
[]
[]
[]
[]
["Everything should be neat. You can drag or resize Slicer while holding Alt key to get the Slicer to \"snap\" to grid."]
["Make sure that there are no elements that distract from delivering the message of \"counts by neighborhood and months\""]
[]
[]
[]
[]
[]
[]
[]
[]
[]
[]
[]
[]
[]
[]
[]
["Complaints-Violations-Short-Description","Date","Result","StatusCurrent","ZipCode","Neighborhood",null,null,"ZipCode","Neighborhood"]
["Construction","2020-10-28","Completed","Completed","98136",{"$f":"_xlfn.XLOOKUP(--fSeattle2020Complaints[[#This Row],[ZipCode]],dZipNeighborhood[ZipCode],dZipNeighborhood[Neighborhood])","v":"Seaview"},null,null,98101,"Seattle"]
["Land Use","2020-09-14","Completed","Completed","98107",{"$f":"_xlfn.XLOOKUP(--fSeattle2020Complaints[[#This Row],[ZipCode]],dZipNeighborhood[ZipCode],dZipNeighborhood[Neighborhood])","v":"Ballard"},null,null,98102,"Capital Hill"]
["Land Use","2020-09-16","Completed","Completed","98107",{"$f":"_xlfn.XLOOKUP(--fSeattle2020Complaints[[#This Row],[ZipCode]],dZipNeighborhood[ZipCode],dZipNeighborhood[Neighborhood])","v":"Ballard"},null,null,98103,"Greenwood"]
["ECA","2020-06-18","Completed","Under Investigation","98178",{"$f":"_xlfn.XLOOKUP(--fSeattle2020Complaints[[#This Row],[ZipCode]],dZipNeighborhood[ZipCode],dZipNeighborhood[Neighborhood])","v":"Skyway"},null,null,98104,"International District"]
["Construction","2020-05-12","Completed","Closed","98108",{"$f":"_xlfn.XLOOKUP(--fSeattle2020Complaints[[#This Row],[ZipCode]],dZipNeighborhood[ZipCode],dZipNeighborhood[Neighborhood])","v":"Rainer Valley"},null,null,98105,"University District"]
["Land Use","2020-08-31","Completed","Completed","98117",{"$f":"_xlfn.XLOOKUP(--fSeattle2020Complaints[[#This Row],[ZipCode]],dZipNeighborhood[ZipCode],dZipNeighborhood[Neighborhood])","v":"Sunset Hill"},null,null,98106,"Delridge"]
["Land Use","2020-09-28","Completed","Completed","98107",{"$f":"_xlfn.XLOOKUP(--fSeattle2020Complaints[[#This Row],[ZipCode]],dZipNeighborhood[ZipCode],dZipNeighborhood[Neighborhood])","v":"Ballard"},null,null,98107,"Ballard"]
["Land Use","2020-09-10","Completed","Under Investigation","98177",{"$f":"_xlfn.XLOOKUP(--fSeattle2020Complaints[[#This Row],[ZipCode]],dZipNeighborhood[ZipCode],dZipNeighborhood[Neighborhood])","v":"Richmond Beach"},null,null,98108,"Rainer Valley"]
["Construction","2020-09-17","Completed","Completed","98102",{"$f":"_xlfn.XLOOKUP(--fSeattle2020Complaints[[#This Row],[ZipCode]],dZipNeighborhood[ZipCode],dZipNeighborhood[Neighborhood])","v":"Capital Hill"},null,null,98109,"South Lake Union"]
["Land Use","2020-09-18","Completed","Closed","98107",{"$f":"_xlfn.XLOOKUP(--fSeattle2020Complaints[[#This Row],[ZipCode]],dZipNeighborhood[ZipCode],dZipNeighborhood[Neighborhood])","v":"Ballard"},null,null,98112,"Madison Park"]
["Land Use","2020-08-17","Completed","Closed","98118",{"$f":"_xlfn.XLOOKUP(--fSeattle2020Complaints[[#This Row],[ZipCode]],dZipNeighborhood[ZipCode],dZipNeighborhood[Neighborhood])","v":"Columbia City"},null,null,98115,"Greenlake"]
["Vacant Building","2020-11-16","Completed","Completed","98107",{"$f":"_xlfn.XLOOKUP(--fSeattle2020Complaints[[#This Row],[ZipCode]],dZipNeighborhood[ZipCode],dZipNeighborhood[Neighborhood])","v":"Ballard"},null,null,98116,"West Seattle"]
["Construction","2020-01-28","Completed","Completed","98103",{"$f":"_xlfn.XLOOKUP(--fSeattle2020Complaints[[#This Row],[ZipCode]],dZipNeighborhood[ZipCode],dZipNeighborhood[Neighborhood])","v":"Greenwood"},null,null,98117,"Sunset Hill"]
["Weeds","2020-03-14","Completed","Completed","98103",{"$f":"_xlfn.XLOOKUP(--fSeattle2020Complaints[[#This Row],[ZipCode]],dZipNeighborhood[ZipCode],dZipNeighborhood[Neighborhood])","v":"Greenwood"},null,null,98118,"Columbia City"]
["Weeds","2020-02-06","Completed","Completed","98117",{"$f":"_xlfn.XLOOKUP(--fSeattle2020Complaints[[#This Row],[ZipCode]],dZipNeighborhood[ZipCode],dZipNeighborhood[Neighborhood])","v":"Sunset Hill"},null,null,98119,"Queen Anne"]
["Weeds","2020-08-04","Completed","Completed","98117",{"$f":"_xlfn.XLOOKUP(--fSeattle2020Complaints[[#This Row],[ZipCode]],dZipNeighborhood[ZipCode],dZipNeighborhood[Neighborhood])","v":"Sunset Hill"},null,null,98121,"Belltown"]
["Land Use","2020-06-01","Completed","Completed","98112",{"$f":"_xlfn.XLOOKUP(--fSeattle2020Complaints[[#This Row],[ZipCode]],dZipNeighborhood[ZipCode],dZipNeighborhood[Neighborhood])","v":"Madison Park"},null,null,98122,"Minor, Central Area"]
["Vacant Building","2020-02-08","Completed","Closed","98103",{"$f":"_xlfn.XLOOKUP(--fSeattle2020Complaints[[#This Row],[ZipCode]],dZipNeighborhood[ZipCode],dZipNeighborhood[Neighborhood])","v":"Greenwood"},null,null,98125,"Northgate"]
["Construction","2020-01-13","Completed","Completed","98134",{"$f":"_xlfn.XLOOKUP(--fSeattle2020Complaints[[#This Row],[ZipCode]],dZipNeighborhood[ZipCode],dZipNeighborhood[Neighborhood])","v":"Duwamish"},null,null,98126,"High Point"]
["Vacant Building","2020-02-20","Completed","Closed","98103",{"$f":"_xlfn.XLOOKUP(--fSeattle2020Complaints[[#This Row],[ZipCode]],dZipNeighborhood[ZipCode],dZipNeighborhood[Neighborhood])","v":"Greenwood"},null,null,98133,"Shoreline"]
["Land Use","2020-01-08","Compliance Achieved","Completed","98122",{"$f":"_xlfn.XLOOKUP(--fSeattle2020Complaints[[#This Row],[ZipCode]],dZipNeighborhood[ZipCode],dZipNeighborhood[Neighborhood])","v":"Minor, Central Area"},null,null,98134,"Duwamish"]
["Land Use","2020-01-05","Completed","Completed","98144",{"$f":"_xlfn.XLOOKUP(--fSeattle2020Complaints[[#This Row],[ZipCode]],dZipNeighborhood[ZipCode],dZipNeighborhood[Neighborhood])","v":"Mount Baker"},null,null,98136,"Seaview"]
["Land Use","2020-05-08","Completed","Completed","98144",{"$f":"_xlfn.XLOOKUP(--fSeattle2020Complaints[[#This Row],[ZipCode]],dZipNeighborhood[ZipCode],dZipNeighborhood[Neighborhood])","v":"Mount Baker"},null,null,98144,"Mount Baker"]
["Land Use","2020-08-12","Completed","Completed","98117",{"$f":"_xlfn.XLOOKUP(--fSeattle2020Complaints[[#This Row],[ZipCode]],dZipNeighborhood[ZipCode],dZipNeighborhood[Neighborhood])","v":"Sunset Hill"},null,null,98146,"Shorewood, White Center"]
["Weeds","2020-06-29","Completed","Completed","98102",{"$f":"_xlfn.XLOOKUP(--fSeattle2020Complaints[[#This Row],[ZipCode]],dZipNeighborhood[ZipCode],dZipNeighborhood[Neighborhood])","v":"Capital Hill"},null,null,98177,"Richmond Beach"]
["Land Use","2020-03-25","Completed","Warning","98106",{"$f":"_xlfn.XLOOKUP(--fSeattle2020Complaints[[#This Row],[ZipCode]],dZipNeighborhood[ZipCode],dZipNeighborhood[Neighborhood])","v":"Delridge"},null,null,98178,"Skyway"]
["Land Use","2020-01-16","Completed","Completed","98122",{"$f":"_xlfn.XLOOKUP(--fSeattle2020Complaints[[#This Row],[ZipCode]],dZipNeighborhood[ZipCode],dZipNeighborhood[Neighborhood])","v":"Minor, Central Area"},null,null,98199,"Magnolia"]
["Weeds","2020-07-05","Completed","Closed","98125",{"$f":"_xlfn.XLOOKUP(--fSeattle2020Complaints[[#This Row],[ZipCode]],dZipNeighborhood[ZipCode],dZipNeighborhood[Neighborhood])","v":"Northgate"}]
["Land Use","2020-02-04","Compliance Achieved","Completed","98105",{"$f":"_xlfn.XLOOKUP(--fSeattle2020Complaints[[#This Row],[ZipCode]],dZipNeighborhood[ZipCode],dZipNeighborhood[Neighborhood])","v":"University District"}]
["Weeds","2020-08-11","Completed","Completed","98119",{"$f":"_xlfn.XLOOKUP(--fSeattle2020Complaints[[#This Row],[ZipCode]],dZipNeighborhood[ZipCode],dZipNeighborhood[Neighborhood])","v":"Queen Anne"}]
["Land UseWeeds ,","2020-07-16","Completed","Completed","98117",{"$f":"_xlfn.XLOOKUP(--fSeattle2020Complaints[[#This Row],[ZipCode]],dZipNeighborhood[ZipCode],dZipNeighborhood[Neighborhood])","v":"Sunset Hill"}]
["Weeds","2020-03-07","Completed","Closed","98199",{"$f":"_xlfn.XLOOKUP(--fSeattle2020Complaints[[#This Row],[ZipCode]],dZipNeighborhood[ZipCode],dZipNeighborhood[Neighborhood])","v":"Magnolia"}]
["Weeds","2020-05-29","Completed","Completed","98122",{"$f":"_xlfn.XLOOKUP(--fSeattle2020Complaints[[#This Row],[ZipCode]],dZipNeighborhood[ZipCode],dZipNeighborhood[Neighborhood])","v":"Minor, Central Area"}]
["Weeds","2020-03-02","Completed","Completed","98126",{"$f":"_xlfn.XLOOKUP(--fSeattle2020Complaints[[#This Row],[ZipCode]],dZipNeighborhood[ZipCode],dZipNeighborhood[Neighborhood])","v":"High Point"}]
["Weeds","2020-08-14","Completed","Completed","98103",{"$f":"_xlfn.XLOOKUP(--fSeattle2020Complaints[[#This Row],[ZipCode]],dZipNeighborhood[ZipCode],dZipNeighborhood[Neighborhood])","v":"Greenwood"}]
["Construction","2020-07-20","Completed","NOV Issued","98199",{"$f":"_xlfn.XLOOKUP(--fSeattle2020Complaints[[#This Row],[ZipCode]],dZipNeighborhood[ZipCode],dZipNeighborhood[Neighborhood])","v":"Magnolia"}]
["Vacant Building","2020-06-30","Completed","Completed","98133",{"$f":"_xlfn.XLOOKUP(--fSeattle2020Complaints[[#This Row],[ZipCode]],dZipNeighborhood[ZipCode],dZipNeighborhood[Neighborhood])","v":"Shoreline"}]
["LandLord/Tenant","2020-01-10","Completed","Completed","98106",{"$f":"_xlfn.XLOOKUP(--fSeattle2020Complaints[[#This Row],[ZipCode]],dZipNeighborhood[ZipCode],dZipNeighborhood[Neighborhood])","v":"Delridge"}]
["Construction","2020-01-11","Completed","Completed","98199",{"$f":"_xlfn.XLOOKUP(--fSeattle2020Complaints[[#This Row],[ZipCode]],dZipNeighborhood[ZipCode],dZipNeighborhood[Neighborhood])","v":"Magnolia"}]
["Weeds","2020-06-25","Completed","Initiated","98119",{"$f":"_xlfn.XLOOKUP(--fSeattle2020Complaints[[#This Row],[ZipCode]],dZipNeighborhood[ZipCode],dZipNeighborhood[Neighborhood])","v":"Queen Anne"}]
["Land Use","2020-01-24","Completed","Completed","98118",{"$f":"_xlfn.XLOOKUP(--fSeattle2020Complaints[[#This Row],[ZipCode]],dZipNeighborhood[ZipCode],dZipNeighborhood[Neighborhood])","v":"Columbia City"}]
["Land Use","2020-10-09","Completed","Completed","98118",{"$f":"_xlfn.XLOOKUP(--fSeattle2020Complaints[[#This Row],[ZipCode]],dZipNeighborhood[ZipCode],dZipNeighborhood[Neighborhood])","v":"Columbia City"}]
["Land Use","2020-02-13","Completed","Completed","98119",{"$f":"_xlfn.XLOOKUP(--fSeattle2020Complaints[[#This Row],[ZipCode]],dZipNeighborhood[ZipCode],dZipNeighborhood[Neighborhood])","v":"Queen Anne"}]
["Land Use","2020-07-15","Admin Closure","Completed","98106",{"$f":"_xlfn.XLOOKUP(--fSeattle2020Complaints[[#This Row],[ZipCode]],dZipNeighborhood[ZipCode],dZipNeighborhood[Neighborhood])","v":"Delridge"}]
["Land Use","2020-06-19","Completed","Completed","98125",{"$f":"_xlfn.XLOOKUP(--fSeattle2020Complaints[[#This Row],[ZipCode]],dZipNeighborhood[ZipCode],dZipNeighborhood[Neighborhood])","v":"Northgate"}]
["Land Use","2020-04-16","Completed","Completed","98107",{"$f":"_xlfn.XLOOKUP(--fSeattle2020Complaints[[#This Row],[ZipCode]],dZipNeighborhood[ZipCode],dZipNeighborhood[Neighborhood])","v":"Ballard"}]
["Weeds","2020-09-29","Completed","Completed","98105",{"$f":"_xlfn.XLOOKUP(--fSeattle2020Complaints[[#This Row],[ZipCode]],dZipNeighborhood[ZipCode],dZipNeighborhood[Neighborhood])","v":"University District"}]
["Land Use","2020-11-12","Completed","Completed","98117",{"$f":"_xlfn.XLOOKUP(--fSeattle2020Complaints[[#This Row],[ZipCode]],dZipNeighborhood[ZipCode],dZipNeighborhood[Neighborhood])","v":"Sunset Hill"}]
["Land Use","2020-07-08","Completed","Completed","98144",{"$f":"_xlfn.XLOOKUP(--fSeattle2020Complaints[[#This Row],[ZipCode]],dZipNeighborhood[ZipCode],dZipNeighborhood[Neighborhood])","v":"Mount Baker"}]
["Construction","2020-01-13","Completed","Completed","98133",{"$f":"_xlfn.XLOOKUP(--fSeattle2020Complaints[[#This Row],[ZipCode]],dZipNeighborhood[ZipCode],dZipNeighborhood[Neighborhood])","v":"Shoreline"}]
["Weeds","2020-11-12","Completed","Completed","98126",{"$f":"_xlfn.XLOOKUP(--fSeattle2020Complaints[[#This Row],[ZipCode]],dZipNeighborhood[ZipCode],dZipNeighborhood[Neighborhood])","v":"High Point"}]
["Land UseConstruction , ECA ,","2020-08-10","Completed","Completed","98116",{"$f":"_xlfn.XLOOKUP(--fSeattle2020Complaints[[#This Row],[ZipCode]],dZipNeighborhood[ZipCode],dZipNeighborhood[Neighborhood])","v":"West Seattle"}]
["Land Use","2020-06-26","Completed","Completed","98125",{"$f":"_xlfn.XLOOKUP(--fSeattle2020Complaints[[#This Row],[ZipCode]],dZipNeighborhood[ZipCode],dZipNeighborhood[Neighborhood])","v":"Northgate"}]
["Weeds","2020-07-01","Completed","Citation Issued","98126",{"$f":"_xlfn.XLOOKUP(--fSeattle2020Complaints[[#This Row],[ZipCode]],dZipNeighborhood[ZipCode],dZipNeighborhood[Neighborhood])","v":"High Point"}]
["Weeds","2020-11-30","Completed","Completed","98125",{"$f":"_xlfn.XLOOKUP(--fSeattle2020Complaints[[#This Row],[ZipCode]],dZipNeighborhood[ZipCode],dZipNeighborhood[Neighborhood])","v":"Northgate"}]
["Land Use","2020-05-11","Completed","Completed","98106",{"$f":"_xlfn.XLOOKUP(--fSeattle2020Complaints[[#This Row],[ZipCode]],dZipNeighborhood[ZipCode],dZipNeighborhood[Neighborhood])","v":"Delridge"}]
["Emergency , Vacant Building","2020-05-19","Completed","Completed","98102",{"$f":"_xlfn.XLOOKUP(--fSeattle2020Complaints[[#This Row],[ZipCode]],dZipNeighborhood[ZipCode],dZipNeighborhood[Neighborhood])","v":"Capital Hill"}]
["LandLord/Tenant","2020-11-16","Completed","Completed","98122",{"$f":"_xlfn.XLOOKUP(--fSeattle2020Complaints[[#This Row],[ZipCode]],dZipNeighborhood[ZipCode],dZipNeighborhood[Neighborhood])","v":"Minor, Central Area"}]
["Emergency , Vacant Building","2020-02-25","Compliance Achieved","Completed","98118",{"$f":"_xlfn.XLOOKUP(--fSeattle2020Complaints[[#This Row],[ZipCode]],dZipNeighborhood[ZipCode],dZipNeighborhood[Neighborhood])","v":"Columbia City"}]
["Tree","2020-02-13","Completed","Completed","98122",{"$f":"_xlfn.XLOOKUP(--fSeattle2020Complaints[[#This Row],[ZipCode]],dZipNeighborhood[ZipCode],dZipNeighborhood[Neighborhood])","v":"Minor, Central Area"}]
["Emergency , Vacant Building","2020-11-17","Completed","Completed","98118",{"$f":"_xlfn.XLOOKUP(--fSeattle2020Complaints[[#This Row],[ZipCode]],dZipNeighborhood[ZipCode],dZipNeighborhood[Neighborhood])","v":"Columbia City"}]
["Vacant Building","2020-01-31","Completed","Closed","98103",{"$f":"_xlfn.XLOOKUP(--fSeattle2020Complaints[[#This Row],[ZipCode]],dZipNeighborhood[ZipCode],dZipNeighborhood[Neighborhood])","v":"Greenwood"}]
["Land Use","2020-03-31","Compliance Achieved","Completed","98108",{"$f":"_xlfn.XLOOKUP(--fSeattle2020Complaints[[#This Row],[ZipCode]],dZipNeighborhood[ZipCode],dZipNeighborhood[Neighborhood])","v":"Rainer Valley"}]
["Construction","2020-03-13","Completed","Completed","98108",{"$f":"_xlfn.XLOOKUP(--fSeattle2020Complaints[[#This Row],[ZipCode]],dZipNeighborhood[ZipCode],dZipNeighborhood[Neighborhood])","v":"Rainer Valley"}]
["Land Use","2020-12-23","Completed","Completed","98122",{"$f":"_xlfn.XLOOKUP(--fSeattle2020Complaints[[#This Row],[ZipCode]],dZipNeighborhood[ZipCode],dZipNeighborhood[Neighborhood])","v":"Minor, Central Area"}]
["Weeds","2020-08-26","Completed","Completed","98136",{"$f":"_xlfn.XLOOKUP(--fSeattle2020Complaints[[#This Row],[ZipCode]],dZipNeighborhood[ZipCode],dZipNeighborhood[Neighborhood])","v":"Seaview"}]
["Weeds","2020-03-12","Completed","Completed","98103",{"$f":"_xlfn.XLOOKUP(--fSeattle2020Complaints[[#This Row],[ZipCode]],dZipNeighborhood[ZipCode],dZipNeighborhood[Neighborhood])","v":"Greenwood"}]
["Land Use","2020-03-23","Completed","Warning","98118",{"$f":"_xlfn.XLOOKUP(--fSeattle2020Complaints[[#This Row],[ZipCode]],dZipNeighborhood[ZipCode],dZipNeighborhood[Neighborhood])","v":"Columbia City"}]
["Vacant Building","2020-09-08","Completed","NOV Issued","98107",{"$f":"_xlfn.XLOOKUP(--fSeattle2020Complaints[[#This Row],[ZipCode]],dZipNeighborhood[ZipCode],dZipNeighborhood[Neighborhood])","v":"Ballard"}]
["Construction","2020-08-19","Completed","Completed","98118",{"$f":"_xlfn.XLOOKUP(--fSeattle2020Complaints[[#This Row],[ZipCode]],dZipNeighborhood[ZipCode],dZipNeighborhood[Neighborhood])","v":"Columbia City"}]
["Land UseWeeds ,","2020-08-14","Completed","Completed","98118",{"$f":"_xlfn.XLOOKUP(--fSeattle2020Complaints[[#This Row],[ZipCode]],dZipNeighborhood[ZipCode],dZipNeighborhood[Neighborhood])","v":"Columbia City"}]
["Weeds","2020-07-23","Completed","Completed","98144",{"$f":"_xlfn.XLOOKUP(--fSeattle2020Complaints[[#This Row],[ZipCode]],dZipNeighborhood[ZipCode],dZipNeighborhood[Neighborhood])","v":"Mount Baker"}]
["Land Use","2020-06-18","Completed","Completed","98199",{"$f":"_xlfn.XLOOKUP(--fSeattle2020Complaints[[#This Row],[ZipCode]],dZipNeighborhood[ZipCode],dZipNeighborhood[Neighborhood])","v":"Magnolia"}]
["Weeds","2020-10-08","Completed","Completed","98109",{"$f":"_xlfn.XLOOKUP(--fSeattle2020Complaints[[#This Row],[ZipCode]],dZipNeighborhood[ZipCode],dZipNeighborhood[Neighborhood])","v":"South Lake Union"}]
["Land Use","2020-03-11","Completed","Completed","98116",{"$f":"_xlfn.XLOOKUP(--fSeattle2020Complaints[[#This Row],[ZipCode]],dZipNeighborhood[ZipCode],dZipNeighborhood[Neighborhood])","v":"West Seattle"}]
["Construction","2020-02-21","Completed","Under Investigation","98118",{"$f":"_xlfn.XLOOKUP(--fSeattle2020Complaints[[#This Row],[ZipCode]],dZipNeighborhood[ZipCode],dZipNeighborhood[Neighborhood])","v":"Columbia City"}]
["Land Use","2020-09-09","Completed","Completed","98122",{"$f":"_xlfn.XLOOKUP(--fSeattle2020Complaints[[#This Row],[ZipCode]],dZipNeighborhood[ZipCode],dZipNeighborhood[Neighborhood])","v":"Minor, Central Area"}]
["Construction","2020-10-16","Completed","Completed","98136",{"$f":"_xlfn.XLOOKUP(--fSeattle2020Complaints[[#This Row],[ZipCode]],dZipNeighborhood[ZipCode],dZipNeighborhood[Neighborhood])","v":"Seaview"}]
["Construction","2020-08-07","Completed","Completed","98116",{"$f":"_xlfn.XLOOKUP(--fSeattle2020Complaints[[#This Row],[ZipCode]],dZipNeighborhood[ZipCode],dZipNeighborhood[Neighborhood])","v":"West Seattle"}]
["Land Use","2020-07-06","Completed","Completed","98118",{"$f":"_xlfn.XLOOKUP(--fSeattle2020Complaints[[#This Row],[ZipCode]],dZipNeighborhood[ZipCode],dZipNeighborhood[Neighborhood])","v":"Columbia City"}]
["Construction","2020-03-18","Completed","Completed","98144",{"$f":"_xlfn.XLOOKUP(--fSeattle2020Complaints[[#This Row],[ZipCode]],dZipNeighborhood[ZipCode],dZipNeighborhood[Neighborhood])","v":"Mount Baker"}]
["Land Use","2020-05-19","Completed","Completed","98146",{"$f":"_xlfn.XLOOKUP(--fSeattle2020Complaints[[#This Row],[ZipCode]],dZipNeighborhood[ZipCode],dZipNeighborhood[Neighborhood])","v":"Shorewood, White Center"}]
["ECA , Tree","2020-08-03","Completed","Completed","98136",{"$f":"_xlfn.XLOOKUP(--fSeattle2020Complaints[[#This Row],[ZipCode]],dZipNeighborhood[ZipCode],dZipNeighborhood[Neighborhood])","v":"Seaview"}]
["Weeds","2020-02-26","Completed","Completed","98109",{"$f":"_xlfn.XLOOKUP(--fSeattle2020Complaints[[#This Row],[ZipCode]],dZipNeighborhood[ZipCode],dZipNeighborhood[Neighborhood])","v":"South Lake Union"}]
["Land Use","2020-08-19","Completed","Completed","98144",{"$f":"_xlfn.XLOOKUP(--fSeattle2020Complaints[[#This Row],[ZipCode]],dZipNeighborhood[ZipCode],dZipNeighborhood[Neighborhood])","v":"Mount Baker"}]
["Land Use","2020-09-29","Completed","Completed","98118",{"$f":"_xlfn.XLOOKUP(--fSeattle2020Complaints[[#This Row],[ZipCode]],dZipNeighborhood[ZipCode],dZipNeighborhood[Neighborhood])","v":"Columbia City"}]
["Construction","2020-09-11","Completed","Closed","98118",{"$f":"_xlfn.XLOOKUP(--fSeattle2020Complaints[[#This Row],[ZipCode]],dZipNeighborhood[ZipCode],dZipNeighborhood[Neighborhood])","v":"Columbia City"}]
["Construction","2020-11-12","Completed","Completed","98199",{"$f":"_xlfn.XLOOKUP(--fSeattle2020Complaints[[#This Row],[ZipCode]],dZipNeighborhood[ZipCode],dZipNeighborhood[Neighborhood])","v":"Magnolia"}]
["Noise","2020-02-01","Completed","Completed","98109",{"$f":"_xlfn.XLOOKUP(--fSeattle2020Complaints[[#This Row],[ZipCode]],dZipNeighborhood[ZipCode],dZipNeighborhood[Neighborhood])","v":"South Lake Union"}]
["Land UseWeeds ,","2020-06-03","Completed","Completed","98146",{"$f":"_xlfn.XLOOKUP(--fSeattle2020Complaints[[#This Row],[ZipCode]],dZipNeighborhood[ZipCode],dZipNeighborhood[Neighborhood])","v":"Shorewood, White Center"}]
["Land Use","2020-07-31","Completed","Completed","98117",{"$f":"_xlfn.XLOOKUP(--fSeattle2020Complaints[[#This Row],[ZipCode]],dZipNeighborhood[ZipCode],dZipNeighborhood[Neighborhood])","v":"Sunset Hill"}]
["Weeds","2020-01-22","Compliance Achieved","Completed","98112",{"$f":"_xlfn.XLOOKUP(--fSeattle2020Complaints[[#This Row],[ZipCode]],dZipNeighborhood[ZipCode],dZipNeighborhood[Neighborhood])","v":"Madison Park"}]
["Weeds","2020-01-09","Completed","Completed","98105",{"$f":"_xlfn.XLOOKUP(--fSeattle2020Complaints[[#This Row],[ZipCode]],dZipNeighborhood[ZipCode],dZipNeighborhood[Neighborhood])","v":"University District"}]
["Weeds","2020-09-28","Completed","Completed","98116",{"$f":"_xlfn.XLOOKUP(--fSeattle2020Complaints[[#This Row],[ZipCode]],dZipNeighborhood[ZipCode],dZipNeighborhood[Neighborhood])","v":"West Seattle"}]
["Vacant Building","2020-03-10","Completed","Completed","98107",{"$f":"_xlfn.XLOOKUP(--fSeattle2020Complaints[[#This Row],[ZipCode]],dZipNeighborhood[ZipCode],dZipNeighborhood[Neighborhood])","v":"Ballard"}]
["Land Use","2020-04-13","Completed","Completed","98122",{"$f":"_xlfn.XLOOKUP(--fSeattle2020Complaints[[#This Row],[ZipCode]],dZipNeighborhood[ZipCode],dZipNeighborhood[Neighborhood])","v":"Minor, Central Area"}]
["Land Use","2020-02-05","Completed","Completed","98115",{"$f":"_xlfn.XLOOKUP(--fSeattle2020Complaints[[#This Row],[ZipCode]],dZipNeighborhood[ZipCode],dZipNeighborhood[Neighborhood])","v":"Greenlake"}]
["Land Use","2020-04-02","Compliance Achieved","Completed","98108",{"$f":"_xlfn.XLOOKUP(--fSeattle2020Complaints[[#This Row],[ZipCode]],dZipNeighborhood[ZipCode],dZipNeighborhood[Neighborhood])","v":"Rainer Valley"}]
["Weeds","2020-06-10","Completed","Completed","98144",{"$f":"_xlfn.XLOOKUP(--fSeattle2020Complaints[[#This Row],[ZipCode]],dZipNeighborhood[ZipCode],dZipNeighborhood[Neighborhood])","v":"Mount Baker"}]
["Weeds","2020-06-15","Completed","Completed","98199",{"$f":"_xlfn.XLOOKUP(--fSeattle2020Complaints[[#This Row],[ZipCode]],dZipNeighborhood[ZipCode],dZipNeighborhood[Neighborhood])","v":"Magnolia"}]
["Land Use","2020-11-25","Completed","Completed","98116",{"$f":"_xlfn.XLOOKUP(--fSeattle2020Complaints[[#This Row],[ZipCode]],dZipNeighborhood[ZipCode],dZipNeighborhood[Neighborhood])","v":"West Seattle"}]
["Construction","2020-09-19","Completed","Completed","98117",{"$f":"_xlfn.XLOOKUP(--fSeattle2020Complaints[[#This Row],[ZipCode]],dZipNeighborhood[ZipCode],dZipNeighborhood[Neighborhood])","v":"Sunset Hill"}]
["Weeds","2020-06-25","Completed","Completed","98103",{"$f":"_xlfn.XLOOKUP(--fSeattle2020Complaints[[#This Row],[ZipCode]],dZipNeighborhood[ZipCode],dZipNeighborhood[Neighborhood])","v":"Greenwood"}]
["Weeds","2020-03-06","Compliance Achieved","Completed","98105",{"$f":"_xlfn.XLOOKUP(--fSeattle2020Complaints[[#This Row],[ZipCode]],dZipNeighborhood[ZipCode],dZipNeighborhood[Neighborhood])","v":"University District"}]
["Land Use","2020-02-13","Completed","Completed","98199",{"$f":"_xlfn.XLOOKUP(--fSeattle2020Complaints[[#This Row],[ZipCode]],dZipNeighborhood[ZipCode],dZipNeighborhood[Neighborhood])","v":"Magnolia"}]
["Weeds","2020-05-31","Completed","Completed","98106",{"$f":"_xlfn.XLOOKUP(--fSeattle2020Complaints[[#This Row],[ZipCode]],dZipNeighborhood[ZipCode],dZipNeighborhood[Neighborhood])","v":"Delridge"}]
["Construction","2020-01-30","Completed","Completed","98144",{"$f":"_xlfn.XLOOKUP(--fSeattle2020Complaints[[#This Row],[ZipCode]],dZipNeighborhood[ZipCode],dZipNeighborhood[Neighborhood])","v":"Mount Baker"}]
["Weeds","2020-09-25","Completed","Completed","98112",{"$f":"_xlfn.XLOOKUP(--fSeattle2020Complaints[[#This Row],[ZipCode]],dZipNeighborhood[ZipCode],dZipNeighborhood[Neighborhood])","v":"Madison Park"}]
["Weeds","2020-02-05","Completed","Completed","98112",{"$f":"_xlfn.XLOOKUP(--fSeattle2020Complaints[[#This Row],[ZipCode]],dZipNeighborhood[ZipCode],dZipNeighborhood[Neighborhood])","v":"Madison Park"}]
["Emergency , Vacant Building","2020-02-06","Compliance Achieved","Completed","98144",{"$f":"_xlfn.XLOOKUP(--fSeattle2020Complaints[[#This Row],[ZipCode]],dZipNeighborhood[ZipCode],dZipNeighborhood[Neighborhood])","v":"Mount Baker"}]
["Weeds","2020-06-29","Completed","Completed","98144",{"$f":"_xlfn.XLOOKUP(--fSeattle2020Complaints[[#This Row],[ZipCode]],dZipNeighborhood[ZipCode],dZipNeighborhood[Neighborhood])","v":"Mount Baker"}]
["Vacant Building","2020-03-26","Completed","Closed","98122",{"$f":"_xlfn.XLOOKUP(--fSeattle2020Complaints[[#This Row],[ZipCode]],dZipNeighborhood[ZipCode],dZipNeighborhood[Neighborhood])","v":"Minor, Central Area"}]
["Construction","2020-07-01","Completed","Completed","98122",{"$f":"_xlfn.XLOOKUP(--fSeattle2020Complaints[[#This Row],[ZipCode]],dZipNeighborhood[ZipCode],dZipNeighborhood[Neighborhood])","v":"Minor, Central Area"}]
["Noise","2020-11-04","No Violation","Completed","98136",{"$f":"_xlfn.XLOOKUP(--fSeattle2020Complaints[[#This Row],[ZipCode]],dZipNeighborhood[ZipCode],dZipNeighborhood[Neighborhood])","v":"Seaview"}]
["Land Use","2020-03-04","No Access/Unable to Observe","Completed","98121",{"$f":"_xlfn.XLOOKUP(--fSeattle2020Complaints[[#This Row],[ZipCode]],dZipNeighborhood[ZipCode],dZipNeighborhood[Neighborhood])","v":"Belltown"}]
["Vacant Building","2020-02-10","Completed","Completed","98103",{"$f":"_xlfn.XLOOKUP(--fSeattle2020Complaints[[#This Row],[ZipCode]],dZipNeighborhood[ZipCode],dZipNeighborhood[Neighborhood])","v":"Greenwood"}]
["Land Use","2020-12-08","Completed","Completed","98115",{"$f":"_xlfn.XLOOKUP(--fSeattle2020Complaints[[#This Row],[ZipCode]],dZipNeighborhood[ZipCode],dZipNeighborhood[Neighborhood])","v":"Greenlake"}]
["Weeds","2020-06-29","Completed","Completed","98107",{"$f":"_xlfn.XLOOKUP(--fSeattle2020Complaints[[#This Row],[ZipCode]],dZipNeighborhood[ZipCode],dZipNeighborhood[Neighborhood])","v":"Ballard"}]
["Construction","2020-07-29","Completed","Completed","98107",{"$f":"_xlfn.XLOOKUP(--fSeattle2020Complaints[[#This Row],[ZipCode]],dZipNeighborhood[ZipCode],dZipNeighborhood[Neighborhood])","v":"Ballard"}]
["Weeds","2020-02-10","Completed","Completed","98115",{"$f":"_xlfn.XLOOKUP(--fSeattle2020Complaints[[#This Row],[ZipCode]],dZipNeighborhood[ZipCode],dZipNeighborhood[Neighborhood])","v":"Greenlake"}]
["Weeds","2020-08-12","Compliance Achieved","Completed","98109",{"$f":"_xlfn.XLOOKUP(--fSeattle2020Complaints[[#This Row],[ZipCode]],dZipNeighborhood[ZipCode],dZipNeighborhood[Neighborhood])","v":"South Lake Union"}]
["Construction","2020-08-25","Completed","Closed","98106",{"$f":"_xlfn.XLOOKUP(--fSeattle2020Complaints[[#This Row],[ZipCode]],dZipNeighborhood[ZipCode],dZipNeighborhood[Neighborhood])","v":"Delridge"}]
["Land Use","2020-09-29","Not Vacant","Completed","98199",{"$f":"_xlfn.XLOOKUP(--fSeattle2020Complaints[[#This Row],[ZipCode]],dZipNeighborhood[ZipCode],dZipNeighborhood[Neighborhood])","v":"Magnolia"}]
["Vacant Building","2020-01-25","Completed","Completed","98115",{"$f":"_xlfn.XLOOKUP(--fSeattle2020Complaints[[#This Row],[ZipCode]],dZipNeighborhood[ZipCode],dZipNeighborhood[Neighborhood])","v":"Greenlake"}]
["Noise","2020-03-03","Completed","Completed","98199",{"$f":"_xlfn.XLOOKUP(--fSeattle2020Complaints[[#This Row],[ZipCode]],dZipNeighborhood[ZipCode],dZipNeighborhood[Neighborhood])","v":"Magnolia"}]
["Land Use","2020-08-05","Completed","Closed","98119",{"$f":"_xlfn.XLOOKUP(--fSeattle2020Complaints[[#This Row],[ZipCode]],dZipNeighborhood[ZipCode],dZipNeighborhood[Neighborhood])","v":"Queen Anne"}]
["Land Use","2020-10-06","Completed","Closed","98107",{"$f":"_xlfn.XLOOKUP(--fSeattle2020Complaints[[#This Row],[ZipCode]],dZipNeighborhood[ZipCode],dZipNeighborhood[Neighborhood])","v":"Ballard"}]
["Land Use","2020-03-26","Completed","Completed","98118",{"$f":"_xlfn.XLOOKUP(--fSeattle2020Complaints[[#This Row],[ZipCode]],dZipNeighborhood[ZipCode],dZipNeighborhood[Neighborhood])","v":"Columbia City"}]
["Construction","2020-04-20","Completed","Completed","98199",{"$f":"_xlfn.XLOOKUP(--fSeattle2020Complaints[[#This Row],[ZipCode]],dZipNeighborhood[ZipCode],dZipNeighborhood[Neighborhood])","v":"Magnolia"}]
["Land Use","2020-06-29","Completed","Completed","98144",{"$f":"_xlfn.XLOOKUP(--fSeattle2020Complaints[[#This Row],[ZipCode]],dZipNeighborhood[ZipCode],dZipNeighborhood[Neighborhood])","v":"Mount Baker"}]
["Land Use","2020-06-14","Completed","Completed","98106",{"$f":"_xlfn.XLOOKUP(--fSeattle2020Complaints[[#This Row],[ZipCode]],dZipNeighborhood[ZipCode],dZipNeighborhood[Neighborhood])","v":"Delridge"}]
["Weeds","2020-07-08","Completed","Completed","98144",{"$f":"_xlfn.XLOOKUP(--fSeattle2020Complaints[[#This Row],[ZipCode]],dZipNeighborhood[ZipCode],dZipNeighborhood[Neighborhood])","v":"Mount Baker"}]
["Land Use","2020-05-28","Completed","Completed","98125",{"$f":"_xlfn.XLOOKUP(--fSeattle2020Complaints[[#This Row],[ZipCode]],dZipNeighborhood[ZipCode],dZipNeighborhood[Neighborhood])","v":"Northgate"}]
["Land Use","2020-01-31","Completed","Completed","98136",{"$f":"_xlfn.XLOOKUP(--fSeattle2020Complaints[[#This Row],[ZipCode]],dZipNeighborhood[ZipCode],dZipNeighborhood[Neighborhood])","v":"Seaview"}]
["Construction","2020-06-16","Completed","Completed","98136",{"$f":"_xlfn.XLOOKUP(--fSeattle2020Complaints[[#This Row],[ZipCode]],dZipNeighborhood[ZipCode],dZipNeighborhood[Neighborhood])","v":"Seaview"}]
["Land Use","2020-08-18","Completed","Completed","98122",{"$f":"_xlfn.XLOOKUP(--fSeattle2020Complaints[[#This Row],[ZipCode]],dZipNeighborhood[ZipCode],dZipNeighborhood[Neighborhood])","v":"Minor, Central Area"}]
["Weeds","2020-12-18","Completed","Completed","98136",{"$f":"_xlfn.XLOOKUP(--fSeattle2020Complaints[[#This Row],[ZipCode]],dZipNeighborhood[ZipCode],dZipNeighborhood[Neighborhood])","v":"Seaview"}]
["Weeds","2020-09-29","Completed","Completed","98125",{"$f":"_xlfn.XLOOKUP(--fSeattle2020Complaints[[#This Row],[ZipCode]],dZipNeighborhood[ZipCode],dZipNeighborhood[Neighborhood])","v":"Northgate"}]
["Land Use","2020-02-03","Completed","Completed","98122",{"$f":"_xlfn.XLOOKUP(--fSeattle2020Complaints[[#This Row],[ZipCode]],dZipNeighborhood[ZipCode],dZipNeighborhood[Neighborhood])","v":"Minor, Central Area"}]
["Construction","2020-01-31","Completed","Completed","98178",{"$f":"_xlfn.XLOOKUP(--fSeattle2020Complaints[[#This Row],[ZipCode]],dZipNeighborhood[ZipCode],dZipNeighborhood[Neighborhood])","v":"Skyway"}]
["Construction","2020-09-09","Completed","Under Investigation","98134",{"$f":"_xlfn.XLOOKUP(--fSeattle2020Complaints[[#This Row],[ZipCode]],dZipNeighborhood[ZipCode],dZipNeighborhood[Neighborhood])","v":"Duwamish"}]
["Land Use","2020-01-29","Completed","Completed","98122",{"$f":"_xlfn.XLOOKUP(--fSeattle2020Complaints[[#This Row],[ZipCode]],dZipNeighborhood[ZipCode],dZipNeighborhood[Neighborhood])","v":"Minor, Central Area"}]
["Emergency , Vacant Building","2020-11-13","Completed","Completed","98118",{"$f":"_xlfn.XLOOKUP(--fSeattle2020Complaints[[#This Row],[ZipCode]],dZipNeighborhood[ZipCode],dZipNeighborhood[Neighborhood])","v":"Columbia City"}]
["Land Use","2020-07-06","Completed","Completed","98121",{"$f":"_xlfn.XLOOKUP(--fSeattle2020Complaints[[#This Row],[ZipCode]],dZipNeighborhood[ZipCode],dZipNeighborhood[Neighborhood])","v":"Belltown"}]
["Shoreline","2020-12-15","Completed","Completed","98109",{"$f":"_xlfn.XLOOKUP(--fSeattle2020Complaints[[#This Row],[ZipCode]],dZipNeighborhood[ZipCode],dZipNeighborhood[Neighborhood])","v":"South Lake Union"}]
["Weeds","2020-06-02","Compliance Achieved","Completed","98122",{"$f":"_xlfn.XLOOKUP(--fSeattle2020Complaints[[#This Row],[ZipCode]],dZipNeighborhood[ZipCode],dZipNeighborhood[Neighborhood])","v":"Minor, Central Area"}]
["Construction","2020-01-29","Completed","Completed","98115",{"$f":"_xlfn.XLOOKUP(--fSeattle2020Complaints[[#This Row],[ZipCode]],dZipNeighborhood[ZipCode],dZipNeighborhood[Neighborhood])","v":"Greenlake"}]
["Construction","2020-12-14","Completed","Completed","98118",{"$f":"_xlfn.XLOOKUP(--fSeattle2020Complaints[[#This Row],[ZipCode]],dZipNeighborhood[ZipCode],dZipNeighborhood[Neighborhood])","v":"Columbia City"}]
["Construction , Noise","2020-06-17","Completed","Completed","98122",{"$f":"_xlfn.XLOOKUP(--fSeattle2020Complaints[[#This Row],[ZipCode]],dZipNeighborhood[ZipCode],dZipNeighborhood[Neighborhood])","v":"Minor, Central Area"}]
["Weeds","2020-07-24","Completed","Completed","98115",{"$f":"_xlfn.XLOOKUP(--fSeattle2020Complaints[[#This Row],[ZipCode]],dZipNeighborhood[ZipCode],dZipNeighborhood[Neighborhood])","v":"Greenlake"}]
["Land UseConstruction ,","2020-05-13","Completed","Completed","98119",{"$f":"_xlfn.XLOOKUP(--fSeattle2020Complaints[[#This Row],[ZipCode]],dZipNeighborhood[ZipCode],dZipNeighborhood[Neighborhood])","v":"Queen Anne"}]
["Weeds","2020-05-01","Completed","Completed","98117",{"$f":"_xlfn.XLOOKUP(--fSeattle2020Complaints[[#This Row],[ZipCode]],dZipNeighborhood[ZipCode],dZipNeighborhood[Neighborhood])","v":"Sunset Hill"}]
["Construction","2020-10-29","Completed","Completed","98109",{"$f":"_xlfn.XLOOKUP(--fSeattle2020Complaints[[#This Row],[ZipCode]],dZipNeighborhood[ZipCode],dZipNeighborhood[Neighborhood])","v":"South Lake Union"}]
["Weeds","2020-04-18","Completed","Closed","98122",{"$f":"_xlfn.XLOOKUP(--fSeattle2020Complaints[[#This Row],[ZipCode]],dZipNeighborhood[ZipCode],dZipNeighborhood[Neighborhood])","v":"Minor, Central Area"}]
["Construction","2020-11-25","No Violation","Completed","98199",{"$f":"_xlfn.XLOOKUP(--fSeattle2020Complaints[[#This Row],[ZipCode]],dZipNeighborhood[ZipCode],dZipNeighborhood[Neighborhood])","v":"Magnolia"}]
["Land Use","2020-07-07","Completed","Completed","98105",{"$f":"_xlfn.XLOOKUP(--fSeattle2020Complaints[[#This Row],[ZipCode]],dZipNeighborhood[ZipCode],dZipNeighborhood[Neighborhood])","v":"University District"}]
["Weeds","2020-09-14","Completed","Completed","98126",{"$f":"_xlfn.XLOOKUP(--fSeattle2020Complaints[[#This Row],[ZipCode]],dZipNeighborhood[ZipCode],dZipNeighborhood[Neighborhood])","v":"High Point"}]
["Vacant Building","2020-01-13","Completed","Closed","98117",{"$f":"_xlfn.XLOOKUP(--fSeattle2020Complaints[[#This Row],[ZipCode]],dZipNeighborhood[ZipCode],dZipNeighborhood[Neighborhood])","v":"Sunset Hill"}]
["Weeds","2020-03-04","Compliance Achieved","Completed","98118",{"$f":"_xlfn.XLOOKUP(--fSeattle2020Complaints[[#This Row],[ZipCode]],dZipNeighborhood[ZipCode],dZipNeighborhood[Neighborhood])","v":"Columbia City"}]
["Land Use","2020-03-16","No Access/Unable to Observe","Completed","98118",{"$f":"_xlfn.XLOOKUP(--fSeattle2020Complaints[[#This Row],[ZipCode]],dZipNeighborhood[ZipCode],dZipNeighborhood[Neighborhood])","v":"Columbia City"}]
["Tree","2020-04-07","Completed","Completed","98119",{"$f":"_xlfn.XLOOKUP(--fSeattle2020Complaints[[#This Row],[ZipCode]],dZipNeighborhood[ZipCode],dZipNeighborhood[Neighborhood])","v":"Queen Anne"}]
["Land Use","2020-10-27","Completed","Completed","98122",{"$f":"_xlfn.XLOOKUP(--fSeattle2020Complaints[[#This Row],[ZipCode]],dZipNeighborhood[ZipCode],dZipNeighborhood[Neighborhood])","v":"Minor, Central Area"}]
["Land Use","2020-02-25","Completed","Completed","98144",{"$f":"_xlfn.XLOOKUP(--fSeattle2020Complaints[[#This Row],[ZipCode]],dZipNeighborhood[ZipCode],dZipNeighborhood[Neighborhood])","v":"Mount Baker"}]
["Construction","2020-05-28","Completed","Completed","98102",{"$f":"_xlfn.XLOOKUP(--fSeattle2020Complaints[[#This Row],[ZipCode]],dZipNeighborhood[ZipCode],dZipNeighborhood[Neighborhood])","v":"Capital Hill"}]
["Land Use","2020-03-16","Completed","Completed","98108",{"$f":"_xlfn.XLOOKUP(--fSeattle2020Complaints[[#This Row],[ZipCode]],dZipNeighborhood[ZipCode],dZipNeighborhood[Neighborhood])","v":"Rainer Valley"}]
["Weeds","2020-01-12","Completed","Completed","98118",{"$f":"_xlfn.XLOOKUP(--fSeattle2020Complaints[[#This Row],[ZipCode]],dZipNeighborhood[ZipCode],dZipNeighborhood[Neighborhood])","v":"Columbia City"}]
["Weeds","2020-08-09","Completed","Completed","98115",{"$f":"_xlfn.XLOOKUP(--fSeattle2020Complaints[[#This Row],[ZipCode]],dZipNeighborhood[ZipCode],dZipNeighborhood[Neighborhood])","v":"Greenlake"}]
["Land Use","2020-06-09","Completed","Completed","98118",{"$f":"_xlfn.XLOOKUP(--fSeattle2020Complaints[[#This Row],[ZipCode]],dZipNeighborhood[ZipCode],dZipNeighborhood[Neighborhood])","v":"Columbia City"}]
["Construction","2020-03-09","Completed","Completed","98116",{"$f":"_xlfn.XLOOKUP(--fSeattle2020Complaints[[#This Row],[ZipCode]],dZipNeighborhood[ZipCode],dZipNeighborhood[Neighborhood])","v":"West Seattle"}]
["Land Use","2020-08-11","Completed","Completed","98118",{"$f":"_xlfn.XLOOKUP(--fSeattle2020Complaints[[#This Row],[ZipCode]],dZipNeighborhood[ZipCode],dZipNeighborhood[Neighborhood])","v":"Columbia City"}]
["Land Use","2020-08-10","No Access/Unable to Observe","Completed","98108",{"$f":"_xlfn.XLOOKUP(--fSeattle2020Complaints[[#This Row],[ZipCode]],dZipNeighborhood[ZipCode],dZipNeighborhood[Neighborhood])","v":"Rainer Valley"}]
["Construction , Tree","2020-08-21","Completed","Completed","98178",{"$f":"_xlfn.XLOOKUP(--fSeattle2020Complaints[[#This Row],[ZipCode]],dZipNeighborhood[ZipCode],dZipNeighborhood[Neighborhood])","v":"Skyway"}]
["Construction","2020-01-28","Completed","Completed","98107",{"$f":"_xlfn.XLOOKUP(--fSeattle2020Complaints[[#This Row],[ZipCode]],dZipNeighborhood[ZipCode],dZipNeighborhood[Neighborhood])","v":"Ballard"}]
["Construction , ECA","2020-10-05","Completed","Completed","98119",{"$f":"_xlfn.XLOOKUP(--fSeattle2020Complaints[[#This Row],[ZipCode]],dZipNeighborhood[ZipCode],dZipNeighborhood[Neighborhood])","v":"Queen Anne"}]
["Vacant Building","2020-05-05","Completed","Completed","98115",{"$f":"_xlfn.XLOOKUP(--fSeattle2020Complaints[[#This Row],[ZipCode]],dZipNeighborhood[ZipCode],dZipNeighborhood[Neighborhood])","v":"Greenlake"}]
["Land Use","2020-01-24","Completed","Completed","98117",{"$f":"_xlfn.XLOOKUP(--fSeattle2020Complaints[[#This Row],[ZipCode]],dZipNeighborhood[ZipCode],dZipNeighborhood[Neighborhood])","v":"Sunset Hill"}]
["Weeds","2020-07-16","Compliance Achieved","Completed","98136",{"$f":"_xlfn.XLOOKUP(--fSeattle2020Complaints[[#This Row],[ZipCode]],dZipNeighborhood[ZipCode],dZipNeighborhood[Neighborhood])","v":"Seaview"}]
["Weeds","2020-08-20","Completed","Completed","98115",{"$f":"_xlfn.XLOOKUP(--fSeattle2020Complaints[[#This Row],[ZipCode]],dZipNeighborhood[ZipCode],dZipNeighborhood[Neighborhood])","v":"Greenlake"}]
["Land Use","2020-05-07","Completed","Completed","98106",{"$f":"_xlfn.XLOOKUP(--fSeattle2020Complaints[[#This Row],[ZipCode]],dZipNeighborhood[ZipCode],dZipNeighborhood[Neighborhood])","v":"Delridge"}]
["Construction","2020-02-28","Completed","Completed","98178",{"$f":"_xlfn.XLOOKUP(--fSeattle2020Complaints[[#This Row],[ZipCode]],dZipNeighborhood[ZipCode],dZipNeighborhood[Neighborhood])","v":"Skyway"}]
["Weeds","2020-06-11","Completed","Completed","98136",{"$f":"_xlfn.XLOOKUP(--fSeattle2020Complaints[[#This Row],[ZipCode]],dZipNeighborhood[ZipCode],dZipNeighborhood[Neighborhood])","v":"Seaview"}]
["LandLord/Tenant","2020-04-21","Compliance Achieved","Completed","98122",{"$f":"_xlfn.XLOOKUP(--fSeattle2020Complaints[[#This Row],[ZipCode]],dZipNeighborhood[ZipCode],dZipNeighborhood[Neighborhood])","v":"Minor, Central Area"}]
["Land Use","2020-11-20","Completed","Citation Issued","98118",{"$f":"_xlfn.XLOOKUP(--fSeattle2020Complaints[[#This Row],[ZipCode]],dZipNeighborhood[ZipCode],dZipNeighborhood[Neighborhood])","v":"Columbia City"}]
["Land Use","2020-03-11","Completed","Completed","98104",{"$f":"_xlfn.XLOOKUP(--fSeattle2020Complaints[[#This Row],[ZipCode]],dZipNeighborhood[ZipCode],dZipNeighborhood[Neighborhood])","v":"International District"}]
["Land UseConstruction ,","2020-06-15","Completed","Completed","98106",{"$f":"_xlfn.XLOOKUP(--fSeattle2020Complaints[[#This Row],[ZipCode]],dZipNeighborhood[ZipCode],dZipNeighborhood[Neighborhood])","v":"Delridge"}]
["Weeds","2020-03-05","Completed","Completed","98108",{"$f":"_xlfn.XLOOKUP(--fSeattle2020Complaints[[#This Row],[ZipCode]],dZipNeighborhood[ZipCode],dZipNeighborhood[Neighborhood])","v":"Rainer Valley"}]
["Emergency , Vacant Building","2020-01-23","Compliance Achieved","Completed","98103",{"$f":"_xlfn.XLOOKUP(--fSeattle2020Complaints[[#This Row],[ZipCode]],dZipNeighborhood[ZipCode],dZipNeighborhood[Neighborhood])","v":"Greenwood"}]
["Weeds","2020-02-25","Completed","Completed","98107",{"$f":"_xlfn.XLOOKUP(--fSeattle2020Complaints[[#This Row],[ZipCode]],dZipNeighborhood[ZipCode],dZipNeighborhood[Neighborhood])","v":"Ballard"}]
["Construction","2020-07-30","Completed","Completed","98178",{"$f":"_xlfn.XLOOKUP(--fSeattle2020Complaints[[#This Row],[ZipCode]],dZipNeighborhood[ZipCode],dZipNeighborhood[Neighborhood])","v":"Skyway"}]
["Construction","2020-03-03","Completed","Completed","98102",{"$f":"_xlfn.XLOOKUP(--fSeattle2020Complaints[[#This Row],[ZipCode]],dZipNeighborhood[ZipCode],dZipNeighborhood[Neighborhood])","v":"Capital Hill"}]
["Vacant Building","2020-06-30","Completed","Completed","98125",{"$f":"_xlfn.XLOOKUP(--fSeattle2020Complaints[[#This Row],[ZipCode]],dZipNeighborhood[ZipCode],dZipNeighborhood[Neighborhood])","v":"Northgate"}]
["Land Use","2020-09-03","Completed","Completed","98118",{"$f":"_xlfn.XLOOKUP(--fSeattle2020Complaints[[#This Row],[ZipCode]],dZipNeighborhood[ZipCode],dZipNeighborhood[Neighborhood])","v":"Columbia City"}]
["Weeds","2020-02-06","Completed","Completed","98144",{"$f":"_xlfn.XLOOKUP(--fSeattle2020Complaints[[#This Row],[ZipCode]],dZipNeighborhood[ZipCode],dZipNeighborhood[Neighborhood])","v":"Mount Baker"}]
["Construction","2020-05-14","Completed","Hazard Correction Order Issued","98133",{"$f":"_xlfn.XLOOKUP(--fSeattle2020Complaints[[#This Row],[ZipCode]],dZipNeighborhood[ZipCode],dZipNeighborhood[Neighborhood])","v":"Shoreline"}]
["Tree","2020-07-10","Completed","Completed","98126",{"$f":"_xlfn.XLOOKUP(--fSeattle2020Complaints[[#This Row],[ZipCode]],dZipNeighborhood[ZipCode],dZipNeighborhood[Neighborhood])","v":"High Point"}]
["Land Use","2020-03-30","Completed","Completed","98122",{"$f":"_xlfn.XLOOKUP(--fSeattle2020Complaints[[#This Row],[ZipCode]],dZipNeighborhood[ZipCode],dZipNeighborhood[Neighborhood])","v":"Minor, Central Area"}]
["Weeds","2020-01-02","Completed","Completed","98199",{"$f":"_xlfn.XLOOKUP(--fSeattle2020Complaints[[#This Row],[ZipCode]],dZipNeighborhood[ZipCode],dZipNeighborhood[Neighborhood])","v":"Magnolia"}]
["Land UseConstruction ,","2020-07-10","Completed","Completed","98126",{"$f":"_xlfn.XLOOKUP(--fSeattle2020Complaints[[#This Row],[ZipCode]],dZipNeighborhood[ZipCode],dZipNeighborhood[Neighborhood])","v":"High Point"}]
["Land Use","2020-09-22","Completed","Completed","98103",{"$f":"_xlfn.XLOOKUP(--fSeattle2020Complaints[[#This Row],[ZipCode]],dZipNeighborhood[ZipCode],dZipNeighborhood[Neighborhood])","v":"Greenwood"}]
["Tree","2020-09-01","Completed","Completed","98117",{"$f":"_xlfn.XLOOKUP(--fSeattle2020Complaints[[#This Row],[ZipCode]],dZipNeighborhood[ZipCode],dZipNeighborhood[Neighborhood])","v":"Sunset Hill"}]
["Land Use","2020-03-26","Completed","Completed","98104",{"$f":"_xlfn.XLOOKUP(--fSeattle2020Complaints[[#This Row],[ZipCode]],dZipNeighborhood[ZipCode],dZipNeighborhood[Neighborhood])","v":"International District"}]
["Land Use","2020-07-13","Completed","Completed","98106",{"$f":"_xlfn.XLOOKUP(--fSeattle2020Complaints[[#This Row],[ZipCode]],dZipNeighborhood[ZipCode],dZipNeighborhood[Neighborhood])","v":"Delridge"}]
["Construction","2020-01-06","Completed","Completed","98119",{"$f":"_xlfn.XLOOKUP(--fSeattle2020Complaints[[#This Row],[ZipCode]],dZipNeighborhood[ZipCode],dZipNeighborhood[Neighborhood])","v":"Queen Anne"}]
["Construction","2020-01-30","Completed","NOV Issued","98118",{"$f":"_xlfn.XLOOKUP(--fSeattle2020Complaints[[#This Row],[ZipCode]],dZipNeighborhood[ZipCode],dZipNeighborhood[Neighborhood])","v":"Columbia City"}]
["Land Use","2020-07-08","No Access/Unable to Observe","Completed","98144",{"$f":"_xlfn.XLOOKUP(--fSeattle2020Complaints[[#This Row],[ZipCode]],dZipNeighborhood[ZipCode],dZipNeighborhood[Neighborhood])","v":"Mount Baker"}]
["Vacant Building","2020-10-16","Secured with No Violations","Completed","98106",{"$f":"_xlfn.XLOOKUP(--fSeattle2020Complaints[[#This Row],[ZipCode]],dZipNeighborhood[ZipCode],dZipNeighborhood[Neighborhood])","v":"Delridge"}]
["Land Use","2020-02-10","Completed","Completed","98126",{"$f":"_xlfn.XLOOKUP(--fSeattle2020Complaints[[#This Row],[ZipCode]],dZipNeighborhood[ZipCode],dZipNeighborhood[Neighborhood])","v":"High Point"}]
["Emergency , Vacant Building","2020-05-21","Completed","Completed","98109",{"$f":"_xlfn.XLOOKUP(--fSeattle2020Complaints[[#This Row],[ZipCode]],dZipNeighborhood[ZipCode],dZipNeighborhood[Neighborhood])","v":"South Lake Union"}]
["Weeds","2020-09-17","Completed","Completed","98105",{"$f":"_xlfn.XLOOKUP(--fSeattle2020Complaints[[#This Row],[ZipCode]],dZipNeighborhood[ZipCode],dZipNeighborhood[Neighborhood])","v":"University District"}]
["Vacant Building","2020-01-29","Completed","Closed","98199",{"$f":"_xlfn.XLOOKUP(--fSeattle2020Complaints[[#This Row],[ZipCode]],dZipNeighborhood[ZipCode],dZipNeighborhood[Neighborhood])","v":"Magnolia"}]
["Construction","2020-03-03","Completed","Completed","98133",{"$f":"_xlfn.XLOOKUP(--fSeattle2020Complaints[[#This Row],[ZipCode]],dZipNeighborhood[ZipCode],dZipNeighborhood[Neighborhood])","v":"Shoreline"}]
["Land Use","2020-04-16","Completed","Completed","98103",{"$f":"_xlfn.XLOOKUP(--fSeattle2020Complaints[[#This Row],[ZipCode]],dZipNeighborhood[ZipCode],dZipNeighborhood[Neighborhood])","v":"Greenwood"}]
["Land Use","2020-02-05","Completed","Completed","98106",{"$f":"_xlfn.XLOOKUP(--fSeattle2020Complaints[[#This Row],[ZipCode]],dZipNeighborhood[ZipCode],dZipNeighborhood[Neighborhood])","v":"Delridge"}]
["Land Use","2020-08-20","Completed","Completed","98118",{"$f":"_xlfn.XLOOKUP(--fSeattle2020Complaints[[#This Row],[ZipCode]],dZipNeighborhood[ZipCode],dZipNeighborhood[Neighborhood])","v":"Columbia City"}]
["Construction , Noise , Tree","2020-03-20","Completed","Completed","98119",{"$f":"_xlfn.XLOOKUP(--fSeattle2020Complaints[[#This Row],[ZipCode]],dZipNeighborhood[ZipCode],dZipNeighborhood[Neighborhood])","v":"Queen Anne"}]
["Construction","2020-01-21","Admin Closure","Completed","98136",{"$f":"_xlfn.XLOOKUP(--fSeattle2020Complaints[[#This Row],[ZipCode]],dZipNeighborhood[ZipCode],dZipNeighborhood[Neighborhood])","v":"Seaview"}]
["Weeds","2020-07-28","Completed","Completed","98125",{"$f":"_xlfn.XLOOKUP(--fSeattle2020Complaints[[#This Row],[ZipCode]],dZipNeighborhood[ZipCode],dZipNeighborhood[Neighborhood])","v":"Northgate"}]
["Land Use","2020-07-30","Completed","Completed","98126",{"$f":"_xlfn.XLOOKUP(--fSeattle2020Complaints[[#This Row],[ZipCode]],dZipNeighborhood[ZipCode],dZipNeighborhood[Neighborhood])","v":"High Point"}]
["Construction","2020-03-12","Completed","NOV Issued","98115",{"$f":"_xlfn.XLOOKUP(--fSeattle2020Complaints[[#This Row],[ZipCode]],dZipNeighborhood[ZipCode],dZipNeighborhood[Neighborhood])","v":"Greenlake"}]
["Weeds","2020-09-22","Completed","Completed","98144",{"$f":"_xlfn.XLOOKUP(--fSeattle2020Complaints[[#This Row],[ZipCode]],dZipNeighborhood[ZipCode],dZipNeighborhood[Neighborhood])","v":"Mount Baker"}]
["Land Use","2020-08-20","Completed","Completed","98118",{"$f":"_xlfn.XLOOKUP(--fSeattle2020Complaints[[#This Row],[ZipCode]],dZipNeighborhood[ZipCode],dZipNeighborhood[Neighborhood])","v":"Columbia City"}]
["Construction","2020-08-11","Completed","Completed","98144",{"$f":"_xlfn.XLOOKUP(--fSeattle2020Complaints[[#This Row],[ZipCode]],dZipNeighborhood[ZipCode],dZipNeighborhood[Neighborhood])","v":"Mount Baker"}]
["Land Use","2020-09-28","Not Vacant","Completed","98199",{"$f":"_xlfn.XLOOKUP(--fSeattle2020Complaints[[#This Row],[ZipCode]],dZipNeighborhood[ZipCode],dZipNeighborhood[Neighborhood])","v":"Magnolia"}]
["Weeds","2020-02-26","Compliance Achieved","Completed","98103",{"$f":"_xlfn.XLOOKUP(--fSeattle2020Complaints[[#This Row],[ZipCode]],dZipNeighborhood[ZipCode],dZipNeighborhood[Neighborhood])","v":"Greenwood"}]
["Construction","2020-11-16","Completed","Completed","98178",{"$f":"_xlfn.XLOOKUP(--fSeattle2020Complaints[[#This Row],[ZipCode]],dZipNeighborhood[ZipCode],dZipNeighborhood[Neighborhood])","v":"Skyway"}]
["Construction","2020-09-17","Completed","Completed","98115",{"$f":"_xlfn.XLOOKUP(--fSeattle2020Complaints[[#This Row],[ZipCode]],dZipNeighborhood[ZipCode],dZipNeighborhood[Neighborhood])","v":"Greenlake"}]
["Land Use","2020-07-24","Completed","Completed","98119",{"$f":"_xlfn.XLOOKUP(--fSeattle2020Complaints[[#This Row],[ZipCode]],dZipNeighborhood[ZipCode],dZipNeighborhood[Neighborhood])","v":"Queen Anne"}]
["Weeds","2020-07-03","Completed","Completed","98122",{"$f":"_xlfn.XLOOKUP(--fSeattle2020Complaints[[#This Row],[ZipCode]],dZipNeighborhood[ZipCode],dZipNeighborhood[Neighborhood])","v":"Minor, Central Area"}]
["Weeds","2020-07-02","Compliance Achieved","Completed","98136",{"$f":"_xlfn.XLOOKUP(--fSeattle2020Complaints[[#This Row],[ZipCode]],dZipNeighborhood[ZipCode],dZipNeighborhood[Neighborhood])","v":"Seaview"}]
["Construction","2020-01-23","Completed","Completed","98125",{"$f":"_xlfn.XLOOKUP(--fSeattle2020Complaints[[#This Row],[ZipCode]],dZipNeighborhood[ZipCode],dZipNeighborhood[Neighborhood])","v":"Northgate"}]
["Tree","2020-12-15","Completed","Completed","98126",{"$f":"_xlfn.XLOOKUP(--fSeattle2020Complaints[[#This Row],[ZipCode]],dZipNeighborhood[ZipCode],dZipNeighborhood[Neighborhood])","v":"High Point"}]
["Tree","2020-09-22","Completed","Completed","98136",{"$f":"_xlfn.XLOOKUP(--fSeattle2020Complaints[[#This Row],[ZipCode]],dZipNeighborhood[ZipCode],dZipNeighborhood[Neighborhood])","v":"Seaview"}]
["Land Use","2020-07-06","Completed","Completed","98103",{"$f":"_xlfn.XLOOKUP(--fSeattle2020Complaints[[#This Row],[ZipCode]],dZipNeighborhood[ZipCode],dZipNeighborhood[Neighborhood])","v":"Greenwood"}]
["Construction , Tree","2020-03-13","Completed","Closed","98112",{"$f":"_xlfn.XLOOKUP(--fSeattle2020Complaints[[#This Row],[ZipCode]],dZipNeighborhood[ZipCode],dZipNeighborhood[Neighborhood])","v":"Madison Park"}]
["Weeds","2020-02-24","Completed","Under Investigation","98103",{"$f":"_xlfn.XLOOKUP(--fSeattle2020Complaints[[#This Row],[ZipCode]],dZipNeighborhood[ZipCode],dZipNeighborhood[Neighborhood])","v":"Greenwood"}]
["Emergency , Vacant Building","2020-02-04","Compliance Achieved","Completed","98102",{"$f":"_xlfn.XLOOKUP(--fSeattle2020Complaints[[#This Row],[ZipCode]],dZipNeighborhood[ZipCode],dZipNeighborhood[Neighborhood])","v":"Capital Hill"}]
["ECA , Tree","2020-11-09","Completed","Under Investigation","98116",{"$f":"_xlfn.XLOOKUP(--fSeattle2020Complaints[[#This Row],[ZipCode]],dZipNeighborhood[ZipCode],dZipNeighborhood[Neighborhood])","v":"West Seattle"}]
["Land Use","2020-04-21","Completed","Completed","98146",{"$f":"_xlfn.XLOOKUP(--fSeattle2020Complaints[[#This Row],[ZipCode]],dZipNeighborhood[ZipCode],dZipNeighborhood[Neighborhood])","v":"Shorewood, White Center"}]
["Vacant Building","2020-08-16","Completed","Completed","98117",{"$f":"_xlfn.XLOOKUP(--fSeattle2020Complaints[[#This Row],[ZipCode]],dZipNeighborhood[ZipCode],dZipNeighborhood[Neighborhood])","v":"Sunset Hill"}]
["Land Use","2020-03-18","Completed","Completed","98122",{"$f":"_xlfn.XLOOKUP(--fSeattle2020Complaints[[#This Row],[ZipCode]],dZipNeighborhood[ZipCode],dZipNeighborhood[Neighborhood])","v":"Minor, Central Area"}]
["Land Use","2020-09-01","Completed","Completed","98117",{"$f":"_xlfn.XLOOKUP(--fSeattle2020Complaints[[#This Row],[ZipCode]],dZipNeighborhood[ZipCode],dZipNeighborhood[Neighborhood])","v":"Sunset Hill"}]
["Land Use","2020-08-20","Completed","Completed","98122",{"$f":"_xlfn.XLOOKUP(--fSeattle2020Complaints[[#This Row],[ZipCode]],dZipNeighborhood[ZipCode],dZipNeighborhood[Neighborhood])","v":"Minor, Central Area"}]
["Weeds","2020-05-31","Completed","Completed","98144",{"$f":"_xlfn.XLOOKUP(--fSeattle2020Complaints[[#This Row],[ZipCode]],dZipNeighborhood[ZipCode],dZipNeighborhood[Neighborhood])","v":"Mount Baker"}]
["Land Use","2020-03-18","Completed","Completed","98117",{"$f":"_xlfn.XLOOKUP(--fSeattle2020Complaints[[#This Row],[ZipCode]],dZipNeighborhood[ZipCode],dZipNeighborhood[Neighborhood])","v":"Sunset Hill"}]
["Vacant Building","2020-01-27","Completed","Completed","98115",{"$f":"_xlfn.XLOOKUP(--fSeattle2020Complaints[[#This Row],[ZipCode]],dZipNeighborhood[ZipCode],dZipNeighborhood[Neighborhood])","v":"Greenlake"}]
["Land Use","2020-02-24","Completed","Completed","98105",{"$f":"_xlfn.XLOOKUP(--fSeattle2020Complaints[[#This Row],[ZipCode]],dZipNeighborhood[ZipCode],dZipNeighborhood[Neighborhood])","v":"University District"}]
["Land Use","2020-08-20","Completed","Closed","98105",{"$f":"_xlfn.XLOOKUP(--fSeattle2020Complaints[[#This Row],[ZipCode]],dZipNeighborhood[ZipCode],dZipNeighborhood[Neighborhood])","v":"University District"}]
["Construction","2020-10-29","Completed","Completed","98105",{"$f":"_xlfn.XLOOKUP(--fSeattle2020Complaints[[#This Row],[ZipCode]],dZipNeighborhood[ZipCode],dZipNeighborhood[Neighborhood])","v":"University District"}]
["Weeds","2020-06-09","Completed","Completed","98199",{"$f":"_xlfn.XLOOKUP(--fSeattle2020Complaints[[#This Row],[ZipCode]],dZipNeighborhood[ZipCode],dZipNeighborhood[Neighborhood])","v":"Magnolia"}]
["Weeds","2020-02-16","Completed","Completed","98103",{"$f":"_xlfn.XLOOKUP(--fSeattle2020Complaints[[#This Row],[ZipCode]],dZipNeighborhood[ZipCode],dZipNeighborhood[Neighborhood])","v":"Greenwood"}]
["Land Use","2020-10-19","Completed","Completed","98105",{"$f":"_xlfn.XLOOKUP(--fSeattle2020Complaints[[#This Row],[ZipCode]],dZipNeighborhood[ZipCode],dZipNeighborhood[Neighborhood])","v":"University District"}]
["Tree","2020-07-28","Completed","Completed","98105",{"$f":"_xlfn.XLOOKUP(--fSeattle2020Complaints[[#This Row],[ZipCode]],dZipNeighborhood[ZipCode],dZipNeighborhood[Neighborhood])","v":"University District"}]
["Emergency , LandLord/Tenant","2020-02-20","Completed","Completed","98109",{"$f":"_xlfn.XLOOKUP(--fSeattle2020Complaints[[#This Row],[ZipCode]],dZipNeighborhood[ZipCode],dZipNeighborhood[Neighborhood])","v":"South Lake Union"}]
["Noise","2020-12-17","Completed","Completed","98121",{"$f":"_xlfn.XLOOKUP(--fSeattle2020Complaints[[#This Row],[ZipCode]],dZipNeighborhood[ZipCode],dZipNeighborhood[Neighborhood])","v":"Belltown"}]
["Vacant Building","2020-05-22","Completed","Completed","98118",{"$f":"_xlfn.XLOOKUP(--fSeattle2020Complaints[[#This Row],[ZipCode]],dZipNeighborhood[ZipCode],dZipNeighborhood[Neighborhood])","v":"Columbia City"}]
["Land Use","2020-07-21","Completed","Closed","98105",{"$f":"_xlfn.XLOOKUP(--fSeattle2020Complaints[[#This Row],[ZipCode]],dZipNeighborhood[ZipCode],dZipNeighborhood[Neighborhood])","v":"University District"}]
["Weeds","2020-06-28","Completed","Completed","98106",{"$f":"_xlfn.XLOOKUP(--fSeattle2020Complaints[[#This Row],[ZipCode]],dZipNeighborhood[ZipCode],dZipNeighborhood[Neighborhood])","v":"Delridge"}]
["Land Use","2020-10-13","Completed","Completed","98103",{"$f":"_xlfn.XLOOKUP(--fSeattle2020Complaints[[#This Row],[ZipCode]],dZipNeighborhood[ZipCode],dZipNeighborhood[Neighborhood])","v":"Greenwood"}]
["Land Use","2020-08-05","Completed","Completed","98122",{"$f":"_xlfn.XLOOKUP(--fSeattle2020Complaints[[#This Row],[ZipCode]],dZipNeighborhood[ZipCode],dZipNeighborhood[Neighborhood])","v":"Minor, Central Area"}]
["Weeds","2020-06-01","Completed","Completed","98108",{"$f":"_xlfn.XLOOKUP(--fSeattle2020Complaints[[#This Row],[ZipCode]],dZipNeighborhood[ZipCode],dZipNeighborhood[Neighborhood])","v":"Rainer Valley"}]
["Weeds","2020-01-10","Completed","Completed","98126",{"$f":"_xlfn.XLOOKUP(--fSeattle2020Complaints[[#This Row],[ZipCode]],dZipNeighborhood[ZipCode],dZipNeighborhood[Neighborhood])","v":"High Point"}]
["Land Use","2020-03-03","Withdrawn","Completed","98125",{"$f":"_xlfn.XLOOKUP(--fSeattle2020Complaints[[#This Row],[ZipCode]],dZipNeighborhood[ZipCode],dZipNeighborhood[Neighborhood])","v":"Northgate"}]
["Construction","2020-06-08","Completed","NOV Issued","98118",{"$f":"_xlfn.XLOOKUP(--fSeattle2020Complaints[[#This Row],[ZipCode]],dZipNeighborhood[ZipCode],dZipNeighborhood[Neighborhood])","v":"Columbia City"}]
["Land Use","2020-09-23","Completed","Completed","98125",{"$f":"_xlfn.XLOOKUP(--fSeattle2020Complaints[[#This Row],[ZipCode]],dZipNeighborhood[ZipCode],dZipNeighborhood[Neighborhood])","v":"Northgate"}]
["Land Use","2020-09-09","Completed","Closed","98115",{"$f":"_xlfn.XLOOKUP(--fSeattle2020Complaints[[#This Row],[ZipCode]],dZipNeighborhood[ZipCode],dZipNeighborhood[Neighborhood])","v":"Greenlake"}]
["Construction , ECA , Tree","2020-06-17","Completed","Completed","98118",{"$f":"_xlfn.XLOOKUP(--fSeattle2020Complaints[[#This Row],[ZipCode]],dZipNeighborhood[ZipCode],dZipNeighborhood[Neighborhood])","v":"Columbia City"}]
["Land Use","2020-03-11","Compliance Achieved","Completed","98103",{"$f":"_xlfn.XLOOKUP(--fSeattle2020Complaints[[#This Row],[ZipCode]],dZipNeighborhood[ZipCode],dZipNeighborhood[Neighborhood])","v":"Greenwood"}]
["Construction","2020-11-17","Completed","Completed","98116",{"$f":"_xlfn.XLOOKUP(--fSeattle2020Complaints[[#This Row],[ZipCode]],dZipNeighborhood[ZipCode],dZipNeighborhood[Neighborhood])","v":"West Seattle"}]
["Weeds","2020-09-14","Completed","Closed","98117",{"$f":"_xlfn.XLOOKUP(--fSeattle2020Complaints[[#This Row],[ZipCode]],dZipNeighborhood[ZipCode],dZipNeighborhood[Neighborhood])","v":"Sunset Hill"}]
["Land Use","2020-07-09","Compliance Achieved","Completed","98101",{"$f":"_xlfn.XLOOKUP(--fSeattle2020Complaints[[#This Row],[ZipCode]],dZipNeighborhood[ZipCode],dZipNeighborhood[Neighborhood])","v":"Seattle"}]
["Vacant Building","2020-03-13","Completed","Completed","98144",{"$f":"_xlfn.XLOOKUP(--fSeattle2020Complaints[[#This Row],[ZipCode]],dZipNeighborhood[ZipCode],dZipNeighborhood[Neighborhood])","v":"Mount Baker"}]
["Land Use","2020-12-09","Completed","Completed","98102",{"$f":"_xlfn.XLOOKUP(--fSeattle2020Complaints[[#This Row],[ZipCode]],dZipNeighborhood[ZipCode],dZipNeighborhood[Neighborhood])","v":"Capital Hill"}]
["Land Use","2020-04-30","Completed","Completed","98122",{"$f":"_xlfn.XLOOKUP(--fSeattle2020Complaints[[#This Row],[ZipCode]],dZipNeighborhood[ZipCode],dZipNeighborhood[Neighborhood])","v":"Minor, Central Area"}]
["Weeds","2020-03-09","Completed","Completed","98116",{"$f":"_xlfn.XLOOKUP(--fSeattle2020Complaints[[#This Row],[ZipCode]],dZipNeighborhood[ZipCode],dZipNeighborhood[Neighborhood])","v":"West Seattle"}]
["Construction","2020-11-25","Completed","Completed","98106",{"$f":"_xlfn.XLOOKUP(--fSeattle2020Complaints[[#This Row],[ZipCode]],dZipNeighborhood[ZipCode],dZipNeighborhood[Neighborhood])","v":"Delridge"}]
["Weeds","2020-01-23","Compliance Achieved","Warning","98199",{"$f":"_xlfn.XLOOKUP(--fSeattle2020Complaints[[#This Row],[ZipCode]],dZipNeighborhood[ZipCode],dZipNeighborhood[Neighborhood])","v":"Magnolia"}]
["Land Use","2020-03-08","Completed","Completed","98106",{"$f":"_xlfn.XLOOKUP(--fSeattle2020Complaints[[#This Row],[ZipCode]],dZipNeighborhood[ZipCode],dZipNeighborhood[Neighborhood])","v":"Delridge"}]
["Construction","2020-03-11","Completed","Initiated","98107",{"$f":"_xlfn.XLOOKUP(--fSeattle2020Complaints[[#This Row],[ZipCode]],dZipNeighborhood[ZipCode],dZipNeighborhood[Neighborhood])","v":"Ballard"}]
["Construction","2020-11-02","Completed","Completed","98112",{"$f":"_xlfn.XLOOKUP(--fSeattle2020Complaints[[#This Row],[ZipCode]],dZipNeighborhood[ZipCode],dZipNeighborhood[Neighborhood])","v":"Madison Park"}]
["Weeds","2020-10-29","Completed","Completed","98144",{"$f":"_xlfn.XLOOKUP(--fSeattle2020Complaints[[#This Row],[ZipCode]],dZipNeighborhood[ZipCode],dZipNeighborhood[Neighborhood])","v":"Mount Baker"}]
["LandLord/Tenant","2020-09-24","Completed","Completed","98122",{"$f":"_xlfn.XLOOKUP(--fSeattle2020Complaints[[#This Row],[ZipCode]],dZipNeighborhood[ZipCode],dZipNeighborhood[Neighborhood])","v":"Minor, Central Area"}]
["Weeds","2020-07-06","Completed","Citation Issued","98106",{"$f":"_xlfn.XLOOKUP(--fSeattle2020Complaints[[#This Row],[ZipCode]],dZipNeighborhood[ZipCode],dZipNeighborhood[Neighborhood])","v":"Delridge"}]
["Land Use","2020-12-17","Completed","Completed","98122",{"$f":"_xlfn.XLOOKUP(--fSeattle2020Complaints[[#This Row],[ZipCode]],dZipNeighborhood[ZipCode],dZipNeighborhood[Neighborhood])","v":"Minor, Central Area"}]
["Construction","2020-10-16","Completed","Closed","98118",{"$f":"_xlfn.XLOOKUP(--fSeattle2020Complaints[[#This Row],[ZipCode]],dZipNeighborhood[ZipCode],dZipNeighborhood[Neighborhood])","v":"Columbia City"}]
["Weeds","2020-06-22","Completed","Completed","98122",{"$f":"_xlfn.XLOOKUP(--fSeattle2020Complaints[[#This Row],[ZipCode]],dZipNeighborhood[ZipCode],dZipNeighborhood[Neighborhood])","v":"Minor, Central Area"}]
["Weeds","2020-05-04","Completed","Completed","98106",{"$f":"_xlfn.XLOOKUP(--fSeattle2020Complaints[[#This Row],[ZipCode]],dZipNeighborhood[ZipCode],dZipNeighborhood[Neighborhood])","v":"Delridge"}]
["Land Use","2020-02-27","Completed","Completed","98115",{"$f":"_xlfn.XLOOKUP(--fSeattle2020Complaints[[#This Row],[ZipCode]],dZipNeighborhood[ZipCode],dZipNeighborhood[Neighborhood])","v":"Greenlake"}]
["Construction","2020-10-01","Completed","Completed","98107",{"$f":"_xlfn.XLOOKUP(--fSeattle2020Complaints[[#This Row],[ZipCode]],dZipNeighborhood[ZipCode],dZipNeighborhood[Neighborhood])","v":"Ballard"}]
["Land Use","2020-11-18","Completed","Completed","98117",{"$f":"_xlfn.XLOOKUP(--fSeattle2020Complaints[[#This Row],[ZipCode]],dZipNeighborhood[ZipCode],dZipNeighborhood[Neighborhood])","v":"Sunset Hill"}]
["Construction","2020-09-15","Completed","Completed","98115",{"$f":"_xlfn.XLOOKUP(--fSeattle2020Complaints[[#This Row],[ZipCode]],dZipNeighborhood[ZipCode],dZipNeighborhood[Neighborhood])","v":"Greenlake"}]
["Construction","2020-12-03","Completed","Completed","98115",{"$f":"_xlfn.XLOOKUP(--fSeattle2020Complaints[[#This Row],[ZipCode]],dZipNeighborhood[ZipCode],dZipNeighborhood[Neighborhood])","v":"Greenlake"}]
["Construction , Tree","2020-04-06","Completed","Completed","98119",{"$f":"_xlfn.XLOOKUP(--fSeattle2020Complaints[[#This Row],[ZipCode]],dZipNeighborhood[ZipCode],dZipNeighborhood[Neighborhood])","v":"Queen Anne"}]
["Land Use","2020-05-27","Completed","Completed","98106",{"$f":"_xlfn.XLOOKUP(--fSeattle2020Complaints[[#This Row],[ZipCode]],dZipNeighborhood[ZipCode],dZipNeighborhood[Neighborhood])","v":"Delridge"}]
["Vacant Building","2020-08-09","Completed","Completed","98117",{"$f":"_xlfn.XLOOKUP(--fSeattle2020Complaints[[#This Row],[ZipCode]],dZipNeighborhood[ZipCode],dZipNeighborhood[Neighborhood])","v":"Sunset Hill"}]
["Vacant Building","2020-05-20","Completed","Completed","98117",{"$f":"_xlfn.XLOOKUP(--fSeattle2020Complaints[[#This Row],[ZipCode]],dZipNeighborhood[ZipCode],dZipNeighborhood[Neighborhood])","v":"Sunset Hill"}]
["Land Use","2020-01-17","Completed","Completed","98106",{"$f":"_xlfn.XLOOKUP(--fSeattle2020Complaints[[#This Row],[ZipCode]],dZipNeighborhood[ZipCode],dZipNeighborhood[Neighborhood])","v":"Delridge"}]
["Land Use","2020-05-08","Completed","Completed","98108",{"$f":"_xlfn.XLOOKUP(--fSeattle2020Complaints[[#This Row],[ZipCode]],dZipNeighborhood[ZipCode],dZipNeighborhood[Neighborhood])","v":"Rainer Valley"}]
["Noise","2020-02-20","Completed","Completed","98116",{"$f":"_xlfn.XLOOKUP(--fSeattle2020Complaints[[#This Row],[ZipCode]],dZipNeighborhood[ZipCode],dZipNeighborhood[Neighborhood])","v":"West Seattle"}]
["Noise","2020-12-08","Completed","Completed","98104",{"$f":"_xlfn.XLOOKUP(--fSeattle2020Complaints[[#This Row],[ZipCode]],dZipNeighborhood[ZipCode],dZipNeighborhood[Neighborhood])","v":"International District"}]
["Tree","2020-06-10","Completed","Completed","98108",{"$f":"_xlfn.XLOOKUP(--fSeattle2020Complaints[[#This Row],[ZipCode]],dZipNeighborhood[ZipCode],dZipNeighborhood[Neighborhood])","v":"Rainer Valley"}]
["Shoreline","2020-10-15","Completed","NOV Issued","98178",{"$f":"_xlfn.XLOOKUP(--fSeattle2020Complaints[[#This Row],[ZipCode]],dZipNeighborhood[ZipCode],dZipNeighborhood[Neighborhood])","v":"Skyway"}]
["Emergency , Vacant Building","2020-01-07","Compliance Achieved","Completed","98118",{"$f":"_xlfn.XLOOKUP(--fSeattle2020Complaints[[#This Row],[ZipCode]],dZipNeighborhood[ZipCode],dZipNeighborhood[Neighborhood])","v":"Columbia City"}]
["Land Use","2020-03-17","Completed","Completed","98125",{"$f":"_xlfn.XLOOKUP(--fSeattle2020Complaints[[#This Row],[ZipCode]],dZipNeighborhood[ZipCode],dZipNeighborhood[Neighborhood])","v":"Northgate"}]
["Construction","2020-04-21","Completed","Completed","98115",{"$f":"_xlfn.XLOOKUP(--fSeattle2020Complaints[[#This Row],[ZipCode]],dZipNeighborhood[ZipCode],dZipNeighborhood[Neighborhood])","v":"Greenlake"}]
["Weeds","2020-10-08","Completed","Completed","98125",{"$f":"_xlfn.XLOOKUP(--fSeattle2020Complaints[[#This Row],[ZipCode]],dZipNeighborhood[ZipCode],dZipNeighborhood[Neighborhood])","v":"Northgate"}]
["Vacant Building","2020-07-28","Completed","Completed","98118",{"$f":"_xlfn.XLOOKUP(--fSeattle2020Complaints[[#This Row],[ZipCode]],dZipNeighborhood[ZipCode],dZipNeighborhood[Neighborhood])","v":"Columbia City"}]
["Weeds","2020-06-17","Completed","Completed","98108",{"$f":"_xlfn.XLOOKUP(--fSeattle2020Complaints[[#This Row],[ZipCode]],dZipNeighborhood[ZipCode],dZipNeighborhood[Neighborhood])","v":"Rainer Valley"}]
["Weeds","2020-01-17","Completed","Completed","98115",{"$f":"_xlfn.XLOOKUP(--fSeattle2020Complaints[[#This Row],[ZipCode]],dZipNeighborhood[ZipCode],dZipNeighborhood[Neighborhood])","v":"Greenlake"}]
["Construction","2020-03-13","Completed","Initiated","98115",{"$f":"_xlfn.XLOOKUP(--fSeattle2020Complaints[[#This Row],[ZipCode]],dZipNeighborhood[ZipCode],dZipNeighborhood[Neighborhood])","v":"Greenlake"}]
["Weeds","2020-09-15","Completed","Completed","98119",{"$f":"_xlfn.XLOOKUP(--fSeattle2020Complaints[[#This Row],[ZipCode]],dZipNeighborhood[ZipCode],dZipNeighborhood[Neighborhood])","v":"Queen Anne"}]
["Vacant Building","2020-03-05","Completed","Completed","98104",{"$f":"_xlfn.XLOOKUP(--fSeattle2020Complaints[[#This Row],[ZipCode]],dZipNeighborhood[ZipCode],dZipNeighborhood[Neighborhood])","v":"International District"}]
["Land Use","2020-02-05","Completed","Completed","98144",{"$f":"_xlfn.XLOOKUP(--fSeattle2020Complaints[[#This Row],[ZipCode]],dZipNeighborhood[ZipCode],dZipNeighborhood[Neighborhood])","v":"Mount Baker"}]
["Shoreline","2020-10-05","Completed","Warning","98199",{"$f":"_xlfn.XLOOKUP(--fSeattle2020Complaints[[#This Row],[ZipCode]],dZipNeighborhood[ZipCode],dZipNeighborhood[Neighborhood])","v":"Magnolia"}]
["Weeds","2020-02-26","Compliance Achieved","Completed","98103",{"$f":"_xlfn.XLOOKUP(--fSeattle2020Complaints[[#This Row],[ZipCode]],dZipNeighborhood[ZipCode],dZipNeighborhood[Neighborhood])","v":"Greenwood"}]
["Construction","2020-05-07","Completed","Completed","98133",{"$f":"_xlfn.XLOOKUP(--fSeattle2020Complaints[[#This Row],[ZipCode]],dZipNeighborhood[ZipCode],dZipNeighborhood[Neighborhood])","v":"Shoreline"}]
["Land Use","2020-03-08","Completed","Completed","98112",{"$f":"_xlfn.XLOOKUP(--fSeattle2020Complaints[[#This Row],[ZipCode]],dZipNeighborhood[ZipCode],dZipNeighborhood[Neighborhood])","v":"Madison Park"}]
["Land Use","2020-02-27","Completed","Completed","98144",{"$f":"_xlfn.XLOOKUP(--fSeattle2020Complaints[[#This Row],[ZipCode]],dZipNeighborhood[ZipCode],dZipNeighborhood[Neighborhood])","v":"Mount Baker"}]
["Construction","2020-02-12","Completed","Completed","98103",{"$f":"_xlfn.XLOOKUP(--fSeattle2020Complaints[[#This Row],[ZipCode]],dZipNeighborhood[ZipCode],dZipNeighborhood[Neighborhood])","v":"Greenwood"}]
["Construction","2020-02-25","Completed","Closed","98106",{"$f":"_xlfn.XLOOKUP(--fSeattle2020Complaints[[#This Row],[ZipCode]],dZipNeighborhood[ZipCode],dZipNeighborhood[Neighborhood])","v":"Delridge"}]
["Land Use","2020-10-16","Completed","Completed","98122",{"$f":"_xlfn.XLOOKUP(--fSeattle2020Complaints[[#This Row],[ZipCode]],dZipNeighborhood[ZipCode],dZipNeighborhood[Neighborhood])","v":"Minor, Central Area"}]
["Weeds","2020-02-25","Completed","Completed","98117",{"$f":"_xlfn.XLOOKUP(--fSeattle2020Complaints[[#This Row],[ZipCode]],dZipNeighborhood[ZipCode],dZipNeighborhood[Neighborhood])","v":"Sunset Hill"}]
["Land UseEmergency , Vacant Building ,","2020-06-09","Completed","Completed","98144",{"$f":"_xlfn.XLOOKUP(--fSeattle2020Complaints[[#This Row],[ZipCode]],dZipNeighborhood[ZipCode],dZipNeighborhood[Neighborhood])","v":"Mount Baker"}]
["Construction","2020-01-14","Completed","Completed","98199",{"$f":"_xlfn.XLOOKUP(--fSeattle2020Complaints[[#This Row],[ZipCode]],dZipNeighborhood[ZipCode],dZipNeighborhood[Neighborhood])","v":"Magnolia"}]
["Land Use","2020-02-07","Completed","Completed","98118",{"$f":"_xlfn.XLOOKUP(--fSeattle2020Complaints[[#This Row],[ZipCode]],dZipNeighborhood[ZipCode],dZipNeighborhood[Neighborhood])","v":"Columbia City"}]
["Shoreline , Tree","2020-06-04","Completed","Completed","98116",{"$f":"_xlfn.XLOOKUP(--fSeattle2020Complaints[[#This Row],[ZipCode]],dZipNeighborhood[ZipCode],dZipNeighborhood[Neighborhood])","v":"West Seattle"}]
["Land Use","2020-09-08","Completed","Completed","98122",{"$f":"_xlfn.XLOOKUP(--fSeattle2020Complaints[[#This Row],[ZipCode]],dZipNeighborhood[ZipCode],dZipNeighborhood[Neighborhood])","v":"Minor, Central Area"}]
["Emergency , Vacant Building","2020-05-19","Completed","Completed","98119",{"$f":"_xlfn.XLOOKUP(--fSeattle2020Complaints[[#This Row],[ZipCode]],dZipNeighborhood[ZipCode],dZipNeighborhood[Neighborhood])","v":"Queen Anne"}]
["Weeds","2020-06-04","Completed","Completed","98122",{"$f":"_xlfn.XLOOKUP(--fSeattle2020Complaints[[#This Row],[ZipCode]],dZipNeighborhood[ZipCode],dZipNeighborhood[Neighborhood])","v":"Minor, Central Area"}]
["Emergency , Vacant Building","2020-01-24","Completed","Completed","98105",{"$f":"_xlfn.XLOOKUP(--fSeattle2020Complaints[[#This Row],[ZipCode]],dZipNeighborhood[ZipCode],dZipNeighborhood[Neighborhood])","v":"University District"}]
["Weeds","2020-03-17","Completed","Completed","98199",{"$f":"_xlfn.XLOOKUP(--fSeattle2020Complaints[[#This Row],[ZipCode]],dZipNeighborhood[ZipCode],dZipNeighborhood[Neighborhood])","v":"Magnolia"}]
["Weeds","2020-10-01","Completed","Completed","98108",{"$f":"_xlfn.XLOOKUP(--fSeattle2020Complaints[[#This Row],[ZipCode]],dZipNeighborhood[ZipCode],dZipNeighborhood[Neighborhood])","v":"Rainer Valley"}]
["Land Use","2020-11-06","Completed","Completed","98118",{"$f":"_xlfn.XLOOKUP(--fSeattle2020Complaints[[#This Row],[ZipCode]],dZipNeighborhood[ZipCode],dZipNeighborhood[Neighborhood])","v":"Columbia City"}]
["Weeds","2020-02-07","Completed","Completed","98116",{"$f":"_xlfn.XLOOKUP(--fSeattle2020Complaints[[#This Row],[ZipCode]],dZipNeighborhood[ZipCode],dZipNeighborhood[Neighborhood])","v":"West Seattle"}]
["Weeds","2020-08-20","Completed","Completed","98144",{"$f":"_xlfn.XLOOKUP(--fSeattle2020Complaints[[#This Row],[ZipCode]],dZipNeighborhood[ZipCode],dZipNeighborhood[Neighborhood])","v":"Mount Baker"}]
["Land Use","2020-05-18","Completed","Completed","98117",{"$f":"_xlfn.XLOOKUP(--fSeattle2020Complaints[[#This Row],[ZipCode]],dZipNeighborhood[ZipCode],dZipNeighborhood[Neighborhood])","v":"Sunset Hill"}]
["Tree","2020-05-11","Completed","Closed","98125",{"$f":"_xlfn.XLOOKUP(--fSeattle2020Complaints[[#This Row],[ZipCode]],dZipNeighborhood[ZipCode],dZipNeighborhood[Neighborhood])","v":"Northgate"}]
["Weeds","2020-08-11","Completed","Completed","98117",{"$f":"_xlfn.XLOOKUP(--fSeattle2020Complaints[[#This Row],[ZipCode]],dZipNeighborhood[ZipCode],dZipNeighborhood[Neighborhood])","v":"Sunset Hill"}]
["Construction","2020-12-31","Completed","Completed","98118",{"$f":"_xlfn.XLOOKUP(--fSeattle2020Complaints[[#This Row],[ZipCode]],dZipNeighborhood[ZipCode],dZipNeighborhood[Neighborhood])","v":"Columbia City"}]
["Land Use","2020-08-19","Completed","Completed","98117",{"$f":"_xlfn.XLOOKUP(--fSeattle2020Complaints[[#This Row],[ZipCode]],dZipNeighborhood[ZipCode],dZipNeighborhood[Neighborhood])","v":"Sunset Hill"}]
["Land Use","2020-08-20","Completed","Completed","98177",{"$f":"_xlfn.XLOOKUP(--fSeattle2020Complaints[[#This Row],[ZipCode]],dZipNeighborhood[ZipCode],dZipNeighborhood[Neighborhood])","v":"Richmond Beach"}]
["Weeds","2020-07-01","Compliance Achieved","Completed","98102",{"$f":"_xlfn.XLOOKUP(--fSeattle2020Complaints[[#This Row],[ZipCode]],dZipNeighborhood[ZipCode],dZipNeighborhood[Neighborhood])","v":"Capital Hill"}]
["Construction","2020-12-27","Completed","Completed","98199",{"$f":"_xlfn.XLOOKUP(--fSeattle2020Complaints[[#This Row],[ZipCode]],dZipNeighborhood[ZipCode],dZipNeighborhood[Neighborhood])","v":"Magnolia"}]
["Construction","2020-09-21","Completed","Completed","98117",{"$f":"_xlfn.XLOOKUP(--fSeattle2020Complaints[[#This Row],[ZipCode]],dZipNeighborhood[ZipCode],dZipNeighborhood[Neighborhood])","v":"Sunset Hill"}]
["Construction","2020-12-11","Completed","Completed","98107",{"$f":"_xlfn.XLOOKUP(--fSeattle2020Complaints[[#This Row],[ZipCode]],dZipNeighborhood[ZipCode],dZipNeighborhood[Neighborhood])","v":"Ballard"}]
["Construction , Tree","2020-12-02","Completed","Completed","98144",{"$f":"_xlfn.XLOOKUP(--fSeattle2020Complaints[[#This Row],[ZipCode]],dZipNeighborhood[ZipCode],dZipNeighborhood[Neighborhood])","v":"Mount Baker"}]
["Weeds","2020-03-05","Completed","Closed","98116",{"$f":"_xlfn.XLOOKUP(--fSeattle2020Complaints[[#This Row],[ZipCode]],dZipNeighborhood[ZipCode],dZipNeighborhood[Neighborhood])","v":"West Seattle"}]
["Land Use","2020-01-16","Completed","Completed","98103",{"$f":"_xlfn.XLOOKUP(--fSeattle2020Complaints[[#This Row],[ZipCode]],dZipNeighborhood[ZipCode],dZipNeighborhood[Neighborhood])","v":"Greenwood"}]
["Weeds","2020-08-13","Completed","Completed","98133",{"$f":"_xlfn.XLOOKUP(--fSeattle2020Complaints[[#This Row],[ZipCode]],dZipNeighborhood[ZipCode],dZipNeighborhood[Neighborhood])","v":"Shoreline"}]
["Construction , Noise","2020-08-25","Completed","Completed","98199",{"$f":"_xlfn.XLOOKUP(--fSeattle2020Complaints[[#This Row],[ZipCode]],dZipNeighborhood[ZipCode],dZipNeighborhood[Neighborhood])","v":"Magnolia"}]
["Land UseConstruction ,","2020-03-24","Completed","Completed","98117",{"$f":"_xlfn.XLOOKUP(--fSeattle2020Complaints[[#This Row],[ZipCode]],dZipNeighborhood[ZipCode],dZipNeighborhood[Neighborhood])","v":"Sunset Hill"}]
["Land Use","2020-02-05","Completed","Completed","98126",{"$f":"_xlfn.XLOOKUP(--fSeattle2020Complaints[[#This Row],[ZipCode]],dZipNeighborhood[ZipCode],dZipNeighborhood[Neighborhood])","v":"High Point"}]
["Land Use","2020-12-20","Completed","Completed","98144",{"$f":"_xlfn.XLOOKUP(--fSeattle2020Complaints[[#This Row],[ZipCode]],dZipNeighborhood[ZipCode],dZipNeighborhood[Neighborhood])","v":"Mount Baker"}]
["Land Use","2020-07-23","Completed","Initiated","98106",{"$f":"_xlfn.XLOOKUP(--fSeattle2020Complaints[[#This Row],[ZipCode]],dZipNeighborhood[ZipCode],dZipNeighborhood[Neighborhood])","v":"Delridge"}]
["Tree","2020-04-12","Completed","Closed","98136",{"$f":"_xlfn.XLOOKUP(--fSeattle2020Complaints[[#This Row],[ZipCode]],dZipNeighborhood[ZipCode],dZipNeighborhood[Neighborhood])","v":"Seaview"}]
["Land Use","2020-08-02","Completed","Under Investigation","98133",{"$f":"_xlfn.XLOOKUP(--fSeattle2020Complaints[[#This Row],[ZipCode]],dZipNeighborhood[ZipCode],dZipNeighborhood[Neighborhood])","v":"Shoreline"}]
["Land Use","2020-03-12","Completed","NOV Issued","98107",{"$f":"_xlfn.XLOOKUP(--fSeattle2020Complaints[[#This Row],[ZipCode]],dZipNeighborhood[ZipCode],dZipNeighborhood[Neighborhood])","v":"Ballard"}]
["Construction","2020-12-22","Completed","Under Investigation","98118",{"$f":"_xlfn.XLOOKUP(--fSeattle2020Complaints[[#This Row],[ZipCode]],dZipNeighborhood[ZipCode],dZipNeighborhood[Neighborhood])","v":"Columbia City"}]
["Construction , ECA","2020-06-04","Completed","NOV Issued","98109",{"$f":"_xlfn.XLOOKUP(--fSeattle2020Complaints[[#This Row],[ZipCode]],dZipNeighborhood[ZipCode],dZipNeighborhood[Neighborhood])","v":"South Lake Union"}]
["Construction , Tree","2020-08-05","Completed","Completed","98136",{"$f":"_xlfn.XLOOKUP(--fSeattle2020Complaints[[#This Row],[ZipCode]],dZipNeighborhood[ZipCode],dZipNeighborhood[Neighborhood])","v":"Seaview"}]
["Construction","2020-06-14","Completed","Completed","98144",{"$f":"_xlfn.XLOOKUP(--fSeattle2020Complaints[[#This Row],[ZipCode]],dZipNeighborhood[ZipCode],dZipNeighborhood[Neighborhood])","v":"Mount Baker"}]
["Construction","2020-10-21","Completed","Completed","98112",{"$f":"_xlfn.XLOOKUP(--fSeattle2020Complaints[[#This Row],[ZipCode]],dZipNeighborhood[ZipCode],dZipNeighborhood[Neighborhood])","v":"Madison Park"}]
["Vacant Building","2020-08-21","Completed","Completed","98103",{"$f":"_xlfn.XLOOKUP(--fSeattle2020Complaints[[#This Row],[ZipCode]],dZipNeighborhood[ZipCode],dZipNeighborhood[Neighborhood])","v":"Greenwood"}]
["Land Use","2020-10-27","Completed","Completed","98103",{"$f":"_xlfn.XLOOKUP(--fSeattle2020Complaints[[#This Row],[ZipCode]],dZipNeighborhood[ZipCode],dZipNeighborhood[Neighborhood])","v":"Greenwood"}]
["Weeds","2020-03-23","Completed","Warning","98107",{"$f":"_xlfn.XLOOKUP(--fSeattle2020Complaints[[#This Row],[ZipCode]],dZipNeighborhood[ZipCode],dZipNeighborhood[Neighborhood])","v":"Ballard"}]
["Land Use","2020-06-16","Completed","Completed","98125",{"$f":"_xlfn.XLOOKUP(--fSeattle2020Complaints[[#This Row],[ZipCode]],dZipNeighborhood[ZipCode],dZipNeighborhood[Neighborhood])","v":"Northgate"}]
["Land Use","2020-01-27","Completed","Completed","98178",{"$f":"_xlfn.XLOOKUP(--fSeattle2020Complaints[[#This Row],[ZipCode]],dZipNeighborhood[ZipCode],dZipNeighborhood[Neighborhood])","v":"Skyway"}]
["Construction","2020-02-18","Completed","Initiated","98103",{"$f":"_xlfn.XLOOKUP(--fSeattle2020Complaints[[#This Row],[ZipCode]],dZipNeighborhood[ZipCode],dZipNeighborhood[Neighborhood])","v":"Greenwood"}]
["Land Use","2020-05-07","Completed","Completed","98106",{"$f":"_xlfn.XLOOKUP(--fSeattle2020Complaints[[#This Row],[ZipCode]],dZipNeighborhood[ZipCode],dZipNeighborhood[Neighborhood])","v":"Delridge"}]
["ECA , Tree","2020-04-03","Completed","Completed","98199",{"$f":"_xlfn.XLOOKUP(--fSeattle2020Complaints[[#This Row],[ZipCode]],dZipNeighborhood[ZipCode],dZipNeighborhood[Neighborhood])","v":"Magnolia"}]
["Land UseNoise ,","2020-07-30","Completed","Completed","98199",{"$f":"_xlfn.XLOOKUP(--fSeattle2020Complaints[[#This Row],[ZipCode]],dZipNeighborhood[ZipCode],dZipNeighborhood[Neighborhood])","v":"Magnolia"}]
["Land Use","2020-02-03","Completed","Completed","98122",{"$f":"_xlfn.XLOOKUP(--fSeattle2020Complaints[[#This Row],[ZipCode]],dZipNeighborhood[ZipCode],dZipNeighborhood[Neighborhood])","v":"Minor, Central Area"}]
["Land UseVacant Building ,","2020-04-14","Completed","Completed","98109",{"$f":"_xlfn.XLOOKUP(--fSeattle2020Complaints[[#This Row],[ZipCode]],dZipNeighborhood[ZipCode],dZipNeighborhood[Neighborhood])","v":"South Lake Union"}]
["Vacant Building","2020-08-21","Completed","Completed","98133",{"$f":"_xlfn.XLOOKUP(--fSeattle2020Complaints[[#This Row],[ZipCode]],dZipNeighborhood[ZipCode],dZipNeighborhood[Neighborhood])","v":"Shoreline"}]
["Land Use","2020-03-03","Completed","Completed","98107",{"$f":"_xlfn.XLOOKUP(--fSeattle2020Complaints[[#This Row],[ZipCode]],dZipNeighborhood[ZipCode],dZipNeighborhood[Neighborhood])","v":"Ballard"}]
["Vacant Building","2020-02-06","Completed","Completed","98103",{"$f":"_xlfn.XLOOKUP(--fSeattle2020Complaints[[#This Row],[ZipCode]],dZipNeighborhood[ZipCode],dZipNeighborhood[Neighborhood])","v":"Greenwood"}]
["Land Use","2020-07-07","Completed","Completed","98106",{"$f":"_xlfn.XLOOKUP(--fSeattle2020Complaints[[#This Row],[ZipCode]],dZipNeighborhood[ZipCode],dZipNeighborhood[Neighborhood])","v":"Delridge"}]
["Land Use","2020-10-07","No Access/Unable to Observe","Closed","98115",{"$f":"_xlfn.XLOOKUP(--fSeattle2020Complaints[[#This Row],[ZipCode]],dZipNeighborhood[ZipCode],dZipNeighborhood[Neighborhood])","v":"Greenlake"}]
["Land Use","2020-10-13","Completed","Completed","98118",{"$f":"_xlfn.XLOOKUP(--fSeattle2020Complaints[[#This Row],[ZipCode]],dZipNeighborhood[ZipCode],dZipNeighborhood[Neighborhood])","v":"Columbia City"}]
["Land Use","2020-02-21","Completed","Completed","98116",{"$f":"_xlfn.XLOOKUP(--fSeattle2020Complaints[[#This Row],[ZipCode]],dZipNeighborhood[ZipCode],dZipNeighborhood[Neighborhood])","v":"West Seattle"}]
["Land UseConstruction ,","2020-06-15","Completed","Completed","98199",{"$f":"_xlfn.XLOOKUP(--fSeattle2020Complaints[[#This Row],[ZipCode]],dZipNeighborhood[ZipCode],dZipNeighborhood[Neighborhood])","v":"Magnolia"}]
["Weeds","2020-08-06","Completed","Completed","98108",{"$f":"_xlfn.XLOOKUP(--fSeattle2020Complaints[[#This Row],[ZipCode]],dZipNeighborhood[ZipCode],dZipNeighborhood[Neighborhood])","v":"Rainer Valley"}]
["Land Use","2020-12-02","Completed","Completed","98102",{"$f":"_xlfn.XLOOKUP(--fSeattle2020Complaints[[#This Row],[ZipCode]],dZipNeighborhood[ZipCode],dZipNeighborhood[Neighborhood])","v":"Capital Hill"}]
["Land Use","2020-12-22","Completed","Completed","98107",{"$f":"_xlfn.XLOOKUP(--fSeattle2020Complaints[[#This Row],[ZipCode]],dZipNeighborhood[ZipCode],dZipNeighborhood[Neighborhood])","v":"Ballard"}]
["Weeds","2020-05-21","Completed","Completed","98116",{"$f":"_xlfn.XLOOKUP(--fSeattle2020Complaints[[#This Row],[ZipCode]],dZipNeighborhood[ZipCode],dZipNeighborhood[Neighborhood])","v":"West Seattle"}]
["Construction","2020-03-09","No Access/Unable to Observe","Closed","98178",{"$f":"_xlfn.XLOOKUP(--fSeattle2020Complaints[[#This Row],[ZipCode]],dZipNeighborhood[ZipCode],dZipNeighborhood[Neighborhood])","v":"Skyway"}]
["Land Use","2020-09-18","Completed","Completed","98125",{"$f":"_xlfn.XLOOKUP(--fSeattle2020Complaints[[#This Row],[ZipCode]],dZipNeighborhood[ZipCode],dZipNeighborhood[Neighborhood])","v":"Northgate"}]
["Weeds","2020-07-23","Completed","Completed","98106",{"$f":"_xlfn.XLOOKUP(--fSeattle2020Complaints[[#This Row],[ZipCode]],dZipNeighborhood[ZipCode],dZipNeighborhood[Neighborhood])","v":"Delridge"}]
["Land Use","2020-07-22","Completed","Completed","98115",{"$f":"_xlfn.XLOOKUP(--fSeattle2020Complaints[[#This Row],[ZipCode]],dZipNeighborhood[ZipCode],dZipNeighborhood[Neighborhood])","v":"Greenlake"}]
["Vacant Building","2020-06-04","Completed","Completed","98144",{"$f":"_xlfn.XLOOKUP(--fSeattle2020Complaints[[#This Row],[ZipCode]],dZipNeighborhood[ZipCode],dZipNeighborhood[Neighborhood])","v":"Mount Baker"}]
["Construction","2020-06-10","Completed","Completed","98125",{"$f":"_xlfn.XLOOKUP(--fSeattle2020Complaints[[#This Row],[ZipCode]],dZipNeighborhood[ZipCode],dZipNeighborhood[Neighborhood])","v":"Northgate"}]
["Construction","2020-02-28","Completed","Completed","98118",{"$f":"_xlfn.XLOOKUP(--fSeattle2020Complaints[[#This Row],[ZipCode]],dZipNeighborhood[ZipCode],dZipNeighborhood[Neighborhood])","v":"Columbia City"}]
["Land Use","2020-02-03","Completed","Completed","98107",{"$f":"_xlfn.XLOOKUP(--fSeattle2020Complaints[[#This Row],[ZipCode]],dZipNeighborhood[ZipCode],dZipNeighborhood[Neighborhood])","v":"Ballard"}]
["Land Use","2020-01-14","Completed","Completed","98102",{"$f":"_xlfn.XLOOKUP(--fSeattle2020Complaints[[#This Row],[ZipCode]],dZipNeighborhood[ZipCode],dZipNeighborhood[Neighborhood])","v":"Capital Hill"}]
["Land Use","2020-05-13","Completed","Completed","98121",{"$f":"_xlfn.XLOOKUP(--fSeattle2020Complaints[[#This Row],[ZipCode]],dZipNeighborhood[ZipCode],dZipNeighborhood[Neighborhood])","v":"Belltown"}]
["Weeds","2020-02-25","Completed","Warning","98119",{"$f":"_xlfn.XLOOKUP(--fSeattle2020Complaints[[#This Row],[ZipCode]],dZipNeighborhood[ZipCode],dZipNeighborhood[Neighborhood])","v":"Queen Anne"}]
["Weeds","2020-06-29","Completed","Completed","98115",{"$f":"_xlfn.XLOOKUP(--fSeattle2020Complaints[[#This Row],[ZipCode]],dZipNeighborhood[ZipCode],dZipNeighborhood[Neighborhood])","v":"Greenlake"}]
["Construction","2020-05-11","Completed","Completed","98109",{"$f":"_xlfn.XLOOKUP(--fSeattle2020Complaints[[#This Row],[ZipCode]],dZipNeighborhood[ZipCode],dZipNeighborhood[Neighborhood])","v":"South Lake Union"}]
["Land Use","2020-02-06","Completed","Completed","98122",{"$f":"_xlfn.XLOOKUP(--fSeattle2020Complaints[[#This Row],[ZipCode]],dZipNeighborhood[ZipCode],dZipNeighborhood[Neighborhood])","v":"Minor, Central Area"}]
["Land Use","2020-04-16","Completed","Completed","98115",{"$f":"_xlfn.XLOOKUP(--fSeattle2020Complaints[[#This Row],[ZipCode]],dZipNeighborhood[ZipCode],dZipNeighborhood[Neighborhood])","v":"Greenlake"}]
["Land Use","2020-02-21","Completed","Completed","98178",{"$f":"_xlfn.XLOOKUP(--fSeattle2020Complaints[[#This Row],[ZipCode]],dZipNeighborhood[ZipCode],dZipNeighborhood[Neighborhood])","v":"Skyway"}]
["Land Use","2020-03-17","Completed","Completed","98108",{"$f":"_xlfn.XLOOKUP(--fSeattle2020Complaints[[#This Row],[ZipCode]],dZipNeighborhood[ZipCode],dZipNeighborhood[Neighborhood])","v":"Rainer Valley"}]
["Land Use","2020-07-06","Completed","Completed","98106",{"$f":"_xlfn.XLOOKUP(--fSeattle2020Complaints[[#This Row],[ZipCode]],dZipNeighborhood[ZipCode],dZipNeighborhood[Neighborhood])","v":"Delridge"}]
["Land Use","2020-01-27","Completed","Completed","98115",{"$f":"_xlfn.XLOOKUP(--fSeattle2020Complaints[[#This Row],[ZipCode]],dZipNeighborhood[ZipCode],dZipNeighborhood[Neighborhood])","v":"Greenlake"}]
["Weeds","2020-07-16","Compliance Achieved","Completed","98122",{"$f":"_xlfn.XLOOKUP(--fSeattle2020Complaints[[#This Row],[ZipCode]],dZipNeighborhood[ZipCode],dZipNeighborhood[Neighborhood])","v":"Minor, Central Area"}]
["Land Use","2020-12-07","Completed","Completed","98118",{"$f":"_xlfn.XLOOKUP(--fSeattle2020Complaints[[#This Row],[ZipCode]],dZipNeighborhood[ZipCode],dZipNeighborhood[Neighborhood])","v":"Columbia City"}]
["Construction","2020-11-23","Completed","Completed","98107",{"$f":"_xlfn.XLOOKUP(--fSeattle2020Complaints[[#This Row],[ZipCode]],dZipNeighborhood[ZipCode],dZipNeighborhood[Neighborhood])","v":"Ballard"}]
["Vacant Building","2020-07-08","Compliance Achieved","Completed","98122",{"$f":"_xlfn.XLOOKUP(--fSeattle2020Complaints[[#This Row],[ZipCode]],dZipNeighborhood[ZipCode],dZipNeighborhood[Neighborhood])","v":"Minor, Central Area"}]
["Vacant Building","2020-03-06","Completed","Under Investigation","98118",{"$f":"_xlfn.XLOOKUP(--fSeattle2020Complaints[[#This Row],[ZipCode]],dZipNeighborhood[ZipCode],dZipNeighborhood[Neighborhood])","v":"Columbia City"}]
["Construction","2020-08-16","Completed","Completed","98103",{"$f":"_xlfn.XLOOKUP(--fSeattle2020Complaints[[#This Row],[ZipCode]],dZipNeighborhood[ZipCode],dZipNeighborhood[Neighborhood])","v":"Greenwood"}]
["Land Use","2020-02-23","Completed","Closed","98122",{"$f":"_xlfn.XLOOKUP(--fSeattle2020Complaints[[#This Row],[ZipCode]],dZipNeighborhood[ZipCode],dZipNeighborhood[Neighborhood])","v":"Minor, Central Area"}]
["ECA , Tree","2020-12-18","Completed","Completed","98116",{"$f":"_xlfn.XLOOKUP(--fSeattle2020Complaints[[#This Row],[ZipCode]],dZipNeighborhood[ZipCode],dZipNeighborhood[Neighborhood])","v":"West Seattle"}]
["Weeds","2020-07-01","Compliance Achieved","Completed","98105",{"$f":"_xlfn.XLOOKUP(--fSeattle2020Complaints[[#This Row],[ZipCode]],dZipNeighborhood[ZipCode],dZipNeighborhood[Neighborhood])","v":"University District"}]
["Emergency , Vacant Building","2020-06-24","Completed","Completed","98103",{"$f":"_xlfn.XLOOKUP(--fSeattle2020Complaints[[#This Row],[ZipCode]],dZipNeighborhood[ZipCode],dZipNeighborhood[Neighborhood])","v":"Greenwood"}]
["Vacant Building","2020-02-28","Completed","Completed","98108",{"$f":"_xlfn.XLOOKUP(--fSeattle2020Complaints[[#This Row],[ZipCode]],dZipNeighborhood[ZipCode],dZipNeighborhood[Neighborhood])","v":"Rainer Valley"}]
["Vacant Building","2020-01-23","Completed","Completed","98108",{"$f":"_xlfn.XLOOKUP(--fSeattle2020Complaints[[#This Row],[ZipCode]],dZipNeighborhood[ZipCode],dZipNeighborhood[Neighborhood])","v":"Rainer Valley"}]
["Weeds","2020-02-26","Compliance Achieved","Completed","98119",{"$f":"_xlfn.XLOOKUP(--fSeattle2020Complaints[[#This Row],[ZipCode]],dZipNeighborhood[ZipCode],dZipNeighborhood[Neighborhood])","v":"Queen Anne"}]
["Land Use","2020-06-18","Completed","Completed","98177",{"$f":"_xlfn.XLOOKUP(--fSeattle2020Complaints[[#This Row],[ZipCode]],dZipNeighborhood[ZipCode],dZipNeighborhood[Neighborhood])","v":"Richmond Beach"}]
["Construction","2020-10-04","Completed","Completed","98105",{"$f":"_xlfn.XLOOKUP(--fSeattle2020Complaints[[#This Row],[ZipCode]],dZipNeighborhood[ZipCode],dZipNeighborhood[Neighborhood])","v":"University District"}]
["Land UseTree ,","2020-07-28","Completed","Completed","98199",{"$f":"_xlfn.XLOOKUP(--fSeattle2020Complaints[[#This Row],[ZipCode]],dZipNeighborhood[ZipCode],dZipNeighborhood[Neighborhood])","v":"Magnolia"}]
["Tree","2020-03-26","Completed","Completed","98136",{"$f":"_xlfn.XLOOKUP(--fSeattle2020Complaints[[#This Row],[ZipCode]],dZipNeighborhood[ZipCode],dZipNeighborhood[Neighborhood])","v":"Seaview"}]
["Land Use","2020-08-14","Completed","Completed","98106",{"$f":"_xlfn.XLOOKUP(--fSeattle2020Complaints[[#This Row],[ZipCode]],dZipNeighborhood[ZipCode],dZipNeighborhood[Neighborhood])","v":"Delridge"}]
["Land Use","2020-10-29","Completed","Completed","98133",{"$f":"_xlfn.XLOOKUP(--fSeattle2020Complaints[[#This Row],[ZipCode]],dZipNeighborhood[ZipCode],dZipNeighborhood[Neighborhood])","v":"Shoreline"}]
["Construction","2020-01-29","Completed","Closed","98146",{"$f":"_xlfn.XLOOKUP(--fSeattle2020Complaints[[#This Row],[ZipCode]],dZipNeighborhood[ZipCode],dZipNeighborhood[Neighborhood])","v":"Shorewood, White Center"}]
["Construction","2020-08-31","No Access/Unable to Observe","Completed","98199",{"$f":"_xlfn.XLOOKUP(--fSeattle2020Complaints[[#This Row],[ZipCode]],dZipNeighborhood[ZipCode],dZipNeighborhood[Neighborhood])","v":"Magnolia"}]
["Land Use","2020-09-11","Completed","Initiated","98103",{"$f":"_xlfn.XLOOKUP(--fSeattle2020Complaints[[#This Row],[ZipCode]],dZipNeighborhood[ZipCode],dZipNeighborhood[Neighborhood])","v":"Greenwood"}]
["Weeds","2020-08-22","Completed","Completed","98115",{"$f":"_xlfn.XLOOKUP(--fSeattle2020Complaints[[#This Row],[ZipCode]],dZipNeighborhood[ZipCode],dZipNeighborhood[Neighborhood])","v":"Greenlake"}]
["LandLord/Tenant","2020-09-11","No Access/Unable to Observe","Completed","98118",{"$f":"_xlfn.XLOOKUP(--fSeattle2020Complaints[[#This Row],[ZipCode]],dZipNeighborhood[ZipCode],dZipNeighborhood[Neighborhood])","v":"Columbia City"}]
["Construction","2020-09-14","Completed","Completed","98115",{"$f":"_xlfn.XLOOKUP(--fSeattle2020Complaints[[#This Row],[ZipCode]],dZipNeighborhood[ZipCode],dZipNeighborhood[Neighborhood])","v":"Greenlake"}]
["Construction","2020-10-10","Completed","Completed","98115",{"$f":"_xlfn.XLOOKUP(--fSeattle2020Complaints[[#This Row],[ZipCode]],dZipNeighborhood[ZipCode],dZipNeighborhood[Neighborhood])","v":"Greenlake"}]
["Land Use","2020-06-22","Completed","Completed","98106",{"$f":"_xlfn.XLOOKUP(--fSeattle2020Complaints[[#This Row],[ZipCode]],dZipNeighborhood[ZipCode],dZipNeighborhood[Neighborhood])","v":"Delridge"}]
["Land Use","2020-01-08","Compliance Achieved","Completed","98178",{"$f":"_xlfn.XLOOKUP(--fSeattle2020Complaints[[#This Row],[ZipCode]],dZipNeighborhood[ZipCode],dZipNeighborhood[Neighborhood])","v":"Skyway"}]
["Vacant Building","2020-07-29","Completed","Closed","98125",{"$f":"_xlfn.XLOOKUP(--fSeattle2020Complaints[[#This Row],[ZipCode]],dZipNeighborhood[ZipCode],dZipNeighborhood[Neighborhood])","v":"Northgate"}]
["Weeds","2020-08-13","Completed","Completed","98105",{"$f":"_xlfn.XLOOKUP(--fSeattle2020Complaints[[#This Row],[ZipCode]],dZipNeighborhood[ZipCode],dZipNeighborhood[Neighborhood])","v":"University District"}]
["Land Use","2020-03-02","Completed","Completed","98106",{"$f":"_xlfn.XLOOKUP(--fSeattle2020Complaints[[#This Row],[ZipCode]],dZipNeighborhood[ZipCode],dZipNeighborhood[Neighborhood])","v":"Delridge"}]
["Land Use","2020-08-27","No Access/Unable to Observe","Completed","98104",{"$f":"_xlfn.XLOOKUP(--fSeattle2020Complaints[[#This Row],[ZipCode]],dZipNeighborhood[ZipCode],dZipNeighborhood[Neighborhood])","v":"International District"}]
["Land Use","2020-05-28","Compliance Achieved","Completed","98105",{"$f":"_xlfn.XLOOKUP(--fSeattle2020Complaints[[#This Row],[ZipCode]],dZipNeighborhood[ZipCode],dZipNeighborhood[Neighborhood])","v":"University District"}]
["Land Use","2020-08-24","Completed","Completed","98103",{"$f":"_xlfn.XLOOKUP(--fSeattle2020Complaints[[#This Row],[ZipCode]],dZipNeighborhood[ZipCode],dZipNeighborhood[Neighborhood])","v":"Greenwood"}]
["Weeds","2020-07-21","Completed","Completed","98102",{"$f":"_xlfn.XLOOKUP(--fSeattle2020Complaints[[#This Row],[ZipCode]],dZipNeighborhood[ZipCode],dZipNeighborhood[Neighborhood])","v":"Capital Hill"}]
["Land Use","2020-07-14","Compliance Achieved","Completed","98144",{"$f":"_xlfn.XLOOKUP(--fSeattle2020Complaints[[#This Row],[ZipCode]],dZipNeighborhood[ZipCode],dZipNeighborhood[Neighborhood])","v":"Mount Baker"}]
["Land Use","2020-02-18","Completed","Completed","98108",{"$f":"_xlfn.XLOOKUP(--fSeattle2020Complaints[[#This Row],[ZipCode]],dZipNeighborhood[ZipCode],dZipNeighborhood[Neighborhood])","v":"Rainer Valley"}]
["Land Use","2020-03-13","Completed","Initiated","98126",{"$f":"_xlfn.XLOOKUP(--fSeattle2020Complaints[[#This Row],[ZipCode]],dZipNeighborhood[ZipCode],dZipNeighborhood[Neighborhood])","v":"High Point"}]
["Construction","2020-10-09","Completed","Completed","98125",{"$f":"_xlfn.XLOOKUP(--fSeattle2020Complaints[[#This Row],[ZipCode]],dZipNeighborhood[ZipCode],dZipNeighborhood[Neighborhood])","v":"Northgate"}]
["Weeds","2020-06-19","Completed","Completed","98108",{"$f":"_xlfn.XLOOKUP(--fSeattle2020Complaints[[#This Row],[ZipCode]],dZipNeighborhood[ZipCode],dZipNeighborhood[Neighborhood])","v":"Rainer Valley"}]
["Noise","2020-12-14","Completed","Completed","98121",{"$f":"_xlfn.XLOOKUP(--fSeattle2020Complaints[[#This Row],[ZipCode]],dZipNeighborhood[ZipCode],dZipNeighborhood[Neighborhood])","v":"Belltown"}]
["Land Use","2020-06-08","Completed","Completed","98118",{"$f":"_xlfn.XLOOKUP(--fSeattle2020Complaints[[#This Row],[ZipCode]],dZipNeighborhood[ZipCode],dZipNeighborhood[Neighborhood])","v":"Columbia City"}]
["Construction","2020-03-11","Completed","Completed","98199",{"$f":"_xlfn.XLOOKUP(--fSeattle2020Complaints[[#This Row],[ZipCode]],dZipNeighborhood[ZipCode],dZipNeighborhood[Neighborhood])","v":"Magnolia"}]
["Land Use","2020-01-10","Completed","Completed","98144",{"$f":"_xlfn.XLOOKUP(--fSeattle2020Complaints[[#This Row],[ZipCode]],dZipNeighborhood[ZipCode],dZipNeighborhood[Neighborhood])","v":"Mount Baker"}]
["Vacant Building","2020-04-03","Completed","Completed","98115",{"$f":"_xlfn.XLOOKUP(--fSeattle2020Complaints[[#This Row],[ZipCode]],dZipNeighborhood[ZipCode],dZipNeighborhood[Neighborhood])","v":"Greenlake"}]
["Weeds","2020-08-19","Completed","Completed","98177",{"$f":"_xlfn.XLOOKUP(--fSeattle2020Complaints[[#This Row],[ZipCode]],dZipNeighborhood[ZipCode],dZipNeighborhood[Neighborhood])","v":"Richmond Beach"}]
["Land Use","2020-04-30","Completed","Completed","98118",{"$f":"_xlfn.XLOOKUP(--fSeattle2020Complaints[[#This Row],[ZipCode]],dZipNeighborhood[ZipCode],dZipNeighborhood[Neighborhood])","v":"Columbia City"}]
["Construction","2020-01-06","Completed","Completed","98119",{"$f":"_xlfn.XLOOKUP(--fSeattle2020Complaints[[#This Row],[ZipCode]],dZipNeighborhood[ZipCode],dZipNeighborhood[Neighborhood])","v":"Queen Anne"}]
["Emergency , Vacant Building","2020-05-01","Compliance Achieved","Completed","98105",{"$f":"_xlfn.XLOOKUP(--fSeattle2020Complaints[[#This Row],[ZipCode]],dZipNeighborhood[ZipCode],dZipNeighborhood[Neighborhood])","v":"University District"}]
["Weeds","2020-03-17","Compliance Achieved","Completed","98106",{"$f":"_xlfn.XLOOKUP(--fSeattle2020Complaints[[#This Row],[ZipCode]],dZipNeighborhood[ZipCode],dZipNeighborhood[Neighborhood])","v":"Delridge"}]
["Weeds","2020-03-12","Completed","Warning","98108",{"$f":"_xlfn.XLOOKUP(--fSeattle2020Complaints[[#This Row],[ZipCode]],dZipNeighborhood[ZipCode],dZipNeighborhood[Neighborhood])","v":"Rainer Valley"}]
["Land Use","2020-09-16","Completed","Completed","98117",{"$f":"_xlfn.XLOOKUP(--fSeattle2020Complaints[[#This Row],[ZipCode]],dZipNeighborhood[ZipCode],dZipNeighborhood[Neighborhood])","v":"Sunset Hill"}]
["Construction","2020-07-20","Completed","Completed","98199",{"$f":"_xlfn.XLOOKUP(--fSeattle2020Complaints[[#This Row],[ZipCode]],dZipNeighborhood[ZipCode],dZipNeighborhood[Neighborhood])","v":"Magnolia"}]
["Construction","2020-04-06","Completed","Initiated","98118",{"$f":"_xlfn.XLOOKUP(--fSeattle2020Complaints[[#This Row],[ZipCode]],dZipNeighborhood[ZipCode],dZipNeighborhood[Neighborhood])","v":"Columbia City"}]
["Land Use","2020-08-14","Completed","Completed","98144",{"$f":"_xlfn.XLOOKUP(--fSeattle2020Complaints[[#This Row],[ZipCode]],dZipNeighborhood[ZipCode],dZipNeighborhood[Neighborhood])","v":"Mount Baker"}]
["Weeds","2020-07-06","Completed","Citation Issued","98106",{"$f":"_xlfn.XLOOKUP(--fSeattle2020Complaints[[#This Row],[ZipCode]],dZipNeighborhood[ZipCode],dZipNeighborhood[Neighborhood])","v":"Delridge"}]
["Weeds","2020-02-27","Completed","Completed","98109",{"$f":"_xlfn.XLOOKUP(--fSeattle2020Complaints[[#This Row],[ZipCode]],dZipNeighborhood[ZipCode],dZipNeighborhood[Neighborhood])","v":"South Lake Union"}]
["Construction","2020-03-23","Completed","Completed","98118",{"$f":"_xlfn.XLOOKUP(--fSeattle2020Complaints[[#This Row],[ZipCode]],dZipNeighborhood[ZipCode],dZipNeighborhood[Neighborhood])","v":"Columbia City"}]
["Weeds","2020-05-05","Completed","Completed","98144",{"$f":"_xlfn.XLOOKUP(--fSeattle2020Complaints[[#This Row],[ZipCode]],dZipNeighborhood[ZipCode],dZipNeighborhood[Neighborhood])","v":"Mount Baker"}]
["Tree","2020-02-03","Compliance Achieved","NOV Issued","98112",{"$f":"_xlfn.XLOOKUP(--fSeattle2020Complaints[[#This Row],[ZipCode]],dZipNeighborhood[ZipCode],dZipNeighborhood[Neighborhood])","v":"Madison Park"}]
["Weeds","2020-02-18","Completed","Completed","98112",{"$f":"_xlfn.XLOOKUP(--fSeattle2020Complaints[[#This Row],[ZipCode]],dZipNeighborhood[ZipCode],dZipNeighborhood[Neighborhood])","v":"Madison Park"}]
["Weeds","2020-05-19","Completed","Completed","98112",{"$f":"_xlfn.XLOOKUP(--fSeattle2020Complaints[[#This Row],[ZipCode]],dZipNeighborhood[ZipCode],dZipNeighborhood[Neighborhood])","v":"Madison Park"}]
["Weeds","2020-05-31","Completed","Completed","98126",{"$f":"_xlfn.XLOOKUP(--fSeattle2020Complaints[[#This Row],[ZipCode]],dZipNeighborhood[ZipCode],dZipNeighborhood[Neighborhood])","v":"High Point"}]
["Land Use","2020-10-23","Completed","Completed","98118",{"$f":"_xlfn.XLOOKUP(--fSeattle2020Complaints[[#This Row],[ZipCode]],dZipNeighborhood[ZipCode],dZipNeighborhood[Neighborhood])","v":"Columbia City"}]
["Land Use","2020-03-12","Compliance Achieved","Completed","98117",{"$f":"_xlfn.XLOOKUP(--fSeattle2020Complaints[[#This Row],[ZipCode]],dZipNeighborhood[ZipCode],dZipNeighborhood[Neighborhood])","v":"Sunset Hill"}]
["Construction","2020-03-04","Completed","NOV Issued","98118",{"$f":"_xlfn.XLOOKUP(--fSeattle2020Complaints[[#This Row],[ZipCode]],dZipNeighborhood[ZipCode],dZipNeighborhood[Neighborhood])","v":"Columbia City"}]
["Land Use","2020-08-05","Completed","Completed","98103",{"$f":"_xlfn.XLOOKUP(--fSeattle2020Complaints[[#This Row],[ZipCode]],dZipNeighborhood[ZipCode],dZipNeighborhood[Neighborhood])","v":"Greenwood"}]
["Land Use","2020-01-30","Completed","Completed","98118",{"$f":"_xlfn.XLOOKUP(--fSeattle2020Complaints[[#This Row],[ZipCode]],dZipNeighborhood[ZipCode],dZipNeighborhood[Neighborhood])","v":"Columbia City"}]
["Weeds","2020-10-19","Completed","Completed","98103",{"$f":"_xlfn.XLOOKUP(--fSeattle2020Complaints[[#This Row],[ZipCode]],dZipNeighborhood[ZipCode],dZipNeighborhood[Neighborhood])","v":"Greenwood"}]
["Construction","2020-10-30","Completed","Closed","98106",{"$f":"_xlfn.XLOOKUP(--fSeattle2020Complaints[[#This Row],[ZipCode]],dZipNeighborhood[ZipCode],dZipNeighborhood[Neighborhood])","v":"Delridge"}]
["Construction","2020-03-02","No Access/Unable to Observe","Completed","98122",{"$f":"_xlfn.XLOOKUP(--fSeattle2020Complaints[[#This Row],[ZipCode]],dZipNeighborhood[ZipCode],dZipNeighborhood[Neighborhood])","v":"Minor, Central Area"}]
["Construction","2020-05-21","Compliance Achieved","Completed","98144",{"$f":"_xlfn.XLOOKUP(--fSeattle2020Complaints[[#This Row],[ZipCode]],dZipNeighborhood[ZipCode],dZipNeighborhood[Neighborhood])","v":"Mount Baker"}]
["Land Use","2020-05-19","Completed","Completed","98108",{"$f":"_xlfn.XLOOKUP(--fSeattle2020Complaints[[#This Row],[ZipCode]],dZipNeighborhood[ZipCode],dZipNeighborhood[Neighborhood])","v":"Rainer Valley"}]
["Construction","2020-01-23","Completed","Completed","98115",{"$f":"_xlfn.XLOOKUP(--fSeattle2020Complaints[[#This Row],[ZipCode]],dZipNeighborhood[ZipCode],dZipNeighborhood[Neighborhood])","v":"Greenlake"}]
["Vacant Building","2020-10-14","Compliance Achieved","Completed","98117",{"$f":"_xlfn.XLOOKUP(--fSeattle2020Complaints[[#This Row],[ZipCode]],dZipNeighborhood[ZipCode],dZipNeighborhood[Neighborhood])","v":"Sunset Hill"}]
["Weeds","2020-08-13","Completed","Completed","98144",{"$f":"_xlfn.XLOOKUP(--fSeattle2020Complaints[[#This Row],[ZipCode]],dZipNeighborhood[ZipCode],dZipNeighborhood[Neighborhood])","v":"Mount Baker"}]
["Weeds","2020-09-08","Completed","Completed","98109",{"$f":"_xlfn.XLOOKUP(--fSeattle2020Complaints[[#This Row],[ZipCode]],dZipNeighborhood[ZipCode],dZipNeighborhood[Neighborhood])","v":"South Lake Union"}]
["Vacant Building","2020-01-30","Completed","Closed","98103",{"$f":"_xlfn.XLOOKUP(--fSeattle2020Complaints[[#This Row],[ZipCode]],dZipNeighborhood[ZipCode],dZipNeighborhood[Neighborhood])","v":"Greenwood"}]
["Land Use","2020-08-03","Completed","Completed","98115",{"$f":"_xlfn.XLOOKUP(--fSeattle2020Complaints[[#This Row],[ZipCode]],dZipNeighborhood[ZipCode],dZipNeighborhood[Neighborhood])","v":"Greenlake"}]
["Land Use","2020-03-20","Completed","Warning","98177",{"$f":"_xlfn.XLOOKUP(--fSeattle2020Complaints[[#This Row],[ZipCode]],dZipNeighborhood[ZipCode],dZipNeighborhood[Neighborhood])","v":"Richmond Beach"}]
["Land Use","2020-10-22","Completed","Closed","98102",{"$f":"_xlfn.XLOOKUP(--fSeattle2020Complaints[[#This Row],[ZipCode]],dZipNeighborhood[ZipCode],dZipNeighborhood[Neighborhood])","v":"Capital Hill"}]
["Emergency","2020-04-03","Completed","Closed","98103",{"$f":"_xlfn.XLOOKUP(--fSeattle2020Complaints[[#This Row],[ZipCode]],dZipNeighborhood[ZipCode],dZipNeighborhood[Neighborhood])","v":"Greenwood"}]
["Weeds","2020-10-22","Completed","Completed","98109",{"$f":"_xlfn.XLOOKUP(--fSeattle2020Complaints[[#This Row],[ZipCode]],dZipNeighborhood[ZipCode],dZipNeighborhood[Neighborhood])","v":"South Lake Union"}]
["Construction","2020-01-23","Completed","Completed","98103",{"$f":"_xlfn.XLOOKUP(--fSeattle2020Complaints[[#This Row],[ZipCode]],dZipNeighborhood[ZipCode],dZipNeighborhood[Neighborhood])","v":"Greenwood"}]
["Weeds","2020-04-25","Completed","Completed","98119",{"$f":"_xlfn.XLOOKUP(--fSeattle2020Complaints[[#This Row],[ZipCode]],dZipNeighborhood[ZipCode],dZipNeighborhood[Neighborhood])","v":"Queen Anne"}]
["Land Use","2020-07-28","Compliance Achieved","Completed","98106",{"$f":"_xlfn.XLOOKUP(--fSeattle2020Complaints[[#This Row],[ZipCode]],dZipNeighborhood[ZipCode],dZipNeighborhood[Neighborhood])","v":"Delridge"}]
["Land Use","2020-07-06","Compliance Achieved","Completed","98121",{"$f":"_xlfn.XLOOKUP(--fSeattle2020Complaints[[#This Row],[ZipCode]],dZipNeighborhood[ZipCode],dZipNeighborhood[Neighborhood])","v":"Belltown"}]
["Weeds","2020-03-19","Completed","Warning","98116",{"$f":"_xlfn.XLOOKUP(--fSeattle2020Complaints[[#This Row],[ZipCode]],dZipNeighborhood[ZipCode],dZipNeighborhood[Neighborhood])","v":"West Seattle"}]
["Land Use","2020-06-02","Completed","Completed","98118",{"$f":"_xlfn.XLOOKUP(--fSeattle2020Complaints[[#This Row],[ZipCode]],dZipNeighborhood[ZipCode],dZipNeighborhood[Neighborhood])","v":"Columbia City"}]
["Construction","2020-02-20","Completed","Completed","98106",{"$f":"_xlfn.XLOOKUP(--fSeattle2020Complaints[[#This Row],[ZipCode]],dZipNeighborhood[ZipCode],dZipNeighborhood[Neighborhood])","v":"Delridge"}]
["Land Use","2020-07-28","Completed","Completed","98126",{"$f":"_xlfn.XLOOKUP(--fSeattle2020Complaints[[#This Row],[ZipCode]],dZipNeighborhood[ZipCode],dZipNeighborhood[Neighborhood])","v":"High Point"}]
["Vacant Building","2020-06-11","Compliance Achieved","Completed","98108",{"$f":"_xlfn.XLOOKUP(--fSeattle2020Complaints[[#This Row],[ZipCode]],dZipNeighborhood[ZipCode],dZipNeighborhood[Neighborhood])","v":"Rainer Valley"}]
["Land Use","2020-02-27","No Access/Unable to Observe","Completed","98102",{"$f":"_xlfn.XLOOKUP(--fSeattle2020Complaints[[#This Row],[ZipCode]],dZipNeighborhood[ZipCode],dZipNeighborhood[Neighborhood])","v":"Capital Hill"}]
["Construction","2020-02-11","Completed","Completed","98118",{"$f":"_xlfn.XLOOKUP(--fSeattle2020Complaints[[#This Row],[ZipCode]],dZipNeighborhood[ZipCode],dZipNeighborhood[Neighborhood])","v":"Columbia City"}]
["Construction","2020-04-05","Completed","Completed","98106",{"$f":"_xlfn.XLOOKUP(--fSeattle2020Complaints[[#This Row],[ZipCode]],dZipNeighborhood[ZipCode],dZipNeighborhood[Neighborhood])","v":"Delridge"}]
["Weeds","2020-02-26","Completed","Completed","98103",{"$f":"_xlfn.XLOOKUP(--fSeattle2020Complaints[[#This Row],[ZipCode]],dZipNeighborhood[ZipCode],dZipNeighborhood[Neighborhood])","v":"Greenwood"}]
["Land UseConstruction ,","2020-09-04","Completed","Under Investigation","98126",{"$f":"_xlfn.XLOOKUP(--fSeattle2020Complaints[[#This Row],[ZipCode]],dZipNeighborhood[ZipCode],dZipNeighborhood[Neighborhood])","v":"High Point"}]
["Vacant Building","2020-05-12","Completed","Completed","98105",{"$f":"_xlfn.XLOOKUP(--fSeattle2020Complaints[[#This Row],[ZipCode]],dZipNeighborhood[ZipCode],dZipNeighborhood[Neighborhood])","v":"University District"}]
["Weeds","2020-01-17","Completed","Completed","98115",{"$f":"_xlfn.XLOOKUP(--fSeattle2020Complaints[[#This Row],[ZipCode]],dZipNeighborhood[ZipCode],dZipNeighborhood[Neighborhood])","v":"Greenlake"}]
["Tree","2020-09-16","Completed","Completed","98125",{"$f":"_xlfn.XLOOKUP(--fSeattle2020Complaints[[#This Row],[ZipCode]],dZipNeighborhood[ZipCode],dZipNeighborhood[Neighborhood])","v":"Northgate"}]
["Construction , Tree","2020-12-04","Completed","Completed","98115",{"$f":"_xlfn.XLOOKUP(--fSeattle2020Complaints[[#This Row],[ZipCode]],dZipNeighborhood[ZipCode],dZipNeighborhood[Neighborhood])","v":"Greenlake"}]
["Construction","2020-06-16","Completed","Completed","98122",{"$f":"_xlfn.XLOOKUP(--fSeattle2020Complaints[[#This Row],[ZipCode]],dZipNeighborhood[ZipCode],dZipNeighborhood[Neighborhood])","v":"Minor, Central Area"}]
["Land Use","2020-02-20","Completed","Completed","98103",{"$f":"_xlfn.XLOOKUP(--fSeattle2020Complaints[[#This Row],[ZipCode]],dZipNeighborhood[ZipCode],dZipNeighborhood[Neighborhood])","v":"Greenwood"}]
["Weeds","2020-02-11","Completed","Completed","98109",{"$f":"_xlfn.XLOOKUP(--fSeattle2020Complaints[[#This Row],[ZipCode]],dZipNeighborhood[ZipCode],dZipNeighborhood[Neighborhood])","v":"South Lake Union"}]
["Land Use","2020-11-24","Completed","Completed","98105",{"$f":"_xlfn.XLOOKUP(--fSeattle2020Complaints[[#This Row],[ZipCode]],dZipNeighborhood[ZipCode],dZipNeighborhood[Neighborhood])","v":"University District"}]
["Land Use","2020-06-19","Completed","Completed","98117",{"$f":"_xlfn.XLOOKUP(--fSeattle2020Complaints[[#This Row],[ZipCode]],dZipNeighborhood[ZipCode],dZipNeighborhood[Neighborhood])","v":"Sunset Hill"}]
["Land Use","2020-03-23","Completed","Warning","98106",{"$f":"_xlfn.XLOOKUP(--fSeattle2020Complaints[[#This Row],[ZipCode]],dZipNeighborhood[ZipCode],dZipNeighborhood[Neighborhood])","v":"Delridge"}]
["Land Use","2020-05-19","Completed","Completed","98105",{"$f":"_xlfn.XLOOKUP(--fSeattle2020Complaints[[#This Row],[ZipCode]],dZipNeighborhood[ZipCode],dZipNeighborhood[Neighborhood])","v":"University District"}]
["Emergency , Vacant Building","2020-01-23","Compliance Achieved","Completed","98107",{"$f":"_xlfn.XLOOKUP(--fSeattle2020Complaints[[#This Row],[ZipCode]],dZipNeighborhood[ZipCode],dZipNeighborhood[Neighborhood])","v":"Ballard"}]
["Land Use","2020-07-17","Completed","Completed","98122",{"$f":"_xlfn.XLOOKUP(--fSeattle2020Complaints[[#This Row],[ZipCode]],dZipNeighborhood[ZipCode],dZipNeighborhood[Neighborhood])","v":"Minor, Central Area"}]
["Vacant Building","2020-09-25","Completed","NOV Issued","98115",{"$f":"_xlfn.XLOOKUP(--fSeattle2020Complaints[[#This Row],[ZipCode]],dZipNeighborhood[ZipCode],dZipNeighborhood[Neighborhood])","v":"Greenlake"}]
["Weeds","2020-02-13","Completed","Completed","98177",{"$f":"_xlfn.XLOOKUP(--fSeattle2020Complaints[[#This Row],[ZipCode]],dZipNeighborhood[ZipCode],dZipNeighborhood[Neighborhood])","v":"Richmond Beach"}]
["Weeds","2020-07-09","Completed","Completed","98105",{"$f":"_xlfn.XLOOKUP(--fSeattle2020Complaints[[#This Row],[ZipCode]],dZipNeighborhood[ZipCode],dZipNeighborhood[Neighborhood])","v":"University District"}]
["Vacant Building","2020-07-28","Completed","Completed","98105",{"$f":"_xlfn.XLOOKUP(--fSeattle2020Complaints[[#This Row],[ZipCode]],dZipNeighborhood[ZipCode],dZipNeighborhood[Neighborhood])","v":"University District"}]
["Vacant Building","2020-02-13","Completed","Completed","98108",{"$f":"_xlfn.XLOOKUP(--fSeattle2020Complaints[[#This Row],[ZipCode]],dZipNeighborhood[ZipCode],dZipNeighborhood[Neighborhood])","v":"Rainer Valley"}]
["Tree","2020-10-12","Completed","Completed","98199",{"$f":"_xlfn.XLOOKUP(--fSeattle2020Complaints[[#This Row],[ZipCode]],dZipNeighborhood[ZipCode],dZipNeighborhood[Neighborhood])","v":"Magnolia"}]
["Weeds","2020-01-14","Completed","Completed","98103",{"$f":"_xlfn.XLOOKUP(--fSeattle2020Complaints[[#This Row],[ZipCode]],dZipNeighborhood[ZipCode],dZipNeighborhood[Neighborhood])","v":"Greenwood"}]
["Construction","2020-05-01","Completed","Completed","98105",{"$f":"_xlfn.XLOOKUP(--fSeattle2020Complaints[[#This Row],[ZipCode]],dZipNeighborhood[ZipCode],dZipNeighborhood[Neighborhood])","v":"University District"}]
["Weeds","2020-07-08","Completed","Completed","98109",{"$f":"_xlfn.XLOOKUP(--fSeattle2020Complaints[[#This Row],[ZipCode]],dZipNeighborhood[ZipCode],dZipNeighborhood[Neighborhood])","v":"South Lake Union"}]
["Land Use","2020-05-04","Completed","Completed","98146",{"$f":"_xlfn.XLOOKUP(--fSeattle2020Complaints[[#This Row],[ZipCode]],dZipNeighborhood[ZipCode],dZipNeighborhood[Neighborhood])","v":"Shorewood, White Center"}]
["Land Use","2020-08-18","Completed","Completed","98106",{"$f":"_xlfn.XLOOKUP(--fSeattle2020Complaints[[#This Row],[ZipCode]],dZipNeighborhood[ZipCode],dZipNeighborhood[Neighborhood])","v":"Delridge"}]
["Land Use","2020-07-28","Completed","Completed","98118",{"$f":"_xlfn.XLOOKUP(--fSeattle2020Complaints[[#This Row],[ZipCode]],dZipNeighborhood[ZipCode],dZipNeighborhood[Neighborhood])","v":"Columbia City"}]
["Land Use","2020-12-23","Completed","Completed","98119",{"$f":"_xlfn.XLOOKUP(--fSeattle2020Complaints[[#This Row],[ZipCode]],dZipNeighborhood[ZipCode],dZipNeighborhood[Neighborhood])","v":"Queen Anne"}]
["Weeds","2020-05-10","Completed","Completed","98122",{"$f":"_xlfn.XLOOKUP(--fSeattle2020Complaints[[#This Row],[ZipCode]],dZipNeighborhood[ZipCode],dZipNeighborhood[Neighborhood])","v":"Minor, Central Area"}]
["Construction , ECA","2020-07-26","No Access/Unable to Observe","Completed","98126",{"$f":"_xlfn.XLOOKUP(--fSeattle2020Complaints[[#This Row],[ZipCode]],dZipNeighborhood[ZipCode],dZipNeighborhood[Neighborhood])","v":"High Point"}]
["Construction","2020-09-02","Completed","Completed","98122",{"$f":"_xlfn.XLOOKUP(--fSeattle2020Complaints[[#This Row],[ZipCode]],dZipNeighborhood[ZipCode],dZipNeighborhood[Neighborhood])","v":"Minor, Central Area"}]
["Land Use","2020-07-14","Completed","Completed","98146",{"$f":"_xlfn.XLOOKUP(--fSeattle2020Complaints[[#This Row],[ZipCode]],dZipNeighborhood[ZipCode],dZipNeighborhood[Neighborhood])","v":"Shorewood, White Center"}]
["Land Use","2020-10-24","Completed","Completed","98118",{"$f":"_xlfn.XLOOKUP(--fSeattle2020Complaints[[#This Row],[ZipCode]],dZipNeighborhood[ZipCode],dZipNeighborhood[Neighborhood])","v":"Columbia City"}]
["Construction","2020-07-29","Completed","Closed","98125",{"$f":"_xlfn.XLOOKUP(--fSeattle2020Complaints[[#This Row],[ZipCode]],dZipNeighborhood[ZipCode],dZipNeighborhood[Neighborhood])","v":"Northgate"}]
["Weeds","2020-09-09","Completed","Completed","98103",{"$f":"_xlfn.XLOOKUP(--fSeattle2020Complaints[[#This Row],[ZipCode]],dZipNeighborhood[ZipCode],dZipNeighborhood[Neighborhood])","v":"Greenwood"}]
["Land Use","2020-12-04","Completed","Completed","98102",{"$f":"_xlfn.XLOOKUP(--fSeattle2020Complaints[[#This Row],[ZipCode]],dZipNeighborhood[ZipCode],dZipNeighborhood[Neighborhood])","v":"Capital Hill"}]
["Land Use","2020-08-18","Completed","Completed","98105",{"$f":"_xlfn.XLOOKUP(--fSeattle2020Complaints[[#This Row],[ZipCode]],dZipNeighborhood[ZipCode],dZipNeighborhood[Neighborhood])","v":"University District"}]
["Land Use","2020-09-30","Completed","Completed","98125",{"$f":"_xlfn.XLOOKUP(--fSeattle2020Complaints[[#This Row],[ZipCode]],dZipNeighborhood[ZipCode],dZipNeighborhood[Neighborhood])","v":"Northgate"}]
["Vacant Building","2020-01-24","Completed","Completed","98117",{"$f":"_xlfn.XLOOKUP(--fSeattle2020Complaints[[#This Row],[ZipCode]],dZipNeighborhood[ZipCode],dZipNeighborhood[Neighborhood])","v":"Sunset Hill"}]
["Weeds","2020-05-12","Completed","Completed","98136",{"$f":"_xlfn.XLOOKUP(--fSeattle2020Complaints[[#This Row],[ZipCode]],dZipNeighborhood[ZipCode],dZipNeighborhood[Neighborhood])","v":"Seaview"}]
["Weeds","2020-03-09","Completed","Completed","98112",{"$f":"_xlfn.XLOOKUP(--fSeattle2020Complaints[[#This Row],[ZipCode]],dZipNeighborhood[ZipCode],dZipNeighborhood[Neighborhood])","v":"Madison Park"}]
["Land UseWeeds ,","2020-05-06","Completed","Completed","98118",{"$f":"_xlfn.XLOOKUP(--fSeattle2020Complaints[[#This Row],[ZipCode]],dZipNeighborhood[ZipCode],dZipNeighborhood[Neighborhood])","v":"Columbia City"}]
["Land Use","2020-01-30","Completed","Completed","98122",{"$f":"_xlfn.XLOOKUP(--fSeattle2020Complaints[[#This Row],[ZipCode]],dZipNeighborhood[ZipCode],dZipNeighborhood[Neighborhood])","v":"Minor, Central Area"}]
["Land Use","2020-03-31","Completed","Completed","98126",{"$f":"_xlfn.XLOOKUP(--fSeattle2020Complaints[[#This Row],[ZipCode]],dZipNeighborhood[ZipCode],dZipNeighborhood[Neighborhood])","v":"High Point"}]
["Land Use","2020-03-04","Completed","Warning","98133",{"$f":"_xlfn.XLOOKUP(--fSeattle2020Complaints[[#This Row],[ZipCode]],dZipNeighborhood[ZipCode],dZipNeighborhood[Neighborhood])","v":"Shoreline"}]
["LandLord/Tenant","2020-03-09","Compliance Achieved","Completed","98105",{"$f":"_xlfn.XLOOKUP(--fSeattle2020Complaints[[#This Row],[ZipCode]],dZipNeighborhood[ZipCode],dZipNeighborhood[Neighborhood])","v":"University District"}]
["Construction","2020-09-01","Completed","Completed","98108",{"$f":"_xlfn.XLOOKUP(--fSeattle2020Complaints[[#This Row],[ZipCode]],dZipNeighborhood[ZipCode],dZipNeighborhood[Neighborhood])","v":"Rainer Valley"}]
["Weeds","2020-11-04","Completed","Completed","98105",{"$f":"_xlfn.XLOOKUP(--fSeattle2020Complaints[[#This Row],[ZipCode]],dZipNeighborhood[ZipCode],dZipNeighborhood[Neighborhood])","v":"University District"}]
["Land Use","2020-10-16","Completed","Completed","98108",{"$f":"_xlfn.XLOOKUP(--fSeattle2020Complaints[[#This Row],[ZipCode]],dZipNeighborhood[ZipCode],dZipNeighborhood[Neighborhood])","v":"Rainer Valley"}]
["Weeds","2020-03-13","Compliance Achieved","Completed","98103",{"$f":"_xlfn.XLOOKUP(--fSeattle2020Complaints[[#This Row],[ZipCode]],dZipNeighborhood[ZipCode],dZipNeighborhood[Neighborhood])","v":"Greenwood"}]
["Land Use","2020-05-27","Completed","Completed","98108",{"$f":"_xlfn.XLOOKUP(--fSeattle2020Complaints[[#This Row],[ZipCode]],dZipNeighborhood[ZipCode],dZipNeighborhood[Neighborhood])","v":"Rainer Valley"}]
["Construction","2020-09-10","Completed","Completed","98103",{"$f":"_xlfn.XLOOKUP(--fSeattle2020Complaints[[#This Row],[ZipCode]],dZipNeighborhood[ZipCode],dZipNeighborhood[Neighborhood])","v":"Greenwood"}]
["Weeds","2020-06-27","Completed","Completed","98122",{"$f":"_xlfn.XLOOKUP(--fSeattle2020Complaints[[#This Row],[ZipCode]],dZipNeighborhood[ZipCode],dZipNeighborhood[Neighborhood])","v":"Minor, Central Area"}]
["Land Use","2020-01-27","Completed","Completed","98107",{"$f":"_xlfn.XLOOKUP(--fSeattle2020Complaints[[#This Row],[ZipCode]],dZipNeighborhood[ZipCode],dZipNeighborhood[Neighborhood])","v":"Ballard"}]
["Construction , Tree","2020-02-19","Completed","Closed","98103",{"$f":"_xlfn.XLOOKUP(--fSeattle2020Complaints[[#This Row],[ZipCode]],dZipNeighborhood[ZipCode],dZipNeighborhood[Neighborhood])","v":"Greenwood"}]
["Tree","2020-08-14","Completed","Completed","98108",{"$f":"_xlfn.XLOOKUP(--fSeattle2020Complaints[[#This Row],[ZipCode]],dZipNeighborhood[ZipCode],dZipNeighborhood[Neighborhood])","v":"Rainer Valley"}]
["Construction","2020-01-30","Completed","Completed","98103",{"$f":"_xlfn.XLOOKUP(--fSeattle2020Complaints[[#This Row],[ZipCode]],dZipNeighborhood[ZipCode],dZipNeighborhood[Neighborhood])","v":"Greenwood"}]
["Vacant Building","2020-08-17","Completed","Closed","98117",{"$f":"_xlfn.XLOOKUP(--fSeattle2020Complaints[[#This Row],[ZipCode]],dZipNeighborhood[ZipCode],dZipNeighborhood[Neighborhood])","v":"Sunset Hill"}]
["Construction","2020-08-18","Completed","Completed","98199",{"$f":"_xlfn.XLOOKUP(--fSeattle2020Complaints[[#This Row],[ZipCode]],dZipNeighborhood[ZipCode],dZipNeighborhood[Neighborhood])","v":"Magnolia"}]
["Weeds","2020-07-01","Completed","Warning","98119",{"$f":"_xlfn.XLOOKUP(--fSeattle2020Complaints[[#This Row],[ZipCode]],dZipNeighborhood[ZipCode],dZipNeighborhood[Neighborhood])","v":"Queen Anne"}]
["Land Use","2020-11-09","Completed","NOV Issued","98103",{"$f":"_xlfn.XLOOKUP(--fSeattle2020Complaints[[#This Row],[ZipCode]],dZipNeighborhood[ZipCode],dZipNeighborhood[Neighborhood])","v":"Greenwood"}]
["Land Use","2020-02-04","Admin Closure","Completed","98105",{"$f":"_xlfn.XLOOKUP(--fSeattle2020Complaints[[#This Row],[ZipCode]],dZipNeighborhood[ZipCode],dZipNeighborhood[Neighborhood])","v":"University District"}]
["Land Use","2020-06-14","Completed","Completed","98122",{"$f":"_xlfn.XLOOKUP(--fSeattle2020Complaints[[#This Row],[ZipCode]],dZipNeighborhood[ZipCode],dZipNeighborhood[Neighborhood])","v":"Minor, Central Area"}]
["Weeds","2020-02-12","Completed","Warning","98116",{"$f":"_xlfn.XLOOKUP(--fSeattle2020Complaints[[#This Row],[ZipCode]],dZipNeighborhood[ZipCode],dZipNeighborhood[Neighborhood])","v":"West Seattle"}]
["Weeds","2020-08-14","Completed","Completed","98116",{"$f":"_xlfn.XLOOKUP(--fSeattle2020Complaints[[#This Row],[ZipCode]],dZipNeighborhood[ZipCode],dZipNeighborhood[Neighborhood])","v":"West Seattle"}]
["Weeds","2020-03-27","Compliance Achieved","Completed","98112",{"$f":"_xlfn.XLOOKUP(--fSeattle2020Complaints[[#This Row],[ZipCode]],dZipNeighborhood[ZipCode],dZipNeighborhood[Neighborhood])","v":"Madison Park"}]
["Land Use","2020-02-24","Admin Closure","Completed","98105",{"$f":"_xlfn.XLOOKUP(--fSeattle2020Complaints[[#This Row],[ZipCode]],dZipNeighborhood[ZipCode],dZipNeighborhood[Neighborhood])","v":"University District"}]
["Construction","2020-03-03","Completed","Under Investigation","98122",{"$f":"_xlfn.XLOOKUP(--fSeattle2020Complaints[[#This Row],[ZipCode]],dZipNeighborhood[ZipCode],dZipNeighborhood[Neighborhood])","v":"Minor, Central Area"}]
["Weeds","2020-01-21","Completed","Completed","98105",{"$f":"_xlfn.XLOOKUP(--fSeattle2020Complaints[[#This Row],[ZipCode]],dZipNeighborhood[ZipCode],dZipNeighborhood[Neighborhood])","v":"University District"}]
["Construction","2020-10-12","Completed","Completed","98144",{"$f":"_xlfn.XLOOKUP(--fSeattle2020Complaints[[#This Row],[ZipCode]],dZipNeighborhood[ZipCode],dZipNeighborhood[Neighborhood])","v":"Mount Baker"}]
["Construction","2020-07-27","No Access/Unable to Observe","Completed","98106",{"$f":"_xlfn.XLOOKUP(--fSeattle2020Complaints[[#This Row],[ZipCode]],dZipNeighborhood[ZipCode],dZipNeighborhood[Neighborhood])","v":"Delridge"}]
["Land Use","2020-09-02","Completed","Completed","98103",{"$f":"_xlfn.XLOOKUP(--fSeattle2020Complaints[[#This Row],[ZipCode]],dZipNeighborhood[ZipCode],dZipNeighborhood[Neighborhood])","v":"Greenwood"}]
["Weeds","2020-06-26","Completed","Completed","98118",{"$f":"_xlfn.XLOOKUP(--fSeattle2020Complaints[[#This Row],[ZipCode]],dZipNeighborhood[ZipCode],dZipNeighborhood[Neighborhood])","v":"Columbia City"}]
["Vacant Building","2020-08-17","Completed","Closed","98107",{"$f":"_xlfn.XLOOKUP(--fSeattle2020Complaints[[#This Row],[ZipCode]],dZipNeighborhood[ZipCode],dZipNeighborhood[Neighborhood])","v":"Ballard"}]
["Construction","2020-06-23","Completed","Closed","98122",{"$f":"_xlfn.XLOOKUP(--fSeattle2020Complaints[[#This Row],[ZipCode]],dZipNeighborhood[ZipCode],dZipNeighborhood[Neighborhood])","v":"Minor, Central Area"}]
["Construction , Tree","2020-10-06","Completed","Closed","98144",{"$f":"_xlfn.XLOOKUP(--fSeattle2020Complaints[[#This Row],[ZipCode]],dZipNeighborhood[ZipCode],dZipNeighborhood[Neighborhood])","v":"Mount Baker"}]
["Land Use","2020-12-10","Completed","Completed","98108",{"$f":"_xlfn.XLOOKUP(--fSeattle2020Complaints[[#This Row],[ZipCode]],dZipNeighborhood[ZipCode],dZipNeighborhood[Neighborhood])","v":"Rainer Valley"}]
["Land Use","2020-02-21","Completed","Completed","98107",{"$f":"_xlfn.XLOOKUP(--fSeattle2020Complaints[[#This Row],[ZipCode]],dZipNeighborhood[ZipCode],dZipNeighborhood[Neighborhood])","v":"Ballard"}]
["Weeds","2020-07-29","Completed","Completed","98125",{"$f":"_xlfn.XLOOKUP(--fSeattle2020Complaints[[#This Row],[ZipCode]],dZipNeighborhood[ZipCode],dZipNeighborhood[Neighborhood])","v":"Northgate"}]
["Tree","2020-09-22","No Violation","Completed","98117",{"$f":"_xlfn.XLOOKUP(--fSeattle2020Complaints[[#This Row],[ZipCode]],dZipNeighborhood[ZipCode],dZipNeighborhood[Neighborhood])","v":"Sunset Hill"}]
["Vacant Building","2020-11-23","Completed","Completed","98122",{"$f":"_xlfn.XLOOKUP(--fSeattle2020Complaints[[#This Row],[ZipCode]],dZipNeighborhood[ZipCode],dZipNeighborhood[Neighborhood])","v":"Minor, Central Area"}]
["Land Use","2020-10-06","Completed","Completed","98109",{"$f":"_xlfn.XLOOKUP(--fSeattle2020Complaints[[#This Row],[ZipCode]],dZipNeighborhood[ZipCode],dZipNeighborhood[Neighborhood])","v":"South Lake Union"}]
["Land Use","2020-08-19","Completed","Completed","98109",{"$f":"_xlfn.XLOOKUP(--fSeattle2020Complaints[[#This Row],[ZipCode]],dZipNeighborhood[ZipCode],dZipNeighborhood[Neighborhood])","v":"South Lake Union"}]
["Construction","2020-01-21","Completed","Completed","98103",{"$f":"_xlfn.XLOOKUP(--fSeattle2020Complaints[[#This Row],[ZipCode]],dZipNeighborhood[ZipCode],dZipNeighborhood[Neighborhood])","v":"Greenwood"}]
["Land Use","2020-05-08","Completed","Completed","98106",{"$f":"_xlfn.XLOOKUP(--fSeattle2020Complaints[[#This Row],[ZipCode]],dZipNeighborhood[ZipCode],dZipNeighborhood[Neighborhood])","v":"Delridge"}]
["Weeds","2020-07-01","Compliance Achieved","Completed","98136",{"$f":"_xlfn.XLOOKUP(--fSeattle2020Complaints[[#This Row],[ZipCode]],dZipNeighborhood[ZipCode],dZipNeighborhood[Neighborhood])","v":"Seaview"}]
["Tree","2020-08-18","No Access/Unable to Observe","Completed","98199",{"$f":"_xlfn.XLOOKUP(--fSeattle2020Complaints[[#This Row],[ZipCode]],dZipNeighborhood[ZipCode],dZipNeighborhood[Neighborhood])","v":"Magnolia"}]
["Weeds","2020-02-26","Completed","Completed","98106",{"$f":"_xlfn.XLOOKUP(--fSeattle2020Complaints[[#This Row],[ZipCode]],dZipNeighborhood[ZipCode],dZipNeighborhood[Neighborhood])","v":"Delridge"}]
["Vacant Building","2020-11-05","Compliance Achieved","Completed","98105",{"$f":"_xlfn.XLOOKUP(--fSeattle2020Complaints[[#This Row],[ZipCode]],dZipNeighborhood[ZipCode],dZipNeighborhood[Neighborhood])","v":"University District"}]
["Construction","2020-04-28","Completed","Completed","98118",{"$f":"_xlfn.XLOOKUP(--fSeattle2020Complaints[[#This Row],[ZipCode]],dZipNeighborhood[ZipCode],dZipNeighborhood[Neighborhood])","v":"Columbia City"}]
["Construction","2020-08-10","Completed","Completed","98144",{"$f":"_xlfn.XLOOKUP(--fSeattle2020Complaints[[#This Row],[ZipCode]],dZipNeighborhood[ZipCode],dZipNeighborhood[Neighborhood])","v":"Mount Baker"}]
["Tree","2020-03-07","Completed","Completed","98115",{"$f":"_xlfn.XLOOKUP(--fSeattle2020Complaints[[#This Row],[ZipCode]],dZipNeighborhood[ZipCode],dZipNeighborhood[Neighborhood])","v":"Greenlake"}]
["Construction","2020-01-30","Completed","Completed","98119",{"$f":"_xlfn.XLOOKUP(--fSeattle2020Complaints[[#This Row],[ZipCode]],dZipNeighborhood[ZipCode],dZipNeighborhood[Neighborhood])","v":"Queen Anne"}]
["Weeds","2020-05-31","Completed","Completed","98103",{"$f":"_xlfn.XLOOKUP(--fSeattle2020Complaints[[#This Row],[ZipCode]],dZipNeighborhood[ZipCode],dZipNeighborhood[Neighborhood])","v":"Greenwood"}]
["Land Use","2020-09-01","Completed","Completed","98121",{"$f":"_xlfn.XLOOKUP(--fSeattle2020Complaints[[#This Row],[ZipCode]],dZipNeighborhood[ZipCode],dZipNeighborhood[Neighborhood])","v":"Belltown"}]
["Construction","2020-07-23","Completed","NOV Issued","98118",{"$f":"_xlfn.XLOOKUP(--fSeattle2020Complaints[[#This Row],[ZipCode]],dZipNeighborhood[ZipCode],dZipNeighborhood[Neighborhood])","v":"Columbia City"}]
["Construction","2020-10-30","Completed","Closed","98106",{"$f":"_xlfn.XLOOKUP(--fSeattle2020Complaints[[#This Row],[ZipCode]],dZipNeighborhood[ZipCode],dZipNeighborhood[Neighborhood])","v":"Delridge"}]
["Construction","2020-06-02","Completed","Completed","98118",{"$f":"_xlfn.XLOOKUP(--fSeattle2020Complaints[[#This Row],[ZipCode]],dZipNeighborhood[ZipCode],dZipNeighborhood[Neighborhood])","v":"Columbia City"}]
["Construction","2020-02-04","Completed","Completed","98109",{"$f":"_xlfn.XLOOKUP(--fSeattle2020Complaints[[#This Row],[ZipCode]],dZipNeighborhood[ZipCode],dZipNeighborhood[Neighborhood])","v":"South Lake Union"}]
["Land Use","2020-08-27","Completed","Completed","98104",{"$f":"_xlfn.XLOOKUP(--fSeattle2020Complaints[[#This Row],[ZipCode]],dZipNeighborhood[ZipCode],dZipNeighborhood[Neighborhood])","v":"International District"}]
["Tree","2020-10-16","Completed","Completed","98108",{"$f":"_xlfn.XLOOKUP(--fSeattle2020Complaints[[#This Row],[ZipCode]],dZipNeighborhood[ZipCode],dZipNeighborhood[Neighborhood])","v":"Rainer Valley"}]
["Land Use","2020-02-06","Completed","Initiated","98116",{"$f":"_xlfn.XLOOKUP(--fSeattle2020Complaints[[#This Row],[ZipCode]],dZipNeighborhood[ZipCode],dZipNeighborhood[Neighborhood])","v":"West Seattle"}]
["Land Use","2020-09-18","Completed","Completed","98199",{"$f":"_xlfn.XLOOKUP(--fSeattle2020Complaints[[#This Row],[ZipCode]],dZipNeighborhood[ZipCode],dZipNeighborhood[Neighborhood])","v":"Magnolia"}]
["Construction","2020-05-16","Completed","Completed","98118",{"$f":"_xlfn.XLOOKUP(--fSeattle2020Complaints[[#This Row],[ZipCode]],dZipNeighborhood[ZipCode],dZipNeighborhood[Neighborhood])","v":"Columbia City"}]
["Emergency , Vacant Building","2020-06-08","Completed","Completed","98118",{"$f":"_xlfn.XLOOKUP(--fSeattle2020Complaints[[#This Row],[ZipCode]],dZipNeighborhood[ZipCode],dZipNeighborhood[Neighborhood])","v":"Columbia City"}]
["Land Use","2020-07-29","Completed","Completed","98108",{"$f":"_xlfn.XLOOKUP(--fSeattle2020Complaints[[#This Row],[ZipCode]],dZipNeighborhood[ZipCode],dZipNeighborhood[Neighborhood])","v":"Rainer Valley"}]
["Construction , Tree","2020-06-19","Completed","Closed","98119",{"$f":"_xlfn.XLOOKUP(--fSeattle2020Complaints[[#This Row],[ZipCode]],dZipNeighborhood[ZipCode],dZipNeighborhood[Neighborhood])","v":"Queen Anne"}]
["Land UseConstruction ,","2020-06-22","Completed","Completed","98126",{"$f":"_xlfn.XLOOKUP(--fSeattle2020Complaints[[#This Row],[ZipCode]],dZipNeighborhood[ZipCode],dZipNeighborhood[Neighborhood])","v":"High Point"}]
["Weeds","2020-06-05","Completed","Completed","98106",{"$f":"_xlfn.XLOOKUP(--fSeattle2020Complaints[[#This Row],[ZipCode]],dZipNeighborhood[ZipCode],dZipNeighborhood[Neighborhood])","v":"Delridge"}]
["Land Use","2020-10-19","Completed","Completed","98108",{"$f":"_xlfn.XLOOKUP(--fSeattle2020Complaints[[#This Row],[ZipCode]],dZipNeighborhood[ZipCode],dZipNeighborhood[Neighborhood])","v":"Rainer Valley"}]
["Construction , ECA","2020-05-18","Completed","Completed","98116",{"$f":"_xlfn.XLOOKUP(--fSeattle2020Complaints[[#This Row],[ZipCode]],dZipNeighborhood[ZipCode],dZipNeighborhood[Neighborhood])","v":"West Seattle"}]
["Construction , ECA","2020-07-14","Completed","Closed","98116",{"$f":"_xlfn.XLOOKUP(--fSeattle2020Complaints[[#This Row],[ZipCode]],dZipNeighborhood[ZipCode],dZipNeighborhood[Neighborhood])","v":"West Seattle"}]
["Tree","2020-10-12","Completed","Completed","98106",{"$f":"_xlfn.XLOOKUP(--fSeattle2020Complaints[[#This Row],[ZipCode]],dZipNeighborhood[ZipCode],dZipNeighborhood[Neighborhood])","v":"Delridge"}]
["Emergency , Vacant Building","2020-02-21","Completed","Completed","98125",{"$f":"_xlfn.XLOOKUP(--fSeattle2020Complaints[[#This Row],[ZipCode]],dZipNeighborhood[ZipCode],dZipNeighborhood[Neighborhood])","v":"Northgate"}]
["Weeds","2020-02-11","Completed","Warning","98116",{"$f":"_xlfn.XLOOKUP(--fSeattle2020Complaints[[#This Row],[ZipCode]],dZipNeighborhood[ZipCode],dZipNeighborhood[Neighborhood])","v":"West Seattle"}]
["Vacant Building","2020-08-17","Completed","Completed","98102",{"$f":"_xlfn.XLOOKUP(--fSeattle2020Complaints[[#This Row],[ZipCode]],dZipNeighborhood[ZipCode],dZipNeighborhood[Neighborhood])","v":"Capital Hill"}]
["Construction","2020-11-25","Completed","Completed","98118",{"$f":"_xlfn.XLOOKUP(--fSeattle2020Complaints[[#This Row],[ZipCode]],dZipNeighborhood[ZipCode],dZipNeighborhood[Neighborhood])","v":"Columbia City"}]
["Vacant Building","2020-04-13","Completed","Completed","98109",{"$f":"_xlfn.XLOOKUP(--fSeattle2020Complaints[[#This Row],[ZipCode]],dZipNeighborhood[ZipCode],dZipNeighborhood[Neighborhood])","v":"South Lake Union"}]
["Land Use","2020-10-29","Completed","Completed","98108",{"$f":"_xlfn.XLOOKUP(--fSeattle2020Complaints[[#This Row],[ZipCode]],dZipNeighborhood[ZipCode],dZipNeighborhood[Neighborhood])","v":"Rainer Valley"}]
["Weeds","2020-06-09","Completed","Completed","98117",{"$f":"_xlfn.XLOOKUP(--fSeattle2020Complaints[[#This Row],[ZipCode]],dZipNeighborhood[ZipCode],dZipNeighborhood[Neighborhood])","v":"Sunset Hill"}]
["Weeds","2020-10-12","Completed","Completed","98103",{"$f":"_xlfn.XLOOKUP(--fSeattle2020Complaints[[#This Row],[ZipCode]],dZipNeighborhood[ZipCode],dZipNeighborhood[Neighborhood])","v":"Greenwood"}]
["Land Use","2020-04-07","Completed","Completed","98115",{"$f":"_xlfn.XLOOKUP(--fSeattle2020Complaints[[#This Row],[ZipCode]],dZipNeighborhood[ZipCode],dZipNeighborhood[Neighborhood])","v":"Greenlake"}]
["Land Use","2020-10-20","Completed","Completed","98144",{"$f":"_xlfn.XLOOKUP(--fSeattle2020Complaints[[#This Row],[ZipCode]],dZipNeighborhood[ZipCode],dZipNeighborhood[Neighborhood])","v":"Mount Baker"}]
["Land Use","2020-05-27","Completed","Completed","98108",{"$f":"_xlfn.XLOOKUP(--fSeattle2020Complaints[[#This Row],[ZipCode]],dZipNeighborhood[ZipCode],dZipNeighborhood[Neighborhood])","v":"Rainer Valley"}]
["Land Use","2020-09-10","No Violation","Completed","98177",{"$f":"_xlfn.XLOOKUP(--fSeattle2020Complaints[[#This Row],[ZipCode]],dZipNeighborhood[ZipCode],dZipNeighborhood[Neighborhood])","v":"Richmond Beach"}]
["Land Use","2020-03-06","Completed","Completed","98106",{"$f":"_xlfn.XLOOKUP(--fSeattle2020Complaints[[#This Row],[ZipCode]],dZipNeighborhood[ZipCode],dZipNeighborhood[Neighborhood])","v":"Delridge"}]
["Weeds","2020-02-28","Completed","Completed","98108",{"$f":"_xlfn.XLOOKUP(--fSeattle2020Complaints[[#This Row],[ZipCode]],dZipNeighborhood[ZipCode],dZipNeighborhood[Neighborhood])","v":"Rainer Valley"}]
["Land Use","2020-09-22","Completed","Completed","98133",{"$f":"_xlfn.XLOOKUP(--fSeattle2020Complaints[[#This Row],[ZipCode]],dZipNeighborhood[ZipCode],dZipNeighborhood[Neighborhood])","v":"Shoreline"}]
["Vacant Building","2020-07-17","Completed","Closed","98103",{"$f":"_xlfn.XLOOKUP(--fSeattle2020Complaints[[#This Row],[ZipCode]],dZipNeighborhood[ZipCode],dZipNeighborhood[Neighborhood])","v":"Greenwood"}]
["Land Use","2020-03-11","Completed","Completed","98115",{"$f":"_xlfn.XLOOKUP(--fSeattle2020Complaints[[#This Row],[ZipCode]],dZipNeighborhood[ZipCode],dZipNeighborhood[Neighborhood])","v":"Greenlake"}]
["Weeds","2020-05-22","Completed","Completed","98107",{"$f":"_xlfn.XLOOKUP(--fSeattle2020Complaints[[#This Row],[ZipCode]],dZipNeighborhood[ZipCode],dZipNeighborhood[Neighborhood])","v":"Ballard"}]
["Land Use","2020-03-13","Completed","Completed","98122",{"$f":"_xlfn.XLOOKUP(--fSeattle2020Complaints[[#This Row],[ZipCode]],dZipNeighborhood[ZipCode],dZipNeighborhood[Neighborhood])","v":"Minor, Central Area"}]
["Emergency , Vacant Building","2020-03-03","Completed","Completed","98118",{"$f":"_xlfn.XLOOKUP(--fSeattle2020Complaints[[#This Row],[ZipCode]],dZipNeighborhood[ZipCode],dZipNeighborhood[Neighborhood])","v":"Columbia City"}]
["Land Use","2020-10-02","Completed","Completed","98125",{"$f":"_xlfn.XLOOKUP(--fSeattle2020Complaints[[#This Row],[ZipCode]],dZipNeighborhood[ZipCode],dZipNeighborhood[Neighborhood])","v":"Northgate"}]
["Construction","2020-10-02","Completed","Under Investigation","98112",{"$f":"_xlfn.XLOOKUP(--fSeattle2020Complaints[[#This Row],[ZipCode]],dZipNeighborhood[ZipCode],dZipNeighborhood[Neighborhood])","v":"Madison Park"}]
["Construction","2020-01-23","Compliance Achieved","Completed","98108",{"$f":"_xlfn.XLOOKUP(--fSeattle2020Complaints[[#This Row],[ZipCode]],dZipNeighborhood[ZipCode],dZipNeighborhood[Neighborhood])","v":"Rainer Valley"}]
["Construction","2020-08-12","Completed","Under Investigation","98122",{"$f":"_xlfn.XLOOKUP(--fSeattle2020Complaints[[#This Row],[ZipCode]],dZipNeighborhood[ZipCode],dZipNeighborhood[Neighborhood])","v":"Minor, Central Area"}]
["Land Use","2020-08-16","Completed","Completed","98108",{"$f":"_xlfn.XLOOKUP(--fSeattle2020Complaints[[#This Row],[ZipCode]],dZipNeighborhood[ZipCode],dZipNeighborhood[Neighborhood])","v":"Rainer Valley"}]
["Weeds","2020-05-17","Completed","Completed","98177",{"$f":"_xlfn.XLOOKUP(--fSeattle2020Complaints[[#This Row],[ZipCode]],dZipNeighborhood[ZipCode],dZipNeighborhood[Neighborhood])","v":"Richmond Beach"}]
["Land Use","2020-12-07","Completed","Completed","98105",{"$f":"_xlfn.XLOOKUP(--fSeattle2020Complaints[[#This Row],[ZipCode]],dZipNeighborhood[ZipCode],dZipNeighborhood[Neighborhood])","v":"University District"}]
["Weeds","2020-03-11","Compliance Achieved","Completed","98116",{"$f":"_xlfn.XLOOKUP(--fSeattle2020Complaints[[#This Row],[ZipCode]],dZipNeighborhood[ZipCode],dZipNeighborhood[Neighborhood])","v":"West Seattle"}]
["Weeds","2020-07-12","Completed","Completed","98106",{"$f":"_xlfn.XLOOKUP(--fSeattle2020Complaints[[#This Row],[ZipCode]],dZipNeighborhood[ZipCode],dZipNeighborhood[Neighborhood])","v":"Delridge"}]
["Construction","2020-02-07","Completed","Completed","98109",{"$f":"_xlfn.XLOOKUP(--fSeattle2020Complaints[[#This Row],[ZipCode]],dZipNeighborhood[ZipCode],dZipNeighborhood[Neighborhood])","v":"South Lake Union"}]
["Weeds","2020-05-13","Compliance Achieved","Completed","98103",{"$f":"_xlfn.XLOOKUP(--fSeattle2020Complaints[[#This Row],[ZipCode]],dZipNeighborhood[ZipCode],dZipNeighborhood[Neighborhood])","v":"Greenwood"}]
["Land Use","2020-01-26","Completed","Completed","98105",{"$f":"_xlfn.XLOOKUP(--fSeattle2020Complaints[[#This Row],[ZipCode]],dZipNeighborhood[ZipCode],dZipNeighborhood[Neighborhood])","v":"University District"}]
["Emergency , Vacant Building","2020-04-10","Completed","Completed","98105",{"$f":"_xlfn.XLOOKUP(--fSeattle2020Complaints[[#This Row],[ZipCode]],dZipNeighborhood[ZipCode],dZipNeighborhood[Neighborhood])","v":"University District"}]
["Tree","2020-03-11","Completed","Completed","98116",{"$f":"_xlfn.XLOOKUP(--fSeattle2020Complaints[[#This Row],[ZipCode]],dZipNeighborhood[ZipCode],dZipNeighborhood[Neighborhood])","v":"West Seattle"}]
["Construction","2020-08-11","Completed","Completed","98105",{"$f":"_xlfn.XLOOKUP(--fSeattle2020Complaints[[#This Row],[ZipCode]],dZipNeighborhood[ZipCode],dZipNeighborhood[Neighborhood])","v":"University District"}]
["Construction , Noise","2020-07-19","Completed","Completed","98115",{"$f":"_xlfn.XLOOKUP(--fSeattle2020Complaints[[#This Row],[ZipCode]],dZipNeighborhood[ZipCode],dZipNeighborhood[Neighborhood])","v":"Greenlake"}]
["Land Use","2020-07-16","Completed","Completed","98106",{"$f":"_xlfn.XLOOKUP(--fSeattle2020Complaints[[#This Row],[ZipCode]],dZipNeighborhood[ZipCode],dZipNeighborhood[Neighborhood])","v":"Delridge"}]
["Weeds","2020-07-20","Compliance Achieved","Completed","98136",{"$f":"_xlfn.XLOOKUP(--fSeattle2020Complaints[[#This Row],[ZipCode]],dZipNeighborhood[ZipCode],dZipNeighborhood[Neighborhood])","v":"Seaview"}]
["Construction","2020-03-03","Completed","Completed","98119",{"$f":"_xlfn.XLOOKUP(--fSeattle2020Complaints[[#This Row],[ZipCode]],dZipNeighborhood[ZipCode],dZipNeighborhood[Neighborhood])","v":"Queen Anne"}]
["Construction","2020-07-17","Completed","Completed","98199",{"$f":"_xlfn.XLOOKUP(--fSeattle2020Complaints[[#This Row],[ZipCode]],dZipNeighborhood[ZipCode],dZipNeighborhood[Neighborhood])","v":"Magnolia"}]
["Land Use","2020-12-03","Completed","Completed","98109",{"$f":"_xlfn.XLOOKUP(--fSeattle2020Complaints[[#This Row],[ZipCode]],dZipNeighborhood[ZipCode],dZipNeighborhood[Neighborhood])","v":"South Lake Union"}]
["Construction","2020-06-24","Completed","Closed","98199",{"$f":"_xlfn.XLOOKUP(--fSeattle2020Complaints[[#This Row],[ZipCode]],dZipNeighborhood[ZipCode],dZipNeighborhood[Neighborhood])","v":"Magnolia"}]
["Construction , Tree","2020-09-02","No Access/Unable to Observe","Under Investigation","98125",{"$f":"_xlfn.XLOOKUP(--fSeattle2020Complaints[[#This Row],[ZipCode]],dZipNeighborhood[ZipCode],dZipNeighborhood[Neighborhood])","v":"Northgate"}]
["Land Use","2020-08-17","Completed","Completed","98115",{"$f":"_xlfn.XLOOKUP(--fSeattle2020Complaints[[#This Row],[ZipCode]],dZipNeighborhood[ZipCode],dZipNeighborhood[Neighborhood])","v":"Greenlake"}]
["Emergency , Vacant Building","2020-05-21","Completed","Completed","98122",{"$f":"_xlfn.XLOOKUP(--fSeattle2020Complaints[[#This Row],[ZipCode]],dZipNeighborhood[ZipCode],dZipNeighborhood[Neighborhood])","v":"Minor, Central Area"}]
["Weeds","2020-06-11","Completed","Completed","98106",{"$f":"_xlfn.XLOOKUP(--fSeattle2020Complaints[[#This Row],[ZipCode]],dZipNeighborhood[ZipCode],dZipNeighborhood[Neighborhood])","v":"Delridge"}]
["Construction","2020-03-11","Completed","Completed","98122",{"$f":"_xlfn.XLOOKUP(--fSeattle2020Complaints[[#This Row],[ZipCode]],dZipNeighborhood[ZipCode],dZipNeighborhood[Neighborhood])","v":"Minor, Central Area"}]
["Vacant Building","2020-09-18","Completed","Completed","98103",{"$f":"_xlfn.XLOOKUP(--fSeattle2020Complaints[[#This Row],[ZipCode]],dZipNeighborhood[ZipCode],dZipNeighborhood[Neighborhood])","v":"Greenwood"}]
["Land Use","2020-02-25","Completed","Completed","98115",{"$f":"_xlfn.XLOOKUP(--fSeattle2020Complaints[[#This Row],[ZipCode]],dZipNeighborhood[ZipCode],dZipNeighborhood[Neighborhood])","v":"Greenlake"}]
["Construction , ECA , Tree , Weeds","2020-10-21","Completed","Completed","98109",{"$f":"_xlfn.XLOOKUP(--fSeattle2020Complaints[[#This Row],[ZipCode]],dZipNeighborhood[ZipCode],dZipNeighborhood[Neighborhood])","v":"South Lake Union"}]
["Weeds","2020-08-14","Completed","Completed","98199",{"$f":"_xlfn.XLOOKUP(--fSeattle2020Complaints[[#This Row],[ZipCode]],dZipNeighborhood[ZipCode],dZipNeighborhood[Neighborhood])","v":"Magnolia"}]
["Land Use","2020-11-24","Completed","Completed","98122",{"$f":"_xlfn.XLOOKUP(--fSeattle2020Complaints[[#This Row],[ZipCode]],dZipNeighborhood[ZipCode],dZipNeighborhood[Neighborhood])","v":"Minor, Central Area"}]
["Weeds","2020-08-10","Completed","Completed","98115",{"$f":"_xlfn.XLOOKUP(--fSeattle2020Complaints[[#This Row],[ZipCode]],dZipNeighborhood[ZipCode],dZipNeighborhood[Neighborhood])","v":"Greenlake"}]
["Construction","2020-12-09","Completed","Completed","98118",{"$f":"_xlfn.XLOOKUP(--fSeattle2020Complaints[[#This Row],[ZipCode]],dZipNeighborhood[ZipCode],dZipNeighborhood[Neighborhood])","v":"Columbia City"}]
["Weeds","2020-11-10","Completed","Completed","98118",{"$f":"_xlfn.XLOOKUP(--fSeattle2020Complaints[[#This Row],[ZipCode]],dZipNeighborhood[ZipCode],dZipNeighborhood[Neighborhood])","v":"Columbia City"}]
["Construction","2020-08-31","Completed","Closed","98109",{"$f":"_xlfn.XLOOKUP(--fSeattle2020Complaints[[#This Row],[ZipCode]],dZipNeighborhood[ZipCode],dZipNeighborhood[Neighborhood])","v":"South Lake Union"}]
["Land Use","2020-07-08","Completed","Completed","98103",{"$f":"_xlfn.XLOOKUP(--fSeattle2020Complaints[[#This Row],[ZipCode]],dZipNeighborhood[ZipCode],dZipNeighborhood[Neighborhood])","v":"Greenwood"}]
["Weeds","2020-09-20","Completed","Completed","98115",{"$f":"_xlfn.XLOOKUP(--fSeattle2020Complaints[[#This Row],[ZipCode]],dZipNeighborhood[ZipCode],dZipNeighborhood[Neighborhood])","v":"Greenlake"}]
["Land Use","2020-09-18","Completed","Completed","98144",{"$f":"_xlfn.XLOOKUP(--fSeattle2020Complaints[[#This Row],[ZipCode]],dZipNeighborhood[ZipCode],dZipNeighborhood[Neighborhood])","v":"Mount Baker"}]
["Land Use","2020-09-02","Completed","Completed","98199",{"$f":"_xlfn.XLOOKUP(--fSeattle2020Complaints[[#This Row],[ZipCode]],dZipNeighborhood[ZipCode],dZipNeighborhood[Neighborhood])","v":"Magnolia"}]
["Land UseVacant Building ,","2020-05-29","Completed","Completed","98105",{"$f":"_xlfn.XLOOKUP(--fSeattle2020Complaints[[#This Row],[ZipCode]],dZipNeighborhood[ZipCode],dZipNeighborhood[Neighborhood])","v":"University District"}]
["Land Use","2020-09-06","Completed","Closed","98103",{"$f":"_xlfn.XLOOKUP(--fSeattle2020Complaints[[#This Row],[ZipCode]],dZipNeighborhood[ZipCode],dZipNeighborhood[Neighborhood])","v":"Greenwood"}]
["Land Use","2020-06-22","Completed","Completed","98144",{"$f":"_xlfn.XLOOKUP(--fSeattle2020Complaints[[#This Row],[ZipCode]],dZipNeighborhood[ZipCode],dZipNeighborhood[Neighborhood])","v":"Mount Baker"}]
["Construction , Noise","2020-05-28","Completed","Completed","98118",{"$f":"_xlfn.XLOOKUP(--fSeattle2020Complaints[[#This Row],[ZipCode]],dZipNeighborhood[ZipCode],dZipNeighborhood[Neighborhood])","v":"Columbia City"}]
["Construction","2020-12-10","Completed","Completed","98108",{"$f":"_xlfn.XLOOKUP(--fSeattle2020Complaints[[#This Row],[ZipCode]],dZipNeighborhood[ZipCode],dZipNeighborhood[Neighborhood])","v":"Rainer Valley"}]
["Land Use","2020-02-11","Completed","Completed","98144",{"$f":"_xlfn.XLOOKUP(--fSeattle2020Complaints[[#This Row],[ZipCode]],dZipNeighborhood[ZipCode],dZipNeighborhood[Neighborhood])","v":"Mount Baker"}]
["Weeds","2020-04-21","Completed","Completed","98119",{"$f":"_xlfn.XLOOKUP(--fSeattle2020Complaints[[#This Row],[ZipCode]],dZipNeighborhood[ZipCode],dZipNeighborhood[Neighborhood])","v":"Queen Anne"}]
["Tree","2020-03-19","Completed","Completed","98116",{"$f":"_xlfn.XLOOKUP(--fSeattle2020Complaints[[#This Row],[ZipCode]],dZipNeighborhood[ZipCode],dZipNeighborhood[Neighborhood])","v":"West Seattle"}]
["Land Use","2020-05-06","Completed","Completed","98109",{"$f":"_xlfn.XLOOKUP(--fSeattle2020Complaints[[#This Row],[ZipCode]],dZipNeighborhood[ZipCode],dZipNeighborhood[Neighborhood])","v":"South Lake Union"}]
["Weeds","2020-10-23","Completed","Completed","98104",{"$f":"_xlfn.XLOOKUP(--fSeattle2020Complaints[[#This Row],[ZipCode]],dZipNeighborhood[ZipCode],dZipNeighborhood[Neighborhood])","v":"International District"}]
["Construction","2020-03-11","Admin Closure","Completed","98136",{"$f":"_xlfn.XLOOKUP(--fSeattle2020Complaints[[#This Row],[ZipCode]],dZipNeighborhood[ZipCode],dZipNeighborhood[Neighborhood])","v":"Seaview"}]
["Weeds","2020-12-12","Completed","Completed","98199",{"$f":"_xlfn.XLOOKUP(--fSeattle2020Complaints[[#This Row],[ZipCode]],dZipNeighborhood[ZipCode],dZipNeighborhood[Neighborhood])","v":"Magnolia"}]
["Construction","2020-01-08","Completed","Under Investigation","98144",{"$f":"_xlfn.XLOOKUP(--fSeattle2020Complaints[[#This Row],[ZipCode]],dZipNeighborhood[ZipCode],dZipNeighborhood[Neighborhood])","v":"Mount Baker"}]
["Vacant Building","2020-01-21","Completed","Completed","98107",{"$f":"_xlfn.XLOOKUP(--fSeattle2020Complaints[[#This Row],[ZipCode]],dZipNeighborhood[ZipCode],dZipNeighborhood[Neighborhood])","v":"Ballard"}]
["Land Use","2020-03-09","Completed","Completed","98122",{"$f":"_xlfn.XLOOKUP(--fSeattle2020Complaints[[#This Row],[ZipCode]],dZipNeighborhood[ZipCode],dZipNeighborhood[Neighborhood])","v":"Minor, Central Area"}]
["Construction","2020-03-09","Completed","Completed","98109",{"$f":"_xlfn.XLOOKUP(--fSeattle2020Complaints[[#This Row],[ZipCode]],dZipNeighborhood[ZipCode],dZipNeighborhood[Neighborhood])","v":"South Lake Union"}]
["Land Use","2020-08-11","Completed","Completed","98122",{"$f":"_xlfn.XLOOKUP(--fSeattle2020Complaints[[#This Row],[ZipCode]],dZipNeighborhood[ZipCode],dZipNeighborhood[Neighborhood])","v":"Minor, Central Area"}]
["Construction","2020-06-17","Completed","NOV Issued","98102",{"$f":"_xlfn.XLOOKUP(--fSeattle2020Complaints[[#This Row],[ZipCode]],dZipNeighborhood[ZipCode],dZipNeighborhood[Neighborhood])","v":"Capital Hill"}]
["Vacant Building","2020-07-11","Completed","Completed","98144",{"$f":"_xlfn.XLOOKUP(--fSeattle2020Complaints[[#This Row],[ZipCode]],dZipNeighborhood[ZipCode],dZipNeighborhood[Neighborhood])","v":"Mount Baker"}]
["Construction","2020-10-10","Completed","Completed","98105",{"$f":"_xlfn.XLOOKUP(--fSeattle2020Complaints[[#This Row],[ZipCode]],dZipNeighborhood[ZipCode],dZipNeighborhood[Neighborhood])","v":"University District"}]
["Land Use","2020-06-30","Completed","Completed","98118",{"$f":"_xlfn.XLOOKUP(--fSeattle2020Complaints[[#This Row],[ZipCode]],dZipNeighborhood[ZipCode],dZipNeighborhood[Neighborhood])","v":"Columbia City"}]
["Construction","2020-02-03","Compliance Achieved","Completed","98144",{"$f":"_xlfn.XLOOKUP(--fSeattle2020Complaints[[#This Row],[ZipCode]],dZipNeighborhood[ZipCode],dZipNeighborhood[Neighborhood])","v":"Mount Baker"}]
["Land Use","2020-02-28","Completed","Completed","98117",{"$f":"_xlfn.XLOOKUP(--fSeattle2020Complaints[[#This Row],[ZipCode]],dZipNeighborhood[ZipCode],dZipNeighborhood[Neighborhood])","v":"Sunset Hill"}]
["Land Use","2020-01-12","Completed","Completed","98103",{"$f":"_xlfn.XLOOKUP(--fSeattle2020Complaints[[#This Row],[ZipCode]],dZipNeighborhood[ZipCode],dZipNeighborhood[Neighborhood])","v":"Greenwood"}]
["Weeds","2020-10-19","Completed","Warning","98133",{"$f":"_xlfn.XLOOKUP(--fSeattle2020Complaints[[#This Row],[ZipCode]],dZipNeighborhood[ZipCode],dZipNeighborhood[Neighborhood])","v":"Shoreline"}]
["Land Use","2020-07-13","Completed","Completed","98122",{"$f":"_xlfn.XLOOKUP(--fSeattle2020Complaints[[#This Row],[ZipCode]],dZipNeighborhood[ZipCode],dZipNeighborhood[Neighborhood])","v":"Minor, Central Area"}]
["Vacant Building","2020-09-08","Completed","Completed","98103",{"$f":"_xlfn.XLOOKUP(--fSeattle2020Complaints[[#This Row],[ZipCode]],dZipNeighborhood[ZipCode],dZipNeighborhood[Neighborhood])","v":"Greenwood"}]
["Construction","2020-11-17","Completed","Under Investigation","98109",{"$f":"_xlfn.XLOOKUP(--fSeattle2020Complaints[[#This Row],[ZipCode]],dZipNeighborhood[ZipCode],dZipNeighborhood[Neighborhood])","v":"South Lake Union"}]
["Weeds","2020-01-16","Completed","Completed","98118",{"$f":"_xlfn.XLOOKUP(--fSeattle2020Complaints[[#This Row],[ZipCode]],dZipNeighborhood[ZipCode],dZipNeighborhood[Neighborhood])","v":"Columbia City"}]
["Construction , Tree","2020-09-10","Completed","Completed","98109",{"$f":"_xlfn.XLOOKUP(--fSeattle2020Complaints[[#This Row],[ZipCode]],dZipNeighborhood[ZipCode],dZipNeighborhood[Neighborhood])","v":"South Lake Union"}]
["Land Use","2020-08-11","Completed","Completed","98104",{"$f":"_xlfn.XLOOKUP(--fSeattle2020Complaints[[#This Row],[ZipCode]],dZipNeighborhood[ZipCode],dZipNeighborhood[Neighborhood])","v":"International District"}]
["Weeds","2020-09-10","Completed","Completed","98117",{"$f":"_xlfn.XLOOKUP(--fSeattle2020Complaints[[#This Row],[ZipCode]],dZipNeighborhood[ZipCode],dZipNeighborhood[Neighborhood])","v":"Sunset Hill"}]
["Weeds","2020-09-05","Completed","Completed","98126",{"$f":"_xlfn.XLOOKUP(--fSeattle2020Complaints[[#This Row],[ZipCode]],dZipNeighborhood[ZipCode],dZipNeighborhood[Neighborhood])","v":"High Point"}]
["Emergency , Vacant Building","2020-04-10","Completed","Completed","98144",{"$f":"_xlfn.XLOOKUP(--fSeattle2020Complaints[[#This Row],[ZipCode]],dZipNeighborhood[ZipCode],dZipNeighborhood[Neighborhood])","v":"Mount Baker"}]
["Construction","2020-06-27","Completed","Completed","98136",{"$f":"_xlfn.XLOOKUP(--fSeattle2020Complaints[[#This Row],[ZipCode]],dZipNeighborhood[ZipCode],dZipNeighborhood[Neighborhood])","v":"Seaview"}]
["Weeds","2020-08-09","Completed","Completed","98106",{"$f":"_xlfn.XLOOKUP(--fSeattle2020Complaints[[#This Row],[ZipCode]],dZipNeighborhood[ZipCode],dZipNeighborhood[Neighborhood])","v":"Delridge"}]
["Weeds","2020-03-05","Completed","Completed","98103",{"$f":"_xlfn.XLOOKUP(--fSeattle2020Complaints[[#This Row],[ZipCode]],dZipNeighborhood[ZipCode],dZipNeighborhood[Neighborhood])","v":"Greenwood"}]
["Land Use","2020-06-02","Completed","Completed","98122",{"$f":"_xlfn.XLOOKUP(--fSeattle2020Complaints[[#This Row],[ZipCode]],dZipNeighborhood[ZipCode],dZipNeighborhood[Neighborhood])","v":"Minor, Central Area"}]
["Noise","2020-06-11","Completed","Completed","98104",{"$f":"_xlfn.XLOOKUP(--fSeattle2020Complaints[[#This Row],[ZipCode]],dZipNeighborhood[ZipCode],dZipNeighborhood[Neighborhood])","v":"International District"}]
["Land Use","2020-05-14","Completed","Completed","98177",{"$f":"_xlfn.XLOOKUP(--fSeattle2020Complaints[[#This Row],[ZipCode]],dZipNeighborhood[ZipCode],dZipNeighborhood[Neighborhood])","v":"Richmond Beach"}]
["Weeds","2020-04-22","Compliance Achieved","Completed","98115",{"$f":"_xlfn.XLOOKUP(--fSeattle2020Complaints[[#This Row],[ZipCode]],dZipNeighborhood[ZipCode],dZipNeighborhood[Neighborhood])","v":"Greenlake"}]
["Weeds","2020-03-04","Completed","Warning","98199",{"$f":"_xlfn.XLOOKUP(--fSeattle2020Complaints[[#This Row],[ZipCode]],dZipNeighborhood[ZipCode],dZipNeighborhood[Neighborhood])","v":"Magnolia"}]
["Construction","2020-07-01","Completed","Completed","98103",{"$f":"_xlfn.XLOOKUP(--fSeattle2020Complaints[[#This Row],[ZipCode]],dZipNeighborhood[ZipCode],dZipNeighborhood[Neighborhood])","v":"Greenwood"}]
["Land Use","2020-01-27","Completed","Completed","98144",{"$f":"_xlfn.XLOOKUP(--fSeattle2020Complaints[[#This Row],[ZipCode]],dZipNeighborhood[ZipCode],dZipNeighborhood[Neighborhood])","v":"Mount Baker"}]
["Construction","2020-09-08","Completed","Completed","98103",{"$f":"_xlfn.XLOOKUP(--fSeattle2020Complaints[[#This Row],[ZipCode]],dZipNeighborhood[ZipCode],dZipNeighborhood[Neighborhood])","v":"Greenwood"}]
["Land Use","2020-03-04","Completed","Completed","98105",{"$f":"_xlfn.XLOOKUP(--fSeattle2020Complaints[[#This Row],[ZipCode]],dZipNeighborhood[ZipCode],dZipNeighborhood[Neighborhood])","v":"University District"}]
["Weeds","2020-06-05","Completed","Completed","98106",{"$f":"_xlfn.XLOOKUP(--fSeattle2020Complaints[[#This Row],[ZipCode]],dZipNeighborhood[ZipCode],dZipNeighborhood[Neighborhood])","v":"Delridge"}]
["Construction","2020-05-13","Completed","Completed","98133",{"$f":"_xlfn.XLOOKUP(--fSeattle2020Complaints[[#This Row],[ZipCode]],dZipNeighborhood[ZipCode],dZipNeighborhood[Neighborhood])","v":"Shoreline"}]
["Construction","2020-10-30","Completed","Closed","98106",{"$f":"_xlfn.XLOOKUP(--fSeattle2020Complaints[[#This Row],[ZipCode]],dZipNeighborhood[ZipCode],dZipNeighborhood[Neighborhood])","v":"Delridge"}]
["Land Use","2020-02-10","Completed","Completed","98104",{"$f":"_xlfn.XLOOKUP(--fSeattle2020Complaints[[#This Row],[ZipCode]],dZipNeighborhood[ZipCode],dZipNeighborhood[Neighborhood])","v":"International District"}]
["Weeds","2020-08-06","Completed","Completed","98116",{"$f":"_xlfn.XLOOKUP(--fSeattle2020Complaints[[#This Row],[ZipCode]],dZipNeighborhood[ZipCode],dZipNeighborhood[Neighborhood])","v":"West Seattle"}]
["Land Use","2020-02-20","Completed","Completed","98103",{"$f":"_xlfn.XLOOKUP(--fSeattle2020Complaints[[#This Row],[ZipCode]],dZipNeighborhood[ZipCode],dZipNeighborhood[Neighborhood])","v":"Greenwood"}]
["Vacant Building","2020-09-20","Completed","Completed","98103",{"$f":"_xlfn.XLOOKUP(--fSeattle2020Complaints[[#This Row],[ZipCode]],dZipNeighborhood[ZipCode],dZipNeighborhood[Neighborhood])","v":"Greenwood"}]
["Construction","2020-06-29","Completed","Completed","98119",{"$f":"_xlfn.XLOOKUP(--fSeattle2020Complaints[[#This Row],[ZipCode]],dZipNeighborhood[ZipCode],dZipNeighborhood[Neighborhood])","v":"Queen Anne"}]
["Construction","2020-01-23","Completed","NOV Issued","98122",{"$f":"_xlfn.XLOOKUP(--fSeattle2020Complaints[[#This Row],[ZipCode]],dZipNeighborhood[ZipCode],dZipNeighborhood[Neighborhood])","v":"Minor, Central Area"}]
["Weeds","2020-03-06","Compliance Achieved","Completed","98105",{"$f":"_xlfn.XLOOKUP(--fSeattle2020Complaints[[#This Row],[ZipCode]],dZipNeighborhood[ZipCode],dZipNeighborhood[Neighborhood])","v":"University District"}]
["Construction","2020-02-21","Completed","Completed","98107",{"$f":"_xlfn.XLOOKUP(--fSeattle2020Complaints[[#This Row],[ZipCode]],dZipNeighborhood[ZipCode],dZipNeighborhood[Neighborhood])","v":"Ballard"}]
["Construction","2020-12-18","Completed","Completed","98116",{"$f":"_xlfn.XLOOKUP(--fSeattle2020Complaints[[#This Row],[ZipCode]],dZipNeighborhood[ZipCode],dZipNeighborhood[Neighborhood])","v":"West Seattle"}]
["Vacant Building","2020-04-07","Completed","Closed","98109",{"$f":"_xlfn.XLOOKUP(--fSeattle2020Complaints[[#This Row],[ZipCode]],dZipNeighborhood[ZipCode],dZipNeighborhood[Neighborhood])","v":"South Lake Union"}]
["Weeds","2020-04-25","Completed","Completed","98108",{"$f":"_xlfn.XLOOKUP(--fSeattle2020Complaints[[#This Row],[ZipCode]],dZipNeighborhood[ZipCode],dZipNeighborhood[Neighborhood])","v":"Rainer Valley"}]
["Weeds","2020-02-03","Completed","Completed","98103",{"$f":"_xlfn.XLOOKUP(--fSeattle2020Complaints[[#This Row],[ZipCode]],dZipNeighborhood[ZipCode],dZipNeighborhood[Neighborhood])","v":"Greenwood"}]
["Construction","2020-12-28","No Access/Unable to Observe","Completed","98126",{"$f":"_xlfn.XLOOKUP(--fSeattle2020Complaints[[#This Row],[ZipCode]],dZipNeighborhood[ZipCode],dZipNeighborhood[Neighborhood])","v":"High Point"}]
["Weeds","2020-08-14","Completed","Completed","98117",{"$f":"_xlfn.XLOOKUP(--fSeattle2020Complaints[[#This Row],[ZipCode]],dZipNeighborhood[ZipCode],dZipNeighborhood[Neighborhood])","v":"Sunset Hill"}]
["Land Use","2020-12-04","Compliance Achieved","Completed","98122",{"$f":"_xlfn.XLOOKUP(--fSeattle2020Complaints[[#This Row],[ZipCode]],dZipNeighborhood[ZipCode],dZipNeighborhood[Neighborhood])","v":"Minor, Central Area"}]
["Weeds","2020-01-28","Compliance Achieved","Completed","98144",{"$f":"_xlfn.XLOOKUP(--fSeattle2020Complaints[[#This Row],[ZipCode]],dZipNeighborhood[ZipCode],dZipNeighborhood[Neighborhood])","v":"Mount Baker"}]
["Construction , ECA","2020-11-16","Completed","Under Investigation","98102",{"$f":"_xlfn.XLOOKUP(--fSeattle2020Complaints[[#This Row],[ZipCode]],dZipNeighborhood[ZipCode],dZipNeighborhood[Neighborhood])","v":"Capital Hill"}]
["Land Use","2020-05-03","Completed","Completed","98106",{"$f":"_xlfn.XLOOKUP(--fSeattle2020Complaints[[#This Row],[ZipCode]],dZipNeighborhood[ZipCode],dZipNeighborhood[Neighborhood])","v":"Delridge"}]
["Weeds","2020-07-17","Completed","Completed","98126",{"$f":"_xlfn.XLOOKUP(--fSeattle2020Complaints[[#This Row],[ZipCode]],dZipNeighborhood[ZipCode],dZipNeighborhood[Neighborhood])","v":"High Point"}]
["Construction","2020-02-28","Completed","Completed","98118",{"$f":"_xlfn.XLOOKUP(--fSeattle2020Complaints[[#This Row],[ZipCode]],dZipNeighborhood[ZipCode],dZipNeighborhood[Neighborhood])","v":"Columbia City"}]
["Construction","2020-03-10","Completed","Completed","98115",{"$f":"_xlfn.XLOOKUP(--fSeattle2020Complaints[[#This Row],[ZipCode]],dZipNeighborhood[ZipCode],dZipNeighborhood[Neighborhood])","v":"Greenlake"}]
["Vacant Building","2020-04-27","Completed","Completed","98107",{"$f":"_xlfn.XLOOKUP(--fSeattle2020Complaints[[#This Row],[ZipCode]],dZipNeighborhood[ZipCode],dZipNeighborhood[Neighborhood])","v":"Ballard"}]
["Vacant Building","2020-04-03","Completed","Completed","98122",{"$f":"_xlfn.XLOOKUP(--fSeattle2020Complaints[[#This Row],[ZipCode]],dZipNeighborhood[ZipCode],dZipNeighborhood[Neighborhood])","v":"Minor, Central Area"}]
["Weeds","2020-03-09","Completed","Closed","98118",{"$f":"_xlfn.XLOOKUP(--fSeattle2020Complaints[[#This Row],[ZipCode]],dZipNeighborhood[ZipCode],dZipNeighborhood[Neighborhood])","v":"Columbia City"}]
["Land Use","2020-08-17","Completed","Completed","98116",{"$f":"_xlfn.XLOOKUP(--fSeattle2020Complaints[[#This Row],[ZipCode]],dZipNeighborhood[ZipCode],dZipNeighborhood[Neighborhood])","v":"West Seattle"}]
["Land Use","2020-07-02","Completed","Warning","98146",{"$f":"_xlfn.XLOOKUP(--fSeattle2020Complaints[[#This Row],[ZipCode]],dZipNeighborhood[ZipCode],dZipNeighborhood[Neighborhood])","v":"Shorewood, White Center"}]
["Land Use","2020-11-09","Completed","Completed","98122",{"$f":"_xlfn.XLOOKUP(--fSeattle2020Complaints[[#This Row],[ZipCode]],dZipNeighborhood[ZipCode],dZipNeighborhood[Neighborhood])","v":"Minor, Central Area"}]
["Weeds","2020-02-20","Completed","Completed","98103",{"$f":"_xlfn.XLOOKUP(--fSeattle2020Complaints[[#This Row],[ZipCode]],dZipNeighborhood[ZipCode],dZipNeighborhood[Neighborhood])","v":"Greenwood"}]
["Weeds","2020-02-25","Completed","Initiated","98119",{"$f":"_xlfn.XLOOKUP(--fSeattle2020Complaints[[#This Row],[ZipCode]],dZipNeighborhood[ZipCode],dZipNeighborhood[Neighborhood])","v":"Queen Anne"}]
["Land Use","2020-07-20","Completed","Under Investigation","98106",{"$f":"_xlfn.XLOOKUP(--fSeattle2020Complaints[[#This Row],[ZipCode]],dZipNeighborhood[ZipCode],dZipNeighborhood[Neighborhood])","v":"Delridge"}]
["LandLord/Tenant","2020-02-25","Completed","Completed","98115",{"$f":"_xlfn.XLOOKUP(--fSeattle2020Complaints[[#This Row],[ZipCode]],dZipNeighborhood[ZipCode],dZipNeighborhood[Neighborhood])","v":"Greenlake"}]
["Land Use","2020-08-19","Completed","Completed","98117",{"$f":"_xlfn.XLOOKUP(--fSeattle2020Complaints[[#This Row],[ZipCode]],dZipNeighborhood[ZipCode],dZipNeighborhood[Neighborhood])","v":"Sunset Hill"}]
["Vacant Building","2020-08-22","Completed","Completed","98144",{"$f":"_xlfn.XLOOKUP(--fSeattle2020Complaints[[#This Row],[ZipCode]],dZipNeighborhood[ZipCode],dZipNeighborhood[Neighborhood])","v":"Mount Baker"}]
["Weeds","2020-08-17","Completed","Completed","98117",{"$f":"_xlfn.XLOOKUP(--fSeattle2020Complaints[[#This Row],[ZipCode]],dZipNeighborhood[ZipCode],dZipNeighborhood[Neighborhood])","v":"Sunset Hill"}]
["Construction","2020-05-19","Completed","Completed","98119",{"$f":"_xlfn.XLOOKUP(--fSeattle2020Complaints[[#This Row],[ZipCode]],dZipNeighborhood[ZipCode],dZipNeighborhood[Neighborhood])","v":"Queen Anne"}]
["Land UseNoise ,","2020-11-02","Completed","Completed","98115",{"$f":"_xlfn.XLOOKUP(--fSeattle2020Complaints[[#This Row],[ZipCode]],dZipNeighborhood[ZipCode],dZipNeighborhood[Neighborhood])","v":"Greenlake"}]
["Land Use","2020-08-01","Completed","Completed","98117",{"$f":"_xlfn.XLOOKUP(--fSeattle2020Complaints[[#This Row],[ZipCode]],dZipNeighborhood[ZipCode],dZipNeighborhood[Neighborhood])","v":"Sunset Hill"}]
["Weeds","2020-06-12","Completed","Completed","98103",{"$f":"_xlfn.XLOOKUP(--fSeattle2020Complaints[[#This Row],[ZipCode]],dZipNeighborhood[ZipCode],dZipNeighborhood[Neighborhood])","v":"Greenwood"}]
["Tree","2020-01-10","Completed","Completed","98116",{"$f":"_xlfn.XLOOKUP(--fSeattle2020Complaints[[#This Row],[ZipCode]],dZipNeighborhood[ZipCode],dZipNeighborhood[Neighborhood])","v":"West Seattle"}]
["Construction , ECA","2020-12-01","Completed","Closed","98109",{"$f":"_xlfn.XLOOKUP(--fSeattle2020Complaints[[#This Row],[ZipCode]],dZipNeighborhood[ZipCode],dZipNeighborhood[Neighborhood])","v":"South Lake Union"}]
["Land Use","2020-10-26","Completed","Closed","98118",{"$f":"_xlfn.XLOOKUP(--fSeattle2020Complaints[[#This Row],[ZipCode]],dZipNeighborhood[ZipCode],dZipNeighborhood[Neighborhood])","v":"Columbia City"}]
["Land Use","2020-02-12","Completed","Initiated","98118",{"$f":"_xlfn.XLOOKUP(--fSeattle2020Complaints[[#This Row],[ZipCode]],dZipNeighborhood[ZipCode],dZipNeighborhood[Neighborhood])","v":"Columbia City"}]
["Construction","2020-05-21","Completed","Completed","98144",{"$f":"_xlfn.XLOOKUP(--fSeattle2020Complaints[[#This Row],[ZipCode]],dZipNeighborhood[ZipCode],dZipNeighborhood[Neighborhood])","v":"Mount Baker"}]
["Emergency , Vacant Building","2020-01-24","Completed","Completed","98105",{"$f":"_xlfn.XLOOKUP(--fSeattle2020Complaints[[#This Row],[ZipCode]],dZipNeighborhood[ZipCode],dZipNeighborhood[Neighborhood])","v":"University District"}]
["Construction","2020-11-17","Completed","Completed","98106",{"$f":"_xlfn.XLOOKUP(--fSeattle2020Complaints[[#This Row],[ZipCode]],dZipNeighborhood[ZipCode],dZipNeighborhood[Neighborhood])","v":"Delridge"}]
["Land Use","2020-07-05","Completed","Completed","98136",{"$f":"_xlfn.XLOOKUP(--fSeattle2020Complaints[[#This Row],[ZipCode]],dZipNeighborhood[ZipCode],dZipNeighborhood[Neighborhood])","v":"Seaview"}]
["Weeds","2020-06-05","Completed","Completed","98116",{"$f":"_xlfn.XLOOKUP(--fSeattle2020Complaints[[#This Row],[ZipCode]],dZipNeighborhood[ZipCode],dZipNeighborhood[Neighborhood])","v":"West Seattle"}]
["Land Use","2020-07-07","Completed","Completed","98112",{"$f":"_xlfn.XLOOKUP(--fSeattle2020Complaints[[#This Row],[ZipCode]],dZipNeighborhood[ZipCode],dZipNeighborhood[Neighborhood])","v":"Madison Park"}]
["Land Use","2020-08-13","No Access/Unable to Observe","Completed","98118",{"$f":"_xlfn.XLOOKUP(--fSeattle2020Complaints[[#This Row],[ZipCode]],dZipNeighborhood[ZipCode],dZipNeighborhood[Neighborhood])","v":"Columbia City"}]
["Construction","2020-06-03","Completed","Completed","98122",{"$f":"_xlfn.XLOOKUP(--fSeattle2020Complaints[[#This Row],[ZipCode]],dZipNeighborhood[ZipCode],dZipNeighborhood[Neighborhood])","v":"Minor, Central Area"}]
["Weeds","2020-11-05","Completed","Completed","98102",{"$f":"_xlfn.XLOOKUP(--fSeattle2020Complaints[[#This Row],[ZipCode]],dZipNeighborhood[ZipCode],dZipNeighborhood[Neighborhood])","v":"Capital Hill"}]
["Weeds","2020-07-13","Completed","Completed","98117",{"$f":"_xlfn.XLOOKUP(--fSeattle2020Complaints[[#This Row],[ZipCode]],dZipNeighborhood[ZipCode],dZipNeighborhood[Neighborhood])","v":"Sunset Hill"}]
["Vacant Building","2020-07-06","Completed","Completed","98104",{"$f":"_xlfn.XLOOKUP(--fSeattle2020Complaints[[#This Row],[ZipCode]],dZipNeighborhood[ZipCode],dZipNeighborhood[Neighborhood])","v":"International District"}]
["Land Use","2020-01-24","Completed","Completed","98105",{"$f":"_xlfn.XLOOKUP(--fSeattle2020Complaints[[#This Row],[ZipCode]],dZipNeighborhood[ZipCode],dZipNeighborhood[Neighborhood])","v":"University District"}]
["Land Use","2020-07-28","Completed","Completed","98108",{"$f":"_xlfn.XLOOKUP(--fSeattle2020Complaints[[#This Row],[ZipCode]],dZipNeighborhood[ZipCode],dZipNeighborhood[Neighborhood])","v":"Rainer Valley"}]
["Construction","2020-05-13","Completed","NOV Issued","98133",{"$f":"_xlfn.XLOOKUP(--fSeattle2020Complaints[[#This Row],[ZipCode]],dZipNeighborhood[ZipCode],dZipNeighborhood[Neighborhood])","v":"Shoreline"}]
["Weeds","2020-05-29","Completed","Completed","98122",{"$f":"_xlfn.XLOOKUP(--fSeattle2020Complaints[[#This Row],[ZipCode]],dZipNeighborhood[ZipCode],dZipNeighborhood[Neighborhood])","v":"Minor, Central Area"}]
["Land Use","2020-09-08","Completed","Completed","98117",{"$f":"_xlfn.XLOOKUP(--fSeattle2020Complaints[[#This Row],[ZipCode]],dZipNeighborhood[ZipCode],dZipNeighborhood[Neighborhood])","v":"Sunset Hill"}]
["Weeds","2020-06-01","Completed","Completed","98119",{"$f":"_xlfn.XLOOKUP(--fSeattle2020Complaints[[#This Row],[ZipCode]],dZipNeighborhood[ZipCode],dZipNeighborhood[Neighborhood])","v":"Queen Anne"}]
["Land Use","2020-01-03","Completed","Completed","98118",{"$f":"_xlfn.XLOOKUP(--fSeattle2020Complaints[[#This Row],[ZipCode]],dZipNeighborhood[ZipCode],dZipNeighborhood[Neighborhood])","v":"Columbia City"}]
["Land Use","2020-03-24","Completed","Completed","98106",{"$f":"_xlfn.XLOOKUP(--fSeattle2020Complaints[[#This Row],[ZipCode]],dZipNeighborhood[ZipCode],dZipNeighborhood[Neighborhood])","v":"Delridge"}]
["Land Use","2020-02-19","Completed","Initiated","98103",{"$f":"_xlfn.XLOOKUP(--fSeattle2020Complaints[[#This Row],[ZipCode]],dZipNeighborhood[ZipCode],dZipNeighborhood[Neighborhood])","v":"Greenwood"}]
["Tree","2020-01-22","Completed","Completed","98126",{"$f":"_xlfn.XLOOKUP(--fSeattle2020Complaints[[#This Row],[ZipCode]],dZipNeighborhood[ZipCode],dZipNeighborhood[Neighborhood])","v":"High Point"}]
["Construction","2020-10-09","Completed","Under Investigation","98133",{"$f":"_xlfn.XLOOKUP(--fSeattle2020Complaints[[#This Row],[ZipCode]],dZipNeighborhood[ZipCode],dZipNeighborhood[Neighborhood])","v":"Shoreline"}]
["Weeds","2020-02-21","Compliance Achieved","Completed","98103",{"$f":"_xlfn.XLOOKUP(--fSeattle2020Complaints[[#This Row],[ZipCode]],dZipNeighborhood[ZipCode],dZipNeighborhood[Neighborhood])","v":"Greenwood"}]
["Land Use","2020-12-17","Completed","Completed","98119",{"$f":"_xlfn.XLOOKUP(--fSeattle2020Complaints[[#This Row],[ZipCode]],dZipNeighborhood[ZipCode],dZipNeighborhood[Neighborhood])","v":"Queen Anne"}]
["Weeds","2020-02-04","Compliance Achieved","Completed","98122",{"$f":"_xlfn.XLOOKUP(--fSeattle2020Complaints[[#This Row],[ZipCode]],dZipNeighborhood[ZipCode],dZipNeighborhood[Neighborhood])","v":"Minor, Central Area"}]
["Land Use","2020-02-04","Completed","Completed","98118",{"$f":"_xlfn.XLOOKUP(--fSeattle2020Complaints[[#This Row],[ZipCode]],dZipNeighborhood[ZipCode],dZipNeighborhood[Neighborhood])","v":"Columbia City"}]
["Land Use","2020-08-13","Completed","Completed","98103",{"$f":"_xlfn.XLOOKUP(--fSeattle2020Complaints[[#This Row],[ZipCode]],dZipNeighborhood[ZipCode],dZipNeighborhood[Neighborhood])","v":"Greenwood"}]
["Tree","2020-06-17","Completed","Completed","98136",{"$f":"_xlfn.XLOOKUP(--fSeattle2020Complaints[[#This Row],[ZipCode]],dZipNeighborhood[ZipCode],dZipNeighborhood[Neighborhood])","v":"Seaview"}]
["Weeds","2020-02-26","Completed","Warning","98177",{"$f":"_xlfn.XLOOKUP(--fSeattle2020Complaints[[#This Row],[ZipCode]],dZipNeighborhood[ZipCode],dZipNeighborhood[Neighborhood])","v":"Richmond Beach"}]
["Construction","2020-07-07","Completed","Completed","98144",{"$f":"_xlfn.XLOOKUP(--fSeattle2020Complaints[[#This Row],[ZipCode]],dZipNeighborhood[ZipCode],dZipNeighborhood[Neighborhood])","v":"Mount Baker"}]
["Construction","2020-08-28","Completed","Completed","98125",{"$f":"_xlfn.XLOOKUP(--fSeattle2020Complaints[[#This Row],[ZipCode]],dZipNeighborhood[ZipCode],dZipNeighborhood[Neighborhood])","v":"Northgate"}]
["Construction","2020-12-02","Completed","Under Investigation","98115",{"$f":"_xlfn.XLOOKUP(--fSeattle2020Complaints[[#This Row],[ZipCode]],dZipNeighborhood[ZipCode],dZipNeighborhood[Neighborhood])","v":"Greenlake"}]
["Emergency , Vacant Building","2020-04-27","Completed","Closed","98119",{"$f":"_xlfn.XLOOKUP(--fSeattle2020Complaints[[#This Row],[ZipCode]],dZipNeighborhood[ZipCode],dZipNeighborhood[Neighborhood])","v":"Queen Anne"}]
["Land Use","2020-10-14","Completed","Completed","98102",{"$f":"_xlfn.XLOOKUP(--fSeattle2020Complaints[[#This Row],[ZipCode]],dZipNeighborhood[ZipCode],dZipNeighborhood[Neighborhood])","v":"Capital Hill"}]
["Construction","2020-12-16","Completed","Completed","98122",{"$f":"_xlfn.XLOOKUP(--fSeattle2020Complaints[[#This Row],[ZipCode]],dZipNeighborhood[ZipCode],dZipNeighborhood[Neighborhood])","v":"Minor, Central Area"}]
["Construction","2020-02-17","Completed","Completed","98108",{"$f":"_xlfn.XLOOKUP(--fSeattle2020Complaints[[#This Row],[ZipCode]],dZipNeighborhood[ZipCode],dZipNeighborhood[Neighborhood])","v":"Rainer Valley"}]
["Land Use","2020-11-23","Completed","Completed","98118",{"$f":"_xlfn.XLOOKUP(--fSeattle2020Complaints[[#This Row],[ZipCode]],dZipNeighborhood[ZipCode],dZipNeighborhood[Neighborhood])","v":"Columbia City"}]
["Weeds","2020-08-21","No Access/Unable to Observe","Completed","98118",{"$f":"_xlfn.XLOOKUP(--fSeattle2020Complaints[[#This Row],[ZipCode]],dZipNeighborhood[ZipCode],dZipNeighborhood[Neighborhood])","v":"Columbia City"}]
["Land Use","2020-06-30","Completed","Completed","98107",{"$f":"_xlfn.XLOOKUP(--fSeattle2020Complaints[[#This Row],[ZipCode]],dZipNeighborhood[ZipCode],dZipNeighborhood[Neighborhood])","v":"Ballard"}]
["Vacant Building","2020-06-17","Completed","Completed","98122",{"$f":"_xlfn.XLOOKUP(--fSeattle2020Complaints[[#This Row],[ZipCode]],dZipNeighborhood[ZipCode],dZipNeighborhood[Neighborhood])","v":"Minor, Central Area"}]
["Construction","2020-04-03","Completed","Completed","98125",{"$f":"_xlfn.XLOOKUP(--fSeattle2020Complaints[[#This Row],[ZipCode]],dZipNeighborhood[ZipCode],dZipNeighborhood[Neighborhood])","v":"Northgate"}]
["Land Use","2020-03-10","Completed","Initiated","98116",{"$f":"_xlfn.XLOOKUP(--fSeattle2020Complaints[[#This Row],[ZipCode]],dZipNeighborhood[ZipCode],dZipNeighborhood[Neighborhood])","v":"West Seattle"}]
["Weeds","2020-06-15","Completed","Completed","98136",{"$f":"_xlfn.XLOOKUP(--fSeattle2020Complaints[[#This Row],[ZipCode]],dZipNeighborhood[ZipCode],dZipNeighborhood[Neighborhood])","v":"Seaview"}]
["Land Use","2020-09-10","Completed","Completed","98103",{"$f":"_xlfn.XLOOKUP(--fSeattle2020Complaints[[#This Row],[ZipCode]],dZipNeighborhood[ZipCode],dZipNeighborhood[Neighborhood])","v":"Greenwood"}]
["Construction","2020-07-20","Completed","Completed","98103",{"$f":"_xlfn.XLOOKUP(--fSeattle2020Complaints[[#This Row],[ZipCode]],dZipNeighborhood[ZipCode],dZipNeighborhood[Neighborhood])","v":"Greenwood"}]
["Land Use","2020-07-10","Compliance Achieved","Completed","98105",{"$f":"_xlfn.XLOOKUP(--fSeattle2020Complaints[[#This Row],[ZipCode]],dZipNeighborhood[ZipCode],dZipNeighborhood[Neighborhood])","v":"University District"}]
["Land Use","2020-06-16","Completed","Completed","98108",{"$f":"_xlfn.XLOOKUP(--fSeattle2020Complaints[[#This Row],[ZipCode]],dZipNeighborhood[ZipCode],dZipNeighborhood[Neighborhood])","v":"Rainer Valley"}]
["Weeds","2020-07-27","Completed","Completed","98103",{"$f":"_xlfn.XLOOKUP(--fSeattle2020Complaints[[#This Row],[ZipCode]],dZipNeighborhood[ZipCode],dZipNeighborhood[Neighborhood])","v":"Greenwood"}]
["Land Use","2020-02-04","Completed","Completed","98125",{"$f":"_xlfn.XLOOKUP(--fSeattle2020Complaints[[#This Row],[ZipCode]],dZipNeighborhood[ZipCode],dZipNeighborhood[Neighborhood])","v":"Northgate"}]
["Weeds","2020-01-27","Completed","Completed","98108",{"$f":"_xlfn.XLOOKUP(--fSeattle2020Complaints[[#This Row],[ZipCode]],dZipNeighborhood[ZipCode],dZipNeighborhood[Neighborhood])","v":"Rainer Valley"}]
["Weeds","2020-06-05","Completed","Completed","98144",{"$f":"_xlfn.XLOOKUP(--fSeattle2020Complaints[[#This Row],[ZipCode]],dZipNeighborhood[ZipCode],dZipNeighborhood[Neighborhood])","v":"Mount Baker"}]
["Land Use","2020-09-18","Completed","Completed","98144",{"$f":"_xlfn.XLOOKUP(--fSeattle2020Complaints[[#This Row],[ZipCode]],dZipNeighborhood[ZipCode],dZipNeighborhood[Neighborhood])","v":"Mount Baker"}]
["Vacant Building","2020-02-10","Completed","Completed","98122",{"$f":"_xlfn.XLOOKUP(--fSeattle2020Complaints[[#This Row],[ZipCode]],dZipNeighborhood[ZipCode],dZipNeighborhood[Neighborhood])","v":"Minor, Central Area"}]
["Land Use","2020-09-02","Completed","Completed","98118",{"$f":"_xlfn.XLOOKUP(--fSeattle2020Complaints[[#This Row],[ZipCode]],dZipNeighborhood[ZipCode],dZipNeighborhood[Neighborhood])","v":"Columbia City"}]
["Weeds","2020-08-09","Completed","Completed","98106",{"$f":"_xlfn.XLOOKUP(--fSeattle2020Complaints[[#This Row],[ZipCode]],dZipNeighborhood[ZipCode],dZipNeighborhood[Neighborhood])","v":"Delridge"}]
["Emergency , Vacant Building","2020-05-12","Completed","Completed","98105",{"$f":"_xlfn.XLOOKUP(--fSeattle2020Complaints[[#This Row],[ZipCode]],dZipNeighborhood[ZipCode],dZipNeighborhood[Neighborhood])","v":"University District"}]
["Weeds","2020-02-10","Completed","Completed","98108",{"$f":"_xlfn.XLOOKUP(--fSeattle2020Complaints[[#This Row],[ZipCode]],dZipNeighborhood[ZipCode],dZipNeighborhood[Neighborhood])","v":"Rainer Valley"}]
["Land Use","2020-06-20","Completed","Completed","98118",{"$f":"_xlfn.XLOOKUP(--fSeattle2020Complaints[[#This Row],[ZipCode]],dZipNeighborhood[ZipCode],dZipNeighborhood[Neighborhood])","v":"Columbia City"}]
["Weeds","2020-04-28","Completed","Closed","98118",{"$f":"_xlfn.XLOOKUP(--fSeattle2020Complaints[[#This Row],[ZipCode]],dZipNeighborhood[ZipCode],dZipNeighborhood[Neighborhood])","v":"Columbia City"}]
["Weeds","2020-02-27","Completed","Completed","98115",{"$f":"_xlfn.XLOOKUP(--fSeattle2020Complaints[[#This Row],[ZipCode]],dZipNeighborhood[ZipCode],dZipNeighborhood[Neighborhood])","v":"Greenlake"}]
["Land Use","2020-02-19","Compliance Achieved","Completed","98125",{"$f":"_xlfn.XLOOKUP(--fSeattle2020Complaints[[#This Row],[ZipCode]],dZipNeighborhood[ZipCode],dZipNeighborhood[Neighborhood])","v":"Northgate"}]
["Land Use","2020-08-07","Completed","Closed","98126",{"$f":"_xlfn.XLOOKUP(--fSeattle2020Complaints[[#This Row],[ZipCode]],dZipNeighborhood[ZipCode],dZipNeighborhood[Neighborhood])","v":"High Point"}]
["Weeds","2020-10-09","Completed","Completed","98103",{"$f":"_xlfn.XLOOKUP(--fSeattle2020Complaints[[#This Row],[ZipCode]],dZipNeighborhood[ZipCode],dZipNeighborhood[Neighborhood])","v":"Greenwood"}]
["Emergency , Vacant Building","2020-05-22","Completed","Completed","98144",{"$f":"_xlfn.XLOOKUP(--fSeattle2020Complaints[[#This Row],[ZipCode]],dZipNeighborhood[ZipCode],dZipNeighborhood[Neighborhood])","v":"Mount Baker"}]
["Land Use","2020-06-29","Completed","Completed","98119",{"$f":"_xlfn.XLOOKUP(--fSeattle2020Complaints[[#This Row],[ZipCode]],dZipNeighborhood[ZipCode],dZipNeighborhood[Neighborhood])","v":"Queen Anne"}]
["Land Use","2020-01-06","Completed","Completed","98115",{"$f":"_xlfn.XLOOKUP(--fSeattle2020Complaints[[#This Row],[ZipCode]],dZipNeighborhood[ZipCode],dZipNeighborhood[Neighborhood])","v":"Greenlake"}]
["LandLord/Tenant","2020-07-24","Completed","Under Investigation","98122",{"$f":"_xlfn.XLOOKUP(--fSeattle2020Complaints[[#This Row],[ZipCode]],dZipNeighborhood[ZipCode],dZipNeighborhood[Neighborhood])","v":"Minor, Central Area"}]
["Weeds","2020-05-14","Completed","Completed","98112",{"$f":"_xlfn.XLOOKUP(--fSeattle2020Complaints[[#This Row],[ZipCode]],dZipNeighborhood[ZipCode],dZipNeighborhood[Neighborhood])","v":"Madison Park"}]
["Construction","2020-03-11","Completed","Completed","98122",{"$f":"_xlfn.XLOOKUP(--fSeattle2020Complaints[[#This Row],[ZipCode]],dZipNeighborhood[ZipCode],dZipNeighborhood[Neighborhood])","v":"Minor, Central Area"}]
["Land Use","2020-06-11","Completed","Completed","98118",{"$f":"_xlfn.XLOOKUP(--fSeattle2020Complaints[[#This Row],[ZipCode]],dZipNeighborhood[ZipCode],dZipNeighborhood[Neighborhood])","v":"Columbia City"}]
["Construction","2020-01-19","Completed","Completed","98125",{"$f":"_xlfn.XLOOKUP(--fSeattle2020Complaints[[#This Row],[ZipCode]],dZipNeighborhood[ZipCode],dZipNeighborhood[Neighborhood])","v":"Northgate"}]
["LandLord/Tenant","2020-02-06","Completed","Completed","98122",{"$f":"_xlfn.XLOOKUP(--fSeattle2020Complaints[[#This Row],[ZipCode]],dZipNeighborhood[ZipCode],dZipNeighborhood[Neighborhood])","v":"Minor, Central Area"}]
["Land Use","2020-10-11","Completed","Completed","98122",{"$f":"_xlfn.XLOOKUP(--fSeattle2020Complaints[[#This Row],[ZipCode]],dZipNeighborhood[ZipCode],dZipNeighborhood[Neighborhood])","v":"Minor, Central Area"}]
["Land Use","2020-07-10","Completed","Completed","98102",{"$f":"_xlfn.XLOOKUP(--fSeattle2020Complaints[[#This Row],[ZipCode]],dZipNeighborhood[ZipCode],dZipNeighborhood[Neighborhood])","v":"Capital Hill"}]
["Construction , Tree","2020-10-22","Completed","Closed","98112",{"$f":"_xlfn.XLOOKUP(--fSeattle2020Complaints[[#This Row],[ZipCode]],dZipNeighborhood[ZipCode],dZipNeighborhood[Neighborhood])","v":"Madison Park"}]
["Weeds","2020-06-29","Completed","Completed","98103",{"$f":"_xlfn.XLOOKUP(--fSeattle2020Complaints[[#This Row],[ZipCode]],dZipNeighborhood[ZipCode],dZipNeighborhood[Neighborhood])","v":"Greenwood"}]
["Vacant Building","2020-07-07","Completed","Completed","98144",{"$f":"_xlfn.XLOOKUP(--fSeattle2020Complaints[[#This Row],[ZipCode]],dZipNeighborhood[ZipCode],dZipNeighborhood[Neighborhood])","v":"Mount Baker"}]
["Weeds","2020-05-02","Completed","Completed","98144",{"$f":"_xlfn.XLOOKUP(--fSeattle2020Complaints[[#This Row],[ZipCode]],dZipNeighborhood[ZipCode],dZipNeighborhood[Neighborhood])","v":"Mount Baker"}]
["Weeds","2020-07-17","Completed","Completed","98109",{"$f":"_xlfn.XLOOKUP(--fSeattle2020Complaints[[#This Row],[ZipCode]],dZipNeighborhood[ZipCode],dZipNeighborhood[Neighborhood])","v":"South Lake Union"}]
["Land UseConstruction ,","2020-08-12","Completed","Completed","98178",{"$f":"_xlfn.XLOOKUP(--fSeattle2020Complaints[[#This Row],[ZipCode]],dZipNeighborhood[ZipCode],dZipNeighborhood[Neighborhood])","v":"Skyway"}]
["Land Use","2020-07-10","Completed","Completed","98108",{"$f":"_xlfn.XLOOKUP(--fSeattle2020Complaints[[#This Row],[ZipCode]],dZipNeighborhood[ZipCode],dZipNeighborhood[Neighborhood])","v":"Rainer Valley"}]
["Emergency , Vacant Building","2020-01-23","Completed","Closed","98122",{"$f":"_xlfn.XLOOKUP(--fSeattle2020Complaints[[#This Row],[ZipCode]],dZipNeighborhood[ZipCode],dZipNeighborhood[Neighborhood])","v":"Minor, Central Area"}]
["Land Use","2020-05-04","Completed","Completed","98122",{"$f":"_xlfn.XLOOKUP(--fSeattle2020Complaints[[#This Row],[ZipCode]],dZipNeighborhood[ZipCode],dZipNeighborhood[Neighborhood])","v":"Minor, Central Area"}]
["LandLord/Tenant","2020-08-12","Completed","Completed","98121",{"$f":"_xlfn.XLOOKUP(--fSeattle2020Complaints[[#This Row],[ZipCode]],dZipNeighborhood[ZipCode],dZipNeighborhood[Neighborhood])","v":"Belltown"}]
["Weeds","2020-06-29","Completed","Completed","98119",{"$f":"_xlfn.XLOOKUP(--fSeattle2020Complaints[[#This Row],[ZipCode]],dZipNeighborhood[ZipCode],dZipNeighborhood[Neighborhood])","v":"Queen Anne"}]
["Weeds","2020-07-07","Completed","Completed","98118",{"$f":"_xlfn.XLOOKUP(--fSeattle2020Complaints[[#This Row],[ZipCode]],dZipNeighborhood[ZipCode],dZipNeighborhood[Neighborhood])","v":"Columbia City"}]
["Construction","2020-02-26","Completed","Completed","98199",{"$f":"_xlfn.XLOOKUP(--fSeattle2020Complaints[[#This Row],[ZipCode]],dZipNeighborhood[ZipCode],dZipNeighborhood[Neighborhood])","v":"Magnolia"}]
["Weeds","2020-07-13","Compliance Achieved","Completed","98122",{"$f":"_xlfn.XLOOKUP(--fSeattle2020Complaints[[#This Row],[ZipCode]],dZipNeighborhood[ZipCode],dZipNeighborhood[Neighborhood])","v":"Minor, Central Area"}]
["Land Use","2020-08-31","Completed","Completed","98118",{"$f":"_xlfn.XLOOKUP(--fSeattle2020Complaints[[#This Row],[ZipCode]],dZipNeighborhood[ZipCode],dZipNeighborhood[Neighborhood])","v":"Columbia City"}]
["Weeds","2020-04-06","Compliance Achieved","Completed","98118",{"$f":"_xlfn.XLOOKUP(--fSeattle2020Complaints[[#This Row],[ZipCode]],dZipNeighborhood[ZipCode],dZipNeighborhood[Neighborhood])","v":"Columbia City"}]
["Land Use","2020-04-05","Completed","Completed","98116",{"$f":"_xlfn.XLOOKUP(--fSeattle2020Complaints[[#This Row],[ZipCode]],dZipNeighborhood[ZipCode],dZipNeighborhood[Neighborhood])","v":"West Seattle"}]
["Construction","2020-10-16","Completed","Completed","98177",{"$f":"_xlfn.XLOOKUP(--fSeattle2020Complaints[[#This Row],[ZipCode]],dZipNeighborhood[ZipCode],dZipNeighborhood[Neighborhood])","v":"Richmond Beach"}]
["Weeds","2020-02-27","Compliance Achieved","Completed","98199",{"$f":"_xlfn.XLOOKUP(--fSeattle2020Complaints[[#This Row],[ZipCode]],dZipNeighborhood[ZipCode],dZipNeighborhood[Neighborhood])","v":"Magnolia"}]
["Weeds","2020-07-01","Completed","Completed","98105",{"$f":"_xlfn.XLOOKUP(--fSeattle2020Complaints[[#This Row],[ZipCode]],dZipNeighborhood[ZipCode],dZipNeighborhood[Neighborhood])","v":"University District"}]
["Land Use","2020-07-01","Completed","Completed","98117",{"$f":"_xlfn.XLOOKUP(--fSeattle2020Complaints[[#This Row],[ZipCode]],dZipNeighborhood[ZipCode],dZipNeighborhood[Neighborhood])","v":"Sunset Hill"}]
["Land UseWeeds ,","2020-07-01","Compliance Achieved","Completed","98146",{"$f":"_xlfn.XLOOKUP(--fSeattle2020Complaints[[#This Row],[ZipCode]],dZipNeighborhood[ZipCode],dZipNeighborhood[Neighborhood])","v":"Shorewood, White Center"}]
["Construction","2020-01-08","Completed","Completed","98112",{"$f":"_xlfn.XLOOKUP(--fSeattle2020Complaints[[#This Row],[ZipCode]],dZipNeighborhood[ZipCode],dZipNeighborhood[Neighborhood])","v":"Madison Park"}]
["Construction","2020-01-08","Completed","Completed","98105",{"$f":"_xlfn.XLOOKUP(--fSeattle2020Complaints[[#This Row],[ZipCode]],dZipNeighborhood[ZipCode],dZipNeighborhood[Neighborhood])","v":"University District"}]
["Land Use","2020-11-02","Completed","Completed","98105",{"$f":"_xlfn.XLOOKUP(--fSeattle2020Complaints[[#This Row],[ZipCode]],dZipNeighborhood[ZipCode],dZipNeighborhood[Neighborhood])","v":"University District"}]
["Construction","2020-06-30","Completed","Closed","98102",{"$f":"_xlfn.XLOOKUP(--fSeattle2020Complaints[[#This Row],[ZipCode]],dZipNeighborhood[ZipCode],dZipNeighborhood[Neighborhood])","v":"Capital Hill"}]
["Construction","2020-12-22","No Access/Unable to Observe","Completed","98126",{"$f":"_xlfn.XLOOKUP(--fSeattle2020Complaints[[#This Row],[ZipCode]],dZipNeighborhood[ZipCode],dZipNeighborhood[Neighborhood])","v":"High Point"}]
["Land Use","2020-04-01","Compliance Achieved","Completed","98118",{"$f":"_xlfn.XLOOKUP(--fSeattle2020Complaints[[#This Row],[ZipCode]],dZipNeighborhood[ZipCode],dZipNeighborhood[Neighborhood])","v":"Columbia City"}]
["Weeds","2020-08-12","Completed","Completed","98105",{"$f":"_xlfn.XLOOKUP(--fSeattle2020Complaints[[#This Row],[ZipCode]],dZipNeighborhood[ZipCode],dZipNeighborhood[Neighborhood])","v":"University District"}]
["Weeds","2020-06-30","Completed","Completed","98103",{"$f":"_xlfn.XLOOKUP(--fSeattle2020Complaints[[#This Row],[ZipCode]],dZipNeighborhood[ZipCode],dZipNeighborhood[Neighborhood])","v":"Greenwood"}]
["Vacant Building","2020-07-08","Secured with No Violations","Closed","98136",{"$f":"_xlfn.XLOOKUP(--fSeattle2020Complaints[[#This Row],[ZipCode]],dZipNeighborhood[ZipCode],dZipNeighborhood[Neighborhood])","v":"Seaview"}]
["Construction","2020-12-16","Completed","Completed","98103",{"$f":"_xlfn.XLOOKUP(--fSeattle2020Complaints[[#This Row],[ZipCode]],dZipNeighborhood[ZipCode],dZipNeighborhood[Neighborhood])","v":"Greenwood"}]
["Vacant Building","2020-05-05","Completed","Completed","98108",{"$f":"_xlfn.XLOOKUP(--fSeattle2020Complaints[[#This Row],[ZipCode]],dZipNeighborhood[ZipCode],dZipNeighborhood[Neighborhood])","v":"Rainer Valley"}]
["Land Use","2020-02-28","Compliance Achieved","Completed","98118",{"$f":"_xlfn.XLOOKUP(--fSeattle2020Complaints[[#This Row],[ZipCode]],dZipNeighborhood[ZipCode],dZipNeighborhood[Neighborhood])","v":"Columbia City"}]
["Land Use","2020-03-11","Withdrawn","Completed","98118",{"$f":"_xlfn.XLOOKUP(--fSeattle2020Complaints[[#This Row],[ZipCode]],dZipNeighborhood[ZipCode],dZipNeighborhood[Neighborhood])","v":"Columbia City"}]
["Weeds","2020-04-13","Completed","Completed","98122",{"$f":"_xlfn.XLOOKUP(--fSeattle2020Complaints[[#This Row],[ZipCode]],dZipNeighborhood[ZipCode],dZipNeighborhood[Neighborhood])","v":"Minor, Central Area"}]
["Land Use","2020-05-09","Completed","Completed","98105",{"$f":"_xlfn.XLOOKUP(--fSeattle2020Complaints[[#This Row],[ZipCode]],dZipNeighborhood[ZipCode],dZipNeighborhood[Neighborhood])","v":"University District"}]
["Emergency , Vacant Building","2020-01-23","Completed","Completed","98107",{"$f":"_xlfn.XLOOKUP(--fSeattle2020Complaints[[#This Row],[ZipCode]],dZipNeighborhood[ZipCode],dZipNeighborhood[Neighborhood])","v":"Ballard"}]
["Vacant Building","2020-05-09","Completed","Completed","98122",{"$f":"_xlfn.XLOOKUP(--fSeattle2020Complaints[[#This Row],[ZipCode]],dZipNeighborhood[ZipCode],dZipNeighborhood[Neighborhood])","v":"Minor, Central Area"}]
["Land Use","2020-12-14","Completed","Completed","98106",{"$f":"_xlfn.XLOOKUP(--fSeattle2020Complaints[[#This Row],[ZipCode]],dZipNeighborhood[ZipCode],dZipNeighborhood[Neighborhood])","v":"Delridge"}]
["Construction","2020-03-25","Completed","Completed","98102",{"$f":"_xlfn.XLOOKUP(--fSeattle2020Complaints[[#This Row],[ZipCode]],dZipNeighborhood[ZipCode],dZipNeighborhood[Neighborhood])","v":"Capital Hill"}]
["Land Use","2020-04-10","Completed","Completed","98106",{"$f":"_xlfn.XLOOKUP(--fSeattle2020Complaints[[#This Row],[ZipCode]],dZipNeighborhood[ZipCode],dZipNeighborhood[Neighborhood])","v":"Delridge"}]
["Land Use","2020-09-19","Completed","Completed","98199",{"$f":"_xlfn.XLOOKUP(--fSeattle2020Complaints[[#This Row],[ZipCode]],dZipNeighborhood[ZipCode],dZipNeighborhood[Neighborhood])","v":"Magnolia"}]
["Land Use","2020-08-24","Completed","Completed","98136",{"$f":"_xlfn.XLOOKUP(--fSeattle2020Complaints[[#This Row],[ZipCode]],dZipNeighborhood[ZipCode],dZipNeighborhood[Neighborhood])","v":"Seaview"}]
["Land Use","2020-01-21","Completed","Completed","98125",{"$f":"_xlfn.XLOOKUP(--fSeattle2020Complaints[[#This Row],[ZipCode]],dZipNeighborhood[ZipCode],dZipNeighborhood[Neighborhood])","v":"Northgate"}]
["Land Use","2020-09-18","Completed","Completed","98118",{"$f":"_xlfn.XLOOKUP(--fSeattle2020Complaints[[#This Row],[ZipCode]],dZipNeighborhood[ZipCode],dZipNeighborhood[Neighborhood])","v":"Columbia City"}]
["Emergency , Vacant Building","2020-02-27","Completed","Completed","98118",{"$f":"_xlfn.XLOOKUP(--fSeattle2020Complaints[[#This Row],[ZipCode]],dZipNeighborhood[ZipCode],dZipNeighborhood[Neighborhood])","v":"Columbia City"}]
["Land Use","2020-01-03","Completed","NOV Issued","98118",{"$f":"_xlfn.XLOOKUP(--fSeattle2020Complaints[[#This Row],[ZipCode]],dZipNeighborhood[ZipCode],dZipNeighborhood[Neighborhood])","v":"Columbia City"}]
["Construction","2020-04-21","Completed","NOV Issued","98118",{"$f":"_xlfn.XLOOKUP(--fSeattle2020Complaints[[#This Row],[ZipCode]],dZipNeighborhood[ZipCode],dZipNeighborhood[Neighborhood])","v":"Columbia City"}]
["ECA , Tree","2020-08-03","Completed","Completed","98136",{"$f":"_xlfn.XLOOKUP(--fSeattle2020Complaints[[#This Row],[ZipCode]],dZipNeighborhood[ZipCode],dZipNeighborhood[Neighborhood])","v":"Seaview"}]
["Weeds","2020-09-24","Completed","Completed","98102",{"$f":"_xlfn.XLOOKUP(--fSeattle2020Complaints[[#This Row],[ZipCode]],dZipNeighborhood[ZipCode],dZipNeighborhood[Neighborhood])","v":"Capital Hill"}]
["Weeds","2020-07-12","Completed","Completed","98125",{"$f":"_xlfn.XLOOKUP(--fSeattle2020Complaints[[#This Row],[ZipCode]],dZipNeighborhood[ZipCode],dZipNeighborhood[Neighborhood])","v":"Northgate"}]
["Weeds","2020-07-02","Compliance Achieved","Completed","98136",{"$f":"_xlfn.XLOOKUP(--fSeattle2020Complaints[[#This Row],[ZipCode]],dZipNeighborhood[ZipCode],dZipNeighborhood[Neighborhood])","v":"Seaview"}]
["Construction","2020-10-16","Completed","Completed","98133",{"$f":"_xlfn.XLOOKUP(--fSeattle2020Complaints[[#This Row],[ZipCode]],dZipNeighborhood[ZipCode],dZipNeighborhood[Neighborhood])","v":"Shoreline"}]
["Weeds","2020-06-03","Completed","Completed","98103",{"$f":"_xlfn.XLOOKUP(--fSeattle2020Complaints[[#This Row],[ZipCode]],dZipNeighborhood[ZipCode],dZipNeighborhood[Neighborhood])","v":"Greenwood"}]
["Weeds","2020-07-16","Completed","Completed","98115",{"$f":"_xlfn.XLOOKUP(--fSeattle2020Complaints[[#This Row],[ZipCode]],dZipNeighborhood[ZipCode],dZipNeighborhood[Neighborhood])","v":"Greenlake"}]
["Land Use","2020-08-11","Completed","Completed","98107",{"$f":"_xlfn.XLOOKUP(--fSeattle2020Complaints[[#This Row],[ZipCode]],dZipNeighborhood[ZipCode],dZipNeighborhood[Neighborhood])","v":"Ballard"}]
["Weeds","2020-01-24","Completed","Completed","98105",{"$f":"_xlfn.XLOOKUP(--fSeattle2020Complaints[[#This Row],[ZipCode]],dZipNeighborhood[ZipCode],dZipNeighborhood[Neighborhood])","v":"University District"}]
["Construction","2020-07-17","Completed","Closed","98118",{"$f":"_xlfn.XLOOKUP(--fSeattle2020Complaints[[#This Row],[ZipCode]],dZipNeighborhood[ZipCode],dZipNeighborhood[Neighborhood])","v":"Columbia City"}]
["Land Use","2020-04-07","Completed","Completed","98106",{"$f":"_xlfn.XLOOKUP(--fSeattle2020Complaints[[#This Row],[ZipCode]],dZipNeighborhood[ZipCode],dZipNeighborhood[Neighborhood])","v":"Delridge"}]
["Weeds","2020-07-06","Compliance Achieved","Completed","98126",{"$f":"_xlfn.XLOOKUP(--fSeattle2020Complaints[[#This Row],[ZipCode]],dZipNeighborhood[ZipCode],dZipNeighborhood[Neighborhood])","v":"High Point"}]
["Construction","2020-05-27","Completed","Closed","98107",{"$f":"_xlfn.XLOOKUP(--fSeattle2020Complaints[[#This Row],[ZipCode]],dZipNeighborhood[ZipCode],dZipNeighborhood[Neighborhood])","v":"Ballard"}]
["Noise","2020-11-21","Completed","Completed","98125",{"$f":"_xlfn.XLOOKUP(--fSeattle2020Complaints[[#This Row],[ZipCode]],dZipNeighborhood[ZipCode],dZipNeighborhood[Neighborhood])","v":"Northgate"}]
["Land Use","2020-09-29","Completed","Completed","98105",{"$f":"_xlfn.XLOOKUP(--fSeattle2020Complaints[[#This Row],[ZipCode]],dZipNeighborhood[ZipCode],dZipNeighborhood[Neighborhood])","v":"University District"}]
["Land Use","2020-03-11","Completed","Completed","98118",{"$f":"_xlfn.XLOOKUP(--fSeattle2020Complaints[[#This Row],[ZipCode]],dZipNeighborhood[ZipCode],dZipNeighborhood[Neighborhood])","v":"Columbia City"}]
["Land Use","2020-07-28","Completed","Completed","98105",{"$f":"_xlfn.XLOOKUP(--fSeattle2020Complaints[[#This Row],[ZipCode]],dZipNeighborhood[ZipCode],dZipNeighborhood[Neighborhood])","v":"University District"}]
["Land Use","2020-10-11","Completed","Completed","98122",{"$f":"_xlfn.XLOOKUP(--fSeattle2020Complaints[[#This Row],[ZipCode]],dZipNeighborhood[ZipCode],dZipNeighborhood[Neighborhood])","v":"Minor, Central Area"}]
["Land Use","2020-06-17","Completed","Completed","98103",{"$f":"_xlfn.XLOOKUP(--fSeattle2020Complaints[[#This Row],[ZipCode]],dZipNeighborhood[ZipCode],dZipNeighborhood[Neighborhood])","v":"Greenwood"}]
["Construction","2020-12-16","Completed","Completed","98117",{"$f":"_xlfn.XLOOKUP(--fSeattle2020Complaints[[#This Row],[ZipCode]],dZipNeighborhood[ZipCode],dZipNeighborhood[Neighborhood])","v":"Sunset Hill"}]
["Construction","2020-07-08","Completed","Under Investigation","98122",{"$f":"_xlfn.XLOOKUP(--fSeattle2020Complaints[[#This Row],[ZipCode]],dZipNeighborhood[ZipCode],dZipNeighborhood[Neighborhood])","v":"Minor, Central Area"}]
["Weeds","2020-02-20","Completed","Completed","98119",{"$f":"_xlfn.XLOOKUP(--fSeattle2020Complaints[[#This Row],[ZipCode]],dZipNeighborhood[ZipCode],dZipNeighborhood[Neighborhood])","v":"Queen Anne"}]
["Construction","2020-03-10","Completed","Initiated","98136",{"$f":"_xlfn.XLOOKUP(--fSeattle2020Complaints[[#This Row],[ZipCode]],dZipNeighborhood[ZipCode],dZipNeighborhood[Neighborhood])","v":"Seaview"}]
["Land Use","2020-11-02","Completed","Completed","98144",{"$f":"_xlfn.XLOOKUP(--fSeattle2020Complaints[[#This Row],[ZipCode]],dZipNeighborhood[ZipCode],dZipNeighborhood[Neighborhood])","v":"Mount Baker"}]
["Shoreline","2020-04-28","No Access/Unable to Observe","Completed","98118",{"$f":"_xlfn.XLOOKUP(--fSeattle2020Complaints[[#This Row],[ZipCode]],dZipNeighborhood[ZipCode],dZipNeighborhood[Neighborhood])","v":"Columbia City"}]
["Construction","2020-01-09","Completed","Completed","98125",{"$f":"_xlfn.XLOOKUP(--fSeattle2020Complaints[[#This Row],[ZipCode]],dZipNeighborhood[ZipCode],dZipNeighborhood[Neighborhood])","v":"Northgate"}]
["Land Use","2020-08-10","Completed","Completed","98108",{"$f":"_xlfn.XLOOKUP(--fSeattle2020Complaints[[#This Row],[ZipCode]],dZipNeighborhood[ZipCode],dZipNeighborhood[Neighborhood])","v":"Rainer Valley"}]
["Weeds","2020-07-02","Completed","Completed","98125",{"$f":"_xlfn.XLOOKUP(--fSeattle2020Complaints[[#This Row],[ZipCode]],dZipNeighborhood[ZipCode],dZipNeighborhood[Neighborhood])","v":"Northgate"}]
["Land Use","2020-07-07","Completed","Completed","98105",{"$f":"_xlfn.XLOOKUP(--fSeattle2020Complaints[[#This Row],[ZipCode]],dZipNeighborhood[ZipCode],dZipNeighborhood[Neighborhood])","v":"University District"}]
["Land UseVacant Building ,","2020-05-15","Completed","Completed","98106",{"$f":"_xlfn.XLOOKUP(--fSeattle2020Complaints[[#This Row],[ZipCode]],dZipNeighborhood[ZipCode],dZipNeighborhood[Neighborhood])","v":"Delridge"}]
["Construction","2020-06-26","Completed","Completed","98199",{"$f":"_xlfn.XLOOKUP(--fSeattle2020Complaints[[#This Row],[ZipCode]],dZipNeighborhood[ZipCode],dZipNeighborhood[Neighborhood])","v":"Magnolia"}]
["Weeds","2020-02-12","Compliance Achieved","Completed","98102",{"$f":"_xlfn.XLOOKUP(--fSeattle2020Complaints[[#This Row],[ZipCode]],dZipNeighborhood[ZipCode],dZipNeighborhood[Neighborhood])","v":"Capital Hill"}]
["Weeds","2020-06-11","Completed","Completed","98112",{"$f":"_xlfn.XLOOKUP(--fSeattle2020Complaints[[#This Row],[ZipCode]],dZipNeighborhood[ZipCode],dZipNeighborhood[Neighborhood])","v":"Madison Park"}]
["Weeds","2020-04-15","Completed","Completed","98102",{"$f":"_xlfn.XLOOKUP(--fSeattle2020Complaints[[#This Row],[ZipCode]],dZipNeighborhood[ZipCode],dZipNeighborhood[Neighborhood])","v":"Capital Hill"}]
["Weeds","2020-03-11","Completed","Completed","98199",{"$f":"_xlfn.XLOOKUP(--fSeattle2020Complaints[[#This Row],[ZipCode]],dZipNeighborhood[ZipCode],dZipNeighborhood[Neighborhood])","v":"Magnolia"}]
["Weeds","2020-08-20","Completed","Completed","98119",{"$f":"_xlfn.XLOOKUP(--fSeattle2020Complaints[[#This Row],[ZipCode]],dZipNeighborhood[ZipCode],dZipNeighborhood[Neighborhood])","v":"Queen Anne"}]
["Shoreline","2020-10-30","Completed","Warning","98103",{"$f":"_xlfn.XLOOKUP(--fSeattle2020Complaints[[#This Row],[ZipCode]],dZipNeighborhood[ZipCode],dZipNeighborhood[Neighborhood])","v":"Greenwood"}]
["Land Use","2020-10-02","Completed","Completed","98118",{"$f":"_xlfn.XLOOKUP(--fSeattle2020Complaints[[#This Row],[ZipCode]],dZipNeighborhood[ZipCode],dZipNeighborhood[Neighborhood])","v":"Columbia City"}]
["Land UseVacant Building ,","2020-03-10","Completed","Under Investigation","98134",{"$f":"_xlfn.XLOOKUP(--fSeattle2020Complaints[[#This Row],[ZipCode]],dZipNeighborhood[ZipCode],dZipNeighborhood[Neighborhood])","v":"Duwamish"}]
["Tree","2020-01-27","Completed","Warning","98126",{"$f":"_xlfn.XLOOKUP(--fSeattle2020Complaints[[#This Row],[ZipCode]],dZipNeighborhood[ZipCode],dZipNeighborhood[Neighborhood])","v":"High Point"}]
["Weeds","2020-07-27","Completed","Completed","98105",{"$f":"_xlfn.XLOOKUP(--fSeattle2020Complaints[[#This Row],[ZipCode]],dZipNeighborhood[ZipCode],dZipNeighborhood[Neighborhood])","v":"University District"}]
["Construction","2020-06-26","Completed","Completed","98125",{"$f":"_xlfn.XLOOKUP(--fSeattle2020Complaints[[#This Row],[ZipCode]],dZipNeighborhood[ZipCode],dZipNeighborhood[Neighborhood])","v":"Northgate"}]
["Weeds","2020-05-14","Completed","Completed","98106",{"$f":"_xlfn.XLOOKUP(--fSeattle2020Complaints[[#This Row],[ZipCode]],dZipNeighborhood[ZipCode],dZipNeighborhood[Neighborhood])","v":"Delridge"}]
["Weeds","2020-01-21","Completed","Completed","98108",{"$f":"_xlfn.XLOOKUP(--fSeattle2020Complaints[[#This Row],[ZipCode]],dZipNeighborhood[ZipCode],dZipNeighborhood[Neighborhood])","v":"Rainer Valley"}]
["Land Use","2020-05-08","Completed","Completed","98106",{"$f":"_xlfn.XLOOKUP(--fSeattle2020Complaints[[#This Row],[ZipCode]],dZipNeighborhood[ZipCode],dZipNeighborhood[Neighborhood])","v":"Delridge"}]
["Weeds","2020-02-05","Compliance Achieved","Completed","98133",{"$f":"_xlfn.XLOOKUP(--fSeattle2020Complaints[[#This Row],[ZipCode]],dZipNeighborhood[ZipCode],dZipNeighborhood[Neighborhood])","v":"Shoreline"}]
["Land Use","2020-04-03","Completed","Citation Issued","98108",{"$f":"_xlfn.XLOOKUP(--fSeattle2020Complaints[[#This Row],[ZipCode]],dZipNeighborhood[ZipCode],dZipNeighborhood[Neighborhood])","v":"Rainer Valley"}]
["Construction","2020-02-14","Completed","NOV Issued","98118",{"$f":"_xlfn.XLOOKUP(--fSeattle2020Complaints[[#This Row],[ZipCode]],dZipNeighborhood[ZipCode],dZipNeighborhood[Neighborhood])","v":"Columbia City"}]
["Weeds","2020-06-29","Completed","Closed","98117",{"$f":"_xlfn.XLOOKUP(--fSeattle2020Complaints[[#This Row],[ZipCode]],dZipNeighborhood[ZipCode],dZipNeighborhood[Neighborhood])","v":"Sunset Hill"}]
["Construction","2020-11-23","Completed","Under Investigation","98118",{"$f":"_xlfn.XLOOKUP(--fSeattle2020Complaints[[#This Row],[ZipCode]],dZipNeighborhood[ZipCode],dZipNeighborhood[Neighborhood])","v":"Columbia City"}]
["Land Use","2020-08-04","Completed","Completed","98107",{"$f":"_xlfn.XLOOKUP(--fSeattle2020Complaints[[#This Row],[ZipCode]],dZipNeighborhood[ZipCode],dZipNeighborhood[Neighborhood])","v":"Ballard"}]
["Weeds","2020-03-13","Compliance Achieved","Completed","98108",{"$f":"_xlfn.XLOOKUP(--fSeattle2020Complaints[[#This Row],[ZipCode]],dZipNeighborhood[ZipCode],dZipNeighborhood[Neighborhood])","v":"Rainer Valley"}]
["Construction","2020-09-24","Completed","Completed","98103",{"$f":"_xlfn.XLOOKUP(--fSeattle2020Complaints[[#This Row],[ZipCode]],dZipNeighborhood[ZipCode],dZipNeighborhood[Neighborhood])","v":"Greenwood"}]
["Land Use","2020-06-29","Completed","Completed","98105",{"$f":"_xlfn.XLOOKUP(--fSeattle2020Complaints[[#This Row],[ZipCode]],dZipNeighborhood[ZipCode],dZipNeighborhood[Neighborhood])","v":"University District"}]
["Weeds","2020-03-03","Completed","Completed","98118",{"$f":"_xlfn.XLOOKUP(--fSeattle2020Complaints[[#This Row],[ZipCode]],dZipNeighborhood[ZipCode],dZipNeighborhood[Neighborhood])","v":"Columbia City"}]
["Weeds","2020-06-28","Completed","Completed","98105",{"$f":"_xlfn.XLOOKUP(--fSeattle2020Complaints[[#This Row],[ZipCode]],dZipNeighborhood[ZipCode],dZipNeighborhood[Neighborhood])","v":"University District"}]
["Weeds","2020-08-10","Completed","Completed","98122",{"$f":"_xlfn.XLOOKUP(--fSeattle2020Complaints[[#This Row],[ZipCode]],dZipNeighborhood[ZipCode],dZipNeighborhood[Neighborhood])","v":"Minor, Central Area"}]
["Weeds","2020-09-01","Completed","Completed","98108",{"$f":"_xlfn.XLOOKUP(--fSeattle2020Complaints[[#This Row],[ZipCode]],dZipNeighborhood[ZipCode],dZipNeighborhood[Neighborhood])","v":"Rainer Valley"}]
["Emergency , Vacant Building","2020-05-10","Completed","Completed","98122",{"$f":"_xlfn.XLOOKUP(--fSeattle2020Complaints[[#This Row],[ZipCode]],dZipNeighborhood[ZipCode],dZipNeighborhood[Neighborhood])","v":"Minor, Central Area"}]
["Construction","2020-11-23","Completed","Completed","98136",{"$f":"_xlfn.XLOOKUP(--fSeattle2020Complaints[[#This Row],[ZipCode]],dZipNeighborhood[ZipCode],dZipNeighborhood[Neighborhood])","v":"Seaview"}]
["Land UseLandLord/Tenant ,","2020-01-17","No Access/Unable to Observe","Completed","98101",{"$f":"_xlfn.XLOOKUP(--fSeattle2020Complaints[[#This Row],[ZipCode]],dZipNeighborhood[ZipCode],dZipNeighborhood[Neighborhood])","v":"Seattle"}]
["Vacant Building","2020-02-05","Completed","Completed","98118",{"$f":"_xlfn.XLOOKUP(--fSeattle2020Complaints[[#This Row],[ZipCode]],dZipNeighborhood[ZipCode],dZipNeighborhood[Neighborhood])","v":"Columbia City"}]
["Land Use","2020-09-29","Completed","Completed","98125",{"$f":"_xlfn.XLOOKUP(--fSeattle2020Complaints[[#This Row],[ZipCode]],dZipNeighborhood[ZipCode],dZipNeighborhood[Neighborhood])","v":"Northgate"}]
["Land Use","2020-07-14","Completed","Completed","98125",{"$f":"_xlfn.XLOOKUP(--fSeattle2020Complaints[[#This Row],[ZipCode]],dZipNeighborhood[ZipCode],dZipNeighborhood[Neighborhood])","v":"Northgate"}]
["Construction","2020-03-11","Completed","NOV Issued","98133",{"$f":"_xlfn.XLOOKUP(--fSeattle2020Complaints[[#This Row],[ZipCode]],dZipNeighborhood[ZipCode],dZipNeighborhood[Neighborhood])","v":"Shoreline"}]
["Construction","2020-05-13","Completed","Completed","98178",{"$f":"_xlfn.XLOOKUP(--fSeattle2020Complaints[[#This Row],[ZipCode]],dZipNeighborhood[ZipCode],dZipNeighborhood[Neighborhood])","v":"Skyway"}]
["Land Use","2020-09-18","Completed","Completed","98144",{"$f":"_xlfn.XLOOKUP(--fSeattle2020Complaints[[#This Row],[ZipCode]],dZipNeighborhood[ZipCode],dZipNeighborhood[Neighborhood])","v":"Mount Baker"}]
["Weeds","2020-07-20","Completed","Completed","98126",{"$f":"_xlfn.XLOOKUP(--fSeattle2020Complaints[[#This Row],[ZipCode]],dZipNeighborhood[ZipCode],dZipNeighborhood[Neighborhood])","v":"High Point"}]
["Construction","2020-02-21","Completed","Completed","98108",{"$f":"_xlfn.XLOOKUP(--fSeattle2020Complaints[[#This Row],[ZipCode]],dZipNeighborhood[ZipCode],dZipNeighborhood[Neighborhood])","v":"Rainer Valley"}]
["Construction","2020-09-15","Completed","Under Investigation","98144",{"$f":"_xlfn.XLOOKUP(--fSeattle2020Complaints[[#This Row],[ZipCode]],dZipNeighborhood[ZipCode],dZipNeighborhood[Neighborhood])","v":"Mount Baker"}]
["Weeds","2020-02-15","Completed","Completed","98112",{"$f":"_xlfn.XLOOKUP(--fSeattle2020Complaints[[#This Row],[ZipCode]],dZipNeighborhood[ZipCode],dZipNeighborhood[Neighborhood])","v":"Madison Park"}]
["Weeds","2020-07-29","Completed","Completed","98118",{"$f":"_xlfn.XLOOKUP(--fSeattle2020Complaints[[#This Row],[ZipCode]],dZipNeighborhood[ZipCode],dZipNeighborhood[Neighborhood])","v":"Columbia City"}]
["Land Use","2020-01-09","Completed","Completed","98118",{"$f":"_xlfn.XLOOKUP(--fSeattle2020Complaints[[#This Row],[ZipCode]],dZipNeighborhood[ZipCode],dZipNeighborhood[Neighborhood])","v":"Columbia City"}]
["Construction","2020-07-25","No Access/Unable to Observe","Under Investigation","98144",{"$f":"_xlfn.XLOOKUP(--fSeattle2020Complaints[[#This Row],[ZipCode]],dZipNeighborhood[ZipCode],dZipNeighborhood[Neighborhood])","v":"Mount Baker"}]
["Emergency , Vacant Building","2020-05-20","Compliance Achieved","Completed","98122",{"$f":"_xlfn.XLOOKUP(--fSeattle2020Complaints[[#This Row],[ZipCode]],dZipNeighborhood[ZipCode],dZipNeighborhood[Neighborhood])","v":"Minor, Central Area"}]
["Land Use","2020-01-03","Completed","Closed","98122",{"$f":"_xlfn.XLOOKUP(--fSeattle2020Complaints[[#This Row],[ZipCode]],dZipNeighborhood[ZipCode],dZipNeighborhood[Neighborhood])","v":"Minor, Central Area"}]
["Construction","2020-10-23","Completed","Completed","98109",{"$f":"_xlfn.XLOOKUP(--fSeattle2020Complaints[[#This Row],[ZipCode]],dZipNeighborhood[ZipCode],dZipNeighborhood[Neighborhood])","v":"South Lake Union"}]
["Construction","2020-02-07","Completed","Completed","98104",{"$f":"_xlfn.XLOOKUP(--fSeattle2020Complaints[[#This Row],[ZipCode]],dZipNeighborhood[ZipCode],dZipNeighborhood[Neighborhood])","v":"International District"}]
["Construction","2020-10-26","Completed","Under Investigation","98108",{"$f":"_xlfn.XLOOKUP(--fSeattle2020Complaints[[#This Row],[ZipCode]],dZipNeighborhood[ZipCode],dZipNeighborhood[Neighborhood])","v":"Rainer Valley"}]
["Tree","2020-05-19","No Access/Unable to Observe","Under Investigation","98199",{"$f":"_xlfn.XLOOKUP(--fSeattle2020Complaints[[#This Row],[ZipCode]],dZipNeighborhood[ZipCode],dZipNeighborhood[Neighborhood])","v":"Magnolia"}]
["Emergency , Vacant Building","2020-06-11","Compliance Achieved","Completed","98102",{"$f":"_xlfn.XLOOKUP(--fSeattle2020Complaints[[#This Row],[ZipCode]],dZipNeighborhood[ZipCode],dZipNeighborhood[Neighborhood])","v":"Capital Hill"}]
["Construction","2020-12-15","Completed","Completed","98109",{"$f":"_xlfn.XLOOKUP(--fSeattle2020Complaints[[#This Row],[ZipCode]],dZipNeighborhood[ZipCode],dZipNeighborhood[Neighborhood])","v":"South Lake Union"}]
["Land Use","2020-04-05","Completed","Completed","98122",{"$f":"_xlfn.XLOOKUP(--fSeattle2020Complaints[[#This Row],[ZipCode]],dZipNeighborhood[ZipCode],dZipNeighborhood[Neighborhood])","v":"Minor, Central Area"}]
["Land Use","2020-06-24","Completed","Completed","98105",{"$f":"_xlfn.XLOOKUP(--fSeattle2020Complaints[[#This Row],[ZipCode]],dZipNeighborhood[ZipCode],dZipNeighborhood[Neighborhood])","v":"University District"}]
["Land Use","2020-05-15","Completed","Completed","98107",{"$f":"_xlfn.XLOOKUP(--fSeattle2020Complaints[[#This Row],[ZipCode]],dZipNeighborhood[ZipCode],dZipNeighborhood[Neighborhood])","v":"Ballard"}]
["Emergency , Vacant Building","2020-09-14","Completed","Completed","98118",{"$f":"_xlfn.XLOOKUP(--fSeattle2020Complaints[[#This Row],[ZipCode]],dZipNeighborhood[ZipCode],dZipNeighborhood[Neighborhood])","v":"Columbia City"}]
["Weeds","2020-03-10","Completed","Warning","98103",{"$f":"_xlfn.XLOOKUP(--fSeattle2020Complaints[[#This Row],[ZipCode]],dZipNeighborhood[ZipCode],dZipNeighborhood[Neighborhood])","v":"Greenwood"}]
["Land Use","2020-01-16","Completed","Completed","98115",{"$f":"_xlfn.XLOOKUP(--fSeattle2020Complaints[[#This Row],[ZipCode]],dZipNeighborhood[ZipCode],dZipNeighborhood[Neighborhood])","v":"Greenlake"}]
["Construction","2020-08-10","Completed","Completed","98126",{"$f":"_xlfn.XLOOKUP(--fSeattle2020Complaints[[#This Row],[ZipCode]],dZipNeighborhood[ZipCode],dZipNeighborhood[Neighborhood])","v":"High Point"}]
["Land Use","2020-09-01","Completed","Completed","98133",{"$f":"_xlfn.XLOOKUP(--fSeattle2020Complaints[[#This Row],[ZipCode]],dZipNeighborhood[ZipCode],dZipNeighborhood[Neighborhood])","v":"Shoreline"}]
["Land Use","2020-07-14","Completed","Completed","98105",{"$f":"_xlfn.XLOOKUP(--fSeattle2020Complaints[[#This Row],[ZipCode]],dZipNeighborhood[ZipCode],dZipNeighborhood[Neighborhood])","v":"University District"}]
["Land Use","2020-08-24","Completed","Completed","98136",{"$f":"_xlfn.XLOOKUP(--fSeattle2020Complaints[[#This Row],[ZipCode]],dZipNeighborhood[ZipCode],dZipNeighborhood[Neighborhood])","v":"Seaview"}]
["Land Use","2020-03-20","Completed","Initiated","98117",{"$f":"_xlfn.XLOOKUP(--fSeattle2020Complaints[[#This Row],[ZipCode]],dZipNeighborhood[ZipCode],dZipNeighborhood[Neighborhood])","v":"Sunset Hill"}]
["Tree","2020-08-31","Completed","Completed","98102",{"$f":"_xlfn.XLOOKUP(--fSeattle2020Complaints[[#This Row],[ZipCode]],dZipNeighborhood[ZipCode],dZipNeighborhood[Neighborhood])","v":"Capital Hill"}]
["Land Use","2020-05-19","Completed","Completed","98125",{"$f":"_xlfn.XLOOKUP(--fSeattle2020Complaints[[#This Row],[ZipCode]],dZipNeighborhood[ZipCode],dZipNeighborhood[Neighborhood])","v":"Northgate"}]
["Land Use","2020-12-17","Completed","Completed","98103",{"$f":"_xlfn.XLOOKUP(--fSeattle2020Complaints[[#This Row],[ZipCode]],dZipNeighborhood[ZipCode],dZipNeighborhood[Neighborhood])","v":"Greenwood"}]
["Weeds","2020-08-10","Completed","Completed","98122",{"$f":"_xlfn.XLOOKUP(--fSeattle2020Complaints[[#This Row],[ZipCode]],dZipNeighborhood[ZipCode],dZipNeighborhood[Neighborhood])","v":"Minor, Central Area"}]
["Land Use","2020-02-13","Completed","Completed","98119",{"$f":"_xlfn.XLOOKUP(--fSeattle2020Complaints[[#This Row],[ZipCode]],dZipNeighborhood[ZipCode],dZipNeighborhood[Neighborhood])","v":"Queen Anne"}]
["Land Use","2020-03-06","Completed","Completed","98133",{"$f":"_xlfn.XLOOKUP(--fSeattle2020Complaints[[#This Row],[ZipCode]],dZipNeighborhood[ZipCode],dZipNeighborhood[Neighborhood])","v":"Shoreline"}]
["Land Use","2020-02-26","Completed","Completed","98107",{"$f":"_xlfn.XLOOKUP(--fSeattle2020Complaints[[#This Row],[ZipCode]],dZipNeighborhood[ZipCode],dZipNeighborhood[Neighborhood])","v":"Ballard"}]
["Emergency , Vacant Building","2020-06-17","Compliance Achieved","Completed","98144",{"$f":"_xlfn.XLOOKUP(--fSeattle2020Complaints[[#This Row],[ZipCode]],dZipNeighborhood[ZipCode],dZipNeighborhood[Neighborhood])","v":"Mount Baker"}]
["Tree","2020-01-17","Completed","Completed","98136",{"$f":"_xlfn.XLOOKUP(--fSeattle2020Complaints[[#This Row],[ZipCode]],dZipNeighborhood[ZipCode],dZipNeighborhood[Neighborhood])","v":"Seaview"}]
["Construction","2020-08-03","Completed","Completed","98144",{"$f":"_xlfn.XLOOKUP(--fSeattle2020Complaints[[#This Row],[ZipCode]],dZipNeighborhood[ZipCode],dZipNeighborhood[Neighborhood])","v":"Mount Baker"}]
["Weeds","2020-07-30","Completed","Completed","98178",{"$f":"_xlfn.XLOOKUP(--fSeattle2020Complaints[[#This Row],[ZipCode]],dZipNeighborhood[ZipCode],dZipNeighborhood[Neighborhood])","v":"Skyway"}]
["Weeds","2020-03-25","Compliance Achieved","Warning","98112",{"$f":"_xlfn.XLOOKUP(--fSeattle2020Complaints[[#This Row],[ZipCode]],dZipNeighborhood[ZipCode],dZipNeighborhood[Neighborhood])","v":"Madison Park"}]
["Weeds","2020-02-18","Compliance Achieved","Completed","98118",{"$f":"_xlfn.XLOOKUP(--fSeattle2020Complaints[[#This Row],[ZipCode]],dZipNeighborhood[ZipCode],dZipNeighborhood[Neighborhood])","v":"Columbia City"}]
["Construction","2020-10-14","No Violation","Closed","98109",{"$f":"_xlfn.XLOOKUP(--fSeattle2020Complaints[[#This Row],[ZipCode]],dZipNeighborhood[ZipCode],dZipNeighborhood[Neighborhood])","v":"South Lake Union"}]
["Noise","2020-01-25","No Violation","Completed","98121",{"$f":"_xlfn.XLOOKUP(--fSeattle2020Complaints[[#This Row],[ZipCode]],dZipNeighborhood[ZipCode],dZipNeighborhood[Neighborhood])","v":"Belltown"}]
["Noise","2020-12-01","Completed","Completed","98104",{"$f":"_xlfn.XLOOKUP(--fSeattle2020Complaints[[#This Row],[ZipCode]],dZipNeighborhood[ZipCode],dZipNeighborhood[Neighborhood])","v":"International District"}]
["Land Use","2020-08-27","Completed","Completed","98112",{"$f":"_xlfn.XLOOKUP(--fSeattle2020Complaints[[#This Row],[ZipCode]],dZipNeighborhood[ZipCode],dZipNeighborhood[Neighborhood])","v":"Madison Park"}]
["Vacant Building","2020-07-14","Compliance Achieved","Completed","98107",{"$f":"_xlfn.XLOOKUP(--fSeattle2020Complaints[[#This Row],[ZipCode]],dZipNeighborhood[ZipCode],dZipNeighborhood[Neighborhood])","v":"Ballard"}]
["Weeds","2020-02-21","Completed","Warning","98107",{"$f":"_xlfn.XLOOKUP(--fSeattle2020Complaints[[#This Row],[ZipCode]],dZipNeighborhood[ZipCode],dZipNeighborhood[Neighborhood])","v":"Ballard"}]
["Construction","2020-09-07","Completed","Completed","98107",{"$f":"_xlfn.XLOOKUP(--fSeattle2020Complaints[[#This Row],[ZipCode]],dZipNeighborhood[ZipCode],dZipNeighborhood[Neighborhood])","v":"Ballard"}]
["Vacant Building","2020-10-27","No Structure","Completed","98116",{"$f":"_xlfn.XLOOKUP(--fSeattle2020Complaints[[#This Row],[ZipCode]],dZipNeighborhood[ZipCode],dZipNeighborhood[Neighborhood])","v":"West Seattle"}]
["Weeds","2020-02-07","Completed","Completed","98112",{"$f":"_xlfn.XLOOKUP(--fSeattle2020Complaints[[#This Row],[ZipCode]],dZipNeighborhood[ZipCode],dZipNeighborhood[Neighborhood])","v":"Madison Park"}]
["Land Use","2020-01-13","Completed","Completed","98199",{"$f":"_xlfn.XLOOKUP(--fSeattle2020Complaints[[#This Row],[ZipCode]],dZipNeighborhood[ZipCode],dZipNeighborhood[Neighborhood])","v":"Magnolia"}]
["Land Use","2020-08-07","Completed","Completed","98104",{"$f":"_xlfn.XLOOKUP(--fSeattle2020Complaints[[#This Row],[ZipCode]],dZipNeighborhood[ZipCode],dZipNeighborhood[Neighborhood])","v":"International District"}]
["Weeds","2020-08-12","Completed","Completed","98178",{"$f":"_xlfn.XLOOKUP(--fSeattle2020Complaints[[#This Row],[ZipCode]],dZipNeighborhood[ZipCode],dZipNeighborhood[Neighborhood])","v":"Skyway"}]
["Land UseConstruction ,","2020-05-14","Completed","Completed","98136",{"$f":"_xlfn.XLOOKUP(--fSeattle2020Complaints[[#This Row],[ZipCode]],dZipNeighborhood[ZipCode],dZipNeighborhood[Neighborhood])","v":"Seaview"}]
["Tree","2020-05-27","Completed","Completed","98103",{"$f":"_xlfn.XLOOKUP(--fSeattle2020Complaints[[#This Row],[ZipCode]],dZipNeighborhood[ZipCode],dZipNeighborhood[Neighborhood])","v":"Greenwood"}]
["Land Use","2020-09-29","Admin Closure","Completed","98121",{"$f":"_xlfn.XLOOKUP(--fSeattle2020Complaints[[#This Row],[ZipCode]],dZipNeighborhood[ZipCode],dZipNeighborhood[Neighborhood])","v":"Belltown"}]
["Land Use","2020-06-30","Completed","Completed","98107",{"$f":"_xlfn.XLOOKUP(--fSeattle2020Complaints[[#This Row],[ZipCode]],dZipNeighborhood[ZipCode],dZipNeighborhood[Neighborhood])","v":"Ballard"}]
["Tree","2020-01-08","Completed","Completed","98112",{"$f":"_xlfn.XLOOKUP(--fSeattle2020Complaints[[#This Row],[ZipCode]],dZipNeighborhood[ZipCode],dZipNeighborhood[Neighborhood])","v":"Madison Park"}]
["Land Use","2020-12-29","Completed","Completed","98112",{"$f":"_xlfn.XLOOKUP(--fSeattle2020Complaints[[#This Row],[ZipCode]],dZipNeighborhood[ZipCode],dZipNeighborhood[Neighborhood])","v":"Madison Park"}]
["Land Use","2020-04-14","Compliance Achieved","Completed","98118",{"$f":"_xlfn.XLOOKUP(--fSeattle2020Complaints[[#This Row],[ZipCode]],dZipNeighborhood[ZipCode],dZipNeighborhood[Neighborhood])","v":"Columbia City"}]
["Land Use","2020-01-24","Completed","Completed","98118",{"$f":"_xlfn.XLOOKUP(--fSeattle2020Complaints[[#This Row],[ZipCode]],dZipNeighborhood[ZipCode],dZipNeighborhood[Neighborhood])","v":"Columbia City"}]
["Land Use","2020-04-11","Completed","Completed","98116",{"$f":"_xlfn.XLOOKUP(--fSeattle2020Complaints[[#This Row],[ZipCode]],dZipNeighborhood[ZipCode],dZipNeighborhood[Neighborhood])","v":"West Seattle"}]
["Weeds","2020-03-16","Completed","Completed","98199",{"$f":"_xlfn.XLOOKUP(--fSeattle2020Complaints[[#This Row],[ZipCode]],dZipNeighborhood[ZipCode],dZipNeighborhood[Neighborhood])","v":"Magnolia"}]
["Weeds","2020-03-12","Completed","Completed","98103",{"$f":"_xlfn.XLOOKUP(--fSeattle2020Complaints[[#This Row],[ZipCode]],dZipNeighborhood[ZipCode],dZipNeighborhood[Neighborhood])","v":"Greenwood"}]
["Land Use","2020-08-20","Completed","Completed","98144",{"$f":"_xlfn.XLOOKUP(--fSeattle2020Complaints[[#This Row],[ZipCode]],dZipNeighborhood[ZipCode],dZipNeighborhood[Neighborhood])","v":"Mount Baker"}]
["Weeds","2020-08-03","Completed","Under Investigation","98103",{"$f":"_xlfn.XLOOKUP(--fSeattle2020Complaints[[#This Row],[ZipCode]],dZipNeighborhood[ZipCode],dZipNeighborhood[Neighborhood])","v":"Greenwood"}]
["Land Use","2020-01-31","Completed","Completed","98117",{"$f":"_xlfn.XLOOKUP(--fSeattle2020Complaints[[#This Row],[ZipCode]],dZipNeighborhood[ZipCode],dZipNeighborhood[Neighborhood])","v":"Sunset Hill"}]
["Land Use","2020-06-10","Completed","Completed","98106",{"$f":"_xlfn.XLOOKUP(--fSeattle2020Complaints[[#This Row],[ZipCode]],dZipNeighborhood[ZipCode],dZipNeighborhood[Neighborhood])","v":"Delridge"}]
["Tree","2020-11-20","Completed","Completed","98144",{"$f":"_xlfn.XLOOKUP(--fSeattle2020Complaints[[#This Row],[ZipCode]],dZipNeighborhood[ZipCode],dZipNeighborhood[Neighborhood])","v":"Mount Baker"}]
["Weeds","2020-07-26","Completed","Completed","98108",{"$f":"_xlfn.XLOOKUP(--fSeattle2020Complaints[[#This Row],[ZipCode]],dZipNeighborhood[ZipCode],dZipNeighborhood[Neighborhood])","v":"Rainer Valley"}]
["Land Use","2020-03-17","Completed","Completed","98126",{"$f":"_xlfn.XLOOKUP(--fSeattle2020Complaints[[#This Row],[ZipCode]],dZipNeighborhood[ZipCode],dZipNeighborhood[Neighborhood])","v":"High Point"}]
["Land Use","2020-09-29","Completed","Completed","98115",{"$f":"_xlfn.XLOOKUP(--fSeattle2020Complaints[[#This Row],[ZipCode]],dZipNeighborhood[ZipCode],dZipNeighborhood[Neighborhood])","v":"Greenlake"}]
["Weeds","2020-08-26","Completed","Completed","98103",{"$f":"_xlfn.XLOOKUP(--fSeattle2020Complaints[[#This Row],[ZipCode]],dZipNeighborhood[ZipCode],dZipNeighborhood[Neighborhood])","v":"Greenwood"}]
["Land Use","2020-03-30","Completed","Completed","98105",{"$f":"_xlfn.XLOOKUP(--fSeattle2020Complaints[[#This Row],[ZipCode]],dZipNeighborhood[ZipCode],dZipNeighborhood[Neighborhood])","v":"University District"}]
["Weeds","2020-05-20","Completed","Completed","98108",{"$f":"_xlfn.XLOOKUP(--fSeattle2020Complaints[[#This Row],[ZipCode]],dZipNeighborhood[ZipCode],dZipNeighborhood[Neighborhood])","v":"Rainer Valley"}]
["Construction","2020-09-21","Completed","Under Investigation","98178",{"$f":"_xlfn.XLOOKUP(--fSeattle2020Complaints[[#This Row],[ZipCode]],dZipNeighborhood[ZipCode],dZipNeighborhood[Neighborhood])","v":"Skyway"}]
["Construction","2020-02-12","No Access/Unable to Observe","Completed","98122",{"$f":"_xlfn.XLOOKUP(--fSeattle2020Complaints[[#This Row],[ZipCode]],dZipNeighborhood[ZipCode],dZipNeighborhood[Neighborhood])","v":"Minor, Central Area"}]
["Construction , Tree","2020-03-16","Completed","Completed","98199",{"$f":"_xlfn.XLOOKUP(--fSeattle2020Complaints[[#This Row],[ZipCode]],dZipNeighborhood[ZipCode],dZipNeighborhood[Neighborhood])","v":"Magnolia"}]
["LandLord/Tenant","2020-12-23","Completed","Completed","98121",{"$f":"_xlfn.XLOOKUP(--fSeattle2020Complaints[[#This Row],[ZipCode]],dZipNeighborhood[ZipCode],dZipNeighborhood[Neighborhood])","v":"Belltown"}]
["Construction","2020-04-21","Completed","Completed","98118",{"$f":"_xlfn.XLOOKUP(--fSeattle2020Complaints[[#This Row],[ZipCode]],dZipNeighborhood[ZipCode],dZipNeighborhood[Neighborhood])","v":"Columbia City"}]
["Weeds","2020-08-14","Completed","Completed","98117",{"$f":"_xlfn.XLOOKUP(--fSeattle2020Complaints[[#This Row],[ZipCode]],dZipNeighborhood[ZipCode],dZipNeighborhood[Neighborhood])","v":"Sunset Hill"}]
["Land Use","2020-12-29","Completed","Completed","98106",{"$f":"_xlfn.XLOOKUP(--fSeattle2020Complaints[[#This Row],[ZipCode]],dZipNeighborhood[ZipCode],dZipNeighborhood[Neighborhood])","v":"Delridge"}]
["Construction , Tree","2020-07-15","Completed","Completed","98105",{"$f":"_xlfn.XLOOKUP(--fSeattle2020Complaints[[#This Row],[ZipCode]],dZipNeighborhood[ZipCode],dZipNeighborhood[Neighborhood])","v":"University District"}]
["Land Use","2020-02-06","Completed","Completed","98136",{"$f":"_xlfn.XLOOKUP(--fSeattle2020Complaints[[#This Row],[ZipCode]],dZipNeighborhood[ZipCode],dZipNeighborhood[Neighborhood])","v":"Seaview"}]
["Land Use","2020-12-07","Completed","Completed","98122",{"$f":"_xlfn.XLOOKUP(--fSeattle2020Complaints[[#This Row],[ZipCode]],dZipNeighborhood[ZipCode],dZipNeighborhood[Neighborhood])","v":"Minor, Central Area"}]
["Weeds","2020-03-02","Completed","Warning","98177",{"$f":"_xlfn.XLOOKUP(--fSeattle2020Complaints[[#This Row],[ZipCode]],dZipNeighborhood[ZipCode],dZipNeighborhood[Neighborhood])","v":"Richmond Beach"}]
["Construction","2020-01-02","Completed","Completed","98115",{"$f":"_xlfn.XLOOKUP(--fSeattle2020Complaints[[#This Row],[ZipCode]],dZipNeighborhood[ZipCode],dZipNeighborhood[Neighborhood])","v":"Greenlake"}]
["Vacant Building","2020-05-25","Completed","Completed","98112",{"$f":"_xlfn.XLOOKUP(--fSeattle2020Complaints[[#This Row],[ZipCode]],dZipNeighborhood[ZipCode],dZipNeighborhood[Neighborhood])","v":"Madison Park"}]
["Noise","2020-01-07","No Violation","Completed","98118",{"$f":"_xlfn.XLOOKUP(--fSeattle2020Complaints[[#This Row],[ZipCode]],dZipNeighborhood[ZipCode],dZipNeighborhood[Neighborhood])","v":"Columbia City"}]
["Construction","2020-03-19","Completed","Completed","98102",{"$f":"_xlfn.XLOOKUP(--fSeattle2020Complaints[[#This Row],[ZipCode]],dZipNeighborhood[ZipCode],dZipNeighborhood[Neighborhood])","v":"Capital Hill"}]
["Weeds","2020-07-22","Completed","Completed","98105",{"$f":"_xlfn.XLOOKUP(--fSeattle2020Complaints[[#This Row],[ZipCode]],dZipNeighborhood[ZipCode],dZipNeighborhood[Neighborhood])","v":"University District"}]
["Construction","2020-07-01","Completed","Completed","98118",{"$f":"_xlfn.XLOOKUP(--fSeattle2020Complaints[[#This Row],[ZipCode]],dZipNeighborhood[ZipCode],dZipNeighborhood[Neighborhood])","v":"Columbia City"}]
["Construction","2020-12-18","Completed","Completed","98116",{"$f":"_xlfn.XLOOKUP(--fSeattle2020Complaints[[#This Row],[ZipCode]],dZipNeighborhood[ZipCode],dZipNeighborhood[Neighborhood])","v":"West Seattle"}]
["Weeds","2020-08-07","Completed","Completed","98125",{"$f":"_xlfn.XLOOKUP(--fSeattle2020Complaints[[#This Row],[ZipCode]],dZipNeighborhood[ZipCode],dZipNeighborhood[Neighborhood])","v":"Northgate"}]
["Vacant Building","2020-12-28","Completed","Completed","98125",{"$f":"_xlfn.XLOOKUP(--fSeattle2020Complaints[[#This Row],[ZipCode]],dZipNeighborhood[ZipCode],dZipNeighborhood[Neighborhood])","v":"Northgate"}]
["Land Use","2020-06-04","Completed","Completed","98125",{"$f":"_xlfn.XLOOKUP(--fSeattle2020Complaints[[#This Row],[ZipCode]],dZipNeighborhood[ZipCode],dZipNeighborhood[Neighborhood])","v":"Northgate"}]
["Emergency , Vacant Building","2020-05-22","Compliance Achieved","Completed","98118",{"$f":"_xlfn.XLOOKUP(--fSeattle2020Complaints[[#This Row],[ZipCode]],dZipNeighborhood[ZipCode],dZipNeighborhood[Neighborhood])","v":"Columbia City"}]
["Emergency , Vacant Building","2020-04-10","Compliance Achieved","Completed","98118",{"$f":"_xlfn.XLOOKUP(--fSeattle2020Complaints[[#This Row],[ZipCode]],dZipNeighborhood[ZipCode],dZipNeighborhood[Neighborhood])","v":"Columbia City"}]
["Land Use","2020-02-28","Completed","Completed","98102",{"$f":"_xlfn.XLOOKUP(--fSeattle2020Complaints[[#This Row],[ZipCode]],dZipNeighborhood[ZipCode],dZipNeighborhood[Neighborhood])","v":"Capital Hill"}]
["Vacant Building","2020-01-21","Completed","Completed","98103",{"$f":"_xlfn.XLOOKUP(--fSeattle2020Complaints[[#This Row],[ZipCode]],dZipNeighborhood[ZipCode],dZipNeighborhood[Neighborhood])","v":"Greenwood"}]
["Weeds","2020-06-03","Completed","Completed","98146",{"$f":"_xlfn.XLOOKUP(--fSeattle2020Complaints[[#This Row],[ZipCode]],dZipNeighborhood[ZipCode],dZipNeighborhood[Neighborhood])","v":"Shorewood, White Center"}]
["Land Use","2020-05-22","Completed","Completed","98109",{"$f":"_xlfn.XLOOKUP(--fSeattle2020Complaints[[#This Row],[ZipCode]],dZipNeighborhood[ZipCode],dZipNeighborhood[Neighborhood])","v":"South Lake Union"}]
["Land UseConstruction ,","2020-02-27","Compliance Achieved","Completed","98122",{"$f":"_xlfn.XLOOKUP(--fSeattle2020Complaints[[#This Row],[ZipCode]],dZipNeighborhood[ZipCode],dZipNeighborhood[Neighborhood])","v":"Minor, Central Area"}]
["Construction","2020-02-03","Completed","NOV Issued","98136",{"$f":"_xlfn.XLOOKUP(--fSeattle2020Complaints[[#This Row],[ZipCode]],dZipNeighborhood[ZipCode],dZipNeighborhood[Neighborhood])","v":"Seaview"}]
["Emergency , Vacant Building","2020-06-08","Completed","Completed","98118",{"$f":"_xlfn.XLOOKUP(--fSeattle2020Complaints[[#This Row],[ZipCode]],dZipNeighborhood[ZipCode],dZipNeighborhood[Neighborhood])","v":"Columbia City"}]
["Vacant Building","2020-04-08","Completed","Closed","98103",{"$f":"_xlfn.XLOOKUP(--fSeattle2020Complaints[[#This Row],[ZipCode]],dZipNeighborhood[ZipCode],dZipNeighborhood[Neighborhood])","v":"Greenwood"}]
["Land Use","2020-05-18","Completed","Completed","98105",{"$f":"_xlfn.XLOOKUP(--fSeattle2020Complaints[[#This Row],[ZipCode]],dZipNeighborhood[ZipCode],dZipNeighborhood[Neighborhood])","v":"University District"}]
["Land Use","2020-07-28","Completed","Completed","98125",{"$f":"_xlfn.XLOOKUP(--fSeattle2020Complaints[[#This Row],[ZipCode]],dZipNeighborhood[ZipCode],dZipNeighborhood[Neighborhood])","v":"Northgate"}]
["Construction","2020-11-04","Completed","Completed","98103",{"$f":"_xlfn.XLOOKUP(--fSeattle2020Complaints[[#This Row],[ZipCode]],dZipNeighborhood[ZipCode],dZipNeighborhood[Neighborhood])","v":"Greenwood"}]
["Weeds","2020-03-16","Compliance Achieved","Completed","98112",{"$f":"_xlfn.XLOOKUP(--fSeattle2020Complaints[[#This Row],[ZipCode]],dZipNeighborhood[ZipCode],dZipNeighborhood[Neighborhood])","v":"Madison Park"}]
["Weeds","2020-07-08","Completed","Completed","98118",{"$f":"_xlfn.XLOOKUP(--fSeattle2020Complaints[[#This Row],[ZipCode]],dZipNeighborhood[ZipCode],dZipNeighborhood[Neighborhood])","v":"Columbia City"}]
["Construction","2020-03-11","Completed","Completed","98115",{"$f":"_xlfn.XLOOKUP(--fSeattle2020Complaints[[#This Row],[ZipCode]],dZipNeighborhood[ZipCode],dZipNeighborhood[Neighborhood])","v":"Greenlake"}]
["Weeds","2020-07-05","Completed","Completed","98115",{"$f":"_xlfn.XLOOKUP(--fSeattle2020Complaints[[#This Row],[ZipCode]],dZipNeighborhood[ZipCode],dZipNeighborhood[Neighborhood])","v":"Greenlake"}]
["Land Use","2020-04-06","No Violation","Completed","98116",{"$f":"_xlfn.XLOOKUP(--fSeattle2020Complaints[[#This Row],[ZipCode]],dZipNeighborhood[ZipCode],dZipNeighborhood[Neighborhood])","v":"West Seattle"}]
["Construction","2020-09-16","No Access/Unable to Observe","Completed","98199",{"$f":"_xlfn.XLOOKUP(--fSeattle2020Complaints[[#This Row],[ZipCode]],dZipNeighborhood[ZipCode],dZipNeighborhood[Neighborhood])","v":"Magnolia"}]
["Weeds","2020-09-24","Completed","Completed","98199",{"$f":"_xlfn.XLOOKUP(--fSeattle2020Complaints[[#This Row],[ZipCode]],dZipNeighborhood[ZipCode],dZipNeighborhood[Neighborhood])","v":"Magnolia"}]
["Weeds","2020-09-08","Completed","Completed","98109",{"$f":"_xlfn.XLOOKUP(--fSeattle2020Complaints[[#This Row],[ZipCode]],dZipNeighborhood[ZipCode],dZipNeighborhood[Neighborhood])","v":"South Lake Union"}]
["Construction","2020-02-25","Completed","Completed","98115",{"$f":"_xlfn.XLOOKUP(--fSeattle2020Complaints[[#This Row],[ZipCode]],dZipNeighborhood[ZipCode],dZipNeighborhood[Neighborhood])","v":"Greenlake"}]
["Land Use","2020-09-09","No Access/Unable to Observe","Completed","98102",{"$f":"_xlfn.XLOOKUP(--fSeattle2020Complaints[[#This Row],[ZipCode]],dZipNeighborhood[ZipCode],dZipNeighborhood[Neighborhood])","v":"Capital Hill"}]
["Weeds","2020-02-13","Completed","Completed","98108",{"$f":"_xlfn.XLOOKUP(--fSeattle2020Complaints[[#This Row],[ZipCode]],dZipNeighborhood[ZipCode],dZipNeighborhood[Neighborhood])","v":"Rainer Valley"}]
["Land Use","2020-07-10","Completed","Completed","98105",{"$f":"_xlfn.XLOOKUP(--fSeattle2020Complaints[[#This Row],[ZipCode]],dZipNeighborhood[ZipCode],dZipNeighborhood[Neighborhood])","v":"University District"}]
["Noise","2020-01-12","Completed","Completed","98103",{"$f":"_xlfn.XLOOKUP(--fSeattle2020Complaints[[#This Row],[ZipCode]],dZipNeighborhood[ZipCode],dZipNeighborhood[Neighborhood])","v":"Greenwood"}]
["Construction","2020-06-10","Completed","Completed","98103",{"$f":"_xlfn.XLOOKUP(--fSeattle2020Complaints[[#This Row],[ZipCode]],dZipNeighborhood[ZipCode],dZipNeighborhood[Neighborhood])","v":"Greenwood"}]
["Construction","2020-01-30","Completed","Completed","98105",{"$f":"_xlfn.XLOOKUP(--fSeattle2020Complaints[[#This Row],[ZipCode]],dZipNeighborhood[ZipCode],dZipNeighborhood[Neighborhood])","v":"University District"}]
["Land Use","2020-02-12","Completed","Completed","98105",{"$f":"_xlfn.XLOOKUP(--fSeattle2020Complaints[[#This Row],[ZipCode]],dZipNeighborhood[ZipCode],dZipNeighborhood[Neighborhood])","v":"University District"}]
["Weeds","2020-06-05","Completed","Completed","98107",{"$f":"_xlfn.XLOOKUP(--fSeattle2020Complaints[[#This Row],[ZipCode]],dZipNeighborhood[ZipCode],dZipNeighborhood[Neighborhood])","v":"Ballard"}]
["Land Use","2020-01-10","Completed","Completed","98115",{"$f":"_xlfn.XLOOKUP(--fSeattle2020Complaints[[#This Row],[ZipCode]],dZipNeighborhood[ZipCode],dZipNeighborhood[Neighborhood])","v":"Greenlake"}]
["Land Use","2020-01-31","Compliance Achieved","Completed","98178",{"$f":"_xlfn.XLOOKUP(--fSeattle2020Complaints[[#This Row],[ZipCode]],dZipNeighborhood[ZipCode],dZipNeighborhood[Neighborhood])","v":"Skyway"}]
["Weeds","2020-07-20","Completed","Completed","98118",{"$f":"_xlfn.XLOOKUP(--fSeattle2020Complaints[[#This Row],[ZipCode]],dZipNeighborhood[ZipCode],dZipNeighborhood[Neighborhood])","v":"Columbia City"}]
["Land Use","2020-08-18","No Access/Unable to Observe","Completed","98102",{"$f":"_xlfn.XLOOKUP(--fSeattle2020Complaints[[#This Row],[ZipCode]],dZipNeighborhood[ZipCode],dZipNeighborhood[Neighborhood])","v":"Capital Hill"}]
["Land Use","2020-01-06","Completed","Completed","98118",{"$f":"_xlfn.XLOOKUP(--fSeattle2020Complaints[[#This Row],[ZipCode]],dZipNeighborhood[ZipCode],dZipNeighborhood[Neighborhood])","v":"Columbia City"}]
["Weeds","2020-02-27","Completed","Warning","98117",{"$f":"_xlfn.XLOOKUP(--fSeattle2020Complaints[[#This Row],[ZipCode]],dZipNeighborhood[ZipCode],dZipNeighborhood[Neighborhood])","v":"Sunset Hill"}]
["Construction","2020-09-11","Completed","Completed","98108",{"$f":"_xlfn.XLOOKUP(--fSeattle2020Complaints[[#This Row],[ZipCode]],dZipNeighborhood[ZipCode],dZipNeighborhood[Neighborhood])","v":"Rainer Valley"}]
["Land Use","2020-03-24","Compliance Achieved","Completed","98122",{"$f":"_xlfn.XLOOKUP(--fSeattle2020Complaints[[#This Row],[ZipCode]],dZipNeighborhood[ZipCode],dZipNeighborhood[Neighborhood])","v":"Minor, Central Area"}]
["Weeds","2020-02-20","Completed","Under Investigation","98116",{"$f":"_xlfn.XLOOKUP(--fSeattle2020Complaints[[#This Row],[ZipCode]],dZipNeighborhood[ZipCode],dZipNeighborhood[Neighborhood])","v":"West Seattle"}]
["Vacant Building","2020-06-17","Completed","Completed","98106",{"$f":"_xlfn.XLOOKUP(--fSeattle2020Complaints[[#This Row],[ZipCode]],dZipNeighborhood[ZipCode],dZipNeighborhood[Neighborhood])","v":"Delridge"}]
["Land Use","2020-08-12","Completed","Completed","98118",{"$f":"_xlfn.XLOOKUP(--fSeattle2020Complaints[[#This Row],[ZipCode]],dZipNeighborhood[ZipCode],dZipNeighborhood[Neighborhood])","v":"Columbia City"}]
["Construction","2020-07-20","Completed","Closed","98117",{"$f":"_xlfn.XLOOKUP(--fSeattle2020Complaints[[#This Row],[ZipCode]],dZipNeighborhood[ZipCode],dZipNeighborhood[Neighborhood])","v":"Sunset Hill"}]
["Vacant Building","2020-01-29","Completed","Closed","98117",{"$f":"_xlfn.XLOOKUP(--fSeattle2020Complaints[[#This Row],[ZipCode]],dZipNeighborhood[ZipCode],dZipNeighborhood[Neighborhood])","v":"Sunset Hill"}]
["Weeds","2020-07-28","Completed","Completed","98178",{"$f":"_xlfn.XLOOKUP(--fSeattle2020Complaints[[#This Row],[ZipCode]],dZipNeighborhood[ZipCode],dZipNeighborhood[Neighborhood])","v":"Skyway"}]
["Land Use","2020-02-18","Compliance Achieved","Completed","98105",{"$f":"_xlfn.XLOOKUP(--fSeattle2020Complaints[[#This Row],[ZipCode]],dZipNeighborhood[ZipCode],dZipNeighborhood[Neighborhood])","v":"University District"}]
["Land Use","2020-02-05","Completed","Warning","98118",{"$f":"_xlfn.XLOOKUP(--fSeattle2020Complaints[[#This Row],[ZipCode]],dZipNeighborhood[ZipCode],dZipNeighborhood[Neighborhood])","v":"Columbia City"}]
["Vacant Building","2020-01-09","Completed","Completed","98115",{"$f":"_xlfn.XLOOKUP(--fSeattle2020Complaints[[#This Row],[ZipCode]],dZipNeighborhood[ZipCode],dZipNeighborhood[Neighborhood])","v":"Greenlake"}]
["Vacant Building","2020-05-09","Completed","Completed","98107",{"$f":"_xlfn.XLOOKUP(--fSeattle2020Complaints[[#This Row],[ZipCode]],dZipNeighborhood[ZipCode],dZipNeighborhood[Neighborhood])","v":"Ballard"}]
["Vacant Building","2020-02-05","Completed","Completed","98103",{"$f":"_xlfn.XLOOKUP(--fSeattle2020Complaints[[#This Row],[ZipCode]],dZipNeighborhood[ZipCode],dZipNeighborhood[Neighborhood])","v":"Greenwood"}]
["Vacant Building","2020-08-12","Completed","Under Investigation","98133",{"$f":"_xlfn.XLOOKUP(--fSeattle2020Complaints[[#This Row],[ZipCode]],dZipNeighborhood[ZipCode],dZipNeighborhood[Neighborhood])","v":"Shoreline"}]
["Construction","2020-10-04","Completed","Closed","98116",{"$f":"_xlfn.XLOOKUP(--fSeattle2020Complaints[[#This Row],[ZipCode]],dZipNeighborhood[ZipCode],dZipNeighborhood[Neighborhood])","v":"West Seattle"}]
["Land Use","2020-07-27","Compliance Achieved","Completed","98117",{"$f":"_xlfn.XLOOKUP(--fSeattle2020Complaints[[#This Row],[ZipCode]],dZipNeighborhood[ZipCode],dZipNeighborhood[Neighborhood])","v":"Sunset Hill"}]
["Construction","2020-01-10","Completed","Completed","98117",{"$f":"_xlfn.XLOOKUP(--fSeattle2020Complaints[[#This Row],[ZipCode]],dZipNeighborhood[ZipCode],dZipNeighborhood[Neighborhood])","v":"Sunset Hill"}]
["Construction","2020-11-14","Completed","Under Investigation","98102",{"$f":"_xlfn.XLOOKUP(--fSeattle2020Complaints[[#This Row],[ZipCode]],dZipNeighborhood[ZipCode],dZipNeighborhood[Neighborhood])","v":"Capital Hill"}]
["Weeds","2020-06-11","Completed","Completed","98126",{"$f":"_xlfn.XLOOKUP(--fSeattle2020Complaints[[#This Row],[ZipCode]],dZipNeighborhood[ZipCode],dZipNeighborhood[Neighborhood])","v":"High Point"}]
["Weeds","2020-12-07","Completed","Completed","98115",{"$f":"_xlfn.XLOOKUP(--fSeattle2020Complaints[[#This Row],[ZipCode]],dZipNeighborhood[ZipCode],dZipNeighborhood[Neighborhood])","v":"Greenlake"}]
["Land Use","2020-03-17","Completed","NOV Issued","98108",{"$f":"_xlfn.XLOOKUP(--fSeattle2020Complaints[[#This Row],[ZipCode]],dZipNeighborhood[ZipCode],dZipNeighborhood[Neighborhood])","v":"Rainer Valley"}]
["Weeds","2020-06-26","Completed","Completed","98108",{"$f":"_xlfn.XLOOKUP(--fSeattle2020Complaints[[#This Row],[ZipCode]],dZipNeighborhood[ZipCode],dZipNeighborhood[Neighborhood])","v":"Rainer Valley"}]
["Vacant Building","2020-08-14","Secured with No Violations","Completed","98101",{"$f":"_xlfn.XLOOKUP(--fSeattle2020Complaints[[#This Row],[ZipCode]],dZipNeighborhood[ZipCode],dZipNeighborhood[Neighborhood])","v":"Seattle"}]
["Land Use","2020-02-05","Completed","Warning","98116",{"$f":"_xlfn.XLOOKUP(--fSeattle2020Complaints[[#This Row],[ZipCode]],dZipNeighborhood[ZipCode],dZipNeighborhood[Neighborhood])","v":"West Seattle"}]
["Tree","2020-07-27","Completed","Completed","98108",{"$f":"_xlfn.XLOOKUP(--fSeattle2020Complaints[[#This Row],[ZipCode]],dZipNeighborhood[ZipCode],dZipNeighborhood[Neighborhood])","v":"Rainer Valley"}]
["Construction","2020-05-27","Completed","Completed","98136",{"$f":"_xlfn.XLOOKUP(--fSeattle2020Complaints[[#This Row],[ZipCode]],dZipNeighborhood[ZipCode],dZipNeighborhood[Neighborhood])","v":"Seaview"}]
["Land Use","2020-11-25","Completed","Completed","98108",{"$f":"_xlfn.XLOOKUP(--fSeattle2020Complaints[[#This Row],[ZipCode]],dZipNeighborhood[ZipCode],dZipNeighborhood[Neighborhood])","v":"Rainer Valley"}]
["LandLord/Tenant","2020-01-28","Completed","Completed","98118",{"$f":"_xlfn.XLOOKUP(--fSeattle2020Complaints[[#This Row],[ZipCode]],dZipNeighborhood[ZipCode],dZipNeighborhood[Neighborhood])","v":"Columbia City"}]
["Vacant Building","2020-07-09","Completed","Closed","98144",{"$f":"_xlfn.XLOOKUP(--fSeattle2020Complaints[[#This Row],[ZipCode]],dZipNeighborhood[ZipCode],dZipNeighborhood[Neighborhood])","v":"Mount Baker"}]
["Land Use","2020-10-30","Completed","Completed","98107",{"$f":"_xlfn.XLOOKUP(--fSeattle2020Complaints[[#This Row],[ZipCode]],dZipNeighborhood[ZipCode],dZipNeighborhood[Neighborhood])","v":"Ballard"}]
["Land Use","2020-06-18","Completed","Completed","98125",{"$f":"_xlfn.XLOOKUP(--fSeattle2020Complaints[[#This Row],[ZipCode]],dZipNeighborhood[ZipCode],dZipNeighborhood[Neighborhood])","v":"Northgate"}]
["Construction , Weeds","2020-06-11","Completed","Under Investigation","98112",{"$f":"_xlfn.XLOOKUP(--fSeattle2020Complaints[[#This Row],[ZipCode]],dZipNeighborhood[ZipCode],dZipNeighborhood[Neighborhood])","v":"Madison Park"}]
["Shoreline","2020-05-21","Completed","Completed","98102",{"$f":"_xlfn.XLOOKUP(--fSeattle2020Complaints[[#This Row],[ZipCode]],dZipNeighborhood[ZipCode],dZipNeighborhood[Neighborhood])","v":"Capital Hill"}]
["Construction","2020-08-10","Completed","Completed","98105",{"$f":"_xlfn.XLOOKUP(--fSeattle2020Complaints[[#This Row],[ZipCode]],dZipNeighborhood[ZipCode],dZipNeighborhood[Neighborhood])","v":"University District"}]
["Emergency , Vacant Building","2020-01-27","Compliance Achieved","Completed","98107",{"$f":"_xlfn.XLOOKUP(--fSeattle2020Complaints[[#This Row],[ZipCode]],dZipNeighborhood[ZipCode],dZipNeighborhood[Neighborhood])","v":"Ballard"}]
["Emergency , Vacant Building","2020-06-02","Completed","Completed","98102",{"$f":"_xlfn.XLOOKUP(--fSeattle2020Complaints[[#This Row],[ZipCode]],dZipNeighborhood[ZipCode],dZipNeighborhood[Neighborhood])","v":"Capital Hill"}]
["Noise","2020-01-14","Completed","Completed","98104",{"$f":"_xlfn.XLOOKUP(--fSeattle2020Complaints[[#This Row],[ZipCode]],dZipNeighborhood[ZipCode],dZipNeighborhood[Neighborhood])","v":"International District"}]
["Land Use","2020-10-09","Completed","Completed","98119",{"$f":"_xlfn.XLOOKUP(--fSeattle2020Complaints[[#This Row],[ZipCode]],dZipNeighborhood[ZipCode],dZipNeighborhood[Neighborhood])","v":"Queen Anne"}]
["Weeds","2020-10-29","Completed","Completed","98134",{"$f":"_xlfn.XLOOKUP(--fSeattle2020Complaints[[#This Row],[ZipCode]],dZipNeighborhood[ZipCode],dZipNeighborhood[Neighborhood])","v":"Duwamish"}]
["Land Use","2020-02-10","Completed","Completed","98108",{"$f":"_xlfn.XLOOKUP(--fSeattle2020Complaints[[#This Row],[ZipCode]],dZipNeighborhood[ZipCode],dZipNeighborhood[Neighborhood])","v":"Rainer Valley"}]
["Vacant Building","2020-03-29","Completed","Completed","98122",{"$f":"_xlfn.XLOOKUP(--fSeattle2020Complaints[[#This Row],[ZipCode]],dZipNeighborhood[ZipCode],dZipNeighborhood[Neighborhood])","v":"Minor, Central Area"}]
["Construction , Vacant Building","2020-05-21","No Structure","Closed","98199",{"$f":"_xlfn.XLOOKUP(--fSeattle2020Complaints[[#This Row],[ZipCode]],dZipNeighborhood[ZipCode],dZipNeighborhood[Neighborhood])","v":"Magnolia"}]
["Weeds","2020-04-29","Completed","Completed","98106",{"$f":"_xlfn.XLOOKUP(--fSeattle2020Complaints[[#This Row],[ZipCode]],dZipNeighborhood[ZipCode],dZipNeighborhood[Neighborhood])","v":"Delridge"}]
["Construction","2020-08-28","Completed","Completed","98102",{"$f":"_xlfn.XLOOKUP(--fSeattle2020Complaints[[#This Row],[ZipCode]],dZipNeighborhood[ZipCode],dZipNeighborhood[Neighborhood])","v":"Capital Hill"}]
["Tree","2020-06-15","Completed","Completed","98146",{"$f":"_xlfn.XLOOKUP(--fSeattle2020Complaints[[#This Row],[ZipCode]],dZipNeighborhood[ZipCode],dZipNeighborhood[Neighborhood])","v":"Shorewood, White Center"}]
["Land Use","2020-06-23","Completed","Completed","98144",{"$f":"_xlfn.XLOOKUP(--fSeattle2020Complaints[[#This Row],[ZipCode]],dZipNeighborhood[ZipCode],dZipNeighborhood[Neighborhood])","v":"Mount Baker"}]
["Construction","2020-09-14","Completed","Completed","98105",{"$f":"_xlfn.XLOOKUP(--fSeattle2020Complaints[[#This Row],[ZipCode]],dZipNeighborhood[ZipCode],dZipNeighborhood[Neighborhood])","v":"University District"}]
["Weeds","2020-09-14","Completed","Completed","98136",{"$f":"_xlfn.XLOOKUP(--fSeattle2020Complaints[[#This Row],[ZipCode]],dZipNeighborhood[ZipCode],dZipNeighborhood[Neighborhood])","v":"Seaview"}]
["Weeds","2020-02-20","Completed","Warning","98117",{"$f":"_xlfn.XLOOKUP(--fSeattle2020Complaints[[#This Row],[ZipCode]],dZipNeighborhood[ZipCode],dZipNeighborhood[Neighborhood])","v":"Sunset Hill"}]
["Construction","2020-09-18","No Access/Unable to Observe","Completed","98112",{"$f":"_xlfn.XLOOKUP(--fSeattle2020Complaints[[#This Row],[ZipCode]],dZipNeighborhood[ZipCode],dZipNeighborhood[Neighborhood])","v":"Madison Park"}]
["Construction","2020-12-04","Completed","Completed","98117",{"$f":"_xlfn.XLOOKUP(--fSeattle2020Complaints[[#This Row],[ZipCode]],dZipNeighborhood[ZipCode],dZipNeighborhood[Neighborhood])","v":"Sunset Hill"}]
["Construction","2020-10-13","Completed","Completed","98136",{"$f":"_xlfn.XLOOKUP(--fSeattle2020Complaints[[#This Row],[ZipCode]],dZipNeighborhood[ZipCode],dZipNeighborhood[Neighborhood])","v":"Seaview"}]
["Weeds","2020-03-06","Compliance Achieved","Completed","98105",{"$f":"_xlfn.XLOOKUP(--fSeattle2020Complaints[[#This Row],[ZipCode]],dZipNeighborhood[ZipCode],dZipNeighborhood[Neighborhood])","v":"University District"}]
["Land Use","2020-08-19","Completed","Completed","98112",{"$f":"_xlfn.XLOOKUP(--fSeattle2020Complaints[[#This Row],[ZipCode]],dZipNeighborhood[ZipCode],dZipNeighborhood[Neighborhood])","v":"Madison Park"}]
["Tree","2020-01-13","No Access/Unable to Observe","Completed","98125",{"$f":"_xlfn.XLOOKUP(--fSeattle2020Complaints[[#This Row],[ZipCode]],dZipNeighborhood[ZipCode],dZipNeighborhood[Neighborhood])","v":"Northgate"}]
["Land Use","2020-04-02","Completed","Completed","98178",{"$f":"_xlfn.XLOOKUP(--fSeattle2020Complaints[[#This Row],[ZipCode]],dZipNeighborhood[ZipCode],dZipNeighborhood[Neighborhood])","v":"Skyway"}]
["Land Use","2020-07-27","No Access/Unable to Observe","Completed","98144",{"$f":"_xlfn.XLOOKUP(--fSeattle2020Complaints[[#This Row],[ZipCode]],dZipNeighborhood[ZipCode],dZipNeighborhood[Neighborhood])","v":"Mount Baker"}]
["Land Use","2020-12-12","Completed","Completed","98136",{"$f":"_xlfn.XLOOKUP(--fSeattle2020Complaints[[#This Row],[ZipCode]],dZipNeighborhood[ZipCode],dZipNeighborhood[Neighborhood])","v":"Seaview"}]
["Vacant Building","2020-06-30","Compliance Achieved","Completed","98102",{"$f":"_xlfn.XLOOKUP(--fSeattle2020Complaints[[#This Row],[ZipCode]],dZipNeighborhood[ZipCode],dZipNeighborhood[Neighborhood])","v":"Capital Hill"}]
["Emergency","2020-08-05","Vacant","Completed","98107",{"$f":"_xlfn.XLOOKUP(--fSeattle2020Complaints[[#This Row],[ZipCode]],dZipNeighborhood[ZipCode],dZipNeighborhood[Neighborhood])","v":"Ballard"}]
["Land Use","2020-08-20","Completed","Under Investigation","98116",{"$f":"_xlfn.XLOOKUP(--fSeattle2020Complaints[[#This Row],[ZipCode]],dZipNeighborhood[ZipCode],dZipNeighborhood[Neighborhood])","v":"West Seattle"}]
["Construction","2020-12-03","Completed","Completed","98117",{"$f":"_xlfn.XLOOKUP(--fSeattle2020Complaints[[#This Row],[ZipCode]],dZipNeighborhood[ZipCode],dZipNeighborhood[Neighborhood])","v":"Sunset Hill"}]
["Construction","2020-04-17","Completed","Completed","98126",{"$f":"_xlfn.XLOOKUP(--fSeattle2020Complaints[[#This Row],[ZipCode]],dZipNeighborhood[ZipCode],dZipNeighborhood[Neighborhood])","v":"High Point"}]
["Construction","2020-10-27","Completed","Under Investigation","98122",{"$f":"_xlfn.XLOOKUP(--fSeattle2020Complaints[[#This Row],[ZipCode]],dZipNeighborhood[ZipCode],dZipNeighborhood[Neighborhood])","v":"Minor, Central Area"}]
["Construction","2020-07-23","No Access/Unable to Observe","Completed","98136",{"$f":"_xlfn.XLOOKUP(--fSeattle2020Complaints[[#This Row],[ZipCode]],dZipNeighborhood[ZipCode],dZipNeighborhood[Neighborhood])","v":"Seaview"}]
["Vacant Building","2020-11-06","Completed","Completed","98103",{"$f":"_xlfn.XLOOKUP(--fSeattle2020Complaints[[#This Row],[ZipCode]],dZipNeighborhood[ZipCode],dZipNeighborhood[Neighborhood])","v":"Greenwood"}]
["Vacant Building","2020-04-23","Completed","Completed","98107",{"$f":"_xlfn.XLOOKUP(--fSeattle2020Complaints[[#This Row],[ZipCode]],dZipNeighborhood[ZipCode],dZipNeighborhood[Neighborhood])","v":"Ballard"}]
["Construction , Tree","2020-04-29","Completed","Completed","98126",{"$f":"_xlfn.XLOOKUP(--fSeattle2020Complaints[[#This Row],[ZipCode]],dZipNeighborhood[ZipCode],dZipNeighborhood[Neighborhood])","v":"High Point"}]
["Weeds","2020-07-09","Completed","Completed","98107",{"$f":"_xlfn.XLOOKUP(--fSeattle2020Complaints[[#This Row],[ZipCode]],dZipNeighborhood[ZipCode],dZipNeighborhood[Neighborhood])","v":"Ballard"}]
["Construction , ECA","2020-07-03","Completed","Completed","98117",{"$f":"_xlfn.XLOOKUP(--fSeattle2020Complaints[[#This Row],[ZipCode]],dZipNeighborhood[ZipCode],dZipNeighborhood[Neighborhood])","v":"Sunset Hill"}]
["Land Use","2020-08-25","Completed","Completed","98108",{"$f":"_xlfn.XLOOKUP(--fSeattle2020Complaints[[#This Row],[ZipCode]],dZipNeighborhood[ZipCode],dZipNeighborhood[Neighborhood])","v":"Rainer Valley"}]
["Construction","2020-09-08","Completed","Completed","98136",{"$f":"_xlfn.XLOOKUP(--fSeattle2020Complaints[[#This Row],[ZipCode]],dZipNeighborhood[ZipCode],dZipNeighborhood[Neighborhood])","v":"Seaview"}]
["Tree","2020-07-27","No Violation","Completed","98107",{"$f":"_xlfn.XLOOKUP(--fSeattle2020Complaints[[#This Row],[ZipCode]],dZipNeighborhood[ZipCode],dZipNeighborhood[Neighborhood])","v":"Ballard"}]
["Land Use","2020-02-28","Compliance Achieved","Completed","98122",{"$f":"_xlfn.XLOOKUP(--fSeattle2020Complaints[[#This Row],[ZipCode]],dZipNeighborhood[ZipCode],dZipNeighborhood[Neighborhood])","v":"Minor, Central Area"}]
["LandLord/Tenant","2020-09-26","Completed","Completed","98105",{"$f":"_xlfn.XLOOKUP(--fSeattle2020Complaints[[#This Row],[ZipCode]],dZipNeighborhood[ZipCode],dZipNeighborhood[Neighborhood])","v":"University District"}]
["Land UseWeeds ,","2020-01-02","Completed","Completed","98104",{"$f":"_xlfn.XLOOKUP(--fSeattle2020Complaints[[#This Row],[ZipCode]],dZipNeighborhood[ZipCode],dZipNeighborhood[Neighborhood])","v":"International District"}]
["Noise","2020-08-05","Completed","Completed","98106",{"$f":"_xlfn.XLOOKUP(--fSeattle2020Complaints[[#This Row],[ZipCode]],dZipNeighborhood[ZipCode],dZipNeighborhood[Neighborhood])","v":"Delridge"}]
["LandLord/Tenant","2020-03-23","Compliance Achieved","Completed","98144",{"$f":"_xlfn.XLOOKUP(--fSeattle2020Complaints[[#This Row],[ZipCode]],dZipNeighborhood[ZipCode],dZipNeighborhood[Neighborhood])","v":"Mount Baker"}]
["Construction","2020-10-28","Completed","Completed","98106",{"$f":"_xlfn.XLOOKUP(--fSeattle2020Complaints[[#This Row],[ZipCode]],dZipNeighborhood[ZipCode],dZipNeighborhood[Neighborhood])","v":"Delridge"}]
["Land Use","2020-08-10","Completed","Completed","98103",{"$f":"_xlfn.XLOOKUP(--fSeattle2020Complaints[[#This Row],[ZipCode]],dZipNeighborhood[ZipCode],dZipNeighborhood[Neighborhood])","v":"Greenwood"}]
["Vacant Building","2020-10-14","Completed","Completed","98103",{"$f":"_xlfn.XLOOKUP(--fSeattle2020Complaints[[#This Row],[ZipCode]],dZipNeighborhood[ZipCode],dZipNeighborhood[Neighborhood])","v":"Greenwood"}]
["Emergency , Vacant Building","2020-02-25","Completed","Closed","98199",{"$f":"_xlfn.XLOOKUP(--fSeattle2020Complaints[[#This Row],[ZipCode]],dZipNeighborhood[ZipCode],dZipNeighborhood[Neighborhood])","v":"Magnolia"}]
["Land Use","2020-09-28","Completed","Completed","98115",{"$f":"_xlfn.XLOOKUP(--fSeattle2020Complaints[[#This Row],[ZipCode]],dZipNeighborhood[ZipCode],dZipNeighborhood[Neighborhood])","v":"Greenlake"}]
["Construction , ECA","2020-10-30","Completed","Completed","98136",{"$f":"_xlfn.XLOOKUP(--fSeattle2020Complaints[[#This Row],[ZipCode]],dZipNeighborhood[ZipCode],dZipNeighborhood[Neighborhood])","v":"Seaview"}]
["Land Use","2020-10-14","Completed","Completed","98105",{"$f":"_xlfn.XLOOKUP(--fSeattle2020Complaints[[#This Row],[ZipCode]],dZipNeighborhood[ZipCode],dZipNeighborhood[Neighborhood])","v":"University District"}]
["Weeds","2020-02-05","Completed","Completed","98112",{"$f":"_xlfn.XLOOKUP(--fSeattle2020Complaints[[#This Row],[ZipCode]],dZipNeighborhood[ZipCode],dZipNeighborhood[Neighborhood])","v":"Madison Park"}]
["Land Use","2020-02-13","Completed","Completed","98125",{"$f":"_xlfn.XLOOKUP(--fSeattle2020Complaints[[#This Row],[ZipCode]],dZipNeighborhood[ZipCode],dZipNeighborhood[Neighborhood])","v":"Northgate"}]
["Construction","2020-02-27","Completed","Completed","98122",{"$f":"_xlfn.XLOOKUP(--fSeattle2020Complaints[[#This Row],[ZipCode]],dZipNeighborhood[ZipCode],dZipNeighborhood[Neighborhood])","v":"Minor, Central Area"}]
["Tree","2020-11-06","Completed","Completed","98177",{"$f":"_xlfn.XLOOKUP(--fSeattle2020Complaints[[#This Row],[ZipCode]],dZipNeighborhood[ZipCode],dZipNeighborhood[Neighborhood])","v":"Richmond Beach"}]
["Construction","2020-09-28","Completed","Completed","98122",{"$f":"_xlfn.XLOOKUP(--fSeattle2020Complaints[[#This Row],[ZipCode]],dZipNeighborhood[ZipCode],dZipNeighborhood[Neighborhood])","v":"Minor, Central Area"}]
["Shoreline","2020-06-23","Completed","Completed","98125",{"$f":"_xlfn.XLOOKUP(--fSeattle2020Complaints[[#This Row],[ZipCode]],dZipNeighborhood[ZipCode],dZipNeighborhood[Neighborhood])","v":"Northgate"}]
["Construction","2020-11-02","Completed","Completed","98117",{"$f":"_xlfn.XLOOKUP(--fSeattle2020Complaints[[#This Row],[ZipCode]],dZipNeighborhood[ZipCode],dZipNeighborhood[Neighborhood])","v":"Sunset Hill"}]
["Weeds","2020-02-14","Completed","Completed","98118",{"$f":"_xlfn.XLOOKUP(--fSeattle2020Complaints[[#This Row],[ZipCode]],dZipNeighborhood[ZipCode],dZipNeighborhood[Neighborhood])","v":"Columbia City"}]
["LandLord/Tenant","2020-01-03","No Access/Unable to Observe","Completed","98104",{"$f":"_xlfn.XLOOKUP(--fSeattle2020Complaints[[#This Row],[ZipCode]],dZipNeighborhood[ZipCode],dZipNeighborhood[Neighborhood])","v":"International District"}]
["Weeds","2020-02-04","Compliance Achieved","Completed","98112",{"$f":"_xlfn.XLOOKUP(--fSeattle2020Complaints[[#This Row],[ZipCode]],dZipNeighborhood[ZipCode],dZipNeighborhood[Neighborhood])","v":"Madison Park"}]
["Construction","2020-11-17","Completed","Closed","98118",{"$f":"_xlfn.XLOOKUP(--fSeattle2020Complaints[[#This Row],[ZipCode]],dZipNeighborhood[ZipCode],dZipNeighborhood[Neighborhood])","v":"Columbia City"}]
["Construction","2020-06-09","Completed","Completed","98136",{"$f":"_xlfn.XLOOKUP(--fSeattle2020Complaints[[#This Row],[ZipCode]],dZipNeighborhood[ZipCode],dZipNeighborhood[Neighborhood])","v":"Seaview"}]
["Land Use","2020-07-29","Completed","Completed","98106",{"$f":"_xlfn.XLOOKUP(--fSeattle2020Complaints[[#This Row],[ZipCode]],dZipNeighborhood[ZipCode],dZipNeighborhood[Neighborhood])","v":"Delridge"}]
["Tree","2020-07-23","No Access/Unable to Observe","Completed","98119",{"$f":"_xlfn.XLOOKUP(--fSeattle2020Complaints[[#This Row],[ZipCode]],dZipNeighborhood[ZipCode],dZipNeighborhood[Neighborhood])","v":"Queen Anne"}]
["Land Use","2020-06-01","Completed","Completed","98103",{"$f":"_xlfn.XLOOKUP(--fSeattle2020Complaints[[#This Row],[ZipCode]],dZipNeighborhood[ZipCode],dZipNeighborhood[Neighborhood])","v":"Greenwood"}]
["Weeds","2020-03-10","Completed","Completed","98119",{"$f":"_xlfn.XLOOKUP(--fSeattle2020Complaints[[#This Row],[ZipCode]],dZipNeighborhood[ZipCode],dZipNeighborhood[Neighborhood])","v":"Queen Anne"}]
["Land Use","2020-11-02","Completed","Completed","98105",{"$f":"_xlfn.XLOOKUP(--fSeattle2020Complaints[[#This Row],[ZipCode]],dZipNeighborhood[ZipCode],dZipNeighborhood[Neighborhood])","v":"University District"}]
["Land Use","2020-08-02","Completed","Completed","98144",{"$f":"_xlfn.XLOOKUP(--fSeattle2020Complaints[[#This Row],[ZipCode]],dZipNeighborhood[ZipCode],dZipNeighborhood[Neighborhood])","v":"Mount Baker"}]
["Weeds","2020-02-05","Compliance Achieved","Completed","98112",{"$f":"_xlfn.XLOOKUP(--fSeattle2020Complaints[[#This Row],[ZipCode]],dZipNeighborhood[ZipCode],dZipNeighborhood[Neighborhood])","v":"Madison Park"}]
["Land Use","2020-03-17","Completed","Completed","98104",{"$f":"_xlfn.XLOOKUP(--fSeattle2020Complaints[[#This Row],[ZipCode]],dZipNeighborhood[ZipCode],dZipNeighborhood[Neighborhood])","v":"International District"}]
["Construction","2020-01-17","Completed","Closed","98102",{"$f":"_xlfn.XLOOKUP(--fSeattle2020Complaints[[#This Row],[ZipCode]],dZipNeighborhood[ZipCode],dZipNeighborhood[Neighborhood])","v":"Capital Hill"}]
["Construction","2020-02-28","Completed","NOV Issued","98102",{"$f":"_xlfn.XLOOKUP(--fSeattle2020Complaints[[#This Row],[ZipCode]],dZipNeighborhood[ZipCode],dZipNeighborhood[Neighborhood])","v":"Capital Hill"}]
["Emergency","2020-01-15","Completed","Completed","98103",{"$f":"_xlfn.XLOOKUP(--fSeattle2020Complaints[[#This Row],[ZipCode]],dZipNeighborhood[ZipCode],dZipNeighborhood[Neighborhood])","v":"Greenwood"}]
["Emergency , Vacant Building","2020-02-25","Completed","Closed","98199",{"$f":"_xlfn.XLOOKUP(--fSeattle2020Complaints[[#This Row],[ZipCode]],dZipNeighborhood[ZipCode],dZipNeighborhood[Neighborhood])","v":"Magnolia"}]
["Weeds","2020-09-08","Completed","Completed","98118",{"$f":"_xlfn.XLOOKUP(--fSeattle2020Complaints[[#This Row],[ZipCode]],dZipNeighborhood[ZipCode],dZipNeighborhood[Neighborhood])","v":"Columbia City"}]
["Land UseTree ,","2020-08-14","Completed","Completed","98125",{"$f":"_xlfn.XLOOKUP(--fSeattle2020Complaints[[#This Row],[ZipCode]],dZipNeighborhood[ZipCode],dZipNeighborhood[Neighborhood])","v":"Northgate"}]
["Land Use","2020-07-17","Completed","Closed","98117",{"$f":"_xlfn.XLOOKUP(--fSeattle2020Complaints[[#This Row],[ZipCode]],dZipNeighborhood[ZipCode],dZipNeighborhood[Neighborhood])","v":"Sunset Hill"}]
["Land Use","2020-05-27","Completed","Completed","98108",{"$f":"_xlfn.XLOOKUP(--fSeattle2020Complaints[[#This Row],[ZipCode]],dZipNeighborhood[ZipCode],dZipNeighborhood[Neighborhood])","v":"Rainer Valley"}]
["Vacant Building","2020-02-18","Completed","Completed","98144",{"$f":"_xlfn.XLOOKUP(--fSeattle2020Complaints[[#This Row],[ZipCode]],dZipNeighborhood[ZipCode],dZipNeighborhood[Neighborhood])","v":"Mount Baker"}]
["Weeds","2020-05-31","Completed","Completed","98103",{"$f":"_xlfn.XLOOKUP(--fSeattle2020Complaints[[#This Row],[ZipCode]],dZipNeighborhood[ZipCode],dZipNeighborhood[Neighborhood])","v":"Greenwood"}]
["Land Use","2020-03-17","Compliance Achieved","Compliance Achieved","98178",{"$f":"_xlfn.XLOOKUP(--fSeattle2020Complaints[[#This Row],[ZipCode]],dZipNeighborhood[ZipCode],dZipNeighborhood[Neighborhood])","v":"Skyway"}]
["Construction","2020-05-16","Completed","Completed","98108",{"$f":"_xlfn.XLOOKUP(--fSeattle2020Complaints[[#This Row],[ZipCode]],dZipNeighborhood[ZipCode],dZipNeighborhood[Neighborhood])","v":"Rainer Valley"}]
["Tree","2020-07-22","Completed","Initiated","98116",{"$f":"_xlfn.XLOOKUP(--fSeattle2020Complaints[[#This Row],[ZipCode]],dZipNeighborhood[ZipCode],dZipNeighborhood[Neighborhood])","v":"West Seattle"}]
["Land Use","2020-10-27","Completed","Completed","98103",{"$f":"_xlfn.XLOOKUP(--fSeattle2020Complaints[[#This Row],[ZipCode]],dZipNeighborhood[ZipCode],dZipNeighborhood[Neighborhood])","v":"Greenwood"}]
["Land UseLandLord/Tenant ,","2020-09-16","No Access/Unable to Observe","Closed","98118",{"$f":"_xlfn.XLOOKUP(--fSeattle2020Complaints[[#This Row],[ZipCode]],dZipNeighborhood[ZipCode],dZipNeighborhood[Neighborhood])","v":"Columbia City"}]
["Weeds","2020-03-12","Completed","Completed","98103",{"$f":"_xlfn.XLOOKUP(--fSeattle2020Complaints[[#This Row],[ZipCode]],dZipNeighborhood[ZipCode],dZipNeighborhood[Neighborhood])","v":"Greenwood"}]
["Weeds","2020-08-28","Completed","Completed","98144",{"$f":"_xlfn.XLOOKUP(--fSeattle2020Complaints[[#This Row],[ZipCode]],dZipNeighborhood[ZipCode],dZipNeighborhood[Neighborhood])","v":"Mount Baker"}]
["Land Use","2020-06-04","Admin Closure","Completed","98134",{"$f":"_xlfn.XLOOKUP(--fSeattle2020Complaints[[#This Row],[ZipCode]],dZipNeighborhood[ZipCode],dZipNeighborhood[Neighborhood])","v":"Duwamish"}]
["Land Use","2020-08-10","Completed","Completed","98126",{"$f":"_xlfn.XLOOKUP(--fSeattle2020Complaints[[#This Row],[ZipCode]],dZipNeighborhood[ZipCode],dZipNeighborhood[Neighborhood])","v":"High Point"}]
["Land Use","2020-06-25","Completed","Completed","98126",{"$f":"_xlfn.XLOOKUP(--fSeattle2020Complaints[[#This Row],[ZipCode]],dZipNeighborhood[ZipCode],dZipNeighborhood[Neighborhood])","v":"High Point"}]
["Weeds","2020-04-03","Compliance Achieved","Completed","98105",{"$f":"_xlfn.XLOOKUP(--fSeattle2020Complaints[[#This Row],[ZipCode]],dZipNeighborhood[ZipCode],dZipNeighborhood[Neighborhood])","v":"University District"}]
["Land Use","2020-03-06","Completed","NOV Issued","98118",{"$f":"_xlfn.XLOOKUP(--fSeattle2020Complaints[[#This Row],[ZipCode]],dZipNeighborhood[ZipCode],dZipNeighborhood[Neighborhood])","v":"Columbia City"}]
["Land Use","2020-08-28","No Access/Unable to Observe","Completed","98103",{"$f":"_xlfn.XLOOKUP(--fSeattle2020Complaints[[#This Row],[ZipCode]],dZipNeighborhood[ZipCode],dZipNeighborhood[Neighborhood])","v":"Greenwood"}]
["Weeds","2020-08-11","Completed","Completed","98106",{"$f":"_xlfn.XLOOKUP(--fSeattle2020Complaints[[#This Row],[ZipCode]],dZipNeighborhood[ZipCode],dZipNeighborhood[Neighborhood])","v":"Delridge"}]
["Land UseVacant Building ,","2020-02-10","Completed","Completed","98103",{"$f":"_xlfn.XLOOKUP(--fSeattle2020Complaints[[#This Row],[ZipCode]],dZipNeighborhood[ZipCode],dZipNeighborhood[Neighborhood])","v":"Greenwood"}]
["Land Use","2020-07-17","Completed","Completed","98118",{"$f":"_xlfn.XLOOKUP(--fSeattle2020Complaints[[#This Row],[ZipCode]],dZipNeighborhood[ZipCode],dZipNeighborhood[Neighborhood])","v":"Columbia City"}]
["Land Use","2020-03-13","Completed","Initiated","98126",{"$f":"_xlfn.XLOOKUP(--fSeattle2020Complaints[[#This Row],[ZipCode]],dZipNeighborhood[ZipCode],dZipNeighborhood[Neighborhood])","v":"High Point"}]
["Land Use","2020-02-18","Completed","Completed","98122",{"$f":"_xlfn.XLOOKUP(--fSeattle2020Complaints[[#This Row],[ZipCode]],dZipNeighborhood[ZipCode],dZipNeighborhood[Neighborhood])","v":"Minor, Central Area"}]
["Construction","2020-02-28","Compliance Achieved","Completed","98118",{"$f":"_xlfn.XLOOKUP(--fSeattle2020Complaints[[#This Row],[ZipCode]],dZipNeighborhood[ZipCode],dZipNeighborhood[Neighborhood])","v":"Columbia City"}]
["Weeds","2020-09-23","Completed","Completed","98118",{"$f":"_xlfn.XLOOKUP(--fSeattle2020Complaints[[#This Row],[ZipCode]],dZipNeighborhood[ZipCode],dZipNeighborhood[Neighborhood])","v":"Columbia City"}]
["Land Use","2020-09-24","Completed","Completed","98107",{"$f":"_xlfn.XLOOKUP(--fSeattle2020Complaints[[#This Row],[ZipCode]],dZipNeighborhood[ZipCode],dZipNeighborhood[Neighborhood])","v":"Ballard"}]
["Land Use","2020-09-15","Completed","Completed","98115",{"$f":"_xlfn.XLOOKUP(--fSeattle2020Complaints[[#This Row],[ZipCode]],dZipNeighborhood[ZipCode],dZipNeighborhood[Neighborhood])","v":"Greenlake"}]
["Land Use","2020-10-20","Completed","Completed","98121",{"$f":"_xlfn.XLOOKUP(--fSeattle2020Complaints[[#This Row],[ZipCode]],dZipNeighborhood[ZipCode],dZipNeighborhood[Neighborhood])","v":"Belltown"}]
["Land Use","2020-01-27","Completed","Completed","98104",{"$f":"_xlfn.XLOOKUP(--fSeattle2020Complaints[[#This Row],[ZipCode]],dZipNeighborhood[ZipCode],dZipNeighborhood[Neighborhood])","v":"International District"}]
["Vacant Building","2020-04-02","Completed","Closed","98133",{"$f":"_xlfn.XLOOKUP(--fSeattle2020Complaints[[#This Row],[ZipCode]],dZipNeighborhood[ZipCode],dZipNeighborhood[Neighborhood])","v":"Shoreline"}]
["Construction , ECA , Tree","2020-06-16","Completed","Completed","98112",{"$f":"_xlfn.XLOOKUP(--fSeattle2020Complaints[[#This Row],[ZipCode]],dZipNeighborhood[ZipCode],dZipNeighborhood[Neighborhood])","v":"Madison Park"}]
["Weeds","2020-06-30","Completed","Completed","98144",{"$f":"_xlfn.XLOOKUP(--fSeattle2020Complaints[[#This Row],[ZipCode]],dZipNeighborhood[ZipCode],dZipNeighborhood[Neighborhood])","v":"Mount Baker"}]
["Land Use","2020-03-30","Completed","Completed","98109",{"$f":"_xlfn.XLOOKUP(--fSeattle2020Complaints[[#This Row],[ZipCode]],dZipNeighborhood[ZipCode],dZipNeighborhood[Neighborhood])","v":"South Lake Union"}]
["Construction","2020-06-09","Completed","Completed","98199",{"$f":"_xlfn.XLOOKUP(--fSeattle2020Complaints[[#This Row],[ZipCode]],dZipNeighborhood[ZipCode],dZipNeighborhood[Neighborhood])","v":"Magnolia"}]
["Land Use","2020-04-13","Completed","Completed","98103",{"$f":"_xlfn.XLOOKUP(--fSeattle2020Complaints[[#This Row],[ZipCode]],dZipNeighborhood[ZipCode],dZipNeighborhood[Neighborhood])","v":"Greenwood"}]
["Emergency , LandLord/Tenant","2020-01-30","Completed","Completed","98125",{"$f":"_xlfn.XLOOKUP(--fSeattle2020Complaints[[#This Row],[ZipCode]],dZipNeighborhood[ZipCode],dZipNeighborhood[Neighborhood])","v":"Northgate"}]
["Land Use","2020-11-10","Completed","Citation Issued","98126",{"$f":"_xlfn.XLOOKUP(--fSeattle2020Complaints[[#This Row],[ZipCode]],dZipNeighborhood[ZipCode],dZipNeighborhood[Neighborhood])","v":"High Point"}]
["Land Use","2020-05-17","Completed","Completed","98125",{"$f":"_xlfn.XLOOKUP(--fSeattle2020Complaints[[#This Row],[ZipCode]],dZipNeighborhood[ZipCode],dZipNeighborhood[Neighborhood])","v":"Northgate"}]
["Weeds","2020-10-16","Completed","Completed","98104",{"$f":"_xlfn.XLOOKUP(--fSeattle2020Complaints[[#This Row],[ZipCode]],dZipNeighborhood[ZipCode],dZipNeighborhood[Neighborhood])","v":"International District"}]
["Emergency , Vacant Building","2020-05-12","Completed","EO Repair Restore Issued","98105",{"$f":"_xlfn.XLOOKUP(--fSeattle2020Complaints[[#This Row],[ZipCode]],dZipNeighborhood[ZipCode],dZipNeighborhood[Neighborhood])","v":"University District"}]
["Construction","2020-07-27","Compliance Achieved","Completed","98118",{"$f":"_xlfn.XLOOKUP(--fSeattle2020Complaints[[#This Row],[ZipCode]],dZipNeighborhood[ZipCode],dZipNeighborhood[Neighborhood])","v":"Columbia City"}]
["Weeds","2020-12-18","Completed","Completed","98126",{"$f":"_xlfn.XLOOKUP(--fSeattle2020Complaints[[#This Row],[ZipCode]],dZipNeighborhood[ZipCode],dZipNeighborhood[Neighborhood])","v":"High Point"}]
["Construction","2020-07-16","Completed","Under Investigation","98118",{"$f":"_xlfn.XLOOKUP(--fSeattle2020Complaints[[#This Row],[ZipCode]],dZipNeighborhood[ZipCode],dZipNeighborhood[Neighborhood])","v":"Columbia City"}]
["Construction","2020-07-21","Completed","NOV Issued","98109",{"$f":"_xlfn.XLOOKUP(--fSeattle2020Complaints[[#This Row],[ZipCode]],dZipNeighborhood[ZipCode],dZipNeighborhood[Neighborhood])","v":"South Lake Union"}]
["Weeds","2020-02-11","Compliance Achieved","Completed","98112",{"$f":"_xlfn.XLOOKUP(--fSeattle2020Complaints[[#This Row],[ZipCode]],dZipNeighborhood[ZipCode],dZipNeighborhood[Neighborhood])","v":"Madison Park"}]
["Land Use","2020-02-27","Completed","Closed","98103",{"$f":"_xlfn.XLOOKUP(--fSeattle2020Complaints[[#This Row],[ZipCode]],dZipNeighborhood[ZipCode],dZipNeighborhood[Neighborhood])","v":"Greenwood"}]
["Emergency , Vacant Building","2020-01-24","Completed","Completed","98105",{"$f":"_xlfn.XLOOKUP(--fSeattle2020Complaints[[#This Row],[ZipCode]],dZipNeighborhood[ZipCode],dZipNeighborhood[Neighborhood])","v":"University District"}]
["Emergency , Vacant Building","2020-04-07","Compliance Achieved","Completed","98115",{"$f":"_xlfn.XLOOKUP(--fSeattle2020Complaints[[#This Row],[ZipCode]],dZipNeighborhood[ZipCode],dZipNeighborhood[Neighborhood])","v":"Greenlake"}]
["Land Use","2020-09-29","Completed","Completed","98144",{"$f":"_xlfn.XLOOKUP(--fSeattle2020Complaints[[#This Row],[ZipCode]],dZipNeighborhood[ZipCode],dZipNeighborhood[Neighborhood])","v":"Mount Baker"}]
["Weeds","2020-03-18","Completed","Compliance Achieved","98106",{"$f":"_xlfn.XLOOKUP(--fSeattle2020Complaints[[#This Row],[ZipCode]],dZipNeighborhood[ZipCode],dZipNeighborhood[Neighborhood])","v":"Delridge"}]
["Vacant Building","2020-03-24","Completed","Completed","98109",{"$f":"_xlfn.XLOOKUP(--fSeattle2020Complaints[[#This Row],[ZipCode]],dZipNeighborhood[ZipCode],dZipNeighborhood[Neighborhood])","v":"South Lake Union"}]
["Construction","2020-10-05","Completed","Completed","98125",{"$f":"_xlfn.XLOOKUP(--fSeattle2020Complaints[[#This Row],[ZipCode]],dZipNeighborhood[ZipCode],dZipNeighborhood[Neighborhood])","v":"Northgate"}]
["Weeds","2020-09-30","Completed","Completed","98108",{"$f":"_xlfn.XLOOKUP(--fSeattle2020Complaints[[#This Row],[ZipCode]],dZipNeighborhood[ZipCode],dZipNeighborhood[Neighborhood])","v":"Rainer Valley"}]
["Construction","2020-07-15","No Access/Unable to Observe","Closed","98101",{"$f":"_xlfn.XLOOKUP(--fSeattle2020Complaints[[#This Row],[ZipCode]],dZipNeighborhood[ZipCode],dZipNeighborhood[Neighborhood])","v":"Seattle"}]
["Weeds","2020-08-19","Completed","Completed","98133",{"$f":"_xlfn.XLOOKUP(--fSeattle2020Complaints[[#This Row],[ZipCode]],dZipNeighborhood[ZipCode],dZipNeighborhood[Neighborhood])","v":"Shoreline"}]
["Land Use","2020-10-05","Completed","Completed","98122",{"$f":"_xlfn.XLOOKUP(--fSeattle2020Complaints[[#This Row],[ZipCode]],dZipNeighborhood[ZipCode],dZipNeighborhood[Neighborhood])","v":"Minor, Central Area"}]
["Land Use","2020-05-08","Completed","Completed","98116",{"$f":"_xlfn.XLOOKUP(--fSeattle2020Complaints[[#This Row],[ZipCode]],dZipNeighborhood[ZipCode],dZipNeighborhood[Neighborhood])","v":"West Seattle"}]
["Construction","2020-12-15","Completed","Completed","98109",{"$f":"_xlfn.XLOOKUP(--fSeattle2020Complaints[[#This Row],[ZipCode]],dZipNeighborhood[ZipCode],dZipNeighborhood[Neighborhood])","v":"South Lake Union"}]
["Construction","2020-09-21","Completed","Completed","98118",{"$f":"_xlfn.XLOOKUP(--fSeattle2020Complaints[[#This Row],[ZipCode]],dZipNeighborhood[ZipCode],dZipNeighborhood[Neighborhood])","v":"Columbia City"}]
["Weeds","2020-01-09","Completed","Completed","98106",{"$f":"_xlfn.XLOOKUP(--fSeattle2020Complaints[[#This Row],[ZipCode]],dZipNeighborhood[ZipCode],dZipNeighborhood[Neighborhood])","v":"Delridge"}]
["Land Use","2020-11-27","Completed","Completed","98102",{"$f":"_xlfn.XLOOKUP(--fSeattle2020Complaints[[#This Row],[ZipCode]],dZipNeighborhood[ZipCode],dZipNeighborhood[Neighborhood])","v":"Capital Hill"}]
["Construction","2020-01-17","Completed","Completed","98115",{"$f":"_xlfn.XLOOKUP(--fSeattle2020Complaints[[#This Row],[ZipCode]],dZipNeighborhood[ZipCode],dZipNeighborhood[Neighborhood])","v":"Greenlake"}]
["Land Use","2020-05-18","Completed","Completed","98108",{"$f":"_xlfn.XLOOKUP(--fSeattle2020Complaints[[#This Row],[ZipCode]],dZipNeighborhood[ZipCode],dZipNeighborhood[Neighborhood])","v":"Rainer Valley"}]
["Tree","2020-05-26","Completed","Completed","98116",{"$f":"_xlfn.XLOOKUP(--fSeattle2020Complaints[[#This Row],[ZipCode]],dZipNeighborhood[ZipCode],dZipNeighborhood[Neighborhood])","v":"West Seattle"}]
["Weeds","2020-06-03","Completed","Completed","98117",{"$f":"_xlfn.XLOOKUP(--fSeattle2020Complaints[[#This Row],[ZipCode]],dZipNeighborhood[ZipCode],dZipNeighborhood[Neighborhood])","v":"Sunset Hill"}]
["Vacant Building","2020-07-13","Completed","Completed","98103",{"$f":"_xlfn.XLOOKUP(--fSeattle2020Complaints[[#This Row],[ZipCode]],dZipNeighborhood[ZipCode],dZipNeighborhood[Neighborhood])","v":"Greenwood"}]
["Construction , Noise","2020-05-11","Completed","Completed","98125",{"$f":"_xlfn.XLOOKUP(--fSeattle2020Complaints[[#This Row],[ZipCode]],dZipNeighborhood[ZipCode],dZipNeighborhood[Neighborhood])","v":"Northgate"}]
["Vacant Building","2020-06-23","Completed","Closed","98103",{"$f":"_xlfn.XLOOKUP(--fSeattle2020Complaints[[#This Row],[ZipCode]],dZipNeighborhood[ZipCode],dZipNeighborhood[Neighborhood])","v":"Greenwood"}]
["Construction","2020-08-26","No Violation","Completed","98133",{"$f":"_xlfn.XLOOKUP(--fSeattle2020Complaints[[#This Row],[ZipCode]],dZipNeighborhood[ZipCode],dZipNeighborhood[Neighborhood])","v":"Shoreline"}]
["Construction","2020-02-14","Completed","Completed","98108",{"$f":"_xlfn.XLOOKUP(--fSeattle2020Complaints[[#This Row],[ZipCode]],dZipNeighborhood[ZipCode],dZipNeighborhood[Neighborhood])","v":"Rainer Valley"}]
["Weeds","2020-06-18","Completed","Completed","98126",{"$f":"_xlfn.XLOOKUP(--fSeattle2020Complaints[[#This Row],[ZipCode]],dZipNeighborhood[ZipCode],dZipNeighborhood[Neighborhood])","v":"High Point"}]
["Land Use","2020-06-12","Completed","Completed","98126",{"$f":"_xlfn.XLOOKUP(--fSeattle2020Complaints[[#This Row],[ZipCode]],dZipNeighborhood[ZipCode],dZipNeighborhood[Neighborhood])","v":"High Point"}]
["Tree","2020-12-09","No Access/Unable to Observe","Closed","98125",{"$f":"_xlfn.XLOOKUP(--fSeattle2020Complaints[[#This Row],[ZipCode]],dZipNeighborhood[ZipCode],dZipNeighborhood[Neighborhood])","v":"Northgate"}]
["Weeds","2020-05-20","Completed","Completed","98108",{"$f":"_xlfn.XLOOKUP(--fSeattle2020Complaints[[#This Row],[ZipCode]],dZipNeighborhood[ZipCode],dZipNeighborhood[Neighborhood])","v":"Rainer Valley"}]
["Land Use","2020-02-04","Completed","NOV Issued","98144",{"$f":"_xlfn.XLOOKUP(--fSeattle2020Complaints[[#This Row],[ZipCode]],dZipNeighborhood[ZipCode],dZipNeighborhood[Neighborhood])","v":"Mount Baker"}]
["Construction","2020-08-18","Completed","Completed","98122",{"$f":"_xlfn.XLOOKUP(--fSeattle2020Complaints[[#This Row],[ZipCode]],dZipNeighborhood[ZipCode],dZipNeighborhood[Neighborhood])","v":"Minor, Central Area"}]
["Land Use","2020-08-24","Completed","Completed","98106",{"$f":"_xlfn.XLOOKUP(--fSeattle2020Complaints[[#This Row],[ZipCode]],dZipNeighborhood[ZipCode],dZipNeighborhood[Neighborhood])","v":"Delridge"}]
["Construction","2020-06-17","Compliance Achieved","Completed","98199",{"$f":"_xlfn.XLOOKUP(--fSeattle2020Complaints[[#This Row],[ZipCode]],dZipNeighborhood[ZipCode],dZipNeighborhood[Neighborhood])","v":"Magnolia"}]
["Weeds","2020-08-05","Completed","Completed","98105",{"$f":"_xlfn.XLOOKUP(--fSeattle2020Complaints[[#This Row],[ZipCode]],dZipNeighborhood[ZipCode],dZipNeighborhood[Neighborhood])","v":"University District"}]
["Land Use","2020-07-29","Completed","Completed","98126",{"$f":"_xlfn.XLOOKUP(--fSeattle2020Complaints[[#This Row],[ZipCode]],dZipNeighborhood[ZipCode],dZipNeighborhood[Neighborhood])","v":"High Point"}]
["Land Use","2020-05-11","Completed","Completed","98106",{"$f":"_xlfn.XLOOKUP(--fSeattle2020Complaints[[#This Row],[ZipCode]],dZipNeighborhood[ZipCode],dZipNeighborhood[Neighborhood])","v":"Delridge"}]
["Land Use","2020-02-18","Completed","Completed","98102",{"$f":"_xlfn.XLOOKUP(--fSeattle2020Complaints[[#This Row],[ZipCode]],dZipNeighborhood[ZipCode],dZipNeighborhood[Neighborhood])","v":"Capital Hill"}]
["Land Use","2020-01-21","Completed","Completed","98118",{"$f":"_xlfn.XLOOKUP(--fSeattle2020Complaints[[#This Row],[ZipCode]],dZipNeighborhood[ZipCode],dZipNeighborhood[Neighborhood])","v":"Columbia City"}]
["Land Use","2020-08-25","Completed","Completed","98118",{"$f":"_xlfn.XLOOKUP(--fSeattle2020Complaints[[#This Row],[ZipCode]],dZipNeighborhood[ZipCode],dZipNeighborhood[Neighborhood])","v":"Columbia City"}]
["Land UseConstruction ,","2020-09-09","Completed","Under Investigation","98103",{"$f":"_xlfn.XLOOKUP(--fSeattle2020Complaints[[#This Row],[ZipCode]],dZipNeighborhood[ZipCode],dZipNeighborhood[Neighborhood])","v":"Greenwood"}]
["Weeds","2020-10-09","Completed","Completed","98103",{"$f":"_xlfn.XLOOKUP(--fSeattle2020Complaints[[#This Row],[ZipCode]],dZipNeighborhood[ZipCode],dZipNeighborhood[Neighborhood])","v":"Greenwood"}]
["Construction","2020-04-15","No Violation","Completed","98102",{"$f":"_xlfn.XLOOKUP(--fSeattle2020Complaints[[#This Row],[ZipCode]],dZipNeighborhood[ZipCode],dZipNeighborhood[Neighborhood])","v":"Capital Hill"}]
["Land Use","2020-02-28","Completed","Completed","98118",{"$f":"_xlfn.XLOOKUP(--fSeattle2020Complaints[[#This Row],[ZipCode]],dZipNeighborhood[ZipCode],dZipNeighborhood[Neighborhood])","v":"Columbia City"}]
["Land Use","2020-03-13","Completed","Completed","98126",{"$f":"_xlfn.XLOOKUP(--fSeattle2020Complaints[[#This Row],[ZipCode]],dZipNeighborhood[ZipCode],dZipNeighborhood[Neighborhood])","v":"High Point"}]
["Land Use","2020-02-10","Completed","Warning","98106",{"$f":"_xlfn.XLOOKUP(--fSeattle2020Complaints[[#This Row],[ZipCode]],dZipNeighborhood[ZipCode],dZipNeighborhood[Neighborhood])","v":"Delridge"}]
["Construction","2020-02-18","Completed","Completed","98112",{"$f":"_xlfn.XLOOKUP(--fSeattle2020Complaints[[#This Row],[ZipCode]],dZipNeighborhood[ZipCode],dZipNeighborhood[Neighborhood])","v":"Madison Park"}]
["Land Use","2020-10-30","Completed","Completed","98107",{"$f":"_xlfn.XLOOKUP(--fSeattle2020Complaints[[#This Row],[ZipCode]],dZipNeighborhood[ZipCode],dZipNeighborhood[Neighborhood])","v":"Ballard"}]
["Construction","2020-10-28","Completed","Under Investigation","98144",{"$f":"_xlfn.XLOOKUP(--fSeattle2020Complaints[[#This Row],[ZipCode]],dZipNeighborhood[ZipCode],dZipNeighborhood[Neighborhood])","v":"Mount Baker"}]
["Weeds","2020-04-29","Completed","Completed","98122",{"$f":"_xlfn.XLOOKUP(--fSeattle2020Complaints[[#This Row],[ZipCode]],dZipNeighborhood[ZipCode],dZipNeighborhood[Neighborhood])","v":"Minor, Central Area"}]
["Land Use","2020-02-10","Completed","Completed","98109",{"$f":"_xlfn.XLOOKUP(--fSeattle2020Complaints[[#This Row],[ZipCode]],dZipNeighborhood[ZipCode],dZipNeighborhood[Neighborhood])","v":"South Lake Union"}]
["Vacant Building","2020-04-27","Completed","Closed","98101",{"$f":"_xlfn.XLOOKUP(--fSeattle2020Complaints[[#This Row],[ZipCode]],dZipNeighborhood[ZipCode],dZipNeighborhood[Neighborhood])","v":"Seattle"}]
["Vacant Building","2020-01-02","Completed","Closed","98103",{"$f":"_xlfn.XLOOKUP(--fSeattle2020Complaints[[#This Row],[ZipCode]],dZipNeighborhood[ZipCode],dZipNeighborhood[Neighborhood])","v":"Greenwood"}]
["Land Use","2020-09-12","Completed","Completed","98107",{"$f":"_xlfn.XLOOKUP(--fSeattle2020Complaints[[#This Row],[ZipCode]],dZipNeighborhood[ZipCode],dZipNeighborhood[Neighborhood])","v":"Ballard"}]
["Land Use","2020-06-29","Completed","Completed","98115",{"$f":"_xlfn.XLOOKUP(--fSeattle2020Complaints[[#This Row],[ZipCode]],dZipNeighborhood[ZipCode],dZipNeighborhood[Neighborhood])","v":"Greenlake"}]
["Tree","2020-10-25","Completed","Completed","98144",{"$f":"_xlfn.XLOOKUP(--fSeattle2020Complaints[[#This Row],[ZipCode]],dZipNeighborhood[ZipCode],dZipNeighborhood[Neighborhood])","v":"Mount Baker"}]
["Land Use","2020-07-25","Completed","Completed","98144",{"$f":"_xlfn.XLOOKUP(--fSeattle2020Complaints[[#This Row],[ZipCode]],dZipNeighborhood[ZipCode],dZipNeighborhood[Neighborhood])","v":"Mount Baker"}]
["Land Use","2020-01-09","Compliance Achieved","Completed","98144",{"$f":"_xlfn.XLOOKUP(--fSeattle2020Complaints[[#This Row],[ZipCode]],dZipNeighborhood[ZipCode],dZipNeighborhood[Neighborhood])","v":"Mount Baker"}]
["Land Use","2020-05-08","Completed","Completed","98178",{"$f":"_xlfn.XLOOKUP(--fSeattle2020Complaints[[#This Row],[ZipCode]],dZipNeighborhood[ZipCode],dZipNeighborhood[Neighborhood])","v":"Skyway"}]
["Land Use","2020-07-13","Completed","Closed","98125",{"$f":"_xlfn.XLOOKUP(--fSeattle2020Complaints[[#This Row],[ZipCode]],dZipNeighborhood[ZipCode],dZipNeighborhood[Neighborhood])","v":"Northgate"}]
["Weeds","2020-02-24","Compliance Achieved","Completed","98199",{"$f":"_xlfn.XLOOKUP(--fSeattle2020Complaints[[#This Row],[ZipCode]],dZipNeighborhood[ZipCode],dZipNeighborhood[Neighborhood])","v":"Magnolia"}]
["Vacant Building","2020-01-23","Completed","Completed","98199",{"$f":"_xlfn.XLOOKUP(--fSeattle2020Complaints[[#This Row],[ZipCode]],dZipNeighborhood[ZipCode],dZipNeighborhood[Neighborhood])","v":"Magnolia"}]
["Land Use","2020-03-04","Completed","Completed","98108",{"$f":"_xlfn.XLOOKUP(--fSeattle2020Complaints[[#This Row],[ZipCode]],dZipNeighborhood[ZipCode],dZipNeighborhood[Neighborhood])","v":"Rainer Valley"}]
["Construction","2020-12-30","Completed","Completed","98119",{"$f":"_xlfn.XLOOKUP(--fSeattle2020Complaints[[#This Row],[ZipCode]],dZipNeighborhood[ZipCode],dZipNeighborhood[Neighborhood])","v":"Queen Anne"}]
["Land Use","2020-04-13","Completed","Completed","98106",{"$f":"_xlfn.XLOOKUP(--fSeattle2020Complaints[[#This Row],[ZipCode]],dZipNeighborhood[ZipCode],dZipNeighborhood[Neighborhood])","v":"Delridge"}]
["Weeds","2020-12-28","Completed","Completed","98144",{"$f":"_xlfn.XLOOKUP(--fSeattle2020Complaints[[#This Row],[ZipCode]],dZipNeighborhood[ZipCode],dZipNeighborhood[Neighborhood])","v":"Mount Baker"}]
["Vacant Building","2020-01-21","Completed","Closed","98117",{"$f":"_xlfn.XLOOKUP(--fSeattle2020Complaints[[#This Row],[ZipCode]],dZipNeighborhood[ZipCode],dZipNeighborhood[Neighborhood])","v":"Sunset Hill"}]
["Weeds","2020-09-10","Completed","Completed","98112",{"$f":"_xlfn.XLOOKUP(--fSeattle2020Complaints[[#This Row],[ZipCode]],dZipNeighborhood[ZipCode],dZipNeighborhood[Neighborhood])","v":"Madison Park"}]
["Construction","2020-01-30","Completed","Completed","98178",{"$f":"_xlfn.XLOOKUP(--fSeattle2020Complaints[[#This Row],[ZipCode]],dZipNeighborhood[ZipCode],dZipNeighborhood[Neighborhood])","v":"Skyway"}]
["Emergency , Vacant Building","2020-03-03","Compliance Achieved","Completed","98118",{"$f":"_xlfn.XLOOKUP(--fSeattle2020Complaints[[#This Row],[ZipCode]],dZipNeighborhood[ZipCode],dZipNeighborhood[Neighborhood])","v":"Columbia City"}]
["Land Use","2020-01-09","Completed","Completed","98108",{"$f":"_xlfn.XLOOKUP(--fSeattle2020Complaints[[#This Row],[ZipCode]],dZipNeighborhood[ZipCode],dZipNeighborhood[Neighborhood])","v":"Rainer Valley"}]
["Construction","2020-01-21","Completed","Completed","98122",{"$f":"_xlfn.XLOOKUP(--fSeattle2020Complaints[[#This Row],[ZipCode]],dZipNeighborhood[ZipCode],dZipNeighborhood[Neighborhood])","v":"Minor, Central Area"}]
["Construction","2020-12-07","Completed","Completed","98122",{"$f":"_xlfn.XLOOKUP(--fSeattle2020Complaints[[#This Row],[ZipCode]],dZipNeighborhood[ZipCode],dZipNeighborhood[Neighborhood])","v":"Minor, Central Area"}]
["Vacant Building","2020-09-20","Completed","Closed","98125",{"$f":"_xlfn.XLOOKUP(--fSeattle2020Complaints[[#This Row],[ZipCode]],dZipNeighborhood[ZipCode],dZipNeighborhood[Neighborhood])","v":"Northgate"}]
["Weeds","2020-08-21","Completed","Completed","98115",{"$f":"_xlfn.XLOOKUP(--fSeattle2020Complaints[[#This Row],[ZipCode]],dZipNeighborhood[ZipCode],dZipNeighborhood[Neighborhood])","v":"Greenlake"}]
["Land Use","2020-01-10","Compliance Achieved","Completed","98126",{"$f":"_xlfn.XLOOKUP(--fSeattle2020Complaints[[#This Row],[ZipCode]],dZipNeighborhood[ZipCode],dZipNeighborhood[Neighborhood])","v":"High Point"}]
["Weeds","2020-10-16","Completed","Completed","98108",{"$f":"_xlfn.XLOOKUP(--fSeattle2020Complaints[[#This Row],[ZipCode]],dZipNeighborhood[ZipCode],dZipNeighborhood[Neighborhood])","v":"Rainer Valley"}]
["Noise","2020-07-22","Completed","Completed","98107",{"$f":"_xlfn.XLOOKUP(--fSeattle2020Complaints[[#This Row],[ZipCode]],dZipNeighborhood[ZipCode],dZipNeighborhood[Neighborhood])","v":"Ballard"}]
["Weeds","2020-08-27","Completed","Completed","98101",{"$f":"_xlfn.XLOOKUP(--fSeattle2020Complaints[[#This Row],[ZipCode]],dZipNeighborhood[ZipCode],dZipNeighborhood[Neighborhood])","v":"Seattle"}]
["Weeds","2020-06-13","Completed","Completed","98118",{"$f":"_xlfn.XLOOKUP(--fSeattle2020Complaints[[#This Row],[ZipCode]],dZipNeighborhood[ZipCode],dZipNeighborhood[Neighborhood])","v":"Columbia City"}]
["Construction","2020-07-17","Completed","Completed","98109",{"$f":"_xlfn.XLOOKUP(--fSeattle2020Complaints[[#This Row],[ZipCode]],dZipNeighborhood[ZipCode],dZipNeighborhood[Neighborhood])","v":"South Lake Union"}]
["Land Use","2020-10-22","Completed","Completed","98125",{"$f":"_xlfn.XLOOKUP(--fSeattle2020Complaints[[#This Row],[ZipCode]],dZipNeighborhood[ZipCode],dZipNeighborhood[Neighborhood])","v":"Northgate"}]
["Land Use","2020-02-11","Compliance Achieved","Completed","98115",{"$f":"_xlfn.XLOOKUP(--fSeattle2020Complaints[[#This Row],[ZipCode]],dZipNeighborhood[ZipCode],dZipNeighborhood[Neighborhood])","v":"Greenlake"}]
["Weeds","2020-04-22","Completed","Completed","98136",{"$f":"_xlfn.XLOOKUP(--fSeattle2020Complaints[[#This Row],[ZipCode]],dZipNeighborhood[ZipCode],dZipNeighborhood[Neighborhood])","v":"Seaview"}]
["Vacant Building","2020-08-03","Admin Closure","Completed","98116",{"$f":"_xlfn.XLOOKUP(--fSeattle2020Complaints[[#This Row],[ZipCode]],dZipNeighborhood[ZipCode],dZipNeighborhood[Neighborhood])","v":"West Seattle"}]
["Construction","2020-05-03","Completed","Completed","98107",{"$f":"_xlfn.XLOOKUP(--fSeattle2020Complaints[[#This Row],[ZipCode]],dZipNeighborhood[ZipCode],dZipNeighborhood[Neighborhood])","v":"Ballard"}]
["Land UseVacant Building ,","2020-12-09","Completed","Completed","98115",{"$f":"_xlfn.XLOOKUP(--fSeattle2020Complaints[[#This Row],[ZipCode]],dZipNeighborhood[ZipCode],dZipNeighborhood[Neighborhood])","v":"Greenlake"}]
["Weeds","2020-02-28","Completed","Completed","98177",{"$f":"_xlfn.XLOOKUP(--fSeattle2020Complaints[[#This Row],[ZipCode]],dZipNeighborhood[ZipCode],dZipNeighborhood[Neighborhood])","v":"Richmond Beach"}]
["Vacant Building","2020-08-14","Completed","Completed","98105",{"$f":"_xlfn.XLOOKUP(--fSeattle2020Complaints[[#This Row],[ZipCode]],dZipNeighborhood[ZipCode],dZipNeighborhood[Neighborhood])","v":"University District"}]
["Land Use","2020-01-03","Completed","Completed","98178",{"$f":"_xlfn.XLOOKUP(--fSeattle2020Complaints[[#This Row],[ZipCode]],dZipNeighborhood[ZipCode],dZipNeighborhood[Neighborhood])","v":"Skyway"}]
["Land Use","2020-07-21","Completed","Completed","98126",{"$f":"_xlfn.XLOOKUP(--fSeattle2020Complaints[[#This Row],[ZipCode]],dZipNeighborhood[ZipCode],dZipNeighborhood[Neighborhood])","v":"High Point"}]
["Shoreline","2020-08-12","Completed","Completed","98199",{"$f":"_xlfn.XLOOKUP(--fSeattle2020Complaints[[#This Row],[ZipCode]],dZipNeighborhood[ZipCode],dZipNeighborhood[Neighborhood])","v":"Magnolia"}]
["Land UseWeeds ,","2020-07-24","Completed","Completed","98122",{"$f":"_xlfn.XLOOKUP(--fSeattle2020Complaints[[#This Row],[ZipCode]],dZipNeighborhood[ZipCode],dZipNeighborhood[Neighborhood])","v":"Minor, Central Area"}]
["Construction","2020-02-24","Completed","Completed","98146",{"$f":"_xlfn.XLOOKUP(--fSeattle2020Complaints[[#This Row],[ZipCode]],dZipNeighborhood[ZipCode],dZipNeighborhood[Neighborhood])","v":"Shorewood, White Center"}]
["Land Use","2020-01-10","Completed","Completed","98105",{"$f":"_xlfn.XLOOKUP(--fSeattle2020Complaints[[#This Row],[ZipCode]],dZipNeighborhood[ZipCode],dZipNeighborhood[Neighborhood])","v":"University District"}]
["Construction","2020-08-30","Completed","Completed","98102",{"$f":"_xlfn.XLOOKUP(--fSeattle2020Complaints[[#This Row],[ZipCode]],dZipNeighborhood[ZipCode],dZipNeighborhood[Neighborhood])","v":"Capital Hill"}]
["Vacant Building","2020-09-24","Completed","Completed","98107",{"$f":"_xlfn.XLOOKUP(--fSeattle2020Complaints[[#This Row],[ZipCode]],dZipNeighborhood[ZipCode],dZipNeighborhood[Neighborhood])","v":"Ballard"}]
["Construction","2020-01-12","Completed","Completed","98199",{"$f":"_xlfn.XLOOKUP(--fSeattle2020Complaints[[#This Row],[ZipCode]],dZipNeighborhood[ZipCode],dZipNeighborhood[Neighborhood])","v":"Magnolia"}]
["Land Use","2020-06-26","Completed","Completed","98121",{"$f":"_xlfn.XLOOKUP(--fSeattle2020Complaints[[#This Row],[ZipCode]],dZipNeighborhood[ZipCode],dZipNeighborhood[Neighborhood])","v":"Belltown"}]
["LandLord/Tenant","2020-11-20","Completed","Completed","98115",{"$f":"_xlfn.XLOOKUP(--fSeattle2020Complaints[[#This Row],[ZipCode]],dZipNeighborhood[ZipCode],dZipNeighborhood[Neighborhood])","v":"Greenlake"}]
["LandLord/Tenant","2020-02-24","Completed","Completed","98199",{"$f":"_xlfn.XLOOKUP(--fSeattle2020Complaints[[#This Row],[ZipCode]],dZipNeighborhood[ZipCode],dZipNeighborhood[Neighborhood])","v":"Magnolia"}]
["Construction","2020-02-10","Completed","Completed","98125",{"$f":"_xlfn.XLOOKUP(--fSeattle2020Complaints[[#This Row],[ZipCode]],dZipNeighborhood[ZipCode],dZipNeighborhood[Neighborhood])","v":"Northgate"}]
["Land Use","2020-08-11","Completed","Completed","98106",{"$f":"_xlfn.XLOOKUP(--fSeattle2020Complaints[[#This Row],[ZipCode]],dZipNeighborhood[ZipCode],dZipNeighborhood[Neighborhood])","v":"Delridge"}]
["Land Use","2020-04-21","Completed","Closed","98109",{"$f":"_xlfn.XLOOKUP(--fSeattle2020Complaints[[#This Row],[ZipCode]],dZipNeighborhood[ZipCode],dZipNeighborhood[Neighborhood])","v":"South Lake Union"}]
["Construction","2020-08-20","Completed","Completed","98144",{"$f":"_xlfn.XLOOKUP(--fSeattle2020Complaints[[#This Row],[ZipCode]],dZipNeighborhood[ZipCode],dZipNeighborhood[Neighborhood])","v":"Mount Baker"}]
["Construction","2020-01-16","Completed","Completed","98108",{"$f":"_xlfn.XLOOKUP(--fSeattle2020Complaints[[#This Row],[ZipCode]],dZipNeighborhood[ZipCode],dZipNeighborhood[Neighborhood])","v":"Rainer Valley"}]
["Land UseTree ,","2020-07-24","Completed","Completed","98106",{"$f":"_xlfn.XLOOKUP(--fSeattle2020Complaints[[#This Row],[ZipCode]],dZipNeighborhood[ZipCode],dZipNeighborhood[Neighborhood])","v":"Delridge"}]
["Emergency , Vacant Building","2020-05-12","Completed","EO Repair Restore Issued","98105",{"$f":"_xlfn.XLOOKUP(--fSeattle2020Complaints[[#This Row],[ZipCode]],dZipNeighborhood[ZipCode],dZipNeighborhood[Neighborhood])","v":"University District"}]
["Weeds","2020-03-10","Completed","Closed","98102",{"$f":"_xlfn.XLOOKUP(--fSeattle2020Complaints[[#This Row],[ZipCode]],dZipNeighborhood[ZipCode],dZipNeighborhood[Neighborhood])","v":"Capital Hill"}]
["Vacant Building","2020-02-04","Completed","Completed","98107",{"$f":"_xlfn.XLOOKUP(--fSeattle2020Complaints[[#This Row],[ZipCode]],dZipNeighborhood[ZipCode],dZipNeighborhood[Neighborhood])","v":"Ballard"}]
["Land Use","2020-06-26","Completed","Completed","98125",{"$f":"_xlfn.XLOOKUP(--fSeattle2020Complaints[[#This Row],[ZipCode]],dZipNeighborhood[ZipCode],dZipNeighborhood[Neighborhood])","v":"Northgate"}]
["Land Use","2020-06-09","Completed","Completed","98108",{"$f":"_xlfn.XLOOKUP(--fSeattle2020Complaints[[#This Row],[ZipCode]],dZipNeighborhood[ZipCode],dZipNeighborhood[Neighborhood])","v":"Rainer Valley"}]
["Construction","2020-02-04","Completed","NOV Issued","98144",{"$f":"_xlfn.XLOOKUP(--fSeattle2020Complaints[[#This Row],[ZipCode]],dZipNeighborhood[ZipCode],dZipNeighborhood[Neighborhood])","v":"Mount Baker"}]
["Construction","2020-12-09","Completed","Completed","98105",{"$f":"_xlfn.XLOOKUP(--fSeattle2020Complaints[[#This Row],[ZipCode]],dZipNeighborhood[ZipCode],dZipNeighborhood[Neighborhood])","v":"University District"}]
["Weeds","2020-12-21","Completed","Completed","98106",{"$f":"_xlfn.XLOOKUP(--fSeattle2020Complaints[[#This Row],[ZipCode]],dZipNeighborhood[ZipCode],dZipNeighborhood[Neighborhood])","v":"Delridge"}]
["Construction , Tree","2020-06-19","Completed","Completed","98199",{"$f":"_xlfn.XLOOKUP(--fSeattle2020Complaints[[#This Row],[ZipCode]],dZipNeighborhood[ZipCode],dZipNeighborhood[Neighborhood])","v":"Magnolia"}]
["LandLord/Tenant","2020-03-19","Completed","Completed","98144",{"$f":"_xlfn.XLOOKUP(--fSeattle2020Complaints[[#This Row],[ZipCode]],dZipNeighborhood[ZipCode],dZipNeighborhood[Neighborhood])","v":"Mount Baker"}]
["Vacant Building","2020-12-30","Completed","Closed","98105",{"$f":"_xlfn.XLOOKUP(--fSeattle2020Complaints[[#This Row],[ZipCode]],dZipNeighborhood[ZipCode],dZipNeighborhood[Neighborhood])","v":"University District"}]
["Emergency , Vacant Building","2020-08-20","Completed","Completed","98105",{"$f":"_xlfn.XLOOKUP(--fSeattle2020Complaints[[#This Row],[ZipCode]],dZipNeighborhood[ZipCode],dZipNeighborhood[Neighborhood])","v":"University District"}]
["Weeds","2020-07-06","Compliance Achieved","Completed","98116",{"$f":"_xlfn.XLOOKUP(--fSeattle2020Complaints[[#This Row],[ZipCode]],dZipNeighborhood[ZipCode],dZipNeighborhood[Neighborhood])","v":"West Seattle"}]
["Land UseConstruction ,","2020-08-12","Completed","Completed","98103",{"$f":"_xlfn.XLOOKUP(--fSeattle2020Complaints[[#This Row],[ZipCode]],dZipNeighborhood[ZipCode],dZipNeighborhood[Neighborhood])","v":"Greenwood"}]
["Emergency , Vacant Building","2020-05-07","Completed","Completed","98105",{"$f":"_xlfn.XLOOKUP(--fSeattle2020Complaints[[#This Row],[ZipCode]],dZipNeighborhood[ZipCode],dZipNeighborhood[Neighborhood])","v":"University District"}]
["Land Use","2020-01-22","Compliance Achieved","Completed","98178",{"$f":"_xlfn.XLOOKUP(--fSeattle2020Complaints[[#This Row],[ZipCode]],dZipNeighborhood[ZipCode],dZipNeighborhood[Neighborhood])","v":"Skyway"}]
["Weeds","2020-07-11","Completed","Completed","98199",{"$f":"_xlfn.XLOOKUP(--fSeattle2020Complaints[[#This Row],[ZipCode]],dZipNeighborhood[ZipCode],dZipNeighborhood[Neighborhood])","v":"Magnolia"}]
["Land Use","2020-02-07","Completed","Completed","98119",{"$f":"_xlfn.XLOOKUP(--fSeattle2020Complaints[[#This Row],[ZipCode]],dZipNeighborhood[ZipCode],dZipNeighborhood[Neighborhood])","v":"Queen Anne"}]
["Weeds","2020-12-15","Completed","Completed","98105",{"$f":"_xlfn.XLOOKUP(--fSeattle2020Complaints[[#This Row],[ZipCode]],dZipNeighborhood[ZipCode],dZipNeighborhood[Neighborhood])","v":"University District"}]
["Tree","2020-07-23","Completed","Completed","98199",{"$f":"_xlfn.XLOOKUP(--fSeattle2020Complaints[[#This Row],[ZipCode]],dZipNeighborhood[ZipCode],dZipNeighborhood[Neighborhood])","v":"Magnolia"}]
["Land Use","2020-08-26","Completed","Completed","98117",{"$f":"_xlfn.XLOOKUP(--fSeattle2020Complaints[[#This Row],[ZipCode]],dZipNeighborhood[ZipCode],dZipNeighborhood[Neighborhood])","v":"Sunset Hill"}]
["Construction","2020-10-07","Completed","Completed","98108",{"$f":"_xlfn.XLOOKUP(--fSeattle2020Complaints[[#This Row],[ZipCode]],dZipNeighborhood[ZipCode],dZipNeighborhood[Neighborhood])","v":"Rainer Valley"}]
["Land Use","2020-01-29","Compliance Achieved","Completed","98106",{"$f":"_xlfn.XLOOKUP(--fSeattle2020Complaints[[#This Row],[ZipCode]],dZipNeighborhood[ZipCode],dZipNeighborhood[Neighborhood])","v":"Delridge"}]
["Construction","2020-08-02","Completed","Completed","98116",{"$f":"_xlfn.XLOOKUP(--fSeattle2020Complaints[[#This Row],[ZipCode]],dZipNeighborhood[ZipCode],dZipNeighborhood[Neighborhood])","v":"West Seattle"}]
["Weeds","2020-03-10","Compliance Achieved","Compliance Achieved","98103",{"$f":"_xlfn.XLOOKUP(--fSeattle2020Complaints[[#This Row],[ZipCode]],dZipNeighborhood[ZipCode],dZipNeighborhood[Neighborhood])","v":"Greenwood"}]
["Vacant Building","2020-07-10","Completed","Initiated","98106",{"$f":"_xlfn.XLOOKUP(--fSeattle2020Complaints[[#This Row],[ZipCode]],dZipNeighborhood[ZipCode],dZipNeighborhood[Neighborhood])","v":"Delridge"}]
["Land Use","2020-01-29","Completed","Completed","98109",{"$f":"_xlfn.XLOOKUP(--fSeattle2020Complaints[[#This Row],[ZipCode]],dZipNeighborhood[ZipCode],dZipNeighborhood[Neighborhood])","v":"South Lake Union"}]
["Weeds","2020-07-08","Completed","Completed","98112",{"$f":"_xlfn.XLOOKUP(--fSeattle2020Complaints[[#This Row],[ZipCode]],dZipNeighborhood[ZipCode],dZipNeighborhood[Neighborhood])","v":"Madison Park"}]
["Weeds","2020-01-30","Completed","Completed","98133",{"$f":"_xlfn.XLOOKUP(--fSeattle2020Complaints[[#This Row],[ZipCode]],dZipNeighborhood[ZipCode],dZipNeighborhood[Neighborhood])","v":"Shoreline"}]
["Shoreline","2020-08-24","Completed","Completed","98178",{"$f":"_xlfn.XLOOKUP(--fSeattle2020Complaints[[#This Row],[ZipCode]],dZipNeighborhood[ZipCode],dZipNeighborhood[Neighborhood])","v":"Skyway"}]
["Construction","2020-02-03","Completed","Completed","98116",{"$f":"_xlfn.XLOOKUP(--fSeattle2020Complaints[[#This Row],[ZipCode]],dZipNeighborhood[ZipCode],dZipNeighborhood[Neighborhood])","v":"West Seattle"}]
["Land Use","2020-02-24","Completed","Completed","98103",{"$f":"_xlfn.XLOOKUP(--fSeattle2020Complaints[[#This Row],[ZipCode]],dZipNeighborhood[ZipCode],dZipNeighborhood[Neighborhood])","v":"Greenwood"}]
["Emergency , Vacant Building","2020-02-25","Completed","Closed","98199",{"$f":"_xlfn.XLOOKUP(--fSeattle2020Complaints[[#This Row],[ZipCode]],dZipNeighborhood[ZipCode],dZipNeighborhood[Neighborhood])","v":"Magnolia"}]
["Land Use","2020-09-30","Completed","Completed","98122",{"$f":"_xlfn.XLOOKUP(--fSeattle2020Complaints[[#This Row],[ZipCode]],dZipNeighborhood[ZipCode],dZipNeighborhood[Neighborhood])","v":"Minor, Central Area"}]
["Land Use","2020-07-06","Completed","Completed","98108",{"$f":"_xlfn.XLOOKUP(--fSeattle2020Complaints[[#This Row],[ZipCode]],dZipNeighborhood[ZipCode],dZipNeighborhood[Neighborhood])","v":"Rainer Valley"}]
["Emergency","2020-02-20","Completed","EO Repair Restore Issued","98106",{"$f":"_xlfn.XLOOKUP(--fSeattle2020Complaints[[#This Row],[ZipCode]],dZipNeighborhood[ZipCode],dZipNeighborhood[Neighborhood])","v":"Delridge"}]
["Land Use","2020-04-01","Completed","Warning","98116",{"$f":"_xlfn.XLOOKUP(--fSeattle2020Complaints[[#This Row],[ZipCode]],dZipNeighborhood[ZipCode],dZipNeighborhood[Neighborhood])","v":"West Seattle"}]
["Weeds","2020-03-11","Completed","Warning","98109",{"$f":"_xlfn.XLOOKUP(--fSeattle2020Complaints[[#This Row],[ZipCode]],dZipNeighborhood[ZipCode],dZipNeighborhood[Neighborhood])","v":"South Lake Union"}]
["Land Use","2020-07-07","Completed","Completed","98101",{"$f":"_xlfn.XLOOKUP(--fSeattle2020Complaints[[#This Row],[ZipCode]],dZipNeighborhood[ZipCode],dZipNeighborhood[Neighborhood])","v":"Seattle"}]
["Emergency , Vacant Building","2020-07-31","Completed","Completed","98118",{"$f":"_xlfn.XLOOKUP(--fSeattle2020Complaints[[#This Row],[ZipCode]],dZipNeighborhood[ZipCode],dZipNeighborhood[Neighborhood])","v":"Columbia City"}]
["Weeds","2020-05-12","Completed","Completed","98116",{"$f":"_xlfn.XLOOKUP(--fSeattle2020Complaints[[#This Row],[ZipCode]],dZipNeighborhood[ZipCode],dZipNeighborhood[Neighborhood])","v":"West Seattle"}]
["Construction","2020-02-03","Compliance Achieved","Completed","98144",{"$f":"_xlfn.XLOOKUP(--fSeattle2020Complaints[[#This Row],[ZipCode]],dZipNeighborhood[ZipCode],dZipNeighborhood[Neighborhood])","v":"Mount Baker"}]
["Land UseNoise ,","2020-06-12","Completed","Completed","98108",{"$f":"_xlfn.XLOOKUP(--fSeattle2020Complaints[[#This Row],[ZipCode]],dZipNeighborhood[ZipCode],dZipNeighborhood[Neighborhood])","v":"Rainer Valley"}]
["Construction","2020-11-17","Completed","Completed","98105",{"$f":"_xlfn.XLOOKUP(--fSeattle2020Complaints[[#This Row],[ZipCode]],dZipNeighborhood[ZipCode],dZipNeighborhood[Neighborhood])","v":"University District"}]
["Land Use","2020-06-24","No Access/Unable to Observe","Completed","98103",{"$f":"_xlfn.XLOOKUP(--fSeattle2020Complaints[[#This Row],[ZipCode]],dZipNeighborhood[ZipCode],dZipNeighborhood[Neighborhood])","v":"Greenwood"}]
["Vacant Building","2020-05-11","Completed","Completed","98103",{"$f":"_xlfn.XLOOKUP(--fSeattle2020Complaints[[#This Row],[ZipCode]],dZipNeighborhood[ZipCode],dZipNeighborhood[Neighborhood])","v":"Greenwood"}]
["Vacant Building","2020-12-20","Completed","Completed","98115",{"$f":"_xlfn.XLOOKUP(--fSeattle2020Complaints[[#This Row],[ZipCode]],dZipNeighborhood[ZipCode],dZipNeighborhood[Neighborhood])","v":"Greenlake"}]
["Construction","2020-05-29","Completed","Completed","98125",{"$f":"_xlfn.XLOOKUP(--fSeattle2020Complaints[[#This Row],[ZipCode]],dZipNeighborhood[ZipCode],dZipNeighborhood[Neighborhood])","v":"Northgate"}]
["Land Use","2020-02-17","Completed","Completed","98116",{"$f":"_xlfn.XLOOKUP(--fSeattle2020Complaints[[#This Row],[ZipCode]],dZipNeighborhood[ZipCode],dZipNeighborhood[Neighborhood])","v":"West Seattle"}]
["Weeds","2020-05-07","Completed","Completed","98199",{"$f":"_xlfn.XLOOKUP(--fSeattle2020Complaints[[#This Row],[ZipCode]],dZipNeighborhood[ZipCode],dZipNeighborhood[Neighborhood])","v":"Magnolia"}]
["Construction , ECA","2020-04-21","Completed","NOV Issued","98102",{"$f":"_xlfn.XLOOKUP(--fSeattle2020Complaints[[#This Row],[ZipCode]],dZipNeighborhood[ZipCode],dZipNeighborhood[Neighborhood])","v":"Capital Hill"}]
["Construction","2020-03-10","Compliance Achieved","Completed","98104",{"$f":"_xlfn.XLOOKUP(--fSeattle2020Complaints[[#This Row],[ZipCode]],dZipNeighborhood[ZipCode],dZipNeighborhood[Neighborhood])","v":"International District"}]
["Land Use","2020-03-26","Completed","Completed","98112",{"$f":"_xlfn.XLOOKUP(--fSeattle2020Complaints[[#This Row],[ZipCode]],dZipNeighborhood[ZipCode],dZipNeighborhood[Neighborhood])","v":"Madison Park"}]
["Land Use","2020-08-10","Completed","Completed","98103",{"$f":"_xlfn.XLOOKUP(--fSeattle2020Complaints[[#This Row],[ZipCode]],dZipNeighborhood[ZipCode],dZipNeighborhood[Neighborhood])","v":"Greenwood"}]
["Weeds","2020-09-25","Completed","Completed","98115",{"$f":"_xlfn.XLOOKUP(--fSeattle2020Complaints[[#This Row],[ZipCode]],dZipNeighborhood[ZipCode],dZipNeighborhood[Neighborhood])","v":"Greenlake"}]
["Land Use","2020-08-12","Completed","Completed","98105",{"$f":"_xlfn.XLOOKUP(--fSeattle2020Complaints[[#This Row],[ZipCode]],dZipNeighborhood[ZipCode],dZipNeighborhood[Neighborhood])","v":"University District"}]
["Construction","2020-07-08","Completed","Completed","98133",{"$f":"_xlfn.XLOOKUP(--fSeattle2020Complaints[[#This Row],[ZipCode]],dZipNeighborhood[ZipCode],dZipNeighborhood[Neighborhood])","v":"Shoreline"}]
["Tree","2020-03-01","Completed","Completed","98115",{"$f":"_xlfn.XLOOKUP(--fSeattle2020Complaints[[#This Row],[ZipCode]],dZipNeighborhood[ZipCode],dZipNeighborhood[Neighborhood])","v":"Greenlake"}]
["Land Use","2020-08-03","Completed","Completed","98104",{"$f":"_xlfn.XLOOKUP(--fSeattle2020Complaints[[#This Row],[ZipCode]],dZipNeighborhood[ZipCode],dZipNeighborhood[Neighborhood])","v":"International District"}]
["Construction","2020-01-03","Completed","Completed","98107",{"$f":"_xlfn.XLOOKUP(--fSeattle2020Complaints[[#This Row],[ZipCode]],dZipNeighborhood[ZipCode],dZipNeighborhood[Neighborhood])","v":"Ballard"}]
["Construction","2020-08-14","Completed","Completed","98116",{"$f":"_xlfn.XLOOKUP(--fSeattle2020Complaints[[#This Row],[ZipCode]],dZipNeighborhood[ZipCode],dZipNeighborhood[Neighborhood])","v":"West Seattle"}]
["Vacant Building","2020-02-13","Completed","Closed","98107",{"$f":"_xlfn.XLOOKUP(--fSeattle2020Complaints[[#This Row],[ZipCode]],dZipNeighborhood[ZipCode],dZipNeighborhood[Neighborhood])","v":"Ballard"}]
["Land Use","2020-02-05","Compliance Achieved","Completed","98115",{"$f":"_xlfn.XLOOKUP(--fSeattle2020Complaints[[#This Row],[ZipCode]],dZipNeighborhood[ZipCode],dZipNeighborhood[Neighborhood])","v":"Greenlake"}]
["Construction","2020-03-24","Completed","Closed","98144",{"$f":"_xlfn.XLOOKUP(--fSeattle2020Complaints[[#This Row],[ZipCode]],dZipNeighborhood[ZipCode],dZipNeighborhood[Neighborhood])","v":"Mount Baker"}]
["Noise","2020-01-31","No Violation","Completed","98117",{"$f":"_xlfn.XLOOKUP(--fSeattle2020Complaints[[#This Row],[ZipCode]],dZipNeighborhood[ZipCode],dZipNeighborhood[Neighborhood])","v":"Sunset Hill"}]
["Construction","2020-10-28","Completed","Completed","98103",{"$f":"_xlfn.XLOOKUP(--fSeattle2020Complaints[[#This Row],[ZipCode]],dZipNeighborhood[ZipCode],dZipNeighborhood[Neighborhood])","v":"Greenwood"}]
["LandLord/Tenant","2020-09-25","Completed","Under Investigation","98115",{"$f":"_xlfn.XLOOKUP(--fSeattle2020Complaints[[#This Row],[ZipCode]],dZipNeighborhood[ZipCode],dZipNeighborhood[Neighborhood])","v":"Greenlake"}]
["Construction","2020-02-11","Completed","Completed","98199",{"$f":"_xlfn.XLOOKUP(--fSeattle2020Complaints[[#This Row],[ZipCode]],dZipNeighborhood[ZipCode],dZipNeighborhood[Neighborhood])","v":"Magnolia"}]
["Weeds","2020-06-26","Completed","Completed","98144",{"$f":"_xlfn.XLOOKUP(--fSeattle2020Complaints[[#This Row],[ZipCode]],dZipNeighborhood[ZipCode],dZipNeighborhood[Neighborhood])","v":"Mount Baker"}]
["LandLord/Tenant","2020-09-29","Completed","Under Investigation","98126",{"$f":"_xlfn.XLOOKUP(--fSeattle2020Complaints[[#This Row],[ZipCode]],dZipNeighborhood[ZipCode],dZipNeighborhood[Neighborhood])","v":"High Point"}]
["Weeds","2020-01-29","No Violation","Completed","98122",{"$f":"_xlfn.XLOOKUP(--fSeattle2020Complaints[[#This Row],[ZipCode]],dZipNeighborhood[ZipCode],dZipNeighborhood[Neighborhood])","v":"Minor, Central Area"}]
["Land Use","2020-02-07","Completed","Completed","98118",{"$f":"_xlfn.XLOOKUP(--fSeattle2020Complaints[[#This Row],[ZipCode]],dZipNeighborhood[ZipCode],dZipNeighborhood[Neighborhood])","v":"Columbia City"}]
["Emergency , Vacant Building","2020-05-21","Completed","Completed","98119",{"$f":"_xlfn.XLOOKUP(--fSeattle2020Complaints[[#This Row],[ZipCode]],dZipNeighborhood[ZipCode],dZipNeighborhood[Neighborhood])","v":"Queen Anne"}]
["Land Use","2020-07-07","Completed","Completed","98115",{"$f":"_xlfn.XLOOKUP(--fSeattle2020Complaints[[#This Row],[ZipCode]],dZipNeighborhood[ZipCode],dZipNeighborhood[Neighborhood])","v":"Greenlake"}]
["Land Use","2020-04-08","Completed","Completed","98103",{"$f":"_xlfn.XLOOKUP(--fSeattle2020Complaints[[#This Row],[ZipCode]],dZipNeighborhood[ZipCode],dZipNeighborhood[Neighborhood])","v":"Greenwood"}]
["Vacant Building","2020-11-13","Completed","Completed","98115",{"$f":"_xlfn.XLOOKUP(--fSeattle2020Complaints[[#This Row],[ZipCode]],dZipNeighborhood[ZipCode],dZipNeighborhood[Neighborhood])","v":"Greenlake"}]
["Construction","2020-01-03","Completed","Completed","98102",{"$f":"_xlfn.XLOOKUP(--fSeattle2020Complaints[[#This Row],[ZipCode]],dZipNeighborhood[ZipCode],dZipNeighborhood[Neighborhood])","v":"Capital Hill"}]
["Land Use","2020-12-31","Completed","Completed","98144",{"$f":"_xlfn.XLOOKUP(--fSeattle2020Complaints[[#This Row],[ZipCode]],dZipNeighborhood[ZipCode],dZipNeighborhood[Neighborhood])","v":"Mount Baker"}]
["Emergency","2020-02-21","Compliance Achieved","Completed","98115",{"$f":"_xlfn.XLOOKUP(--fSeattle2020Complaints[[#This Row],[ZipCode]],dZipNeighborhood[ZipCode],dZipNeighborhood[Neighborhood])","v":"Greenlake"}]
["Emergency","2020-04-22","Completed","Completed","98109",{"$f":"_xlfn.XLOOKUP(--fSeattle2020Complaints[[#This Row],[ZipCode]],dZipNeighborhood[ZipCode],dZipNeighborhood[Neighborhood])","v":"South Lake Union"}]
["Emergency , Vacant Building","2020-04-23","Compliance Achieved","Completed","98102",{"$f":"_xlfn.XLOOKUP(--fSeattle2020Complaints[[#This Row],[ZipCode]],dZipNeighborhood[ZipCode],dZipNeighborhood[Neighborhood])","v":"Capital Hill"}]
["Land Use","2020-02-21","Completed","Completed","98177",{"$f":"_xlfn.XLOOKUP(--fSeattle2020Complaints[[#This Row],[ZipCode]],dZipNeighborhood[ZipCode],dZipNeighborhood[Neighborhood])","v":"Richmond Beach"}]
["Construction","2020-10-08","Completed","Closed","98115",{"$f":"_xlfn.XLOOKUP(--fSeattle2020Complaints[[#This Row],[ZipCode]],dZipNeighborhood[ZipCode],dZipNeighborhood[Neighborhood])","v":"Greenlake"}]
["Weeds","2020-05-14","Completed","Completed","98136",{"$f":"_xlfn.XLOOKUP(--fSeattle2020Complaints[[#This Row],[ZipCode]],dZipNeighborhood[ZipCode],dZipNeighborhood[Neighborhood])","v":"Seaview"}]
["Land Use","2020-08-21","Completed","Closed","98103",{"$f":"_xlfn.XLOOKUP(--fSeattle2020Complaints[[#This Row],[ZipCode]],dZipNeighborhood[ZipCode],dZipNeighborhood[Neighborhood])","v":"Greenwood"}]
["Land Use","2020-01-26","Completed","Completed","98108",{"$f":"_xlfn.XLOOKUP(--fSeattle2020Complaints[[#This Row],[ZipCode]],dZipNeighborhood[ZipCode],dZipNeighborhood[Neighborhood])","v":"Rainer Valley"}]
["Construction , Tree","2020-10-22","Completed","Completed","98115",{"$f":"_xlfn.XLOOKUP(--fSeattle2020Complaints[[#This Row],[ZipCode]],dZipNeighborhood[ZipCode],dZipNeighborhood[Neighborhood])","v":"Greenlake"}]
["Construction","2020-02-10","Completed","Closed","98126",{"$f":"_xlfn.XLOOKUP(--fSeattle2020Complaints[[#This Row],[ZipCode]],dZipNeighborhood[ZipCode],dZipNeighborhood[Neighborhood])","v":"High Point"}]
["Land Use","2020-09-08","Completed","Completed","98126",{"$f":"_xlfn.XLOOKUP(--fSeattle2020Complaints[[#This Row],[ZipCode]],dZipNeighborhood[ZipCode],dZipNeighborhood[Neighborhood])","v":"High Point"}]
["Vacant Building","2020-01-01","Completed","Completed","98118",{"$f":"_xlfn.XLOOKUP(--fSeattle2020Complaints[[#This Row],[ZipCode]],dZipNeighborhood[ZipCode],dZipNeighborhood[Neighborhood])","v":"Columbia City"}]
["Weeds","2020-03-18","Compliance Achieved","Compliance Achieved","98106",{"$f":"_xlfn.XLOOKUP(--fSeattle2020Complaints[[#This Row],[ZipCode]],dZipNeighborhood[ZipCode],dZipNeighborhood[Neighborhood])","v":"Delridge"}]
["Weeds","2020-02-05","Compliance Achieved","Completed","98105",{"$f":"_xlfn.XLOOKUP(--fSeattle2020Complaints[[#This Row],[ZipCode]],dZipNeighborhood[ZipCode],dZipNeighborhood[Neighborhood])","v":"University District"}]
["Weeds","2020-07-09","Completed","Completed","98115",{"$f":"_xlfn.XLOOKUP(--fSeattle2020Complaints[[#This Row],[ZipCode]],dZipNeighborhood[ZipCode],dZipNeighborhood[Neighborhood])","v":"Greenlake"}]
["Tree","2020-08-28","No Access/Unable to Observe","Closed","98108",{"$f":"_xlfn.XLOOKUP(--fSeattle2020Complaints[[#This Row],[ZipCode]],dZipNeighborhood[ZipCode],dZipNeighborhood[Neighborhood])","v":"Rainer Valley"}]
["Weeds","2020-06-05","Completed","Completed","98106",{"$f":"_xlfn.XLOOKUP(--fSeattle2020Complaints[[#This Row],[ZipCode]],dZipNeighborhood[ZipCode],dZipNeighborhood[Neighborhood])","v":"Delridge"}]
["Vacant Building","2020-03-23","Completed","Closed","98109",{"$f":"_xlfn.XLOOKUP(--fSeattle2020Complaints[[#This Row],[ZipCode]],dZipNeighborhood[ZipCode],dZipNeighborhood[Neighborhood])","v":"South Lake Union"}]
["Weeds","2020-02-19","Compliance Achieved","Completed","98103",{"$f":"_xlfn.XLOOKUP(--fSeattle2020Complaints[[#This Row],[ZipCode]],dZipNeighborhood[ZipCode],dZipNeighborhood[Neighborhood])","v":"Greenwood"}]
["Weeds","2020-07-30","Completed","Completed","98144",{"$f":"_xlfn.XLOOKUP(--fSeattle2020Complaints[[#This Row],[ZipCode]],dZipNeighborhood[ZipCode],dZipNeighborhood[Neighborhood])","v":"Mount Baker"}]
["Vacant Building","2020-01-27","Completed","Completed","98105",{"$f":"_xlfn.XLOOKUP(--fSeattle2020Complaints[[#This Row],[ZipCode]],dZipNeighborhood[ZipCode],dZipNeighborhood[Neighborhood])","v":"University District"}]
["Weeds","2020-05-01","Completed","Completed","98104",{"$f":"_xlfn.XLOOKUP(--fSeattle2020Complaints[[#This Row],[ZipCode]],dZipNeighborhood[ZipCode],dZipNeighborhood[Neighborhood])","v":"International District"}]
["Land Use","2020-03-22","Completed","Completed","98108",{"$f":"_xlfn.XLOOKUP(--fSeattle2020Complaints[[#This Row],[ZipCode]],dZipNeighborhood[ZipCode],dZipNeighborhood[Neighborhood])","v":"Rainer Valley"}]
["Land Use","2020-11-12","Completed","Completed","98199",{"$f":"_xlfn.XLOOKUP(--fSeattle2020Complaints[[#This Row],[ZipCode]],dZipNeighborhood[ZipCode],dZipNeighborhood[Neighborhood])","v":"Magnolia"}]
["Emergency","2020-09-18","Completed","Closed","98119",{"$f":"_xlfn.XLOOKUP(--fSeattle2020Complaints[[#This Row],[ZipCode]],dZipNeighborhood[ZipCode],dZipNeighborhood[Neighborhood])","v":"Queen Anne"}]
["Land Use","2020-01-14","Completed","Completed","98102",{"$f":"_xlfn.XLOOKUP(--fSeattle2020Complaints[[#This Row],[ZipCode]],dZipNeighborhood[ZipCode],dZipNeighborhood[Neighborhood])","v":"Capital Hill"}]
["Tree","2020-07-06","Completed","Completed","98119",{"$f":"_xlfn.XLOOKUP(--fSeattle2020Complaints[[#This Row],[ZipCode]],dZipNeighborhood[ZipCode],dZipNeighborhood[Neighborhood])","v":"Queen Anne"}]
["Tree","2020-10-14","Completed","Completed","98103",{"$f":"_xlfn.XLOOKUP(--fSeattle2020Complaints[[#This Row],[ZipCode]],dZipNeighborhood[ZipCode],dZipNeighborhood[Neighborhood])","v":"Greenwood"}]
["Weeds","2020-06-30","Completed","Completed","98108",{"$f":"_xlfn.XLOOKUP(--fSeattle2020Complaints[[#This Row],[ZipCode]],dZipNeighborhood[ZipCode],dZipNeighborhood[Neighborhood])","v":"Rainer Valley"}]
["LandLord/Tenant","2020-04-22","Completed","Under Investigation","98118",{"$f":"_xlfn.XLOOKUP(--fSeattle2020Complaints[[#This Row],[ZipCode]],dZipNeighborhood[ZipCode],dZipNeighborhood[Neighborhood])","v":"Columbia City"}]
["Land Use","2020-02-20","Completed","Completed","98126",{"$f":"_xlfn.XLOOKUP(--fSeattle2020Complaints[[#This Row],[ZipCode]],dZipNeighborhood[ZipCode],dZipNeighborhood[Neighborhood])","v":"High Point"}]
["Weeds","2020-03-12","Completed","Closed","98103",{"$f":"_xlfn.XLOOKUP(--fSeattle2020Complaints[[#This Row],[ZipCode]],dZipNeighborhood[ZipCode],dZipNeighborhood[Neighborhood])","v":"Greenwood"}]
["Weeds","2020-02-05","Completed","Completed","98112",{"$f":"_xlfn.XLOOKUP(--fSeattle2020Complaints[[#This Row],[ZipCode]],dZipNeighborhood[ZipCode],dZipNeighborhood[Neighborhood])","v":"Madison Park"}]
["Land Use","2020-05-24","Completed","Completed","98108",{"$f":"_xlfn.XLOOKUP(--fSeattle2020Complaints[[#This Row],[ZipCode]],dZipNeighborhood[ZipCode],dZipNeighborhood[Neighborhood])","v":"Rainer Valley"}]
["Tree","2020-03-22","Completed","Completed","98118",{"$f":"_xlfn.XLOOKUP(--fSeattle2020Complaints[[#This Row],[ZipCode]],dZipNeighborhood[ZipCode],dZipNeighborhood[Neighborhood])","v":"Columbia City"}]
["Weeds","2020-02-20","Compliance Achieved","Completed","98103",{"$f":"_xlfn.XLOOKUP(--fSeattle2020Complaints[[#This Row],[ZipCode]],dZipNeighborhood[ZipCode],dZipNeighborhood[Neighborhood])","v":"Greenwood"}]
["Weeds","2020-02-10","Compliance Achieved","Completed","98112",{"$f":"_xlfn.XLOOKUP(--fSeattle2020Complaints[[#This Row],[ZipCode]],dZipNeighborhood[ZipCode],dZipNeighborhood[Neighborhood])","v":"Madison Park"}]
["Land Use","2020-01-07","Compliance Achieved","Completed","98118",{"$f":"_xlfn.XLOOKUP(--fSeattle2020Complaints[[#This Row],[ZipCode]],dZipNeighborhood[ZipCode],dZipNeighborhood[Neighborhood])","v":"Columbia City"}]
["Emergency","2020-06-23","Completed","Initiated","98103",{"$f":"_xlfn.XLOOKUP(--fSeattle2020Complaints[[#This Row],[ZipCode]],dZipNeighborhood[ZipCode],dZipNeighborhood[Neighborhood])","v":"Greenwood"}]
["Weeds","2020-06-15","Completed","Completed","98122",{"$f":"_xlfn.XLOOKUP(--fSeattle2020Complaints[[#This Row],[ZipCode]],dZipNeighborhood[ZipCode],dZipNeighborhood[Neighborhood])","v":"Minor, Central Area"}]
["Land Use","2020-01-29","Completed","Completed","98125",{"$f":"_xlfn.XLOOKUP(--fSeattle2020Complaints[[#This Row],[ZipCode]],dZipNeighborhood[ZipCode],dZipNeighborhood[Neighborhood])","v":"Northgate"}]
["Weeds","2020-06-30","Completed","Completed","98106",{"$f":"_xlfn.XLOOKUP(--fSeattle2020Complaints[[#This Row],[ZipCode]],dZipNeighborhood[ZipCode],dZipNeighborhood[Neighborhood])","v":"Delridge"}]
["Land Use","2020-03-27","Completed","Completed","98105",{"$f":"_xlfn.XLOOKUP(--fSeattle2020Complaints[[#This Row],[ZipCode]],dZipNeighborhood[ZipCode],dZipNeighborhood[Neighborhood])","v":"University District"}]
["Weeds","2020-08-31","Completed","Completed","98116",{"$f":"_xlfn.XLOOKUP(--fSeattle2020Complaints[[#This Row],[ZipCode]],dZipNeighborhood[ZipCode],dZipNeighborhood[Neighborhood])","v":"West Seattle"}]
["Construction","2020-01-28","Completed","Completed","98115",{"$f":"_xlfn.XLOOKUP(--fSeattle2020Complaints[[#This Row],[ZipCode]],dZipNeighborhood[ZipCode],dZipNeighborhood[Neighborhood])","v":"Greenlake"}]
["Emergency , Vacant Building","2020-04-22","Completed","Closed","98119",{"$f":"_xlfn.XLOOKUP(--fSeattle2020Complaints[[#This Row],[ZipCode]],dZipNeighborhood[ZipCode],dZipNeighborhood[Neighborhood])","v":"Queen Anne"}]
["Land Use","2020-11-06","Completed","Completed","98102",{"$f":"_xlfn.XLOOKUP(--fSeattle2020Complaints[[#This Row],[ZipCode]],dZipNeighborhood[ZipCode],dZipNeighborhood[Neighborhood])","v":"Capital Hill"}]
["Noise","2020-08-04","Completed","Completed","98106",{"$f":"_xlfn.XLOOKUP(--fSeattle2020Complaints[[#This Row],[ZipCode]],dZipNeighborhood[ZipCode],dZipNeighborhood[Neighborhood])","v":"Delridge"}]
["Land Use","2020-04-14","Completed","Completed","98108",{"$f":"_xlfn.XLOOKUP(--fSeattle2020Complaints[[#This Row],[ZipCode]],dZipNeighborhood[ZipCode],dZipNeighborhood[Neighborhood])","v":"Rainer Valley"}]
["Land Use","2020-12-22","Completed","Completed","98126",{"$f":"_xlfn.XLOOKUP(--fSeattle2020Complaints[[#This Row],[ZipCode]],dZipNeighborhood[ZipCode],dZipNeighborhood[Neighborhood])","v":"High Point"}]
["Vacant Building","2020-12-12","Completed","Completed","98125",{"$f":"_xlfn.XLOOKUP(--fSeattle2020Complaints[[#This Row],[ZipCode]],dZipNeighborhood[ZipCode],dZipNeighborhood[Neighborhood])","v":"Northgate"}]
["Construction","2020-10-16","Completed","Completed","98109",{"$f":"_xlfn.XLOOKUP(--fSeattle2020Complaints[[#This Row],[ZipCode]],dZipNeighborhood[ZipCode],dZipNeighborhood[Neighborhood])","v":"South Lake Union"}]
["Construction","2020-01-16","Completed","Closed","98146",{"$f":"_xlfn.XLOOKUP(--fSeattle2020Complaints[[#This Row],[ZipCode]],dZipNeighborhood[ZipCode],dZipNeighborhood[Neighborhood])","v":"Shorewood, White Center"}]
["Land Use","2020-04-14","Completed","Completed","98121",{"$f":"_xlfn.XLOOKUP(--fSeattle2020Complaints[[#This Row],[ZipCode]],dZipNeighborhood[ZipCode],dZipNeighborhood[Neighborhood])","v":"Belltown"}]
["Construction","2020-02-26","Completed","Completed","98107",{"$f":"_xlfn.XLOOKUP(--fSeattle2020Complaints[[#This Row],[ZipCode]],dZipNeighborhood[ZipCode],dZipNeighborhood[Neighborhood])","v":"Ballard"}]
["Construction","2020-07-21","Completed","Completed","98136",{"$f":"_xlfn.XLOOKUP(--fSeattle2020Complaints[[#This Row],[ZipCode]],dZipNeighborhood[ZipCode],dZipNeighborhood[Neighborhood])","v":"Seaview"}]
["Land Use","2020-09-10","Completed","Completed","98109",{"$f":"_xlfn.XLOOKUP(--fSeattle2020Complaints[[#This Row],[ZipCode]],dZipNeighborhood[ZipCode],dZipNeighborhood[Neighborhood])","v":"South Lake Union"}]
["Weeds","2020-07-22","Completed","Completed","98105",{"$f":"_xlfn.XLOOKUP(--fSeattle2020Complaints[[#This Row],[ZipCode]],dZipNeighborhood[ZipCode],dZipNeighborhood[Neighborhood])","v":"University District"}]
["Land Use","2020-03-06","Compliance Achieved","Completed","98118",{"$f":"_xlfn.XLOOKUP(--fSeattle2020Complaints[[#This Row],[ZipCode]],dZipNeighborhood[ZipCode],dZipNeighborhood[Neighborhood])","v":"Columbia City"}]
["Weeds","2020-02-19","Completed","Completed","98105",{"$f":"_xlfn.XLOOKUP(--fSeattle2020Complaints[[#This Row],[ZipCode]],dZipNeighborhood[ZipCode],dZipNeighborhood[Neighborhood])","v":"University District"}]
["Tree","2020-01-08","Completed","Completed","98117",{"$f":"_xlfn.XLOOKUP(--fSeattle2020Complaints[[#This Row],[ZipCode]],dZipNeighborhood[ZipCode],dZipNeighborhood[Neighborhood])","v":"Sunset Hill"}]
["Vacant Building","2020-09-25","Admin Closure","Closed","98108",{"$f":"_xlfn.XLOOKUP(--fSeattle2020Complaints[[#This Row],[ZipCode]],dZipNeighborhood[ZipCode],dZipNeighborhood[Neighborhood])","v":"Rainer Valley"}]
["Weeds","2020-03-30","Completed","Warning","98126",{"$f":"_xlfn.XLOOKUP(--fSeattle2020Complaints[[#This Row],[ZipCode]],dZipNeighborhood[ZipCode],dZipNeighborhood[Neighborhood])","v":"High Point"}]
["Construction","2020-09-09","Completed","Completed","98102",{"$f":"_xlfn.XLOOKUP(--fSeattle2020Complaints[[#This Row],[ZipCode]],dZipNeighborhood[ZipCode],dZipNeighborhood[Neighborhood])","v":"Capital Hill"}]
["Construction","2020-07-02","Completed","NOV Issued","98122",{"$f":"_xlfn.XLOOKUP(--fSeattle2020Complaints[[#This Row],[ZipCode]],dZipNeighborhood[ZipCode],dZipNeighborhood[Neighborhood])","v":"Minor, Central Area"}]
["Land Use","2020-03-24","Completed","Completed","98126",{"$f":"_xlfn.XLOOKUP(--fSeattle2020Complaints[[#This Row],[ZipCode]],dZipNeighborhood[ZipCode],dZipNeighborhood[Neighborhood])","v":"High Point"}]
["Construction , ECA , Tree","2020-07-20","Completed","Under Investigation","98118",{"$f":"_xlfn.XLOOKUP(--fSeattle2020Complaints[[#This Row],[ZipCode]],dZipNeighborhood[ZipCode],dZipNeighborhood[Neighborhood])","v":"Columbia City"}]
["Construction","2020-07-15","Completed","Completed","98146",{"$f":"_xlfn.XLOOKUP(--fSeattle2020Complaints[[#This Row],[ZipCode]],dZipNeighborhood[ZipCode],dZipNeighborhood[Neighborhood])","v":"Shorewood, White Center"}]
["Construction","2020-01-06","Completed","Completed","98144",{"$f":"_xlfn.XLOOKUP(--fSeattle2020Complaints[[#This Row],[ZipCode]],dZipNeighborhood[ZipCode],dZipNeighborhood[Neighborhood])","v":"Mount Baker"}]
["Land Use","2020-03-06","Completed","Completed","98107",{"$f":"_xlfn.XLOOKUP(--fSeattle2020Complaints[[#This Row],[ZipCode]],dZipNeighborhood[ZipCode],dZipNeighborhood[Neighborhood])","v":"Ballard"}]
["Weeds","2020-07-27","Completed","Completed","98116",{"$f":"_xlfn.XLOOKUP(--fSeattle2020Complaints[[#This Row],[ZipCode]],dZipNeighborhood[ZipCode],dZipNeighborhood[Neighborhood])","v":"West Seattle"}]
["Vacant Building","2020-08-11","Completed","Completed","98104",{"$f":"_xlfn.XLOOKUP(--fSeattle2020Complaints[[#This Row],[ZipCode]],dZipNeighborhood[ZipCode],dZipNeighborhood[Neighborhood])","v":"International District"}]
["Construction","2020-04-09","Completed","Completed","98144",{"$f":"_xlfn.XLOOKUP(--fSeattle2020Complaints[[#This Row],[ZipCode]],dZipNeighborhood[ZipCode],dZipNeighborhood[Neighborhood])","v":"Mount Baker"}]
["Weeds","2020-11-25","Completed","Completed","98102",{"$f":"_xlfn.XLOOKUP(--fSeattle2020Complaints[[#This Row],[ZipCode]],dZipNeighborhood[ZipCode],dZipNeighborhood[Neighborhood])","v":"Capital Hill"}]
["Land Use","2020-10-07","Completed","Completed","98115",{"$f":"_xlfn.XLOOKUP(--fSeattle2020Complaints[[#This Row],[ZipCode]],dZipNeighborhood[ZipCode],dZipNeighborhood[Neighborhood])","v":"Greenlake"}]
["Land Use","2020-12-31","Completed","Completed","98112",{"$f":"_xlfn.XLOOKUP(--fSeattle2020Complaints[[#This Row],[ZipCode]],dZipNeighborhood[ZipCode],dZipNeighborhood[Neighborhood])","v":"Madison Park"}]
["Noise","2020-08-24","Completed","Completed","98117",{"$f":"_xlfn.XLOOKUP(--fSeattle2020Complaints[[#This Row],[ZipCode]],dZipNeighborhood[ZipCode],dZipNeighborhood[Neighborhood])","v":"Sunset Hill"}]
["Land Use","2020-03-19","Completed","Completed","98199",{"$f":"_xlfn.XLOOKUP(--fSeattle2020Complaints[[#This Row],[ZipCode]],dZipNeighborhood[ZipCode],dZipNeighborhood[Neighborhood])","v":"Magnolia"}]
["Weeds","2020-12-07","Completed","Completed","98126",{"$f":"_xlfn.XLOOKUP(--fSeattle2020Complaints[[#This Row],[ZipCode]],dZipNeighborhood[ZipCode],dZipNeighborhood[Neighborhood])","v":"High Point"}]
["Noise","2020-03-18","No Violation","Completed","98104",{"$f":"_xlfn.XLOOKUP(--fSeattle2020Complaints[[#This Row],[ZipCode]],dZipNeighborhood[ZipCode],dZipNeighborhood[Neighborhood])","v":"International District"}]
["Land Use","2020-02-22","Compliance Achieved","Compliance Achieved","98118",{"$f":"_xlfn.XLOOKUP(--fSeattle2020Complaints[[#This Row],[ZipCode]],dZipNeighborhood[ZipCode],dZipNeighborhood[Neighborhood])","v":"Columbia City"}]
["Construction , ECA , Tree","2020-10-29","No Access/Unable to Observe","Closed","98199",{"$f":"_xlfn.XLOOKUP(--fSeattle2020Complaints[[#This Row],[ZipCode]],dZipNeighborhood[ZipCode],dZipNeighborhood[Neighborhood])","v":"Magnolia"}]
["Tree","2020-07-22","Completed","Completed","98119",{"$f":"_xlfn.XLOOKUP(--fSeattle2020Complaints[[#This Row],[ZipCode]],dZipNeighborhood[ZipCode],dZipNeighborhood[Neighborhood])","v":"Queen Anne"}]
["Weeds","2020-10-14","Completed","Completed","98107",{"$f":"_xlfn.XLOOKUP(--fSeattle2020Complaints[[#This Row],[ZipCode]],dZipNeighborhood[ZipCode],dZipNeighborhood[Neighborhood])","v":"Ballard"}]
["Land Use","2020-08-15","Completed","Completed","98115",{"$f":"_xlfn.XLOOKUP(--fSeattle2020Complaints[[#This Row],[ZipCode]],dZipNeighborhood[ZipCode],dZipNeighborhood[Neighborhood])","v":"Greenlake"}]
["Emergency , Vacant Building","2020-06-08","Completed","Completed","98118",{"$f":"_xlfn.XLOOKUP(--fSeattle2020Complaints[[#This Row],[ZipCode]],dZipNeighborhood[ZipCode],dZipNeighborhood[Neighborhood])","v":"Columbia City"}]
["Weeds","2020-07-09","Completed","Completed","98108",{"$f":"_xlfn.XLOOKUP(--fSeattle2020Complaints[[#This Row],[ZipCode]],dZipNeighborhood[ZipCode],dZipNeighborhood[Neighborhood])","v":"Rainer Valley"}]
["Vacant Building","2020-06-22","Compliance Achieved","Completed","98126",{"$f":"_xlfn.XLOOKUP(--fSeattle2020Complaints[[#This Row],[ZipCode]],dZipNeighborhood[ZipCode],dZipNeighborhood[Neighborhood])","v":"High Point"}]
["Weeds","2020-05-21","Completed","Completed","98103",{"$f":"_xlfn.XLOOKUP(--fSeattle2020Complaints[[#This Row],[ZipCode]],dZipNeighborhood[ZipCode],dZipNeighborhood[Neighborhood])","v":"Greenwood"}]
["Tree","2020-10-26","Completed","Completed","98136",{"$f":"_xlfn.XLOOKUP(--fSeattle2020Complaints[[#This Row],[ZipCode]],dZipNeighborhood[ZipCode],dZipNeighborhood[Neighborhood])","v":"Seaview"}]
["Land Use","2020-01-17","Completed","Closed","98136",{"$f":"_xlfn.XLOOKUP(--fSeattle2020Complaints[[#This Row],[ZipCode]],dZipNeighborhood[ZipCode],dZipNeighborhood[Neighborhood])","v":"Seaview"}]
["Weeds","2020-02-11","Completed","Warning","98116",{"$f":"_xlfn.XLOOKUP(--fSeattle2020Complaints[[#This Row],[ZipCode]],dZipNeighborhood[ZipCode],dZipNeighborhood[Neighborhood])","v":"West Seattle"}]
["Weeds","2020-03-06","Completed","Completed","98102",{"$f":"_xlfn.XLOOKUP(--fSeattle2020Complaints[[#This Row],[ZipCode]],dZipNeighborhood[ZipCode],dZipNeighborhood[Neighborhood])","v":"Capital Hill"}]
["Emergency","2020-02-18","Completed","Completed","98107",{"$f":"_xlfn.XLOOKUP(--fSeattle2020Complaints[[#This Row],[ZipCode]],dZipNeighborhood[ZipCode],dZipNeighborhood[Neighborhood])","v":"Ballard"}]
["Construction","2020-07-23","Completed","Completed","98118",{"$f":"_xlfn.XLOOKUP(--fSeattle2020Complaints[[#This Row],[ZipCode]],dZipNeighborhood[ZipCode],dZipNeighborhood[Neighborhood])","v":"Columbia City"}]
["Vacant Building","2020-05-10","Completed","Completed","98102",{"$f":"_xlfn.XLOOKUP(--fSeattle2020Complaints[[#This Row],[ZipCode]],dZipNeighborhood[ZipCode],dZipNeighborhood[Neighborhood])","v":"Capital Hill"}]
["Land Use","2020-12-09","Completed","Completed","98121",{"$f":"_xlfn.XLOOKUP(--fSeattle2020Complaints[[#This Row],[ZipCode]],dZipNeighborhood[ZipCode],dZipNeighborhood[Neighborhood])","v":"Belltown"}]
["Emergency , Vacant Building","2020-02-04","Compliance Achieved","Completed","98102",{"$f":"_xlfn.XLOOKUP(--fSeattle2020Complaints[[#This Row],[ZipCode]],dZipNeighborhood[ZipCode],dZipNeighborhood[Neighborhood])","v":"Capital Hill"}]
["Construction","2020-01-30","Completed","Completed","98177",{"$f":"_xlfn.XLOOKUP(--fSeattle2020Complaints[[#This Row],[ZipCode]],dZipNeighborhood[ZipCode],dZipNeighborhood[Neighborhood])","v":"Richmond Beach"}]
["Land Use","2020-01-24","Completed","Completed","98118",{"$f":"_xlfn.XLOOKUP(--fSeattle2020Complaints[[#This Row],[ZipCode]],dZipNeighborhood[ZipCode],dZipNeighborhood[Neighborhood])","v":"Columbia City"}]
["Weeds","2020-08-05","Completed","Completed","98105",{"$f":"_xlfn.XLOOKUP(--fSeattle2020Complaints[[#This Row],[ZipCode]],dZipNeighborhood[ZipCode],dZipNeighborhood[Neighborhood])","v":"University District"}]
["Land Use","2020-01-01","Completed","Completed","98122",{"$f":"_xlfn.XLOOKUP(--fSeattle2020Complaints[[#This Row],[ZipCode]],dZipNeighborhood[ZipCode],dZipNeighborhood[Neighborhood])","v":"Minor, Central Area"}]
["Construction , Noise","2020-06-08","Completed","NOV Issued","98199",{"$f":"_xlfn.XLOOKUP(--fSeattle2020Complaints[[#This Row],[ZipCode]],dZipNeighborhood[ZipCode],dZipNeighborhood[Neighborhood])","v":"Magnolia"}]
["Land Use","2020-04-09","Completed","Completed","98144",{"$f":"_xlfn.XLOOKUP(--fSeattle2020Complaints[[#This Row],[ZipCode]],dZipNeighborhood[ZipCode],dZipNeighborhood[Neighborhood])","v":"Mount Baker"}]
["Weeds","2020-07-28","Completed","Completed","98115",{"$f":"_xlfn.XLOOKUP(--fSeattle2020Complaints[[#This Row],[ZipCode]],dZipNeighborhood[ZipCode],dZipNeighborhood[Neighborhood])","v":"Greenlake"}]
["Construction","2020-02-05","Completed","Completed","98144",{"$f":"_xlfn.XLOOKUP(--fSeattle2020Complaints[[#This Row],[ZipCode]],dZipNeighborhood[ZipCode],dZipNeighborhood[Neighborhood])","v":"Mount Baker"}]
["Land Use","2020-09-28","Completed","Completed","98118",{"$f":"_xlfn.XLOOKUP(--fSeattle2020Complaints[[#This Row],[ZipCode]],dZipNeighborhood[ZipCode],dZipNeighborhood[Neighborhood])","v":"Columbia City"}]
["Weeds","2020-02-25","Compliance Achieved","Completed","98122",{"$f":"_xlfn.XLOOKUP(--fSeattle2020Complaints[[#This Row],[ZipCode]],dZipNeighborhood[ZipCode],dZipNeighborhood[Neighborhood])","v":"Minor, Central Area"}]
["Vacant Building","2020-09-06","Completed","Completed","98103",{"$f":"_xlfn.XLOOKUP(--fSeattle2020Complaints[[#This Row],[ZipCode]],dZipNeighborhood[ZipCode],dZipNeighborhood[Neighborhood])","v":"Greenwood"}]
["Emergency , Vacant Building","2020-04-13","Completed","Completed","98118",{"$f":"_xlfn.XLOOKUP(--fSeattle2020Complaints[[#This Row],[ZipCode]],dZipNeighborhood[ZipCode],dZipNeighborhood[Neighborhood])","v":"Columbia City"}]
["Weeds","2020-06-29","Completed","Completed","98122",{"$f":"_xlfn.XLOOKUP(--fSeattle2020Complaints[[#This Row],[ZipCode]],dZipNeighborhood[ZipCode],dZipNeighborhood[Neighborhood])","v":"Minor, Central Area"}]
["Construction","2020-06-19","No Access/Unable to Observe","Closed","98112",{"$f":"_xlfn.XLOOKUP(--fSeattle2020Complaints[[#This Row],[ZipCode]],dZipNeighborhood[ZipCode],dZipNeighborhood[Neighborhood])","v":"Madison Park"}]
["Land Use","2020-07-17","Completed","Completed","98106",{"$f":"_xlfn.XLOOKUP(--fSeattle2020Complaints[[#This Row],[ZipCode]],dZipNeighborhood[ZipCode],dZipNeighborhood[Neighborhood])","v":"Delridge"}]
["Construction","2020-05-18","Completed","Completed","98199",{"$f":"_xlfn.XLOOKUP(--fSeattle2020Complaints[[#This Row],[ZipCode]],dZipNeighborhood[ZipCode],dZipNeighborhood[Neighborhood])","v":"Magnolia"}]
["Land Use","2020-01-22","Completed","Warning","98144",{"$f":"_xlfn.XLOOKUP(--fSeattle2020Complaints[[#This Row],[ZipCode]],dZipNeighborhood[ZipCode],dZipNeighborhood[Neighborhood])","v":"Mount Baker"}]
["LandLord/Tenant","2020-02-07","Completed","Under Investigation","98118",{"$f":"_xlfn.XLOOKUP(--fSeattle2020Complaints[[#This Row],[ZipCode]],dZipNeighborhood[ZipCode],dZipNeighborhood[Neighborhood])","v":"Columbia City"}]
["LandLord/Tenant","2020-10-15","Completed","Completed","98118",{"$f":"_xlfn.XLOOKUP(--fSeattle2020Complaints[[#This Row],[ZipCode]],dZipNeighborhood[ZipCode],dZipNeighborhood[Neighborhood])","v":"Columbia City"}]
["Weeds","2020-05-26","Completed","Completed","98118",{"$f":"_xlfn.XLOOKUP(--fSeattle2020Complaints[[#This Row],[ZipCode]],dZipNeighborhood[ZipCode],dZipNeighborhood[Neighborhood])","v":"Columbia City"}]
["Weeds","2020-08-11","Completed","Initiated","98122",{"$f":"_xlfn.XLOOKUP(--fSeattle2020Complaints[[#This Row],[ZipCode]],dZipNeighborhood[ZipCode],dZipNeighborhood[Neighborhood])","v":"Minor, Central Area"}]
["Weeds","2020-01-21","Completed","Completed","98108",{"$f":"_xlfn.XLOOKUP(--fSeattle2020Complaints[[#This Row],[ZipCode]],dZipNeighborhood[ZipCode],dZipNeighborhood[Neighborhood])","v":"Rainer Valley"}]
["Construction","2020-02-06","Completed","Completed","98112",{"$f":"_xlfn.XLOOKUP(--fSeattle2020Complaints[[#This Row],[ZipCode]],dZipNeighborhood[ZipCode],dZipNeighborhood[Neighborhood])","v":"Madison Park"}]
["Land Use","2020-02-10","Completed","Completed","98126",{"$f":"_xlfn.XLOOKUP(--fSeattle2020Complaints[[#This Row],[ZipCode]],dZipNeighborhood[ZipCode],dZipNeighborhood[Neighborhood])","v":"High Point"}]
["Weeds","2020-06-05","Completed","Completed","98136",{"$f":"_xlfn.XLOOKUP(--fSeattle2020Complaints[[#This Row],[ZipCode]],dZipNeighborhood[ZipCode],dZipNeighborhood[Neighborhood])","v":"Seaview"}]
["Vacant Building","2020-06-07","Completed","Closed","98117",{"$f":"_xlfn.XLOOKUP(--fSeattle2020Complaints[[#This Row],[ZipCode]],dZipNeighborhood[ZipCode],dZipNeighborhood[Neighborhood])","v":"Sunset Hill"}]
["Land Use","2020-11-10","Completed","Completed","98117",{"$f":"_xlfn.XLOOKUP(--fSeattle2020Complaints[[#This Row],[ZipCode]],dZipNeighborhood[ZipCode],dZipNeighborhood[Neighborhood])","v":"Sunset Hill"}]
["Emergency , Vacant Building","2020-05-20","Compliance Achieved","Completed","98122",{"$f":"_xlfn.XLOOKUP(--fSeattle2020Complaints[[#This Row],[ZipCode]],dZipNeighborhood[ZipCode],dZipNeighborhood[Neighborhood])","v":"Minor, Central Area"}]
["Weeds","2020-08-28","Completed","Completed","98103",{"$f":"_xlfn.XLOOKUP(--fSeattle2020Complaints[[#This Row],[ZipCode]],dZipNeighborhood[ZipCode],dZipNeighborhood[Neighborhood])","v":"Greenwood"}]
["Land Use","2020-04-13","Completed","Completed","98106",{"$f":"_xlfn.XLOOKUP(--fSeattle2020Complaints[[#This Row],[ZipCode]],dZipNeighborhood[ZipCode],dZipNeighborhood[Neighborhood])","v":"Delridge"}]
["Land Use","2020-02-28","Compliance Achieved","Completed","98178",{"$f":"_xlfn.XLOOKUP(--fSeattle2020Complaints[[#This Row],[ZipCode]],dZipNeighborhood[ZipCode],dZipNeighborhood[Neighborhood])","v":"Skyway"}]
["Land Use","2020-04-23","Completed","Closed","98109",{"$f":"_xlfn.XLOOKUP(--fSeattle2020Complaints[[#This Row],[ZipCode]],dZipNeighborhood[ZipCode],dZipNeighborhood[Neighborhood])","v":"South Lake Union"}]
["Land Use","2020-02-21","Completed","Completed","98178",{"$f":"_xlfn.XLOOKUP(--fSeattle2020Complaints[[#This Row],[ZipCode]],dZipNeighborhood[ZipCode],dZipNeighborhood[Neighborhood])","v":"Skyway"}]
["Construction","2020-11-05","No Access/Unable to Observe","Closed","98122",{"$f":"_xlfn.XLOOKUP(--fSeattle2020Complaints[[#This Row],[ZipCode]],dZipNeighborhood[ZipCode],dZipNeighborhood[Neighborhood])","v":"Minor, Central Area"}]
["Tree","2020-02-10","Completed","Completed","98199",{"$f":"_xlfn.XLOOKUP(--fSeattle2020Complaints[[#This Row],[ZipCode]],dZipNeighborhood[ZipCode],dZipNeighborhood[Neighborhood])","v":"Magnolia"}]
["Land Use","2020-10-02","Completed","Completed","98118",{"$f":"_xlfn.XLOOKUP(--fSeattle2020Complaints[[#This Row],[ZipCode]],dZipNeighborhood[ZipCode],dZipNeighborhood[Neighborhood])","v":"Columbia City"}]
["Weeds","2020-02-18","Compliance Achieved","Completed","98115",{"$f":"_xlfn.XLOOKUP(--fSeattle2020Complaints[[#This Row],[ZipCode]],dZipNeighborhood[ZipCode],dZipNeighborhood[Neighborhood])","v":"Greenlake"}]
["Land Use","2020-03-14","Completed","Completed","98144",{"$f":"_xlfn.XLOOKUP(--fSeattle2020Complaints[[#This Row],[ZipCode]],dZipNeighborhood[ZipCode],dZipNeighborhood[Neighborhood])","v":"Mount Baker"}]
["Vacant Building","2020-02-05","Completed","Closed","98144",{"$f":"_xlfn.XLOOKUP(--fSeattle2020Complaints[[#This Row],[ZipCode]],dZipNeighborhood[ZipCode],dZipNeighborhood[Neighborhood])","v":"Mount Baker"}]
["Weeds","2020-09-07","Completed","Completed","98107",{"$f":"_xlfn.XLOOKUP(--fSeattle2020Complaints[[#This Row],[ZipCode]],dZipNeighborhood[ZipCode],dZipNeighborhood[Neighborhood])","v":"Ballard"}]
["Weeds","2020-06-09","Completed","Closed","98105",{"$f":"_xlfn.XLOOKUP(--fSeattle2020Complaints[[#This Row],[ZipCode]],dZipNeighborhood[ZipCode],dZipNeighborhood[Neighborhood])","v":"University District"}]
["Land Use","2020-07-21","Compliance Achieved","Completed","98106",{"$f":"_xlfn.XLOOKUP(--fSeattle2020Complaints[[#This Row],[ZipCode]],dZipNeighborhood[ZipCode],dZipNeighborhood[Neighborhood])","v":"Delridge"}]
["Construction","2020-03-10","Completed","Completed","98199",{"$f":"_xlfn.XLOOKUP(--fSeattle2020Complaints[[#This Row],[ZipCode]],dZipNeighborhood[ZipCode],dZipNeighborhood[Neighborhood])","v":"Magnolia"}]
["Weeds","2020-12-07","Completed","Completed","98115",{"$f":"_xlfn.XLOOKUP(--fSeattle2020Complaints[[#This Row],[ZipCode]],dZipNeighborhood[ZipCode],dZipNeighborhood[Neighborhood])","v":"Greenlake"}]
["LandLord/Tenant","2020-11-05","Withdrawn","Closed","98118",{"$f":"_xlfn.XLOOKUP(--fSeattle2020Complaints[[#This Row],[ZipCode]],dZipNeighborhood[ZipCode],dZipNeighborhood[Neighborhood])","v":"Columbia City"}]
["Weeds","2020-01-24","Completed","Completed","98102",{"$f":"_xlfn.XLOOKUP(--fSeattle2020Complaints[[#This Row],[ZipCode]],dZipNeighborhood[ZipCode],dZipNeighborhood[Neighborhood])","v":"Capital Hill"}]
["Weeds","2020-05-18","Completed","Completed","98108",{"$f":"_xlfn.XLOOKUP(--fSeattle2020Complaints[[#This Row],[ZipCode]],dZipNeighborhood[ZipCode],dZipNeighborhood[Neighborhood])","v":"Rainer Valley"}]
["Land Use","2020-02-04","Completed","Initiated","98199",{"$f":"_xlfn.XLOOKUP(--fSeattle2020Complaints[[#This Row],[ZipCode]],dZipNeighborhood[ZipCode],dZipNeighborhood[Neighborhood])","v":"Magnolia"}]
["Weeds","2020-03-11","Completed","Completed","98117",{"$f":"_xlfn.XLOOKUP(--fSeattle2020Complaints[[#This Row],[ZipCode]],dZipNeighborhood[ZipCode],dZipNeighborhood[Neighborhood])","v":"Sunset Hill"}]
["Construction","2020-11-17","Completed","Completed","98106",{"$f":"_xlfn.XLOOKUP(--fSeattle2020Complaints[[#This Row],[ZipCode]],dZipNeighborhood[ZipCode],dZipNeighborhood[Neighborhood])","v":"Delridge"}]
["Weeds","2020-08-19","Completed","Completed","98117",{"$f":"_xlfn.XLOOKUP(--fSeattle2020Complaints[[#This Row],[ZipCode]],dZipNeighborhood[ZipCode],dZipNeighborhood[Neighborhood])","v":"Sunset Hill"}]
["Tree","2020-08-13","No Access/Unable to Observe","Completed","98115",{"$f":"_xlfn.XLOOKUP(--fSeattle2020Complaints[[#This Row],[ZipCode]],dZipNeighborhood[ZipCode],dZipNeighborhood[Neighborhood])","v":"Greenlake"}]
["Tree","2020-01-09","Completed","Completed","98136",{"$f":"_xlfn.XLOOKUP(--fSeattle2020Complaints[[#This Row],[ZipCode]],dZipNeighborhood[ZipCode],dZipNeighborhood[Neighborhood])","v":"Seaview"}]
["Weeds","2020-03-25","Completed","Completed","98106",{"$f":"_xlfn.XLOOKUP(--fSeattle2020Complaints[[#This Row],[ZipCode]],dZipNeighborhood[ZipCode],dZipNeighborhood[Neighborhood])","v":"Delridge"}]
["Construction","2020-07-01","Completed","Completed","98105",{"$f":"_xlfn.XLOOKUP(--fSeattle2020Complaints[[#This Row],[ZipCode]],dZipNeighborhood[ZipCode],dZipNeighborhood[Neighborhood])","v":"University District"}]
["Weeds","2020-07-16","Completed","Completed","98106",{"$f":"_xlfn.XLOOKUP(--fSeattle2020Complaints[[#This Row],[ZipCode]],dZipNeighborhood[ZipCode],dZipNeighborhood[Neighborhood])","v":"Delridge"}]
["Land Use","2020-05-12","Completed","Completed","98118",{"$f":"_xlfn.XLOOKUP(--fSeattle2020Complaints[[#This Row],[ZipCode]],dZipNeighborhood[ZipCode],dZipNeighborhood[Neighborhood])","v":"Columbia City"}]
["Land Use","2020-05-12","Completed","Completed","98146",{"$f":"_xlfn.XLOOKUP(--fSeattle2020Complaints[[#This Row],[ZipCode]],dZipNeighborhood[ZipCode],dZipNeighborhood[Neighborhood])","v":"Shorewood, White Center"}]
["Vacant Building","2020-04-02","Completed","Completed","98104",{"$f":"_xlfn.XLOOKUP(--fSeattle2020Complaints[[#This Row],[ZipCode]],dZipNeighborhood[ZipCode],dZipNeighborhood[Neighborhood])","v":"International District"}]
["Construction","2020-09-21","Completed","Completed","98126",{"$f":"_xlfn.XLOOKUP(--fSeattle2020Complaints[[#This Row],[ZipCode]],dZipNeighborhood[ZipCode],dZipNeighborhood[Neighborhood])","v":"High Point"}]
["Weeds","2020-09-08","Completed","Completed","98107",{"$f":"_xlfn.XLOOKUP(--fSeattle2020Complaints[[#This Row],[ZipCode]],dZipNeighborhood[ZipCode],dZipNeighborhood[Neighborhood])","v":"Ballard"}]
["Land Use","2020-05-13","Completed","Completed","98144",{"$f":"_xlfn.XLOOKUP(--fSeattle2020Complaints[[#This Row],[ZipCode]],dZipNeighborhood[ZipCode],dZipNeighborhood[Neighborhood])","v":"Mount Baker"}]
["Construction","2020-06-18","Completed","Completed","98118",{"$f":"_xlfn.XLOOKUP(--fSeattle2020Complaints[[#This Row],[ZipCode]],dZipNeighborhood[ZipCode],dZipNeighborhood[Neighborhood])","v":"Columbia City"}]
["Land Use","2020-01-21","No Access/Unable to Observe","Completed","98122",{"$f":"_xlfn.XLOOKUP(--fSeattle2020Complaints[[#This Row],[ZipCode]],dZipNeighborhood[ZipCode],dZipNeighborhood[Neighborhood])","v":"Minor, Central Area"}]
["Construction","2020-02-21","Completed","Initiated","98115",{"$f":"_xlfn.XLOOKUP(--fSeattle2020Complaints[[#This Row],[ZipCode]],dZipNeighborhood[ZipCode],dZipNeighborhood[Neighborhood])","v":"Greenlake"}]
["Land Use","2020-02-10","Completed","Completed","98126",{"$f":"_xlfn.XLOOKUP(--fSeattle2020Complaints[[#This Row],[ZipCode]],dZipNeighborhood[ZipCode],dZipNeighborhood[Neighborhood])","v":"High Point"}]
["Land Use","2020-06-29","Completed","Completed","98118",{"$f":"_xlfn.XLOOKUP(--fSeattle2020Complaints[[#This Row],[ZipCode]],dZipNeighborhood[ZipCode],dZipNeighborhood[Neighborhood])","v":"Columbia City"}]
["Construction","2020-06-23","Completed","Completed","98119",{"$f":"_xlfn.XLOOKUP(--fSeattle2020Complaints[[#This Row],[ZipCode]],dZipNeighborhood[ZipCode],dZipNeighborhood[Neighborhood])","v":"Queen Anne"}]
["Construction","2020-07-06","Compliance Achieved","Completed","98112",{"$f":"_xlfn.XLOOKUP(--fSeattle2020Complaints[[#This Row],[ZipCode]],dZipNeighborhood[ZipCode],dZipNeighborhood[Neighborhood])","v":"Madison Park"}]
["Weeds","2020-02-14","Completed","Completed","98118",{"$f":"_xlfn.XLOOKUP(--fSeattle2020Complaints[[#This Row],[ZipCode]],dZipNeighborhood[ZipCode],dZipNeighborhood[Neighborhood])","v":"Columbia City"}]
["Weeds","2020-06-14","Completed","Completed","98133",{"$f":"_xlfn.XLOOKUP(--fSeattle2020Complaints[[#This Row],[ZipCode]],dZipNeighborhood[ZipCode],dZipNeighborhood[Neighborhood])","v":"Shoreline"}]
["Construction","2020-08-17","Completed","Completed","98103",{"$f":"_xlfn.XLOOKUP(--fSeattle2020Complaints[[#This Row],[ZipCode]],dZipNeighborhood[ZipCode],dZipNeighborhood[Neighborhood])","v":"Greenwood"}]
["Construction","2020-11-20","Completed","Under Investigation","98122",{"$f":"_xlfn.XLOOKUP(--fSeattle2020Complaints[[#This Row],[ZipCode]],dZipNeighborhood[ZipCode],dZipNeighborhood[Neighborhood])","v":"Minor, Central Area"}]
["Land Use","2020-06-05","No Access/Unable to Observe","Completed","98102",{"$f":"_xlfn.XLOOKUP(--fSeattle2020Complaints[[#This Row],[ZipCode]],dZipNeighborhood[ZipCode],dZipNeighborhood[Neighborhood])","v":"Capital Hill"}]
["Weeds","2020-07-07","Completed","Completed","98118",{"$f":"_xlfn.XLOOKUP(--fSeattle2020Complaints[[#This Row],[ZipCode]],dZipNeighborhood[ZipCode],dZipNeighborhood[Neighborhood])","v":"Columbia City"}]
["Land Use","2020-11-16","Completed","Closed","98103",{"$f":"_xlfn.XLOOKUP(--fSeattle2020Complaints[[#This Row],[ZipCode]],dZipNeighborhood[ZipCode],dZipNeighborhood[Neighborhood])","v":"Greenwood"}]
["Land Use","2020-07-07","Completed","Completed","98105",{"$f":"_xlfn.XLOOKUP(--fSeattle2020Complaints[[#This Row],[ZipCode]],dZipNeighborhood[ZipCode],dZipNeighborhood[Neighborhood])","v":"University District"}]
["Construction","2020-02-13","Completed","Completed","98115",{"$f":"_xlfn.XLOOKUP(--fSeattle2020Complaints[[#This Row],[ZipCode]],dZipNeighborhood[ZipCode],dZipNeighborhood[Neighborhood])","v":"Greenlake"}]
["Construction , Noise","2020-03-11","No Access/Unable to Observe","Completed","98107",{"$f":"_xlfn.XLOOKUP(--fSeattle2020Complaints[[#This Row],[ZipCode]],dZipNeighborhood[ZipCode],dZipNeighborhood[Neighborhood])","v":"Ballard"}]
["Vacant Building","2020-11-01","Completed","Completed","98118",{"$f":"_xlfn.XLOOKUP(--fSeattle2020Complaints[[#This Row],[ZipCode]],dZipNeighborhood[ZipCode],dZipNeighborhood[Neighborhood])","v":"Columbia City"}]
["Land Use","2020-06-01","Completed","Completed","98122",{"$f":"_xlfn.XLOOKUP(--fSeattle2020Complaints[[#This Row],[ZipCode]],dZipNeighborhood[ZipCode],dZipNeighborhood[Neighborhood])","v":"Minor, Central Area"}]
["Emergency , Vacant Building","2020-02-14","Completed","Completed","98118",{"$f":"_xlfn.XLOOKUP(--fSeattle2020Complaints[[#This Row],[ZipCode]],dZipNeighborhood[ZipCode],dZipNeighborhood[Neighborhood])","v":"Columbia City"}]
["Weeds","2020-08-02","Completed","Completed","98108",{"$f":"_xlfn.XLOOKUP(--fSeattle2020Complaints[[#This Row],[ZipCode]],dZipNeighborhood[ZipCode],dZipNeighborhood[Neighborhood])","v":"Rainer Valley"}]
["Land Use","2020-06-03","Completed","Completed","98117",{"$f":"_xlfn.XLOOKUP(--fSeattle2020Complaints[[#This Row],[ZipCode]],dZipNeighborhood[ZipCode],dZipNeighborhood[Neighborhood])","v":"Sunset Hill"}]
["Land Use","2020-09-28","Completed","Completed","98125",{"$f":"_xlfn.XLOOKUP(--fSeattle2020Complaints[[#This Row],[ZipCode]],dZipNeighborhood[ZipCode],dZipNeighborhood[Neighborhood])","v":"Northgate"}]
["Land Use","2020-12-28","Completed","Completed","98199",{"$f":"_xlfn.XLOOKUP(--fSeattle2020Complaints[[#This Row],[ZipCode]],dZipNeighborhood[ZipCode],dZipNeighborhood[Neighborhood])","v":"Magnolia"}]
["Land Use","2020-09-17","Completed","Completed","98103",{"$f":"_xlfn.XLOOKUP(--fSeattle2020Complaints[[#This Row],[ZipCode]],dZipNeighborhood[ZipCode],dZipNeighborhood[Neighborhood])","v":"Greenwood"}]
["Emergency","2020-01-17","Compliance Achieved","Completed","98133",{"$f":"_xlfn.XLOOKUP(--fSeattle2020Complaints[[#This Row],[ZipCode]],dZipNeighborhood[ZipCode],dZipNeighborhood[Neighborhood])","v":"Shoreline"}]
["Construction","2020-05-12","Completed","Completed","98126",{"$f":"_xlfn.XLOOKUP(--fSeattle2020Complaints[[#This Row],[ZipCode]],dZipNeighborhood[ZipCode],dZipNeighborhood[Neighborhood])","v":"High Point"}]
["Tree","2020-08-15","Completed","Closed","98106",{"$f":"_xlfn.XLOOKUP(--fSeattle2020Complaints[[#This Row],[ZipCode]],dZipNeighborhood[ZipCode],dZipNeighborhood[Neighborhood])","v":"Delridge"}]
["Tree","2020-01-31","Completed","Completed","98106",{"$f":"_xlfn.XLOOKUP(--fSeattle2020Complaints[[#This Row],[ZipCode]],dZipNeighborhood[ZipCode],dZipNeighborhood[Neighborhood])","v":"Delridge"}]
["Construction","2020-09-13","Completed","Completed","98122",{"$f":"_xlfn.XLOOKUP(--fSeattle2020Complaints[[#This Row],[ZipCode]],dZipNeighborhood[ZipCode],dZipNeighborhood[Neighborhood])","v":"Minor, Central Area"}]
["Land Use","2020-01-27","Completed","Completed","98144",{"$f":"_xlfn.XLOOKUP(--fSeattle2020Complaints[[#This Row],[ZipCode]],dZipNeighborhood[ZipCode],dZipNeighborhood[Neighborhood])","v":"Mount Baker"}]
["Land Use","2020-11-18","Completed","Completed","98144",{"$f":"_xlfn.XLOOKUP(--fSeattle2020Complaints[[#This Row],[ZipCode]],dZipNeighborhood[ZipCode],dZipNeighborhood[Neighborhood])","v":"Mount Baker"}]
["Construction , Tree","2020-06-10","Completed","Completed","98108",{"$f":"_xlfn.XLOOKUP(--fSeattle2020Complaints[[#This Row],[ZipCode]],dZipNeighborhood[ZipCode],dZipNeighborhood[Neighborhood])","v":"Rainer Valley"}]
["Vacant Building","2020-04-10","Completed","Completed","98199",{"$f":"_xlfn.XLOOKUP(--fSeattle2020Complaints[[#This Row],[ZipCode]],dZipNeighborhood[ZipCode],dZipNeighborhood[Neighborhood])","v":"Magnolia"}]
["LandLord/Tenant","2020-03-26","Completed","Completed","98199",{"$f":"_xlfn.XLOOKUP(--fSeattle2020Complaints[[#This Row],[ZipCode]],dZipNeighborhood[ZipCode],dZipNeighborhood[Neighborhood])","v":"Magnolia"}]
["Land Use","2020-12-17","Completed","Completed","98108",{"$f":"_xlfn.XLOOKUP(--fSeattle2020Complaints[[#This Row],[ZipCode]],dZipNeighborhood[ZipCode],dZipNeighborhood[Neighborhood])","v":"Rainer Valley"}]
["Emergency , Vacant Building","2020-09-30","Completed","Completed","98102",{"$f":"_xlfn.XLOOKUP(--fSeattle2020Complaints[[#This Row],[ZipCode]],dZipNeighborhood[ZipCode],dZipNeighborhood[Neighborhood])","v":"Capital Hill"}]
["Weeds","2020-05-06","Completed","Completed","98102",{"$f":"_xlfn.XLOOKUP(--fSeattle2020Complaints[[#This Row],[ZipCode]],dZipNeighborhood[ZipCode],dZipNeighborhood[Neighborhood])","v":"Capital Hill"}]
["Land Use","2020-07-01","Compliance Achieved","Completed","98106",{"$f":"_xlfn.XLOOKUP(--fSeattle2020Complaints[[#This Row],[ZipCode]],dZipNeighborhood[ZipCode],dZipNeighborhood[Neighborhood])","v":"Delridge"}]
["Construction","2020-10-13","Completed","Under Investigation","98125",{"$f":"_xlfn.XLOOKUP(--fSeattle2020Complaints[[#This Row],[ZipCode]],dZipNeighborhood[ZipCode],dZipNeighborhood[Neighborhood])","v":"Northgate"}]
["Construction","2020-03-03","Completed","Completed","98115",{"$f":"_xlfn.XLOOKUP(--fSeattle2020Complaints[[#This Row],[ZipCode]],dZipNeighborhood[ZipCode],dZipNeighborhood[Neighborhood])","v":"Greenlake"}]
["Land Use","2020-07-28","Completed","Completed","98144",{"$f":"_xlfn.XLOOKUP(--fSeattle2020Complaints[[#This Row],[ZipCode]],dZipNeighborhood[ZipCode],dZipNeighborhood[Neighborhood])","v":"Mount Baker"}]
["Weeds","2020-02-26","No Violation","Completed","98103",{"$f":"_xlfn.XLOOKUP(--fSeattle2020Complaints[[#This Row],[ZipCode]],dZipNeighborhood[ZipCode],dZipNeighborhood[Neighborhood])","v":"Greenwood"}]
["Construction","2020-02-19","Completed","Completed","98118",{"$f":"_xlfn.XLOOKUP(--fSeattle2020Complaints[[#This Row],[ZipCode]],dZipNeighborhood[ZipCode],dZipNeighborhood[Neighborhood])","v":"Columbia City"}]
["Construction","2020-08-12","Completed","Completed","98108",{"$f":"_xlfn.XLOOKUP(--fSeattle2020Complaints[[#This Row],[ZipCode]],dZipNeighborhood[ZipCode],dZipNeighborhood[Neighborhood])","v":"Rainer Valley"}]
["Vacant Building","2020-05-04","Completed","Completed","98103",{"$f":"_xlfn.XLOOKUP(--fSeattle2020Complaints[[#This Row],[ZipCode]],dZipNeighborhood[ZipCode],dZipNeighborhood[Neighborhood])","v":"Greenwood"}]
["Land Use","2020-09-15","Completed","Completed","98118",{"$f":"_xlfn.XLOOKUP(--fSeattle2020Complaints[[#This Row],[ZipCode]],dZipNeighborhood[ZipCode],dZipNeighborhood[Neighborhood])","v":"Columbia City"}]
["Land Use","2020-06-11","Completed","Completed","98117",{"$f":"_xlfn.XLOOKUP(--fSeattle2020Complaints[[#This Row],[ZipCode]],dZipNeighborhood[ZipCode],dZipNeighborhood[Neighborhood])","v":"Sunset Hill"}]
["LandLord/Tenant","2020-04-18","Completed","Completed","98104",{"$f":"_xlfn.XLOOKUP(--fSeattle2020Complaints[[#This Row],[ZipCode]],dZipNeighborhood[ZipCode],dZipNeighborhood[Neighborhood])","v":"International District"}]
["Vacant Building","2020-01-04","Admin Closure","Closed","98106",{"$f":"_xlfn.XLOOKUP(--fSeattle2020Complaints[[#This Row],[ZipCode]],dZipNeighborhood[ZipCode],dZipNeighborhood[Neighborhood])","v":"Delridge"}]
["Construction","2020-01-31","Completed","Completed","98144",{"$f":"_xlfn.XLOOKUP(--fSeattle2020Complaints[[#This Row],[ZipCode]],dZipNeighborhood[ZipCode],dZipNeighborhood[Neighborhood])","v":"Mount Baker"}]
["Weeds","2020-12-18","Completed","Completed","98136",{"$f":"_xlfn.XLOOKUP(--fSeattle2020Complaints[[#This Row],[ZipCode]],dZipNeighborhood[ZipCode],dZipNeighborhood[Neighborhood])","v":"Seaview"}]
["Construction","2020-04-29","Completed","Completed","98116",{"$f":"_xlfn.XLOOKUP(--fSeattle2020Complaints[[#This Row],[ZipCode]],dZipNeighborhood[ZipCode],dZipNeighborhood[Neighborhood])","v":"West Seattle"}]
["Weeds","2020-05-10","Completed","Completed","98122",{"$f":"_xlfn.XLOOKUP(--fSeattle2020Complaints[[#This Row],[ZipCode]],dZipNeighborhood[ZipCode],dZipNeighborhood[Neighborhood])","v":"Minor, Central Area"}]
["Weeds","2020-04-29","Completed","Completed","98126",{"$f":"_xlfn.XLOOKUP(--fSeattle2020Complaints[[#This Row],[ZipCode]],dZipNeighborhood[ZipCode],dZipNeighborhood[Neighborhood])","v":"High Point"}]
["Construction","2020-01-25","Completed","Completed","98118",{"$f":"_xlfn.XLOOKUP(--fSeattle2020Complaints[[#This Row],[ZipCode]],dZipNeighborhood[ZipCode],dZipNeighborhood[Neighborhood])","v":"Columbia City"}]
["Tree","2020-09-20","No Access/Unable to Observe","Completed","98125",{"$f":"_xlfn.XLOOKUP(--fSeattle2020Complaints[[#This Row],[ZipCode]],dZipNeighborhood[ZipCode],dZipNeighborhood[Neighborhood])","v":"Northgate"}]
["Weeds","2020-03-20","Completed","Warning","98133",{"$f":"_xlfn.XLOOKUP(--fSeattle2020Complaints[[#This Row],[ZipCode]],dZipNeighborhood[ZipCode],dZipNeighborhood[Neighborhood])","v":"Shoreline"}]
["Land Use","2020-10-08","Completed","Completed","98105",{"$f":"_xlfn.XLOOKUP(--fSeattle2020Complaints[[#This Row],[ZipCode]],dZipNeighborhood[ZipCode],dZipNeighborhood[Neighborhood])","v":"University District"}]
["Land Use","2020-03-06","Compliance Achieved","Completed","98115",{"$f":"_xlfn.XLOOKUP(--fSeattle2020Complaints[[#This Row],[ZipCode]],dZipNeighborhood[ZipCode],dZipNeighborhood[Neighborhood])","v":"Greenlake"}]
["Vacant Building","2020-03-04","Completed","Closed","98199",{"$f":"_xlfn.XLOOKUP(--fSeattle2020Complaints[[#This Row],[ZipCode]],dZipNeighborhood[ZipCode],dZipNeighborhood[Neighborhood])","v":"Magnolia"}]
["Emergency","2020-01-17","Completed","Completed","98103",{"$f":"_xlfn.XLOOKUP(--fSeattle2020Complaints[[#This Row],[ZipCode]],dZipNeighborhood[ZipCode],dZipNeighborhood[Neighborhood])","v":"Greenwood"}]
["Land Use","2020-11-23","Completed","Completed","98121",{"$f":"_xlfn.XLOOKUP(--fSeattle2020Complaints[[#This Row],[ZipCode]],dZipNeighborhood[ZipCode],dZipNeighborhood[Neighborhood])","v":"Belltown"}]
["Emergency , Vacant Building","2020-05-19","Compliance Achieved","Completed","98107",{"$f":"_xlfn.XLOOKUP(--fSeattle2020Complaints[[#This Row],[ZipCode]],dZipNeighborhood[ZipCode],dZipNeighborhood[Neighborhood])","v":"Ballard"}]
["Land Use","2020-03-23","Completed","Warning","98118",{"$f":"_xlfn.XLOOKUP(--fSeattle2020Complaints[[#This Row],[ZipCode]],dZipNeighborhood[ZipCode],dZipNeighborhood[Neighborhood])","v":"Columbia City"}]
["Construction","2020-03-12","Completed","Completed","98126",{"$f":"_xlfn.XLOOKUP(--fSeattle2020Complaints[[#This Row],[ZipCode]],dZipNeighborhood[ZipCode],dZipNeighborhood[Neighborhood])","v":"High Point"}]
["Construction","2020-08-04","Completed","Completed","98115",{"$f":"_xlfn.XLOOKUP(--fSeattle2020Complaints[[#This Row],[ZipCode]],dZipNeighborhood[ZipCode],dZipNeighborhood[Neighborhood])","v":"Greenlake"}]
["Land Use","2020-01-12","Completed","Completed","98125",{"$f":"_xlfn.XLOOKUP(--fSeattle2020Complaints[[#This Row],[ZipCode]],dZipNeighborhood[ZipCode],dZipNeighborhood[Neighborhood])","v":"Northgate"}]
["Land Use","2020-08-17","Completed","Completed","98104",{"$f":"_xlfn.XLOOKUP(--fSeattle2020Complaints[[#This Row],[ZipCode]],dZipNeighborhood[ZipCode],dZipNeighborhood[Neighborhood])","v":"International District"}]
["Emergency , LandLord/Tenant","2020-02-04","Completed","Initiated","98125",{"$f":"_xlfn.XLOOKUP(--fSeattle2020Complaints[[#This Row],[ZipCode]],dZipNeighborhood[ZipCode],dZipNeighborhood[Neighborhood])","v":"Northgate"}]
["Weeds","2020-08-15","Completed","Completed","98116",{"$f":"_xlfn.XLOOKUP(--fSeattle2020Complaints[[#This Row],[ZipCode]],dZipNeighborhood[ZipCode],dZipNeighborhood[Neighborhood])","v":"West Seattle"}]
["Vacant Building","2020-04-13","Completed","Completed","98115",{"$f":"_xlfn.XLOOKUP(--fSeattle2020Complaints[[#This Row],[ZipCode]],dZipNeighborhood[ZipCode],dZipNeighborhood[Neighborhood])","v":"Greenlake"}]
["Weeds","2020-05-12","Compliance Achieved","Completed","98105",{"$f":"_xlfn.XLOOKUP(--fSeattle2020Complaints[[#This Row],[ZipCode]],dZipNeighborhood[ZipCode],dZipNeighborhood[Neighborhood])","v":"University District"}]
["Weeds","2020-08-10","Completed","Completed","98117",{"$f":"_xlfn.XLOOKUP(--fSeattle2020Complaints[[#This Row],[ZipCode]],dZipNeighborhood[ZipCode],dZipNeighborhood[Neighborhood])","v":"Sunset Hill"}]
["Land UseConstruction ,","2020-09-01","Completed","Completed","98103",{"$f":"_xlfn.XLOOKUP(--fSeattle2020Complaints[[#This Row],[ZipCode]],dZipNeighborhood[ZipCode],dZipNeighborhood[Neighborhood])","v":"Greenwood"}]
["Weeds","2020-05-17","Completed","Completed","98116",{"$f":"_xlfn.XLOOKUP(--fSeattle2020Complaints[[#This Row],[ZipCode]],dZipNeighborhood[ZipCode],dZipNeighborhood[Neighborhood])","v":"West Seattle"}]
["Land Use","2020-01-13","Completed","Completed","98199",{"$f":"_xlfn.XLOOKUP(--fSeattle2020Complaints[[#This Row],[ZipCode]],dZipNeighborhood[ZipCode],dZipNeighborhood[Neighborhood])","v":"Magnolia"}]
["Construction","2020-08-19","Completed","Completed","98115",{"$f":"_xlfn.XLOOKUP(--fSeattle2020Complaints[[#This Row],[ZipCode]],dZipNeighborhood[ZipCode],dZipNeighborhood[Neighborhood])","v":"Greenlake"}]
["Construction","2020-02-06","Completed","Initiated","98112",{"$f":"_xlfn.XLOOKUP(--fSeattle2020Complaints[[#This Row],[ZipCode]],dZipNeighborhood[ZipCode],dZipNeighborhood[Neighborhood])","v":"Madison Park"}]
["Land Use","2020-09-13","No Access/Unable to Observe","Completed","98101",{"$f":"_xlfn.XLOOKUP(--fSeattle2020Complaints[[#This Row],[ZipCode]],dZipNeighborhood[ZipCode],dZipNeighborhood[Neighborhood])","v":"Seattle"}]
["Weeds","2020-06-29","Completed","Completed","98115",{"$f":"_xlfn.XLOOKUP(--fSeattle2020Complaints[[#This Row],[ZipCode]],dZipNeighborhood[ZipCode],dZipNeighborhood[Neighborhood])","v":"Greenlake"}]
["Weeds","2020-07-08","Compliance Achieved","Completed","98136",{"$f":"_xlfn.XLOOKUP(--fSeattle2020Complaints[[#This Row],[ZipCode]],dZipNeighborhood[ZipCode],dZipNeighborhood[Neighborhood])","v":"Seaview"}]
["Construction","2020-01-24","Completed","Closed","98146",{"$f":"_xlfn.XLOOKUP(--fSeattle2020Complaints[[#This Row],[ZipCode]],dZipNeighborhood[ZipCode],dZipNeighborhood[Neighborhood])","v":"Shorewood, White Center"}]
["Land Use","2020-07-02","Compliance Achieved","Completed","98146",{"$f":"_xlfn.XLOOKUP(--fSeattle2020Complaints[[#This Row],[ZipCode]],dZipNeighborhood[ZipCode],dZipNeighborhood[Neighborhood])","v":"Shorewood, White Center"}]
["Vacant Building","2020-04-10","Completed","Closed","98117",{"$f":"_xlfn.XLOOKUP(--fSeattle2020Complaints[[#This Row],[ZipCode]],dZipNeighborhood[ZipCode],dZipNeighborhood[Neighborhood])","v":"Sunset Hill"}]
["Construction","2020-08-11","Completed","Completed","98115",{"$f":"_xlfn.XLOOKUP(--fSeattle2020Complaints[[#This Row],[ZipCode]],dZipNeighborhood[ZipCode],dZipNeighborhood[Neighborhood])","v":"Greenlake"}]
["Vacant Building","2020-06-30","Completed","Completed","98103",{"$f":"_xlfn.XLOOKUP(--fSeattle2020Complaints[[#This Row],[ZipCode]],dZipNeighborhood[ZipCode],dZipNeighborhood[Neighborhood])","v":"Greenwood"}]
["Land Use","2020-11-24","Completed","Completed","98103",{"$f":"_xlfn.XLOOKUP(--fSeattle2020Complaints[[#This Row],[ZipCode]],dZipNeighborhood[ZipCode],dZipNeighborhood[Neighborhood])","v":"Greenwood"}]
["Weeds","2020-03-17","Compliance Achieved","Completed","98103",{"$f":"_xlfn.XLOOKUP(--fSeattle2020Complaints[[#This Row],[ZipCode]],dZipNeighborhood[ZipCode],dZipNeighborhood[Neighborhood])","v":"Greenwood"}]
["Weeds","2020-02-23","Completed","Completed","98107",{"$f":"_xlfn.XLOOKUP(--fSeattle2020Complaints[[#This Row],[ZipCode]],dZipNeighborhood[ZipCode],dZipNeighborhood[Neighborhood])","v":"Ballard"}]
["Land UseNoise ,","2020-08-21","Completed","Completed","98115",{"$f":"_xlfn.XLOOKUP(--fSeattle2020Complaints[[#This Row],[ZipCode]],dZipNeighborhood[ZipCode],dZipNeighborhood[Neighborhood])","v":"Greenlake"}]
["Weeds","2020-08-06","Completed","Completed","98118",{"$f":"_xlfn.XLOOKUP(--fSeattle2020Complaints[[#This Row],[ZipCode]],dZipNeighborhood[ZipCode],dZipNeighborhood[Neighborhood])","v":"Columbia City"}]
["Construction","2020-07-30","Completed","Completed","98144",{"$f":"_xlfn.XLOOKUP(--fSeattle2020Complaints[[#This Row],[ZipCode]],dZipNeighborhood[ZipCode],dZipNeighborhood[Neighborhood])","v":"Mount Baker"}]
["Construction","2020-02-11","Completed","Completed","98122",{"$f":"_xlfn.XLOOKUP(--fSeattle2020Complaints[[#This Row],[ZipCode]],dZipNeighborhood[ZipCode],dZipNeighborhood[Neighborhood])","v":"Minor, Central Area"}]
["Land Use","2020-01-27","Completed","Completed","98101",{"$f":"_xlfn.XLOOKUP(--fSeattle2020Complaints[[#This Row],[ZipCode]],dZipNeighborhood[ZipCode],dZipNeighborhood[Neighborhood])","v":"Seattle"}]
["Construction , Tree","2020-10-19","Completed","Completed","98106",{"$f":"_xlfn.XLOOKUP(--fSeattle2020Complaints[[#This Row],[ZipCode]],dZipNeighborhood[ZipCode],dZipNeighborhood[Neighborhood])","v":"Delridge"}]
["Construction","2020-01-07","Completed","NOV Issued","98144",{"$f":"_xlfn.XLOOKUP(--fSeattle2020Complaints[[#This Row],[ZipCode]],dZipNeighborhood[ZipCode],dZipNeighborhood[Neighborhood])","v":"Mount Baker"}]
["Tree","2020-09-15","Completed","Completed","98125",{"$f":"_xlfn.XLOOKUP(--fSeattle2020Complaints[[#This Row],[ZipCode]],dZipNeighborhood[ZipCode],dZipNeighborhood[Neighborhood])","v":"Northgate"}]
["Vacant Building","2020-02-13","Completed","Completed","98103",{"$f":"_xlfn.XLOOKUP(--fSeattle2020Complaints[[#This Row],[ZipCode]],dZipNeighborhood[ZipCode],dZipNeighborhood[Neighborhood])","v":"Greenwood"}]
["Weeds","2020-03-24","Completed","Completed","98105",{"$f":"_xlfn.XLOOKUP(--fSeattle2020Complaints[[#This Row],[ZipCode]],dZipNeighborhood[ZipCode],dZipNeighborhood[Neighborhood])","v":"University District"}]
["Land Use","2020-04-17","Completed","Completed","98108",{"$f":"_xlfn.XLOOKUP(--fSeattle2020Complaints[[#This Row],[ZipCode]],dZipNeighborhood[ZipCode],dZipNeighborhood[Neighborhood])","v":"Rainer Valley"}]
["Land Use","2020-02-12","Completed","Completed","98136",{"$f":"_xlfn.XLOOKUP(--fSeattle2020Complaints[[#This Row],[ZipCode]],dZipNeighborhood[ZipCode],dZipNeighborhood[Neighborhood])","v":"Seaview"}]
["Land Use","2020-08-03","Completed","Completed","98119",{"$f":"_xlfn.XLOOKUP(--fSeattle2020Complaints[[#This Row],[ZipCode]],dZipNeighborhood[ZipCode],dZipNeighborhood[Neighborhood])","v":"Queen Anne"}]
["Land Use","2020-08-19","Completed","Completed","98105",{"$f":"_xlfn.XLOOKUP(--fSeattle2020Complaints[[#This Row],[ZipCode]],dZipNeighborhood[ZipCode],dZipNeighborhood[Neighborhood])","v":"University District"}]
["Vacant Building","2020-09-30","Completed","Completed","98107",{"$f":"_xlfn.XLOOKUP(--fSeattle2020Complaints[[#This Row],[ZipCode]],dZipNeighborhood[ZipCode],dZipNeighborhood[Neighborhood])","v":"Ballard"}]
["Weeds","2020-06-01","Completed","Completed","98144",{"$f":"_xlfn.XLOOKUP(--fSeattle2020Complaints[[#This Row],[ZipCode]],dZipNeighborhood[ZipCode],dZipNeighborhood[Neighborhood])","v":"Mount Baker"}]
["Land Use","2020-04-06","Compliance Achieved","Completed","98106",{"$f":"_xlfn.XLOOKUP(--fSeattle2020Complaints[[#This Row],[ZipCode]],dZipNeighborhood[ZipCode],dZipNeighborhood[Neighborhood])","v":"Delridge"}]
["Weeds","2020-09-26","Completed","Completed","98122",{"$f":"_xlfn.XLOOKUP(--fSeattle2020Complaints[[#This Row],[ZipCode]],dZipNeighborhood[ZipCode],dZipNeighborhood[Neighborhood])","v":"Minor, Central Area"}]
["Weeds","2020-09-15","Completed","Completed","98125",{"$f":"_xlfn.XLOOKUP(--fSeattle2020Complaints[[#This Row],[ZipCode]],dZipNeighborhood[ZipCode],dZipNeighborhood[Neighborhood])","v":"Northgate"}]
["Land Use","2020-09-08","Completed","Completed","98199",{"$f":"_xlfn.XLOOKUP(--fSeattle2020Complaints[[#This Row],[ZipCode]],dZipNeighborhood[ZipCode],dZipNeighborhood[Neighborhood])","v":"Magnolia"}]
["Weeds","2020-09-21","Completed","Completed","98105",{"$f":"_xlfn.XLOOKUP(--fSeattle2020Complaints[[#This Row],[ZipCode]],dZipNeighborhood[ZipCode],dZipNeighborhood[Neighborhood])","v":"University District"}]
["Weeds","2020-12-02","Completed","Completed","98115",{"$f":"_xlfn.XLOOKUP(--fSeattle2020Complaints[[#This Row],[ZipCode]],dZipNeighborhood[ZipCode],dZipNeighborhood[Neighborhood])","v":"Greenlake"}]
["Construction","2020-06-17","Completed","Closed","98108",{"$f":"_xlfn.XLOOKUP(--fSeattle2020Complaints[[#This Row],[ZipCode]],dZipNeighborhood[ZipCode],dZipNeighborhood[Neighborhood])","v":"Rainer Valley"}]
["Weeds","2020-11-10","Completed","Completed","98118",{"$f":"_xlfn.XLOOKUP(--fSeattle2020Complaints[[#This Row],[ZipCode]],dZipNeighborhood[ZipCode],dZipNeighborhood[Neighborhood])","v":"Columbia City"}]
["Construction","2020-08-26","Completed","Completed","98125",{"$f":"_xlfn.XLOOKUP(--fSeattle2020Complaints[[#This Row],[ZipCode]],dZipNeighborhood[ZipCode],dZipNeighborhood[Neighborhood])","v":"Northgate"}]
["Land Use","2020-06-29","Completed","Completed","98178",{"$f":"_xlfn.XLOOKUP(--fSeattle2020Complaints[[#This Row],[ZipCode]],dZipNeighborhood[ZipCode],dZipNeighborhood[Neighborhood])","v":"Skyway"}]
["Vacant Building","2020-04-14","Completed","Closed","98103",{"$f":"_xlfn.XLOOKUP(--fSeattle2020Complaints[[#This Row],[ZipCode]],dZipNeighborhood[ZipCode],dZipNeighborhood[Neighborhood])","v":"Greenwood"}]
["Construction , Noise","2020-04-22","Completed","Completed","98117",{"$f":"_xlfn.XLOOKUP(--fSeattle2020Complaints[[#This Row],[ZipCode]],dZipNeighborhood[ZipCode],dZipNeighborhood[Neighborhood])","v":"Sunset Hill"}]
["Land Use","2020-12-06","Completed","Completed","98144",{"$f":"_xlfn.XLOOKUP(--fSeattle2020Complaints[[#This Row],[ZipCode]],dZipNeighborhood[ZipCode],dZipNeighborhood[Neighborhood])","v":"Mount Baker"}]
["Weeds","2020-10-03","Completed","Completed","98102",{"$f":"_xlfn.XLOOKUP(--fSeattle2020Complaints[[#This Row],[ZipCode]],dZipNeighborhood[ZipCode],dZipNeighborhood[Neighborhood])","v":"Capital Hill"}]
["Land Use","2020-10-20","Completed","Closed","98115",{"$f":"_xlfn.XLOOKUP(--fSeattle2020Complaints[[#This Row],[ZipCode]],dZipNeighborhood[ZipCode],dZipNeighborhood[Neighborhood])","v":"Greenlake"}]
["Weeds","2020-06-13","Completed","Completed","98103",{"$f":"_xlfn.XLOOKUP(--fSeattle2020Complaints[[#This Row],[ZipCode]],dZipNeighborhood[ZipCode],dZipNeighborhood[Neighborhood])","v":"Greenwood"}]
["Land Use","2020-07-18","Completed","Completed","98103",{"$f":"_xlfn.XLOOKUP(--fSeattle2020Complaints[[#This Row],[ZipCode]],dZipNeighborhood[ZipCode],dZipNeighborhood[Neighborhood])","v":"Greenwood"}]
["LandLord/Tenant","2020-03-13","Completed","Completed","98106",{"$f":"_xlfn.XLOOKUP(--fSeattle2020Complaints[[#This Row],[ZipCode]],dZipNeighborhood[ZipCode],dZipNeighborhood[Neighborhood])","v":"Delridge"}]
["Land Use","2020-03-20","Completed","Completed","98118",{"$f":"_xlfn.XLOOKUP(--fSeattle2020Complaints[[#This Row],[ZipCode]],dZipNeighborhood[ZipCode],dZipNeighborhood[Neighborhood])","v":"Columbia City"}]
["Vacant Building","2020-02-13","Completed","Completed","98103",{"$f":"_xlfn.XLOOKUP(--fSeattle2020Complaints[[#This Row],[ZipCode]],dZipNeighborhood[ZipCode],dZipNeighborhood[Neighborhood])","v":"Greenwood"}]
["Construction","2020-03-05","Completed","Completed","98119",{"$f":"_xlfn.XLOOKUP(--fSeattle2020Complaints[[#This Row],[ZipCode]],dZipNeighborhood[ZipCode],dZipNeighborhood[Neighborhood])","v":"Queen Anne"}]
["Land Use","2020-01-10","Completed","Completed","98106",{"$f":"_xlfn.XLOOKUP(--fSeattle2020Complaints[[#This Row],[ZipCode]],dZipNeighborhood[ZipCode],dZipNeighborhood[Neighborhood])","v":"Delridge"}]
["Land Use","2020-05-28","Completed","Completed","98117",{"$f":"_xlfn.XLOOKUP(--fSeattle2020Complaints[[#This Row],[ZipCode]],dZipNeighborhood[ZipCode],dZipNeighborhood[Neighborhood])","v":"Sunset Hill"}]
["Construction","2020-01-08","Completed","NOV Issued","98102",{"$f":"_xlfn.XLOOKUP(--fSeattle2020Complaints[[#This Row],[ZipCode]],dZipNeighborhood[ZipCode],dZipNeighborhood[Neighborhood])","v":"Capital Hill"}]
["Weeds","2020-06-05","Completed","Completed","98136",{"$f":"_xlfn.XLOOKUP(--fSeattle2020Complaints[[#This Row],[ZipCode]],dZipNeighborhood[ZipCode],dZipNeighborhood[Neighborhood])","v":"Seaview"}]
["Weeds","2020-08-03","Completed","Completed","98108",{"$f":"_xlfn.XLOOKUP(--fSeattle2020Complaints[[#This Row],[ZipCode]],dZipNeighborhood[ZipCode],dZipNeighborhood[Neighborhood])","v":"Rainer Valley"}]
["Emergency , Vacant Building","2020-07-09","Compliance Achieved","Completed","98103",{"$f":"_xlfn.XLOOKUP(--fSeattle2020Complaints[[#This Row],[ZipCode]],dZipNeighborhood[ZipCode],dZipNeighborhood[Neighborhood])","v":"Greenwood"}]
["Weeds","2020-02-28","Compliance Achieved","Completed","98144",{"$f":"_xlfn.XLOOKUP(--fSeattle2020Complaints[[#This Row],[ZipCode]],dZipNeighborhood[ZipCode],dZipNeighborhood[Neighborhood])","v":"Mount Baker"}]
["Construction","2020-09-08","Completed","Completed","98118",{"$f":"_xlfn.XLOOKUP(--fSeattle2020Complaints[[#This Row],[ZipCode]],dZipNeighborhood[ZipCode],dZipNeighborhood[Neighborhood])","v":"Columbia City"}]
["Land Use","2020-03-10","Completed","Initiated","98106",{"$f":"_xlfn.XLOOKUP(--fSeattle2020Complaints[[#This Row],[ZipCode]],dZipNeighborhood[ZipCode],dZipNeighborhood[Neighborhood])","v":"Delridge"}]
["Weeds","2020-06-01","Completed","Closed","98136",{"$f":"_xlfn.XLOOKUP(--fSeattle2020Complaints[[#This Row],[ZipCode]],dZipNeighborhood[ZipCode],dZipNeighborhood[Neighborhood])","v":"Seaview"}]
["Land Use","2020-12-03","Completed","Completed","98122",{"$f":"_xlfn.XLOOKUP(--fSeattle2020Complaints[[#This Row],[ZipCode]],dZipNeighborhood[ZipCode],dZipNeighborhood[Neighborhood])","v":"Minor, Central Area"}]
["Weeds","2020-06-05","Completed","Completed","98106",{"$f":"_xlfn.XLOOKUP(--fSeattle2020Complaints[[#This Row],[ZipCode]],dZipNeighborhood[ZipCode],dZipNeighborhood[Neighborhood])","v":"Delridge"}]
["Vacant Building","2020-05-28","Completed","Completed","98103",{"$f":"_xlfn.XLOOKUP(--fSeattle2020Complaints[[#This Row],[ZipCode]],dZipNeighborhood[ZipCode],dZipNeighborhood[Neighborhood])","v":"Greenwood"}]
["Construction","2020-06-30","Completed","Completed","98125",{"$f":"_xlfn.XLOOKUP(--fSeattle2020Complaints[[#This Row],[ZipCode]],dZipNeighborhood[ZipCode],dZipNeighborhood[Neighborhood])","v":"Northgate"}]
["Land Use","2020-02-19","Completed","Completed","98108",{"$f":"_xlfn.XLOOKUP(--fSeattle2020Complaints[[#This Row],[ZipCode]],dZipNeighborhood[ZipCode],dZipNeighborhood[Neighborhood])","v":"Rainer Valley"}]
["Vacant Building","2020-05-20","Completed","Completed","98115",{"$f":"_xlfn.XLOOKUP(--fSeattle2020Complaints[[#This Row],[ZipCode]],dZipNeighborhood[ZipCode],dZipNeighborhood[Neighborhood])","v":"Greenlake"}]
["Weeds","2020-10-12","Completed","Closed","98118",{"$f":"_xlfn.XLOOKUP(--fSeattle2020Complaints[[#This Row],[ZipCode]],dZipNeighborhood[ZipCode],dZipNeighborhood[Neighborhood])","v":"Columbia City"}]
["Land Use","2020-04-30","Completed","Completed","98118",{"$f":"_xlfn.XLOOKUP(--fSeattle2020Complaints[[#This Row],[ZipCode]],dZipNeighborhood[ZipCode],dZipNeighborhood[Neighborhood])","v":"Columbia City"}]
["Land Use","2020-02-03","Completed","Completed","98122",{"$f":"_xlfn.XLOOKUP(--fSeattle2020Complaints[[#This Row],[ZipCode]],dZipNeighborhood[ZipCode],dZipNeighborhood[Neighborhood])","v":"Minor, Central Area"}]
["LandLord/Tenant","2020-07-07","Completed","Under Investigation","98104",{"$f":"_xlfn.XLOOKUP(--fSeattle2020Complaints[[#This Row],[ZipCode]],dZipNeighborhood[ZipCode],dZipNeighborhood[Neighborhood])","v":"International District"}]
["Construction","2020-07-06","Completed","Completed","98136",{"$f":"_xlfn.XLOOKUP(--fSeattle2020Complaints[[#This Row],[ZipCode]],dZipNeighborhood[ZipCode],dZipNeighborhood[Neighborhood])","v":"Seaview"}]
["Vacant Building","2020-02-20","Completed","Completed","98144",{"$f":"_xlfn.XLOOKUP(--fSeattle2020Complaints[[#This Row],[ZipCode]],dZipNeighborhood[ZipCode],dZipNeighborhood[Neighborhood])","v":"Mount Baker"}]
["Construction","2020-06-18","Completed","Completed","98118",{"$f":"_xlfn.XLOOKUP(--fSeattle2020Complaints[[#This Row],[ZipCode]],dZipNeighborhood[ZipCode],dZipNeighborhood[Neighborhood])","v":"Columbia City"}]
["Construction","2020-01-30","Completed","Completed","98146",{"$f":"_xlfn.XLOOKUP(--fSeattle2020Complaints[[#This Row],[ZipCode]],dZipNeighborhood[ZipCode],dZipNeighborhood[Neighborhood])","v":"Shorewood, White Center"}]
["Emergency","2020-05-26","Completed","Completed","98101",{"$f":"_xlfn.XLOOKUP(--fSeattle2020Complaints[[#This Row],[ZipCode]],dZipNeighborhood[ZipCode],dZipNeighborhood[Neighborhood])","v":"Seattle"}]
["Weeds","2020-11-04","Completed","Completed","98103",{"$f":"_xlfn.XLOOKUP(--fSeattle2020Complaints[[#This Row],[ZipCode]],dZipNeighborhood[ZipCode],dZipNeighborhood[Neighborhood])","v":"Greenwood"}]
["Land Use","2020-12-07","Completed","Completed","98105",{"$f":"_xlfn.XLOOKUP(--fSeattle2020Complaints[[#This Row],[ZipCode]],dZipNeighborhood[ZipCode],dZipNeighborhood[Neighborhood])","v":"University District"}]
["LandLord/Tenant","2020-04-20","Compliance Achieved","Completed","98104",{"$f":"_xlfn.XLOOKUP(--fSeattle2020Complaints[[#This Row],[ZipCode]],dZipNeighborhood[ZipCode],dZipNeighborhood[Neighborhood])","v":"International District"}]
["Land Use","2020-09-29","Completed","Completed","98112",{"$f":"_xlfn.XLOOKUP(--fSeattle2020Complaints[[#This Row],[ZipCode]],dZipNeighborhood[ZipCode],dZipNeighborhood[Neighborhood])","v":"Madison Park"}]
["Land Use","2020-09-06","Completed","Completed","98115",{"$f":"_xlfn.XLOOKUP(--fSeattle2020Complaints[[#This Row],[ZipCode]],dZipNeighborhood[ZipCode],dZipNeighborhood[Neighborhood])","v":"Greenlake"}]
["Land Use","2020-01-29","Completed","Completed","98102",{"$f":"_xlfn.XLOOKUP(--fSeattle2020Complaints[[#This Row],[ZipCode]],dZipNeighborhood[ZipCode],dZipNeighborhood[Neighborhood])","v":"Capital Hill"}]
["Construction","2020-08-12","Completed","Completed","98144",{"$f":"_xlfn.XLOOKUP(--fSeattle2020Complaints[[#This Row],[ZipCode]],dZipNeighborhood[ZipCode],dZipNeighborhood[Neighborhood])","v":"Mount Baker"}]
["Emergency , Vacant Building","2020-01-23","Completed","Completed","98122",{"$f":"_xlfn.XLOOKUP(--fSeattle2020Complaints[[#This Row],[ZipCode]],dZipNeighborhood[ZipCode],dZipNeighborhood[Neighborhood])","v":"Minor, Central Area"}]
["Emergency , Vacant Building","2020-07-09","Compliance Achieved","Completed","98119",{"$f":"_xlfn.XLOOKUP(--fSeattle2020Complaints[[#This Row],[ZipCode]],dZipNeighborhood[ZipCode],dZipNeighborhood[Neighborhood])","v":"Queen Anne"}]
["Land Use","2020-08-04","Completed","Completed","98106",{"$f":"_xlfn.XLOOKUP(--fSeattle2020Complaints[[#This Row],[ZipCode]],dZipNeighborhood[ZipCode],dZipNeighborhood[Neighborhood])","v":"Delridge"}]
["Weeds","2020-03-05","Compliance Achieved","Completed","98115",{"$f":"_xlfn.XLOOKUP(--fSeattle2020Complaints[[#This Row],[ZipCode]],dZipNeighborhood[ZipCode],dZipNeighborhood[Neighborhood])","v":"Greenlake"}]
["Land Use","2020-09-14","Completed","Completed","98144",{"$f":"_xlfn.XLOOKUP(--fSeattle2020Complaints[[#This Row],[ZipCode]],dZipNeighborhood[ZipCode],dZipNeighborhood[Neighborhood])","v":"Mount Baker"}]
["Land Use","2020-12-28","Completed","Under Investigation","98118",{"$f":"_xlfn.XLOOKUP(--fSeattle2020Complaints[[#This Row],[ZipCode]],dZipNeighborhood[ZipCode],dZipNeighborhood[Neighborhood])","v":"Columbia City"}]
["Construction","2020-01-27","Completed","Completed","98115",{"$f":"_xlfn.XLOOKUP(--fSeattle2020Complaints[[#This Row],[ZipCode]],dZipNeighborhood[ZipCode],dZipNeighborhood[Neighborhood])","v":"Greenlake"}]
["Weeds","2020-07-01","Compliance Achieved","Completed","98126",{"$f":"_xlfn.XLOOKUP(--fSeattle2020Complaints[[#This Row],[ZipCode]],dZipNeighborhood[ZipCode],dZipNeighborhood[Neighborhood])","v":"High Point"}]
["Emergency , Vacant Building","2020-07-16","Completed","EO Repair Restore Issued","98126",{"$f":"_xlfn.XLOOKUP(--fSeattle2020Complaints[[#This Row],[ZipCode]],dZipNeighborhood[ZipCode],dZipNeighborhood[Neighborhood])","v":"High Point"}]
["Land Use","2020-03-13","Completed","Initiated","98126",{"$f":"_xlfn.XLOOKUP(--fSeattle2020Complaints[[#This Row],[ZipCode]],dZipNeighborhood[ZipCode],dZipNeighborhood[Neighborhood])","v":"High Point"}]
["Land Use","2020-11-02","Completed","Completed","98122",{"$f":"_xlfn.XLOOKUP(--fSeattle2020Complaints[[#This Row],[ZipCode]],dZipNeighborhood[ZipCode],dZipNeighborhood[Neighborhood])","v":"Minor, Central Area"}]
["Land Use","2020-02-03","Completed","Completed","98122",{"$f":"_xlfn.XLOOKUP(--fSeattle2020Complaints[[#This Row],[ZipCode]],dZipNeighborhood[ZipCode],dZipNeighborhood[Neighborhood])","v":"Minor, Central Area"}]
["Land Use","2020-07-17","Completed","Completed","98102",{"$f":"_xlfn.XLOOKUP(--fSeattle2020Complaints[[#This Row],[ZipCode]],dZipNeighborhood[ZipCode],dZipNeighborhood[Neighborhood])","v":"Capital Hill"}]
["Land Use","2020-02-10","Completed","Completed","98136",{"$f":"_xlfn.XLOOKUP(--fSeattle2020Complaints[[#This Row],[ZipCode]],dZipNeighborhood[ZipCode],dZipNeighborhood[Neighborhood])","v":"Seaview"}]
["Construction","2020-03-03","Compliance Achieved","Completed","98108",{"$f":"_xlfn.XLOOKUP(--fSeattle2020Complaints[[#This Row],[ZipCode]],dZipNeighborhood[ZipCode],dZipNeighborhood[Neighborhood])","v":"Rainer Valley"}]
["Construction","2020-02-19","Completed","Initiated","98108",{"$f":"_xlfn.XLOOKUP(--fSeattle2020Complaints[[#This Row],[ZipCode]],dZipNeighborhood[ZipCode],dZipNeighborhood[Neighborhood])","v":"Rainer Valley"}]
["Weeds","2020-07-27","Completed","Completed","98103",{"$f":"_xlfn.XLOOKUP(--fSeattle2020Complaints[[#This Row],[ZipCode]],dZipNeighborhood[ZipCode],dZipNeighborhood[Neighborhood])","v":"Greenwood"}]
["Vacant Building","2020-05-05","Completed","Closed","98105",{"$f":"_xlfn.XLOOKUP(--fSeattle2020Complaints[[#This Row],[ZipCode]],dZipNeighborhood[ZipCode],dZipNeighborhood[Neighborhood])","v":"University District"}]
["Noise","2020-01-24","Completed","Completed","98112",{"$f":"_xlfn.XLOOKUP(--fSeattle2020Complaints[[#This Row],[ZipCode]],dZipNeighborhood[ZipCode],dZipNeighborhood[Neighborhood])","v":"Madison Park"}]
["Construction","2020-07-13","Completed","Under Investigation","98144",{"$f":"_xlfn.XLOOKUP(--fSeattle2020Complaints[[#This Row],[ZipCode]],dZipNeighborhood[ZipCode],dZipNeighborhood[Neighborhood])","v":"Mount Baker"}]
["Land Use","2020-07-10","Completed","Completed","98118",{"$f":"_xlfn.XLOOKUP(--fSeattle2020Complaints[[#This Row],[ZipCode]],dZipNeighborhood[ZipCode],dZipNeighborhood[Neighborhood])","v":"Columbia City"}]
["Tree","2020-02-19","Completed","Completed","98102",{"$f":"_xlfn.XLOOKUP(--fSeattle2020Complaints[[#This Row],[ZipCode]],dZipNeighborhood[ZipCode],dZipNeighborhood[Neighborhood])","v":"Capital Hill"}]
["Land UseConstruction ,","2020-05-10","Completed","Completed","98126",{"$f":"_xlfn.XLOOKUP(--fSeattle2020Complaints[[#This Row],[ZipCode]],dZipNeighborhood[ZipCode],dZipNeighborhood[Neighborhood])","v":"High Point"}]
["Construction","2020-11-12","Completed","Completed","98125",{"$f":"_xlfn.XLOOKUP(--fSeattle2020Complaints[[#This Row],[ZipCode]],dZipNeighborhood[ZipCode],dZipNeighborhood[Neighborhood])","v":"Northgate"}]
["Emergency , Vacant Building","2020-04-08","Compliance Achieved","Completed","98122",{"$f":"_xlfn.XLOOKUP(--fSeattle2020Complaints[[#This Row],[ZipCode]],dZipNeighborhood[ZipCode],dZipNeighborhood[Neighborhood])","v":"Minor, Central Area"}]
["Emergency , Vacant Building","2020-04-16","Compliance Achieved","Completed","98122",{"$f":"_xlfn.XLOOKUP(--fSeattle2020Complaints[[#This Row],[ZipCode]],dZipNeighborhood[ZipCode],dZipNeighborhood[Neighborhood])","v":"Minor, Central Area"}]
["LandLord/Tenant","2020-01-07","Compliance Achieved","Completed","98102",{"$f":"_xlfn.XLOOKUP(--fSeattle2020Complaints[[#This Row],[ZipCode]],dZipNeighborhood[ZipCode],dZipNeighborhood[Neighborhood])","v":"Capital Hill"}]
["Vacant Building","2020-04-28","Completed","Completed","98107",{"$f":"_xlfn.XLOOKUP(--fSeattle2020Complaints[[#This Row],[ZipCode]],dZipNeighborhood[ZipCode],dZipNeighborhood[Neighborhood])","v":"Ballard"}]
["Weeds","2020-10-01","Completed","Completed","98118",{"$f":"_xlfn.XLOOKUP(--fSeattle2020Complaints[[#This Row],[ZipCode]],dZipNeighborhood[ZipCode],dZipNeighborhood[Neighborhood])","v":"Columbia City"}]
["Land Use","2020-09-01","Completed","Completed","98117",{"$f":"_xlfn.XLOOKUP(--fSeattle2020Complaints[[#This Row],[ZipCode]],dZipNeighborhood[ZipCode],dZipNeighborhood[Neighborhood])","v":"Sunset Hill"}]
["Land Use","2020-02-24","Completed","Completed","98118",{"$f":"_xlfn.XLOOKUP(--fSeattle2020Complaints[[#This Row],[ZipCode]],dZipNeighborhood[ZipCode],dZipNeighborhood[Neighborhood])","v":"Columbia City"}]
["Land UseWeeds ,","2020-07-12","Completed","Completed","98102",{"$f":"_xlfn.XLOOKUP(--fSeattle2020Complaints[[#This Row],[ZipCode]],dZipNeighborhood[ZipCode],dZipNeighborhood[Neighborhood])","v":"Capital Hill"}]
["Weeds","2020-05-13","Completed","Completed","98106",{"$f":"_xlfn.XLOOKUP(--fSeattle2020Complaints[[#This Row],[ZipCode]],dZipNeighborhood[ZipCode],dZipNeighborhood[Neighborhood])","v":"Delridge"}]
["LandLord/Tenant","2020-09-30","Completed","Completed","98118",{"$f":"_xlfn.XLOOKUP(--fSeattle2020Complaints[[#This Row],[ZipCode]],dZipNeighborhood[ZipCode],dZipNeighborhood[Neighborhood])","v":"Columbia City"}]
["Land UseTree ,","2020-09-10","Completed","Completed","98103",{"$f":"_xlfn.XLOOKUP(--fSeattle2020Complaints[[#This Row],[ZipCode]],dZipNeighborhood[ZipCode],dZipNeighborhood[Neighborhood])","v":"Greenwood"}]
["Construction","2020-02-20","Compliance Achieved","Completed","98122",{"$f":"_xlfn.XLOOKUP(--fSeattle2020Complaints[[#This Row],[ZipCode]],dZipNeighborhood[ZipCode],dZipNeighborhood[Neighborhood])","v":"Minor, Central Area"}]
["Tree","2020-05-19","Completed","Completed","98116",{"$f":"_xlfn.XLOOKUP(--fSeattle2020Complaints[[#This Row],[ZipCode]],dZipNeighborhood[ZipCode],dZipNeighborhood[Neighborhood])","v":"West Seattle"}]
["LandLord/Tenant","2020-02-12","Completed","Completed","98126",{"$f":"_xlfn.XLOOKUP(--fSeattle2020Complaints[[#This Row],[ZipCode]],dZipNeighborhood[ZipCode],dZipNeighborhood[Neighborhood])","v":"High Point"}]
["Emergency","2020-03-11","Completed","Completed","98105",{"$f":"_xlfn.XLOOKUP(--fSeattle2020Complaints[[#This Row],[ZipCode]],dZipNeighborhood[ZipCode],dZipNeighborhood[Neighborhood])","v":"University District"}]
["Weeds","2020-03-17","Compliance Achieved","Completed","98103",{"$f":"_xlfn.XLOOKUP(--fSeattle2020Complaints[[#This Row],[ZipCode]],dZipNeighborhood[ZipCode],dZipNeighborhood[Neighborhood])","v":"Greenwood"}]
["Weeds","2020-02-14","Compliance Achieved","Completed","98122",{"$f":"_xlfn.XLOOKUP(--fSeattle2020Complaints[[#This Row],[ZipCode]],dZipNeighborhood[ZipCode],dZipNeighborhood[Neighborhood])","v":"Minor, Central Area"}]
["Weeds","2020-12-29","Completed","Completed","98134",{"$f":"_xlfn.XLOOKUP(--fSeattle2020Complaints[[#This Row],[ZipCode]],dZipNeighborhood[ZipCode],dZipNeighborhood[Neighborhood])","v":"Duwamish"}]
["Land Use","2020-02-08","Completed","Completed","98109",{"$f":"_xlfn.XLOOKUP(--fSeattle2020Complaints[[#This Row],[ZipCode]],dZipNeighborhood[ZipCode],dZipNeighborhood[Neighborhood])","v":"South Lake Union"}]
["Weeds","2020-07-10","Completed","Initiated","98177",{"$f":"_xlfn.XLOOKUP(--fSeattle2020Complaints[[#This Row],[ZipCode]],dZipNeighborhood[ZipCode],dZipNeighborhood[Neighborhood])","v":"Richmond Beach"}]
["Land Use","2020-04-07","Completed","Completed","98133",{"$f":"_xlfn.XLOOKUP(--fSeattle2020Complaints[[#This Row],[ZipCode]],dZipNeighborhood[ZipCode],dZipNeighborhood[Neighborhood])","v":"Shoreline"}]
["Land Use","2020-02-21","Completed","Completed","98117",{"$f":"_xlfn.XLOOKUP(--fSeattle2020Complaints[[#This Row],[ZipCode]],dZipNeighborhood[ZipCode],dZipNeighborhood[Neighborhood])","v":"Sunset Hill"}]
["Construction","2020-01-23","Completed","Completed","98144",{"$f":"_xlfn.XLOOKUP(--fSeattle2020Complaints[[#This Row],[ZipCode]],dZipNeighborhood[ZipCode],dZipNeighborhood[Neighborhood])","v":"Mount Baker"}]
["Weeds","2020-09-07","Completed","Completed","98105",{"$f":"_xlfn.XLOOKUP(--fSeattle2020Complaints[[#This Row],[ZipCode]],dZipNeighborhood[ZipCode],dZipNeighborhood[Neighborhood])","v":"University District"}]
["Construction","2020-07-22","Completed","NOV Issued","98199",{"$f":"_xlfn.XLOOKUP(--fSeattle2020Complaints[[#This Row],[ZipCode]],dZipNeighborhood[ZipCode],dZipNeighborhood[Neighborhood])","v":"Magnolia"}]
["Land UseShoreline ,","2020-06-10","Completed","Completed","98136",{"$f":"_xlfn.XLOOKUP(--fSeattle2020Complaints[[#This Row],[ZipCode]],dZipNeighborhood[ZipCode],dZipNeighborhood[Neighborhood])","v":"Seaview"}]
["Construction","2020-02-05","Completed","NOV Issued","98146",{"$f":"_xlfn.XLOOKUP(--fSeattle2020Complaints[[#This Row],[ZipCode]],dZipNeighborhood[ZipCode],dZipNeighborhood[Neighborhood])","v":"Shorewood, White Center"}]
["Land Use","2020-07-08","Completed","Completed","98109",{"$f":"_xlfn.XLOOKUP(--fSeattle2020Complaints[[#This Row],[ZipCode]],dZipNeighborhood[ZipCode],dZipNeighborhood[Neighborhood])","v":"South Lake Union"}]
["Land Use","2020-05-26","Completed","Completed","98101",{"$f":"_xlfn.XLOOKUP(--fSeattle2020Complaints[[#This Row],[ZipCode]],dZipNeighborhood[ZipCode],dZipNeighborhood[Neighborhood])","v":"Seattle"}]
["Tree","2020-04-07","Completed","Completed","98122",{"$f":"_xlfn.XLOOKUP(--fSeattle2020Complaints[[#This Row],[ZipCode]],dZipNeighborhood[ZipCode],dZipNeighborhood[Neighborhood])","v":"Minor, Central Area"}]
["Construction","2020-12-03","Completed","Completed","98122",{"$f":"_xlfn.XLOOKUP(--fSeattle2020Complaints[[#This Row],[ZipCode]],dZipNeighborhood[ZipCode],dZipNeighborhood[Neighborhood])","v":"Minor, Central Area"}]
["Tree","2020-07-31","Completed","Completed","98177",{"$f":"_xlfn.XLOOKUP(--fSeattle2020Complaints[[#This Row],[ZipCode]],dZipNeighborhood[ZipCode],dZipNeighborhood[Neighborhood])","v":"Richmond Beach"}]
["Vacant Building","2020-08-14","Completed","Completed","98102",{"$f":"_xlfn.XLOOKUP(--fSeattle2020Complaints[[#This Row],[ZipCode]],dZipNeighborhood[ZipCode],dZipNeighborhood[Neighborhood])","v":"Capital Hill"}]
["Vacant Building","2020-11-17","Completed","Completed","98144",{"$f":"_xlfn.XLOOKUP(--fSeattle2020Complaints[[#This Row],[ZipCode]],dZipNeighborhood[ZipCode],dZipNeighborhood[Neighborhood])","v":"Mount Baker"}]
["Weeds","2020-06-24","Completed","Completed","98144",{"$f":"_xlfn.XLOOKUP(--fSeattle2020Complaints[[#This Row],[ZipCode]],dZipNeighborhood[ZipCode],dZipNeighborhood[Neighborhood])","v":"Mount Baker"}]
["Land Use","2020-12-20","Compliance Achieved","Completed","98122",{"$f":"_xlfn.XLOOKUP(--fSeattle2020Complaints[[#This Row],[ZipCode]],dZipNeighborhood[ZipCode],dZipNeighborhood[Neighborhood])","v":"Minor, Central Area"}]
["Vacant Building","2020-01-27","Completed","Completed","98115",{"$f":"_xlfn.XLOOKUP(--fSeattle2020Complaints[[#This Row],[ZipCode]],dZipNeighborhood[ZipCode],dZipNeighborhood[Neighborhood])","v":"Greenlake"}]
["Construction","2020-03-16","Completed","Completed","98178",{"$f":"_xlfn.XLOOKUP(--fSeattle2020Complaints[[#This Row],[ZipCode]],dZipNeighborhood[ZipCode],dZipNeighborhood[Neighborhood])","v":"Skyway"}]
["Land Use","2020-08-25","Completed","Completed","98108",{"$f":"_xlfn.XLOOKUP(--fSeattle2020Complaints[[#This Row],[ZipCode]],dZipNeighborhood[ZipCode],dZipNeighborhood[Neighborhood])","v":"Rainer Valley"}]
["Weeds","2020-05-15","Completed","Completed","98116",{"$f":"_xlfn.XLOOKUP(--fSeattle2020Complaints[[#This Row],[ZipCode]],dZipNeighborhood[ZipCode],dZipNeighborhood[Neighborhood])","v":"West Seattle"}]
["Land Use","2020-01-15","Completed","Completed","98133",{"$f":"_xlfn.XLOOKUP(--fSeattle2020Complaints[[#This Row],[ZipCode]],dZipNeighborhood[ZipCode],dZipNeighborhood[Neighborhood])","v":"Shoreline"}]
["Shoreline","2020-03-26","No Access/Unable to Observe","Closed","98199",{"$f":"_xlfn.XLOOKUP(--fSeattle2020Complaints[[#This Row],[ZipCode]],dZipNeighborhood[ZipCode],dZipNeighborhood[Neighborhood])","v":"Magnolia"}]
["Land Use","2020-03-12","Compliance Achieved","Completed","98117",{"$f":"_xlfn.XLOOKUP(--fSeattle2020Complaints[[#This Row],[ZipCode]],dZipNeighborhood[ZipCode],dZipNeighborhood[Neighborhood])","v":"Sunset Hill"}]
["Vacant Building","2020-03-13","Completed","Closed","98109",{"$f":"_xlfn.XLOOKUP(--fSeattle2020Complaints[[#This Row],[ZipCode]],dZipNeighborhood[ZipCode],dZipNeighborhood[Neighborhood])","v":"South Lake Union"}]
["Weeds","2020-08-20","Completed","Completed","98108",{"$f":"_xlfn.XLOOKUP(--fSeattle2020Complaints[[#This Row],[ZipCode]],dZipNeighborhood[ZipCode],dZipNeighborhood[Neighborhood])","v":"Rainer Valley"}]
["Emergency , Vacant Building","2020-05-08","Compliance Achieved","Completed","98105",{"$f":"_xlfn.XLOOKUP(--fSeattle2020Complaints[[#This Row],[ZipCode]],dZipNeighborhood[ZipCode],dZipNeighborhood[Neighborhood])","v":"University District"}]
["Land UseConstruction ,","2020-10-30","Completed","Completed","98122",{"$f":"_xlfn.XLOOKUP(--fSeattle2020Complaints[[#This Row],[ZipCode]],dZipNeighborhood[ZipCode],dZipNeighborhood[Neighborhood])","v":"Minor, Central Area"}]
["Vacant Building","2020-04-06","Completed","Closed","98103",{"$f":"_xlfn.XLOOKUP(--fSeattle2020Complaints[[#This Row],[ZipCode]],dZipNeighborhood[ZipCode],dZipNeighborhood[Neighborhood])","v":"Greenwood"}]
["Construction","2020-07-21","Completed","Completed","98102",{"$f":"_xlfn.XLOOKUP(--fSeattle2020Complaints[[#This Row],[ZipCode]],dZipNeighborhood[ZipCode],dZipNeighborhood[Neighborhood])","v":"Capital Hill"}]
["Land Use","2020-04-05","Completed","Completed","98112",{"$f":"_xlfn.XLOOKUP(--fSeattle2020Complaints[[#This Row],[ZipCode]],dZipNeighborhood[ZipCode],dZipNeighborhood[Neighborhood])","v":"Madison Park"}]
["Land Use","2020-04-10","Completed","Completed","98134",{"$f":"_xlfn.XLOOKUP(--fSeattle2020Complaints[[#This Row],[ZipCode]],dZipNeighborhood[ZipCode],dZipNeighborhood[Neighborhood])","v":"Duwamish"}]
["Weeds","2020-03-13","Completed","Closed","98103",{"$f":"_xlfn.XLOOKUP(--fSeattle2020Complaints[[#This Row],[ZipCode]],dZipNeighborhood[ZipCode],dZipNeighborhood[Neighborhood])","v":"Greenwood"}]
["Land Use","2020-02-10","Completed","Warning","98106",{"$f":"_xlfn.XLOOKUP(--fSeattle2020Complaints[[#This Row],[ZipCode]],dZipNeighborhood[ZipCode],dZipNeighborhood[Neighborhood])","v":"Delridge"}]
["Construction","2020-07-19","No Access/Unable to Observe","Under Investigation","98102",{"$f":"_xlfn.XLOOKUP(--fSeattle2020Complaints[[#This Row],[ZipCode]],dZipNeighborhood[ZipCode],dZipNeighborhood[Neighborhood])","v":"Capital Hill"}]
["LandLord/Tenant","2020-03-02","Completed","Completed","98115",{"$f":"_xlfn.XLOOKUP(--fSeattle2020Complaints[[#This Row],[ZipCode]],dZipNeighborhood[ZipCode],dZipNeighborhood[Neighborhood])","v":"Greenlake"}]
["Land Use","2020-07-28","Completed","Completed","98117",{"$f":"_xlfn.XLOOKUP(--fSeattle2020Complaints[[#This Row],[ZipCode]],dZipNeighborhood[ZipCode],dZipNeighborhood[Neighborhood])","v":"Sunset Hill"}]
["Weeds","2020-05-07","Completed","Completed","98106",{"$f":"_xlfn.XLOOKUP(--fSeattle2020Complaints[[#This Row],[ZipCode]],dZipNeighborhood[ZipCode],dZipNeighborhood[Neighborhood])","v":"Delridge"}]
["Tree","2020-08-06","Completed","Completed","98126",{"$f":"_xlfn.XLOOKUP(--fSeattle2020Complaints[[#This Row],[ZipCode]],dZipNeighborhood[ZipCode],dZipNeighborhood[Neighborhood])","v":"High Point"}]
["Construction","2020-02-19","Completed","Completed","98107",{"$f":"_xlfn.XLOOKUP(--fSeattle2020Complaints[[#This Row],[ZipCode]],dZipNeighborhood[ZipCode],dZipNeighborhood[Neighborhood])","v":"Ballard"}]
["Land Use","2020-07-23","No Access/Unable to Observe","Completed","98125",{"$f":"_xlfn.XLOOKUP(--fSeattle2020Complaints[[#This Row],[ZipCode]],dZipNeighborhood[ZipCode],dZipNeighborhood[Neighborhood])","v":"Northgate"}]
["Land Use","2020-05-24","Completed","Completed","98108",{"$f":"_xlfn.XLOOKUP(--fSeattle2020Complaints[[#This Row],[ZipCode]],dZipNeighborhood[ZipCode],dZipNeighborhood[Neighborhood])","v":"Rainer Valley"}]
["Construction","2020-08-14","Completed","Under Investigation","98109",{"$f":"_xlfn.XLOOKUP(--fSeattle2020Complaints[[#This Row],[ZipCode]],dZipNeighborhood[ZipCode],dZipNeighborhood[Neighborhood])","v":"South Lake Union"}]
["Land Use","2020-02-06","Completed","Completed","98104",{"$f":"_xlfn.XLOOKUP(--fSeattle2020Complaints[[#This Row],[ZipCode]],dZipNeighborhood[ZipCode],dZipNeighborhood[Neighborhood])","v":"International District"}]
["Construction","2020-05-26","Completed","Closed","98126",{"$f":"_xlfn.XLOOKUP(--fSeattle2020Complaints[[#This Row],[ZipCode]],dZipNeighborhood[ZipCode],dZipNeighborhood[Neighborhood])","v":"High Point"}]
["Weeds","2020-07-02","Compliance Achieved","Completed","98116",{"$f":"_xlfn.XLOOKUP(--fSeattle2020Complaints[[#This Row],[ZipCode]],dZipNeighborhood[ZipCode],dZipNeighborhood[Neighborhood])","v":"West Seattle"}]
["Land Use","2020-08-30","Completed","Completed","98178",{"$f":"_xlfn.XLOOKUP(--fSeattle2020Complaints[[#This Row],[ZipCode]],dZipNeighborhood[ZipCode],dZipNeighborhood[Neighborhood])","v":"Skyway"}]
["Construction","2020-02-22","Completed","Completed","98126",{"$f":"_xlfn.XLOOKUP(--fSeattle2020Complaints[[#This Row],[ZipCode]],dZipNeighborhood[ZipCode],dZipNeighborhood[Neighborhood])","v":"High Point"}]
["Land Use","2020-04-15","Compliance Achieved","Completed","98115",{"$f":"_xlfn.XLOOKUP(--fSeattle2020Complaints[[#This Row],[ZipCode]],dZipNeighborhood[ZipCode],dZipNeighborhood[Neighborhood])","v":"Greenlake"}]
["Land UseNoise ,","2020-12-12","Completed","Completed","98103",{"$f":"_xlfn.XLOOKUP(--fSeattle2020Complaints[[#This Row],[ZipCode]],dZipNeighborhood[ZipCode],dZipNeighborhood[Neighborhood])","v":"Greenwood"}]
["Weeds","2020-05-29","Completed","Completed","98103",{"$f":"_xlfn.XLOOKUP(--fSeattle2020Complaints[[#This Row],[ZipCode]],dZipNeighborhood[ZipCode],dZipNeighborhood[Neighborhood])","v":"Greenwood"}]
["Land Use","2020-01-13","Completed","Citation Issued","98133",{"$f":"_xlfn.XLOOKUP(--fSeattle2020Complaints[[#This Row],[ZipCode]],dZipNeighborhood[ZipCode],dZipNeighborhood[Neighborhood])","v":"Shoreline"}]
["Land Use","2020-10-18","Completed","Completed","98103",{"$f":"_xlfn.XLOOKUP(--fSeattle2020Complaints[[#This Row],[ZipCode]],dZipNeighborhood[ZipCode],dZipNeighborhood[Neighborhood])","v":"Greenwood"}]
["Vacant Building","2020-10-28","Secured with No Violations","Completed","98199",{"$f":"_xlfn.XLOOKUP(--fSeattle2020Complaints[[#This Row],[ZipCode]],dZipNeighborhood[ZipCode],dZipNeighborhood[Neighborhood])","v":"Magnolia"}]
["Construction","2020-03-04","Completed","NOV Issued","98118",{"$f":"_xlfn.XLOOKUP(--fSeattle2020Complaints[[#This Row],[ZipCode]],dZipNeighborhood[ZipCode],dZipNeighborhood[Neighborhood])","v":"Columbia City"}]
["Construction","2020-02-03","Completed","Completed","98126",{"$f":"_xlfn.XLOOKUP(--fSeattle2020Complaints[[#This Row],[ZipCode]],dZipNeighborhood[ZipCode],dZipNeighborhood[Neighborhood])","v":"High Point"}]
["Vacant Building","2020-11-10","Completed","Completed","98144",{"$f":"_xlfn.XLOOKUP(--fSeattle2020Complaints[[#This Row],[ZipCode]],dZipNeighborhood[ZipCode],dZipNeighborhood[Neighborhood])","v":"Mount Baker"}]
["Weeds","2020-10-15","Completed","Completed","98118",{"$f":"_xlfn.XLOOKUP(--fSeattle2020Complaints[[#This Row],[ZipCode]],dZipNeighborhood[ZipCode],dZipNeighborhood[Neighborhood])","v":"Columbia City"}]
["Land Use","2020-02-21","Completed","Completed","98199",{"$f":"_xlfn.XLOOKUP(--fSeattle2020Complaints[[#This Row],[ZipCode]],dZipNeighborhood[ZipCode],dZipNeighborhood[Neighborhood])","v":"Magnolia"}]
["Land Use","2020-10-27","Completed","Completed","98121",{"$f":"_xlfn.XLOOKUP(--fSeattle2020Complaints[[#This Row],[ZipCode]],dZipNeighborhood[ZipCode],dZipNeighborhood[Neighborhood])","v":"Belltown"}]
["Vacant Building","2020-12-01","Completed","Completed","98107",{"$f":"_xlfn.XLOOKUP(--fSeattle2020Complaints[[#This Row],[ZipCode]],dZipNeighborhood[ZipCode],dZipNeighborhood[Neighborhood])","v":"Ballard"}]
["Construction","2020-01-30","No Access/Unable to Observe","Completed","98199",{"$f":"_xlfn.XLOOKUP(--fSeattle2020Complaints[[#This Row],[ZipCode]],dZipNeighborhood[ZipCode],dZipNeighborhood[Neighborhood])","v":"Magnolia"}]
["Construction","2020-12-09","Completed","Completed","98109",{"$f":"_xlfn.XLOOKUP(--fSeattle2020Complaints[[#This Row],[ZipCode]],dZipNeighborhood[ZipCode],dZipNeighborhood[Neighborhood])","v":"South Lake Union"}]
["Land Use","2020-06-25","Completed","Completed","98108",{"$f":"_xlfn.XLOOKUP(--fSeattle2020Complaints[[#This Row],[ZipCode]],dZipNeighborhood[ZipCode],dZipNeighborhood[Neighborhood])","v":"Rainer Valley"}]
["Weeds","2020-02-05","Compliance Achieved","Completed","98112",{"$f":"_xlfn.XLOOKUP(--fSeattle2020Complaints[[#This Row],[ZipCode]],dZipNeighborhood[ZipCode],dZipNeighborhood[Neighborhood])","v":"Madison Park"}]
["Land Use","2020-03-06","Completed","Completed","98116",{"$f":"_xlfn.XLOOKUP(--fSeattle2020Complaints[[#This Row],[ZipCode]],dZipNeighborhood[ZipCode],dZipNeighborhood[Neighborhood])","v":"West Seattle"}]
["Land Use","2020-01-08","Completed","Completed","98119",{"$f":"_xlfn.XLOOKUP(--fSeattle2020Complaints[[#This Row],[ZipCode]],dZipNeighborhood[ZipCode],dZipNeighborhood[Neighborhood])","v":"Queen Anne"}]
["Noise","2020-03-16","Completed","Completed","98101",{"$f":"_xlfn.XLOOKUP(--fSeattle2020Complaints[[#This Row],[ZipCode]],dZipNeighborhood[ZipCode],dZipNeighborhood[Neighborhood])","v":"Seattle"}]
["Construction","2020-09-14","Completed","Completed","98103",{"$f":"_xlfn.XLOOKUP(--fSeattle2020Complaints[[#This Row],[ZipCode]],dZipNeighborhood[ZipCode],dZipNeighborhood[Neighborhood])","v":"Greenwood"}]
["Weeds","2020-08-11","Completed","Completed","98108",{"$f":"_xlfn.XLOOKUP(--fSeattle2020Complaints[[#This Row],[ZipCode]],dZipNeighborhood[ZipCode],dZipNeighborhood[Neighborhood])","v":"Rainer Valley"}]
["Weeds","2020-05-23","Completed","Completed","98122",{"$f":"_xlfn.XLOOKUP(--fSeattle2020Complaints[[#This Row],[ZipCode]],dZipNeighborhood[ZipCode],dZipNeighborhood[Neighborhood])","v":"Minor, Central Area"}]
["Weeds","2020-02-28","Completed","Warning","98112",{"$f":"_xlfn.XLOOKUP(--fSeattle2020Complaints[[#This Row],[ZipCode]],dZipNeighborhood[ZipCode],dZipNeighborhood[Neighborhood])","v":"Madison Park"}]
["Land UseNoise ,","2020-07-31","Completed","Completed","98103",{"$f":"_xlfn.XLOOKUP(--fSeattle2020Complaints[[#This Row],[ZipCode]],dZipNeighborhood[ZipCode],dZipNeighborhood[Neighborhood])","v":"Greenwood"}]
["Land Use","2020-01-15","Completed","Completed","98144",{"$f":"_xlfn.XLOOKUP(--fSeattle2020Complaints[[#This Row],[ZipCode]],dZipNeighborhood[ZipCode],dZipNeighborhood[Neighborhood])","v":"Mount Baker"}]
["Vacant Building","2020-02-26","Completed","Completed","98105",{"$f":"_xlfn.XLOOKUP(--fSeattle2020Complaints[[#This Row],[ZipCode]],dZipNeighborhood[ZipCode],dZipNeighborhood[Neighborhood])","v":"University District"}]
["Weeds","2020-03-19","Compliance Achieved","Completed","98136",{"$f":"_xlfn.XLOOKUP(--fSeattle2020Complaints[[#This Row],[ZipCode]],dZipNeighborhood[ZipCode],dZipNeighborhood[Neighborhood])","v":"Seaview"}]
["Tree","2020-05-13","Completed","Warning","98133",{"$f":"_xlfn.XLOOKUP(--fSeattle2020Complaints[[#This Row],[ZipCode]],dZipNeighborhood[ZipCode],dZipNeighborhood[Neighborhood])","v":"Shoreline"}]
["Construction","2020-08-28","Completed","Completed","98103",{"$f":"_xlfn.XLOOKUP(--fSeattle2020Complaints[[#This Row],[ZipCode]],dZipNeighborhood[ZipCode],dZipNeighborhood[Neighborhood])","v":"Greenwood"}]
["Land Use","2020-05-17","Completed","Closed","98103",{"$f":"_xlfn.XLOOKUP(--fSeattle2020Complaints[[#This Row],[ZipCode]],dZipNeighborhood[ZipCode],dZipNeighborhood[Neighborhood])","v":"Greenwood"}]
["Emergency , Vacant Building","2020-05-22","Compliance Achieved","Completed","98144",{"$f":"_xlfn.XLOOKUP(--fSeattle2020Complaints[[#This Row],[ZipCode]],dZipNeighborhood[ZipCode],dZipNeighborhood[Neighborhood])","v":"Mount Baker"}]
["Vacant Building","2020-02-12","Completed","Closed","98108",{"$f":"_xlfn.XLOOKUP(--fSeattle2020Complaints[[#This Row],[ZipCode]],dZipNeighborhood[ZipCode],dZipNeighborhood[Neighborhood])","v":"Rainer Valley"}]
["Land Use","2020-06-25","Completed","Completed","98134",{"$f":"_xlfn.XLOOKUP(--fSeattle2020Complaints[[#This Row],[ZipCode]],dZipNeighborhood[ZipCode],dZipNeighborhood[Neighborhood])","v":"Duwamish"}]
["Weeds","2020-07-12","Completed","Completed","98144",{"$f":"_xlfn.XLOOKUP(--fSeattle2020Complaints[[#This Row],[ZipCode]],dZipNeighborhood[ZipCode],dZipNeighborhood[Neighborhood])","v":"Mount Baker"}]
["Weeds","2020-05-04","Completed","Completed","98136",{"$f":"_xlfn.XLOOKUP(--fSeattle2020Complaints[[#This Row],[ZipCode]],dZipNeighborhood[ZipCode],dZipNeighborhood[Neighborhood])","v":"Seaview"}]
["Weeds","2020-06-22","Completed","Closed","98115",{"$f":"_xlfn.XLOOKUP(--fSeattle2020Complaints[[#This Row],[ZipCode]],dZipNeighborhood[ZipCode],dZipNeighborhood[Neighborhood])","v":"Greenlake"}]
["Weeds","2020-05-28","Completed","Completed","98122",{"$f":"_xlfn.XLOOKUP(--fSeattle2020Complaints[[#This Row],[ZipCode]],dZipNeighborhood[ZipCode],dZipNeighborhood[Neighborhood])","v":"Minor, Central Area"}]
["Vacant Building","2020-03-03","Completed","Completed","98103",{"$f":"_xlfn.XLOOKUP(--fSeattle2020Complaints[[#This Row],[ZipCode]],dZipNeighborhood[ZipCode],dZipNeighborhood[Neighborhood])","v":"Greenwood"}]
["Vacant Building","2020-03-01","Completed","Closed","98107",{"$f":"_xlfn.XLOOKUP(--fSeattle2020Complaints[[#This Row],[ZipCode]],dZipNeighborhood[ZipCode],dZipNeighborhood[Neighborhood])","v":"Ballard"}]
["Weeds","2020-06-10","Completed","Completed","98107",{"$f":"_xlfn.XLOOKUP(--fSeattle2020Complaints[[#This Row],[ZipCode]],dZipNeighborhood[ZipCode],dZipNeighborhood[Neighborhood])","v":"Ballard"}]
["Land UseVacant Building ,","2020-08-27","Completed","Completed","98103",{"$f":"_xlfn.XLOOKUP(--fSeattle2020Complaints[[#This Row],[ZipCode]],dZipNeighborhood[ZipCode],dZipNeighborhood[Neighborhood])","v":"Greenwood"}]
["Land Use","2020-05-11","Completed","Completed","98144",{"$f":"_xlfn.XLOOKUP(--fSeattle2020Complaints[[#This Row],[ZipCode]],dZipNeighborhood[ZipCode],dZipNeighborhood[Neighborhood])","v":"Mount Baker"}]
["Land Use","2020-09-11","Completed","Completed","98108",{"$f":"_xlfn.XLOOKUP(--fSeattle2020Complaints[[#This Row],[ZipCode]],dZipNeighborhood[ZipCode],dZipNeighborhood[Neighborhood])","v":"Rainer Valley"}]
["Land Use","2020-04-21","Completed","Completed","98118",{"$f":"_xlfn.XLOOKUP(--fSeattle2020Complaints[[#This Row],[ZipCode]],dZipNeighborhood[ZipCode],dZipNeighborhood[Neighborhood])","v":"Columbia City"}]
["Land Use","2020-11-02","Completed","Completed","98144",{"$f":"_xlfn.XLOOKUP(--fSeattle2020Complaints[[#This Row],[ZipCode]],dZipNeighborhood[ZipCode],dZipNeighborhood[Neighborhood])","v":"Mount Baker"}]
["Vacant Building","2020-04-08","Completed","Completed","98105",{"$f":"_xlfn.XLOOKUP(--fSeattle2020Complaints[[#This Row],[ZipCode]],dZipNeighborhood[ZipCode],dZipNeighborhood[Neighborhood])","v":"University District"}]
["LandLord/Tenant","2020-11-11","Completed","Closed","98105",{"$f":"_xlfn.XLOOKUP(--fSeattle2020Complaints[[#This Row],[ZipCode]],dZipNeighborhood[ZipCode],dZipNeighborhood[Neighborhood])","v":"University District"}]
["Land Use","2020-12-29","Completed","Completed","98144",{"$f":"_xlfn.XLOOKUP(--fSeattle2020Complaints[[#This Row],[ZipCode]],dZipNeighborhood[ZipCode],dZipNeighborhood[Neighborhood])","v":"Mount Baker"}]
["Construction","2020-10-29","Completed","Closed","98199",{"$f":"_xlfn.XLOOKUP(--fSeattle2020Complaints[[#This Row],[ZipCode]],dZipNeighborhood[ZipCode],dZipNeighborhood[Neighborhood])","v":"Magnolia"}]
["Construction","2020-07-31","Completed","Closed","98119",{"$f":"_xlfn.XLOOKUP(--fSeattle2020Complaints[[#This Row],[ZipCode]],dZipNeighborhood[ZipCode],dZipNeighborhood[Neighborhood])","v":"Queen Anne"}]
["Land UseWeeds ,","2020-11-11","Completed","Completed","98178",{"$f":"_xlfn.XLOOKUP(--fSeattle2020Complaints[[#This Row],[ZipCode]],dZipNeighborhood[ZipCode],dZipNeighborhood[Neighborhood])","v":"Skyway"}]
["Land Use","2020-08-24","Completed","Under Investigation","98146",{"$f":"_xlfn.XLOOKUP(--fSeattle2020Complaints[[#This Row],[ZipCode]],dZipNeighborhood[ZipCode],dZipNeighborhood[Neighborhood])","v":"Shorewood, White Center"}]
["Vacant Building","2020-02-28","Completed","Completed","98106",{"$f":"_xlfn.XLOOKUP(--fSeattle2020Complaints[[#This Row],[ZipCode]],dZipNeighborhood[ZipCode],dZipNeighborhood[Neighborhood])","v":"Delridge"}]
["Weeds","2020-05-09","Completed","Completed","98116",{"$f":"_xlfn.XLOOKUP(--fSeattle2020Complaints[[#This Row],[ZipCode]],dZipNeighborhood[ZipCode],dZipNeighborhood[Neighborhood])","v":"West Seattle"}]
["Shoreline","2020-02-07","Completed","NOV Issued","98136",{"$f":"_xlfn.XLOOKUP(--fSeattle2020Complaints[[#This Row],[ZipCode]],dZipNeighborhood[ZipCode],dZipNeighborhood[Neighborhood])","v":"Seaview"}]
["Weeds","2020-07-09","Completed","Completed","98103",{"$f":"_xlfn.XLOOKUP(--fSeattle2020Complaints[[#This Row],[ZipCode]],dZipNeighborhood[ZipCode],dZipNeighborhood[Neighborhood])","v":"Greenwood"}]
["Weeds","2020-02-03","Completed","Warning","98118",{"$f":"_xlfn.XLOOKUP(--fSeattle2020Complaints[[#This Row],[ZipCode]],dZipNeighborhood[ZipCode],dZipNeighborhood[Neighborhood])","v":"Columbia City"}]
["Weeds","2020-09-03","Completed","Completed","98126",{"$f":"_xlfn.XLOOKUP(--fSeattle2020Complaints[[#This Row],[ZipCode]],dZipNeighborhood[ZipCode],dZipNeighborhood[Neighborhood])","v":"High Point"}]
["Land Use","2020-09-29","Completed","Completed","98121",{"$f":"_xlfn.XLOOKUP(--fSeattle2020Complaints[[#This Row],[ZipCode]],dZipNeighborhood[ZipCode],dZipNeighborhood[Neighborhood])","v":"Belltown"}]
["Land Use","2020-01-19","Completed","Completed","98126",{"$f":"_xlfn.XLOOKUP(--fSeattle2020Complaints[[#This Row],[ZipCode]],dZipNeighborhood[ZipCode],dZipNeighborhood[Neighborhood])","v":"High Point"}]
["Land Use","2020-02-03","Completed","Completed","98118",{"$f":"_xlfn.XLOOKUP(--fSeattle2020Complaints[[#This Row],[ZipCode]],dZipNeighborhood[ZipCode],dZipNeighborhood[Neighborhood])","v":"Columbia City"}]
["Vacant Building","2020-01-11","Completed","Closed","98103",{"$f":"_xlfn.XLOOKUP(--fSeattle2020Complaints[[#This Row],[ZipCode]],dZipNeighborhood[ZipCode],dZipNeighborhood[Neighborhood])","v":"Greenwood"}]
["Vacant Building","2020-04-28","Completed","Completed","98122",{"$f":"_xlfn.XLOOKUP(--fSeattle2020Complaints[[#This Row],[ZipCode]],dZipNeighborhood[ZipCode],dZipNeighborhood[Neighborhood])","v":"Minor, Central Area"}]
["Land Use","2020-09-22","Completed","Closed","98115",{"$f":"_xlfn.XLOOKUP(--fSeattle2020Complaints[[#This Row],[ZipCode]],dZipNeighborhood[ZipCode],dZipNeighborhood[Neighborhood])","v":"Greenlake"}]
["Weeds","2020-02-18","Completed","Completed","98144",{"$f":"_xlfn.XLOOKUP(--fSeattle2020Complaints[[#This Row],[ZipCode]],dZipNeighborhood[ZipCode],dZipNeighborhood[Neighborhood])","v":"Mount Baker"}]
["LandLord/Tenant , Vacant Building","2020-03-11","Admin Closure","Completed","98104",{"$f":"_xlfn.XLOOKUP(--fSeattle2020Complaints[[#This Row],[ZipCode]],dZipNeighborhood[ZipCode],dZipNeighborhood[Neighborhood])","v":"International District"}]
["Land Use","2020-06-23","Completed","Completed","98103",{"$f":"_xlfn.XLOOKUP(--fSeattle2020Complaints[[#This Row],[ZipCode]],dZipNeighborhood[ZipCode],dZipNeighborhood[Neighborhood])","v":"Greenwood"}]
["Land Use","2020-01-02","Completed","Completed","98122",{"$f":"_xlfn.XLOOKUP(--fSeattle2020Complaints[[#This Row],[ZipCode]],dZipNeighborhood[ZipCode],dZipNeighborhood[Neighborhood])","v":"Minor, Central Area"}]
["Weeds","2020-07-16","Compliance Achieved","Completed","98126",{"$f":"_xlfn.XLOOKUP(--fSeattle2020Complaints[[#This Row],[ZipCode]],dZipNeighborhood[ZipCode],dZipNeighborhood[Neighborhood])","v":"High Point"}]
["Weeds","2020-06-03","Completed","Completed","98126",{"$f":"_xlfn.XLOOKUP(--fSeattle2020Complaints[[#This Row],[ZipCode]],dZipNeighborhood[ZipCode],dZipNeighborhood[Neighborhood])","v":"High Point"}]
["LandLord/Tenant","2020-03-30","Completed","Completed","98122",{"$f":"_xlfn.XLOOKUP(--fSeattle2020Complaints[[#This Row],[ZipCode]],dZipNeighborhood[ZipCode],dZipNeighborhood[Neighborhood])","v":"Minor, Central Area"}]
["Land Use","2020-02-24","Completed","Completed","98118",{"$f":"_xlfn.XLOOKUP(--fSeattle2020Complaints[[#This Row],[ZipCode]],dZipNeighborhood[ZipCode],dZipNeighborhood[Neighborhood])","v":"Columbia City"}]
["Vacant Building","2020-02-24","Completed","Closed","98109",{"$f":"_xlfn.XLOOKUP(--fSeattle2020Complaints[[#This Row],[ZipCode]],dZipNeighborhood[ZipCode],dZipNeighborhood[Neighborhood])","v":"South Lake Union"}]
["Construction","2020-01-19","Completed","Completed","98109",{"$f":"_xlfn.XLOOKUP(--fSeattle2020Complaints[[#This Row],[ZipCode]],dZipNeighborhood[ZipCode],dZipNeighborhood[Neighborhood])","v":"South Lake Union"}]
["Land Use","2020-05-28","Completed","Completed","98126",{"$f":"_xlfn.XLOOKUP(--fSeattle2020Complaints[[#This Row],[ZipCode]],dZipNeighborhood[ZipCode],dZipNeighborhood[Neighborhood])","v":"High Point"}]
["Land Use","2020-09-25","Completed","Completed","98107",{"$f":"_xlfn.XLOOKUP(--fSeattle2020Complaints[[#This Row],[ZipCode]],dZipNeighborhood[ZipCode],dZipNeighborhood[Neighborhood])","v":"Ballard"}]
["Shoreline","2020-02-19","Completed","Completed","98118",{"$f":"_xlfn.XLOOKUP(--fSeattle2020Complaints[[#This Row],[ZipCode]],dZipNeighborhood[ZipCode],dZipNeighborhood[Neighborhood])","v":"Columbia City"}]
["Land Use","2020-03-26","Completed","Completed","98106",{"$f":"_xlfn.XLOOKUP(--fSeattle2020Complaints[[#This Row],[ZipCode]],dZipNeighborhood[ZipCode],dZipNeighborhood[Neighborhood])","v":"Delridge"}]
["Land Use","2020-02-23","Completed","Completed","98106",{"$f":"_xlfn.XLOOKUP(--fSeattle2020Complaints[[#This Row],[ZipCode]],dZipNeighborhood[ZipCode],dZipNeighborhood[Neighborhood])","v":"Delridge"}]
["Weeds","2020-01-03","Completed","Closed","98122",{"$f":"_xlfn.XLOOKUP(--fSeattle2020Complaints[[#This Row],[ZipCode]],dZipNeighborhood[ZipCode],dZipNeighborhood[Neighborhood])","v":"Minor, Central Area"}]
["Land Use","2020-02-09","Completed","Completed","98122",{"$f":"_xlfn.XLOOKUP(--fSeattle2020Complaints[[#This Row],[ZipCode]],dZipNeighborhood[ZipCode],dZipNeighborhood[Neighborhood])","v":"Minor, Central Area"}]
["Land Use","2020-08-19","Completed","Completed","98107",{"$f":"_xlfn.XLOOKUP(--fSeattle2020Complaints[[#This Row],[ZipCode]],dZipNeighborhood[ZipCode],dZipNeighborhood[Neighborhood])","v":"Ballard"}]
["Land UseShoreline ,","2020-09-30","Completed","Completed","98136",{"$f":"_xlfn.XLOOKUP(--fSeattle2020Complaints[[#This Row],[ZipCode]],dZipNeighborhood[ZipCode],dZipNeighborhood[Neighborhood])","v":"Seaview"}]
["Tree","2020-02-03","Completed","Completed","98117",{"$f":"_xlfn.XLOOKUP(--fSeattle2020Complaints[[#This Row],[ZipCode]],dZipNeighborhood[ZipCode],dZipNeighborhood[Neighborhood])","v":"Sunset Hill"}]
["Land Use","2020-11-13","Completed","Completed","98199",{"$f":"_xlfn.XLOOKUP(--fSeattle2020Complaints[[#This Row],[ZipCode]],dZipNeighborhood[ZipCode],dZipNeighborhood[Neighborhood])","v":"Magnolia"}]
["Land Use","2020-04-21","Completed","Completed","98144",{"$f":"_xlfn.XLOOKUP(--fSeattle2020Complaints[[#This Row],[ZipCode]],dZipNeighborhood[ZipCode],dZipNeighborhood[Neighborhood])","v":"Mount Baker"}]
["Emergency","2020-01-30","Completed","Completed","98105",{"$f":"_xlfn.XLOOKUP(--fSeattle2020Complaints[[#This Row],[ZipCode]],dZipNeighborhood[ZipCode],dZipNeighborhood[Neighborhood])","v":"University District"}]
["Weeds","2020-06-04","Completed","Completed","98115",{"$f":"_xlfn.XLOOKUP(--fSeattle2020Complaints[[#This Row],[ZipCode]],dZipNeighborhood[ZipCode],dZipNeighborhood[Neighborhood])","v":"Greenlake"}]
["Land UseVacant Building ,","2020-07-21","Completed","Completed","98119",{"$f":"_xlfn.XLOOKUP(--fSeattle2020Complaints[[#This Row],[ZipCode]],dZipNeighborhood[ZipCode],dZipNeighborhood[Neighborhood])","v":"Queen Anne"}]
["Weeds","2020-08-31","Completed","Completed","98115",{"$f":"_xlfn.XLOOKUP(--fSeattle2020Complaints[[#This Row],[ZipCode]],dZipNeighborhood[ZipCode],dZipNeighborhood[Neighborhood])","v":"Greenlake"}]
["Weeds","2020-02-21","Completed","Completed","98112",{"$f":"_xlfn.XLOOKUP(--fSeattle2020Complaints[[#This Row],[ZipCode]],dZipNeighborhood[ZipCode],dZipNeighborhood[Neighborhood])","v":"Madison Park"}]
["Land Use","2020-11-25","Completed","Completed","98118",{"$f":"_xlfn.XLOOKUP(--fSeattle2020Complaints[[#This Row],[ZipCode]],dZipNeighborhood[ZipCode],dZipNeighborhood[Neighborhood])","v":"Columbia City"}]
["Weeds","2020-06-11","Completed","Completed","98103",{"$f":"_xlfn.XLOOKUP(--fSeattle2020Complaints[[#This Row],[ZipCode]],dZipNeighborhood[ZipCode],dZipNeighborhood[Neighborhood])","v":"Greenwood"}]
["Emergency , Vacant Building","2020-08-26","Completed","Completed","98144",{"$f":"_xlfn.XLOOKUP(--fSeattle2020Complaints[[#This Row],[ZipCode]],dZipNeighborhood[ZipCode],dZipNeighborhood[Neighborhood])","v":"Mount Baker"}]
["Land Use","2020-04-30","Compliance Achieved","Completed","98115",{"$f":"_xlfn.XLOOKUP(--fSeattle2020Complaints[[#This Row],[ZipCode]],dZipNeighborhood[ZipCode],dZipNeighborhood[Neighborhood])","v":"Greenlake"}]
["Construction","2020-12-28","Completed","Completed","98199",{"$f":"_xlfn.XLOOKUP(--fSeattle2020Complaints[[#This Row],[ZipCode]],dZipNeighborhood[ZipCode],dZipNeighborhood[Neighborhood])","v":"Magnolia"}]
["Land Use","2020-08-13","Completed","Completed","98144",{"$f":"_xlfn.XLOOKUP(--fSeattle2020Complaints[[#This Row],[ZipCode]],dZipNeighborhood[ZipCode],dZipNeighborhood[Neighborhood])","v":"Mount Baker"}]
["Weeds","2020-08-02","Completed","Completed","98116",{"$f":"_xlfn.XLOOKUP(--fSeattle2020Complaints[[#This Row],[ZipCode]],dZipNeighborhood[ZipCode],dZipNeighborhood[Neighborhood])","v":"West Seattle"}]
["Vacant Building","2020-12-26","Completed","Completed","98125",{"$f":"_xlfn.XLOOKUP(--fSeattle2020Complaints[[#This Row],[ZipCode]],dZipNeighborhood[ZipCode],dZipNeighborhood[Neighborhood])","v":"Northgate"}]
["Noise","2020-02-11","Completed","Completed","98109",{"$f":"_xlfn.XLOOKUP(--fSeattle2020Complaints[[#This Row],[ZipCode]],dZipNeighborhood[ZipCode],dZipNeighborhood[Neighborhood])","v":"South Lake Union"}]
["Construction","2020-01-21","Completed","Completed","98107",{"$f":"_xlfn.XLOOKUP(--fSeattle2020Complaints[[#This Row],[ZipCode]],dZipNeighborhood[ZipCode],dZipNeighborhood[Neighborhood])","v":"Ballard"}]
["Construction","2020-07-15","Completed","Completed","98104",{"$f":"_xlfn.XLOOKUP(--fSeattle2020Complaints[[#This Row],[ZipCode]],dZipNeighborhood[ZipCode],dZipNeighborhood[Neighborhood])","v":"International District"}]
["Weeds","2020-02-11","Completed","Completed","98112",{"$f":"_xlfn.XLOOKUP(--fSeattle2020Complaints[[#This Row],[ZipCode]],dZipNeighborhood[ZipCode],dZipNeighborhood[Neighborhood])","v":"Madison Park"}]
["Vacant Building","2020-05-20","Completed","Completed","98133",{"$f":"_xlfn.XLOOKUP(--fSeattle2020Complaints[[#This Row],[ZipCode]],dZipNeighborhood[ZipCode],dZipNeighborhood[Neighborhood])","v":"Shoreline"}]
["Construction","2020-10-22","Completed","Completed","98144",{"$f":"_xlfn.XLOOKUP(--fSeattle2020Complaints[[#This Row],[ZipCode]],dZipNeighborhood[ZipCode],dZipNeighborhood[Neighborhood])","v":"Mount Baker"}]
["Construction","2020-07-17","Completed","Completed","98105",{"$f":"_xlfn.XLOOKUP(--fSeattle2020Complaints[[#This Row],[ZipCode]],dZipNeighborhood[ZipCode],dZipNeighborhood[Neighborhood])","v":"University District"}]
["Vacant Building","2020-07-15","Compliance Achieved","Completed","98144",{"$f":"_xlfn.XLOOKUP(--fSeattle2020Complaints[[#This Row],[ZipCode]],dZipNeighborhood[ZipCode],dZipNeighborhood[Neighborhood])","v":"Mount Baker"}]
["Weeds","2020-03-12","Compliance Achieved","Completed","98115",{"$f":"_xlfn.XLOOKUP(--fSeattle2020Complaints[[#This Row],[ZipCode]],dZipNeighborhood[ZipCode],dZipNeighborhood[Neighborhood])","v":"Greenlake"}]
["Vacant Building","2020-09-18","Completed","Completed","98118",{"$f":"_xlfn.XLOOKUP(--fSeattle2020Complaints[[#This Row],[ZipCode]],dZipNeighborhood[ZipCode],dZipNeighborhood[Neighborhood])","v":"Columbia City"}]
["Vacant Building","2020-05-05","Completed","Completed","98102",{"$f":"_xlfn.XLOOKUP(--fSeattle2020Complaints[[#This Row],[ZipCode]],dZipNeighborhood[ZipCode],dZipNeighborhood[Neighborhood])","v":"Capital Hill"}]
["LandLord/Tenant","2020-08-21","Completed","Completed","98104",{"$f":"_xlfn.XLOOKUP(--fSeattle2020Complaints[[#This Row],[ZipCode]],dZipNeighborhood[ZipCode],dZipNeighborhood[Neighborhood])","v":"International District"}]
["Vacant Building","2020-05-22","Completed","Closed","98117",{"$f":"_xlfn.XLOOKUP(--fSeattle2020Complaints[[#This Row],[ZipCode]],dZipNeighborhood[ZipCode],dZipNeighborhood[Neighborhood])","v":"Sunset Hill"}]
["Land Use","2020-11-24","Completed","Completed","98118",{"$f":"_xlfn.XLOOKUP(--fSeattle2020Complaints[[#This Row],[ZipCode]],dZipNeighborhood[ZipCode],dZipNeighborhood[Neighborhood])","v":"Columbia City"}]
["Construction","2020-01-20","Completed","Completed","98122",{"$f":"_xlfn.XLOOKUP(--fSeattle2020Complaints[[#This Row],[ZipCode]],dZipNeighborhood[ZipCode],dZipNeighborhood[Neighborhood])","v":"Minor, Central Area"}]
["Land Use","2020-03-20","Completed","Completed","98102",{"$f":"_xlfn.XLOOKUP(--fSeattle2020Complaints[[#This Row],[ZipCode]],dZipNeighborhood[ZipCode],dZipNeighborhood[Neighborhood])","v":"Capital Hill"}]
["Land Use","2020-04-14","Completed","Completed","98177",{"$f":"_xlfn.XLOOKUP(--fSeattle2020Complaints[[#This Row],[ZipCode]],dZipNeighborhood[ZipCode],dZipNeighborhood[Neighborhood])","v":"Richmond Beach"}]
["Tree","2020-05-07","Completed","Completed","98133",{"$f":"_xlfn.XLOOKUP(--fSeattle2020Complaints[[#This Row],[ZipCode]],dZipNeighborhood[ZipCode],dZipNeighborhood[Neighborhood])","v":"Shoreline"}]
["Vacant Building","2020-08-06","Completed","Completed","98103",{"$f":"_xlfn.XLOOKUP(--fSeattle2020Complaints[[#This Row],[ZipCode]],dZipNeighborhood[ZipCode],dZipNeighborhood[Neighborhood])","v":"Greenwood"}]
["Weeds","2020-06-25","Completed","Warning","98119",{"$f":"_xlfn.XLOOKUP(--fSeattle2020Complaints[[#This Row],[ZipCode]],dZipNeighborhood[ZipCode],dZipNeighborhood[Neighborhood])","v":"Queen Anne"}]
["Construction","2020-12-07","Completed","Completed","98199",{"$f":"_xlfn.XLOOKUP(--fSeattle2020Complaints[[#This Row],[ZipCode]],dZipNeighborhood[ZipCode],dZipNeighborhood[Neighborhood])","v":"Magnolia"}]
["Weeds","2020-07-21","Completed","Completed","98125",{"$f":"_xlfn.XLOOKUP(--fSeattle2020Complaints[[#This Row],[ZipCode]],dZipNeighborhood[ZipCode],dZipNeighborhood[Neighborhood])","v":"Northgate"}]
["Weeds","2020-09-10","Completed","Completed","98115",{"$f":"_xlfn.XLOOKUP(--fSeattle2020Complaints[[#This Row],[ZipCode]],dZipNeighborhood[ZipCode],dZipNeighborhood[Neighborhood])","v":"Greenlake"}]
["Land Use","2020-04-01","Compliance Achieved","Completed","98118",{"$f":"_xlfn.XLOOKUP(--fSeattle2020Complaints[[#This Row],[ZipCode]],dZipNeighborhood[ZipCode],dZipNeighborhood[Neighborhood])","v":"Columbia City"}]
["Land Use","2020-07-08","Completed","Completed","98103",{"$f":"_xlfn.XLOOKUP(--fSeattle2020Complaints[[#This Row],[ZipCode]],dZipNeighborhood[ZipCode],dZipNeighborhood[Neighborhood])","v":"Greenwood"}]
["Construction","2020-09-30","Completed","Completed","98118",{"$f":"_xlfn.XLOOKUP(--fSeattle2020Complaints[[#This Row],[ZipCode]],dZipNeighborhood[ZipCode],dZipNeighborhood[Neighborhood])","v":"Columbia City"}]
["Emergency , LandLord/Tenant","2020-02-20","Completed","Completed","98115",{"$f":"_xlfn.XLOOKUP(--fSeattle2020Complaints[[#This Row],[ZipCode]],dZipNeighborhood[ZipCode],dZipNeighborhood[Neighborhood])","v":"Greenlake"}]
["Land Use","2020-12-14","Completed","Completed","98106",{"$f":"_xlfn.XLOOKUP(--fSeattle2020Complaints[[#This Row],[ZipCode]],dZipNeighborhood[ZipCode],dZipNeighborhood[Neighborhood])","v":"Delridge"}]
["Construction","2020-01-15","Completed","Completed","98144",{"$f":"_xlfn.XLOOKUP(--fSeattle2020Complaints[[#This Row],[ZipCode]],dZipNeighborhood[ZipCode],dZipNeighborhood[Neighborhood])","v":"Mount Baker"}]
["Vacant Building","2020-12-09","Completed","Closed","98105",{"$f":"_xlfn.XLOOKUP(--fSeattle2020Complaints[[#This Row],[ZipCode]],dZipNeighborhood[ZipCode],dZipNeighborhood[Neighborhood])","v":"University District"}]
["Land Use","2020-01-02","Completed","Completed","98118",{"$f":"_xlfn.XLOOKUP(--fSeattle2020Complaints[[#This Row],[ZipCode]],dZipNeighborhood[ZipCode],dZipNeighborhood[Neighborhood])","v":"Columbia City"}]
["Construction","2020-07-07","Completed","Completed","98109",{"$f":"_xlfn.XLOOKUP(--fSeattle2020Complaints[[#This Row],[ZipCode]],dZipNeighborhood[ZipCode],dZipNeighborhood[Neighborhood])","v":"South Lake Union"}]
["Weeds","2020-04-24","Completed","Completed","98108",{"$f":"_xlfn.XLOOKUP(--fSeattle2020Complaints[[#This Row],[ZipCode]],dZipNeighborhood[ZipCode],dZipNeighborhood[Neighborhood])","v":"Rainer Valley"}]
["Tree","2020-02-20","Completed","Completed","98177",{"$f":"_xlfn.XLOOKUP(--fSeattle2020Complaints[[#This Row],[ZipCode]],dZipNeighborhood[ZipCode],dZipNeighborhood[Neighborhood])","v":"Richmond Beach"}]
["Vacant Building","2020-10-13","Secured with No Violations","Completed","98109",{"$f":"_xlfn.XLOOKUP(--fSeattle2020Complaints[[#This Row],[ZipCode]],dZipNeighborhood[ZipCode],dZipNeighborhood[Neighborhood])","v":"South Lake Union"}]
["Emergency , Vacant Building","2020-04-13","Compliance Achieved","Completed","98118",{"$f":"_xlfn.XLOOKUP(--fSeattle2020Complaints[[#This Row],[ZipCode]],dZipNeighborhood[ZipCode],dZipNeighborhood[Neighborhood])","v":"Columbia City"}]
["Land Use","2020-07-15","Compliance Achieved","Completed","98177",{"$f":"_xlfn.XLOOKUP(--fSeattle2020Complaints[[#This Row],[ZipCode]],dZipNeighborhood[ZipCode],dZipNeighborhood[Neighborhood])","v":"Richmond Beach"}]
["Land UseLandLord/Tenant ,","2020-04-20","Completed","Completed","98178",{"$f":"_xlfn.XLOOKUP(--fSeattle2020Complaints[[#This Row],[ZipCode]],dZipNeighborhood[ZipCode],dZipNeighborhood[Neighborhood])","v":"Skyway"}]
["Land Use","2020-10-07","Completed","Completed","98103",{"$f":"_xlfn.XLOOKUP(--fSeattle2020Complaints[[#This Row],[ZipCode]],dZipNeighborhood[ZipCode],dZipNeighborhood[Neighborhood])","v":"Greenwood"}]
["Land UseTree ,","2020-08-11","Completed","Completed","98126",{"$f":"_xlfn.XLOOKUP(--fSeattle2020Complaints[[#This Row],[ZipCode]],dZipNeighborhood[ZipCode],dZipNeighborhood[Neighborhood])","v":"High Point"}]
["Land Use","2020-03-05","Completed","Completed","98108",{"$f":"_xlfn.XLOOKUP(--fSeattle2020Complaints[[#This Row],[ZipCode]],dZipNeighborhood[ZipCode],dZipNeighborhood[Neighborhood])","v":"Rainer Valley"}]
["Land Use","2020-02-02","Completed","Completed","98103",{"$f":"_xlfn.XLOOKUP(--fSeattle2020Complaints[[#This Row],[ZipCode]],dZipNeighborhood[ZipCode],dZipNeighborhood[Neighborhood])","v":"Greenwood"}]
["Land Use","2020-05-27","Completed","Closed","98108",{"$f":"_xlfn.XLOOKUP(--fSeattle2020Complaints[[#This Row],[ZipCode]],dZipNeighborhood[ZipCode],dZipNeighborhood[Neighborhood])","v":"Rainer Valley"}]
["Emergency","2020-01-02","Completed","Completed","98118",{"$f":"_xlfn.XLOOKUP(--fSeattle2020Complaints[[#This Row],[ZipCode]],dZipNeighborhood[ZipCode],dZipNeighborhood[Neighborhood])","v":"Columbia City"}]
["Land Use","2020-05-16","No Access/Unable to Observe","Closed","98109",{"$f":"_xlfn.XLOOKUP(--fSeattle2020Complaints[[#This Row],[ZipCode]],dZipNeighborhood[ZipCode],dZipNeighborhood[Neighborhood])","v":"South Lake Union"}]
["Construction","2020-03-03","Completed","NOV Issued","98122",{"$f":"_xlfn.XLOOKUP(--fSeattle2020Complaints[[#This Row],[ZipCode]],dZipNeighborhood[ZipCode],dZipNeighborhood[Neighborhood])","v":"Minor, Central Area"}]
["Weeds","2020-11-08","Completed","Completed","98118",{"$f":"_xlfn.XLOOKUP(--fSeattle2020Complaints[[#This Row],[ZipCode]],dZipNeighborhood[ZipCode],dZipNeighborhood[Neighborhood])","v":"Columbia City"}]
["LandLord/Tenant","2020-09-11","Completed","Completed","98105",{"$f":"_xlfn.XLOOKUP(--fSeattle2020Complaints[[#This Row],[ZipCode]],dZipNeighborhood[ZipCode],dZipNeighborhood[Neighborhood])","v":"University District"}]
["Construction","2020-10-28","Completed","Under Investigation","98118",{"$f":"_xlfn.XLOOKUP(--fSeattle2020Complaints[[#This Row],[ZipCode]],dZipNeighborhood[ZipCode],dZipNeighborhood[Neighborhood])","v":"Columbia City"}]
["Construction","2020-05-16","Completed","Completed","98102",{"$f":"_xlfn.XLOOKUP(--fSeattle2020Complaints[[#This Row],[ZipCode]],dZipNeighborhood[ZipCode],dZipNeighborhood[Neighborhood])","v":"Capital Hill"}]
["Land Use","2020-08-05","Completed","Completed","98134",{"$f":"_xlfn.XLOOKUP(--fSeattle2020Complaints[[#This Row],[ZipCode]],dZipNeighborhood[ZipCode],dZipNeighborhood[Neighborhood])","v":"Duwamish"}]
["Land Use","2020-01-16","Completed","Completed","98112",{"$f":"_xlfn.XLOOKUP(--fSeattle2020Complaints[[#This Row],[ZipCode]],dZipNeighborhood[ZipCode],dZipNeighborhood[Neighborhood])","v":"Madison Park"}]
["Weeds","2020-08-10","Completed","Completed","98108",{"$f":"_xlfn.XLOOKUP(--fSeattle2020Complaints[[#This Row],[ZipCode]],dZipNeighborhood[ZipCode],dZipNeighborhood[Neighborhood])","v":"Rainer Valley"}]
["Construction","2020-02-10","Completed","Completed","98122",{"$f":"_xlfn.XLOOKUP(--fSeattle2020Complaints[[#This Row],[ZipCode]],dZipNeighborhood[ZipCode],dZipNeighborhood[Neighborhood])","v":"Minor, Central Area"}]
["Land UseConstruction ,","2020-11-03","Completed","Completed","98106",{"$f":"_xlfn.XLOOKUP(--fSeattle2020Complaints[[#This Row],[ZipCode]],dZipNeighborhood[ZipCode],dZipNeighborhood[Neighborhood])","v":"Delridge"}]
["Construction","2020-04-25","Completed","Completed","98117",{"$f":"_xlfn.XLOOKUP(--fSeattle2020Complaints[[#This Row],[ZipCode]],dZipNeighborhood[ZipCode],dZipNeighborhood[Neighborhood])","v":"Sunset Hill"}]
["Land Use","2020-05-16","Completed","Completed","98115",{"$f":"_xlfn.XLOOKUP(--fSeattle2020Complaints[[#This Row],[ZipCode]],dZipNeighborhood[ZipCode],dZipNeighborhood[Neighborhood])","v":"Greenlake"}]
["Land Use","2020-05-28","Compliance Achieved","Completed","98105",{"$f":"_xlfn.XLOOKUP(--fSeattle2020Complaints[[#This Row],[ZipCode]],dZipNeighborhood[ZipCode],dZipNeighborhood[Neighborhood])","v":"University District"}]
["Land Use","2020-08-21","Completed","Closed","98199",{"$f":"_xlfn.XLOOKUP(--fSeattle2020Complaints[[#This Row],[ZipCode]],dZipNeighborhood[ZipCode],dZipNeighborhood[Neighborhood])","v":"Magnolia"}]
["Construction","2020-07-30","Completed","Closed","98116",{"$f":"_xlfn.XLOOKUP(--fSeattle2020Complaints[[#This Row],[ZipCode]],dZipNeighborhood[ZipCode],dZipNeighborhood[Neighborhood])","v":"West Seattle"}]
["Weeds","2020-06-09","Completed","Completed","98102",{"$f":"_xlfn.XLOOKUP(--fSeattle2020Complaints[[#This Row],[ZipCode]],dZipNeighborhood[ZipCode],dZipNeighborhood[Neighborhood])","v":"Capital Hill"}]
["Weeds","2020-03-24","Completed","Warning","98144",{"$f":"_xlfn.XLOOKUP(--fSeattle2020Complaints[[#This Row],[ZipCode]],dZipNeighborhood[ZipCode],dZipNeighborhood[Neighborhood])","v":"Mount Baker"}]
["Construction","2020-01-31","Completed","Completed","98199",{"$f":"_xlfn.XLOOKUP(--fSeattle2020Complaints[[#This Row],[ZipCode]],dZipNeighborhood[ZipCode],dZipNeighborhood[Neighborhood])","v":"Magnolia"}]
["Vacant Building","2020-03-11","Completed","Closed","98107",{"$f":"_xlfn.XLOOKUP(--fSeattle2020Complaints[[#This Row],[ZipCode]],dZipNeighborhood[ZipCode],dZipNeighborhood[Neighborhood])","v":"Ballard"}]
["Land Use","2020-10-26","Completed","Completed","98115",{"$f":"_xlfn.XLOOKUP(--fSeattle2020Complaints[[#This Row],[ZipCode]],dZipNeighborhood[ZipCode],dZipNeighborhood[Neighborhood])","v":"Greenlake"}]
["Weeds","2020-06-11","Completed","Completed","98106",{"$f":"_xlfn.XLOOKUP(--fSeattle2020Complaints[[#This Row],[ZipCode]],dZipNeighborhood[ZipCode],dZipNeighborhood[Neighborhood])","v":"Delridge"}]
["Emergency , Vacant Building","2020-06-17","Compliance Achieved","Completed","98133",{"$f":"_xlfn.XLOOKUP(--fSeattle2020Complaints[[#This Row],[ZipCode]],dZipNeighborhood[ZipCode],dZipNeighborhood[Neighborhood])","v":"Shoreline"}]
["Construction , Shoreline","2020-04-23","Completed","Completed","98136",{"$f":"_xlfn.XLOOKUP(--fSeattle2020Complaints[[#This Row],[ZipCode]],dZipNeighborhood[ZipCode],dZipNeighborhood[Neighborhood])","v":"Seaview"}]
["Weeds","2020-03-11","Compliance Achieved","Completed","98109",{"$f":"_xlfn.XLOOKUP(--fSeattle2020Complaints[[#This Row],[ZipCode]],dZipNeighborhood[ZipCode],dZipNeighborhood[Neighborhood])","v":"South Lake Union"}]
["Construction","2020-09-28","Completed","Completed","98119",{"$f":"_xlfn.XLOOKUP(--fSeattle2020Complaints[[#This Row],[ZipCode]],dZipNeighborhood[ZipCode],dZipNeighborhood[Neighborhood])","v":"Queen Anne"}]
["Land Use","2020-09-18","Completed","Completed","98122",{"$f":"_xlfn.XLOOKUP(--fSeattle2020Complaints[[#This Row],[ZipCode]],dZipNeighborhood[ZipCode],dZipNeighborhood[Neighborhood])","v":"Minor, Central Area"}]
["Weeds","2020-03-31","Completed","Warning","98106",{"$f":"_xlfn.XLOOKUP(--fSeattle2020Complaints[[#This Row],[ZipCode]],dZipNeighborhood[ZipCode],dZipNeighborhood[Neighborhood])","v":"Delridge"}]
["Land Use","2020-01-09","Completed","Completed","98118",{"$f":"_xlfn.XLOOKUP(--fSeattle2020Complaints[[#This Row],[ZipCode]],dZipNeighborhood[ZipCode],dZipNeighborhood[Neighborhood])","v":"Columbia City"}]
["Weeds","2020-07-30","Completed","Completed","98134",{"$f":"_xlfn.XLOOKUP(--fSeattle2020Complaints[[#This Row],[ZipCode]],dZipNeighborhood[ZipCode],dZipNeighborhood[Neighborhood])","v":"Duwamish"}]
["Land Use","2020-01-29","Completed","Completed","98108",{"$f":"_xlfn.XLOOKUP(--fSeattle2020Complaints[[#This Row],[ZipCode]],dZipNeighborhood[ZipCode],dZipNeighborhood[Neighborhood])","v":"Rainer Valley"}]
["Land Use","2020-02-14","Completed","Completed","98108",{"$f":"_xlfn.XLOOKUP(--fSeattle2020Complaints[[#This Row],[ZipCode]],dZipNeighborhood[ZipCode],dZipNeighborhood[Neighborhood])","v":"Rainer Valley"}]
["Weeds","2020-06-11","Completed","Completed","98136",{"$f":"_xlfn.XLOOKUP(--fSeattle2020Complaints[[#This Row],[ZipCode]],dZipNeighborhood[ZipCode],dZipNeighborhood[Neighborhood])","v":"Seaview"}]
["Weeds","2020-02-03","Compliance Achieved","Completed","98118",{"$f":"_xlfn.XLOOKUP(--fSeattle2020Complaints[[#This Row],[ZipCode]],dZipNeighborhood[ZipCode],dZipNeighborhood[Neighborhood])","v":"Columbia City"}]
["Weeds","2020-08-03","Completed","Completed","98199",{"$f":"_xlfn.XLOOKUP(--fSeattle2020Complaints[[#This Row],[ZipCode]],dZipNeighborhood[ZipCode],dZipNeighborhood[Neighborhood])","v":"Magnolia"}]
["Construction , Tree","2020-07-06","Completed","Completed","98199",{"$f":"_xlfn.XLOOKUP(--fSeattle2020Complaints[[#This Row],[ZipCode]],dZipNeighborhood[ZipCode],dZipNeighborhood[Neighborhood])","v":"Magnolia"}]
["Land Use","2020-11-05","Completed","Completed","98125",{"$f":"_xlfn.XLOOKUP(--fSeattle2020Complaints[[#This Row],[ZipCode]],dZipNeighborhood[ZipCode],dZipNeighborhood[Neighborhood])","v":"Northgate"}]
["Land UseTree ,","2020-11-04","Completed","Completed","98136",{"$f":"_xlfn.XLOOKUP(--fSeattle2020Complaints[[#This Row],[ZipCode]],dZipNeighborhood[ZipCode],dZipNeighborhood[Neighborhood])","v":"Seaview"}]
["Land Use","2020-06-09","Completed","Completed","98125",{"$f":"_xlfn.XLOOKUP(--fSeattle2020Complaints[[#This Row],[ZipCode]],dZipNeighborhood[ZipCode],dZipNeighborhood[Neighborhood])","v":"Northgate"}]
["Land Use","2020-02-12","Completed","Completed","98122",{"$f":"_xlfn.XLOOKUP(--fSeattle2020Complaints[[#This Row],[ZipCode]],dZipNeighborhood[ZipCode],dZipNeighborhood[Neighborhood])","v":"Minor, Central Area"}]
["Weeds","2020-06-03","Completed","Completed","98117",{"$f":"_xlfn.XLOOKUP(--fSeattle2020Complaints[[#This Row],[ZipCode]],dZipNeighborhood[ZipCode],dZipNeighborhood[Neighborhood])","v":"Sunset Hill"}]
["Land Use","2020-08-03","Completed","Completed","98134",{"$f":"_xlfn.XLOOKUP(--fSeattle2020Complaints[[#This Row],[ZipCode]],dZipNeighborhood[ZipCode],dZipNeighborhood[Neighborhood])","v":"Duwamish"}]
["Land Use","2020-04-20","Completed","Completed","98105",{"$f":"_xlfn.XLOOKUP(--fSeattle2020Complaints[[#This Row],[ZipCode]],dZipNeighborhood[ZipCode],dZipNeighborhood[Neighborhood])","v":"University District"}]
["Land UseConstruction ,","2020-03-05","Completed","Completed","98117",{"$f":"_xlfn.XLOOKUP(--fSeattle2020Complaints[[#This Row],[ZipCode]],dZipNeighborhood[ZipCode],dZipNeighborhood[Neighborhood])","v":"Sunset Hill"}]
["Construction","2020-08-18","Completed","Completed","98122",{"$f":"_xlfn.XLOOKUP(--fSeattle2020Complaints[[#This Row],[ZipCode]],dZipNeighborhood[ZipCode],dZipNeighborhood[Neighborhood])","v":"Minor, Central Area"}]
["Construction","2020-01-31","Compliance Achieved","Completed","98144",{"$f":"_xlfn.XLOOKUP(--fSeattle2020Complaints[[#This Row],[ZipCode]],dZipNeighborhood[ZipCode],dZipNeighborhood[Neighborhood])","v":"Mount Baker"}]
["Land Use","2020-02-18","Compliance Achieved","Completed","98118",{"$f":"_xlfn.XLOOKUP(--fSeattle2020Complaints[[#This Row],[ZipCode]],dZipNeighborhood[ZipCode],dZipNeighborhood[Neighborhood])","v":"Columbia City"}]
["Land Use","2020-12-30","Completed","Under Investigation","98119",{"$f":"_xlfn.XLOOKUP(--fSeattle2020Complaints[[#This Row],[ZipCode]],dZipNeighborhood[ZipCode],dZipNeighborhood[Neighborhood])","v":"Queen Anne"}]
["Weeds","2020-06-30","Completed","Completed","98122",{"$f":"_xlfn.XLOOKUP(--fSeattle2020Complaints[[#This Row],[ZipCode]],dZipNeighborhood[ZipCode],dZipNeighborhood[Neighborhood])","v":"Minor, Central Area"}]
["Weeds","2020-03-12","Completed","Completed","98126",{"$f":"_xlfn.XLOOKUP(--fSeattle2020Complaints[[#This Row],[ZipCode]],dZipNeighborhood[ZipCode],dZipNeighborhood[Neighborhood])","v":"High Point"}]
["Land Use","2020-11-02","Completed","Completed","98104",{"$f":"_xlfn.XLOOKUP(--fSeattle2020Complaints[[#This Row],[ZipCode]],dZipNeighborhood[ZipCode],dZipNeighborhood[Neighborhood])","v":"International District"}]
["Vacant Building","2020-07-24","Completed","Closed","98125",{"$f":"_xlfn.XLOOKUP(--fSeattle2020Complaints[[#This Row],[ZipCode]],dZipNeighborhood[ZipCode],dZipNeighborhood[Neighborhood])","v":"Northgate"}]
["Construction","2020-03-13","Completed","Completed","98118",{"$f":"_xlfn.XLOOKUP(--fSeattle2020Complaints[[#This Row],[ZipCode]],dZipNeighborhood[ZipCode],dZipNeighborhood[Neighborhood])","v":"Columbia City"}]
["Land Use","2020-04-13","Compliance Achieved","Completed","98122",{"$f":"_xlfn.XLOOKUP(--fSeattle2020Complaints[[#This Row],[ZipCode]],dZipNeighborhood[ZipCode],dZipNeighborhood[Neighborhood])","v":"Minor, Central Area"}]
["Land Use","2020-07-07","Completed","Completed","98133",{"$f":"_xlfn.XLOOKUP(--fSeattle2020Complaints[[#This Row],[ZipCode]],dZipNeighborhood[ZipCode],dZipNeighborhood[Neighborhood])","v":"Shoreline"}]
["Land Use","2020-08-31","Completed","Completed","98105",{"$f":"_xlfn.XLOOKUP(--fSeattle2020Complaints[[#This Row],[ZipCode]],dZipNeighborhood[ZipCode],dZipNeighborhood[Neighborhood])","v":"University District"}]
["Weeds","2020-08-14","Completed","Closed","98117",{"$f":"_xlfn.XLOOKUP(--fSeattle2020Complaints[[#This Row],[ZipCode]],dZipNeighborhood[ZipCode],dZipNeighborhood[Neighborhood])","v":"Sunset Hill"}]
["Vacant Building","2020-08-11","Completed","Completed","98106",{"$f":"_xlfn.XLOOKUP(--fSeattle2020Complaints[[#This Row],[ZipCode]],dZipNeighborhood[ZipCode],dZipNeighborhood[Neighborhood])","v":"Delridge"}]
["Construction","2020-01-14","Completed","Completed","98117",{"$f":"_xlfn.XLOOKUP(--fSeattle2020Complaints[[#This Row],[ZipCode]],dZipNeighborhood[ZipCode],dZipNeighborhood[Neighborhood])","v":"Sunset Hill"}]
["Land Use","2020-03-13","Completed","Completed","98118",{"$f":"_xlfn.XLOOKUP(--fSeattle2020Complaints[[#This Row],[ZipCode]],dZipNeighborhood[ZipCode],dZipNeighborhood[Neighborhood])","v":"Columbia City"}]
["Weeds","2020-08-24","Completed","Completed","98115",{"$f":"_xlfn.XLOOKUP(--fSeattle2020Complaints[[#This Row],[ZipCode]],dZipNeighborhood[ZipCode],dZipNeighborhood[Neighborhood])","v":"Greenlake"}]
["Vacant Building","2020-09-02","Completed","Completed","98118",{"$f":"_xlfn.XLOOKUP(--fSeattle2020Complaints[[#This Row],[ZipCode]],dZipNeighborhood[ZipCode],dZipNeighborhood[Neighborhood])","v":"Columbia City"}]
["Tree","2020-07-22","Completed","Initiated","98116",{"$f":"_xlfn.XLOOKUP(--fSeattle2020Complaints[[#This Row],[ZipCode]],dZipNeighborhood[ZipCode],dZipNeighborhood[Neighborhood])","v":"West Seattle"}]
["Weeds","2020-12-09","Completed","Completed","98178",{"$f":"_xlfn.XLOOKUP(--fSeattle2020Complaints[[#This Row],[ZipCode]],dZipNeighborhood[ZipCode],dZipNeighborhood[Neighborhood])","v":"Skyway"}]
["Construction","2020-03-04","Completed","Completed","98122",{"$f":"_xlfn.XLOOKUP(--fSeattle2020Complaints[[#This Row],[ZipCode]],dZipNeighborhood[ZipCode],dZipNeighborhood[Neighborhood])","v":"Minor, Central Area"}]
["Construction","2020-03-09","Completed","Completed","98107",{"$f":"_xlfn.XLOOKUP(--fSeattle2020Complaints[[#This Row],[ZipCode]],dZipNeighborhood[ZipCode],dZipNeighborhood[Neighborhood])","v":"Ballard"}]
["Land UseTree ,","2020-07-06","Completed","Completed","98116",{"$f":"_xlfn.XLOOKUP(--fSeattle2020Complaints[[#This Row],[ZipCode]],dZipNeighborhood[ZipCode],dZipNeighborhood[Neighborhood])","v":"West Seattle"}]
["Construction","2020-10-20","Completed","Completed","98112",{"$f":"_xlfn.XLOOKUP(--fSeattle2020Complaints[[#This Row],[ZipCode]],dZipNeighborhood[ZipCode],dZipNeighborhood[Neighborhood])","v":"Madison Park"}]
["Vacant Building","2020-12-02","Completed","Closed","98115",{"$f":"_xlfn.XLOOKUP(--fSeattle2020Complaints[[#This Row],[ZipCode]],dZipNeighborhood[ZipCode],dZipNeighborhood[Neighborhood])","v":"Greenlake"}]
["Weeds","2020-08-23","Completed","Completed","98125",{"$f":"_xlfn.XLOOKUP(--fSeattle2020Complaints[[#This Row],[ZipCode]],dZipNeighborhood[ZipCode],dZipNeighborhood[Neighborhood])","v":"Northgate"}]
["Emergency","2020-01-31","Completed","Completed","98105",{"$f":"_xlfn.XLOOKUP(--fSeattle2020Complaints[[#This Row],[ZipCode]],dZipNeighborhood[ZipCode],dZipNeighborhood[Neighborhood])","v":"University District"}]
["Weeds","2020-05-31","Completed","Completed","98108",{"$f":"_xlfn.XLOOKUP(--fSeattle2020Complaints[[#This Row],[ZipCode]],dZipNeighborhood[ZipCode],dZipNeighborhood[Neighborhood])","v":"Rainer Valley"}]
["Land Use","2020-02-24","Completed","Completed","98122",{"$f":"_xlfn.XLOOKUP(--fSeattle2020Complaints[[#This Row],[ZipCode]],dZipNeighborhood[ZipCode],dZipNeighborhood[Neighborhood])","v":"Minor, Central Area"}]
["Weeds","2020-03-13","Compliance Achieved","Completed","98144",{"$f":"_xlfn.XLOOKUP(--fSeattle2020Complaints[[#This Row],[ZipCode]],dZipNeighborhood[ZipCode],dZipNeighborhood[Neighborhood])","v":"Mount Baker"}]
["Weeds","2020-02-05","Completed","Completed","98112",{"$f":"_xlfn.XLOOKUP(--fSeattle2020Complaints[[#This Row],[ZipCode]],dZipNeighborhood[ZipCode],dZipNeighborhood[Neighborhood])","v":"Madison Park"}]
["Land Use","2020-09-16","Completed","Completed","98103",{"$f":"_xlfn.XLOOKUP(--fSeattle2020Complaints[[#This Row],[ZipCode]],dZipNeighborhood[ZipCode],dZipNeighborhood[Neighborhood])","v":"Greenwood"}]
["Weeds","2020-02-04","Compliance Achieved","Completed","98105",{"$f":"_xlfn.XLOOKUP(--fSeattle2020Complaints[[#This Row],[ZipCode]],dZipNeighborhood[ZipCode],dZipNeighborhood[Neighborhood])","v":"University District"}]
["Construction","2020-12-11","Completed","Completed","98115",{"$f":"_xlfn.XLOOKUP(--fSeattle2020Complaints[[#This Row],[ZipCode]],dZipNeighborhood[ZipCode],dZipNeighborhood[Neighborhood])","v":"Greenlake"}]
["Land Use","2020-12-15","Completed","Completed","98108",{"$f":"_xlfn.XLOOKUP(--fSeattle2020Complaints[[#This Row],[ZipCode]],dZipNeighborhood[ZipCode],dZipNeighborhood[Neighborhood])","v":"Rainer Valley"}]
["Construction","2020-10-24","Completed","Under Investigation","98103",{"$f":"_xlfn.XLOOKUP(--fSeattle2020Complaints[[#This Row],[ZipCode]],dZipNeighborhood[ZipCode],dZipNeighborhood[Neighborhood])","v":"Greenwood"}]
["Land Use","2020-05-04","Completed","Completed","98112",{"$f":"_xlfn.XLOOKUP(--fSeattle2020Complaints[[#This Row],[ZipCode]],dZipNeighborhood[ZipCode],dZipNeighborhood[Neighborhood])","v":"Madison Park"}]
["Construction","2020-04-06","Compliance Achieved","Completed","98104",{"$f":"_xlfn.XLOOKUP(--fSeattle2020Complaints[[#This Row],[ZipCode]],dZipNeighborhood[ZipCode],dZipNeighborhood[Neighborhood])","v":"International District"}]
["Weeds","2020-07-03","Completed","Completed","98125",{"$f":"_xlfn.XLOOKUP(--fSeattle2020Complaints[[#This Row],[ZipCode]],dZipNeighborhood[ZipCode],dZipNeighborhood[Neighborhood])","v":"Northgate"}]
["Land UseNoise ,","2020-07-15","Completed","Completed","98122",{"$f":"_xlfn.XLOOKUP(--fSeattle2020Complaints[[#This Row],[ZipCode]],dZipNeighborhood[ZipCode],dZipNeighborhood[Neighborhood])","v":"Minor, Central Area"}]
["Land Use","2020-03-17","Completed","Completed","98108",{"$f":"_xlfn.XLOOKUP(--fSeattle2020Complaints[[#This Row],[ZipCode]],dZipNeighborhood[ZipCode],dZipNeighborhood[Neighborhood])","v":"Rainer Valley"}]
["Land Use","2020-09-10","Completed","Completed","98107",{"$f":"_xlfn.XLOOKUP(--fSeattle2020Complaints[[#This Row],[ZipCode]],dZipNeighborhood[ZipCode],dZipNeighborhood[Neighborhood])","v":"Ballard"}]
["Land Use","2020-06-24","Completed","Completed","98112",{"$f":"_xlfn.XLOOKUP(--fSeattle2020Complaints[[#This Row],[ZipCode]],dZipNeighborhood[ZipCode],dZipNeighborhood[Neighborhood])","v":"Madison Park"}]
["Land Use","2020-07-08","Completed","Completed","98108",{"$f":"_xlfn.XLOOKUP(--fSeattle2020Complaints[[#This Row],[ZipCode]],dZipNeighborhood[ZipCode],dZipNeighborhood[Neighborhood])","v":"Rainer Valley"}]
["Construction","2020-11-02","Completed","Completed","98103",{"$f":"_xlfn.XLOOKUP(--fSeattle2020Complaints[[#This Row],[ZipCode]],dZipNeighborhood[ZipCode],dZipNeighborhood[Neighborhood])","v":"Greenwood"}]
["Construction , ECA","2020-05-11","Completed","Completed","98109",{"$f":"_xlfn.XLOOKUP(--fSeattle2020Complaints[[#This Row],[ZipCode]],dZipNeighborhood[ZipCode],dZipNeighborhood[Neighborhood])","v":"South Lake Union"}]
["Land Use","2020-07-27","No Access/Unable to Observe","Completed","98102",{"$f":"_xlfn.XLOOKUP(--fSeattle2020Complaints[[#This Row],[ZipCode]],dZipNeighborhood[ZipCode],dZipNeighborhood[Neighborhood])","v":"Capital Hill"}]
["Tree","2020-03-04","Completed","Completed","98103",{"$f":"_xlfn.XLOOKUP(--fSeattle2020Complaints[[#This Row],[ZipCode]],dZipNeighborhood[ZipCode],dZipNeighborhood[Neighborhood])","v":"Greenwood"}]
["Land Use","2020-07-22","Completed","Completed","98122",{"$f":"_xlfn.XLOOKUP(--fSeattle2020Complaints[[#This Row],[ZipCode]],dZipNeighborhood[ZipCode],dZipNeighborhood[Neighborhood])","v":"Minor, Central Area"}]
["Land Use","2020-08-06","Completed","Completed","98199",{"$f":"_xlfn.XLOOKUP(--fSeattle2020Complaints[[#This Row],[ZipCode]],dZipNeighborhood[ZipCode],dZipNeighborhood[Neighborhood])","v":"Magnolia"}]
["Land Use","2020-04-10","Completed","Completed","98118",{"$f":"_xlfn.XLOOKUP(--fSeattle2020Complaints[[#This Row],[ZipCode]],dZipNeighborhood[ZipCode],dZipNeighborhood[Neighborhood])","v":"Columbia City"}]
["Weeds","2020-08-17","Completed","Completed","98144",{"$f":"_xlfn.XLOOKUP(--fSeattle2020Complaints[[#This Row],[ZipCode]],dZipNeighborhood[ZipCode],dZipNeighborhood[Neighborhood])","v":"Mount Baker"}]
["Weeds","2020-06-11","Completed","Completed","98136",{"$f":"_xlfn.XLOOKUP(--fSeattle2020Complaints[[#This Row],[ZipCode]],dZipNeighborhood[ZipCode],dZipNeighborhood[Neighborhood])","v":"Seaview"}]
["Tree","2020-08-03","Completed","Completed","98199",{"$f":"_xlfn.XLOOKUP(--fSeattle2020Complaints[[#This Row],[ZipCode]],dZipNeighborhood[ZipCode],dZipNeighborhood[Neighborhood])","v":"Magnolia"}]
["Construction","2020-05-19","Compliance Achieved","Completed","98108",{"$f":"_xlfn.XLOOKUP(--fSeattle2020Complaints[[#This Row],[ZipCode]],dZipNeighborhood[ZipCode],dZipNeighborhood[Neighborhood])","v":"Rainer Valley"}]
["Weeds","2020-06-25","Completed","Completed","98136",{"$f":"_xlfn.XLOOKUP(--fSeattle2020Complaints[[#This Row],[ZipCode]],dZipNeighborhood[ZipCode],dZipNeighborhood[Neighborhood])","v":"Seaview"}]
["Emergency , Vacant Building","2020-01-06","Completed","Completed","98106",{"$f":"_xlfn.XLOOKUP(--fSeattle2020Complaints[[#This Row],[ZipCode]],dZipNeighborhood[ZipCode],dZipNeighborhood[Neighborhood])","v":"Delridge"}]
["Noise","2020-02-06","Completed","Completed","98118",{"$f":"_xlfn.XLOOKUP(--fSeattle2020Complaints[[#This Row],[ZipCode]],dZipNeighborhood[ZipCode],dZipNeighborhood[Neighborhood])","v":"Columbia City"}]
["Construction","2020-08-05","No Violation","Completed","98119",{"$f":"_xlfn.XLOOKUP(--fSeattle2020Complaints[[#This Row],[ZipCode]],dZipNeighborhood[ZipCode],dZipNeighborhood[Neighborhood])","v":"Queen Anne"}]
["Land Use","2020-12-28","Completed","Completed","98107",{"$f":"_xlfn.XLOOKUP(--fSeattle2020Complaints[[#This Row],[ZipCode]],dZipNeighborhood[ZipCode],dZipNeighborhood[Neighborhood])","v":"Ballard"}]
["Tree","2020-09-29","Completed","Completed","98116",{"$f":"_xlfn.XLOOKUP(--fSeattle2020Complaints[[#This Row],[ZipCode]],dZipNeighborhood[ZipCode],dZipNeighborhood[Neighborhood])","v":"West Seattle"}]
["Weeds","2020-09-01","Completed","Completed","98115",{"$f":"_xlfn.XLOOKUP(--fSeattle2020Complaints[[#This Row],[ZipCode]],dZipNeighborhood[ZipCode],dZipNeighborhood[Neighborhood])","v":"Greenlake"}]
["Weeds","2020-08-28","Completed","Completed","98125",{"$f":"_xlfn.XLOOKUP(--fSeattle2020Complaints[[#This Row],[ZipCode]],dZipNeighborhood[ZipCode],dZipNeighborhood[Neighborhood])","v":"Northgate"}]
["Land Use","2020-09-30","Completed","Completed","98102",{"$f":"_xlfn.XLOOKUP(--fSeattle2020Complaints[[#This Row],[ZipCode]],dZipNeighborhood[ZipCode],dZipNeighborhood[Neighborhood])","v":"Capital Hill"}]
["Land Use","2020-07-16","Compliance Achieved","Completed","98126",{"$f":"_xlfn.XLOOKUP(--fSeattle2020Complaints[[#This Row],[ZipCode]],dZipNeighborhood[ZipCode],dZipNeighborhood[Neighborhood])","v":"High Point"}]
["Land Use","2020-09-30","Completed","Completed","98144",{"$f":"_xlfn.XLOOKUP(--fSeattle2020Complaints[[#This Row],[ZipCode]],dZipNeighborhood[ZipCode],dZipNeighborhood[Neighborhood])","v":"Mount Baker"}]
["Weeds","2020-10-14","Completed","Completed","98106",{"$f":"_xlfn.XLOOKUP(--fSeattle2020Complaints[[#This Row],[ZipCode]],dZipNeighborhood[ZipCode],dZipNeighborhood[Neighborhood])","v":"Delridge"}]
["Construction","2020-10-26","Completed","Completed","98105",{"$f":"_xlfn.XLOOKUP(--fSeattle2020Complaints[[#This Row],[ZipCode]],dZipNeighborhood[ZipCode],dZipNeighborhood[Neighborhood])","v":"University District"}]
["Noise","2020-09-16","No Violation","Completed","98199",{"$f":"_xlfn.XLOOKUP(--fSeattle2020Complaints[[#This Row],[ZipCode]],dZipNeighborhood[ZipCode],dZipNeighborhood[Neighborhood])","v":"Magnolia"}]
["Weeds","2020-09-09","Completed","Completed","98119",{"$f":"_xlfn.XLOOKUP(--fSeattle2020Complaints[[#This Row],[ZipCode]],dZipNeighborhood[ZipCode],dZipNeighborhood[Neighborhood])","v":"Queen Anne"}]
["Construction","2020-07-09","Completed","Completed","98119",{"$f":"_xlfn.XLOOKUP(--fSeattle2020Complaints[[#This Row],[ZipCode]],dZipNeighborhood[ZipCode],dZipNeighborhood[Neighborhood])","v":"Queen Anne"}]
["Vacant Building","2020-10-26","Completed","Closed","98118",{"$f":"_xlfn.XLOOKUP(--fSeattle2020Complaints[[#This Row],[ZipCode]],dZipNeighborhood[ZipCode],dZipNeighborhood[Neighborhood])","v":"Columbia City"}]
["Land Use","2020-07-15","Completed","Completed","98105",{"$f":"_xlfn.XLOOKUP(--fSeattle2020Complaints[[#This Row],[ZipCode]],dZipNeighborhood[ZipCode],dZipNeighborhood[Neighborhood])","v":"University District"}]
["Land Use","2020-02-10","Completed","Completed","98126",{"$f":"_xlfn.XLOOKUP(--fSeattle2020Complaints[[#This Row],[ZipCode]],dZipNeighborhood[ZipCode],dZipNeighborhood[Neighborhood])","v":"High Point"}]
["Construction","2020-09-18","Completed","Completed","98105",{"$f":"_xlfn.XLOOKUP(--fSeattle2020Complaints[[#This Row],[ZipCode]],dZipNeighborhood[ZipCode],dZipNeighborhood[Neighborhood])","v":"University District"}]
["Land Use","2020-07-20","Completed","Completed","98136",{"$f":"_xlfn.XLOOKUP(--fSeattle2020Complaints[[#This Row],[ZipCode]],dZipNeighborhood[ZipCode],dZipNeighborhood[Neighborhood])","v":"Seaview"}]
["Land Use","2020-05-12","Completed","Completed","98118",{"$f":"_xlfn.XLOOKUP(--fSeattle2020Complaints[[#This Row],[ZipCode]],dZipNeighborhood[ZipCode],dZipNeighborhood[Neighborhood])","v":"Columbia City"}]
["Weeds","2020-03-20","Compliance Achieved","Completed","98103",{"$f":"_xlfn.XLOOKUP(--fSeattle2020Complaints[[#This Row],[ZipCode]],dZipNeighborhood[ZipCode],dZipNeighborhood[Neighborhood])","v":"Greenwood"}]
["Weeds","2020-06-15","Completed","Completed","98119",{"$f":"_xlfn.XLOOKUP(--fSeattle2020Complaints[[#This Row],[ZipCode]],dZipNeighborhood[ZipCode],dZipNeighborhood[Neighborhood])","v":"Queen Anne"}]
["Tree","2020-08-20","No Access/Unable to Observe","Completed","98118",{"$f":"_xlfn.XLOOKUP(--fSeattle2020Complaints[[#This Row],[ZipCode]],dZipNeighborhood[ZipCode],dZipNeighborhood[Neighborhood])","v":"Columbia City"}]
["Vacant Building","2020-05-08","Completed","Completed","98122",{"$f":"_xlfn.XLOOKUP(--fSeattle2020Complaints[[#This Row],[ZipCode]],dZipNeighborhood[ZipCode],dZipNeighborhood[Neighborhood])","v":"Minor, Central Area"}]
["Land UseWeeds ,","2020-10-06","Completed","Completed","98103",{"$f":"_xlfn.XLOOKUP(--fSeattle2020Complaints[[#This Row],[ZipCode]],dZipNeighborhood[ZipCode],dZipNeighborhood[Neighborhood])","v":"Greenwood"}]
["Construction","2020-12-16","Completed","Completed","98177",{"$f":"_xlfn.XLOOKUP(--fSeattle2020Complaints[[#This Row],[ZipCode]],dZipNeighborhood[ZipCode],dZipNeighborhood[Neighborhood])","v":"Richmond Beach"}]
["Construction","2020-03-16","Completed","Completed","98112",{"$f":"_xlfn.XLOOKUP(--fSeattle2020Complaints[[#This Row],[ZipCode]],dZipNeighborhood[ZipCode],dZipNeighborhood[Neighborhood])","v":"Madison Park"}]
["Construction","2020-05-27","Completed","NOV Issued","98108",{"$f":"_xlfn.XLOOKUP(--fSeattle2020Complaints[[#This Row],[ZipCode]],dZipNeighborhood[ZipCode],dZipNeighborhood[Neighborhood])","v":"Rainer Valley"}]
["Construction","2020-03-26","Completed","Completed","98119",{"$f":"_xlfn.XLOOKUP(--fSeattle2020Complaints[[#This Row],[ZipCode]],dZipNeighborhood[ZipCode],dZipNeighborhood[Neighborhood])","v":"Queen Anne"}]
["Construction","2020-08-25","Completed","Completed","98106",{"$f":"_xlfn.XLOOKUP(--fSeattle2020Complaints[[#This Row],[ZipCode]],dZipNeighborhood[ZipCode],dZipNeighborhood[Neighborhood])","v":"Delridge"}]
["Weeds","2020-09-23","Completed","Completed","98108",{"$f":"_xlfn.XLOOKUP(--fSeattle2020Complaints[[#This Row],[ZipCode]],dZipNeighborhood[ZipCode],dZipNeighborhood[Neighborhood])","v":"Rainer Valley"}]
["Construction","2020-07-09","Completed","Completed","98118",{"$f":"_xlfn.XLOOKUP(--fSeattle2020Complaints[[#This Row],[ZipCode]],dZipNeighborhood[ZipCode],dZipNeighborhood[Neighborhood])","v":"Columbia City"}]
["Construction , Tree","2020-05-19","Compliance Achieved","Completed","98126",{"$f":"_xlfn.XLOOKUP(--fSeattle2020Complaints[[#This Row],[ZipCode]],dZipNeighborhood[ZipCode],dZipNeighborhood[Neighborhood])","v":"High Point"}]
["Emergency , Vacant Building","2020-01-06","Completed","Closed","98199",{"$f":"_xlfn.XLOOKUP(--fSeattle2020Complaints[[#This Row],[ZipCode]],dZipNeighborhood[ZipCode],dZipNeighborhood[Neighborhood])","v":"Magnolia"}]
["Weeds","2020-07-12","Completed","Completed","98103",{"$f":"_xlfn.XLOOKUP(--fSeattle2020Complaints[[#This Row],[ZipCode]],dZipNeighborhood[ZipCode],dZipNeighborhood[Neighborhood])","v":"Greenwood"}]
["Land Use","2020-03-04","Completed","Initiated","98133",{"$f":"_xlfn.XLOOKUP(--fSeattle2020Complaints[[#This Row],[ZipCode]],dZipNeighborhood[ZipCode],dZipNeighborhood[Neighborhood])","v":"Shoreline"}]
["Construction","2020-11-01","Completed","Completed","98117",{"$f":"_xlfn.XLOOKUP(--fSeattle2020Complaints[[#This Row],[ZipCode]],dZipNeighborhood[ZipCode],dZipNeighborhood[Neighborhood])","v":"Sunset Hill"}]
["Tree","2020-05-19","Completed","Completed","98115",{"$f":"_xlfn.XLOOKUP(--fSeattle2020Complaints[[#This Row],[ZipCode]],dZipNeighborhood[ZipCode],dZipNeighborhood[Neighborhood])","v":"Greenlake"}]
["Weeds","2020-03-16","Completed","Warning","98116",{"$f":"_xlfn.XLOOKUP(--fSeattle2020Complaints[[#This Row],[ZipCode]],dZipNeighborhood[ZipCode],dZipNeighborhood[Neighborhood])","v":"West Seattle"}]
["Construction","2020-09-15","Completed","Completed","98118",{"$f":"_xlfn.XLOOKUP(--fSeattle2020Complaints[[#This Row],[ZipCode]],dZipNeighborhood[ZipCode],dZipNeighborhood[Neighborhood])","v":"Columbia City"}]
["Weeds","2020-07-08","Completed","Closed","98122",{"$f":"_xlfn.XLOOKUP(--fSeattle2020Complaints[[#This Row],[ZipCode]],dZipNeighborhood[ZipCode],dZipNeighborhood[Neighborhood])","v":"Minor, Central Area"}]
["Land Use","2020-08-11","Completed","Completed","98106",{"$f":"_xlfn.XLOOKUP(--fSeattle2020Complaints[[#This Row],[ZipCode]],dZipNeighborhood[ZipCode],dZipNeighborhood[Neighborhood])","v":"Delridge"}]
["Emergency , Vacant Building","2020-12-23","Completed","Completed","98112",{"$f":"_xlfn.XLOOKUP(--fSeattle2020Complaints[[#This Row],[ZipCode]],dZipNeighborhood[ZipCode],dZipNeighborhood[Neighborhood])","v":"Madison Park"}]
["Weeds","2020-07-09","Completed","Completed","98144",{"$f":"_xlfn.XLOOKUP(--fSeattle2020Complaints[[#This Row],[ZipCode]],dZipNeighborhood[ZipCode],dZipNeighborhood[Neighborhood])","v":"Mount Baker"}]
["Emergency , Vacant Building","2020-12-08","Completed","Completed","98118",{"$f":"_xlfn.XLOOKUP(--fSeattle2020Complaints[[#This Row],[ZipCode]],dZipNeighborhood[ZipCode],dZipNeighborhood[Neighborhood])","v":"Columbia City"}]
["Land Use","2020-05-15","Completed","Closed","98106",{"$f":"_xlfn.XLOOKUP(--fSeattle2020Complaints[[#This Row],[ZipCode]],dZipNeighborhood[ZipCode],dZipNeighborhood[Neighborhood])","v":"Delridge"}]
["Land Use","2020-07-31","Completed","Completed","98125",{"$f":"_xlfn.XLOOKUP(--fSeattle2020Complaints[[#This Row],[ZipCode]],dZipNeighborhood[ZipCode],dZipNeighborhood[Neighborhood])","v":"Northgate"}]
["Land Use","2020-03-27","Completed","Completed","98178",{"$f":"_xlfn.XLOOKUP(--fSeattle2020Complaints[[#This Row],[ZipCode]],dZipNeighborhood[ZipCode],dZipNeighborhood[Neighborhood])","v":"Skyway"}]
["Land Use","2020-05-07","Completed","Completed","98126",{"$f":"_xlfn.XLOOKUP(--fSeattle2020Complaints[[#This Row],[ZipCode]],dZipNeighborhood[ZipCode],dZipNeighborhood[Neighborhood])","v":"High Point"}]
["Land Use","2020-10-01","Completed","Completed","98109",{"$f":"_xlfn.XLOOKUP(--fSeattle2020Complaints[[#This Row],[ZipCode]],dZipNeighborhood[ZipCode],dZipNeighborhood[Neighborhood])","v":"South Lake Union"}]
["Tree","2020-10-12","Completed","Completed","98136",{"$f":"_xlfn.XLOOKUP(--fSeattle2020Complaints[[#This Row],[ZipCode]],dZipNeighborhood[ZipCode],dZipNeighborhood[Neighborhood])","v":"Seaview"}]
["Land Use","2020-03-16","Completed","Completed","98144",{"$f":"_xlfn.XLOOKUP(--fSeattle2020Complaints[[#This Row],[ZipCode]],dZipNeighborhood[ZipCode],dZipNeighborhood[Neighborhood])","v":"Mount Baker"}]
["Weeds","2020-02-24","Completed","Completed","98178",{"$f":"_xlfn.XLOOKUP(--fSeattle2020Complaints[[#This Row],[ZipCode]],dZipNeighborhood[ZipCode],dZipNeighborhood[Neighborhood])","v":"Skyway"}]
["Weeds","2020-02-12","Completed","Completed","98102",{"$f":"_xlfn.XLOOKUP(--fSeattle2020Complaints[[#This Row],[ZipCode]],dZipNeighborhood[ZipCode],dZipNeighborhood[Neighborhood])","v":"Capital Hill"}]
["Emergency","2020-02-25","Compliance Achieved","Completed","98106",{"$f":"_xlfn.XLOOKUP(--fSeattle2020Complaints[[#This Row],[ZipCode]],dZipNeighborhood[ZipCode],dZipNeighborhood[Neighborhood])","v":"Delridge"}]
["Vacant Building","2020-06-04","Completed","Completed","98102",{"$f":"_xlfn.XLOOKUP(--fSeattle2020Complaints[[#This Row],[ZipCode]],dZipNeighborhood[ZipCode],dZipNeighborhood[Neighborhood])","v":"Capital Hill"}]
["Land Use","2020-03-12","Compliance Achieved","Completed","98108",{"$f":"_xlfn.XLOOKUP(--fSeattle2020Complaints[[#This Row],[ZipCode]],dZipNeighborhood[ZipCode],dZipNeighborhood[Neighborhood])","v":"Rainer Valley"}]
["Vacant Building","2020-06-19","Completed","Completed","98103",{"$f":"_xlfn.XLOOKUP(--fSeattle2020Complaints[[#This Row],[ZipCode]],dZipNeighborhood[ZipCode],dZipNeighborhood[Neighborhood])","v":"Greenwood"}]
["Weeds","2020-03-17","Compliance Achieved","Completed","98116",{"$f":"_xlfn.XLOOKUP(--fSeattle2020Complaints[[#This Row],[ZipCode]],dZipNeighborhood[ZipCode],dZipNeighborhood[Neighborhood])","v":"West Seattle"}]
["Construction","2020-06-16","Completed","NOV Issued","98118",{"$f":"_xlfn.XLOOKUP(--fSeattle2020Complaints[[#This Row],[ZipCode]],dZipNeighborhood[ZipCode],dZipNeighborhood[Neighborhood])","v":"Columbia City"}]
["Weeds","2020-02-10","Completed","Completed","98115",{"$f":"_xlfn.XLOOKUP(--fSeattle2020Complaints[[#This Row],[ZipCode]],dZipNeighborhood[ZipCode],dZipNeighborhood[Neighborhood])","v":"Greenlake"}]
["Weeds","2020-03-25","Completed","Completed","98112",{"$f":"_xlfn.XLOOKUP(--fSeattle2020Complaints[[#This Row],[ZipCode]],dZipNeighborhood[ZipCode],dZipNeighborhood[Neighborhood])","v":"Madison Park"}]
["Land Use","2020-07-13","Completed","Completed","98133",{"$f":"_xlfn.XLOOKUP(--fSeattle2020Complaints[[#This Row],[ZipCode]],dZipNeighborhood[ZipCode],dZipNeighborhood[Neighborhood])","v":"Shoreline"}]
["Weeds","2020-05-01","Completed","Completed","98105",{"$f":"_xlfn.XLOOKUP(--fSeattle2020Complaints[[#This Row],[ZipCode]],dZipNeighborhood[ZipCode],dZipNeighborhood[Neighborhood])","v":"University District"}]
["Weeds","2020-02-27","Completed","Completed","98106",{"$f":"_xlfn.XLOOKUP(--fSeattle2020Complaints[[#This Row],[ZipCode]],dZipNeighborhood[ZipCode],dZipNeighborhood[Neighborhood])","v":"Delridge"}]
["Land Use","2020-09-25","Completed","Completed","98122",{"$f":"_xlfn.XLOOKUP(--fSeattle2020Complaints[[#This Row],[ZipCode]],dZipNeighborhood[ZipCode],dZipNeighborhood[Neighborhood])","v":"Minor, Central Area"}]
["Weeds","2020-05-08","Completed","Completed","98108",{"$f":"_xlfn.XLOOKUP(--fSeattle2020Complaints[[#This Row],[ZipCode]],dZipNeighborhood[ZipCode],dZipNeighborhood[Neighborhood])","v":"Rainer Valley"}]
["Land Use","2020-10-29","Completed","Completed","98115",{"$f":"_xlfn.XLOOKUP(--fSeattle2020Complaints[[#This Row],[ZipCode]],dZipNeighborhood[ZipCode],dZipNeighborhood[Neighborhood])","v":"Greenlake"}]
["Land UseLandLord/Tenant ,","2020-08-01","Completed","Completed","98122",{"$f":"_xlfn.XLOOKUP(--fSeattle2020Complaints[[#This Row],[ZipCode]],dZipNeighborhood[ZipCode],dZipNeighborhood[Neighborhood])","v":"Minor, Central Area"}]
["Weeds","2020-09-24","Completed","Completed","98102",{"$f":"_xlfn.XLOOKUP(--fSeattle2020Complaints[[#This Row],[ZipCode]],dZipNeighborhood[ZipCode],dZipNeighborhood[Neighborhood])","v":"Capital Hill"}]
["Construction","2020-01-21","Completed","NOV Issued","98105",{"$f":"_xlfn.XLOOKUP(--fSeattle2020Complaints[[#This Row],[ZipCode]],dZipNeighborhood[ZipCode],dZipNeighborhood[Neighborhood])","v":"University District"}]
["Land Use","2020-02-24","Completed","Completed","98117",{"$f":"_xlfn.XLOOKUP(--fSeattle2020Complaints[[#This Row],[ZipCode]],dZipNeighborhood[ZipCode],dZipNeighborhood[Neighborhood])","v":"Sunset Hill"}]
["Construction","2020-11-30","Completed","Completed","98106",{"$f":"_xlfn.XLOOKUP(--fSeattle2020Complaints[[#This Row],[ZipCode]],dZipNeighborhood[ZipCode],dZipNeighborhood[Neighborhood])","v":"Delridge"}]
["Weeds","2020-05-13","Completed","Completed","98106",{"$f":"_xlfn.XLOOKUP(--fSeattle2020Complaints[[#This Row],[ZipCode]],dZipNeighborhood[ZipCode],dZipNeighborhood[Neighborhood])","v":"Delridge"}]
["Construction","2020-01-21","Completed","Completed","98105",{"$f":"_xlfn.XLOOKUP(--fSeattle2020Complaints[[#This Row],[ZipCode]],dZipNeighborhood[ZipCode],dZipNeighborhood[Neighborhood])","v":"University District"}]
["Land Use","2020-10-06","Completed","Completed","98118",{"$f":"_xlfn.XLOOKUP(--fSeattle2020Complaints[[#This Row],[ZipCode]],dZipNeighborhood[ZipCode],dZipNeighborhood[Neighborhood])","v":"Columbia City"}]
["Vacant Building","2020-09-11","No Violation","Completed","98105",{"$f":"_xlfn.XLOOKUP(--fSeattle2020Complaints[[#This Row],[ZipCode]],dZipNeighborhood[ZipCode],dZipNeighborhood[Neighborhood])","v":"University District"}]
["Land Use","2020-12-23","Completed","Completed","98121",{"$f":"_xlfn.XLOOKUP(--fSeattle2020Complaints[[#This Row],[ZipCode]],dZipNeighborhood[ZipCode],dZipNeighborhood[Neighborhood])","v":"Belltown"}]
["Land Use","2020-04-21","No Access/Unable to Observe","Closed","98199",{"$f":"_xlfn.XLOOKUP(--fSeattle2020Complaints[[#This Row],[ZipCode]],dZipNeighborhood[ZipCode],dZipNeighborhood[Neighborhood])","v":"Magnolia"}]
["Land Use","2020-04-22","Compliance Achieved","Completed","98115",{"$f":"_xlfn.XLOOKUP(--fSeattle2020Complaints[[#This Row],[ZipCode]],dZipNeighborhood[ZipCode],dZipNeighborhood[Neighborhood])","v":"Greenlake"}]
["Vacant Building","2020-03-13","Completed","Completed","98115",{"$f":"_xlfn.XLOOKUP(--fSeattle2020Complaints[[#This Row],[ZipCode]],dZipNeighborhood[ZipCode],dZipNeighborhood[Neighborhood])","v":"Greenlake"}]
["Weeds","2020-06-22","Completed","Completed","98115",{"$f":"_xlfn.XLOOKUP(--fSeattle2020Complaints[[#This Row],[ZipCode]],dZipNeighborhood[ZipCode],dZipNeighborhood[Neighborhood])","v":"Greenlake"}]
["Construction","2020-01-14","Completed","Completed","98119",{"$f":"_xlfn.XLOOKUP(--fSeattle2020Complaints[[#This Row],[ZipCode]],dZipNeighborhood[ZipCode],dZipNeighborhood[Neighborhood])","v":"Queen Anne"}]
["Land Use","2020-02-10","Completed","Completed","98118",{"$f":"_xlfn.XLOOKUP(--fSeattle2020Complaints[[#This Row],[ZipCode]],dZipNeighborhood[ZipCode],dZipNeighborhood[Neighborhood])","v":"Columbia City"}]
["Weeds","2020-09-15","Completed","Completed","98103",{"$f":"_xlfn.XLOOKUP(--fSeattle2020Complaints[[#This Row],[ZipCode]],dZipNeighborhood[ZipCode],dZipNeighborhood[Neighborhood])","v":"Greenwood"}]
["Land Use","2020-11-12","Completed","Completed","98118",{"$f":"_xlfn.XLOOKUP(--fSeattle2020Complaints[[#This Row],[ZipCode]],dZipNeighborhood[ZipCode],dZipNeighborhood[Neighborhood])","v":"Columbia City"}]
["Construction","2020-09-18","Completed","Completed","98125",{"$f":"_xlfn.XLOOKUP(--fSeattle2020Complaints[[#This Row],[ZipCode]],dZipNeighborhood[ZipCode],dZipNeighborhood[Neighborhood])","v":"Northgate"}]
["Weeds","2020-03-24","Completed","Initiated","98107",{"$f":"_xlfn.XLOOKUP(--fSeattle2020Complaints[[#This Row],[ZipCode]],dZipNeighborhood[ZipCode],dZipNeighborhood[Neighborhood])","v":"Ballard"}]
["Land Use","2020-03-16","Completed","Completed","98102",{"$f":"_xlfn.XLOOKUP(--fSeattle2020Complaints[[#This Row],[ZipCode]],dZipNeighborhood[ZipCode],dZipNeighborhood[Neighborhood])","v":"Capital Hill"}]
["Vacant Building","2020-03-11","Completed","Completed","98118",{"$f":"_xlfn.XLOOKUP(--fSeattle2020Complaints[[#This Row],[ZipCode]],dZipNeighborhood[ZipCode],dZipNeighborhood[Neighborhood])","v":"Columbia City"}]
["Weeds","2020-06-28","Completed","Completed","98103",{"$f":"_xlfn.XLOOKUP(--fSeattle2020Complaints[[#This Row],[ZipCode]],dZipNeighborhood[ZipCode],dZipNeighborhood[Neighborhood])","v":"Greenwood"}]
["Weeds","2020-05-22","Completed","Completed","98106",{"$f":"_xlfn.XLOOKUP(--fSeattle2020Complaints[[#This Row],[ZipCode]],dZipNeighborhood[ZipCode],dZipNeighborhood[Neighborhood])","v":"Delridge"}]
["Weeds","2020-02-17","Completed","Completed","98116",{"$f":"_xlfn.XLOOKUP(--fSeattle2020Complaints[[#This Row],[ZipCode]],dZipNeighborhood[ZipCode],dZipNeighborhood[Neighborhood])","v":"West Seattle"}]
["Land Use","2020-06-30","Completed","Completed","98107",{"$f":"_xlfn.XLOOKUP(--fSeattle2020Complaints[[#This Row],[ZipCode]],dZipNeighborhood[ZipCode],dZipNeighborhood[Neighborhood])","v":"Ballard"}]
["Construction","2020-01-24","Completed","Completed","98178",{"$f":"_xlfn.XLOOKUP(--fSeattle2020Complaints[[#This Row],[ZipCode]],dZipNeighborhood[ZipCode],dZipNeighborhood[Neighborhood])","v":"Skyway"}]
["Vacant Building","2020-05-29","Completed","Under Investigation","98107",{"$f":"_xlfn.XLOOKUP(--fSeattle2020Complaints[[#This Row],[ZipCode]],dZipNeighborhood[ZipCode],dZipNeighborhood[Neighborhood])","v":"Ballard"}]
["Land Use","2020-04-02","Completed","Completed","98133",{"$f":"_xlfn.XLOOKUP(--fSeattle2020Complaints[[#This Row],[ZipCode]],dZipNeighborhood[ZipCode],dZipNeighborhood[Neighborhood])","v":"Shoreline"}]
["Construction","2020-01-22","Completed","NOV Issued","98122",{"$f":"_xlfn.XLOOKUP(--fSeattle2020Complaints[[#This Row],[ZipCode]],dZipNeighborhood[ZipCode],dZipNeighborhood[Neighborhood])","v":"Minor, Central Area"}]
["Land Use","2020-04-26","Completed","Completed","98144",{"$f":"_xlfn.XLOOKUP(--fSeattle2020Complaints[[#This Row],[ZipCode]],dZipNeighborhood[ZipCode],dZipNeighborhood[Neighborhood])","v":"Mount Baker"}]
["Vacant Building","2020-09-01","Completed","Closed","98107",{"$f":"_xlfn.XLOOKUP(--fSeattle2020Complaints[[#This Row],[ZipCode]],dZipNeighborhood[ZipCode],dZipNeighborhood[Neighborhood])","v":"Ballard"}]
["Land Use","2020-05-11","Completed","Completed","98108",{"$f":"_xlfn.XLOOKUP(--fSeattle2020Complaints[[#This Row],[ZipCode]],dZipNeighborhood[ZipCode],dZipNeighborhood[Neighborhood])","v":"Rainer Valley"}]
["Construction","2020-02-03","Completed","Completed","98122",{"$f":"_xlfn.XLOOKUP(--fSeattle2020Complaints[[#This Row],[ZipCode]],dZipNeighborhood[ZipCode],dZipNeighborhood[Neighborhood])","v":"Minor, Central Area"}]
["Vacant Building","2020-04-14","Completed","Closed","98105",{"$f":"_xlfn.XLOOKUP(--fSeattle2020Complaints[[#This Row],[ZipCode]],dZipNeighborhood[ZipCode],dZipNeighborhood[Neighborhood])","v":"University District"}]
["Emergency , Vacant Building","2020-11-19","Completed","Completed","98125",{"$f":"_xlfn.XLOOKUP(--fSeattle2020Complaints[[#This Row],[ZipCode]],dZipNeighborhood[ZipCode],dZipNeighborhood[Neighborhood])","v":"Northgate"}]
["Construction","2020-07-23","No Access/Unable to Observe","Completed","98102",{"$f":"_xlfn.XLOOKUP(--fSeattle2020Complaints[[#This Row],[ZipCode]],dZipNeighborhood[ZipCode],dZipNeighborhood[Neighborhood])","v":"Capital Hill"}]
["Construction","2020-03-02","Completed","Closed","98126",{"$f":"_xlfn.XLOOKUP(--fSeattle2020Complaints[[#This Row],[ZipCode]],dZipNeighborhood[ZipCode],dZipNeighborhood[Neighborhood])","v":"High Point"}]
["Land Use","2020-05-06","Completed","Completed","98118",{"$f":"_xlfn.XLOOKUP(--fSeattle2020Complaints[[#This Row],[ZipCode]],dZipNeighborhood[ZipCode],dZipNeighborhood[Neighborhood])","v":"Columbia City"}]
["Tree","2020-05-26","Completed","Completed","98122",{"$f":"_xlfn.XLOOKUP(--fSeattle2020Complaints[[#This Row],[ZipCode]],dZipNeighborhood[ZipCode],dZipNeighborhood[Neighborhood])","v":"Minor, Central Area"}]
["Emergency , Vacant Building","2020-12-08","Completed","Completed","98104",{"$f":"_xlfn.XLOOKUP(--fSeattle2020Complaints[[#This Row],[ZipCode]],dZipNeighborhood[ZipCode],dZipNeighborhood[Neighborhood])","v":"International District"}]
["Construction","2020-06-24","Completed","Closed","98105",{"$f":"_xlfn.XLOOKUP(--fSeattle2020Complaints[[#This Row],[ZipCode]],dZipNeighborhood[ZipCode],dZipNeighborhood[Neighborhood])","v":"University District"}]
["Tree","2020-06-15","Completed","Completed","98116",{"$f":"_xlfn.XLOOKUP(--fSeattle2020Complaints[[#This Row],[ZipCode]],dZipNeighborhood[ZipCode],dZipNeighborhood[Neighborhood])","v":"West Seattle"}]
["Land Use","2020-04-08","Compliance Achieved","Completed","98103",{"$f":"_xlfn.XLOOKUP(--fSeattle2020Complaints[[#This Row],[ZipCode]],dZipNeighborhood[ZipCode],dZipNeighborhood[Neighborhood])","v":"Greenwood"}]
["Emergency , Vacant Building","2020-04-23","Secured with No Violations","Compliance Achieved","98136",{"$f":"_xlfn.XLOOKUP(--fSeattle2020Complaints[[#This Row],[ZipCode]],dZipNeighborhood[ZipCode],dZipNeighborhood[Neighborhood])","v":"Seaview"}]
["Land Use","2020-06-03","Completed","Completed","98126",{"$f":"_xlfn.XLOOKUP(--fSeattle2020Complaints[[#This Row],[ZipCode]],dZipNeighborhood[ZipCode],dZipNeighborhood[Neighborhood])","v":"High Point"}]
["Tree","2020-11-17","Completed","Closed","98126",{"$f":"_xlfn.XLOOKUP(--fSeattle2020Complaints[[#This Row],[ZipCode]],dZipNeighborhood[ZipCode],dZipNeighborhood[Neighborhood])","v":"High Point"}]
["Weeds","2020-07-20","Completed","Completed","98118",{"$f":"_xlfn.XLOOKUP(--fSeattle2020Complaints[[#This Row],[ZipCode]],dZipNeighborhood[ZipCode],dZipNeighborhood[Neighborhood])","v":"Columbia City"}]
["Weeds","2020-02-18","Completed","Completed","98112",{"$f":"_xlfn.XLOOKUP(--fSeattle2020Complaints[[#This Row],[ZipCode]],dZipNeighborhood[ZipCode],dZipNeighborhood[Neighborhood])","v":"Madison Park"}]
["Land Use","2020-05-16","Completed","Completed","98118",{"$f":"_xlfn.XLOOKUP(--fSeattle2020Complaints[[#This Row],[ZipCode]],dZipNeighborhood[ZipCode],dZipNeighborhood[Neighborhood])","v":"Columbia City"}]
["Construction","2020-08-05","Completed","Completed","98103",{"$f":"_xlfn.XLOOKUP(--fSeattle2020Complaints[[#This Row],[ZipCode]],dZipNeighborhood[ZipCode],dZipNeighborhood[Neighborhood])","v":"Greenwood"}]
["Land Use","2020-03-12","Completed","Completed","98118",{"$f":"_xlfn.XLOOKUP(--fSeattle2020Complaints[[#This Row],[ZipCode]],dZipNeighborhood[ZipCode],dZipNeighborhood[Neighborhood])","v":"Columbia City"}]
["Vacant Building","2020-02-05","Completed","Closed","98103",{"$f":"_xlfn.XLOOKUP(--fSeattle2020Complaints[[#This Row],[ZipCode]],dZipNeighborhood[ZipCode],dZipNeighborhood[Neighborhood])","v":"Greenwood"}]
["Weeds","2020-03-03","Compliance Achieved","Completed","98102",{"$f":"_xlfn.XLOOKUP(--fSeattle2020Complaints[[#This Row],[ZipCode]],dZipNeighborhood[ZipCode],dZipNeighborhood[Neighborhood])","v":"Capital Hill"}]
["Land Use","2020-09-18","Not Vacant","Completed","98199",{"$f":"_xlfn.XLOOKUP(--fSeattle2020Complaints[[#This Row],[ZipCode]],dZipNeighborhood[ZipCode],dZipNeighborhood[Neighborhood])","v":"Magnolia"}]
["Weeds","2020-12-02","Completed","Completed","98199",{"$f":"_xlfn.XLOOKUP(--fSeattle2020Complaints[[#This Row],[ZipCode]],dZipNeighborhood[ZipCode],dZipNeighborhood[Neighborhood])","v":"Magnolia"}]
["Vacant Building","2020-08-04","Completed","Completed","98118",{"$f":"_xlfn.XLOOKUP(--fSeattle2020Complaints[[#This Row],[ZipCode]],dZipNeighborhood[ZipCode],dZipNeighborhood[Neighborhood])","v":"Columbia City"}]
["Emergency","2020-06-05","Compliance Achieved","Completed","98101",{"$f":"_xlfn.XLOOKUP(--fSeattle2020Complaints[[#This Row],[ZipCode]],dZipNeighborhood[ZipCode],dZipNeighborhood[Neighborhood])","v":"Seattle"}]
["Emergency , Vacant Building","2020-02-14","Completed","EO Vacate Close Issued","98118",{"$f":"_xlfn.XLOOKUP(--fSeattle2020Complaints[[#This Row],[ZipCode]],dZipNeighborhood[ZipCode],dZipNeighborhood[Neighborhood])","v":"Columbia City"}]
["Weeds","2020-08-13","Completed","Completed","98117",{"$f":"_xlfn.XLOOKUP(--fSeattle2020Complaints[[#This Row],[ZipCode]],dZipNeighborhood[ZipCode],dZipNeighborhood[Neighborhood])","v":"Sunset Hill"}]
["Tree","2020-08-21","Completed","Completed","98199",{"$f":"_xlfn.XLOOKUP(--fSeattle2020Complaints[[#This Row],[ZipCode]],dZipNeighborhood[ZipCode],dZipNeighborhood[Neighborhood])","v":"Magnolia"}]
["Weeds","2020-05-04","Completed","Completed","98126",{"$f":"_xlfn.XLOOKUP(--fSeattle2020Complaints[[#This Row],[ZipCode]],dZipNeighborhood[ZipCode],dZipNeighborhood[Neighborhood])","v":"High Point"}]
["Construction","2020-06-16","Completed","NOV Issued","98122",{"$f":"_xlfn.XLOOKUP(--fSeattle2020Complaints[[#This Row],[ZipCode]],dZipNeighborhood[ZipCode],dZipNeighborhood[Neighborhood])","v":"Minor, Central Area"}]
["Tree","2020-09-03","Completed","Completed","98117",{"$f":"_xlfn.XLOOKUP(--fSeattle2020Complaints[[#This Row],[ZipCode]],dZipNeighborhood[ZipCode],dZipNeighborhood[Neighborhood])","v":"Sunset Hill"}]
["Weeds","2020-03-19","Compliance Achieved","Completed","98126",{"$f":"_xlfn.XLOOKUP(--fSeattle2020Complaints[[#This Row],[ZipCode]],dZipNeighborhood[ZipCode],dZipNeighborhood[Neighborhood])","v":"High Point"}]
["Construction","2020-07-26","Completed","Closed","98106",{"$f":"_xlfn.XLOOKUP(--fSeattle2020Complaints[[#This Row],[ZipCode]],dZipNeighborhood[ZipCode],dZipNeighborhood[Neighborhood])","v":"Delridge"}]
["Construction","2020-01-03","Completed","Completed","98117",{"$f":"_xlfn.XLOOKUP(--fSeattle2020Complaints[[#This Row],[ZipCode]],dZipNeighborhood[ZipCode],dZipNeighborhood[Neighborhood])","v":"Sunset Hill"}]
["Weeds","2020-11-05","Completed","Completed","98126",{"$f":"_xlfn.XLOOKUP(--fSeattle2020Complaints[[#This Row],[ZipCode]],dZipNeighborhood[ZipCode],dZipNeighborhood[Neighborhood])","v":"High Point"}]
["Construction","2020-02-25","Completed","Completed","98119",{"$f":"_xlfn.XLOOKUP(--fSeattle2020Complaints[[#This Row],[ZipCode]],dZipNeighborhood[ZipCode],dZipNeighborhood[Neighborhood])","v":"Queen Anne"}]
["Construction","2020-02-12","Completed","Completed","98118",{"$f":"_xlfn.XLOOKUP(--fSeattle2020Complaints[[#This Row],[ZipCode]],dZipNeighborhood[ZipCode],dZipNeighborhood[Neighborhood])","v":"Columbia City"}]
["Construction","2020-07-06","Completed","Completed","98118",{"$f":"_xlfn.XLOOKUP(--fSeattle2020Complaints[[#This Row],[ZipCode]],dZipNeighborhood[ZipCode],dZipNeighborhood[Neighborhood])","v":"Columbia City"}]
["Construction","2020-02-20","Completed","Under Investigation","98122",{"$f":"_xlfn.XLOOKUP(--fSeattle2020Complaints[[#This Row],[ZipCode]],dZipNeighborhood[ZipCode],dZipNeighborhood[Neighborhood])","v":"Minor, Central Area"}]
["Weeds","2020-04-01","Compliance Achieved","Completed","98109",{"$f":"_xlfn.XLOOKUP(--fSeattle2020Complaints[[#This Row],[ZipCode]],dZipNeighborhood[ZipCode],dZipNeighborhood[Neighborhood])","v":"South Lake Union"}]
["Vacant Building","2020-04-10","Completed","Completed","98199",{"$f":"_xlfn.XLOOKUP(--fSeattle2020Complaints[[#This Row],[ZipCode]],dZipNeighborhood[ZipCode],dZipNeighborhood[Neighborhood])","v":"Magnolia"}]
["Land Use","2020-06-25","Completed","Citation Issued","98108",{"$f":"_xlfn.XLOOKUP(--fSeattle2020Complaints[[#This Row],[ZipCode]],dZipNeighborhood[ZipCode],dZipNeighborhood[Neighborhood])","v":"Rainer Valley"}]
["Tree","2020-03-17","No Access/Unable to Observe","Completed","98119",{"$f":"_xlfn.XLOOKUP(--fSeattle2020Complaints[[#This Row],[ZipCode]],dZipNeighborhood[ZipCode],dZipNeighborhood[Neighborhood])","v":"Queen Anne"}]
["Land Use","2020-07-08","Completed","Completed","98146",{"$f":"_xlfn.XLOOKUP(--fSeattle2020Complaints[[#This Row],[ZipCode]],dZipNeighborhood[ZipCode],dZipNeighborhood[Neighborhood])","v":"Shorewood, White Center"}]
["Tree","2020-01-27","Completed","Completed","98199",{"$f":"_xlfn.XLOOKUP(--fSeattle2020Complaints[[#This Row],[ZipCode]],dZipNeighborhood[ZipCode],dZipNeighborhood[Neighborhood])","v":"Magnolia"}]
["Construction","2020-06-29","Completed","Completed","98199",{"$f":"_xlfn.XLOOKUP(--fSeattle2020Complaints[[#This Row],[ZipCode]],dZipNeighborhood[ZipCode],dZipNeighborhood[Neighborhood])","v":"Magnolia"}]
["Land Use","2020-03-13","Completed","Initiated","98116",{"$f":"_xlfn.XLOOKUP(--fSeattle2020Complaints[[#This Row],[ZipCode]],dZipNeighborhood[ZipCode],dZipNeighborhood[Neighborhood])","v":"West Seattle"}]
["Weeds","2020-09-01","Completed","Completed","98109",{"$f":"_xlfn.XLOOKUP(--fSeattle2020Complaints[[#This Row],[ZipCode]],dZipNeighborhood[ZipCode],dZipNeighborhood[Neighborhood])","v":"South Lake Union"}]
["Construction , Tree","2020-02-24","Completed","Completed","98115",{"$f":"_xlfn.XLOOKUP(--fSeattle2020Complaints[[#This Row],[ZipCode]],dZipNeighborhood[ZipCode],dZipNeighborhood[Neighborhood])","v":"Greenlake"}]
["Land Use","2020-01-27","Completed","Completed","98102",{"$f":"_xlfn.XLOOKUP(--fSeattle2020Complaints[[#This Row],[ZipCode]],dZipNeighborhood[ZipCode],dZipNeighborhood[Neighborhood])","v":"Capital Hill"}]
["Construction","2020-12-28","Completed","Closed","98116",{"$f":"_xlfn.XLOOKUP(--fSeattle2020Complaints[[#This Row],[ZipCode]],dZipNeighborhood[ZipCode],dZipNeighborhood[Neighborhood])","v":"West Seattle"}]
["Construction","2020-04-20","No Access/Unable to Observe","Completed","98102",{"$f":"_xlfn.XLOOKUP(--fSeattle2020Complaints[[#This Row],[ZipCode]],dZipNeighborhood[ZipCode],dZipNeighborhood[Neighborhood])","v":"Capital Hill"}]
["Weeds","2020-09-29","Completed","Completed","98108",{"$f":"_xlfn.XLOOKUP(--fSeattle2020Complaints[[#This Row],[ZipCode]],dZipNeighborhood[ZipCode],dZipNeighborhood[Neighborhood])","v":"Rainer Valley"}]
["Land Use","2020-08-28","Completed","Completed","98118",{"$f":"_xlfn.XLOOKUP(--fSeattle2020Complaints[[#This Row],[ZipCode]],dZipNeighborhood[ZipCode],dZipNeighborhood[Neighborhood])","v":"Columbia City"}]
["Construction","2020-07-21","Completed","Completed","98199",{"$f":"_xlfn.XLOOKUP(--fSeattle2020Complaints[[#This Row],[ZipCode]],dZipNeighborhood[ZipCode],dZipNeighborhood[Neighborhood])","v":"Magnolia"}]
["LandLord/Tenant","2020-03-02","Completed","Closed","98118",{"$f":"_xlfn.XLOOKUP(--fSeattle2020Complaints[[#This Row],[ZipCode]],dZipNeighborhood[ZipCode],dZipNeighborhood[Neighborhood])","v":"Columbia City"}]
["Construction","2020-09-17","Completed","Completed","98103",{"$f":"_xlfn.XLOOKUP(--fSeattle2020Complaints[[#This Row],[ZipCode]],dZipNeighborhood[ZipCode],dZipNeighborhood[Neighborhood])","v":"Greenwood"}]
["Construction","2020-07-16","Completed","Completed","98118",{"$f":"_xlfn.XLOOKUP(--fSeattle2020Complaints[[#This Row],[ZipCode]],dZipNeighborhood[ZipCode],dZipNeighborhood[Neighborhood])","v":"Columbia City"}]
["Vacant Building","2020-03-13","Completed","Completed","98122",{"$f":"_xlfn.XLOOKUP(--fSeattle2020Complaints[[#This Row],[ZipCode]],dZipNeighborhood[ZipCode],dZipNeighborhood[Neighborhood])","v":"Minor, Central Area"}]
["Weeds","2020-12-23","Completed","Completed","98144",{"$f":"_xlfn.XLOOKUP(--fSeattle2020Complaints[[#This Row],[ZipCode]],dZipNeighborhood[ZipCode],dZipNeighborhood[Neighborhood])","v":"Mount Baker"}]
["Construction","2020-09-02","Completed","Completed","98122",{"$f":"_xlfn.XLOOKUP(--fSeattle2020Complaints[[#This Row],[ZipCode]],dZipNeighborhood[ZipCode],dZipNeighborhood[Neighborhood])","v":"Minor, Central Area"}]
["Weeds","2020-02-21","Compliance Achieved","Completed","98103",{"$f":"_xlfn.XLOOKUP(--fSeattle2020Complaints[[#This Row],[ZipCode]],dZipNeighborhood[ZipCode],dZipNeighborhood[Neighborhood])","v":"Greenwood"}]
["Construction","2020-09-10","Completed","Completed","98103",{"$f":"_xlfn.XLOOKUP(--fSeattle2020Complaints[[#This Row],[ZipCode]],dZipNeighborhood[ZipCode],dZipNeighborhood[Neighborhood])","v":"Greenwood"}]
["Construction","2020-08-06","Completed","Completed","98119",{"$f":"_xlfn.XLOOKUP(--fSeattle2020Complaints[[#This Row],[ZipCode]],dZipNeighborhood[ZipCode],dZipNeighborhood[Neighborhood])","v":"Queen Anne"}]
["Emergency","2020-08-11","Completed","EO Vacate Close Issued","98108",{"$f":"_xlfn.XLOOKUP(--fSeattle2020Complaints[[#This Row],[ZipCode]],dZipNeighborhood[ZipCode],dZipNeighborhood[Neighborhood])","v":"Rainer Valley"}]
["Land Use","2020-05-29","Completed","Completed","98108",{"$f":"_xlfn.XLOOKUP(--fSeattle2020Complaints[[#This Row],[ZipCode]],dZipNeighborhood[ZipCode],dZipNeighborhood[Neighborhood])","v":"Rainer Valley"}]
["Vacant Building","2020-10-22","No Structure","Completed","98109",{"$f":"_xlfn.XLOOKUP(--fSeattle2020Complaints[[#This Row],[ZipCode]],dZipNeighborhood[ZipCode],dZipNeighborhood[Neighborhood])","v":"South Lake Union"}]
["Vacant Building","2020-07-12","Completed","Closed","98103",{"$f":"_xlfn.XLOOKUP(--fSeattle2020Complaints[[#This Row],[ZipCode]],dZipNeighborhood[ZipCode],dZipNeighborhood[Neighborhood])","v":"Greenwood"}]
["Vacant Building","2020-07-13","Completed","Initiated","98119",{"$f":"_xlfn.XLOOKUP(--fSeattle2020Complaints[[#This Row],[ZipCode]],dZipNeighborhood[ZipCode],dZipNeighborhood[Neighborhood])","v":"Queen Anne"}]
["Construction","2020-12-01","Completed","Closed","98136",{"$f":"_xlfn.XLOOKUP(--fSeattle2020Complaints[[#This Row],[ZipCode]],dZipNeighborhood[ZipCode],dZipNeighborhood[Neighborhood])","v":"Seaview"}]
["Land Use","2020-06-03","Completed","Completed","98144",{"$f":"_xlfn.XLOOKUP(--fSeattle2020Complaints[[#This Row],[ZipCode]],dZipNeighborhood[ZipCode],dZipNeighborhood[Neighborhood])","v":"Mount Baker"}]
["Weeds","2020-03-18","Compliance Achieved","Completed","98116",{"$f":"_xlfn.XLOOKUP(--fSeattle2020Complaints[[#This Row],[ZipCode]],dZipNeighborhood[ZipCode],dZipNeighborhood[Neighborhood])","v":"West Seattle"}]
["Construction","2020-10-07","Completed","Completed","98122",{"$f":"_xlfn.XLOOKUP(--fSeattle2020Complaints[[#This Row],[ZipCode]],dZipNeighborhood[ZipCode],dZipNeighborhood[Neighborhood])","v":"Minor, Central Area"}]
["Construction","2020-05-05","Completed","Completed","98126",{"$f":"_xlfn.XLOOKUP(--fSeattle2020Complaints[[#This Row],[ZipCode]],dZipNeighborhood[ZipCode],dZipNeighborhood[Neighborhood])","v":"High Point"}]
["Construction","2020-08-21","Completed","Completed","98133",{"$f":"_xlfn.XLOOKUP(--fSeattle2020Complaints[[#This Row],[ZipCode]],dZipNeighborhood[ZipCode],dZipNeighborhood[Neighborhood])","v":"Shoreline"}]
["Land Use","2020-04-28","Completed","Completed","98112",{"$f":"_xlfn.XLOOKUP(--fSeattle2020Complaints[[#This Row],[ZipCode]],dZipNeighborhood[ZipCode],dZipNeighborhood[Neighborhood])","v":"Madison Park"}]
["Vacant Building","2020-03-09","Completed","Completed","98115",{"$f":"_xlfn.XLOOKUP(--fSeattle2020Complaints[[#This Row],[ZipCode]],dZipNeighborhood[ZipCode],dZipNeighborhood[Neighborhood])","v":"Greenlake"}]
["Weeds","2020-04-09","Completed","Completed","98112",{"$f":"_xlfn.XLOOKUP(--fSeattle2020Complaints[[#This Row],[ZipCode]],dZipNeighborhood[ZipCode],dZipNeighborhood[Neighborhood])","v":"Madison Park"}]
["Construction","2020-03-12","Completed","Closed","98122",{"$f":"_xlfn.XLOOKUP(--fSeattle2020Complaints[[#This Row],[ZipCode]],dZipNeighborhood[ZipCode],dZipNeighborhood[Neighborhood])","v":"Minor, Central Area"}]
["Tree","2020-09-16","Completed","Completed","98115",{"$f":"_xlfn.XLOOKUP(--fSeattle2020Complaints[[#This Row],[ZipCode]],dZipNeighborhood[ZipCode],dZipNeighborhood[Neighborhood])","v":"Greenlake"}]
["Land Use","2020-12-31","Completed","Completed","98144",{"$f":"_xlfn.XLOOKUP(--fSeattle2020Complaints[[#This Row],[ZipCode]],dZipNeighborhood[ZipCode],dZipNeighborhood[Neighborhood])","v":"Mount Baker"}]
["Construction","2020-07-06","Completed","Completed","98122",{"$f":"_xlfn.XLOOKUP(--fSeattle2020Complaints[[#This Row],[ZipCode]],dZipNeighborhood[ZipCode],dZipNeighborhood[Neighborhood])","v":"Minor, Central Area"}]
["Land Use","2020-03-19","Completed","Completed","98106",{"$f":"_xlfn.XLOOKUP(--fSeattle2020Complaints[[#This Row],[ZipCode]],dZipNeighborhood[ZipCode],dZipNeighborhood[Neighborhood])","v":"Delridge"}]
["Land Use","2020-06-23","Completed","Completed","98121",{"$f":"_xlfn.XLOOKUP(--fSeattle2020Complaints[[#This Row],[ZipCode]],dZipNeighborhood[ZipCode],dZipNeighborhood[Neighborhood])","v":"Belltown"}]
["Land UseWeeds ,","2020-06-03","Completed","Completed","98146",{"$f":"_xlfn.XLOOKUP(--fSeattle2020Complaints[[#This Row],[ZipCode]],dZipNeighborhood[ZipCode],dZipNeighborhood[Neighborhood])","v":"Shorewood, White Center"}]
["Land Use","2020-06-20","Completed","Completed","98102",{"$f":"_xlfn.XLOOKUP(--fSeattle2020Complaints[[#This Row],[ZipCode]],dZipNeighborhood[ZipCode],dZipNeighborhood[Neighborhood])","v":"Capital Hill"}]
["Weeds","2020-06-02","Completed","Closed","98177",{"$f":"_xlfn.XLOOKUP(--fSeattle2020Complaints[[#This Row],[ZipCode]],dZipNeighborhood[ZipCode],dZipNeighborhood[Neighborhood])","v":"Richmond Beach"}]
["Land UseConstruction ,","2020-09-17","No Access/Unable to Observe","Under Investigation","98115",{"$f":"_xlfn.XLOOKUP(--fSeattle2020Complaints[[#This Row],[ZipCode]],dZipNeighborhood[ZipCode],dZipNeighborhood[Neighborhood])","v":"Greenlake"}]
["Vacant Building","2020-02-07","Completed","Closed","98117",{"$f":"_xlfn.XLOOKUP(--fSeattle2020Complaints[[#This Row],[ZipCode]],dZipNeighborhood[ZipCode],dZipNeighborhood[Neighborhood])","v":"Sunset Hill"}]
["Vacant Building","2020-05-01","Completed","Completed","98105",{"$f":"_xlfn.XLOOKUP(--fSeattle2020Complaints[[#This Row],[ZipCode]],dZipNeighborhood[ZipCode],dZipNeighborhood[Neighborhood])","v":"University District"}]
["Weeds","2020-01-16","Completed","Completed","98133",{"$f":"_xlfn.XLOOKUP(--fSeattle2020Complaints[[#This Row],[ZipCode]],dZipNeighborhood[ZipCode],dZipNeighborhood[Neighborhood])","v":"Shoreline"}]
["Land Use","2020-10-28","Completed","Completed","98106",{"$f":"_xlfn.XLOOKUP(--fSeattle2020Complaints[[#This Row],[ZipCode]],dZipNeighborhood[ZipCode],dZipNeighborhood[Neighborhood])","v":"Delridge"}]
["Tree","2020-09-08","Completed","Completed","98117",{"$f":"_xlfn.XLOOKUP(--fSeattle2020Complaints[[#This Row],[ZipCode]],dZipNeighborhood[ZipCode],dZipNeighborhood[Neighborhood])","v":"Sunset Hill"}]
["Weeds","2020-10-12","Withdrawn","Closed","98106",{"$f":"_xlfn.XLOOKUP(--fSeattle2020Complaints[[#This Row],[ZipCode]],dZipNeighborhood[ZipCode],dZipNeighborhood[Neighborhood])","v":"Delridge"}]
["Weeds","2020-12-05","Completed","Completed","98115",{"$f":"_xlfn.XLOOKUP(--fSeattle2020Complaints[[#This Row],[ZipCode]],dZipNeighborhood[ZipCode],dZipNeighborhood[Neighborhood])","v":"Greenlake"}]
["Weeds","2020-08-18","Completed","Completed","98144",{"$f":"_xlfn.XLOOKUP(--fSeattle2020Complaints[[#This Row],[ZipCode]],dZipNeighborhood[ZipCode],dZipNeighborhood[Neighborhood])","v":"Mount Baker"}]
["Vacant Building","2020-02-12","Completed","Completed","98103",{"$f":"_xlfn.XLOOKUP(--fSeattle2020Complaints[[#This Row],[ZipCode]],dZipNeighborhood[ZipCode],dZipNeighborhood[Neighborhood])","v":"Greenwood"}]
["Land Use","2020-09-10","Completed","Completed","98125",{"$f":"_xlfn.XLOOKUP(--fSeattle2020Complaints[[#This Row],[ZipCode]],dZipNeighborhood[ZipCode],dZipNeighborhood[Neighborhood])","v":"Northgate"}]
["Land Use","2020-01-03","Completed","Completed","98122",{"$f":"_xlfn.XLOOKUP(--fSeattle2020Complaints[[#This Row],[ZipCode]],dZipNeighborhood[ZipCode],dZipNeighborhood[Neighborhood])","v":"Minor, Central Area"}]
["Construction","2020-02-12","Completed","NOV Issued","98122",{"$f":"_xlfn.XLOOKUP(--fSeattle2020Complaints[[#This Row],[ZipCode]],dZipNeighborhood[ZipCode],dZipNeighborhood[Neighborhood])","v":"Minor, Central Area"}]
["Construction","2020-08-23","Completed","Closed","98119",{"$f":"_xlfn.XLOOKUP(--fSeattle2020Complaints[[#This Row],[ZipCode]],dZipNeighborhood[ZipCode],dZipNeighborhood[Neighborhood])","v":"Queen Anne"}]
["Vacant Building","2020-09-21","Admin Closure","Completed","98121",{"$f":"_xlfn.XLOOKUP(--fSeattle2020Complaints[[#This Row],[ZipCode]],dZipNeighborhood[ZipCode],dZipNeighborhood[Neighborhood])","v":"Belltown"}]
["Weeds","2020-01-24","Completed","Completed","98118",{"$f":"_xlfn.XLOOKUP(--fSeattle2020Complaints[[#This Row],[ZipCode]],dZipNeighborhood[ZipCode],dZipNeighborhood[Neighborhood])","v":"Columbia City"}]
["Land Use","2020-01-29","Compliance Achieved","Completed","98122",{"$f":"_xlfn.XLOOKUP(--fSeattle2020Complaints[[#This Row],[ZipCode]],dZipNeighborhood[ZipCode],dZipNeighborhood[Neighborhood])","v":"Minor, Central Area"}]
["Land Use","2020-05-14","Completed","Completed","98136",{"$f":"_xlfn.XLOOKUP(--fSeattle2020Complaints[[#This Row],[ZipCode]],dZipNeighborhood[ZipCode],dZipNeighborhood[Neighborhood])","v":"Seaview"}]
["Weeds","2020-07-07","Completed","Completed","98122",{"$f":"_xlfn.XLOOKUP(--fSeattle2020Complaints[[#This Row],[ZipCode]],dZipNeighborhood[ZipCode],dZipNeighborhood[Neighborhood])","v":"Minor, Central Area"}]
["Vacant Building","2020-08-29","Completed","Completed","98125",{"$f":"_xlfn.XLOOKUP(--fSeattle2020Complaints[[#This Row],[ZipCode]],dZipNeighborhood[ZipCode],dZipNeighborhood[Neighborhood])","v":"Northgate"}]
["Land Use","2020-07-22","Completed","Completed","98146",{"$f":"_xlfn.XLOOKUP(--fSeattle2020Complaints[[#This Row],[ZipCode]],dZipNeighborhood[ZipCode],dZipNeighborhood[Neighborhood])","v":"Shorewood, White Center"}]
["Land Use","2020-07-17","Compliance Achieved","Closed","98144",{"$f":"_xlfn.XLOOKUP(--fSeattle2020Complaints[[#This Row],[ZipCode]],dZipNeighborhood[ZipCode],dZipNeighborhood[Neighborhood])","v":"Mount Baker"}]
["Land Use","2020-02-20","Compliance Achieved","Completed","98118",{"$f":"_xlfn.XLOOKUP(--fSeattle2020Complaints[[#This Row],[ZipCode]],dZipNeighborhood[ZipCode],dZipNeighborhood[Neighborhood])","v":"Columbia City"}]
["Construction","2020-09-11","Completed","Completed","98119",{"$f":"_xlfn.XLOOKUP(--fSeattle2020Complaints[[#This Row],[ZipCode]],dZipNeighborhood[ZipCode],dZipNeighborhood[Neighborhood])","v":"Queen Anne"}]
["Weeds","2020-04-22","Completed","Completed","98122",{"$f":"_xlfn.XLOOKUP(--fSeattle2020Complaints[[#This Row],[ZipCode]],dZipNeighborhood[ZipCode],dZipNeighborhood[Neighborhood])","v":"Minor, Central Area"}]
["Land Use","2020-04-29","Compliance Achieved","Completed","98105",{"$f":"_xlfn.XLOOKUP(--fSeattle2020Complaints[[#This Row],[ZipCode]],dZipNeighborhood[ZipCode],dZipNeighborhood[Neighborhood])","v":"University District"}]
["Land Use","2020-02-25","Completed","Completed","98103",{"$f":"_xlfn.XLOOKUP(--fSeattle2020Complaints[[#This Row],[ZipCode]],dZipNeighborhood[ZipCode],dZipNeighborhood[Neighborhood])","v":"Greenwood"}]
["Vacant Building","2020-07-15","Completed","Closed","98117",{"$f":"_xlfn.XLOOKUP(--fSeattle2020Complaints[[#This Row],[ZipCode]],dZipNeighborhood[ZipCode],dZipNeighborhood[Neighborhood])","v":"Sunset Hill"}]
["Weeds","2020-02-10","Compliance Achieved","Completed","98144",{"$f":"_xlfn.XLOOKUP(--fSeattle2020Complaints[[#This Row],[ZipCode]],dZipNeighborhood[ZipCode],dZipNeighborhood[Neighborhood])","v":"Mount Baker"}]
["Construction","2020-05-19","Completed","Completed","98109",{"$f":"_xlfn.XLOOKUP(--fSeattle2020Complaints[[#This Row],[ZipCode]],dZipNeighborhood[ZipCode],dZipNeighborhood[Neighborhood])","v":"South Lake Union"}]
["Weeds","2020-06-04","Completed","Completed","98115",{"$f":"_xlfn.XLOOKUP(--fSeattle2020Complaints[[#This Row],[ZipCode]],dZipNeighborhood[ZipCode],dZipNeighborhood[Neighborhood])","v":"Greenlake"}]
["Construction","2020-06-03","Completed","Completed","98117",{"$f":"_xlfn.XLOOKUP(--fSeattle2020Complaints[[#This Row],[ZipCode]],dZipNeighborhood[ZipCode],dZipNeighborhood[Neighborhood])","v":"Sunset Hill"}]
["Vacant Building","2020-07-14","Completed","Completed","98118",{"$f":"_xlfn.XLOOKUP(--fSeattle2020Complaints[[#This Row],[ZipCode]],dZipNeighborhood[ZipCode],dZipNeighborhood[Neighborhood])","v":"Columbia City"}]
["Emergency , Vacant Building","2020-06-08","Compliance Achieved","Completed","98118",{"$f":"_xlfn.XLOOKUP(--fSeattle2020Complaints[[#This Row],[ZipCode]],dZipNeighborhood[ZipCode],dZipNeighborhood[Neighborhood])","v":"Columbia City"}]
["Land Use","2020-12-31","No Access/Unable to Observe","Closed","98125",{"$f":"_xlfn.XLOOKUP(--fSeattle2020Complaints[[#This Row],[ZipCode]],dZipNeighborhood[ZipCode],dZipNeighborhood[Neighborhood])","v":"Northgate"}]
["Vacant Building","2020-09-29","Completed","Completed","98105",{"$f":"_xlfn.XLOOKUP(--fSeattle2020Complaints[[#This Row],[ZipCode]],dZipNeighborhood[ZipCode],dZipNeighborhood[Neighborhood])","v":"University District"}]
["Land Use","2020-06-03","Completed","Completed","98136",{"$f":"_xlfn.XLOOKUP(--fSeattle2020Complaints[[#This Row],[ZipCode]],dZipNeighborhood[ZipCode],dZipNeighborhood[Neighborhood])","v":"Seaview"}]
["Vacant Building","2020-08-17","Completed","Closed","98107",{"$f":"_xlfn.XLOOKUP(--fSeattle2020Complaints[[#This Row],[ZipCode]],dZipNeighborhood[ZipCode],dZipNeighborhood[Neighborhood])","v":"Ballard"}]
["Land Use","2020-06-10","Completed","Completed","98108",{"$f":"_xlfn.XLOOKUP(--fSeattle2020Complaints[[#This Row],[ZipCode]],dZipNeighborhood[ZipCode],dZipNeighborhood[Neighborhood])","v":"Rainer Valley"}]
["Construction","2020-03-13","Completed","Completed","98122",{"$f":"_xlfn.XLOOKUP(--fSeattle2020Complaints[[#This Row],[ZipCode]],dZipNeighborhood[ZipCode],dZipNeighborhood[Neighborhood])","v":"Minor, Central Area"}]
["Land Use","2020-09-15","Completed","Completed","98125",{"$f":"_xlfn.XLOOKUP(--fSeattle2020Complaints[[#This Row],[ZipCode]],dZipNeighborhood[ZipCode],dZipNeighborhood[Neighborhood])","v":"Northgate"}]
["Land Use","2020-09-14","Completed","Completed","98104",{"$f":"_xlfn.XLOOKUP(--fSeattle2020Complaints[[#This Row],[ZipCode]],dZipNeighborhood[ZipCode],dZipNeighborhood[Neighborhood])","v":"International District"}]
["Land Use","2020-03-20","Completed","Initiated","98117",{"$f":"_xlfn.XLOOKUP(--fSeattle2020Complaints[[#This Row],[ZipCode]],dZipNeighborhood[ZipCode],dZipNeighborhood[Neighborhood])","v":"Sunset Hill"}]
["Land Use","2020-06-24","Completed","Completed","98118",{"$f":"_xlfn.XLOOKUP(--fSeattle2020Complaints[[#This Row],[ZipCode]],dZipNeighborhood[ZipCode],dZipNeighborhood[Neighborhood])","v":"Columbia City"}]
["Weeds","2020-08-14","Completed","Completed","98103",{"$f":"_xlfn.XLOOKUP(--fSeattle2020Complaints[[#This Row],[ZipCode]],dZipNeighborhood[ZipCode],dZipNeighborhood[Neighborhood])","v":"Greenwood"}]
["Land Use","2020-08-25","Completed","Completed","98133",{"$f":"_xlfn.XLOOKUP(--fSeattle2020Complaints[[#This Row],[ZipCode]],dZipNeighborhood[ZipCode],dZipNeighborhood[Neighborhood])","v":"Shoreline"}]
["Weeds","2020-05-15","Completed","Completed","98106",{"$f":"_xlfn.XLOOKUP(--fSeattle2020Complaints[[#This Row],[ZipCode]],dZipNeighborhood[ZipCode],dZipNeighborhood[Neighborhood])","v":"Delridge"}]
["Weeds","2020-05-31","Completed","Completed","98126",{"$f":"_xlfn.XLOOKUP(--fSeattle2020Complaints[[#This Row],[ZipCode]],dZipNeighborhood[ZipCode],dZipNeighborhood[Neighborhood])","v":"High Point"}]
["Land Use","2020-01-10","Completed","Completed","98119",{"$f":"_xlfn.XLOOKUP(--fSeattle2020Complaints[[#This Row],[ZipCode]],dZipNeighborhood[ZipCode],dZipNeighborhood[Neighborhood])","v":"Queen Anne"}]
["Tree","2020-09-17","Completed","Completed","98133",{"$f":"_xlfn.XLOOKUP(--fSeattle2020Complaints[[#This Row],[ZipCode]],dZipNeighborhood[ZipCode],dZipNeighborhood[Neighborhood])","v":"Shoreline"}]
["Vacant Building","2020-02-09","Completed","Closed","98103",{"$f":"_xlfn.XLOOKUP(--fSeattle2020Complaints[[#This Row],[ZipCode]],dZipNeighborhood[ZipCode],dZipNeighborhood[Neighborhood])","v":"Greenwood"}]
["Vacant Building","2020-06-29","Completed","Completed","98103",{"$f":"_xlfn.XLOOKUP(--fSeattle2020Complaints[[#This Row],[ZipCode]],dZipNeighborhood[ZipCode],dZipNeighborhood[Neighborhood])","v":"Greenwood"}]
["Weeds","2020-06-26","Completed","Completed","98112",{"$f":"_xlfn.XLOOKUP(--fSeattle2020Complaints[[#This Row],[ZipCode]],dZipNeighborhood[ZipCode],dZipNeighborhood[Neighborhood])","v":"Madison Park"}]
["Weeds","2020-08-16","Completed","Completed","98116",{"$f":"_xlfn.XLOOKUP(--fSeattle2020Complaints[[#This Row],[ZipCode]],dZipNeighborhood[ZipCode],dZipNeighborhood[Neighborhood])","v":"West Seattle"}]
["Land Use","2020-08-20","Completed","Closed","98199",{"$f":"_xlfn.XLOOKUP(--fSeattle2020Complaints[[#This Row],[ZipCode]],dZipNeighborhood[ZipCode],dZipNeighborhood[Neighborhood])","v":"Magnolia"}]
["Land Use","2020-08-24","No Access/Unable to Observe","Closed","98144",{"$f":"_xlfn.XLOOKUP(--fSeattle2020Complaints[[#This Row],[ZipCode]],dZipNeighborhood[ZipCode],dZipNeighborhood[Neighborhood])","v":"Mount Baker"}]
["Land Use","2020-11-20","Completed","Completed","98105",{"$f":"_xlfn.XLOOKUP(--fSeattle2020Complaints[[#This Row],[ZipCode]],dZipNeighborhood[ZipCode],dZipNeighborhood[Neighborhood])","v":"University District"}]
["Weeds","2020-03-19","Compliance Achieved","Completed","98105",{"$f":"_xlfn.XLOOKUP(--fSeattle2020Complaints[[#This Row],[ZipCode]],dZipNeighborhood[ZipCode],dZipNeighborhood[Neighborhood])","v":"University District"}]
["Land Use","2020-07-29","Completed","Completed","98126",{"$f":"_xlfn.XLOOKUP(--fSeattle2020Complaints[[#This Row],[ZipCode]],dZipNeighborhood[ZipCode],dZipNeighborhood[Neighborhood])","v":"High Point"}]
["Land Use","2020-07-07","Completed","Completed","98115",{"$f":"_xlfn.XLOOKUP(--fSeattle2020Complaints[[#This Row],[ZipCode]],dZipNeighborhood[ZipCode],dZipNeighborhood[Neighborhood])","v":"Greenlake"}]
["Land Use","2020-08-12","No Access/Unable to Observe","Completed","98108",{"$f":"_xlfn.XLOOKUP(--fSeattle2020Complaints[[#This Row],[ZipCode]],dZipNeighborhood[ZipCode],dZipNeighborhood[Neighborhood])","v":"Rainer Valley"}]
["Noise","2020-11-16","No Violation","Completed","98102",{"$f":"_xlfn.XLOOKUP(--fSeattle2020Complaints[[#This Row],[ZipCode]],dZipNeighborhood[ZipCode],dZipNeighborhood[Neighborhood])","v":"Capital Hill"}]
["Land Use","2020-01-07","Completed","Completed","98119",{"$f":"_xlfn.XLOOKUP(--fSeattle2020Complaints[[#This Row],[ZipCode]],dZipNeighborhood[ZipCode],dZipNeighborhood[Neighborhood])","v":"Queen Anne"}]
["Weeds","2020-09-06","Completed","Completed","98109",{"$f":"_xlfn.XLOOKUP(--fSeattle2020Complaints[[#This Row],[ZipCode]],dZipNeighborhood[ZipCode],dZipNeighborhood[Neighborhood])","v":"South Lake Union"}]
["Vacant Building","2020-04-06","Completed","Closed","98103",{"$f":"_xlfn.XLOOKUP(--fSeattle2020Complaints[[#This Row],[ZipCode]],dZipNeighborhood[ZipCode],dZipNeighborhood[Neighborhood])","v":"Greenwood"}]
["Vacant Building","2020-08-17","Completed","Completed","98107",{"$f":"_xlfn.XLOOKUP(--fSeattle2020Complaints[[#This Row],[ZipCode]],dZipNeighborhood[ZipCode],dZipNeighborhood[Neighborhood])","v":"Ballard"}]
["Weeds","2020-06-11","Completed","Completed","98115",{"$f":"_xlfn.XLOOKUP(--fSeattle2020Complaints[[#This Row],[ZipCode]],dZipNeighborhood[ZipCode],dZipNeighborhood[Neighborhood])","v":"Greenlake"}]
["Emergency , Vacant Building","2020-02-25","Completed","Closed","98199",{"$f":"_xlfn.XLOOKUP(--fSeattle2020Complaints[[#This Row],[ZipCode]],dZipNeighborhood[ZipCode],dZipNeighborhood[Neighborhood])","v":"Magnolia"}]
["Weeds","2020-09-15","Completed","Completed","98125",{"$f":"_xlfn.XLOOKUP(--fSeattle2020Complaints[[#This Row],[ZipCode]],dZipNeighborhood[ZipCode],dZipNeighborhood[Neighborhood])","v":"Northgate"}]
["Land Use","2020-11-13","Completed","Completed","98118",{"$f":"_xlfn.XLOOKUP(--fSeattle2020Complaints[[#This Row],[ZipCode]],dZipNeighborhood[ZipCode],dZipNeighborhood[Neighborhood])","v":"Columbia City"}]
["Land Use","2020-01-26","Completed","Completed","98178",{"$f":"_xlfn.XLOOKUP(--fSeattle2020Complaints[[#This Row],[ZipCode]],dZipNeighborhood[ZipCode],dZipNeighborhood[Neighborhood])","v":"Skyway"}]
["Land Use","2020-04-24","Completed","Completed","98103",{"$f":"_xlfn.XLOOKUP(--fSeattle2020Complaints[[#This Row],[ZipCode]],dZipNeighborhood[ZipCode],dZipNeighborhood[Neighborhood])","v":"Greenwood"}]
["Land Use","2020-08-04","Completed","Completed","98125",{"$f":"_xlfn.XLOOKUP(--fSeattle2020Complaints[[#This Row],[ZipCode]],dZipNeighborhood[ZipCode],dZipNeighborhood[Neighborhood])","v":"Northgate"}]
["Land Use","2020-01-03","Completed","Completed","98122",{"$f":"_xlfn.XLOOKUP(--fSeattle2020Complaints[[#This Row],[ZipCode]],dZipNeighborhood[ZipCode],dZipNeighborhood[Neighborhood])","v":"Minor, Central Area"}]
["Land Use","2020-02-27","Compliance Achieved","Completed","98118",{"$f":"_xlfn.XLOOKUP(--fSeattle2020Complaints[[#This Row],[ZipCode]],dZipNeighborhood[ZipCode],dZipNeighborhood[Neighborhood])","v":"Columbia City"}]
["Weeds","2020-04-24","Completed","Completed","98122",{"$f":"_xlfn.XLOOKUP(--fSeattle2020Complaints[[#This Row],[ZipCode]],dZipNeighborhood[ZipCode],dZipNeighborhood[Neighborhood])","v":"Minor, Central Area"}]
["Vacant Building","2020-05-04","Completed","Completed","98102",{"$f":"_xlfn.XLOOKUP(--fSeattle2020Complaints[[#This Row],[ZipCode]],dZipNeighborhood[ZipCode],dZipNeighborhood[Neighborhood])","v":"Capital Hill"}]
["Weeds","2020-02-12","Completed","Warning","98126",{"$f":"_xlfn.XLOOKUP(--fSeattle2020Complaints[[#This Row],[ZipCode]],dZipNeighborhood[ZipCode],dZipNeighborhood[Neighborhood])","v":"High Point"}]
["Construction","2020-08-03","No Access/Unable to Observe","Closed","98115",{"$f":"_xlfn.XLOOKUP(--fSeattle2020Complaints[[#This Row],[ZipCode]],dZipNeighborhood[ZipCode],dZipNeighborhood[Neighborhood])","v":"Greenlake"}]
["Construction","2020-09-15","Completed","Under Investigation","98144",{"$f":"_xlfn.XLOOKUP(--fSeattle2020Complaints[[#This Row],[ZipCode]],dZipNeighborhood[ZipCode],dZipNeighborhood[Neighborhood])","v":"Mount Baker"}]
["Land Use","2020-09-18","Completed","Closed","98108",{"$f":"_xlfn.XLOOKUP(--fSeattle2020Complaints[[#This Row],[ZipCode]],dZipNeighborhood[ZipCode],dZipNeighborhood[Neighborhood])","v":"Rainer Valley"}]
["Construction","2020-01-31","Completed","Completed","98115",{"$f":"_xlfn.XLOOKUP(--fSeattle2020Complaints[[#This Row],[ZipCode]],dZipNeighborhood[ZipCode],dZipNeighborhood[Neighborhood])","v":"Greenlake"}]
["Land Use","2020-07-07","Completed","Completed","98115",{"$f":"_xlfn.XLOOKUP(--fSeattle2020Complaints[[#This Row],[ZipCode]],dZipNeighborhood[ZipCode],dZipNeighborhood[Neighborhood])","v":"Greenlake"}]
["Vacant Building","2020-10-05","Completed","Completed","98125",{"$f":"_xlfn.XLOOKUP(--fSeattle2020Complaints[[#This Row],[ZipCode]],dZipNeighborhood[ZipCode],dZipNeighborhood[Neighborhood])","v":"Northgate"}]
["Tree","2020-09-23","Completed","Completed","98118",{"$f":"_xlfn.XLOOKUP(--fSeattle2020Complaints[[#This Row],[ZipCode]],dZipNeighborhood[ZipCode],dZipNeighborhood[Neighborhood])","v":"Columbia City"}]
["Construction","2020-01-23","Completed","Closed","98107",{"$f":"_xlfn.XLOOKUP(--fSeattle2020Complaints[[#This Row],[ZipCode]],dZipNeighborhood[ZipCode],dZipNeighborhood[Neighborhood])","v":"Ballard"}]
["Emergency , Vacant Building","2020-08-07","Completed","Completed","98105",{"$f":"_xlfn.XLOOKUP(--fSeattle2020Complaints[[#This Row],[ZipCode]],dZipNeighborhood[ZipCode],dZipNeighborhood[Neighborhood])","v":"University District"}]
["Land UseConstruction , ECA ,","2020-08-10","Completed","Completed","98117",{"$f":"_xlfn.XLOOKUP(--fSeattle2020Complaints[[#This Row],[ZipCode]],dZipNeighborhood[ZipCode],dZipNeighborhood[Neighborhood])","v":"Sunset Hill"}]
["Land Use","2020-02-04","Completed","Completed","98101",{"$f":"_xlfn.XLOOKUP(--fSeattle2020Complaints[[#This Row],[ZipCode]],dZipNeighborhood[ZipCode],dZipNeighborhood[Neighborhood])","v":"Seattle"}]
["Construction , Vacant Building","2020-01-07","Completed","Closed","98105",{"$f":"_xlfn.XLOOKUP(--fSeattle2020Complaints[[#This Row],[ZipCode]],dZipNeighborhood[ZipCode],dZipNeighborhood[Neighborhood])","v":"University District"}]
["Land Use","2020-07-06","Completed","Closed","98117",{"$f":"_xlfn.XLOOKUP(--fSeattle2020Complaints[[#This Row],[ZipCode]],dZipNeighborhood[ZipCode],dZipNeighborhood[Neighborhood])","v":"Sunset Hill"}]
["Land Use","2020-05-20","Completed","Completed","98107",{"$f":"_xlfn.XLOOKUP(--fSeattle2020Complaints[[#This Row],[ZipCode]],dZipNeighborhood[ZipCode],dZipNeighborhood[Neighborhood])","v":"Ballard"}]
["Land Use","2020-02-27","Completed","Completed","98119",{"$f":"_xlfn.XLOOKUP(--fSeattle2020Complaints[[#This Row],[ZipCode]],dZipNeighborhood[ZipCode],dZipNeighborhood[Neighborhood])","v":"Queen Anne"}]
["Land Use","2020-12-07","Completed","Completed","98122",{"$f":"_xlfn.XLOOKUP(--fSeattle2020Complaints[[#This Row],[ZipCode]],dZipNeighborhood[ZipCode],dZipNeighborhood[Neighborhood])","v":"Minor, Central Area"}]
["Construction","2020-02-18","Completed","Completed","98112",{"$f":"_xlfn.XLOOKUP(--fSeattle2020Complaints[[#This Row],[ZipCode]],dZipNeighborhood[ZipCode],dZipNeighborhood[Neighborhood])","v":"Madison Park"}]
["Weeds","2020-04-08","Completed","Completed","98117",{"$f":"_xlfn.XLOOKUP(--fSeattle2020Complaints[[#This Row],[ZipCode]],dZipNeighborhood[ZipCode],dZipNeighborhood[Neighborhood])","v":"Sunset Hill"}]
["Land Use","2020-03-03","Completed","Completed","98108",{"$f":"_xlfn.XLOOKUP(--fSeattle2020Complaints[[#This Row],[ZipCode]],dZipNeighborhood[ZipCode],dZipNeighborhood[Neighborhood])","v":"Rainer Valley"}]
["Land Use","2020-07-06","Compliance Achieved","Completed","98122",{"$f":"_xlfn.XLOOKUP(--fSeattle2020Complaints[[#This Row],[ZipCode]],dZipNeighborhood[ZipCode],dZipNeighborhood[Neighborhood])","v":"Minor, Central Area"}]
["Construction","2020-01-06","Completed","Completed","98119",{"$f":"_xlfn.XLOOKUP(--fSeattle2020Complaints[[#This Row],[ZipCode]],dZipNeighborhood[ZipCode],dZipNeighborhood[Neighborhood])","v":"Queen Anne"}]
["Noise","2020-02-04","Completed","Completed","98107",{"$f":"_xlfn.XLOOKUP(--fSeattle2020Complaints[[#This Row],[ZipCode]],dZipNeighborhood[ZipCode],dZipNeighborhood[Neighborhood])","v":"Ballard"}]
["Land Use","2020-02-25","Completed","Completed","98144",{"$f":"_xlfn.XLOOKUP(--fSeattle2020Complaints[[#This Row],[ZipCode]],dZipNeighborhood[ZipCode],dZipNeighborhood[Neighborhood])","v":"Mount Baker"}]
["Construction","2020-09-23","Completed","Completed","98118",{"$f":"_xlfn.XLOOKUP(--fSeattle2020Complaints[[#This Row],[ZipCode]],dZipNeighborhood[ZipCode],dZipNeighborhood[Neighborhood])","v":"Columbia City"}]
["Weeds","2020-07-11","Completed","Completed","98103",{"$f":"_xlfn.XLOOKUP(--fSeattle2020Complaints[[#This Row],[ZipCode]],dZipNeighborhood[ZipCode],dZipNeighborhood[Neighborhood])","v":"Greenwood"}]
["Construction","2020-07-22","Completed","NOV Issued","98199",{"$f":"_xlfn.XLOOKUP(--fSeattle2020Complaints[[#This Row],[ZipCode]],dZipNeighborhood[ZipCode],dZipNeighborhood[Neighborhood])","v":"Magnolia"}]
["Emergency , Vacant Building","2020-05-12","Compliance Achieved","Completed","98122",{"$f":"_xlfn.XLOOKUP(--fSeattle2020Complaints[[#This Row],[ZipCode]],dZipNeighborhood[ZipCode],dZipNeighborhood[Neighborhood])","v":"Minor, Central Area"}]
["Land UseTree ,","2020-08-06","Completed","Completed","98117",{"$f":"_xlfn.XLOOKUP(--fSeattle2020Complaints[[#This Row],[ZipCode]],dZipNeighborhood[ZipCode],dZipNeighborhood[Neighborhood])","v":"Sunset Hill"}]
["Weeds","2020-06-17","Completed","Completed","98107",{"$f":"_xlfn.XLOOKUP(--fSeattle2020Complaints[[#This Row],[ZipCode]],dZipNeighborhood[ZipCode],dZipNeighborhood[Neighborhood])","v":"Ballard"}]
["Weeds","2020-06-11","Completed","Completed","98136",{"$f":"_xlfn.XLOOKUP(--fSeattle2020Complaints[[#This Row],[ZipCode]],dZipNeighborhood[ZipCode],dZipNeighborhood[Neighborhood])","v":"Seaview"}]
["Land Use","2020-01-13","Completed","Completed","98144",{"$f":"_xlfn.XLOOKUP(--fSeattle2020Complaints[[#This Row],[ZipCode]],dZipNeighborhood[ZipCode],dZipNeighborhood[Neighborhood])","v":"Mount Baker"}]
["Land Use","2020-07-06","Completed","Completed","98122",{"$f":"_xlfn.XLOOKUP(--fSeattle2020Complaints[[#This Row],[ZipCode]],dZipNeighborhood[ZipCode],dZipNeighborhood[Neighborhood])","v":"Minor, Central Area"}]
["Land Use","2020-01-05","No Violation","Completed","98122",{"$f":"_xlfn.XLOOKUP(--fSeattle2020Complaints[[#This Row],[ZipCode]],dZipNeighborhood[ZipCode],dZipNeighborhood[Neighborhood])","v":"Minor, Central Area"}]
["Vacant Building","2020-02-24","Admin Closure","Completed","98101",{"$f":"_xlfn.XLOOKUP(--fSeattle2020Complaints[[#This Row],[ZipCode]],dZipNeighborhood[ZipCode],dZipNeighborhood[Neighborhood])","v":"Seattle"}]
["Land Use","2020-02-18","Completed","Completed","98118",{"$f":"_xlfn.XLOOKUP(--fSeattle2020Complaints[[#This Row],[ZipCode]],dZipNeighborhood[ZipCode],dZipNeighborhood[Neighborhood])","v":"Columbia City"}]
["Land Use","2020-08-04","Completed","Completed","98109",{"$f":"_xlfn.XLOOKUP(--fSeattle2020Complaints[[#This Row],[ZipCode]],dZipNeighborhood[ZipCode],dZipNeighborhood[Neighborhood])","v":"South Lake Union"}]
["Land Use","2020-08-24","Completed","Closed","98104",{"$f":"_xlfn.XLOOKUP(--fSeattle2020Complaints[[#This Row],[ZipCode]],dZipNeighborhood[ZipCode],dZipNeighborhood[Neighborhood])","v":"International District"}]
["Construction","2020-01-08","Completed","Completed","98199",{"$f":"_xlfn.XLOOKUP(--fSeattle2020Complaints[[#This Row],[ZipCode]],dZipNeighborhood[ZipCode],dZipNeighborhood[Neighborhood])","v":"Magnolia"}]
["Construction","2020-12-20","Completed","Completed","98122",{"$f":"_xlfn.XLOOKUP(--fSeattle2020Complaints[[#This Row],[ZipCode]],dZipNeighborhood[ZipCode],dZipNeighborhood[Neighborhood])","v":"Minor, Central Area"}]
["Land Use","2020-01-08","Completed","Completed","98144",{"$f":"_xlfn.XLOOKUP(--fSeattle2020Complaints[[#This Row],[ZipCode]],dZipNeighborhood[ZipCode],dZipNeighborhood[Neighborhood])","v":"Mount Baker"}]
["Vacant Building","2020-09-27","Completed","Completed","98144",{"$f":"_xlfn.XLOOKUP(--fSeattle2020Complaints[[#This Row],[ZipCode]],dZipNeighborhood[ZipCode],dZipNeighborhood[Neighborhood])","v":"Mount Baker"}]
["Land Use","2020-07-23","Completed","Completed","98105",{"$f":"_xlfn.XLOOKUP(--fSeattle2020Complaints[[#This Row],[ZipCode]],dZipNeighborhood[ZipCode],dZipNeighborhood[Neighborhood])","v":"University District"}]
["Land Use","2020-05-20","Completed","Completed","98101",{"$f":"_xlfn.XLOOKUP(--fSeattle2020Complaints[[#This Row],[ZipCode]],dZipNeighborhood[ZipCode],dZipNeighborhood[Neighborhood])","v":"Seattle"}]
["Land Use","2020-02-27","Completed","Completed","98118",{"$f":"_xlfn.XLOOKUP(--fSeattle2020Complaints[[#This Row],[ZipCode]],dZipNeighborhood[ZipCode],dZipNeighborhood[Neighborhood])","v":"Columbia City"}]
["Land Use","2020-09-08","Completed","Completed","98108",{"$f":"_xlfn.XLOOKUP(--fSeattle2020Complaints[[#This Row],[ZipCode]],dZipNeighborhood[ZipCode],dZipNeighborhood[Neighborhood])","v":"Rainer Valley"}]
["Weeds","2020-02-20","Completed","Warning","98107",{"$f":"_xlfn.XLOOKUP(--fSeattle2020Complaints[[#This Row],[ZipCode]],dZipNeighborhood[ZipCode],dZipNeighborhood[Neighborhood])","v":"Ballard"}]
["Construction","2020-01-23","Compliance Achieved","Completed","98122",{"$f":"_xlfn.XLOOKUP(--fSeattle2020Complaints[[#This Row],[ZipCode]],dZipNeighborhood[ZipCode],dZipNeighborhood[Neighborhood])","v":"Minor, Central Area"}]
["Tree","2020-02-27","Completed","Completed","98108",{"$f":"_xlfn.XLOOKUP(--fSeattle2020Complaints[[#This Row],[ZipCode]],dZipNeighborhood[ZipCode],dZipNeighborhood[Neighborhood])","v":"Rainer Valley"}]
["Land Use","2020-10-30","Completed","Completed","98105",{"$f":"_xlfn.XLOOKUP(--fSeattle2020Complaints[[#This Row],[ZipCode]],dZipNeighborhood[ZipCode],dZipNeighborhood[Neighborhood])","v":"University District"}]
["Construction","2020-12-25","Completed","Completed","98118",{"$f":"_xlfn.XLOOKUP(--fSeattle2020Complaints[[#This Row],[ZipCode]],dZipNeighborhood[ZipCode],dZipNeighborhood[Neighborhood])","v":"Columbia City"}]
["Land Use","2020-07-13","Completed","Completed","98144",{"$f":"_xlfn.XLOOKUP(--fSeattle2020Complaints[[#This Row],[ZipCode]],dZipNeighborhood[ZipCode],dZipNeighborhood[Neighborhood])","v":"Mount Baker"}]
["Weeds","2020-04-18","Completed","Closed","98144",{"$f":"_xlfn.XLOOKUP(--fSeattle2020Complaints[[#This Row],[ZipCode]],dZipNeighborhood[ZipCode],dZipNeighborhood[Neighborhood])","v":"Mount Baker"}]
["Construction","2020-04-23","Completed","Under Investigation","98199",{"$f":"_xlfn.XLOOKUP(--fSeattle2020Complaints[[#This Row],[ZipCode]],dZipNeighborhood[ZipCode],dZipNeighborhood[Neighborhood])","v":"Magnolia"}]
["Construction","2020-12-30","Completed","Closed","98118",{"$f":"_xlfn.XLOOKUP(--fSeattle2020Complaints[[#This Row],[ZipCode]],dZipNeighborhood[ZipCode],dZipNeighborhood[Neighborhood])","v":"Columbia City"}]
["Construction","2020-03-16","Completed","Closed","98122",{"$f":"_xlfn.XLOOKUP(--fSeattle2020Complaints[[#This Row],[ZipCode]],dZipNeighborhood[ZipCode],dZipNeighborhood[Neighborhood])","v":"Minor, Central Area"}]
["Land Use","2020-07-06","No Access/Unable to Observe","Completed","98199",{"$f":"_xlfn.XLOOKUP(--fSeattle2020Complaints[[#This Row],[ZipCode]],dZipNeighborhood[ZipCode],dZipNeighborhood[Neighborhood])","v":"Magnolia"}]
["Land Use","2020-02-12","Completed","Completed","98104",{"$f":"_xlfn.XLOOKUP(--fSeattle2020Complaints[[#This Row],[ZipCode]],dZipNeighborhood[ZipCode],dZipNeighborhood[Neighborhood])","v":"International District"}]
["Weeds","2020-05-23","Completed","Completed","98115",{"$f":"_xlfn.XLOOKUP(--fSeattle2020Complaints[[#This Row],[ZipCode]],dZipNeighborhood[ZipCode],dZipNeighborhood[Neighborhood])","v":"Greenlake"}]
["Weeds","2020-04-06","No Violation","Completed","98144",{"$f":"_xlfn.XLOOKUP(--fSeattle2020Complaints[[#This Row],[ZipCode]],dZipNeighborhood[ZipCode],dZipNeighborhood[Neighborhood])","v":"Mount Baker"}]
["Land Use","2020-05-27","Completed","Completed","98106",{"$f":"_xlfn.XLOOKUP(--fSeattle2020Complaints[[#This Row],[ZipCode]],dZipNeighborhood[ZipCode],dZipNeighborhood[Neighborhood])","v":"Delridge"}]
["Construction","2020-06-29","Completed","Closed","98116",{"$f":"_xlfn.XLOOKUP(--fSeattle2020Complaints[[#This Row],[ZipCode]],dZipNeighborhood[ZipCode],dZipNeighborhood[Neighborhood])","v":"West Seattle"}]
["Vacant Building","2020-05-18","Completed","Completed","98199",{"$f":"_xlfn.XLOOKUP(--fSeattle2020Complaints[[#This Row],[ZipCode]],dZipNeighborhood[ZipCode],dZipNeighborhood[Neighborhood])","v":"Magnolia"}]
["Vacant Building","2020-04-11","Admin Closure","Completed","98136",{"$f":"_xlfn.XLOOKUP(--fSeattle2020Complaints[[#This Row],[ZipCode]],dZipNeighborhood[ZipCode],dZipNeighborhood[Neighborhood])","v":"Seaview"}]
["Vacant Building","2020-05-19","Completed","Completed","98112",{"$f":"_xlfn.XLOOKUP(--fSeattle2020Complaints[[#This Row],[ZipCode]],dZipNeighborhood[ZipCode],dZipNeighborhood[Neighborhood])","v":"Madison Park"}]
["Land Use","2020-10-13","Completed","Completed","98199",{"$f":"_xlfn.XLOOKUP(--fSeattle2020Complaints[[#This Row],[ZipCode]],dZipNeighborhood[ZipCode],dZipNeighborhood[Neighborhood])","v":"Magnolia"}]
["Noise","2020-01-10","Completed","Completed","98103",{"$f":"_xlfn.XLOOKUP(--fSeattle2020Complaints[[#This Row],[ZipCode]],dZipNeighborhood[ZipCode],dZipNeighborhood[Neighborhood])","v":"Greenwood"}]
["Land Use","2020-05-15","Completed","Completed","98108",{"$f":"_xlfn.XLOOKUP(--fSeattle2020Complaints[[#This Row],[ZipCode]],dZipNeighborhood[ZipCode],dZipNeighborhood[Neighborhood])","v":"Rainer Valley"}]
["Vacant Building","2020-04-21","Completed","Completed","98102",{"$f":"_xlfn.XLOOKUP(--fSeattle2020Complaints[[#This Row],[ZipCode]],dZipNeighborhood[ZipCode],dZipNeighborhood[Neighborhood])","v":"Capital Hill"}]
["Weeds","2020-07-23","Completed","Completed","98144",{"$f":"_xlfn.XLOOKUP(--fSeattle2020Complaints[[#This Row],[ZipCode]],dZipNeighborhood[ZipCode],dZipNeighborhood[Neighborhood])","v":"Mount Baker"}]
["Land Use","2020-01-18","Completed","Completed","98102",{"$f":"_xlfn.XLOOKUP(--fSeattle2020Complaints[[#This Row],[ZipCode]],dZipNeighborhood[ZipCode],dZipNeighborhood[Neighborhood])","v":"Capital Hill"}]
["Weeds","2020-08-27","Completed","Completed","98115",{"$f":"_xlfn.XLOOKUP(--fSeattle2020Complaints[[#This Row],[ZipCode]],dZipNeighborhood[ZipCode],dZipNeighborhood[Neighborhood])","v":"Greenlake"}]
["Land Use","2020-08-05","Completed","Completed","98122",{"$f":"_xlfn.XLOOKUP(--fSeattle2020Complaints[[#This Row],[ZipCode]],dZipNeighborhood[ZipCode],dZipNeighborhood[Neighborhood])","v":"Minor, Central Area"}]
["Tree","2020-02-21","Completed","Completed","98116",{"$f":"_xlfn.XLOOKUP(--fSeattle2020Complaints[[#This Row],[ZipCode]],dZipNeighborhood[ZipCode],dZipNeighborhood[Neighborhood])","v":"West Seattle"}]
["Land Use","2020-08-09","Completed","Completed","98126",{"$f":"_xlfn.XLOOKUP(--fSeattle2020Complaints[[#This Row],[ZipCode]],dZipNeighborhood[ZipCode],dZipNeighborhood[Neighborhood])","v":"High Point"}]
["Land Use","2020-02-20","Completed","Completed","98118",{"$f":"_xlfn.XLOOKUP(--fSeattle2020Complaints[[#This Row],[ZipCode]],dZipNeighborhood[ZipCode],dZipNeighborhood[Neighborhood])","v":"Columbia City"}]
["Construction","2020-08-06","Completed","Completed","98116",{"$f":"_xlfn.XLOOKUP(--fSeattle2020Complaints[[#This Row],[ZipCode]],dZipNeighborhood[ZipCode],dZipNeighborhood[Neighborhood])","v":"West Seattle"}]
["Weeds","2020-10-08","Completed","Completed","98106",{"$f":"_xlfn.XLOOKUP(--fSeattle2020Complaints[[#This Row],[ZipCode]],dZipNeighborhood[ZipCode],dZipNeighborhood[Neighborhood])","v":"Delridge"}]
["Weeds","2020-06-05","Completed","Completed","98126",{"$f":"_xlfn.XLOOKUP(--fSeattle2020Complaints[[#This Row],[ZipCode]],dZipNeighborhood[ZipCode],dZipNeighborhood[Neighborhood])","v":"High Point"}]
["Tree","2020-07-19","Completed","Completed","98106",{"$f":"_xlfn.XLOOKUP(--fSeattle2020Complaints[[#This Row],[ZipCode]],dZipNeighborhood[ZipCode],dZipNeighborhood[Neighborhood])","v":"Delridge"}]
["Weeds","2020-06-08","Completed","Completed","98126",{"$f":"_xlfn.XLOOKUP(--fSeattle2020Complaints[[#This Row],[ZipCode]],dZipNeighborhood[ZipCode],dZipNeighborhood[Neighborhood])","v":"High Point"}]
["Land Use","2020-01-26","Completed","Completed","98118",{"$f":"_xlfn.XLOOKUP(--fSeattle2020Complaints[[#This Row],[ZipCode]],dZipNeighborhood[ZipCode],dZipNeighborhood[Neighborhood])","v":"Columbia City"}]
["Land Use","2020-06-09","Completed","Completed","98144",{"$f":"_xlfn.XLOOKUP(--fSeattle2020Complaints[[#This Row],[ZipCode]],dZipNeighborhood[ZipCode],dZipNeighborhood[Neighborhood])","v":"Mount Baker"}]
["Land Use","2020-06-01","Completed","Completed","98133",{"$f":"_xlfn.XLOOKUP(--fSeattle2020Complaints[[#This Row],[ZipCode]],dZipNeighborhood[ZipCode],dZipNeighborhood[Neighborhood])","v":"Shoreline"}]
["Vacant Building","2020-08-11","Completed","Completed","98122",{"$f":"_xlfn.XLOOKUP(--fSeattle2020Complaints[[#This Row],[ZipCode]],dZipNeighborhood[ZipCode],dZipNeighborhood[Neighborhood])","v":"Minor, Central Area"}]
["Land Use","2020-07-08","Completed","Completed","98199",{"$f":"_xlfn.XLOOKUP(--fSeattle2020Complaints[[#This Row],[ZipCode]],dZipNeighborhood[ZipCode],dZipNeighborhood[Neighborhood])","v":"Magnolia"}]
["Tree","2020-01-10","Completed","Completed","98116",{"$f":"_xlfn.XLOOKUP(--fSeattle2020Complaints[[#This Row],[ZipCode]],dZipNeighborhood[ZipCode],dZipNeighborhood[Neighborhood])","v":"West Seattle"}]
["Land Use","2020-06-16","Completed","Completed","98122",{"$f":"_xlfn.XLOOKUP(--fSeattle2020Complaints[[#This Row],[ZipCode]],dZipNeighborhood[ZipCode],dZipNeighborhood[Neighborhood])","v":"Minor, Central Area"}]
["Weeds","2020-07-22","Completed","Initiated","98112",{"$f":"_xlfn.XLOOKUP(--fSeattle2020Complaints[[#This Row],[ZipCode]],dZipNeighborhood[ZipCode],dZipNeighborhood[Neighborhood])","v":"Madison Park"}]
["Weeds","2020-05-01","Completed","Completed","98106",{"$f":"_xlfn.XLOOKUP(--fSeattle2020Complaints[[#This Row],[ZipCode]],dZipNeighborhood[ZipCode],dZipNeighborhood[Neighborhood])","v":"Delridge"}]
["Weeds","2020-12-01","Completed","Completed","98122",{"$f":"_xlfn.XLOOKUP(--fSeattle2020Complaints[[#This Row],[ZipCode]],dZipNeighborhood[ZipCode],dZipNeighborhood[Neighborhood])","v":"Minor, Central Area"}]
["Weeds","2020-01-03","Compliance Achieved","Completed","98121",{"$f":"_xlfn.XLOOKUP(--fSeattle2020Complaints[[#This Row],[ZipCode]],dZipNeighborhood[ZipCode],dZipNeighborhood[Neighborhood])","v":"Belltown"}]
["Weeds","2020-09-02","Completed","Completed","98103",{"$f":"_xlfn.XLOOKUP(--fSeattle2020Complaints[[#This Row],[ZipCode]],dZipNeighborhood[ZipCode],dZipNeighborhood[Neighborhood])","v":"Greenwood"}]
["Construction","2020-03-03","Completed","Completed","98199",{"$f":"_xlfn.XLOOKUP(--fSeattle2020Complaints[[#This Row],[ZipCode]],dZipNeighborhood[ZipCode],dZipNeighborhood[Neighborhood])","v":"Magnolia"}]
["Construction","2020-06-02","Completed","Completed","98108",{"$f":"_xlfn.XLOOKUP(--fSeattle2020Complaints[[#This Row],[ZipCode]],dZipNeighborhood[ZipCode],dZipNeighborhood[Neighborhood])","v":"Rainer Valley"}]
["Weeds","2020-11-03","Completed","Completed","98144",{"$f":"_xlfn.XLOOKUP(--fSeattle2020Complaints[[#This Row],[ZipCode]],dZipNeighborhood[ZipCode],dZipNeighborhood[Neighborhood])","v":"Mount Baker"}]
["Weeds","2020-03-04","Completed","Completed","98109",{"$f":"_xlfn.XLOOKUP(--fSeattle2020Complaints[[#This Row],[ZipCode]],dZipNeighborhood[ZipCode],dZipNeighborhood[Neighborhood])","v":"South Lake Union"}]
["Land Use","2020-08-10","Completed","Completed","98133",{"$f":"_xlfn.XLOOKUP(--fSeattle2020Complaints[[#This Row],[ZipCode]],dZipNeighborhood[ZipCode],dZipNeighborhood[Neighborhood])","v":"Shoreline"}]
["Land Use","2020-01-24","Completed","Completed","98112",{"$f":"_xlfn.XLOOKUP(--fSeattle2020Complaints[[#This Row],[ZipCode]],dZipNeighborhood[ZipCode],dZipNeighborhood[Neighborhood])","v":"Madison Park"}]
["Land Use","2020-11-19","Completed","Completed","98119",{"$f":"_xlfn.XLOOKUP(--fSeattle2020Complaints[[#This Row],[ZipCode]],dZipNeighborhood[ZipCode],dZipNeighborhood[Neighborhood])","v":"Queen Anne"}]
["Land Use","2020-05-01","Completed","Completed","98117",{"$f":"_xlfn.XLOOKUP(--fSeattle2020Complaints[[#This Row],[ZipCode]],dZipNeighborhood[ZipCode],dZipNeighborhood[Neighborhood])","v":"Sunset Hill"}]
["Land Use","2020-01-23","Completed","Completed","98102",{"$f":"_xlfn.XLOOKUP(--fSeattle2020Complaints[[#This Row],[ZipCode]],dZipNeighborhood[ZipCode],dZipNeighborhood[Neighborhood])","v":"Capital Hill"}]
["Emergency , Vacant Building","2020-01-23","Completed","Completed","98107",{"$f":"_xlfn.XLOOKUP(--fSeattle2020Complaints[[#This Row],[ZipCode]],dZipNeighborhood[ZipCode],dZipNeighborhood[Neighborhood])","v":"Ballard"}]
["Emergency , Vacant Building","2020-06-26","Secured with No Violations","Completed","98119",{"$f":"_xlfn.XLOOKUP(--fSeattle2020Complaints[[#This Row],[ZipCode]],dZipNeighborhood[ZipCode],dZipNeighborhood[Neighborhood])","v":"Queen Anne"}]
["Construction","2020-09-02","Completed","Completed","98103",{"$f":"_xlfn.XLOOKUP(--fSeattle2020Complaints[[#This Row],[ZipCode]],dZipNeighborhood[ZipCode],dZipNeighborhood[Neighborhood])","v":"Greenwood"}]
["Land Use","2020-10-06","Completed","Completed","98105",{"$f":"_xlfn.XLOOKUP(--fSeattle2020Complaints[[#This Row],[ZipCode]],dZipNeighborhood[ZipCode],dZipNeighborhood[Neighborhood])","v":"University District"}]
["Emergency","2020-04-29","Compliance Achieved","Completed","98105",{"$f":"_xlfn.XLOOKUP(--fSeattle2020Complaints[[#This Row],[ZipCode]],dZipNeighborhood[ZipCode],dZipNeighborhood[Neighborhood])","v":"University District"}]
["Emergency , Vacant Building","2020-09-15","Completed","Completed","98105",{"$f":"_xlfn.XLOOKUP(--fSeattle2020Complaints[[#This Row],[ZipCode]],dZipNeighborhood[ZipCode],dZipNeighborhood[Neighborhood])","v":"University District"}]
["Construction","2020-07-22","Completed","NOV Issued","98118",{"$f":"_xlfn.XLOOKUP(--fSeattle2020Complaints[[#This Row],[ZipCode]],dZipNeighborhood[ZipCode],dZipNeighborhood[Neighborhood])","v":"Columbia City"}]
["Shoreline","2020-05-29","Completed","NOV Issued","98118",{"$f":"_xlfn.XLOOKUP(--fSeattle2020Complaints[[#This Row],[ZipCode]],dZipNeighborhood[ZipCode],dZipNeighborhood[Neighborhood])","v":"Columbia City"}]
["Weeds","2020-01-12","Completed","Completed","98136",{"$f":"_xlfn.XLOOKUP(--fSeattle2020Complaints[[#This Row],[ZipCode]],dZipNeighborhood[ZipCode],dZipNeighborhood[Neighborhood])","v":"Seaview"}]
["Weeds","2020-06-21","Completed","Completed","98136",{"$f":"_xlfn.XLOOKUP(--fSeattle2020Complaints[[#This Row],[ZipCode]],dZipNeighborhood[ZipCode],dZipNeighborhood[Neighborhood])","v":"Seaview"}]
["Land Use","2020-05-11","Completed","Completed","98103",{"$f":"_xlfn.XLOOKUP(--fSeattle2020Complaints[[#This Row],[ZipCode]],dZipNeighborhood[ZipCode],dZipNeighborhood[Neighborhood])","v":"Greenwood"}]
["Land Use","2020-08-04","Completed","Completed","98125",{"$f":"_xlfn.XLOOKUP(--fSeattle2020Complaints[[#This Row],[ZipCode]],dZipNeighborhood[ZipCode],dZipNeighborhood[Neighborhood])","v":"Northgate"}]
["Weeds","2020-06-09","Completed","Completed","98117",{"$f":"_xlfn.XLOOKUP(--fSeattle2020Complaints[[#This Row],[ZipCode]],dZipNeighborhood[ZipCode],dZipNeighborhood[Neighborhood])","v":"Sunset Hill"}]
["Construction , Noise","2020-01-07","Completed","Completed","98109",{"$f":"_xlfn.XLOOKUP(--fSeattle2020Complaints[[#This Row],[ZipCode]],dZipNeighborhood[ZipCode],dZipNeighborhood[Neighborhood])","v":"South Lake Union"}]
["Weeds","2020-07-30","Completed","Closed","98117",{"$f":"_xlfn.XLOOKUP(--fSeattle2020Complaints[[#This Row],[ZipCode]],dZipNeighborhood[ZipCode],dZipNeighborhood[Neighborhood])","v":"Sunset Hill"}]
["Weeds","2020-06-09","Completed","Completed","98144",{"$f":"_xlfn.XLOOKUP(--fSeattle2020Complaints[[#This Row],[ZipCode]],dZipNeighborhood[ZipCode],dZipNeighborhood[Neighborhood])","v":"Mount Baker"}]
["Construction","2020-03-06","No Access/Unable to Observe","Completed","98126",{"$f":"_xlfn.XLOOKUP(--fSeattle2020Complaints[[#This Row],[ZipCode]],dZipNeighborhood[ZipCode],dZipNeighborhood[Neighborhood])","v":"High Point"}]
["Weeds","2020-06-23","Completed","Initiated","98106",{"$f":"_xlfn.XLOOKUP(--fSeattle2020Complaints[[#This Row],[ZipCode]],dZipNeighborhood[ZipCode],dZipNeighborhood[Neighborhood])","v":"Delridge"}]
["Weeds","2020-02-21","Completed","Completed","98116",{"$f":"_xlfn.XLOOKUP(--fSeattle2020Complaints[[#This Row],[ZipCode]],dZipNeighborhood[ZipCode],dZipNeighborhood[Neighborhood])","v":"West Seattle"}]
["Vacant Building","2020-05-13","Completed","Completed","98144",{"$f":"_xlfn.XLOOKUP(--fSeattle2020Complaints[[#This Row],[ZipCode]],dZipNeighborhood[ZipCode],dZipNeighborhood[Neighborhood])","v":"Mount Baker"}]
["Weeds","2020-03-17","Compliance Achieved","Completed","98103",{"$f":"_xlfn.XLOOKUP(--fSeattle2020Complaints[[#This Row],[ZipCode]],dZipNeighborhood[ZipCode],dZipNeighborhood[Neighborhood])","v":"Greenwood"}]
["Land Use","2020-06-25","No Access/Unable to Observe","Completed","98121",{"$f":"_xlfn.XLOOKUP(--fSeattle2020Complaints[[#This Row],[ZipCode]],dZipNeighborhood[ZipCode],dZipNeighborhood[Neighborhood])","v":"Belltown"}]
["Land Use","2020-03-27","Completed","Completed","98118",{"$f":"_xlfn.XLOOKUP(--fSeattle2020Complaints[[#This Row],[ZipCode]],dZipNeighborhood[ZipCode],dZipNeighborhood[Neighborhood])","v":"Columbia City"}]
["Weeds","2020-01-09","Completed","Completed","98106",{"$f":"_xlfn.XLOOKUP(--fSeattle2020Complaints[[#This Row],[ZipCode]],dZipNeighborhood[ZipCode],dZipNeighborhood[Neighborhood])","v":"Delridge"}]
["Vacant Building","2020-02-19","Completed","Completed","98116",{"$f":"_xlfn.XLOOKUP(--fSeattle2020Complaints[[#This Row],[ZipCode]],dZipNeighborhood[ZipCode],dZipNeighborhood[Neighborhood])","v":"West Seattle"}]
["Land Use","2020-08-27","Completed","Completed","98107",{"$f":"_xlfn.XLOOKUP(--fSeattle2020Complaints[[#This Row],[ZipCode]],dZipNeighborhood[ZipCode],dZipNeighborhood[Neighborhood])","v":"Ballard"}]
["Land Use","2020-10-12","Completed","Completed","98199",{"$f":"_xlfn.XLOOKUP(--fSeattle2020Complaints[[#This Row],[ZipCode]],dZipNeighborhood[ZipCode],dZipNeighborhood[Neighborhood])","v":"Magnolia"}]
["Land Use","2020-10-30","Completed","Completed","98118",{"$f":"_xlfn.XLOOKUP(--fSeattle2020Complaints[[#This Row],[ZipCode]],dZipNeighborhood[ZipCode],dZipNeighborhood[Neighborhood])","v":"Columbia City"}]
["Land Use","2020-05-12","Completed","Completed","98122",{"$f":"_xlfn.XLOOKUP(--fSeattle2020Complaints[[#This Row],[ZipCode]],dZipNeighborhood[ZipCode],dZipNeighborhood[Neighborhood])","v":"Minor, Central Area"}]
["Land Use","2020-06-27","Completed","Completed","98118",{"$f":"_xlfn.XLOOKUP(--fSeattle2020Complaints[[#This Row],[ZipCode]],dZipNeighborhood[ZipCode],dZipNeighborhood[Neighborhood])","v":"Columbia City"}]
["Vacant Building","2020-04-21","Completed","Closed","98105",{"$f":"_xlfn.XLOOKUP(--fSeattle2020Complaints[[#This Row],[ZipCode]],dZipNeighborhood[ZipCode],dZipNeighborhood[Neighborhood])","v":"University District"}]
["Land Use","2020-01-13","Completed","Completed","98104",{"$f":"_xlfn.XLOOKUP(--fSeattle2020Complaints[[#This Row],[ZipCode]],dZipNeighborhood[ZipCode],dZipNeighborhood[Neighborhood])","v":"International District"}]
["Construction","2020-03-09","Completed","Completed","98104",{"$f":"_xlfn.XLOOKUP(--fSeattle2020Complaints[[#This Row],[ZipCode]],dZipNeighborhood[ZipCode],dZipNeighborhood[Neighborhood])","v":"International District"}]
["Construction","2020-01-29","Completed","Completed","98133",{"$f":"_xlfn.XLOOKUP(--fSeattle2020Complaints[[#This Row],[ZipCode]],dZipNeighborhood[ZipCode],dZipNeighborhood[Neighborhood])","v":"Shoreline"}]
["Land UseConstruction ,","2020-08-31","No Violation","Completed","98107",{"$f":"_xlfn.XLOOKUP(--fSeattle2020Complaints[[#This Row],[ZipCode]],dZipNeighborhood[ZipCode],dZipNeighborhood[Neighborhood])","v":"Ballard"}]
["Construction","2020-09-30","No Access/Unable to Observe","Closed","98116",{"$f":"_xlfn.XLOOKUP(--fSeattle2020Complaints[[#This Row],[ZipCode]],dZipNeighborhood[ZipCode],dZipNeighborhood[Neighborhood])","v":"West Seattle"}]
["Weeds","2020-08-08","Completed","Completed","98144",{"$f":"_xlfn.XLOOKUP(--fSeattle2020Complaints[[#This Row],[ZipCode]],dZipNeighborhood[ZipCode],dZipNeighborhood[Neighborhood])","v":"Mount Baker"}]
["Construction","2020-02-12","Completed","Completed","98102",{"$f":"_xlfn.XLOOKUP(--fSeattle2020Complaints[[#This Row],[ZipCode]],dZipNeighborhood[ZipCode],dZipNeighborhood[Neighborhood])","v":"Capital Hill"}]
["Tree","2020-02-27","Completed","Completed","98177",{"$f":"_xlfn.XLOOKUP(--fSeattle2020Complaints[[#This Row],[ZipCode]],dZipNeighborhood[ZipCode],dZipNeighborhood[Neighborhood])","v":"Richmond Beach"}]
["Emergency , Vacant Building","2020-04-10","Compliance Achieved","Completed","98144",{"$f":"_xlfn.XLOOKUP(--fSeattle2020Complaints[[#This Row],[ZipCode]],dZipNeighborhood[ZipCode],dZipNeighborhood[Neighborhood])","v":"Mount Baker"}]
["Construction","2020-07-15","Completed","Completed","98101",{"$f":"_xlfn.XLOOKUP(--fSeattle2020Complaints[[#This Row],[ZipCode]],dZipNeighborhood[ZipCode],dZipNeighborhood[Neighborhood])","v":"Seattle"}]
["Land Use","2020-03-10","Completed","Completed","98118",{"$f":"_xlfn.XLOOKUP(--fSeattle2020Complaints[[#This Row],[ZipCode]],dZipNeighborhood[ZipCode],dZipNeighborhood[Neighborhood])","v":"Columbia City"}]
["Weeds","2020-05-01","Completed","Completed","98108",{"$f":"_xlfn.XLOOKUP(--fSeattle2020Complaints[[#This Row],[ZipCode]],dZipNeighborhood[ZipCode],dZipNeighborhood[Neighborhood])","v":"Rainer Valley"}]
["Weeds","2020-03-11","Completed","Initiated","98116",{"$f":"_xlfn.XLOOKUP(--fSeattle2020Complaints[[#This Row],[ZipCode]],dZipNeighborhood[ZipCode],dZipNeighborhood[Neighborhood])","v":"West Seattle"}]
["Construction","2020-12-22","Completed","Completed","98126",{"$f":"_xlfn.XLOOKUP(--fSeattle2020Complaints[[#This Row],[ZipCode]],dZipNeighborhood[ZipCode],dZipNeighborhood[Neighborhood])","v":"High Point"}]
["Vacant Building","2020-02-05","Completed","NOV Issued","98108",{"$f":"_xlfn.XLOOKUP(--fSeattle2020Complaints[[#This Row],[ZipCode]],dZipNeighborhood[ZipCode],dZipNeighborhood[Neighborhood])","v":"Rainer Valley"}]
["Land Use","2020-08-24","Completed","Completed","98126",{"$f":"_xlfn.XLOOKUP(--fSeattle2020Complaints[[#This Row],[ZipCode]],dZipNeighborhood[ZipCode],dZipNeighborhood[Neighborhood])","v":"High Point"}]
["Land Use","2020-03-12","Completed","Completed","98118",{"$f":"_xlfn.XLOOKUP(--fSeattle2020Complaints[[#This Row],[ZipCode]],dZipNeighborhood[ZipCode],dZipNeighborhood[Neighborhood])","v":"Columbia City"}]
["Construction","2020-01-13","Completed","Completed","98108",{"$f":"_xlfn.XLOOKUP(--fSeattle2020Complaints[[#This Row],[ZipCode]],dZipNeighborhood[ZipCode],dZipNeighborhood[Neighborhood])","v":"Rainer Valley"}]
["Land Use","2020-11-09","Completed","Closed","98144",{"$f":"_xlfn.XLOOKUP(--fSeattle2020Complaints[[#This Row],[ZipCode]],dZipNeighborhood[ZipCode],dZipNeighborhood[Neighborhood])","v":"Mount Baker"}]
["Vacant Building","2020-05-26","Compliance Achieved","Completed","98103",{"$f":"_xlfn.XLOOKUP(--fSeattle2020Complaints[[#This Row],[ZipCode]],dZipNeighborhood[ZipCode],dZipNeighborhood[Neighborhood])","v":"Greenwood"}]
["Construction","2020-05-20","Completed","Completed","98102",{"$f":"_xlfn.XLOOKUP(--fSeattle2020Complaints[[#This Row],[ZipCode]],dZipNeighborhood[ZipCode],dZipNeighborhood[Neighborhood])","v":"Capital Hill"}]
["Land Use","2020-12-02","Completed","Closed","98125",{"$f":"_xlfn.XLOOKUP(--fSeattle2020Complaints[[#This Row],[ZipCode]],dZipNeighborhood[ZipCode],dZipNeighborhood[Neighborhood])","v":"Northgate"}]
["Weeds","2020-06-27","Completed","Completed","98122",{"$f":"_xlfn.XLOOKUP(--fSeattle2020Complaints[[#This Row],[ZipCode]],dZipNeighborhood[ZipCode],dZipNeighborhood[Neighborhood])","v":"Minor, Central Area"}]
["Land Use","2020-10-12","Completed","Completed","98103",{"$f":"_xlfn.XLOOKUP(--fSeattle2020Complaints[[#This Row],[ZipCode]],dZipNeighborhood[ZipCode],dZipNeighborhood[Neighborhood])","v":"Greenwood"}]
["Tree","2020-04-19","Completed","Completed","98103",{"$f":"_xlfn.XLOOKUP(--fSeattle2020Complaints[[#This Row],[ZipCode]],dZipNeighborhood[ZipCode],dZipNeighborhood[Neighborhood])","v":"Greenwood"}]
["LandLord/Tenant","2020-08-11","Completed","Under Investigation","98136",{"$f":"_xlfn.XLOOKUP(--fSeattle2020Complaints[[#This Row],[ZipCode]],dZipNeighborhood[ZipCode],dZipNeighborhood[Neighborhood])","v":"Seaview"}]
["Emergency , Vacant Building","2020-05-18","Completed","Completed","98107",{"$f":"_xlfn.XLOOKUP(--fSeattle2020Complaints[[#This Row],[ZipCode]],dZipNeighborhood[ZipCode],dZipNeighborhood[Neighborhood])","v":"Ballard"}]
["LandLord/Tenant","2020-02-04","Completed","NOV Issued","98118",{"$f":"_xlfn.XLOOKUP(--fSeattle2020Complaints[[#This Row],[ZipCode]],dZipNeighborhood[ZipCode],dZipNeighborhood[Neighborhood])","v":"Columbia City"}]
["Land Use","2020-01-14","Completed","Completed","98122",{"$f":"_xlfn.XLOOKUP(--fSeattle2020Complaints[[#This Row],[ZipCode]],dZipNeighborhood[ZipCode],dZipNeighborhood[Neighborhood])","v":"Minor, Central Area"}]
["Tree","2020-05-14","Completed","Completed","98126",{"$f":"_xlfn.XLOOKUP(--fSeattle2020Complaints[[#This Row],[ZipCode]],dZipNeighborhood[ZipCode],dZipNeighborhood[Neighborhood])","v":"High Point"}]
["Vacant Building","2020-02-06","Completed","Closed","98103",{"$f":"_xlfn.XLOOKUP(--fSeattle2020Complaints[[#This Row],[ZipCode]],dZipNeighborhood[ZipCode],dZipNeighborhood[Neighborhood])","v":"Greenwood"}]
["Vacant Building","2020-04-14","Completed","Completed","98122",{"$f":"_xlfn.XLOOKUP(--fSeattle2020Complaints[[#This Row],[ZipCode]],dZipNeighborhood[ZipCode],dZipNeighborhood[Neighborhood])","v":"Minor, Central Area"}]
["Weeds","2020-05-13","Completed","Warning","98117",{"$f":"_xlfn.XLOOKUP(--fSeattle2020Complaints[[#This Row],[ZipCode]],dZipNeighborhood[ZipCode],dZipNeighborhood[Neighborhood])","v":"Sunset Hill"}]
["Construction","2020-01-21","Completed","Completed","98115",{"$f":"_xlfn.XLOOKUP(--fSeattle2020Complaints[[#This Row],[ZipCode]],dZipNeighborhood[ZipCode],dZipNeighborhood[Neighborhood])","v":"Greenlake"}]
["Vacant Building","2020-12-02","Completed","Completed","98178",{"$f":"_xlfn.XLOOKUP(--fSeattle2020Complaints[[#This Row],[ZipCode]],dZipNeighborhood[ZipCode],dZipNeighborhood[Neighborhood])","v":"Skyway"}]
["Construction","2020-03-02","Completed","Completed","98107",{"$f":"_xlfn.XLOOKUP(--fSeattle2020Complaints[[#This Row],[ZipCode]],dZipNeighborhood[ZipCode],dZipNeighborhood[Neighborhood])","v":"Ballard"}]
["Land Use","2020-06-06","No Access/Unable to Observe","Completed","98118",{"$f":"_xlfn.XLOOKUP(--fSeattle2020Complaints[[#This Row],[ZipCode]],dZipNeighborhood[ZipCode],dZipNeighborhood[Neighborhood])","v":"Columbia City"}]
["Construction","2020-05-22","Completed","NOV Issued","98178",{"$f":"_xlfn.XLOOKUP(--fSeattle2020Complaints[[#This Row],[ZipCode]],dZipNeighborhood[ZipCode],dZipNeighborhood[Neighborhood])","v":"Skyway"}]
["Land Use","2020-08-03","No Access/Unable to Observe","Completed","98108",{"$f":"_xlfn.XLOOKUP(--fSeattle2020Complaints[[#This Row],[ZipCode]],dZipNeighborhood[ZipCode],dZipNeighborhood[Neighborhood])","v":"Rainer Valley"}]
["Land UseConstruction ,","2020-12-23","Completed","Completed","98115",{"$f":"_xlfn.XLOOKUP(--fSeattle2020Complaints[[#This Row],[ZipCode]],dZipNeighborhood[ZipCode],dZipNeighborhood[Neighborhood])","v":"Greenlake"}]
["Weeds","2020-09-10","Completed","Completed","98115",{"$f":"_xlfn.XLOOKUP(--fSeattle2020Complaints[[#This Row],[ZipCode]],dZipNeighborhood[ZipCode],dZipNeighborhood[Neighborhood])","v":"Greenlake"}]
["Construction","2020-09-28","Completed","Completed","98103",{"$f":"_xlfn.XLOOKUP(--fSeattle2020Complaints[[#This Row],[ZipCode]],dZipNeighborhood[ZipCode],dZipNeighborhood[Neighborhood])","v":"Greenwood"}]
["Construction","2020-02-07","Completed","Completed","98116",{"$f":"_xlfn.XLOOKUP(--fSeattle2020Complaints[[#This Row],[ZipCode]],dZipNeighborhood[ZipCode],dZipNeighborhood[Neighborhood])","v":"West Seattle"}]
["Land Use","2020-07-20","Completed","Completed","98112",{"$f":"_xlfn.XLOOKUP(--fSeattle2020Complaints[[#This Row],[ZipCode]],dZipNeighborhood[ZipCode],dZipNeighborhood[Neighborhood])","v":"Madison Park"}]
["Vacant Building","2020-04-05","Completed","Closed","98133",{"$f":"_xlfn.XLOOKUP(--fSeattle2020Complaints[[#This Row],[ZipCode]],dZipNeighborhood[ZipCode],dZipNeighborhood[Neighborhood])","v":"Shoreline"}]
["Land Use","2020-05-28","Completed","Completed","98126",{"$f":"_xlfn.XLOOKUP(--fSeattle2020Complaints[[#This Row],[ZipCode]],dZipNeighborhood[ZipCode],dZipNeighborhood[Neighborhood])","v":"High Point"}]
["Weeds","2020-03-17","Compliance Achieved","Completed","98103",{"$f":"_xlfn.XLOOKUP(--fSeattle2020Complaints[[#This Row],[ZipCode]],dZipNeighborhood[ZipCode],dZipNeighborhood[Neighborhood])","v":"Greenwood"}]
["Weeds","2020-09-23","Completed","Completed","98144",{"$f":"_xlfn.XLOOKUP(--fSeattle2020Complaints[[#This Row],[ZipCode]],dZipNeighborhood[ZipCode],dZipNeighborhood[Neighborhood])","v":"Mount Baker"}]
["Tree","2020-04-15","Completed","NOV Issued","98117",{"$f":"_xlfn.XLOOKUP(--fSeattle2020Complaints[[#This Row],[ZipCode]],dZipNeighborhood[ZipCode],dZipNeighborhood[Neighborhood])","v":"Sunset Hill"}]
["Land Use","2020-07-22","Completed","Completed","98104",{"$f":"_xlfn.XLOOKUP(--fSeattle2020Complaints[[#This Row],[ZipCode]],dZipNeighborhood[ZipCode],dZipNeighborhood[Neighborhood])","v":"International District"}]
["Construction","2020-02-07","Completed","Completed","98146",{"$f":"_xlfn.XLOOKUP(--fSeattle2020Complaints[[#This Row],[ZipCode]],dZipNeighborhood[ZipCode],dZipNeighborhood[Neighborhood])","v":"Shorewood, White Center"}]
["Construction , Shoreline","2020-02-06","Completed","Completed","98119",{"$f":"_xlfn.XLOOKUP(--fSeattle2020Complaints[[#This Row],[ZipCode]],dZipNeighborhood[ZipCode],dZipNeighborhood[Neighborhood])","v":"Queen Anne"}]
["Weeds","2020-03-12","Compliance Achieved","Warning","98108",{"$f":"_xlfn.XLOOKUP(--fSeattle2020Complaints[[#This Row],[ZipCode]],dZipNeighborhood[ZipCode],dZipNeighborhood[Neighborhood])","v":"Rainer Valley"}]
["Construction","2020-02-14","Completed","Completed","98102",{"$f":"_xlfn.XLOOKUP(--fSeattle2020Complaints[[#This Row],[ZipCode]],dZipNeighborhood[ZipCode],dZipNeighborhood[Neighborhood])","v":"Capital Hill"}]
["Land Use","2020-01-03","Completed","Completed","98118",{"$f":"_xlfn.XLOOKUP(--fSeattle2020Complaints[[#This Row],[ZipCode]],dZipNeighborhood[ZipCode],dZipNeighborhood[Neighborhood])","v":"Columbia City"}]
["Tree","2020-04-25","Completed","Completed","98136",{"$f":"_xlfn.XLOOKUP(--fSeattle2020Complaints[[#This Row],[ZipCode]],dZipNeighborhood[ZipCode],dZipNeighborhood[Neighborhood])","v":"Seaview"}]
["Construction","2020-06-24","Completed","Completed","98122",{"$f":"_xlfn.XLOOKUP(--fSeattle2020Complaints[[#This Row],[ZipCode]],dZipNeighborhood[ZipCode],dZipNeighborhood[Neighborhood])","v":"Minor, Central Area"}]
["Land Use","2020-09-17","Completed","Completed","98125",{"$f":"_xlfn.XLOOKUP(--fSeattle2020Complaints[[#This Row],[ZipCode]],dZipNeighborhood[ZipCode],dZipNeighborhood[Neighborhood])","v":"Northgate"}]
["Land Use","2020-01-11","Completed","Completed","98108",{"$f":"_xlfn.XLOOKUP(--fSeattle2020Complaints[[#This Row],[ZipCode]],dZipNeighborhood[ZipCode],dZipNeighborhood[Neighborhood])","v":"Rainer Valley"}]
["Vacant Building","2020-10-20","Completed","Completed","98122",{"$f":"_xlfn.XLOOKUP(--fSeattle2020Complaints[[#This Row],[ZipCode]],dZipNeighborhood[ZipCode],dZipNeighborhood[Neighborhood])","v":"Minor, Central Area"}]
["Land Use","2020-01-26","Completed","Completed","98101",{"$f":"_xlfn.XLOOKUP(--fSeattle2020Complaints[[#This Row],[ZipCode]],dZipNeighborhood[ZipCode],dZipNeighborhood[Neighborhood])","v":"Seattle"}]
["Construction","2020-12-09","Completed","Closed","98136",{"$f":"_xlfn.XLOOKUP(--fSeattle2020Complaints[[#This Row],[ZipCode]],dZipNeighborhood[ZipCode],dZipNeighborhood[Neighborhood])","v":"Seaview"}]
["Land Use","2020-07-07","Completed","Completed","98115",{"$f":"_xlfn.XLOOKUP(--fSeattle2020Complaints[[#This Row],[ZipCode]],dZipNeighborhood[ZipCode],dZipNeighborhood[Neighborhood])","v":"Greenlake"}]
["Weeds","2020-04-22","Completed","Completed","98103",{"$f":"_xlfn.XLOOKUP(--fSeattle2020Complaints[[#This Row],[ZipCode]],dZipNeighborhood[ZipCode],dZipNeighborhood[Neighborhood])","v":"Greenwood"}]
["Construction","2020-01-29","Completed","NOV Issued","98103",{"$f":"_xlfn.XLOOKUP(--fSeattle2020Complaints[[#This Row],[ZipCode]],dZipNeighborhood[ZipCode],dZipNeighborhood[Neighborhood])","v":"Greenwood"}]
["Vacant Building","2020-12-02","Completed","Closed","98103",{"$f":"_xlfn.XLOOKUP(--fSeattle2020Complaints[[#This Row],[ZipCode]],dZipNeighborhood[ZipCode],dZipNeighborhood[Neighborhood])","v":"Greenwood"}]
["Land Use","2020-12-02","Completed","Completed","98109",{"$f":"_xlfn.XLOOKUP(--fSeattle2020Complaints[[#This Row],[ZipCode]],dZipNeighborhood[ZipCode],dZipNeighborhood[Neighborhood])","v":"South Lake Union"}]
["Land Use","2020-09-15","No Access/Unable to Observe","Completed","98199",{"$f":"_xlfn.XLOOKUP(--fSeattle2020Complaints[[#This Row],[ZipCode]],dZipNeighborhood[ZipCode],dZipNeighborhood[Neighborhood])","v":"Magnolia"}]
["Construction","2020-03-17","Compliance Achieved","Completed","98122",{"$f":"_xlfn.XLOOKUP(--fSeattle2020Complaints[[#This Row],[ZipCode]],dZipNeighborhood[ZipCode],dZipNeighborhood[Neighborhood])","v":"Minor, Central Area"}]
["Weeds","2020-02-22","Completed","Completed","98108",{"$f":"_xlfn.XLOOKUP(--fSeattle2020Complaints[[#This Row],[ZipCode]],dZipNeighborhood[ZipCode],dZipNeighborhood[Neighborhood])","v":"Rainer Valley"}]
["Land Use","2020-09-28","Completed","Completed","98121",{"$f":"_xlfn.XLOOKUP(--fSeattle2020Complaints[[#This Row],[ZipCode]],dZipNeighborhood[ZipCode],dZipNeighborhood[Neighborhood])","v":"Belltown"}]
["Construction","2020-07-14","Completed","NOV Issued","98106",{"$f":"_xlfn.XLOOKUP(--fSeattle2020Complaints[[#This Row],[ZipCode]],dZipNeighborhood[ZipCode],dZipNeighborhood[Neighborhood])","v":"Delridge"}]
["Land Use","2020-07-31","Completed","Completed","98108",{"$f":"_xlfn.XLOOKUP(--fSeattle2020Complaints[[#This Row],[ZipCode]],dZipNeighborhood[ZipCode],dZipNeighborhood[Neighborhood])","v":"Rainer Valley"}]
["Land Use","2020-03-18","Completed","Initiated","98107",{"$f":"_xlfn.XLOOKUP(--fSeattle2020Complaints[[#This Row],[ZipCode]],dZipNeighborhood[ZipCode],dZipNeighborhood[Neighborhood])","v":"Ballard"}]
["Weeds","2020-11-04","Completed","Completed","98199",{"$f":"_xlfn.XLOOKUP(--fSeattle2020Complaints[[#This Row],[ZipCode]],dZipNeighborhood[ZipCode],dZipNeighborhood[Neighborhood])","v":"Magnolia"}]
["LandLord/Tenant","2020-08-03","Completed","Closed","98125",{"$f":"_xlfn.XLOOKUP(--fSeattle2020Complaints[[#This Row],[ZipCode]],dZipNeighborhood[ZipCode],dZipNeighborhood[Neighborhood])","v":"Northgate"}]
["Land Use","2020-08-17","Completed","Completed","98118",{"$f":"_xlfn.XLOOKUP(--fSeattle2020Complaints[[#This Row],[ZipCode]],dZipNeighborhood[ZipCode],dZipNeighborhood[Neighborhood])","v":"Columbia City"}]
["Weeds","2020-05-12","Completed","Completed","98115",{"$f":"_xlfn.XLOOKUP(--fSeattle2020Complaints[[#This Row],[ZipCode]],dZipNeighborhood[ZipCode],dZipNeighborhood[Neighborhood])","v":"Greenlake"}]
["Land Use","2020-07-09","Completed","Completed","98122",{"$f":"_xlfn.XLOOKUP(--fSeattle2020Complaints[[#This Row],[ZipCode]],dZipNeighborhood[ZipCode],dZipNeighborhood[Neighborhood])","v":"Minor, Central Area"}]
["Construction","2020-08-01","Completed","Under Investigation","98108",{"$f":"_xlfn.XLOOKUP(--fSeattle2020Complaints[[#This Row],[ZipCode]],dZipNeighborhood[ZipCode],dZipNeighborhood[Neighborhood])","v":"Rainer Valley"}]
["Land Use","2020-07-15","Completed","Completed","98105",{"$f":"_xlfn.XLOOKUP(--fSeattle2020Complaints[[#This Row],[ZipCode]],dZipNeighborhood[ZipCode],dZipNeighborhood[Neighborhood])","v":"University District"}]
["Land Use","2020-04-27","Completed","NOV Issued","98105",{"$f":"_xlfn.XLOOKUP(--fSeattle2020Complaints[[#This Row],[ZipCode]],dZipNeighborhood[ZipCode],dZipNeighborhood[Neighborhood])","v":"University District"}]
["Weeds","2020-01-10","Completed","Completed","98126",{"$f":"_xlfn.XLOOKUP(--fSeattle2020Complaints[[#This Row],[ZipCode]],dZipNeighborhood[ZipCode],dZipNeighborhood[Neighborhood])","v":"High Point"}]
["Land Use","2020-04-20","Completed","Completed","98126",{"$f":"_xlfn.XLOOKUP(--fSeattle2020Complaints[[#This Row],[ZipCode]],dZipNeighborhood[ZipCode],dZipNeighborhood[Neighborhood])","v":"High Point"}]
["Weeds","2020-09-09","Completed","Completed","98115",{"$f":"_xlfn.XLOOKUP(--fSeattle2020Complaints[[#This Row],[ZipCode]],dZipNeighborhood[ZipCode],dZipNeighborhood[Neighborhood])","v":"Greenlake"}]
["Land Use","2020-11-02","Completed","Completed","98106",{"$f":"_xlfn.XLOOKUP(--fSeattle2020Complaints[[#This Row],[ZipCode]],dZipNeighborhood[ZipCode],dZipNeighborhood[Neighborhood])","v":"Delridge"}]
["Emergency","2020-01-03","Compliance Achieved","Referred to Law","98106",{"$f":"_xlfn.XLOOKUP(--fSeattle2020Complaints[[#This Row],[ZipCode]],dZipNeighborhood[ZipCode],dZipNeighborhood[Neighborhood])","v":"Delridge"}]
["Vacant Building","2020-09-18","Completed","Completed","98125",{"$f":"_xlfn.XLOOKUP(--fSeattle2020Complaints[[#This Row],[ZipCode]],dZipNeighborhood[ZipCode],dZipNeighborhood[Neighborhood])","v":"Northgate"}]
["Land Use","2020-10-16","Completed","Completed","98104",{"$f":"_xlfn.XLOOKUP(--fSeattle2020Complaints[[#This Row],[ZipCode]],dZipNeighborhood[ZipCode],dZipNeighborhood[Neighborhood])","v":"International District"}]
["Weeds","2020-07-08","Completed","Completed","98125",{"$f":"_xlfn.XLOOKUP(--fSeattle2020Complaints[[#This Row],[ZipCode]],dZipNeighborhood[ZipCode],dZipNeighborhood[Neighborhood])","v":"Northgate"}]
["Land Use","2020-12-16","Completed","Completed","98133",{"$f":"_xlfn.XLOOKUP(--fSeattle2020Complaints[[#This Row],[ZipCode]],dZipNeighborhood[ZipCode],dZipNeighborhood[Neighborhood])","v":"Shoreline"}]
["Land Use","2020-07-31","Completed","Completed","98117",{"$f":"_xlfn.XLOOKUP(--fSeattle2020Complaints[[#This Row],[ZipCode]],dZipNeighborhood[ZipCode],dZipNeighborhood[Neighborhood])","v":"Sunset Hill"}]
["Vacant Building","2020-10-20","Completed","Completed","98107",{"$f":"_xlfn.XLOOKUP(--fSeattle2020Complaints[[#This Row],[ZipCode]],dZipNeighborhood[ZipCode],dZipNeighborhood[Neighborhood])","v":"Ballard"}]
["Land Use","2020-05-19","Completed","Completed","98101",{"$f":"_xlfn.XLOOKUP(--fSeattle2020Complaints[[#This Row],[ZipCode]],dZipNeighborhood[ZipCode],dZipNeighborhood[Neighborhood])","v":"Seattle"}]
["Land Use","2020-05-11","Completed","Completed","98106",{"$f":"_xlfn.XLOOKUP(--fSeattle2020Complaints[[#This Row],[ZipCode]],dZipNeighborhood[ZipCode],dZipNeighborhood[Neighborhood])","v":"Delridge"}]
["Land Use","2020-07-11","No Access/Unable to Observe","Closed","98125",{"$f":"_xlfn.XLOOKUP(--fSeattle2020Complaints[[#This Row],[ZipCode]],dZipNeighborhood[ZipCode],dZipNeighborhood[Neighborhood])","v":"Northgate"}]
["Emergency , Vacant Building","2020-04-10","Completed","Completed","98118",{"$f":"_xlfn.XLOOKUP(--fSeattle2020Complaints[[#This Row],[ZipCode]],dZipNeighborhood[ZipCode],dZipNeighborhood[Neighborhood])","v":"Columbia City"}]
["Emergency , Vacant Building","2020-04-22","Compliance Achieved","Completed","98122",{"$f":"_xlfn.XLOOKUP(--fSeattle2020Complaints[[#This Row],[ZipCode]],dZipNeighborhood[ZipCode],dZipNeighborhood[Neighborhood])","v":"Minor, Central Area"}]
["Weeds","2020-01-17","Completed","Completed","98108",{"$f":"_xlfn.XLOOKUP(--fSeattle2020Complaints[[#This Row],[ZipCode]],dZipNeighborhood[ZipCode],dZipNeighborhood[Neighborhood])","v":"Rainer Valley"}]
["Construction","2020-07-08","Completed","Completed","98102",{"$f":"_xlfn.XLOOKUP(--fSeattle2020Complaints[[#This Row],[ZipCode]],dZipNeighborhood[ZipCode],dZipNeighborhood[Neighborhood])","v":"Capital Hill"}]
["Weeds","2020-02-07","Completed","Completed","98199",{"$f":"_xlfn.XLOOKUP(--fSeattle2020Complaints[[#This Row],[ZipCode]],dZipNeighborhood[ZipCode],dZipNeighborhood[Neighborhood])","v":"Magnolia"}]
["Land Use","2020-01-10","Completed","Completed","98144",{"$f":"_xlfn.XLOOKUP(--fSeattle2020Complaints[[#This Row],[ZipCode]],dZipNeighborhood[ZipCode],dZipNeighborhood[Neighborhood])","v":"Mount Baker"}]
["Weeds","2020-07-13","Completed","Completed","98108",{"$f":"_xlfn.XLOOKUP(--fSeattle2020Complaints[[#This Row],[ZipCode]],dZipNeighborhood[ZipCode],dZipNeighborhood[Neighborhood])","v":"Rainer Valley"}]
["Emergency , Vacant Building","2020-06-09","Completed","Completed","98103",{"$f":"_xlfn.XLOOKUP(--fSeattle2020Complaints[[#This Row],[ZipCode]],dZipNeighborhood[ZipCode],dZipNeighborhood[Neighborhood])","v":"Greenwood"}]
["Weeds","2020-06-19","Admin Closure","Completed","98122",{"$f":"_xlfn.XLOOKUP(--fSeattle2020Complaints[[#This Row],[ZipCode]],dZipNeighborhood[ZipCode],dZipNeighborhood[Neighborhood])","v":"Minor, Central Area"}]
["Construction","2020-01-13","Completed","Completed","98125",{"$f":"_xlfn.XLOOKUP(--fSeattle2020Complaints[[#This Row],[ZipCode]],dZipNeighborhood[ZipCode],dZipNeighborhood[Neighborhood])","v":"Northgate"}]
["Vacant Building","2020-03-13","Completed","NOV Issued","98115",{"$f":"_xlfn.XLOOKUP(--fSeattle2020Complaints[[#This Row],[ZipCode]],dZipNeighborhood[ZipCode],dZipNeighborhood[Neighborhood])","v":"Greenlake"}]
["Land Use","2020-10-07","Completed","Completed","98105",{"$f":"_xlfn.XLOOKUP(--fSeattle2020Complaints[[#This Row],[ZipCode]],dZipNeighborhood[ZipCode],dZipNeighborhood[Neighborhood])","v":"University District"}]
["Land Use","2020-08-27","Completed","Completed","98104",{"$f":"_xlfn.XLOOKUP(--fSeattle2020Complaints[[#This Row],[ZipCode]],dZipNeighborhood[ZipCode],dZipNeighborhood[Neighborhood])","v":"International District"}]
["Weeds","2020-10-09","Completed","Completed","98144",{"$f":"_xlfn.XLOOKUP(--fSeattle2020Complaints[[#This Row],[ZipCode]],dZipNeighborhood[ZipCode],dZipNeighborhood[Neighborhood])","v":"Mount Baker"}]
["Land Use","2020-04-24","Completed","Completed","98103",{"$f":"_xlfn.XLOOKUP(--fSeattle2020Complaints[[#This Row],[ZipCode]],dZipNeighborhood[ZipCode],dZipNeighborhood[Neighborhood])","v":"Greenwood"}]
["Land Use","2020-01-31","Completed","Completed","98119",{"$f":"_xlfn.XLOOKUP(--fSeattle2020Complaints[[#This Row],[ZipCode]],dZipNeighborhood[ZipCode],dZipNeighborhood[Neighborhood])","v":"Queen Anne"}]
["Weeds","2020-08-21","Completed","Completed","98115",{"$f":"_xlfn.XLOOKUP(--fSeattle2020Complaints[[#This Row],[ZipCode]],dZipNeighborhood[ZipCode],dZipNeighborhood[Neighborhood])","v":"Greenlake"}]
["Weeds","2020-03-15","Completed","Completed","98103",{"$f":"_xlfn.XLOOKUP(--fSeattle2020Complaints[[#This Row],[ZipCode]],dZipNeighborhood[ZipCode],dZipNeighborhood[Neighborhood])","v":"Greenwood"}]
["Weeds","2020-09-11","Completed","Completed","98103",{"$f":"_xlfn.XLOOKUP(--fSeattle2020Complaints[[#This Row],[ZipCode]],dZipNeighborhood[ZipCode],dZipNeighborhood[Neighborhood])","v":"Greenwood"}]
["Land UseConstruction ,","2020-04-20","Completed","Completed","98125",{"$f":"_xlfn.XLOOKUP(--fSeattle2020Complaints[[#This Row],[ZipCode]],dZipNeighborhood[ZipCode],dZipNeighborhood[Neighborhood])","v":"Northgate"}]
["Emergency , Vacant Building","2020-01-24","Completed","Completed","98105",{"$f":"_xlfn.XLOOKUP(--fSeattle2020Complaints[[#This Row],[ZipCode]],dZipNeighborhood[ZipCode],dZipNeighborhood[Neighborhood])","v":"University District"}]
["Land Use","2020-10-06","Compliance Achieved","Completed","98107",{"$f":"_xlfn.XLOOKUP(--fSeattle2020Complaints[[#This Row],[ZipCode]],dZipNeighborhood[ZipCode],dZipNeighborhood[Neighborhood])","v":"Ballard"}]
["Weeds","2020-08-20","Completed","Completed","98118",{"$f":"_xlfn.XLOOKUP(--fSeattle2020Complaints[[#This Row],[ZipCode]],dZipNeighborhood[ZipCode],dZipNeighborhood[Neighborhood])","v":"Columbia City"}]
["Construction","2020-04-10","Completed","Completed","98115",{"$f":"_xlfn.XLOOKUP(--fSeattle2020Complaints[[#This Row],[ZipCode]],dZipNeighborhood[ZipCode],dZipNeighborhood[Neighborhood])","v":"Greenlake"}]
["Tree","2020-09-24","Completed","Completed","98126",{"$f":"_xlfn.XLOOKUP(--fSeattle2020Complaints[[#This Row],[ZipCode]],dZipNeighborhood[ZipCode],dZipNeighborhood[Neighborhood])","v":"High Point"}]
["Emergency , Vacant Building","2020-07-14","Compliance Achieved","Completed","98125",{"$f":"_xlfn.XLOOKUP(--fSeattle2020Complaints[[#This Row],[ZipCode]],dZipNeighborhood[ZipCode],dZipNeighborhood[Neighborhood])","v":"Northgate"}]
["Noise","2020-12-15","Completed","Completed","98126",{"$f":"_xlfn.XLOOKUP(--fSeattle2020Complaints[[#This Row],[ZipCode]],dZipNeighborhood[ZipCode],dZipNeighborhood[Neighborhood])","v":"High Point"}]
["Tree","2020-08-07","Completed","Completed","98107",{"$f":"_xlfn.XLOOKUP(--fSeattle2020Complaints[[#This Row],[ZipCode]],dZipNeighborhood[ZipCode],dZipNeighborhood[Neighborhood])","v":"Ballard"}]
["Vacant Building","2020-03-23","Completed","Closed","98133",{"$f":"_xlfn.XLOOKUP(--fSeattle2020Complaints[[#This Row],[ZipCode]],dZipNeighborhood[ZipCode],dZipNeighborhood[Neighborhood])","v":"Shoreline"}]
["Weeds","2020-01-09","Completed","Completed","98106",{"$f":"_xlfn.XLOOKUP(--fSeattle2020Complaints[[#This Row],[ZipCode]],dZipNeighborhood[ZipCode],dZipNeighborhood[Neighborhood])","v":"Delridge"}]
["Weeds","2020-08-28","Completed","Completed","98109",{"$f":"_xlfn.XLOOKUP(--fSeattle2020Complaints[[#This Row],[ZipCode]],dZipNeighborhood[ZipCode],dZipNeighborhood[Neighborhood])","v":"South Lake Union"}]
["Land Use","2020-05-08","Completed","Completed","98126",{"$f":"_xlfn.XLOOKUP(--fSeattle2020Complaints[[#This Row],[ZipCode]],dZipNeighborhood[ZipCode],dZipNeighborhood[Neighborhood])","v":"High Point"}]
["Land Use","2020-09-28","Completed","Completed","98125",{"$f":"_xlfn.XLOOKUP(--fSeattle2020Complaints[[#This Row],[ZipCode]],dZipNeighborhood[ZipCode],dZipNeighborhood[Neighborhood])","v":"Northgate"}]
["Emergency , Vacant Building","2020-02-06","Completed","Completed","98105",{"$f":"_xlfn.XLOOKUP(--fSeattle2020Complaints[[#This Row],[ZipCode]],dZipNeighborhood[ZipCode],dZipNeighborhood[Neighborhood])","v":"University District"}]
["Land Use","2020-07-27","Completed","Completed","98144",{"$f":"_xlfn.XLOOKUP(--fSeattle2020Complaints[[#This Row],[ZipCode]],dZipNeighborhood[ZipCode],dZipNeighborhood[Neighborhood])","v":"Mount Baker"}]
["Land Use","2020-08-12","Completed","Completed","98133",{"$f":"_xlfn.XLOOKUP(--fSeattle2020Complaints[[#This Row],[ZipCode]],dZipNeighborhood[ZipCode],dZipNeighborhood[Neighborhood])","v":"Shoreline"}]
["Weeds","2020-06-13","Completed","Completed","98103",{"$f":"_xlfn.XLOOKUP(--fSeattle2020Complaints[[#This Row],[ZipCode]],dZipNeighborhood[ZipCode],dZipNeighborhood[Neighborhood])","v":"Greenwood"}]
["Weeds","2020-09-18","Completed","Completed","98117",{"$f":"_xlfn.XLOOKUP(--fSeattle2020Complaints[[#This Row],[ZipCode]],dZipNeighborhood[ZipCode],dZipNeighborhood[Neighborhood])","v":"Sunset Hill"}]
["Weeds","2020-07-11","Completed","Completed","98112",{"$f":"_xlfn.XLOOKUP(--fSeattle2020Complaints[[#This Row],[ZipCode]],dZipNeighborhood[ZipCode],dZipNeighborhood[Neighborhood])","v":"Madison Park"}]
["Land Use","2020-06-17","Completed","Completed","98122",{"$f":"_xlfn.XLOOKUP(--fSeattle2020Complaints[[#This Row],[ZipCode]],dZipNeighborhood[ZipCode],dZipNeighborhood[Neighborhood])","v":"Minor, Central Area"}]
["Land Use","2020-08-12","Completed","Completed","98105",{"$f":"_xlfn.XLOOKUP(--fSeattle2020Complaints[[#This Row],[ZipCode]],dZipNeighborhood[ZipCode],dZipNeighborhood[Neighborhood])","v":"University District"}]
["Land UseTree ,","2020-11-02","Completed","Completed","98177",{"$f":"_xlfn.XLOOKUP(--fSeattle2020Complaints[[#This Row],[ZipCode]],dZipNeighborhood[ZipCode],dZipNeighborhood[Neighborhood])","v":"Richmond Beach"}]
["Construction","2020-07-01","Completed","Hazard Correction Order Issued","98104",{"$f":"_xlfn.XLOOKUP(--fSeattle2020Complaints[[#This Row],[ZipCode]],dZipNeighborhood[ZipCode],dZipNeighborhood[Neighborhood])","v":"International District"}]
["Construction , ECA","2020-10-04","Completed","Completed","98133",{"$f":"_xlfn.XLOOKUP(--fSeattle2020Complaints[[#This Row],[ZipCode]],dZipNeighborhood[ZipCode],dZipNeighborhood[Neighborhood])","v":"Shoreline"}]
["Construction , Noise","2020-05-02","Completed","Completed","98136",{"$f":"_xlfn.XLOOKUP(--fSeattle2020Complaints[[#This Row],[ZipCode]],dZipNeighborhood[ZipCode],dZipNeighborhood[Neighborhood])","v":"Seaview"}]
["Weeds","2020-02-05","Compliance Achieved","Completed","98112",{"$f":"_xlfn.XLOOKUP(--fSeattle2020Complaints[[#This Row],[ZipCode]],dZipNeighborhood[ZipCode],dZipNeighborhood[Neighborhood])","v":"Madison Park"}]
["Construction","2020-06-02","Completed","Completed","98122",{"$f":"_xlfn.XLOOKUP(--fSeattle2020Complaints[[#This Row],[ZipCode]],dZipNeighborhood[ZipCode],dZipNeighborhood[Neighborhood])","v":"Minor, Central Area"}]
["Weeds","2020-06-14","Completed","Completed","98108",{"$f":"_xlfn.XLOOKUP(--fSeattle2020Complaints[[#This Row],[ZipCode]],dZipNeighborhood[ZipCode],dZipNeighborhood[Neighborhood])","v":"Rainer Valley"}]
["Construction","2020-04-01","Completed","Completed","98112",{"$f":"_xlfn.XLOOKUP(--fSeattle2020Complaints[[#This Row],[ZipCode]],dZipNeighborhood[ZipCode],dZipNeighborhood[Neighborhood])","v":"Madison Park"}]
["Tree","2020-03-26","Completed","Completed","98133",{"$f":"_xlfn.XLOOKUP(--fSeattle2020Complaints[[#This Row],[ZipCode]],dZipNeighborhood[ZipCode],dZipNeighborhood[Neighborhood])","v":"Shoreline"}]
["Land Use","2020-01-23","Completed","Completed","98107",{"$f":"_xlfn.XLOOKUP(--fSeattle2020Complaints[[#This Row],[ZipCode]],dZipNeighborhood[ZipCode],dZipNeighborhood[Neighborhood])","v":"Ballard"}]
["Weeds","2020-10-26","Completed","Completed","98117",{"$f":"_xlfn.XLOOKUP(--fSeattle2020Complaints[[#This Row],[ZipCode]],dZipNeighborhood[ZipCode],dZipNeighborhood[Neighborhood])","v":"Sunset Hill"}]
["Construction","2020-12-05","Completed","Completed","98118",{"$f":"_xlfn.XLOOKUP(--fSeattle2020Complaints[[#This Row],[ZipCode]],dZipNeighborhood[ZipCode],dZipNeighborhood[Neighborhood])","v":"Columbia City"}]
["Vacant Building","2020-01-22","Completed","Closed","98107",{"$f":"_xlfn.XLOOKUP(--fSeattle2020Complaints[[#This Row],[ZipCode]],dZipNeighborhood[ZipCode],dZipNeighborhood[Neighborhood])","v":"Ballard"}]
["Weeds","2020-09-21","Completed","Completed","98117",{"$f":"_xlfn.XLOOKUP(--fSeattle2020Complaints[[#This Row],[ZipCode]],dZipNeighborhood[ZipCode],dZipNeighborhood[Neighborhood])","v":"Sunset Hill"}]
["Weeds","2020-07-24","Completed","Completed","98115",{"$f":"_xlfn.XLOOKUP(--fSeattle2020Complaints[[#This Row],[ZipCode]],dZipNeighborhood[ZipCode],dZipNeighborhood[Neighborhood])","v":"Greenlake"}]
["Land Use","2020-06-01","Completed","Completed","98103",{"$f":"_xlfn.XLOOKUP(--fSeattle2020Complaints[[#This Row],[ZipCode]],dZipNeighborhood[ZipCode],dZipNeighborhood[Neighborhood])","v":"Greenwood"}]
["Weeds","2020-03-12","Completed","Completed","98103",{"$f":"_xlfn.XLOOKUP(--fSeattle2020Complaints[[#This Row],[ZipCode]],dZipNeighborhood[ZipCode],dZipNeighborhood[Neighborhood])","v":"Greenwood"}]
["Tree","2020-06-08","Completed","Completed","98107",{"$f":"_xlfn.XLOOKUP(--fSeattle2020Complaints[[#This Row],[ZipCode]],dZipNeighborhood[ZipCode],dZipNeighborhood[Neighborhood])","v":"Ballard"}]
["LandLord/Tenant","2020-09-21","Completed","Completed","98121",{"$f":"_xlfn.XLOOKUP(--fSeattle2020Complaints[[#This Row],[ZipCode]],dZipNeighborhood[ZipCode],dZipNeighborhood[Neighborhood])","v":"Belltown"}]
["Land Use","2020-04-08","Completed","Completed","98118",{"$f":"_xlfn.XLOOKUP(--fSeattle2020Complaints[[#This Row],[ZipCode]],dZipNeighborhood[ZipCode],dZipNeighborhood[Neighborhood])","v":"Columbia City"}]
["Land Use","2020-07-17","Completed","Completed","98105",{"$f":"_xlfn.XLOOKUP(--fSeattle2020Complaints[[#This Row],[ZipCode]],dZipNeighborhood[ZipCode],dZipNeighborhood[Neighborhood])","v":"University District"}]
["LandLord/Tenant","2020-07-28","No Access/Unable to Observe","Completed","98178",{"$f":"_xlfn.XLOOKUP(--fSeattle2020Complaints[[#This Row],[ZipCode]],dZipNeighborhood[ZipCode],dZipNeighborhood[Neighborhood])","v":"Skyway"}]
["Weeds","2020-06-03","Completed","Completed","98144",{"$f":"_xlfn.XLOOKUP(--fSeattle2020Complaints[[#This Row],[ZipCode]],dZipNeighborhood[ZipCode],dZipNeighborhood[Neighborhood])","v":"Mount Baker"}]
["Construction","2020-01-03","Completed","NOV Issued","98105",{"$f":"_xlfn.XLOOKUP(--fSeattle2020Complaints[[#This Row],[ZipCode]],dZipNeighborhood[ZipCode],dZipNeighborhood[Neighborhood])","v":"University District"}]
["Land Use","2020-02-03","Completed","Completed","98118",{"$f":"_xlfn.XLOOKUP(--fSeattle2020Complaints[[#This Row],[ZipCode]],dZipNeighborhood[ZipCode],dZipNeighborhood[Neighborhood])","v":"Columbia City"}]
["Emergency , Vacant Building","2020-01-24","Completed","Completed","98105",{"$f":"_xlfn.XLOOKUP(--fSeattle2020Complaints[[#This Row],[ZipCode]],dZipNeighborhood[ZipCode],dZipNeighborhood[Neighborhood])","v":"University District"}]
["Vacant Building","2020-06-02","Completed","Completed","98107",{"$f":"_xlfn.XLOOKUP(--fSeattle2020Complaints[[#This Row],[ZipCode]],dZipNeighborhood[ZipCode],dZipNeighborhood[Neighborhood])","v":"Ballard"}]
["Emergency , LandLord/Tenant","2020-03-20","Compliance Achieved","Completed","98144",{"$f":"_xlfn.XLOOKUP(--fSeattle2020Complaints[[#This Row],[ZipCode]],dZipNeighborhood[ZipCode],dZipNeighborhood[Neighborhood])","v":"Mount Baker"}]
["Land Use","2020-01-08","Completed","Completed","98178",{"$f":"_xlfn.XLOOKUP(--fSeattle2020Complaints[[#This Row],[ZipCode]],dZipNeighborhood[ZipCode],dZipNeighborhood[Neighborhood])","v":"Skyway"}]
["Construction","2020-08-05","Completed","Completed","98133",{"$f":"_xlfn.XLOOKUP(--fSeattle2020Complaints[[#This Row],[ZipCode]],dZipNeighborhood[ZipCode],dZipNeighborhood[Neighborhood])","v":"Shoreline"}]
["Vacant Building","2020-03-23","Completed","NOV Issued","98104",{"$f":"_xlfn.XLOOKUP(--fSeattle2020Complaints[[#This Row],[ZipCode]],dZipNeighborhood[ZipCode],dZipNeighborhood[Neighborhood])","v":"International District"}]
["Weeds","2020-06-16","Compliance Achieved","Completed","98115",{"$f":"_xlfn.XLOOKUP(--fSeattle2020Complaints[[#This Row],[ZipCode]],dZipNeighborhood[ZipCode],dZipNeighborhood[Neighborhood])","v":"Greenlake"}]
["Land Use","2020-05-28","Completed","Completed","98144",{"$f":"_xlfn.XLOOKUP(--fSeattle2020Complaints[[#This Row],[ZipCode]],dZipNeighborhood[ZipCode],dZipNeighborhood[Neighborhood])","v":"Mount Baker"}]
["Vacant Building","2020-06-24","Completed","Completed","98144",{"$f":"_xlfn.XLOOKUP(--fSeattle2020Complaints[[#This Row],[ZipCode]],dZipNeighborhood[ZipCode],dZipNeighborhood[Neighborhood])","v":"Mount Baker"}]
["Noise","2020-01-30","Completed","Completed","98107",{"$f":"_xlfn.XLOOKUP(--fSeattle2020Complaints[[#This Row],[ZipCode]],dZipNeighborhood[ZipCode],dZipNeighborhood[Neighborhood])","v":"Ballard"}]
["Weeds","2020-01-22","Compliance Achieved","Completed","98104",{"$f":"_xlfn.XLOOKUP(--fSeattle2020Complaints[[#This Row],[ZipCode]],dZipNeighborhood[ZipCode],dZipNeighborhood[Neighborhood])","v":"International District"}]
["Weeds","2020-03-13","Completed","Warning","98108",{"$f":"_xlfn.XLOOKUP(--fSeattle2020Complaints[[#This Row],[ZipCode]],dZipNeighborhood[ZipCode],dZipNeighborhood[Neighborhood])","v":"Rainer Valley"}]
["Land Use","2020-01-17","Compliance Achieved","Completed","98118",{"$f":"_xlfn.XLOOKUP(--fSeattle2020Complaints[[#This Row],[ZipCode]],dZipNeighborhood[ZipCode],dZipNeighborhood[Neighborhood])","v":"Columbia City"}]
["Construction","2020-03-23","Completed","Completed","98109",{"$f":"_xlfn.XLOOKUP(--fSeattle2020Complaints[[#This Row],[ZipCode]],dZipNeighborhood[ZipCode],dZipNeighborhood[Neighborhood])","v":"South Lake Union"}]
["Weeds","2020-10-19","Completed","Completed","98115",{"$f":"_xlfn.XLOOKUP(--fSeattle2020Complaints[[#This Row],[ZipCode]],dZipNeighborhood[ZipCode],dZipNeighborhood[Neighborhood])","v":"Greenlake"}]
["Weeds","2020-09-07","Completed","Completed","98118",{"$f":"_xlfn.XLOOKUP(--fSeattle2020Complaints[[#This Row],[ZipCode]],dZipNeighborhood[ZipCode],dZipNeighborhood[Neighborhood])","v":"Columbia City"}]
["Construction","2020-08-10","Completed","Completed","98122",{"$f":"_xlfn.XLOOKUP(--fSeattle2020Complaints[[#This Row],[ZipCode]],dZipNeighborhood[ZipCode],dZipNeighborhood[Neighborhood])","v":"Minor, Central Area"}]
["Weeds","2020-06-15","Completed","Completed","98118",{"$f":"_xlfn.XLOOKUP(--fSeattle2020Complaints[[#This Row],[ZipCode]],dZipNeighborhood[ZipCode],dZipNeighborhood[Neighborhood])","v":"Columbia City"}]
["Weeds","2020-07-16","Completed","Completed","98126",{"$f":"_xlfn.XLOOKUP(--fSeattle2020Complaints[[#This Row],[ZipCode]],dZipNeighborhood[ZipCode],dZipNeighborhood[Neighborhood])","v":"High Point"}]
["Land Use","2020-12-14","Completed","Under Investigation","98117",{"$f":"_xlfn.XLOOKUP(--fSeattle2020Complaints[[#This Row],[ZipCode]],dZipNeighborhood[ZipCode],dZipNeighborhood[Neighborhood])","v":"Sunset Hill"}]
["LandLord/Tenant","2020-02-20","Completed","Completed","98105",{"$f":"_xlfn.XLOOKUP(--fSeattle2020Complaints[[#This Row],[ZipCode]],dZipNeighborhood[ZipCode],dZipNeighborhood[Neighborhood])","v":"University District"}]
["Weeds","2020-03-04","Completed","Closed","98144",{"$f":"_xlfn.XLOOKUP(--fSeattle2020Complaints[[#This Row],[ZipCode]],dZipNeighborhood[ZipCode],dZipNeighborhood[Neighborhood])","v":"Mount Baker"}]
["Land Use","2020-08-21","Completed","Completed","98126",{"$f":"_xlfn.XLOOKUP(--fSeattle2020Complaints[[#This Row],[ZipCode]],dZipNeighborhood[ZipCode],dZipNeighborhood[Neighborhood])","v":"High Point"}]
["Land Use","2020-03-13","Compliance Achieved","Completed","98103",{"$f":"_xlfn.XLOOKUP(--fSeattle2020Complaints[[#This Row],[ZipCode]],dZipNeighborhood[ZipCode],dZipNeighborhood[Neighborhood])","v":"Greenwood"}]
["Land Use","2020-03-13","Completed","Completed","98108",{"$f":"_xlfn.XLOOKUP(--fSeattle2020Complaints[[#This Row],[ZipCode]],dZipNeighborhood[ZipCode],dZipNeighborhood[Neighborhood])","v":"Rainer Valley"}]
["Weeds","2020-09-04","Completed","Completed","98115",{"$f":"_xlfn.XLOOKUP(--fSeattle2020Complaints[[#This Row],[ZipCode]],dZipNeighborhood[ZipCode],dZipNeighborhood[Neighborhood])","v":"Greenlake"}]
["Vacant Building","2020-07-15","Compliance Achieved","Completed","98112",{"$f":"_xlfn.XLOOKUP(--fSeattle2020Complaints[[#This Row],[ZipCode]],dZipNeighborhood[ZipCode],dZipNeighborhood[Neighborhood])","v":"Madison Park"}]
["Land Use","2020-02-19","Completed","Warning","98103",{"$f":"_xlfn.XLOOKUP(--fSeattle2020Complaints[[#This Row],[ZipCode]],dZipNeighborhood[ZipCode],dZipNeighborhood[Neighborhood])","v":"Greenwood"}]
["Weeds","2020-07-11","Completed","Completed","98108",{"$f":"_xlfn.XLOOKUP(--fSeattle2020Complaints[[#This Row],[ZipCode]],dZipNeighborhood[ZipCode],dZipNeighborhood[Neighborhood])","v":"Rainer Valley"}]
["Land Use","2020-08-18","Completed","Completed","98144",{"$f":"_xlfn.XLOOKUP(--fSeattle2020Complaints[[#This Row],[ZipCode]],dZipNeighborhood[ZipCode],dZipNeighborhood[Neighborhood])","v":"Mount Baker"}]
["Vacant Building","2020-03-04","Completed","Completed","98107",{"$f":"_xlfn.XLOOKUP(--fSeattle2020Complaints[[#This Row],[ZipCode]],dZipNeighborhood[ZipCode],dZipNeighborhood[Neighborhood])","v":"Ballard"}]
["Tree","2020-08-19","No Access/Unable to Observe","Completed","98199",{"$f":"_xlfn.XLOOKUP(--fSeattle2020Complaints[[#This Row],[ZipCode]],dZipNeighborhood[ZipCode],dZipNeighborhood[Neighborhood])","v":"Magnolia"}]
["Construction","2020-08-07","Completed","Closed","98109",{"$f":"_xlfn.XLOOKUP(--fSeattle2020Complaints[[#This Row],[ZipCode]],dZipNeighborhood[ZipCode],dZipNeighborhood[Neighborhood])","v":"South Lake Union"}]
["Land Use","2020-01-07","Completed","Completed","98117",{"$f":"_xlfn.XLOOKUP(--fSeattle2020Complaints[[#This Row],[ZipCode]],dZipNeighborhood[ZipCode],dZipNeighborhood[Neighborhood])","v":"Sunset Hill"}]
["Land Use","2020-01-12","Completed","Completed","98112",{"$f":"_xlfn.XLOOKUP(--fSeattle2020Complaints[[#This Row],[ZipCode]],dZipNeighborhood[ZipCode],dZipNeighborhood[Neighborhood])","v":"Madison Park"}]
["Construction","2020-09-30","Completed","Completed","98112",{"$f":"_xlfn.XLOOKUP(--fSeattle2020Complaints[[#This Row],[ZipCode]],dZipNeighborhood[ZipCode],dZipNeighborhood[Neighborhood])","v":"Madison Park"}]
["Construction","2020-07-21","Completed","Completed","98199",{"$f":"_xlfn.XLOOKUP(--fSeattle2020Complaints[[#This Row],[ZipCode]],dZipNeighborhood[ZipCode],dZipNeighborhood[Neighborhood])","v":"Magnolia"}]
["Land Use","2020-02-10","Completed","Completed","98105",{"$f":"_xlfn.XLOOKUP(--fSeattle2020Complaints[[#This Row],[ZipCode]],dZipNeighborhood[ZipCode],dZipNeighborhood[Neighborhood])","v":"University District"}]
["Land Use","2020-04-23","Completed","Completed","98112",{"$f":"_xlfn.XLOOKUP(--fSeattle2020Complaints[[#This Row],[ZipCode]],dZipNeighborhood[ZipCode],dZipNeighborhood[Neighborhood])","v":"Madison Park"}]
["Shoreline","2020-12-29","Completed","Completed","98118",{"$f":"_xlfn.XLOOKUP(--fSeattle2020Complaints[[#This Row],[ZipCode]],dZipNeighborhood[ZipCode],dZipNeighborhood[Neighborhood])","v":"Columbia City"}]
["Land UseECA ,","2020-08-26","Completed","Completed","98106",{"$f":"_xlfn.XLOOKUP(--fSeattle2020Complaints[[#This Row],[ZipCode]],dZipNeighborhood[ZipCode],dZipNeighborhood[Neighborhood])","v":"Delridge"}]
["Weeds","2020-02-19","Completed","Completed","98103",{"$f":"_xlfn.XLOOKUP(--fSeattle2020Complaints[[#This Row],[ZipCode]],dZipNeighborhood[ZipCode],dZipNeighborhood[Neighborhood])","v":"Greenwood"}]
["Land Use","2020-08-17","Admin Closure","Completed","98103",{"$f":"_xlfn.XLOOKUP(--fSeattle2020Complaints[[#This Row],[ZipCode]],dZipNeighborhood[ZipCode],dZipNeighborhood[Neighborhood])","v":"Greenwood"}]
["Land Use","2020-05-27","Completed","Completed","98144",{"$f":"_xlfn.XLOOKUP(--fSeattle2020Complaints[[#This Row],[ZipCode]],dZipNeighborhood[ZipCode],dZipNeighborhood[Neighborhood])","v":"Mount Baker"}]
["Weeds","2020-03-27","Compliance Achieved","Completed","98103",{"$f":"_xlfn.XLOOKUP(--fSeattle2020Complaints[[#This Row],[ZipCode]],dZipNeighborhood[ZipCode],dZipNeighborhood[Neighborhood])","v":"Greenwood"}]
["Tree","2020-05-07","Completed","Completed","98102",{"$f":"_xlfn.XLOOKUP(--fSeattle2020Complaints[[#This Row],[ZipCode]],dZipNeighborhood[ZipCode],dZipNeighborhood[Neighborhood])","v":"Capital Hill"}]
["Noise","2020-06-04","Completed","Completed","98103",{"$f":"_xlfn.XLOOKUP(--fSeattle2020Complaints[[#This Row],[ZipCode]],dZipNeighborhood[ZipCode],dZipNeighborhood[Neighborhood])","v":"Greenwood"}]
["Land Use","2020-08-03","No Access/Unable to Observe","Completed","98108",{"$f":"_xlfn.XLOOKUP(--fSeattle2020Complaints[[#This Row],[ZipCode]],dZipNeighborhood[ZipCode],dZipNeighborhood[Neighborhood])","v":"Rainer Valley"}]
["Vacant Building","2020-02-20","No Access/Unable to Observe","Completed","98101",{"$f":"_xlfn.XLOOKUP(--fSeattle2020Complaints[[#This Row],[ZipCode]],dZipNeighborhood[ZipCode],dZipNeighborhood[Neighborhood])","v":"Seattle"}]
["Construction","2020-12-07","Completed","Completed","98117",{"$f":"_xlfn.XLOOKUP(--fSeattle2020Complaints[[#This Row],[ZipCode]],dZipNeighborhood[ZipCode],dZipNeighborhood[Neighborhood])","v":"Sunset Hill"}]
["Construction","2020-07-30","Completed","Completed","98107",{"$f":"_xlfn.XLOOKUP(--fSeattle2020Complaints[[#This Row],[ZipCode]],dZipNeighborhood[ZipCode],dZipNeighborhood[Neighborhood])","v":"Ballard"}]
["Construction , Emergency","2020-02-28","Completed","Closed","98144",{"$f":"_xlfn.XLOOKUP(--fSeattle2020Complaints[[#This Row],[ZipCode]],dZipNeighborhood[ZipCode],dZipNeighborhood[Neighborhood])","v":"Mount Baker"}]
["Land Use","2020-03-30","Completed","Completed","98112",{"$f":"_xlfn.XLOOKUP(--fSeattle2020Complaints[[#This Row],[ZipCode]],dZipNeighborhood[ZipCode],dZipNeighborhood[Neighborhood])","v":"Madison Park"}]
["Weeds","2020-05-18","Compliance Achieved","Completed","98115",{"$f":"_xlfn.XLOOKUP(--fSeattle2020Complaints[[#This Row],[ZipCode]],dZipNeighborhood[ZipCode],dZipNeighborhood[Neighborhood])","v":"Greenlake"}]
["Construction","2020-01-08","Completed","Completed","98199",{"$f":"_xlfn.XLOOKUP(--fSeattle2020Complaints[[#This Row],[ZipCode]],dZipNeighborhood[ZipCode],dZipNeighborhood[Neighborhood])","v":"Magnolia"}]
["Weeds","2020-06-30","Completed","Completed","98112",{"$f":"_xlfn.XLOOKUP(--fSeattle2020Complaints[[#This Row],[ZipCode]],dZipNeighborhood[ZipCode],dZipNeighborhood[Neighborhood])","v":"Madison Park"}]
["Construction , Tree","2020-08-06","Completed","Completed","98199",{"$f":"_xlfn.XLOOKUP(--fSeattle2020Complaints[[#This Row],[ZipCode]],dZipNeighborhood[ZipCode],dZipNeighborhood[Neighborhood])","v":"Magnolia"}]
["Construction","2020-04-09","Completed","Completed","98125",{"$f":"_xlfn.XLOOKUP(--fSeattle2020Complaints[[#This Row],[ZipCode]],dZipNeighborhood[ZipCode],dZipNeighborhood[Neighborhood])","v":"Northgate"}]
["Construction","2020-10-12","Completed","Completed","98112",{"$f":"_xlfn.XLOOKUP(--fSeattle2020Complaints[[#This Row],[ZipCode]],dZipNeighborhood[ZipCode],dZipNeighborhood[Neighborhood])","v":"Madison Park"}]
["Construction","2020-01-30","Completed","Completed","98199",{"$f":"_xlfn.XLOOKUP(--fSeattle2020Complaints[[#This Row],[ZipCode]],dZipNeighborhood[ZipCode],dZipNeighborhood[Neighborhood])","v":"Magnolia"}]
["Land Use","2020-02-28","Completed","Completed","98106",{"$f":"_xlfn.XLOOKUP(--fSeattle2020Complaints[[#This Row],[ZipCode]],dZipNeighborhood[ZipCode],dZipNeighborhood[Neighborhood])","v":"Delridge"}]
["Land Use","2020-07-27","Completed","Completed","98126",{"$f":"_xlfn.XLOOKUP(--fSeattle2020Complaints[[#This Row],[ZipCode]],dZipNeighborhood[ZipCode],dZipNeighborhood[Neighborhood])","v":"High Point"}]
["Land Use","2020-07-23","Completed","Completed","98106",{"$f":"_xlfn.XLOOKUP(--fSeattle2020Complaints[[#This Row],[ZipCode]],dZipNeighborhood[ZipCode],dZipNeighborhood[Neighborhood])","v":"Delridge"}]
["Weeds","2020-11-09","Completed","Completed","98122",{"$f":"_xlfn.XLOOKUP(--fSeattle2020Complaints[[#This Row],[ZipCode]],dZipNeighborhood[ZipCode],dZipNeighborhood[Neighborhood])","v":"Minor, Central Area"}]
["Land Use","2020-05-28","Completed","Completed","98118",{"$f":"_xlfn.XLOOKUP(--fSeattle2020Complaints[[#This Row],[ZipCode]],dZipNeighborhood[ZipCode],dZipNeighborhood[Neighborhood])","v":"Columbia City"}]
["Land Use","2020-01-12","Completed","Completed","98109",{"$f":"_xlfn.XLOOKUP(--fSeattle2020Complaints[[#This Row],[ZipCode]],dZipNeighborhood[ZipCode],dZipNeighborhood[Neighborhood])","v":"South Lake Union"}]
["Vacant Building","2020-02-25","Completed","Completed","98119",{"$f":"_xlfn.XLOOKUP(--fSeattle2020Complaints[[#This Row],[ZipCode]],dZipNeighborhood[ZipCode],dZipNeighborhood[Neighborhood])","v":"Queen Anne"}]
["Land Use","2020-03-03","Completed","Completed","98112",{"$f":"_xlfn.XLOOKUP(--fSeattle2020Complaints[[#This Row],[ZipCode]],dZipNeighborhood[ZipCode],dZipNeighborhood[Neighborhood])","v":"Madison Park"}]
["Weeds","2020-06-11","Completed","Completed","98122",{"$f":"_xlfn.XLOOKUP(--fSeattle2020Complaints[[#This Row],[ZipCode]],dZipNeighborhood[ZipCode],dZipNeighborhood[Neighborhood])","v":"Minor, Central Area"}]
["Tree","2020-10-09","Completed","Completed","98107",{"$f":"_xlfn.XLOOKUP(--fSeattle2020Complaints[[#This Row],[ZipCode]],dZipNeighborhood[ZipCode],dZipNeighborhood[Neighborhood])","v":"Ballard"}]
["Weeds","2020-05-20","Completed","Completed","98107",{"$f":"_xlfn.XLOOKUP(--fSeattle2020Complaints[[#This Row],[ZipCode]],dZipNeighborhood[ZipCode],dZipNeighborhood[Neighborhood])","v":"Ballard"}]
["Construction","2020-02-12","Completed","Completed","98103",{"$f":"_xlfn.XLOOKUP(--fSeattle2020Complaints[[#This Row],[ZipCode]],dZipNeighborhood[ZipCode],dZipNeighborhood[Neighborhood])","v":"Greenwood"}]
["Construction","2020-03-11","Completed","Completed","98199",{"$f":"_xlfn.XLOOKUP(--fSeattle2020Complaints[[#This Row],[ZipCode]],dZipNeighborhood[ZipCode],dZipNeighborhood[Neighborhood])","v":"Magnolia"}]
["Land Use","2020-08-28","Completed","Completed","98126",{"$f":"_xlfn.XLOOKUP(--fSeattle2020Complaints[[#This Row],[ZipCode]],dZipNeighborhood[ZipCode],dZipNeighborhood[Neighborhood])","v":"High Point"}]
["Emergency , Vacant Building","2020-08-05","Completed","Completed","98144",{"$f":"_xlfn.XLOOKUP(--fSeattle2020Complaints[[#This Row],[ZipCode]],dZipNeighborhood[ZipCode],dZipNeighborhood[Neighborhood])","v":"Mount Baker"}]
["Vacant Building","2020-09-02","Completed","Completed","98144",{"$f":"_xlfn.XLOOKUP(--fSeattle2020Complaints[[#This Row],[ZipCode]],dZipNeighborhood[ZipCode],dZipNeighborhood[Neighborhood])","v":"Mount Baker"}]
["Construction","2020-05-11","Completed","Completed","98108",{"$f":"_xlfn.XLOOKUP(--fSeattle2020Complaints[[#This Row],[ZipCode]],dZipNeighborhood[ZipCode],dZipNeighborhood[Neighborhood])","v":"Rainer Valley"}]
["Land Use","2020-01-29","Completed","Completed","98122",{"$f":"_xlfn.XLOOKUP(--fSeattle2020Complaints[[#This Row],[ZipCode]],dZipNeighborhood[ZipCode],dZipNeighborhood[Neighborhood])","v":"Minor, Central Area"}]
["Land Use","2020-01-21","Completed","Completed","98108",{"$f":"_xlfn.XLOOKUP(--fSeattle2020Complaints[[#This Row],[ZipCode]],dZipNeighborhood[ZipCode],dZipNeighborhood[Neighborhood])","v":"Rainer Valley"}]
["Weeds","2020-11-09","Completed","Completed","98119",{"$f":"_xlfn.XLOOKUP(--fSeattle2020Complaints[[#This Row],[ZipCode]],dZipNeighborhood[ZipCode],dZipNeighborhood[Neighborhood])","v":"Queen Anne"}]
["Weeds","2020-11-01","Completed","Completed","98108",{"$f":"_xlfn.XLOOKUP(--fSeattle2020Complaints[[#This Row],[ZipCode]],dZipNeighborhood[ZipCode],dZipNeighborhood[Neighborhood])","v":"Rainer Valley"}]
["Land Use","2020-08-06","No Access/Unable to Observe","Completed","98118",{"$f":"_xlfn.XLOOKUP(--fSeattle2020Complaints[[#This Row],[ZipCode]],dZipNeighborhood[ZipCode],dZipNeighborhood[Neighborhood])","v":"Columbia City"}]
["Weeds","2020-09-19","Completed","Completed","98115",{"$f":"_xlfn.XLOOKUP(--fSeattle2020Complaints[[#This Row],[ZipCode]],dZipNeighborhood[ZipCode],dZipNeighborhood[Neighborhood])","v":"Greenlake"}]
["Land Use","2020-07-22","Completed","Warning","98108",{"$f":"_xlfn.XLOOKUP(--fSeattle2020Complaints[[#This Row],[ZipCode]],dZipNeighborhood[ZipCode],dZipNeighborhood[Neighborhood])","v":"Rainer Valley"}]
["Weeds","2020-03-27","Compliance Achieved","Completed","98178",{"$f":"_xlfn.XLOOKUP(--fSeattle2020Complaints[[#This Row],[ZipCode]],dZipNeighborhood[ZipCode],dZipNeighborhood[Neighborhood])","v":"Skyway"}]
["Weeds","2020-06-29","Completed","Completed","98106",{"$f":"_xlfn.XLOOKUP(--fSeattle2020Complaints[[#This Row],[ZipCode]],dZipNeighborhood[ZipCode],dZipNeighborhood[Neighborhood])","v":"Delridge"}]
["Noise","2020-01-25","Completed","Completed","98104",{"$f":"_xlfn.XLOOKUP(--fSeattle2020Complaints[[#This Row],[ZipCode]],dZipNeighborhood[ZipCode],dZipNeighborhood[Neighborhood])","v":"International District"}]
["Weeds","2020-04-16","Completed","Completed","98118",{"$f":"_xlfn.XLOOKUP(--fSeattle2020Complaints[[#This Row],[ZipCode]],dZipNeighborhood[ZipCode],dZipNeighborhood[Neighborhood])","v":"Columbia City"}]
["Construction","2020-05-11","Completed","Completed","98126",{"$f":"_xlfn.XLOOKUP(--fSeattle2020Complaints[[#This Row],[ZipCode]],dZipNeighborhood[ZipCode],dZipNeighborhood[Neighborhood])","v":"High Point"}]
["Land Use","2020-11-05","Completed","Completed","98105",{"$f":"_xlfn.XLOOKUP(--fSeattle2020Complaints[[#This Row],[ZipCode]],dZipNeighborhood[ZipCode],dZipNeighborhood[Neighborhood])","v":"University District"}]
["Weeds","2020-02-13","Completed","Completed","98122",{"$f":"_xlfn.XLOOKUP(--fSeattle2020Complaints[[#This Row],[ZipCode]],dZipNeighborhood[ZipCode],dZipNeighborhood[Neighborhood])","v":"Minor, Central Area"}]
["Land Use","2020-06-11","Completed","Completed","98105",{"$f":"_xlfn.XLOOKUP(--fSeattle2020Complaints[[#This Row],[ZipCode]],dZipNeighborhood[ZipCode],dZipNeighborhood[Neighborhood])","v":"University District"}]
["Weeds","2020-02-27","Compliance Achieved","Completed","98108",{"$f":"_xlfn.XLOOKUP(--fSeattle2020Complaints[[#This Row],[ZipCode]],dZipNeighborhood[ZipCode],dZipNeighborhood[Neighborhood])","v":"Rainer Valley"}]
["Land Use","2020-12-22","Completed","Completed","98102",{"$f":"_xlfn.XLOOKUP(--fSeattle2020Complaints[[#This Row],[ZipCode]],dZipNeighborhood[ZipCode],dZipNeighborhood[Neighborhood])","v":"Capital Hill"}]
["Land Use","2020-02-04","Completed","Completed","98119",{"$f":"_xlfn.XLOOKUP(--fSeattle2020Complaints[[#This Row],[ZipCode]],dZipNeighborhood[ZipCode],dZipNeighborhood[Neighborhood])","v":"Queen Anne"}]
["Land Use","2020-08-26","Completed","Completed","98122",{"$f":"_xlfn.XLOOKUP(--fSeattle2020Complaints[[#This Row],[ZipCode]],dZipNeighborhood[ZipCode],dZipNeighborhood[Neighborhood])","v":"Minor, Central Area"}]
["Land Use","2020-09-10","Completed","Completed","98133",{"$f":"_xlfn.XLOOKUP(--fSeattle2020Complaints[[#This Row],[ZipCode]],dZipNeighborhood[ZipCode],dZipNeighborhood[Neighborhood])","v":"Shoreline"}]
["Weeds","2020-03-01","Completed","Completed","98103",{"$f":"_xlfn.XLOOKUP(--fSeattle2020Complaints[[#This Row],[ZipCode]],dZipNeighborhood[ZipCode],dZipNeighborhood[Neighborhood])","v":"Greenwood"}]
["Construction","2020-01-30","Compliance Achieved","NOV Issued","98178",{"$f":"_xlfn.XLOOKUP(--fSeattle2020Complaints[[#This Row],[ZipCode]],dZipNeighborhood[ZipCode],dZipNeighborhood[Neighborhood])","v":"Skyway"}]
["Weeds","2020-07-02","Admin Closure","Completed","98104",{"$f":"_xlfn.XLOOKUP(--fSeattle2020Complaints[[#This Row],[ZipCode]],dZipNeighborhood[ZipCode],dZipNeighborhood[Neighborhood])","v":"International District"}]
["Construction","2020-05-18","Completed","Completed","98103",{"$f":"_xlfn.XLOOKUP(--fSeattle2020Complaints[[#This Row],[ZipCode]],dZipNeighborhood[ZipCode],dZipNeighborhood[Neighborhood])","v":"Greenwood"}]
["Land Use","2020-01-31","Completed","Completed","98177",{"$f":"_xlfn.XLOOKUP(--fSeattle2020Complaints[[#This Row],[ZipCode]],dZipNeighborhood[ZipCode],dZipNeighborhood[Neighborhood])","v":"Richmond Beach"}]
["Emergency , Vacant Building","2020-05-20","Completed","Completed","98199",{"$f":"_xlfn.XLOOKUP(--fSeattle2020Complaints[[#This Row],[ZipCode]],dZipNeighborhood[ZipCode],dZipNeighborhood[Neighborhood])","v":"Magnolia"}]
["Land Use","2020-03-09","Completed","Completed","98122",{"$f":"_xlfn.XLOOKUP(--fSeattle2020Complaints[[#This Row],[ZipCode]],dZipNeighborhood[ZipCode],dZipNeighborhood[Neighborhood])","v":"Minor, Central Area"}]
["Noise , Vacant Building","2020-01-21","Completed","Completed","98107",{"$f":"_xlfn.XLOOKUP(--fSeattle2020Complaints[[#This Row],[ZipCode]],dZipNeighborhood[ZipCode],dZipNeighborhood[Neighborhood])","v":"Ballard"}]
["Land Use","2020-10-10","Completed","Completed","98109",{"$f":"_xlfn.XLOOKUP(--fSeattle2020Complaints[[#This Row],[ZipCode]],dZipNeighborhood[ZipCode],dZipNeighborhood[Neighborhood])","v":"South Lake Union"}]
["Land Use","2020-12-27","Completed","Under Investigation","98118",{"$f":"_xlfn.XLOOKUP(--fSeattle2020Complaints[[#This Row],[ZipCode]],dZipNeighborhood[ZipCode],dZipNeighborhood[Neighborhood])","v":"Columbia City"}]
["Shoreline","2020-10-22","Completed","Warning","98136",{"$f":"_xlfn.XLOOKUP(--fSeattle2020Complaints[[#This Row],[ZipCode]],dZipNeighborhood[ZipCode],dZipNeighborhood[Neighborhood])","v":"Seaview"}]
["Land Use","2020-08-03","Completed","Closed","98125",{"$f":"_xlfn.XLOOKUP(--fSeattle2020Complaints[[#This Row],[ZipCode]],dZipNeighborhood[ZipCode],dZipNeighborhood[Neighborhood])","v":"Northgate"}]
["Land Use","2020-01-13","Completed","Completed","98144",{"$f":"_xlfn.XLOOKUP(--fSeattle2020Complaints[[#This Row],[ZipCode]],dZipNeighborhood[ZipCode],dZipNeighborhood[Neighborhood])","v":"Mount Baker"}]
["Land Use","2020-10-09","Completed","Completed","98125",{"$f":"_xlfn.XLOOKUP(--fSeattle2020Complaints[[#This Row],[ZipCode]],dZipNeighborhood[ZipCode],dZipNeighborhood[Neighborhood])","v":"Northgate"}]
["Land Use","2020-06-18","Completed","Completed","98133",{"$f":"_xlfn.XLOOKUP(--fSeattle2020Complaints[[#This Row],[ZipCode]],dZipNeighborhood[ZipCode],dZipNeighborhood[Neighborhood])","v":"Shoreline"}]
["Construction","2020-05-21","Completed","Completed","98108",{"$f":"_xlfn.XLOOKUP(--fSeattle2020Complaints[[#This Row],[ZipCode]],dZipNeighborhood[ZipCode],dZipNeighborhood[Neighborhood])","v":"Rainer Valley"}]
["Construction","2020-01-21","Admin Closure","Completed","98199",{"$f":"_xlfn.XLOOKUP(--fSeattle2020Complaints[[#This Row],[ZipCode]],dZipNeighborhood[ZipCode],dZipNeighborhood[Neighborhood])","v":"Magnolia"}]
["Construction","2020-10-12","Completed","Completed","98122",{"$f":"_xlfn.XLOOKUP(--fSeattle2020Complaints[[#This Row],[ZipCode]],dZipNeighborhood[ZipCode],dZipNeighborhood[Neighborhood])","v":"Minor, Central Area"}]
["Land Use","2020-03-02","Completed","Completed","98107",{"$f":"_xlfn.XLOOKUP(--fSeattle2020Complaints[[#This Row],[ZipCode]],dZipNeighborhood[ZipCode],dZipNeighborhood[Neighborhood])","v":"Ballard"}]
["Weeds","2020-05-31","Completed","Completed","98115",{"$f":"_xlfn.XLOOKUP(--fSeattle2020Complaints[[#This Row],[ZipCode]],dZipNeighborhood[ZipCode],dZipNeighborhood[Neighborhood])","v":"Greenlake"}]
["Construction","2020-02-20","Completed","Completed","98115",{"$f":"_xlfn.XLOOKUP(--fSeattle2020Complaints[[#This Row],[ZipCode]],dZipNeighborhood[ZipCode],dZipNeighborhood[Neighborhood])","v":"Greenlake"}]
["Weeds","2020-08-06","Completed","Completed","98144",{"$f":"_xlfn.XLOOKUP(--fSeattle2020Complaints[[#This Row],[ZipCode]],dZipNeighborhood[ZipCode],dZipNeighborhood[Neighborhood])","v":"Mount Baker"}]
["Land Use","2020-12-15","Completed","Completed","98112",{"$f":"_xlfn.XLOOKUP(--fSeattle2020Complaints[[#This Row],[ZipCode]],dZipNeighborhood[ZipCode],dZipNeighborhood[Neighborhood])","v":"Madison Park"}]
["Emergency , Vacant Building","2020-05-12","Compliance Achieved","Completed","98122",{"$f":"_xlfn.XLOOKUP(--fSeattle2020Complaints[[#This Row],[ZipCode]],dZipNeighborhood[ZipCode],dZipNeighborhood[Neighborhood])","v":"Minor, Central Area"}]
["Weeds","2020-07-08","Completed","Completed","98106",{"$f":"_xlfn.XLOOKUP(--fSeattle2020Complaints[[#This Row],[ZipCode]],dZipNeighborhood[ZipCode],dZipNeighborhood[Neighborhood])","v":"Delridge"}]
["Weeds","2020-02-25","Compliance Achieved","Completed","98199",{"$f":"_xlfn.XLOOKUP(--fSeattle2020Complaints[[#This Row],[ZipCode]],dZipNeighborhood[ZipCode],dZipNeighborhood[Neighborhood])","v":"Magnolia"}]
["Land Use","2020-02-19","Completed","Completed","98105",{"$f":"_xlfn.XLOOKUP(--fSeattle2020Complaints[[#This Row],[ZipCode]],dZipNeighborhood[ZipCode],dZipNeighborhood[Neighborhood])","v":"University District"}]
["Land Use","2020-01-10","Completed","Completed","98122",{"$f":"_xlfn.XLOOKUP(--fSeattle2020Complaints[[#This Row],[ZipCode]],dZipNeighborhood[ZipCode],dZipNeighborhood[Neighborhood])","v":"Minor, Central Area"}]
["Land Use","2020-08-21","Completed","Completed","98109",{"$f":"_xlfn.XLOOKUP(--fSeattle2020Complaints[[#This Row],[ZipCode]],dZipNeighborhood[ZipCode],dZipNeighborhood[Neighborhood])","v":"South Lake Union"}]
["Weeds","2020-07-17","Completed","Completed","98199",{"$f":"_xlfn.XLOOKUP(--fSeattle2020Complaints[[#This Row],[ZipCode]],dZipNeighborhood[ZipCode],dZipNeighborhood[Neighborhood])","v":"Magnolia"}]
["Weeds","2020-05-19","Completed","Completed","98144",{"$f":"_xlfn.XLOOKUP(--fSeattle2020Complaints[[#This Row],[ZipCode]],dZipNeighborhood[ZipCode],dZipNeighborhood[Neighborhood])","v":"Mount Baker"}]
["Land Use","2020-05-10","Completed","Completed","98108",{"$f":"_xlfn.XLOOKUP(--fSeattle2020Complaints[[#This Row],[ZipCode]],dZipNeighborhood[ZipCode],dZipNeighborhood[Neighborhood])","v":"Rainer Valley"}]
["Weeds","2020-11-12","Completed","Completed","98146",{"$f":"_xlfn.XLOOKUP(--fSeattle2020Complaints[[#This Row],[ZipCode]],dZipNeighborhood[ZipCode],dZipNeighborhood[Neighborhood])","v":"Shorewood, White Center"}]
["Construction","2020-12-02","Completed","Completed","98144",{"$f":"_xlfn.XLOOKUP(--fSeattle2020Complaints[[#This Row],[ZipCode]],dZipNeighborhood[ZipCode],dZipNeighborhood[Neighborhood])","v":"Mount Baker"}]
["Land Use","2020-07-15","Completed","Completed","98106",{"$f":"_xlfn.XLOOKUP(--fSeattle2020Complaints[[#This Row],[ZipCode]],dZipNeighborhood[ZipCode],dZipNeighborhood[Neighborhood])","v":"Delridge"}]
["Weeds","2020-09-01","Completed","Completed","98107",{"$f":"_xlfn.XLOOKUP(--fSeattle2020Complaints[[#This Row],[ZipCode]],dZipNeighborhood[ZipCode],dZipNeighborhood[Neighborhood])","v":"Ballard"}]
["Land Use","2020-06-02","Completed","Completed","98102",{"$f":"_xlfn.XLOOKUP(--fSeattle2020Complaints[[#This Row],[ZipCode]],dZipNeighborhood[ZipCode],dZipNeighborhood[Neighborhood])","v":"Capital Hill"}]
["Weeds","2020-07-15","Completed","Completed","98117",{"$f":"_xlfn.XLOOKUP(--fSeattle2020Complaints[[#This Row],[ZipCode]],dZipNeighborhood[ZipCode],dZipNeighborhood[Neighborhood])","v":"Sunset Hill"}]
["Construction","2020-01-09","Compliance Achieved","Completed","98119",{"$f":"_xlfn.XLOOKUP(--fSeattle2020Complaints[[#This Row],[ZipCode]],dZipNeighborhood[ZipCode],dZipNeighborhood[Neighborhood])","v":"Queen Anne"}]
["Weeds","2020-07-30","Completed","Completed","98117",{"$f":"_xlfn.XLOOKUP(--fSeattle2020Complaints[[#This Row],[ZipCode]],dZipNeighborhood[ZipCode],dZipNeighborhood[Neighborhood])","v":"Sunset Hill"}]
["Tree","2020-04-15","Completed","Closed","98199",{"$f":"_xlfn.XLOOKUP(--fSeattle2020Complaints[[#This Row],[ZipCode]],dZipNeighborhood[ZipCode],dZipNeighborhood[Neighborhood])","v":"Magnolia"}]
["LandLord/Tenant","2020-02-18","Completed","Completed","98118",{"$f":"_xlfn.XLOOKUP(--fSeattle2020Complaints[[#This Row],[ZipCode]],dZipNeighborhood[ZipCode],dZipNeighborhood[Neighborhood])","v":"Columbia City"}]
["Land Use","2020-02-13","Completed","Completed","98103",{"$f":"_xlfn.XLOOKUP(--fSeattle2020Complaints[[#This Row],[ZipCode]],dZipNeighborhood[ZipCode],dZipNeighborhood[Neighborhood])","v":"Greenwood"}]
["Construction","2020-08-11","Completed","Completed","98118",{"$f":"_xlfn.XLOOKUP(--fSeattle2020Complaints[[#This Row],[ZipCode]],dZipNeighborhood[ZipCode],dZipNeighborhood[Neighborhood])","v":"Columbia City"}]
["Construction","2020-07-15","Completed","Completed","98102",{"$f":"_xlfn.XLOOKUP(--fSeattle2020Complaints[[#This Row],[ZipCode]],dZipNeighborhood[ZipCode],dZipNeighborhood[Neighborhood])","v":"Capital Hill"}]
["Shoreline","2020-08-19","Completed","Completed","98109",{"$f":"_xlfn.XLOOKUP(--fSeattle2020Complaints[[#This Row],[ZipCode]],dZipNeighborhood[ZipCode],dZipNeighborhood[Neighborhood])","v":"South Lake Union"}]
["Land Use","2020-04-30","Completed","Completed","98108",{"$f":"_xlfn.XLOOKUP(--fSeattle2020Complaints[[#This Row],[ZipCode]],dZipNeighborhood[ZipCode],dZipNeighborhood[Neighborhood])","v":"Rainer Valley"}]
["Weeds","2020-05-24","Completed","Completed","98122",{"$f":"_xlfn.XLOOKUP(--fSeattle2020Complaints[[#This Row],[ZipCode]],dZipNeighborhood[ZipCode],dZipNeighborhood[Neighborhood])","v":"Minor, Central Area"}]
["Land Use","2020-07-07","Completed","Completed","98105",{"$f":"_xlfn.XLOOKUP(--fSeattle2020Complaints[[#This Row],[ZipCode]],dZipNeighborhood[ZipCode],dZipNeighborhood[Neighborhood])","v":"University District"}]
["Weeds","2020-06-11","Completed","Completed","98144",{"$f":"_xlfn.XLOOKUP(--fSeattle2020Complaints[[#This Row],[ZipCode]],dZipNeighborhood[ZipCode],dZipNeighborhood[Neighborhood])","v":"Mount Baker"}]
["Vacant Building","2020-01-17","Completed","Closed","98107",{"$f":"_xlfn.XLOOKUP(--fSeattle2020Complaints[[#This Row],[ZipCode]],dZipNeighborhood[ZipCode],dZipNeighborhood[Neighborhood])","v":"Ballard"}]
["Land Use","2020-05-05","Completed","Completed","98103",{"$f":"_xlfn.XLOOKUP(--fSeattle2020Complaints[[#This Row],[ZipCode]],dZipNeighborhood[ZipCode],dZipNeighborhood[Neighborhood])","v":"Greenwood"}]
["Weeds","2020-07-01","Completed","Citation Issued","98146",{"$f":"_xlfn.XLOOKUP(--fSeattle2020Complaints[[#This Row],[ZipCode]],dZipNeighborhood[ZipCode],dZipNeighborhood[Neighborhood])","v":"Shorewood, White Center"}]
["Land Use","2020-04-21","Completed","Completed","98105",{"$f":"_xlfn.XLOOKUP(--fSeattle2020Complaints[[#This Row],[ZipCode]],dZipNeighborhood[ZipCode],dZipNeighborhood[Neighborhood])","v":"University District"}]
["Weeds","2020-11-20","Completed","Closed","98118",{"$f":"_xlfn.XLOOKUP(--fSeattle2020Complaints[[#This Row],[ZipCode]],dZipNeighborhood[ZipCode],dZipNeighborhood[Neighborhood])","v":"Columbia City"}]
["Land UseShoreline ,","2020-11-12","Completed","Completed","98118",{"$f":"_xlfn.XLOOKUP(--fSeattle2020Complaints[[#This Row],[ZipCode]],dZipNeighborhood[ZipCode],dZipNeighborhood[Neighborhood])","v":"Columbia City"}]
["Land UseWeeds ,","2020-07-01","Compliance Achieved","Completed","98146",{"$f":"_xlfn.XLOOKUP(--fSeattle2020Complaints[[#This Row],[ZipCode]],dZipNeighborhood[ZipCode],dZipNeighborhood[Neighborhood])","v":"Shorewood, White Center"}]
["Construction , ECA","2020-06-25","Completed","Under Investigation","98118",{"$f":"_xlfn.XLOOKUP(--fSeattle2020Complaints[[#This Row],[ZipCode]],dZipNeighborhood[ZipCode],dZipNeighborhood[Neighborhood])","v":"Columbia City"}]
["Emergency , Vacant Building","2020-01-23","Admin Closure","Completed","98117",{"$f":"_xlfn.XLOOKUP(--fSeattle2020Complaints[[#This Row],[ZipCode]],dZipNeighborhood[ZipCode],dZipNeighborhood[Neighborhood])","v":"Sunset Hill"}]
["Land Use","2020-07-20","Completed","Completed","98109",{"$f":"_xlfn.XLOOKUP(--fSeattle2020Complaints[[#This Row],[ZipCode]],dZipNeighborhood[ZipCode],dZipNeighborhood[Neighborhood])","v":"South Lake Union"}]
["Construction","2020-01-30","Completed","Completed","98144",{"$f":"_xlfn.XLOOKUP(--fSeattle2020Complaints[[#This Row],[ZipCode]],dZipNeighborhood[ZipCode],dZipNeighborhood[Neighborhood])","v":"Mount Baker"}]
["Vacant Building","2020-03-11","Completed","Completed","98122",{"$f":"_xlfn.XLOOKUP(--fSeattle2020Complaints[[#This Row],[ZipCode]],dZipNeighborhood[ZipCode],dZipNeighborhood[Neighborhood])","v":"Minor, Central Area"}]
["Land Use","2020-03-11","Compliance Achieved","Completed","98178",{"$f":"_xlfn.XLOOKUP(--fSeattle2020Complaints[[#This Row],[ZipCode]],dZipNeighborhood[ZipCode],dZipNeighborhood[Neighborhood])","v":"Skyway"}]
["Weeds","2020-09-25","Completed","Completed","98108",{"$f":"_xlfn.XLOOKUP(--fSeattle2020Complaints[[#This Row],[ZipCode]],dZipNeighborhood[ZipCode],dZipNeighborhood[Neighborhood])","v":"Rainer Valley"}]
["Vacant Building","2020-02-04","Completed","Completed","98199",{"$f":"_xlfn.XLOOKUP(--fSeattle2020Complaints[[#This Row],[ZipCode]],dZipNeighborhood[ZipCode],dZipNeighborhood[Neighborhood])","v":"Magnolia"}]
["Weeds","2020-06-11","Completed","Completed","98115",{"$f":"_xlfn.XLOOKUP(--fSeattle2020Complaints[[#This Row],[ZipCode]],dZipNeighborhood[ZipCode],dZipNeighborhood[Neighborhood])","v":"Greenlake"}]
["Noise","2020-01-06","Completed","Completed","98115",{"$f":"_xlfn.XLOOKUP(--fSeattle2020Complaints[[#This Row],[ZipCode]],dZipNeighborhood[ZipCode],dZipNeighborhood[Neighborhood])","v":"Greenlake"}]
["Land Use","2020-04-21","Completed","Completed","98109",{"$f":"_xlfn.XLOOKUP(--fSeattle2020Complaints[[#This Row],[ZipCode]],dZipNeighborhood[ZipCode],dZipNeighborhood[Neighborhood])","v":"South Lake Union"}]
["Noise","2020-01-01","Completed","Completed","98117",{"$f":"_xlfn.XLOOKUP(--fSeattle2020Complaints[[#This Row],[ZipCode]],dZipNeighborhood[ZipCode],dZipNeighborhood[Neighborhood])","v":"Sunset Hill"}]
["Weeds","2020-05-25","Completed","Completed","98106",{"$f":"_xlfn.XLOOKUP(--fSeattle2020Complaints[[#This Row],[ZipCode]],dZipNeighborhood[ZipCode],dZipNeighborhood[Neighborhood])","v":"Delridge"}]
["Weeds","2020-03-07","Completed","Completed","98103",{"$f":"_xlfn.XLOOKUP(--fSeattle2020Complaints[[#This Row],[ZipCode]],dZipNeighborhood[ZipCode],dZipNeighborhood[Neighborhood])","v":"Greenwood"}]
["Construction","2020-02-21","Completed","Completed","98115",{"$f":"_xlfn.XLOOKUP(--fSeattle2020Complaints[[#This Row],[ZipCode]],dZipNeighborhood[ZipCode],dZipNeighborhood[Neighborhood])","v":"Greenlake"}]
["Construction","2020-11-17","Completed","Completed","98199",{"$f":"_xlfn.XLOOKUP(--fSeattle2020Complaints[[#This Row],[ZipCode]],dZipNeighborhood[ZipCode],dZipNeighborhood[Neighborhood])","v":"Magnolia"}]
["Weeds","2020-05-08","Completed","Completed","98112",{"$f":"_xlfn.XLOOKUP(--fSeattle2020Complaints[[#This Row],[ZipCode]],dZipNeighborhood[ZipCode],dZipNeighborhood[Neighborhood])","v":"Madison Park"}]
["Weeds","2020-06-16","Compliance Achieved","Completed","98115",{"$f":"_xlfn.XLOOKUP(--fSeattle2020Complaints[[#This Row],[ZipCode]],dZipNeighborhood[ZipCode],dZipNeighborhood[Neighborhood])","v":"Greenlake"}]
["Weeds","2020-07-28","Completed","Completed","98108",{"$f":"_xlfn.XLOOKUP(--fSeattle2020Complaints[[#This Row],[ZipCode]],dZipNeighborhood[ZipCode],dZipNeighborhood[Neighborhood])","v":"Rainer Valley"}]
["Weeds","2020-02-27","Completed","Completed","98119",{"$f":"_xlfn.XLOOKUP(--fSeattle2020Complaints[[#This Row],[ZipCode]],dZipNeighborhood[ZipCode],dZipNeighborhood[Neighborhood])","v":"Queen Anne"}]
["Construction","2020-06-02","Completed","Closed","98101",{"$f":"_xlfn.XLOOKUP(--fSeattle2020Complaints[[#This Row],[ZipCode]],dZipNeighborhood[ZipCode],dZipNeighborhood[Neighborhood])","v":"Seattle"}]
["Construction","2020-09-01","Completed","Under Investigation","98144",{"$f":"_xlfn.XLOOKUP(--fSeattle2020Complaints[[#This Row],[ZipCode]],dZipNeighborhood[ZipCode],dZipNeighborhood[Neighborhood])","v":"Mount Baker"}]
["Weeds","2020-10-13","Completed","Completed","98106",{"$f":"_xlfn.XLOOKUP(--fSeattle2020Complaints[[#This Row],[ZipCode]],dZipNeighborhood[ZipCode],dZipNeighborhood[Neighborhood])","v":"Delridge"}]
["Construction","2020-02-16","Completed","Completed","98199",{"$f":"_xlfn.XLOOKUP(--fSeattle2020Complaints[[#This Row],[ZipCode]],dZipNeighborhood[ZipCode],dZipNeighborhood[Neighborhood])","v":"Magnolia"}]
["Weeds","2020-03-15","Completed","Completed","98112",{"$f":"_xlfn.XLOOKUP(--fSeattle2020Complaints[[#This Row],[ZipCode]],dZipNeighborhood[ZipCode],dZipNeighborhood[Neighborhood])","v":"Madison Park"}]
["Land Use","2020-08-11","Completed","Completed","98105",{"$f":"_xlfn.XLOOKUP(--fSeattle2020Complaints[[#This Row],[ZipCode]],dZipNeighborhood[ZipCode],dZipNeighborhood[Neighborhood])","v":"University District"}]
["Land Use","2020-01-27","Completed","Completed","98102",{"$f":"_xlfn.XLOOKUP(--fSeattle2020Complaints[[#This Row],[ZipCode]],dZipNeighborhood[ZipCode],dZipNeighborhood[Neighborhood])","v":"Capital Hill"}]
["Construction","2020-06-09","Completed","Completed","98102",{"$f":"_xlfn.XLOOKUP(--fSeattle2020Complaints[[#This Row],[ZipCode]],dZipNeighborhood[ZipCode],dZipNeighborhood[Neighborhood])","v":"Capital Hill"}]
["Weeds","2020-03-06","Completed","Completed","98106",{"$f":"_xlfn.XLOOKUP(--fSeattle2020Complaints[[#This Row],[ZipCode]],dZipNeighborhood[ZipCode],dZipNeighborhood[Neighborhood])","v":"Delridge"}]
["Tree","2020-05-21","Completed","Completed","98108",{"$f":"_xlfn.XLOOKUP(--fSeattle2020Complaints[[#This Row],[ZipCode]],dZipNeighborhood[ZipCode],dZipNeighborhood[Neighborhood])","v":"Rainer Valley"}]
["Emergency","2020-06-23","Completed","Initiated","98103",{"$f":"_xlfn.XLOOKUP(--fSeattle2020Complaints[[#This Row],[ZipCode]],dZipNeighborhood[ZipCode],dZipNeighborhood[Neighborhood])","v":"Greenwood"}]
["Weeds","2020-08-17","Completed","Completed","98133",{"$f":"_xlfn.XLOOKUP(--fSeattle2020Complaints[[#This Row],[ZipCode]],dZipNeighborhood[ZipCode],dZipNeighborhood[Neighborhood])","v":"Shoreline"}]
["Emergency","2020-03-23","Compliance Achieved","Referred to Law","98102",{"$f":"_xlfn.XLOOKUP(--fSeattle2020Complaints[[#This Row],[ZipCode]],dZipNeighborhood[ZipCode],dZipNeighborhood[Neighborhood])","v":"Capital Hill"}]
["Tree","2020-04-06","No Access/Unable to Observe","Completed","98199",{"$f":"_xlfn.XLOOKUP(--fSeattle2020Complaints[[#This Row],[ZipCode]],dZipNeighborhood[ZipCode],dZipNeighborhood[Neighborhood])","v":"Magnolia"}]
["Weeds","2020-06-01","Completed","Completed","98115",{"$f":"_xlfn.XLOOKUP(--fSeattle2020Complaints[[#This Row],[ZipCode]],dZipNeighborhood[ZipCode],dZipNeighborhood[Neighborhood])","v":"Greenlake"}]
["Construction","2020-02-28","Completed","Completed","98103",{"$f":"_xlfn.XLOOKUP(--fSeattle2020Complaints[[#This Row],[ZipCode]],dZipNeighborhood[ZipCode],dZipNeighborhood[Neighborhood])","v":"Greenwood"}]
["Weeds","2020-09-01","Completed","Completed","98108",{"$f":"_xlfn.XLOOKUP(--fSeattle2020Complaints[[#This Row],[ZipCode]],dZipNeighborhood[ZipCode],dZipNeighborhood[Neighborhood])","v":"Rainer Valley"}]
["Land Use","2020-08-31","Completed","Completed","98105",{"$f":"_xlfn.XLOOKUP(--fSeattle2020Complaints[[#This Row],[ZipCode]],dZipNeighborhood[ZipCode],dZipNeighborhood[Neighborhood])","v":"University District"}]
["Land Use","2020-06-23","Compliance Achieved","Completed","98106",{"$f":"_xlfn.XLOOKUP(--fSeattle2020Complaints[[#This Row],[ZipCode]],dZipNeighborhood[ZipCode],dZipNeighborhood[Neighborhood])","v":"Delridge"}]
["Weeds","2020-08-26","Completed","Completed","98136",{"$f":"_xlfn.XLOOKUP(--fSeattle2020Complaints[[#This Row],[ZipCode]],dZipNeighborhood[ZipCode],dZipNeighborhood[Neighborhood])","v":"Seaview"}]
["Weeds","2020-03-02","Completed","Warning","98117",{"$f":"_xlfn.XLOOKUP(--fSeattle2020Complaints[[#This Row],[ZipCode]],dZipNeighborhood[ZipCode],dZipNeighborhood[Neighborhood])","v":"Sunset Hill"}]
["Weeds","2020-05-31","Completed","Completed","98116",{"$f":"_xlfn.XLOOKUP(--fSeattle2020Complaints[[#This Row],[ZipCode]],dZipNeighborhood[ZipCode],dZipNeighborhood[Neighborhood])","v":"West Seattle"}]
["Weeds","2020-04-20","Completed","Completed","98116",{"$f":"_xlfn.XLOOKUP(--fSeattle2020Complaints[[#This Row],[ZipCode]],dZipNeighborhood[ZipCode],dZipNeighborhood[Neighborhood])","v":"West Seattle"}]
["Weeds","2020-02-09","Completed","Completed","98133",{"$f":"_xlfn.XLOOKUP(--fSeattle2020Complaints[[#This Row],[ZipCode]],dZipNeighborhood[ZipCode],dZipNeighborhood[Neighborhood])","v":"Shoreline"}]
["Construction , Weeds","2020-10-09","Completed","Closed","98118",{"$f":"_xlfn.XLOOKUP(--fSeattle2020Complaints[[#This Row],[ZipCode]],dZipNeighborhood[ZipCode],dZipNeighborhood[Neighborhood])","v":"Columbia City"}]
["Construction","2020-07-21","Completed","Closed","98118",{"$f":"_xlfn.XLOOKUP(--fSeattle2020Complaints[[#This Row],[ZipCode]],dZipNeighborhood[ZipCode],dZipNeighborhood[Neighborhood])","v":"Columbia City"}]
["Land Use","2020-06-23","Completed","Completed","98103",{"$f":"_xlfn.XLOOKUP(--fSeattle2020Complaints[[#This Row],[ZipCode]],dZipNeighborhood[ZipCode],dZipNeighborhood[Neighborhood])","v":"Greenwood"}]
["Vacant Building","2020-02-10","Completed","Closed","98107",{"$f":"_xlfn.XLOOKUP(--fSeattle2020Complaints[[#This Row],[ZipCode]],dZipNeighborhood[ZipCode],dZipNeighborhood[Neighborhood])","v":"Ballard"}]
["Construction","2020-08-21","Completed","Completed","98109",{"$f":"_xlfn.XLOOKUP(--fSeattle2020Complaints[[#This Row],[ZipCode]],dZipNeighborhood[ZipCode],dZipNeighborhood[Neighborhood])","v":"South Lake Union"}]
["Weeds","2020-08-04","Completed","Completed","98118",{"$f":"_xlfn.XLOOKUP(--fSeattle2020Complaints[[#This Row],[ZipCode]],dZipNeighborhood[ZipCode],dZipNeighborhood[Neighborhood])","v":"Columbia City"}]
["Construction","2020-03-12","Completed","Closed","98118",{"$f":"_xlfn.XLOOKUP(--fSeattle2020Complaints[[#This Row],[ZipCode]],dZipNeighborhood[ZipCode],dZipNeighborhood[Neighborhood])","v":"Columbia City"}]
["Land Use","2020-08-25","Completed","Under Investigation","98136",{"$f":"_xlfn.XLOOKUP(--fSeattle2020Complaints[[#This Row],[ZipCode]],dZipNeighborhood[ZipCode],dZipNeighborhood[Neighborhood])","v":"Seaview"}]
["Land Use","2020-01-13","Completed","Closed","98125",{"$f":"_xlfn.XLOOKUP(--fSeattle2020Complaints[[#This Row],[ZipCode]],dZipNeighborhood[ZipCode],dZipNeighborhood[Neighborhood])","v":"Northgate"}]
["Land Use","2020-05-08","Completed","Completed","98106",{"$f":"_xlfn.XLOOKUP(--fSeattle2020Complaints[[#This Row],[ZipCode]],dZipNeighborhood[ZipCode],dZipNeighborhood[Neighborhood])","v":"Delridge"}]
["Land Use","2020-09-21","No Violation","Completed","98107",{"$f":"_xlfn.XLOOKUP(--fSeattle2020Complaints[[#This Row],[ZipCode]],dZipNeighborhood[ZipCode],dZipNeighborhood[Neighborhood])","v":"Ballard"}]
["Construction","2020-12-22","Completed","Completed","98117",{"$f":"_xlfn.XLOOKUP(--fSeattle2020Complaints[[#This Row],[ZipCode]],dZipNeighborhood[ZipCode],dZipNeighborhood[Neighborhood])","v":"Sunset Hill"}]
["Construction","2020-02-04","Compliance Achieved","Completed","98178",{"$f":"_xlfn.XLOOKUP(--fSeattle2020Complaints[[#This Row],[ZipCode]],dZipNeighborhood[ZipCode],dZipNeighborhood[Neighborhood])","v":"Skyway"}]
["Land Use","2020-03-24","Completed","Completed","98106",{"$f":"_xlfn.XLOOKUP(--fSeattle2020Complaints[[#This Row],[ZipCode]],dZipNeighborhood[ZipCode],dZipNeighborhood[Neighborhood])","v":"Delridge"}]
["Land Use","2020-01-23","Compliance Achieved","Completed","98104",{"$f":"_xlfn.XLOOKUP(--fSeattle2020Complaints[[#This Row],[ZipCode]],dZipNeighborhood[ZipCode],dZipNeighborhood[Neighborhood])","v":"International District"}]
["Construction","2020-07-16","Completed","Under Investigation","98118",{"$f":"_xlfn.XLOOKUP(--fSeattle2020Complaints[[#This Row],[ZipCode]],dZipNeighborhood[ZipCode],dZipNeighborhood[Neighborhood])","v":"Columbia City"}]
["Land Use","2020-08-05","Completed","Completed","98121",{"$f":"_xlfn.XLOOKUP(--fSeattle2020Complaints[[#This Row],[ZipCode]],dZipNeighborhood[ZipCode],dZipNeighborhood[Neighborhood])","v":"Belltown"}]
["Weeds","2020-12-09","Completed","Completed","98104",{"$f":"_xlfn.XLOOKUP(--fSeattle2020Complaints[[#This Row],[ZipCode]],dZipNeighborhood[ZipCode],dZipNeighborhood[Neighborhood])","v":"International District"}]
["Land Use","2020-07-20","Completed","Completed","98133",{"$f":"_xlfn.XLOOKUP(--fSeattle2020Complaints[[#This Row],[ZipCode]],dZipNeighborhood[ZipCode],dZipNeighborhood[Neighborhood])","v":"Shoreline"}]
["Land Use","2020-09-29","Completed","Closed","98144",{"$f":"_xlfn.XLOOKUP(--fSeattle2020Complaints[[#This Row],[ZipCode]],dZipNeighborhood[ZipCode],dZipNeighborhood[Neighborhood])","v":"Mount Baker"}]
["Land Use","2020-09-28","Completed","Completed","98105",{"$f":"_xlfn.XLOOKUP(--fSeattle2020Complaints[[#This Row],[ZipCode]],dZipNeighborhood[ZipCode],dZipNeighborhood[Neighborhood])","v":"University District"}]
["Land Use","2020-09-28","Completed","Completed","98133",{"$f":"_xlfn.XLOOKUP(--fSeattle2020Complaints[[#This Row],[ZipCode]],dZipNeighborhood[ZipCode],dZipNeighborhood[Neighborhood])","v":"Shoreline"}]
["Land Use","2020-01-27","Completed","Completed","98118",{"$f":"_xlfn.XLOOKUP(--fSeattle2020Complaints[[#This Row],[ZipCode]],dZipNeighborhood[ZipCode],dZipNeighborhood[Neighborhood])","v":"Columbia City"}]
["Construction","2020-12-17","Completed","Completed","98119",{"$f":"_xlfn.XLOOKUP(--fSeattle2020Complaints[[#This Row],[ZipCode]],dZipNeighborhood[ZipCode],dZipNeighborhood[Neighborhood])","v":"Queen Anne"}]
["Land Use","2020-10-08","Completed","Completed","98103",{"$f":"_xlfn.XLOOKUP(--fSeattle2020Complaints[[#This Row],[ZipCode]],dZipNeighborhood[ZipCode],dZipNeighborhood[Neighborhood])","v":"Greenwood"}]
["Land Use","2020-03-13","Completed","Completed","98133",{"$f":"_xlfn.XLOOKUP(--fSeattle2020Complaints[[#This Row],[ZipCode]],dZipNeighborhood[ZipCode],dZipNeighborhood[Neighborhood])","v":"Shoreline"}]
["Land Use","2020-01-27","Completed","Warning","98118",{"$f":"_xlfn.XLOOKUP(--fSeattle2020Complaints[[#This Row],[ZipCode]],dZipNeighborhood[ZipCode],dZipNeighborhood[Neighborhood])","v":"Columbia City"}]
["Land Use","2020-10-19","Completed","Completed","98102",{"$f":"_xlfn.XLOOKUP(--fSeattle2020Complaints[[#This Row],[ZipCode]],dZipNeighborhood[ZipCode],dZipNeighborhood[Neighborhood])","v":"Capital Hill"}]
["Emergency , Vacant Building","2020-01-24","Completed","Completed","98105",{"$f":"_xlfn.XLOOKUP(--fSeattle2020Complaints[[#This Row],[ZipCode]],dZipNeighborhood[ZipCode],dZipNeighborhood[Neighborhood])","v":"University District"}]
["Land UseConstruction ,","2020-01-29","Completed","Completed","98106",{"$f":"_xlfn.XLOOKUP(--fSeattle2020Complaints[[#This Row],[ZipCode]],dZipNeighborhood[ZipCode],dZipNeighborhood[Neighborhood])","v":"Delridge"}]
["Weeds","2020-08-07","Completed","Completed","98118",{"$f":"_xlfn.XLOOKUP(--fSeattle2020Complaints[[#This Row],[ZipCode]],dZipNeighborhood[ZipCode],dZipNeighborhood[Neighborhood])","v":"Columbia City"}]
["Weeds","2020-08-17","Completed","Completed","98103",{"$f":"_xlfn.XLOOKUP(--fSeattle2020Complaints[[#This Row],[ZipCode]],dZipNeighborhood[ZipCode],dZipNeighborhood[Neighborhood])","v":"Greenwood"}]
["Land Use","2020-01-28","Completed","Initiated","98126",{"$f":"_xlfn.XLOOKUP(--fSeattle2020Complaints[[#This Row],[ZipCode]],dZipNeighborhood[ZipCode],dZipNeighborhood[Neighborhood])","v":"High Point"}]
["Emergency , Vacant Building","2020-05-08","Compliance Achieved","Completed","98105",{"$f":"_xlfn.XLOOKUP(--fSeattle2020Complaints[[#This Row],[ZipCode]],dZipNeighborhood[ZipCode],dZipNeighborhood[Neighborhood])","v":"University District"}]
["Vacant Building","2020-08-22","Completed","Completed","98105",{"$f":"_xlfn.XLOOKUP(--fSeattle2020Complaints[[#This Row],[ZipCode]],dZipNeighborhood[ZipCode],dZipNeighborhood[Neighborhood])","v":"University District"}]
["Land Use","2020-05-16","Completed","Completed","98117",{"$f":"_xlfn.XLOOKUP(--fSeattle2020Complaints[[#This Row],[ZipCode]],dZipNeighborhood[ZipCode],dZipNeighborhood[Neighborhood])","v":"Sunset Hill"}]
["Weeds","2020-08-04","Completed","Completed","98126",{"$f":"_xlfn.XLOOKUP(--fSeattle2020Complaints[[#This Row],[ZipCode]],dZipNeighborhood[ZipCode],dZipNeighborhood[Neighborhood])","v":"High Point"}]
["Construction","2020-09-25","No Violation","Closed","98117",{"$f":"_xlfn.XLOOKUP(--fSeattle2020Complaints[[#This Row],[ZipCode]],dZipNeighborhood[ZipCode],dZipNeighborhood[Neighborhood])","v":"Sunset Hill"}]
["Noise","2020-07-29","Completed","Completed","98133",{"$f":"_xlfn.XLOOKUP(--fSeattle2020Complaints[[#This Row],[ZipCode]],dZipNeighborhood[ZipCode],dZipNeighborhood[Neighborhood])","v":"Shoreline"}]
["Weeds","2020-10-14","Completed","Completed","98118",{"$f":"_xlfn.XLOOKUP(--fSeattle2020Complaints[[#This Row],[ZipCode]],dZipNeighborhood[ZipCode],dZipNeighborhood[Neighborhood])","v":"Columbia City"}]
["Land Use","2020-07-28","Completed","Completed","98115",{"$f":"_xlfn.XLOOKUP(--fSeattle2020Complaints[[#This Row],[ZipCode]],dZipNeighborhood[ZipCode],dZipNeighborhood[Neighborhood])","v":"Greenlake"}]
["Construction","2020-12-21","Completed","Closed","98116",{"$f":"_xlfn.XLOOKUP(--fSeattle2020Complaints[[#This Row],[ZipCode]],dZipNeighborhood[ZipCode],dZipNeighborhood[Neighborhood])","v":"West Seattle"}]
["Construction","2020-02-03","Completed","Completed","98146",{"$f":"_xlfn.XLOOKUP(--fSeattle2020Complaints[[#This Row],[ZipCode]],dZipNeighborhood[ZipCode],dZipNeighborhood[Neighborhood])","v":"Shorewood, White Center"}]
["Weeds","2020-01-28","Completed","Closed","98144",{"$f":"_xlfn.XLOOKUP(--fSeattle2020Complaints[[#This Row],[ZipCode]],dZipNeighborhood[ZipCode],dZipNeighborhood[Neighborhood])","v":"Mount Baker"}]
["Weeds","2020-06-26","Completed","Completed","98119",{"$f":"_xlfn.XLOOKUP(--fSeattle2020Complaints[[#This Row],[ZipCode]],dZipNeighborhood[ZipCode],dZipNeighborhood[Neighborhood])","v":"Queen Anne"}]
["Construction , Weeds","2020-07-07","Compliance Achieved","Completed","98112",{"$f":"_xlfn.XLOOKUP(--fSeattle2020Complaints[[#This Row],[ZipCode]],dZipNeighborhood[ZipCode],dZipNeighborhood[Neighborhood])","v":"Madison Park"}]
["Vacant Building","2020-01-22","Completed","Closed","98199",{"$f":"_xlfn.XLOOKUP(--fSeattle2020Complaints[[#This Row],[ZipCode]],dZipNeighborhood[ZipCode],dZipNeighborhood[Neighborhood])","v":"Magnolia"}]
["Land Use","2020-11-06","Completed","Completed","98126",{"$f":"_xlfn.XLOOKUP(--fSeattle2020Complaints[[#This Row],[ZipCode]],dZipNeighborhood[ZipCode],dZipNeighborhood[Neighborhood])","v":"High Point"}]
["Land Use","2020-02-03","Completed","Completed","98118",{"$f":"_xlfn.XLOOKUP(--fSeattle2020Complaints[[#This Row],[ZipCode]],dZipNeighborhood[ZipCode],dZipNeighborhood[Neighborhood])","v":"Columbia City"}]
["Land Use","2020-08-14","Completed","Closed","98199",{"$f":"_xlfn.XLOOKUP(--fSeattle2020Complaints[[#This Row],[ZipCode]],dZipNeighborhood[ZipCode],dZipNeighborhood[Neighborhood])","v":"Magnolia"}]
["Land Use","2020-04-20","Completed","Completed","98116",{"$f":"_xlfn.XLOOKUP(--fSeattle2020Complaints[[#This Row],[ZipCode]],dZipNeighborhood[ZipCode],dZipNeighborhood[Neighborhood])","v":"West Seattle"}]
["Weeds","2020-11-08","Completed","Completed","98106",{"$f":"_xlfn.XLOOKUP(--fSeattle2020Complaints[[#This Row],[ZipCode]],dZipNeighborhood[ZipCode],dZipNeighborhood[Neighborhood])","v":"Delridge"}]
["Land UseWeeds ,","2020-08-26","Completed","Closed","98117",{"$f":"_xlfn.XLOOKUP(--fSeattle2020Complaints[[#This Row],[ZipCode]],dZipNeighborhood[ZipCode],dZipNeighborhood[Neighborhood])","v":"Sunset Hill"}]
["Weeds","2020-02-10","Completed","Completed","98108",{"$f":"_xlfn.XLOOKUP(--fSeattle2020Complaints[[#This Row],[ZipCode]],dZipNeighborhood[ZipCode],dZipNeighborhood[Neighborhood])","v":"Rainer Valley"}]
["Construction","2020-10-19","Completed","Completed","98125",{"$f":"_xlfn.XLOOKUP(--fSeattle2020Complaints[[#This Row],[ZipCode]],dZipNeighborhood[ZipCode],dZipNeighborhood[Neighborhood])","v":"Northgate"}]
["Construction","2020-07-17","Completed","Completed","98116",{"$f":"_xlfn.XLOOKUP(--fSeattle2020Complaints[[#This Row],[ZipCode]],dZipNeighborhood[ZipCode],dZipNeighborhood[Neighborhood])","v":"West Seattle"}]
["Emergency , Vacant Building","2020-06-18","Compliance Achieved","Completed","98144",{"$f":"_xlfn.XLOOKUP(--fSeattle2020Complaints[[#This Row],[ZipCode]],dZipNeighborhood[ZipCode],dZipNeighborhood[Neighborhood])","v":"Mount Baker"}]
["Tree","2020-09-12","No Access/Unable to Observe","Completed","98144",{"$f":"_xlfn.XLOOKUP(--fSeattle2020Complaints[[#This Row],[ZipCode]],dZipNeighborhood[ZipCode],dZipNeighborhood[Neighborhood])","v":"Mount Baker"}]
["Land Use","2020-04-22","Completed","Completed","98106",{"$f":"_xlfn.XLOOKUP(--fSeattle2020Complaints[[#This Row],[ZipCode]],dZipNeighborhood[ZipCode],dZipNeighborhood[Neighborhood])","v":"Delridge"}]
["Land Use","2020-10-16","Completed","Completed","98108",{"$f":"_xlfn.XLOOKUP(--fSeattle2020Complaints[[#This Row],[ZipCode]],dZipNeighborhood[ZipCode],dZipNeighborhood[Neighborhood])","v":"Rainer Valley"}]
["Land UseNoise ,","2020-06-30","No Access/Unable to Observe","Completed","98125",{"$f":"_xlfn.XLOOKUP(--fSeattle2020Complaints[[#This Row],[ZipCode]],dZipNeighborhood[ZipCode],dZipNeighborhood[Neighborhood])","v":"Northgate"}]
["Weeds","2020-01-23","Compliance Achieved","Completed","98108",{"$f":"_xlfn.XLOOKUP(--fSeattle2020Complaints[[#This Row],[ZipCode]],dZipNeighborhood[ZipCode],dZipNeighborhood[Neighborhood])","v":"Rainer Valley"}]
["Land Use","2020-02-04","Completed","Initiated","98199",{"$f":"_xlfn.XLOOKUP(--fSeattle2020Complaints[[#This Row],[ZipCode]],dZipNeighborhood[ZipCode],dZipNeighborhood[Neighborhood])","v":"Magnolia"}]
["Emergency","2020-02-11","Completed","Completed","98102",{"$f":"_xlfn.XLOOKUP(--fSeattle2020Complaints[[#This Row],[ZipCode]],dZipNeighborhood[ZipCode],dZipNeighborhood[Neighborhood])","v":"Capital Hill"}]
["Land Use","2020-01-27","Completed","Completed","98103",{"$f":"_xlfn.XLOOKUP(--fSeattle2020Complaints[[#This Row],[ZipCode]],dZipNeighborhood[ZipCode],dZipNeighborhood[Neighborhood])","v":"Greenwood"}]
["Vacant Building","2020-03-12","Completed","Completed","98199",{"$f":"_xlfn.XLOOKUP(--fSeattle2020Complaints[[#This Row],[ZipCode]],dZipNeighborhood[ZipCode],dZipNeighborhood[Neighborhood])","v":"Magnolia"}]
["Land Use","2020-07-05","Completed","Completed","98117",{"$f":"_xlfn.XLOOKUP(--fSeattle2020Complaints[[#This Row],[ZipCode]],dZipNeighborhood[ZipCode],dZipNeighborhood[Neighborhood])","v":"Sunset Hill"}]
["Weeds","2020-07-16","Compliance Achieved","Completed","98126",{"$f":"_xlfn.XLOOKUP(--fSeattle2020Complaints[[#This Row],[ZipCode]],dZipNeighborhood[ZipCode],dZipNeighborhood[Neighborhood])","v":"High Point"}]
["Construction","2020-02-03","Completed","Completed","98126",{"$f":"_xlfn.XLOOKUP(--fSeattle2020Complaints[[#This Row],[ZipCode]],dZipNeighborhood[ZipCode],dZipNeighborhood[Neighborhood])","v":"High Point"}]
["Tree","2020-05-15","Completed","Completed","98115",{"$f":"_xlfn.XLOOKUP(--fSeattle2020Complaints[[#This Row],[ZipCode]],dZipNeighborhood[ZipCode],dZipNeighborhood[Neighborhood])","v":"Greenlake"}]
["Land Use","2020-03-30","Completed","Completed","98146",{"$f":"_xlfn.XLOOKUP(--fSeattle2020Complaints[[#This Row],[ZipCode]],dZipNeighborhood[ZipCode],dZipNeighborhood[Neighborhood])","v":"Shorewood, White Center"}]
["Weeds","2020-08-03","Completed","Completed","98136",{"$f":"_xlfn.XLOOKUP(--fSeattle2020Complaints[[#This Row],[ZipCode]],dZipNeighborhood[ZipCode],dZipNeighborhood[Neighborhood])","v":"Seaview"}]
["Emergency , Vacant Building","2020-04-16","Compliance Achieved","Completed","98125",{"$f":"_xlfn.XLOOKUP(--fSeattle2020Complaints[[#This Row],[ZipCode]],dZipNeighborhood[ZipCode],dZipNeighborhood[Neighborhood])","v":"Northgate"}]
["Land Use","2020-07-17","Completed","Completed","98136",{"$f":"_xlfn.XLOOKUP(--fSeattle2020Complaints[[#This Row],[ZipCode]],dZipNeighborhood[ZipCode],dZipNeighborhood[Neighborhood])","v":"Seaview"}]
["Emergency","2020-02-19","Completed","Completed","98107",{"$f":"_xlfn.XLOOKUP(--fSeattle2020Complaints[[#This Row],[ZipCode]],dZipNeighborhood[ZipCode],dZipNeighborhood[Neighborhood])","v":"Ballard"}]
["Weeds","2020-09-28","Completed","Completed","98115",{"$f":"_xlfn.XLOOKUP(--fSeattle2020Complaints[[#This Row],[ZipCode]],dZipNeighborhood[ZipCode],dZipNeighborhood[Neighborhood])","v":"Greenlake"}]
["Construction","2020-06-29","Completed","Completed","98112",{"$f":"_xlfn.XLOOKUP(--fSeattle2020Complaints[[#This Row],[ZipCode]],dZipNeighborhood[ZipCode],dZipNeighborhood[Neighborhood])","v":"Madison Park"}]
["Land Use","2020-05-30","Completed","Completed","98136",{"$f":"_xlfn.XLOOKUP(--fSeattle2020Complaints[[#This Row],[ZipCode]],dZipNeighborhood[ZipCode],dZipNeighborhood[Neighborhood])","v":"Seaview"}]
["Weeds","2020-02-28","No Violation","Completed","98103",{"$f":"_xlfn.XLOOKUP(--fSeattle2020Complaints[[#This Row],[ZipCode]],dZipNeighborhood[ZipCode],dZipNeighborhood[Neighborhood])","v":"Greenwood"}]
["Land Use","2020-11-05","Completed","Under Investigation","98116",{"$f":"_xlfn.XLOOKUP(--fSeattle2020Complaints[[#This Row],[ZipCode]],dZipNeighborhood[ZipCode],dZipNeighborhood[Neighborhood])","v":"West Seattle"}]
["Vacant Building","2020-03-27","Completed","Completed","98144",{"$f":"_xlfn.XLOOKUP(--fSeattle2020Complaints[[#This Row],[ZipCode]],dZipNeighborhood[ZipCode],dZipNeighborhood[Neighborhood])","v":"Mount Baker"}]
["Land UseNoise ,","2020-01-01","Completed","Closed","98119",{"$f":"_xlfn.XLOOKUP(--fSeattle2020Complaints[[#This Row],[ZipCode]],dZipNeighborhood[ZipCode],dZipNeighborhood[Neighborhood])","v":"Queen Anne"}]
["Weeds","2020-07-31","Completed","Completed","98107",{"$f":"_xlfn.XLOOKUP(--fSeattle2020Complaints[[#This Row],[ZipCode]],dZipNeighborhood[ZipCode],dZipNeighborhood[Neighborhood])","v":"Ballard"}]
["Emergency , Vacant Building","2020-05-28","Completed","Completed","98109",{"$f":"_xlfn.XLOOKUP(--fSeattle2020Complaints[[#This Row],[ZipCode]],dZipNeighborhood[ZipCode],dZipNeighborhood[Neighborhood])","v":"South Lake Union"}]
["Vacant Building","2020-11-16","Completed","Closed","98107",{"$f":"_xlfn.XLOOKUP(--fSeattle2020Complaints[[#This Row],[ZipCode]],dZipNeighborhood[ZipCode],dZipNeighborhood[Neighborhood])","v":"Ballard"}]
["Construction","2020-06-16","No Access/Unable to Observe","Closed","98122",{"$f":"_xlfn.XLOOKUP(--fSeattle2020Complaints[[#This Row],[ZipCode]],dZipNeighborhood[ZipCode],dZipNeighborhood[Neighborhood])","v":"Minor, Central Area"}]
["Weeds","2020-07-07","Completed","Completed","98119",{"$f":"_xlfn.XLOOKUP(--fSeattle2020Complaints[[#This Row],[ZipCode]],dZipNeighborhood[ZipCode],dZipNeighborhood[Neighborhood])","v":"Queen Anne"}]
["Land Use","2020-01-19","Completed","Completed","98126",{"$f":"_xlfn.XLOOKUP(--fSeattle2020Complaints[[#This Row],[ZipCode]],dZipNeighborhood[ZipCode],dZipNeighborhood[Neighborhood])","v":"High Point"}]
["Land Use","2020-07-20","Compliance Achieved","Completed","98105",{"$f":"_xlfn.XLOOKUP(--fSeattle2020Complaints[[#This Row],[ZipCode]],dZipNeighborhood[ZipCode],dZipNeighborhood[Neighborhood])","v":"University District"}]
["Construction","2020-06-26","Completed","Under Investigation","98144",{"$f":"_xlfn.XLOOKUP(--fSeattle2020Complaints[[#This Row],[ZipCode]],dZipNeighborhood[ZipCode],dZipNeighborhood[Neighborhood])","v":"Mount Baker"}]
["Construction","2020-10-08","Completed","Under Investigation","98115",{"$f":"_xlfn.XLOOKUP(--fSeattle2020Complaints[[#This Row],[ZipCode]],dZipNeighborhood[ZipCode],dZipNeighborhood[Neighborhood])","v":"Greenlake"}]
["Weeds","2020-02-13","No Violation","Completed","98103",{"$f":"_xlfn.XLOOKUP(--fSeattle2020Complaints[[#This Row],[ZipCode]],dZipNeighborhood[ZipCode],dZipNeighborhood[Neighborhood])","v":"Greenwood"}]
["Construction","2020-02-17","Completed","Completed","98126",{"$f":"_xlfn.XLOOKUP(--fSeattle2020Complaints[[#This Row],[ZipCode]],dZipNeighborhood[ZipCode],dZipNeighborhood[Neighborhood])","v":"High Point"}]
["Weeds","2020-09-07","Completed","Completed","98115",{"$f":"_xlfn.XLOOKUP(--fSeattle2020Complaints[[#This Row],[ZipCode]],dZipNeighborhood[ZipCode],dZipNeighborhood[Neighborhood])","v":"Greenlake"}]
["Land Use","2020-03-19","Compliance Achieved","Completed","98105",{"$f":"_xlfn.XLOOKUP(--fSeattle2020Complaints[[#This Row],[ZipCode]],dZipNeighborhood[ZipCode],dZipNeighborhood[Neighborhood])","v":"University District"}]
["Land Use","2020-01-05","Completed","Completed","98118",{"$f":"_xlfn.XLOOKUP(--fSeattle2020Complaints[[#This Row],[ZipCode]],dZipNeighborhood[ZipCode],dZipNeighborhood[Neighborhood])","v":"Columbia City"}]
["Weeds","2020-06-06","Completed","Completed","98107",{"$f":"_xlfn.XLOOKUP(--fSeattle2020Complaints[[#This Row],[ZipCode]],dZipNeighborhood[ZipCode],dZipNeighborhood[Neighborhood])","v":"Ballard"}]
["Vacant Building","2020-10-13","Completed","Closed","98144",{"$f":"_xlfn.XLOOKUP(--fSeattle2020Complaints[[#This Row],[ZipCode]],dZipNeighborhood[ZipCode],dZipNeighborhood[Neighborhood])","v":"Mount Baker"}]
["Land Use","2020-11-24","Completed","Completed","98102",{"$f":"_xlfn.XLOOKUP(--fSeattle2020Complaints[[#This Row],[ZipCode]],dZipNeighborhood[ZipCode],dZipNeighborhood[Neighborhood])","v":"Capital Hill"}]
["Vacant Building","2020-02-09","Completed","Closed","98103",{"$f":"_xlfn.XLOOKUP(--fSeattle2020Complaints[[#This Row],[ZipCode]],dZipNeighborhood[ZipCode],dZipNeighborhood[Neighborhood])","v":"Greenwood"}]
["Vacant Building","2020-04-14","Completed","Closed","98103",{"$f":"_xlfn.XLOOKUP(--fSeattle2020Complaints[[#This Row],[ZipCode]],dZipNeighborhood[ZipCode],dZipNeighborhood[Neighborhood])","v":"Greenwood"}]
["Construction","2020-10-08","Completed","Completed","98109",{"$f":"_xlfn.XLOOKUP(--fSeattle2020Complaints[[#This Row],[ZipCode]],dZipNeighborhood[ZipCode],dZipNeighborhood[Neighborhood])","v":"South Lake Union"}]
["Construction","2020-02-22","Completed","Completed","98122",{"$f":"_xlfn.XLOOKUP(--fSeattle2020Complaints[[#This Row],[ZipCode]],dZipNeighborhood[ZipCode],dZipNeighborhood[Neighborhood])","v":"Minor, Central Area"}]
["Vacant Building","2020-10-16","Completed","Completed","98107",{"$f":"_xlfn.XLOOKUP(--fSeattle2020Complaints[[#This Row],[ZipCode]],dZipNeighborhood[ZipCode],dZipNeighborhood[Neighborhood])","v":"Ballard"}]
["Land Use","2020-06-19","Completed","Completed","98107",{"$f":"_xlfn.XLOOKUP(--fSeattle2020Complaints[[#This Row],[ZipCode]],dZipNeighborhood[ZipCode],dZipNeighborhood[Neighborhood])","v":"Ballard"}]
["Land Use","2020-06-18","Completed","Completed","98126",{"$f":"_xlfn.XLOOKUP(--fSeattle2020Complaints[[#This Row],[ZipCode]],dZipNeighborhood[ZipCode],dZipNeighborhood[Neighborhood])","v":"High Point"}]
["Emergency","2020-04-23","Compliance Achieved","Completed","98105",{"$f":"_xlfn.XLOOKUP(--fSeattle2020Complaints[[#This Row],[ZipCode]],dZipNeighborhood[ZipCode],dZipNeighborhood[Neighborhood])","v":"University District"}]
["Weeds","2020-09-14","Completed","Completed","98199",{"$f":"_xlfn.XLOOKUP(--fSeattle2020Complaints[[#This Row],[ZipCode]],dZipNeighborhood[ZipCode],dZipNeighborhood[Neighborhood])","v":"Magnolia"}]
["LandLord/Tenant","2020-08-19","Completed","Completed","98103",{"$f":"_xlfn.XLOOKUP(--fSeattle2020Complaints[[#This Row],[ZipCode]],dZipNeighborhood[ZipCode],dZipNeighborhood[Neighborhood])","v":"Greenwood"}]
["Land UseTree ,","2020-08-14","Completed","Completed","98115",{"$f":"_xlfn.XLOOKUP(--fSeattle2020Complaints[[#This Row],[ZipCode]],dZipNeighborhood[ZipCode],dZipNeighborhood[Neighborhood])","v":"Greenlake"}]
["Weeds","2020-02-10","Completed","Completed","98125",{"$f":"_xlfn.XLOOKUP(--fSeattle2020Complaints[[#This Row],[ZipCode]],dZipNeighborhood[ZipCode],dZipNeighborhood[Neighborhood])","v":"Northgate"}]
["Construction","2020-02-26","Completed","Closed","98116",{"$f":"_xlfn.XLOOKUP(--fSeattle2020Complaints[[#This Row],[ZipCode]],dZipNeighborhood[ZipCode],dZipNeighborhood[Neighborhood])","v":"West Seattle"}]
["Vacant Building","2020-02-03","Completed","Completed","98103",{"$f":"_xlfn.XLOOKUP(--fSeattle2020Complaints[[#This Row],[ZipCode]],dZipNeighborhood[ZipCode],dZipNeighborhood[Neighborhood])","v":"Greenwood"}]
["Weeds","2020-06-27","Completed","Completed","98103",{"$f":"_xlfn.XLOOKUP(--fSeattle2020Complaints[[#This Row],[ZipCode]],dZipNeighborhood[ZipCode],dZipNeighborhood[Neighborhood])","v":"Greenwood"}]
["Land Use","2020-07-22","Completed","Completed","98136",{"$f":"_xlfn.XLOOKUP(--fSeattle2020Complaints[[#This Row],[ZipCode]],dZipNeighborhood[ZipCode],dZipNeighborhood[Neighborhood])","v":"Seaview"}]
["Construction","2020-12-08","Completed","Completed","98115",{"$f":"_xlfn.XLOOKUP(--fSeattle2020Complaints[[#This Row],[ZipCode]],dZipNeighborhood[ZipCode],dZipNeighborhood[Neighborhood])","v":"Greenlake"}]
["Shoreline","2020-07-24","No Access/Unable to Observe","Completed","98125",{"$f":"_xlfn.XLOOKUP(--fSeattle2020Complaints[[#This Row],[ZipCode]],dZipNeighborhood[ZipCode],dZipNeighborhood[Neighborhood])","v":"Northgate"}]
["Land Use","2020-04-07","Completed","Completed","98106",{"$f":"_xlfn.XLOOKUP(--fSeattle2020Complaints[[#This Row],[ZipCode]],dZipNeighborhood[ZipCode],dZipNeighborhood[Neighborhood])","v":"Delridge"}]
["Land Use","2020-03-12","Compliance Achieved","Completed","98144",{"$f":"_xlfn.XLOOKUP(--fSeattle2020Complaints[[#This Row],[ZipCode]],dZipNeighborhood[ZipCode],dZipNeighborhood[Neighborhood])","v":"Mount Baker"}]
["Vacant Building","2020-04-16","Completed","Completed","98125",{"$f":"_xlfn.XLOOKUP(--fSeattle2020Complaints[[#This Row],[ZipCode]],dZipNeighborhood[ZipCode],dZipNeighborhood[Neighborhood])","v":"Northgate"}]
["Land Use","2020-04-02","Compliance Achieved","Completed","98105",{"$f":"_xlfn.XLOOKUP(--fSeattle2020Complaints[[#This Row],[ZipCode]],dZipNeighborhood[ZipCode],dZipNeighborhood[Neighborhood])","v":"University District"}]
["Land Use","2020-11-29","No Access/Unable to Observe","Completed","98118",{"$f":"_xlfn.XLOOKUP(--fSeattle2020Complaints[[#This Row],[ZipCode]],dZipNeighborhood[ZipCode],dZipNeighborhood[Neighborhood])","v":"Columbia City"}]
["Construction","2020-02-10","Completed","Closed","98112",{"$f":"_xlfn.XLOOKUP(--fSeattle2020Complaints[[#This Row],[ZipCode]],dZipNeighborhood[ZipCode],dZipNeighborhood[Neighborhood])","v":"Madison Park"}]
["Construction","2020-06-30","Completed","Completed","98104",{"$f":"_xlfn.XLOOKUP(--fSeattle2020Complaints[[#This Row],[ZipCode]],dZipNeighborhood[ZipCode],dZipNeighborhood[Neighborhood])","v":"International District"}]
["Construction","2020-01-28","Completed","Completed","98103",{"$f":"_xlfn.XLOOKUP(--fSeattle2020Complaints[[#This Row],[ZipCode]],dZipNeighborhood[ZipCode],dZipNeighborhood[Neighborhood])","v":"Greenwood"}]
["Land Use","2020-12-14","Completed","Completed","98144",{"$f":"_xlfn.XLOOKUP(--fSeattle2020Complaints[[#This Row],[ZipCode]],dZipNeighborhood[ZipCode],dZipNeighborhood[Neighborhood])","v":"Mount Baker"}]
["Land Use","2020-03-10","Completed","Initiated","98126",{"$f":"_xlfn.XLOOKUP(--fSeattle2020Complaints[[#This Row],[ZipCode]],dZipNeighborhood[ZipCode],dZipNeighborhood[Neighborhood])","v":"High Point"}]
["Land Use","2020-11-05","Completed","Closed","98118",{"$f":"_xlfn.XLOOKUP(--fSeattle2020Complaints[[#This Row],[ZipCode]],dZipNeighborhood[ZipCode],dZipNeighborhood[Neighborhood])","v":"Columbia City"}]
["Tree","2020-03-10","Completed","Initiated","98108",{"$f":"_xlfn.XLOOKUP(--fSeattle2020Complaints[[#This Row],[ZipCode]],dZipNeighborhood[ZipCode],dZipNeighborhood[Neighborhood])","v":"Rainer Valley"}]
["Construction","2020-03-11","Completed","Completed","98106",{"$f":"_xlfn.XLOOKUP(--fSeattle2020Complaints[[#This Row],[ZipCode]],dZipNeighborhood[ZipCode],dZipNeighborhood[Neighborhood])","v":"Delridge"}]
["Emergency , Vacant Building","2020-04-13","Completed","Completed","98118",{"$f":"_xlfn.XLOOKUP(--fSeattle2020Complaints[[#This Row],[ZipCode]],dZipNeighborhood[ZipCode],dZipNeighborhood[Neighborhood])","v":"Columbia City"}]
["Weeds","2020-06-05","Completed","Completed","98106",{"$f":"_xlfn.XLOOKUP(--fSeattle2020Complaints[[#This Row],[ZipCode]],dZipNeighborhood[ZipCode],dZipNeighborhood[Neighborhood])","v":"Delridge"}]
["Weeds","2020-07-06","Compliance Achieved","Completed","98106",{"$f":"_xlfn.XLOOKUP(--fSeattle2020Complaints[[#This Row],[ZipCode]],dZipNeighborhood[ZipCode],dZipNeighborhood[Neighborhood])","v":"Delridge"}]
["Weeds","2020-10-01","Completed","Completed","98199",{"$f":"_xlfn.XLOOKUP(--fSeattle2020Complaints[[#This Row],[ZipCode]],dZipNeighborhood[ZipCode],dZipNeighborhood[Neighborhood])","v":"Magnolia"}]
["Construction , ECA","2020-06-03","Waived","Under Investigation","98116",{"$f":"_xlfn.XLOOKUP(--fSeattle2020Complaints[[#This Row],[ZipCode]],dZipNeighborhood[ZipCode],dZipNeighborhood[Neighborhood])","v":"West Seattle"}]
["Construction","2020-09-03","Completed","Completed","98106",{"$f":"_xlfn.XLOOKUP(--fSeattle2020Complaints[[#This Row],[ZipCode]],dZipNeighborhood[ZipCode],dZipNeighborhood[Neighborhood])","v":"Delridge"}]
["Construction","2020-09-09","Completed","Completed","98106",{"$f":"_xlfn.XLOOKUP(--fSeattle2020Complaints[[#This Row],[ZipCode]],dZipNeighborhood[ZipCode],dZipNeighborhood[Neighborhood])","v":"Delridge"}]
["Vacant Building","2020-04-13","Completed","Completed","98122",{"$f":"_xlfn.XLOOKUP(--fSeattle2020Complaints[[#This Row],[ZipCode]],dZipNeighborhood[ZipCode],dZipNeighborhood[Neighborhood])","v":"Minor, Central Area"}]
["Land Use","2020-10-31","Completed","Completed","98144",{"$f":"_xlfn.XLOOKUP(--fSeattle2020Complaints[[#This Row],[ZipCode]],dZipNeighborhood[ZipCode],dZipNeighborhood[Neighborhood])","v":"Mount Baker"}]
["Weeds","2020-06-10","Completed","Completed","98109",{"$f":"_xlfn.XLOOKUP(--fSeattle2020Complaints[[#This Row],[ZipCode]],dZipNeighborhood[ZipCode],dZipNeighborhood[Neighborhood])","v":"South Lake Union"}]
["Construction","2020-03-12","Completed","Completed","98126",{"$f":"_xlfn.XLOOKUP(--fSeattle2020Complaints[[#This Row],[ZipCode]],dZipNeighborhood[ZipCode],dZipNeighborhood[Neighborhood])","v":"High Point"}]
["Construction","2020-09-07","Completed","Completed","98125",{"$f":"_xlfn.XLOOKUP(--fSeattle2020Complaints[[#This Row],[ZipCode]],dZipNeighborhood[ZipCode],dZipNeighborhood[Neighborhood])","v":"Northgate"}]
["Tree","2020-06-04","Completed","NOV Issued","98115",{"$f":"_xlfn.XLOOKUP(--fSeattle2020Complaints[[#This Row],[ZipCode]],dZipNeighborhood[ZipCode],dZipNeighborhood[Neighborhood])","v":"Greenlake"}]
["Vacant Building","2020-01-13","Completed","Completed","98144",{"$f":"_xlfn.XLOOKUP(--fSeattle2020Complaints[[#This Row],[ZipCode]],dZipNeighborhood[ZipCode],dZipNeighborhood[Neighborhood])","v":"Mount Baker"}]
["Weeds","2020-09-08","Completed","Completed","98109",{"$f":"_xlfn.XLOOKUP(--fSeattle2020Complaints[[#This Row],[ZipCode]],dZipNeighborhood[ZipCode],dZipNeighborhood[Neighborhood])","v":"South Lake Union"}]
["Construction","2020-02-12","Completed","Completed","98103",{"$f":"_xlfn.XLOOKUP(--fSeattle2020Complaints[[#This Row],[ZipCode]],dZipNeighborhood[ZipCode],dZipNeighborhood[Neighborhood])","v":"Greenwood"}]
["Land Use","2020-02-20","Completed","Completed","98118",{"$f":"_xlfn.XLOOKUP(--fSeattle2020Complaints[[#This Row],[ZipCode]],dZipNeighborhood[ZipCode],dZipNeighborhood[Neighborhood])","v":"Columbia City"}]
["Weeds","2020-11-06","Completed","Completed","98146",{"$f":"_xlfn.XLOOKUP(--fSeattle2020Complaints[[#This Row],[ZipCode]],dZipNeighborhood[ZipCode],dZipNeighborhood[Neighborhood])","v":"Shorewood, White Center"}]
["Land Use","2020-02-21","Completed","Initiated","98112",{"$f":"_xlfn.XLOOKUP(--fSeattle2020Complaints[[#This Row],[ZipCode]],dZipNeighborhood[ZipCode],dZipNeighborhood[Neighborhood])","v":"Madison Park"}]
["Land Use","2020-07-17","Completed","Initiated","98126",{"$f":"_xlfn.XLOOKUP(--fSeattle2020Complaints[[#This Row],[ZipCode]],dZipNeighborhood[ZipCode],dZipNeighborhood[Neighborhood])","v":"High Point"}]
["Construction","2020-12-29","Completed","Completed","98105",{"$f":"_xlfn.XLOOKUP(--fSeattle2020Complaints[[#This Row],[ZipCode]],dZipNeighborhood[ZipCode],dZipNeighborhood[Neighborhood])","v":"University District"}]
["Construction","2020-11-13","Completed","Completed","98106",{"$f":"_xlfn.XLOOKUP(--fSeattle2020Complaints[[#This Row],[ZipCode]],dZipNeighborhood[ZipCode],dZipNeighborhood[Neighborhood])","v":"Delridge"}]
["Land Use","2020-08-20","Completed","Completed","98118",{"$f":"_xlfn.XLOOKUP(--fSeattle2020Complaints[[#This Row],[ZipCode]],dZipNeighborhood[ZipCode],dZipNeighborhood[Neighborhood])","v":"Columbia City"}]
["Land Use","2020-02-04","Completed","Warning","98118",{"$f":"_xlfn.XLOOKUP(--fSeattle2020Complaints[[#This Row],[ZipCode]],dZipNeighborhood[ZipCode],dZipNeighborhood[Neighborhood])","v":"Columbia City"}]
["Weeds","2020-11-04","Completed","Completed","98107",{"$f":"_xlfn.XLOOKUP(--fSeattle2020Complaints[[#This Row],[ZipCode]],dZipNeighborhood[ZipCode],dZipNeighborhood[Neighborhood])","v":"Ballard"}]
["Construction","2020-11-11","Completed","Completed","98102",{"$f":"_xlfn.XLOOKUP(--fSeattle2020Complaints[[#This Row],[ZipCode]],dZipNeighborhood[ZipCode],dZipNeighborhood[Neighborhood])","v":"Capital Hill"}]
["Weeds","2020-08-07","No Access/Unable to Observe","Completed","98126",{"$f":"_xlfn.XLOOKUP(--fSeattle2020Complaints[[#This Row],[ZipCode]],dZipNeighborhood[ZipCode],dZipNeighborhood[Neighborhood])","v":"High Point"}]
["Land Use","2020-07-10","Admin Closure","Closed","98119",{"$f":"_xlfn.XLOOKUP(--fSeattle2020Complaints[[#This Row],[ZipCode]],dZipNeighborhood[ZipCode],dZipNeighborhood[Neighborhood])","v":"Queen Anne"}]
["Weeds","2020-10-27","Completed","Completed","98115",{"$f":"_xlfn.XLOOKUP(--fSeattle2020Complaints[[#This Row],[ZipCode]],dZipNeighborhood[ZipCode],dZipNeighborhood[Neighborhood])","v":"Greenlake"}]
["Land Use","2020-04-03","Compliance Achieved","Completed","98144",{"$f":"_xlfn.XLOOKUP(--fSeattle2020Complaints[[#This Row],[ZipCode]],dZipNeighborhood[ZipCode],dZipNeighborhood[Neighborhood])","v":"Mount Baker"}]
["Land Use","2020-09-05","Completed","Completed","98125",{"$f":"_xlfn.XLOOKUP(--fSeattle2020Complaints[[#This Row],[ZipCode]],dZipNeighborhood[ZipCode],dZipNeighborhood[Neighborhood])","v":"Northgate"}]
["Construction","2020-01-11","Completed","Completed","98116",{"$f":"_xlfn.XLOOKUP(--fSeattle2020Complaints[[#This Row],[ZipCode]],dZipNeighborhood[ZipCode],dZipNeighborhood[Neighborhood])","v":"West Seattle"}]
["Land Use","2020-06-21","Completed","Closed","98122",{"$f":"_xlfn.XLOOKUP(--fSeattle2020Complaints[[#This Row],[ZipCode]],dZipNeighborhood[ZipCode],dZipNeighborhood[Neighborhood])","v":"Minor, Central Area"}]
["Weeds","2020-07-31","Completed","Completed","98133",{"$f":"_xlfn.XLOOKUP(--fSeattle2020Complaints[[#This Row],[ZipCode]],dZipNeighborhood[ZipCode],dZipNeighborhood[Neighborhood])","v":"Shoreline"}]
["Land Use","2020-10-09","Completed","Completed","98126",{"$f":"_xlfn.XLOOKUP(--fSeattle2020Complaints[[#This Row],[ZipCode]],dZipNeighborhood[ZipCode],dZipNeighborhood[Neighborhood])","v":"High Point"}]
["Land Use","2020-07-05","Completed","Completed","98199",{"$f":"_xlfn.XLOOKUP(--fSeattle2020Complaints[[#This Row],[ZipCode]],dZipNeighborhood[ZipCode],dZipNeighborhood[Neighborhood])","v":"Magnolia"}]
["Construction , Tree","2020-12-22","No Violation","Completed","98126",{"$f":"_xlfn.XLOOKUP(--fSeattle2020Complaints[[#This Row],[ZipCode]],dZipNeighborhood[ZipCode],dZipNeighborhood[Neighborhood])","v":"High Point"}]
["Construction","2020-03-01","Completed","Closed","98118",{"$f":"_xlfn.XLOOKUP(--fSeattle2020Complaints[[#This Row],[ZipCode]],dZipNeighborhood[ZipCode],dZipNeighborhood[Neighborhood])","v":"Columbia City"}]
["Weeds","2020-07-28","Completed","Completed","98126",{"$f":"_xlfn.XLOOKUP(--fSeattle2020Complaints[[#This Row],[ZipCode]],dZipNeighborhood[ZipCode],dZipNeighborhood[Neighborhood])","v":"High Point"}]
["Land Use","2020-05-04","Completed","Completed","98105",{"$f":"_xlfn.XLOOKUP(--fSeattle2020Complaints[[#This Row],[ZipCode]],dZipNeighborhood[ZipCode],dZipNeighborhood[Neighborhood])","v":"University District"}]
["Land Use","2020-05-11","Completed","Completed","98109",{"$f":"_xlfn.XLOOKUP(--fSeattle2020Complaints[[#This Row],[ZipCode]],dZipNeighborhood[ZipCode],dZipNeighborhood[Neighborhood])","v":"South Lake Union"}]
["Construction","2020-01-22","Completed","Completed","98109",{"$f":"_xlfn.XLOOKUP(--fSeattle2020Complaints[[#This Row],[ZipCode]],dZipNeighborhood[ZipCode],dZipNeighborhood[Neighborhood])","v":"South Lake Union"}]
["Weeds","2020-10-09","Completed","Completed","98105",{"$f":"_xlfn.XLOOKUP(--fSeattle2020Complaints[[#This Row],[ZipCode]],dZipNeighborhood[ZipCode],dZipNeighborhood[Neighborhood])","v":"University District"}]
["Construction , Noise","2020-04-15","Completed","Completed","98199",{"$f":"_xlfn.XLOOKUP(--fSeattle2020Complaints[[#This Row],[ZipCode]],dZipNeighborhood[ZipCode],dZipNeighborhood[Neighborhood])","v":"Magnolia"}]
["Construction","2020-01-24","Completed","Completed","98107",{"$f":"_xlfn.XLOOKUP(--fSeattle2020Complaints[[#This Row],[ZipCode]],dZipNeighborhood[ZipCode],dZipNeighborhood[Neighborhood])","v":"Ballard"}]
["Construction","2020-03-02","Completed","Completed","98199",{"$f":"_xlfn.XLOOKUP(--fSeattle2020Complaints[[#This Row],[ZipCode]],dZipNeighborhood[ZipCode],dZipNeighborhood[Neighborhood])","v":"Magnolia"}]
["Weeds","2020-05-07","Completed","Completed","98116",{"$f":"_xlfn.XLOOKUP(--fSeattle2020Complaints[[#This Row],[ZipCode]],dZipNeighborhood[ZipCode],dZipNeighborhood[Neighborhood])","v":"West Seattle"}]
["Construction","2020-10-14","Completed","Completed","98119",{"$f":"_xlfn.XLOOKUP(--fSeattle2020Complaints[[#This Row],[ZipCode]],dZipNeighborhood[ZipCode],dZipNeighborhood[Neighborhood])","v":"Queen Anne"}]
["Tree","2020-02-17","Completed","Completed","98103",{"$f":"_xlfn.XLOOKUP(--fSeattle2020Complaints[[#This Row],[ZipCode]],dZipNeighborhood[ZipCode],dZipNeighborhood[Neighborhood])","v":"Greenwood"}]
["Land Use","2020-03-09","Completed","Completed","98122",{"$f":"_xlfn.XLOOKUP(--fSeattle2020Complaints[[#This Row],[ZipCode]],dZipNeighborhood[ZipCode],dZipNeighborhood[Neighborhood])","v":"Minor, Central Area"}]
["Land Use","2020-02-05","Completed","Completed","98117",{"$f":"_xlfn.XLOOKUP(--fSeattle2020Complaints[[#This Row],[ZipCode]],dZipNeighborhood[ZipCode],dZipNeighborhood[Neighborhood])","v":"Sunset Hill"}]
["Land Use","2020-01-11","Completed","Completed","98119",{"$f":"_xlfn.XLOOKUP(--fSeattle2020Complaints[[#This Row],[ZipCode]],dZipNeighborhood[ZipCode],dZipNeighborhood[Neighborhood])","v":"Queen Anne"}]
["Weeds","2020-02-11","Completed","Completed","98115",{"$f":"_xlfn.XLOOKUP(--fSeattle2020Complaints[[#This Row],[ZipCode]],dZipNeighborhood[ZipCode],dZipNeighborhood[Neighborhood])","v":"Greenlake"}]
["Weeds","2020-09-06","Completed","Completed","98116",{"$f":"_xlfn.XLOOKUP(--fSeattle2020Complaints[[#This Row],[ZipCode]],dZipNeighborhood[ZipCode],dZipNeighborhood[Neighborhood])","v":"West Seattle"}]
["Weeds","2020-09-08","Completed","Completed","98126",{"$f":"_xlfn.XLOOKUP(--fSeattle2020Complaints[[#This Row],[ZipCode]],dZipNeighborhood[ZipCode],dZipNeighborhood[Neighborhood])","v":"High Point"}]
["Weeds","2020-08-12","Completed","Completed","98118",{"$f":"_xlfn.XLOOKUP(--fSeattle2020Complaints[[#This Row],[ZipCode]],dZipNeighborhood[ZipCode],dZipNeighborhood[Neighborhood])","v":"Columbia City"}]
["Land Use","2020-08-05","Completed","Closed","98125",{"$f":"_xlfn.XLOOKUP(--fSeattle2020Complaints[[#This Row],[ZipCode]],dZipNeighborhood[ZipCode],dZipNeighborhood[Neighborhood])","v":"Northgate"}]
["Construction","2020-07-07","Completed","NOV Issued","98118",{"$f":"_xlfn.XLOOKUP(--fSeattle2020Complaints[[#This Row],[ZipCode]],dZipNeighborhood[ZipCode],dZipNeighborhood[Neighborhood])","v":"Columbia City"}]
["Weeds","2020-06-16","Compliance Achieved","Completed","98115",{"$f":"_xlfn.XLOOKUP(--fSeattle2020Complaints[[#This Row],[ZipCode]],dZipNeighborhood[ZipCode],dZipNeighborhood[Neighborhood])","v":"Greenlake"}]
["Construction","2020-11-11","Completed","Under Investigation","98122",{"$f":"_xlfn.XLOOKUP(--fSeattle2020Complaints[[#This Row],[ZipCode]],dZipNeighborhood[ZipCode],dZipNeighborhood[Neighborhood])","v":"Minor, Central Area"}]
["Construction","2020-10-19","Completed","Completed","98118",{"$f":"_xlfn.XLOOKUP(--fSeattle2020Complaints[[#This Row],[ZipCode]],dZipNeighborhood[ZipCode],dZipNeighborhood[Neighborhood])","v":"Columbia City"}]
["Land Use","2020-11-01","Completed","Completed","98199",{"$f":"_xlfn.XLOOKUP(--fSeattle2020Complaints[[#This Row],[ZipCode]],dZipNeighborhood[ZipCode],dZipNeighborhood[Neighborhood])","v":"Magnolia"}]
["Weeds","2020-11-02","Completed","Completed","98108",{"$f":"_xlfn.XLOOKUP(--fSeattle2020Complaints[[#This Row],[ZipCode]],dZipNeighborhood[ZipCode],dZipNeighborhood[Neighborhood])","v":"Rainer Valley"}]
["Vacant Building","2020-05-19","Compliance Achieved","Completed","98107",{"$f":"_xlfn.XLOOKUP(--fSeattle2020Complaints[[#This Row],[ZipCode]],dZipNeighborhood[ZipCode],dZipNeighborhood[Neighborhood])","v":"Ballard"}]
["Construction","2020-02-21","Completed","Closed","98107",{"$f":"_xlfn.XLOOKUP(--fSeattle2020Complaints[[#This Row],[ZipCode]],dZipNeighborhood[ZipCode],dZipNeighborhood[Neighborhood])","v":"Ballard"}]
["Construction , ECA","2020-12-23","Completed","Under Investigation","98122",{"$f":"_xlfn.XLOOKUP(--fSeattle2020Complaints[[#This Row],[ZipCode]],dZipNeighborhood[ZipCode],dZipNeighborhood[Neighborhood])","v":"Minor, Central Area"}]
["Land Use","2020-08-05","Completed","Completed","98106",{"$f":"_xlfn.XLOOKUP(--fSeattle2020Complaints[[#This Row],[ZipCode]],dZipNeighborhood[ZipCode],dZipNeighborhood[Neighborhood])","v":"Delridge"}]
["Vacant Building","2020-09-02","Completed","Closed","98107",{"$f":"_xlfn.XLOOKUP(--fSeattle2020Complaints[[#This Row],[ZipCode]],dZipNeighborhood[ZipCode],dZipNeighborhood[Neighborhood])","v":"Ballard"}]
["Emergency , Vacant Building","2020-04-03","Compliance Achieved","Completed","98122",{"$f":"_xlfn.XLOOKUP(--fSeattle2020Complaints[[#This Row],[ZipCode]],dZipNeighborhood[ZipCode],dZipNeighborhood[Neighborhood])","v":"Minor, Central Area"}]
["Land Use","2020-02-16","Completed","Completed","98136",{"$f":"_xlfn.XLOOKUP(--fSeattle2020Complaints[[#This Row],[ZipCode]],dZipNeighborhood[ZipCode],dZipNeighborhood[Neighborhood])","v":"Seaview"}]
["Weeds","2020-06-16","Compliance Achieved","Completed","98115",{"$f":"_xlfn.XLOOKUP(--fSeattle2020Complaints[[#This Row],[ZipCode]],dZipNeighborhood[ZipCode],dZipNeighborhood[Neighborhood])","v":"Greenlake"}]
["Land Use","2020-08-12","Completed","Completed","98133",{"$f":"_xlfn.XLOOKUP(--fSeattle2020Complaints[[#This Row],[ZipCode]],dZipNeighborhood[ZipCode],dZipNeighborhood[Neighborhood])","v":"Shoreline"}]
["Construction","2020-09-15","Completed","Under Investigation","98144",{"$f":"_xlfn.XLOOKUP(--fSeattle2020Complaints[[#This Row],[ZipCode]],dZipNeighborhood[ZipCode],dZipNeighborhood[Neighborhood])","v":"Mount Baker"}]
["Noise","2020-01-23","Completed","Completed","98103",{"$f":"_xlfn.XLOOKUP(--fSeattle2020Complaints[[#This Row],[ZipCode]],dZipNeighborhood[ZipCode],dZipNeighborhood[Neighborhood])","v":"Greenwood"}]
["Weeds","2020-08-28","Completed","Completed","98116",{"$f":"_xlfn.XLOOKUP(--fSeattle2020Complaints[[#This Row],[ZipCode]],dZipNeighborhood[ZipCode],dZipNeighborhood[Neighborhood])","v":"West Seattle"}]
["Vacant Building","2020-10-29","Completed","Completed","98107",{"$f":"_xlfn.XLOOKUP(--fSeattle2020Complaints[[#This Row],[ZipCode]],dZipNeighborhood[ZipCode],dZipNeighborhood[Neighborhood])","v":"Ballard"}]
["Construction","2020-10-15","Completed","Completed","98118",{"$f":"_xlfn.XLOOKUP(--fSeattle2020Complaints[[#This Row],[ZipCode]],dZipNeighborhood[ZipCode],dZipNeighborhood[Neighborhood])","v":"Columbia City"}]
["Land Use","2020-10-01","Completed","Completed","98144",{"$f":"_xlfn.XLOOKUP(--fSeattle2020Complaints[[#This Row],[ZipCode]],dZipNeighborhood[ZipCode],dZipNeighborhood[Neighborhood])","v":"Mount Baker"}]
["Land Use","2020-12-07","Completed","Completed","98144",{"$f":"_xlfn.XLOOKUP(--fSeattle2020Complaints[[#This Row],[ZipCode]],dZipNeighborhood[ZipCode],dZipNeighborhood[Neighborhood])","v":"Mount Baker"}]
["Construction","2020-08-27","Completed","Completed","98122",{"$f":"_xlfn.XLOOKUP(--fSeattle2020Complaints[[#This Row],[ZipCode]],dZipNeighborhood[ZipCode],dZipNeighborhood[Neighborhood])","v":"Minor, Central Area"}]
["Land Use","2020-08-01","Completed","Completed","98115",{"$f":"_xlfn.XLOOKUP(--fSeattle2020Complaints[[#This Row],[ZipCode]],dZipNeighborhood[ZipCode],dZipNeighborhood[Neighborhood])","v":"Greenlake"}]
["Land Use","2020-01-24","Completed","Completed","98116",{"$f":"_xlfn.XLOOKUP(--fSeattle2020Complaints[[#This Row],[ZipCode]],dZipNeighborhood[ZipCode],dZipNeighborhood[Neighborhood])","v":"West Seattle"}]
["Land Use","2020-11-04","Completed","Completed","98109",{"$f":"_xlfn.XLOOKUP(--fSeattle2020Complaints[[#This Row],[ZipCode]],dZipNeighborhood[ZipCode],dZipNeighborhood[Neighborhood])","v":"South Lake Union"}]
["Construction","2020-12-21","Completed","Completed","98107",{"$f":"_xlfn.XLOOKUP(--fSeattle2020Complaints[[#This Row],[ZipCode]],dZipNeighborhood[ZipCode],dZipNeighborhood[Neighborhood])","v":"Ballard"}]
["Weeds","2020-04-11","Completed","Completed","98115",{"$f":"_xlfn.XLOOKUP(--fSeattle2020Complaints[[#This Row],[ZipCode]],dZipNeighborhood[ZipCode],dZipNeighborhood[Neighborhood])","v":"Greenlake"}]
["Land Use","2020-04-08","Completed","Completed","98109",{"$f":"_xlfn.XLOOKUP(--fSeattle2020Complaints[[#This Row],[ZipCode]],dZipNeighborhood[ZipCode],dZipNeighborhood[Neighborhood])","v":"South Lake Union"}]
["Construction","2020-01-24","Completed","Completed","98136",{"$f":"_xlfn.XLOOKUP(--fSeattle2020Complaints[[#This Row],[ZipCode]],dZipNeighborhood[ZipCode],dZipNeighborhood[Neighborhood])","v":"Seaview"}]
["Land Use","2020-07-17","No Access/Unable to Observe","Closed","98125",{"$f":"_xlfn.XLOOKUP(--fSeattle2020Complaints[[#This Row],[ZipCode]],dZipNeighborhood[ZipCode],dZipNeighborhood[Neighborhood])","v":"Northgate"}]
["Land Use","2020-10-21","Completed","Completed","98144",{"$f":"_xlfn.XLOOKUP(--fSeattle2020Complaints[[#This Row],[ZipCode]],dZipNeighborhood[ZipCode],dZipNeighborhood[Neighborhood])","v":"Mount Baker"}]
["Weeds","2020-06-17","Completed","Completed","98144",{"$f":"_xlfn.XLOOKUP(--fSeattle2020Complaints[[#This Row],[ZipCode]],dZipNeighborhood[ZipCode],dZipNeighborhood[Neighborhood])","v":"Mount Baker"}]
["Noise","2020-11-12","No Violation","Completed","98121",{"$f":"_xlfn.XLOOKUP(--fSeattle2020Complaints[[#This Row],[ZipCode]],dZipNeighborhood[ZipCode],dZipNeighborhood[Neighborhood])","v":"Belltown"}]
["Construction","2020-04-29","Completed","NOV Issued","98118",{"$f":"_xlfn.XLOOKUP(--fSeattle2020Complaints[[#This Row],[ZipCode]],dZipNeighborhood[ZipCode],dZipNeighborhood[Neighborhood])","v":"Columbia City"}]
["Land Use","2020-08-03","No Access/Unable to Observe","Completed","98108",{"$f":"_xlfn.XLOOKUP(--fSeattle2020Complaints[[#This Row],[ZipCode]],dZipNeighborhood[ZipCode],dZipNeighborhood[Neighborhood])","v":"Rainer Valley"}]
["Land Use","2020-02-12","Completed","Completed","98116",{"$f":"_xlfn.XLOOKUP(--fSeattle2020Complaints[[#This Row],[ZipCode]],dZipNeighborhood[ZipCode],dZipNeighborhood[Neighborhood])","v":"West Seattle"}]
["Land Use","2020-06-23","Completed","Initiated","98106",{"$f":"_xlfn.XLOOKUP(--fSeattle2020Complaints[[#This Row],[ZipCode]],dZipNeighborhood[ZipCode],dZipNeighborhood[Neighborhood])","v":"Delridge"}]
["Land Use","2020-06-29","Completed","Completed","98104",{"$f":"_xlfn.XLOOKUP(--fSeattle2020Complaints[[#This Row],[ZipCode]],dZipNeighborhood[ZipCode],dZipNeighborhood[Neighborhood])","v":"International District"}]
["Vacant Building","2020-06-30","Completed","Completed","98105",{"$f":"_xlfn.XLOOKUP(--fSeattle2020Complaints[[#This Row],[ZipCode]],dZipNeighborhood[ZipCode],dZipNeighborhood[Neighborhood])","v":"University District"}]
["Construction","2020-01-24","Completed","Completed","98136",{"$f":"_xlfn.XLOOKUP(--fSeattle2020Complaints[[#This Row],[ZipCode]],dZipNeighborhood[ZipCode],dZipNeighborhood[Neighborhood])","v":"Seaview"}]
["Emergency","2020-02-19","Completed","Completed","98106",{"$f":"_xlfn.XLOOKUP(--fSeattle2020Complaints[[#This Row],[ZipCode]],dZipNeighborhood[ZipCode],dZipNeighborhood[Neighborhood])","v":"Delridge"}]
["Land Use","2020-03-16","Compliance Achieved","Completed","98116",{"$f":"_xlfn.XLOOKUP(--fSeattle2020Complaints[[#This Row],[ZipCode]],dZipNeighborhood[ZipCode],dZipNeighborhood[Neighborhood])","v":"West Seattle"}]
["Vacant Building","2020-04-30","Completed","Completed","98105",{"$f":"_xlfn.XLOOKUP(--fSeattle2020Complaints[[#This Row],[ZipCode]],dZipNeighborhood[ZipCode],dZipNeighborhood[Neighborhood])","v":"University District"}]
["Weeds","2020-03-26","Completed","Completed","98105",{"$f":"_xlfn.XLOOKUP(--fSeattle2020Complaints[[#This Row],[ZipCode]],dZipNeighborhood[ZipCode],dZipNeighborhood[Neighborhood])","v":"University District"}]
["Vacant Building","2020-07-21","Completed","Completed","98107",{"$f":"_xlfn.XLOOKUP(--fSeattle2020Complaints[[#This Row],[ZipCode]],dZipNeighborhood[ZipCode],dZipNeighborhood[Neighborhood])","v":"Ballard"}]
["Tree","2020-08-27","Completed","Completed","98126",{"$f":"_xlfn.XLOOKUP(--fSeattle2020Complaints[[#This Row],[ZipCode]],dZipNeighborhood[ZipCode],dZipNeighborhood[Neighborhood])","v":"High Point"}]
["Land Use","2020-02-11","Completed","Completed","98106",{"$f":"_xlfn.XLOOKUP(--fSeattle2020Complaints[[#This Row],[ZipCode]],dZipNeighborhood[ZipCode],dZipNeighborhood[Neighborhood])","v":"Delridge"}]
["Weeds","2020-01-31","Completed","Completed","98177",{"$f":"_xlfn.XLOOKUP(--fSeattle2020Complaints[[#This Row],[ZipCode]],dZipNeighborhood[ZipCode],dZipNeighborhood[Neighborhood])","v":"Richmond Beach"}]
["Construction","2020-05-20","Completed","Completed","98199",{"$f":"_xlfn.XLOOKUP(--fSeattle2020Complaints[[#This Row],[ZipCode]],dZipNeighborhood[ZipCode],dZipNeighborhood[Neighborhood])","v":"Magnolia"}]
["Weeds","2020-06-23","Completed","Completed","98144",{"$f":"_xlfn.XLOOKUP(--fSeattle2020Complaints[[#This Row],[ZipCode]],dZipNeighborhood[ZipCode],dZipNeighborhood[Neighborhood])","v":"Mount Baker"}]
["Weeds","2020-02-28","Completed","Warning","98108",{"$f":"_xlfn.XLOOKUP(--fSeattle2020Complaints[[#This Row],[ZipCode]],dZipNeighborhood[ZipCode],dZipNeighborhood[Neighborhood])","v":"Rainer Valley"}]
["Weeds","2020-09-01","Completed","Completed","98106",{"$f":"_xlfn.XLOOKUP(--fSeattle2020Complaints[[#This Row],[ZipCode]],dZipNeighborhood[ZipCode],dZipNeighborhood[Neighborhood])","v":"Delridge"}]
["Vacant Building","2020-01-13","Completed","Initiated","98108",{"$f":"_xlfn.XLOOKUP(--fSeattle2020Complaints[[#This Row],[ZipCode]],dZipNeighborhood[ZipCode],dZipNeighborhood[Neighborhood])","v":"Rainer Valley"}]
["Tree","2020-09-09","Completed","Completed","98122",{"$f":"_xlfn.XLOOKUP(--fSeattle2020Complaints[[#This Row],[ZipCode]],dZipNeighborhood[ZipCode],dZipNeighborhood[Neighborhood])","v":"Minor, Central Area"}]
["Land Use","2020-10-02","Completed","Completed","98125",{"$f":"_xlfn.XLOOKUP(--fSeattle2020Complaints[[#This Row],[ZipCode]],dZipNeighborhood[ZipCode],dZipNeighborhood[Neighborhood])","v":"Northgate"}]
["LandLord/Tenant","2020-02-27","Completed","Completed","98199",{"$f":"_xlfn.XLOOKUP(--fSeattle2020Complaints[[#This Row],[ZipCode]],dZipNeighborhood[ZipCode],dZipNeighborhood[Neighborhood])","v":"Magnolia"}]
["Land Use","2020-12-15","Completed","Completed","98118",{"$f":"_xlfn.XLOOKUP(--fSeattle2020Complaints[[#This Row],[ZipCode]],dZipNeighborhood[ZipCode],dZipNeighborhood[Neighborhood])","v":"Columbia City"}]
["Construction","2020-01-06","Completed","Completed","98109",{"$f":"_xlfn.XLOOKUP(--fSeattle2020Complaints[[#This Row],[ZipCode]],dZipNeighborhood[ZipCode],dZipNeighborhood[Neighborhood])","v":"South Lake Union"}]
["Noise","2020-01-21","Completed","Completed","98117",{"$f":"_xlfn.XLOOKUP(--fSeattle2020Complaints[[#This Row],[ZipCode]],dZipNeighborhood[ZipCode],dZipNeighborhood[Neighborhood])","v":"Sunset Hill"}]
["Construction , Emergency","2020-02-28","Completed","Closed","98144",{"$f":"_xlfn.XLOOKUP(--fSeattle2020Complaints[[#This Row],[ZipCode]],dZipNeighborhood[ZipCode],dZipNeighborhood[Neighborhood])","v":"Mount Baker"}]
["Construction","2020-05-28","Completed","Completed","98116",{"$f":"_xlfn.XLOOKUP(--fSeattle2020Complaints[[#This Row],[ZipCode]],dZipNeighborhood[ZipCode],dZipNeighborhood[Neighborhood])","v":"West Seattle"}]
["Land Use","2020-12-02","Completed","Completed","98118",{"$f":"_xlfn.XLOOKUP(--fSeattle2020Complaints[[#This Row],[ZipCode]],dZipNeighborhood[ZipCode],dZipNeighborhood[Neighborhood])","v":"Columbia City"}]
["Land Use","2020-04-13","Compliance Achieved","Completed","98122",{"$f":"_xlfn.XLOOKUP(--fSeattle2020Complaints[[#This Row],[ZipCode]],dZipNeighborhood[ZipCode],dZipNeighborhood[Neighborhood])","v":"Minor, Central Area"}]
["Construction","2020-11-18","Completed","Completed","98118",{"$f":"_xlfn.XLOOKUP(--fSeattle2020Complaints[[#This Row],[ZipCode]],dZipNeighborhood[ZipCode],dZipNeighborhood[Neighborhood])","v":"Columbia City"}]
["Vacant Building","2020-05-27","Completed","Completed","98144",{"$f":"_xlfn.XLOOKUP(--fSeattle2020Complaints[[#This Row],[ZipCode]],dZipNeighborhood[ZipCode],dZipNeighborhood[Neighborhood])","v":"Mount Baker"}]
["Construction , Shoreline , ECA","2020-11-10","Completed","Completed","98102",{"$f":"_xlfn.XLOOKUP(--fSeattle2020Complaints[[#This Row],[ZipCode]],dZipNeighborhood[ZipCode],dZipNeighborhood[Neighborhood])","v":"Capital Hill"}]
["Construction","2020-07-09","Completed","Hazard Correction Order Issued","98118",{"$f":"_xlfn.XLOOKUP(--fSeattle2020Complaints[[#This Row],[ZipCode]],dZipNeighborhood[ZipCode],dZipNeighborhood[Neighborhood])","v":"Columbia City"}]
["Vacant Building","2020-02-18","Completed","Closed","98133",{"$f":"_xlfn.XLOOKUP(--fSeattle2020Complaints[[#This Row],[ZipCode]],dZipNeighborhood[ZipCode],dZipNeighborhood[Neighborhood])","v":"Shoreline"}]
["Weeds","2020-05-13","Completed","Initiated","98117",{"$f":"_xlfn.XLOOKUP(--fSeattle2020Complaints[[#This Row],[ZipCode]],dZipNeighborhood[ZipCode],dZipNeighborhood[Neighborhood])","v":"Sunset Hill"}]
["Land Use","2020-08-24","Completed","Completed","98107",{"$f":"_xlfn.XLOOKUP(--fSeattle2020Complaints[[#This Row],[ZipCode]],dZipNeighborhood[ZipCode],dZipNeighborhood[Neighborhood])","v":"Ballard"}]
["Construction","2020-04-28","Completed","Completed","98122",{"$f":"_xlfn.XLOOKUP(--fSeattle2020Complaints[[#This Row],[ZipCode]],dZipNeighborhood[ZipCode],dZipNeighborhood[Neighborhood])","v":"Minor, Central Area"}]
["Land Use","2020-01-04","Completed","Completed","98106",{"$f":"_xlfn.XLOOKUP(--fSeattle2020Complaints[[#This Row],[ZipCode]],dZipNeighborhood[ZipCode],dZipNeighborhood[Neighborhood])","v":"Delridge"}]
["Weeds","2020-09-28","Compliance Achieved","Completed","98117",{"$f":"_xlfn.XLOOKUP(--fSeattle2020Complaints[[#This Row],[ZipCode]],dZipNeighborhood[ZipCode],dZipNeighborhood[Neighborhood])","v":"Sunset Hill"}]
["Weeds","2020-08-10","Completed","Completed","98116",{"$f":"_xlfn.XLOOKUP(--fSeattle2020Complaints[[#This Row],[ZipCode]],dZipNeighborhood[ZipCode],dZipNeighborhood[Neighborhood])","v":"West Seattle"}]
["Weeds","2020-10-20","Completed","Completed","98108",{"$f":"_xlfn.XLOOKUP(--fSeattle2020Complaints[[#This Row],[ZipCode]],dZipNeighborhood[ZipCode],dZipNeighborhood[Neighborhood])","v":"Rainer Valley"}]
["Land Use","2020-07-26","Completed","Completed","98117",{"$f":"_xlfn.XLOOKUP(--fSeattle2020Complaints[[#This Row],[ZipCode]],dZipNeighborhood[ZipCode],dZipNeighborhood[Neighborhood])","v":"Sunset Hill"}]
["Construction","2020-01-21","Completed","Closed","98133",{"$f":"_xlfn.XLOOKUP(--fSeattle2020Complaints[[#This Row],[ZipCode]],dZipNeighborhood[ZipCode],dZipNeighborhood[Neighborhood])","v":"Shoreline"}]
["Weeds","2020-08-25","Completed","Completed","98144",{"$f":"_xlfn.XLOOKUP(--fSeattle2020Complaints[[#This Row],[ZipCode]],dZipNeighborhood[ZipCode],dZipNeighborhood[Neighborhood])","v":"Mount Baker"}]
["Land Use","2020-08-03","Completed","Completed","98144",{"$f":"_xlfn.XLOOKUP(--fSeattle2020Complaints[[#This Row],[ZipCode]],dZipNeighborhood[ZipCode],dZipNeighborhood[Neighborhood])","v":"Mount Baker"}]
["Land Use","2020-01-03","Completed","Completed","98109",{"$f":"_xlfn.XLOOKUP(--fSeattle2020Complaints[[#This Row],[ZipCode]],dZipNeighborhood[ZipCode],dZipNeighborhood[Neighborhood])","v":"South Lake Union"}]
["Land Use","2020-10-03","Completed","Completed","98105",{"$f":"_xlfn.XLOOKUP(--fSeattle2020Complaints[[#This Row],[ZipCode]],dZipNeighborhood[ZipCode],dZipNeighborhood[Neighborhood])","v":"University District"}]
["Land Use","2020-03-20","Completed","Completed","98118",{"$f":"_xlfn.XLOOKUP(--fSeattle2020Complaints[[#This Row],[ZipCode]],dZipNeighborhood[ZipCode],dZipNeighborhood[Neighborhood])","v":"Columbia City"}]
["Land UseShoreline ,","2020-12-16","Completed","Completed","98118",{"$f":"_xlfn.XLOOKUP(--fSeattle2020Complaints[[#This Row],[ZipCode]],dZipNeighborhood[ZipCode],dZipNeighborhood[Neighborhood])","v":"Columbia City"}]
["Tree","2020-01-17","Completed","Completed","98136",{"$f":"_xlfn.XLOOKUP(--fSeattle2020Complaints[[#This Row],[ZipCode]],dZipNeighborhood[ZipCode],dZipNeighborhood[Neighborhood])","v":"Seaview"}]
["Construction","2020-05-09","Completed","Completed","98133",{"$f":"_xlfn.XLOOKUP(--fSeattle2020Complaints[[#This Row],[ZipCode]],dZipNeighborhood[ZipCode],dZipNeighborhood[Neighborhood])","v":"Shoreline"}]
["Land Use","2020-07-02","Completed","Referred to Law","98106",{"$f":"_xlfn.XLOOKUP(--fSeattle2020Complaints[[#This Row],[ZipCode]],dZipNeighborhood[ZipCode],dZipNeighborhood[Neighborhood])","v":"Delridge"}]
["Construction","2020-12-10","Completed","Completed","98115",{"$f":"_xlfn.XLOOKUP(--fSeattle2020Complaints[[#This Row],[ZipCode]],dZipNeighborhood[ZipCode],dZipNeighborhood[Neighborhood])","v":"Greenlake"}]
["Weeds","2020-08-26","Completed","Completed","98115",{"$f":"_xlfn.XLOOKUP(--fSeattle2020Complaints[[#This Row],[ZipCode]],dZipNeighborhood[ZipCode],dZipNeighborhood[Neighborhood])","v":"Greenlake"}]
["Construction","2020-06-09","Completed","Completed","98107",{"$f":"_xlfn.XLOOKUP(--fSeattle2020Complaints[[#This Row],[ZipCode]],dZipNeighborhood[ZipCode],dZipNeighborhood[Neighborhood])","v":"Ballard"}]
["Construction","2020-09-04","Completed","Completed","98118",{"$f":"_xlfn.XLOOKUP(--fSeattle2020Complaints[[#This Row],[ZipCode]],dZipNeighborhood[ZipCode],dZipNeighborhood[Neighborhood])","v":"Columbia City"}]
["Construction","2020-12-02","Completed","Completed","98144",{"$f":"_xlfn.XLOOKUP(--fSeattle2020Complaints[[#This Row],[ZipCode]],dZipNeighborhood[ZipCode],dZipNeighborhood[Neighborhood])","v":"Mount Baker"}]
["Land Use","2020-04-20","Completed","Completed","98108",{"$f":"_xlfn.XLOOKUP(--fSeattle2020Complaints[[#This Row],[ZipCode]],dZipNeighborhood[ZipCode],dZipNeighborhood[Neighborhood])","v":"Rainer Valley"}]
["Land UseTree ,","2020-07-15","Completed","Completed","98109",{"$f":"_xlfn.XLOOKUP(--fSeattle2020Complaints[[#This Row],[ZipCode]],dZipNeighborhood[ZipCode],dZipNeighborhood[Neighborhood])","v":"South Lake Union"}]
["Land Use","2020-02-10","Completed","Completed","98105",{"$f":"_xlfn.XLOOKUP(--fSeattle2020Complaints[[#This Row],[ZipCode]],dZipNeighborhood[ZipCode],dZipNeighborhood[Neighborhood])","v":"University District"}]
["Vacant Building","2020-07-12","Completed","Completed","98103",{"$f":"_xlfn.XLOOKUP(--fSeattle2020Complaints[[#This Row],[ZipCode]],dZipNeighborhood[ZipCode],dZipNeighborhood[Neighborhood])","v":"Greenwood"}]
["Land Use","2020-05-20","Completed","Completed","98146",{"$f":"_xlfn.XLOOKUP(--fSeattle2020Complaints[[#This Row],[ZipCode]],dZipNeighborhood[ZipCode],dZipNeighborhood[Neighborhood])","v":"Shorewood, White Center"}]
["Land Use","2020-03-20","Completed","Completed","98144",{"$f":"_xlfn.XLOOKUP(--fSeattle2020Complaints[[#This Row],[ZipCode]],dZipNeighborhood[ZipCode],dZipNeighborhood[Neighborhood])","v":"Mount Baker"}]
["Weeds","2020-02-24","Completed","Warning","98199",{"$f":"_xlfn.XLOOKUP(--fSeattle2020Complaints[[#This Row],[ZipCode]],dZipNeighborhood[ZipCode],dZipNeighborhood[Neighborhood])","v":"Magnolia"}]
["Land Use","2020-10-23","Completed","Completed","98119",{"$f":"_xlfn.XLOOKUP(--fSeattle2020Complaints[[#This Row],[ZipCode]],dZipNeighborhood[ZipCode],dZipNeighborhood[Neighborhood])","v":"Queen Anne"}]
["Weeds","2020-04-03","Completed","Under Investigation","98109",{"$f":"_xlfn.XLOOKUP(--fSeattle2020Complaints[[#This Row],[ZipCode]],dZipNeighborhood[ZipCode],dZipNeighborhood[Neighborhood])","v":"South Lake Union"}]
["Emergency , Vacant Building","2020-04-16","Compliance Achieved","Completed","98118",{"$f":"_xlfn.XLOOKUP(--fSeattle2020Complaints[[#This Row],[ZipCode]],dZipNeighborhood[ZipCode],dZipNeighborhood[Neighborhood])","v":"Columbia City"}]
["Construction","2020-02-20","Completed","NOV Issued","98115",{"$f":"_xlfn.XLOOKUP(--fSeattle2020Complaints[[#This Row],[ZipCode]],dZipNeighborhood[ZipCode],dZipNeighborhood[Neighborhood])","v":"Greenlake"}]
["Construction","2020-09-04","No Access/Unable to Observe","Completed","98133",{"$f":"_xlfn.XLOOKUP(--fSeattle2020Complaints[[#This Row],[ZipCode]],dZipNeighborhood[ZipCode],dZipNeighborhood[Neighborhood])","v":"Shoreline"}]
["Noise","2020-06-12","Completed","Closed","98178",{"$f":"_xlfn.XLOOKUP(--fSeattle2020Complaints[[#This Row],[ZipCode]],dZipNeighborhood[ZipCode],dZipNeighborhood[Neighborhood])","v":"Skyway"}]
["Land Use","2020-10-29","Completed","Completed","98122",{"$f":"_xlfn.XLOOKUP(--fSeattle2020Complaints[[#This Row],[ZipCode]],dZipNeighborhood[ZipCode],dZipNeighborhood[Neighborhood])","v":"Minor, Central Area"}]
["Weeds","2020-06-24","Completed","Completed","98108",{"$f":"_xlfn.XLOOKUP(--fSeattle2020Complaints[[#This Row],[ZipCode]],dZipNeighborhood[ZipCode],dZipNeighborhood[Neighborhood])","v":"Rainer Valley"}]
["Vacant Building","2020-06-17","Completed","Completed","98106",{"$f":"_xlfn.XLOOKUP(--fSeattle2020Complaints[[#This Row],[ZipCode]],dZipNeighborhood[ZipCode],dZipNeighborhood[Neighborhood])","v":"Delridge"}]
["Construction","2020-03-02","Completed","Completed","98144",{"$f":"_xlfn.XLOOKUP(--fSeattle2020Complaints[[#This Row],[ZipCode]],dZipNeighborhood[ZipCode],dZipNeighborhood[Neighborhood])","v":"Mount Baker"}]
["Land Use","2020-02-07","Completed","Completed","98133",{"$f":"_xlfn.XLOOKUP(--fSeattle2020Complaints[[#This Row],[ZipCode]],dZipNeighborhood[ZipCode],dZipNeighborhood[Neighborhood])","v":"Shoreline"}]
["Construction","2020-08-28","Completed","Completed","98109",{"$f":"_xlfn.XLOOKUP(--fSeattle2020Complaints[[#This Row],[ZipCode]],dZipNeighborhood[ZipCode],dZipNeighborhood[Neighborhood])","v":"South Lake Union"}]
["Land Use","2020-08-11","Completed","Completed","98109",{"$f":"_xlfn.XLOOKUP(--fSeattle2020Complaints[[#This Row],[ZipCode]],dZipNeighborhood[ZipCode],dZipNeighborhood[Neighborhood])","v":"South Lake Union"}]
["Land Use","2020-04-22","Completed","Completed","98105",{"$f":"_xlfn.XLOOKUP(--fSeattle2020Complaints[[#This Row],[ZipCode]],dZipNeighborhood[ZipCode],dZipNeighborhood[Neighborhood])","v":"University District"}]
["Land Use","2020-01-03","Completed","Completed","98119",{"$f":"_xlfn.XLOOKUP(--fSeattle2020Complaints[[#This Row],[ZipCode]],dZipNeighborhood[ZipCode],dZipNeighborhood[Neighborhood])","v":"Queen Anne"}]
["Weeds","2020-06-26","Completed","Completed","98106",{"$f":"_xlfn.XLOOKUP(--fSeattle2020Complaints[[#This Row],[ZipCode]],dZipNeighborhood[ZipCode],dZipNeighborhood[Neighborhood])","v":"Delridge"}]
["Land Use","2020-08-29","Completed","Completed","98108",{"$f":"_xlfn.XLOOKUP(--fSeattle2020Complaints[[#This Row],[ZipCode]],dZipNeighborhood[ZipCode],dZipNeighborhood[Neighborhood])","v":"Rainer Valley"}]
["Weeds","2020-07-02","Completed","Completed","98106",{"$f":"_xlfn.XLOOKUP(--fSeattle2020Complaints[[#This Row],[ZipCode]],dZipNeighborhood[ZipCode],dZipNeighborhood[Neighborhood])","v":"Delridge"}]
["Land Use","2020-02-24","Completed","Completed","98112",{"$f":"_xlfn.XLOOKUP(--fSeattle2020Complaints[[#This Row],[ZipCode]],dZipNeighborhood[ZipCode],dZipNeighborhood[Neighborhood])","v":"Madison Park"}]
["Weeds","2020-08-06","Completed","Completed","98117",{"$f":"_xlfn.XLOOKUP(--fSeattle2020Complaints[[#This Row],[ZipCode]],dZipNeighborhood[ZipCode],dZipNeighborhood[Neighborhood])","v":"Sunset Hill"}]
["Land Use","2020-01-08","Completed","Completed","98134",{"$f":"_xlfn.XLOOKUP(--fSeattle2020Complaints[[#This Row],[ZipCode]],dZipNeighborhood[ZipCode],dZipNeighborhood[Neighborhood])","v":"Duwamish"}]
["Vacant Building","2020-07-17","Compliance Achieved","Completed","98102",{"$f":"_xlfn.XLOOKUP(--fSeattle2020Complaints[[#This Row],[ZipCode]],dZipNeighborhood[ZipCode],dZipNeighborhood[Neighborhood])","v":"Capital Hill"}]
["LandLord/Tenant","2020-02-20","Completed","Completed","98122",{"$f":"_xlfn.XLOOKUP(--fSeattle2020Complaints[[#This Row],[ZipCode]],dZipNeighborhood[ZipCode],dZipNeighborhood[Neighborhood])","v":"Minor, Central Area"}]
["Tree","2020-01-07","Completed","Completed","98125",{"$f":"_xlfn.XLOOKUP(--fSeattle2020Complaints[[#This Row],[ZipCode]],dZipNeighborhood[ZipCode],dZipNeighborhood[Neighborhood])","v":"Northgate"}]
["Land Use","2020-02-22","Compliance Achieved","Completed","98118",{"$f":"_xlfn.XLOOKUP(--fSeattle2020Complaints[[#This Row],[ZipCode]],dZipNeighborhood[ZipCode],dZipNeighborhood[Neighborhood])","v":"Columbia City"}]
["Weeds","2020-03-07","Completed","Closed","98112",{"$f":"_xlfn.XLOOKUP(--fSeattle2020Complaints[[#This Row],[ZipCode]],dZipNeighborhood[ZipCode],dZipNeighborhood[Neighborhood])","v":"Madison Park"}]
["Construction","2020-02-26","Completed","Completed","98102",{"$f":"_xlfn.XLOOKUP(--fSeattle2020Complaints[[#This Row],[ZipCode]],dZipNeighborhood[ZipCode],dZipNeighborhood[Neighborhood])","v":"Capital Hill"}]
["Construction","2020-09-10","Completed","Completed","98106",{"$f":"_xlfn.XLOOKUP(--fSeattle2020Complaints[[#This Row],[ZipCode]],dZipNeighborhood[ZipCode],dZipNeighborhood[Neighborhood])","v":"Delridge"}]
["Land Use","2020-11-09","Completed","Completed","98126",{"$f":"_xlfn.XLOOKUP(--fSeattle2020Complaints[[#This Row],[ZipCode]],dZipNeighborhood[ZipCode],dZipNeighborhood[Neighborhood])","v":"High Point"}]
["Land Use","2020-02-04","Completed","NOV Issued","98117",{"$f":"_xlfn.XLOOKUP(--fSeattle2020Complaints[[#This Row],[ZipCode]],dZipNeighborhood[ZipCode],dZipNeighborhood[Neighborhood])","v":"Sunset Hill"}]
["Land Use","2020-01-17","Completed","Completed","98118",{"$f":"_xlfn.XLOOKUP(--fSeattle2020Complaints[[#This Row],[ZipCode]],dZipNeighborhood[ZipCode],dZipNeighborhood[Neighborhood])","v":"Columbia City"}]
["Weeds","2020-02-06","Compliance Achieved","Completed","98144",{"$f":"_xlfn.XLOOKUP(--fSeattle2020Complaints[[#This Row],[ZipCode]],dZipNeighborhood[ZipCode],dZipNeighborhood[Neighborhood])","v":"Mount Baker"}]
["Land Use","2020-11-23","Completed","Completed","98102",{"$f":"_xlfn.XLOOKUP(--fSeattle2020Complaints[[#This Row],[ZipCode]],dZipNeighborhood[ZipCode],dZipNeighborhood[Neighborhood])","v":"Capital Hill"}]
["Construction","2020-05-10","Completed","Completed","98126",{"$f":"_xlfn.XLOOKUP(--fSeattle2020Complaints[[#This Row],[ZipCode]],dZipNeighborhood[ZipCode],dZipNeighborhood[Neighborhood])","v":"High Point"}]
["Weeds","2020-06-05","Completed","Completed","98122",{"$f":"_xlfn.XLOOKUP(--fSeattle2020Complaints[[#This Row],[ZipCode]],dZipNeighborhood[ZipCode],dZipNeighborhood[Neighborhood])","v":"Minor, Central Area"}]
["Land Use","2020-06-01","Completed","Completed","98112",{"$f":"_xlfn.XLOOKUP(--fSeattle2020Complaints[[#This Row],[ZipCode]],dZipNeighborhood[ZipCode],dZipNeighborhood[Neighborhood])","v":"Madison Park"}]
["Emergency , Vacant Building","2020-01-22","Completed","Completed","98117",{"$f":"_xlfn.XLOOKUP(--fSeattle2020Complaints[[#This Row],[ZipCode]],dZipNeighborhood[ZipCode],dZipNeighborhood[Neighborhood])","v":"Sunset Hill"}]
["Tree","2020-02-11","Completed","Completed","98199",{"$f":"_xlfn.XLOOKUP(--fSeattle2020Complaints[[#This Row],[ZipCode]],dZipNeighborhood[ZipCode],dZipNeighborhood[Neighborhood])","v":"Magnolia"}]
["Construction","2020-01-30","Completed","Completed","98119",{"$f":"_xlfn.XLOOKUP(--fSeattle2020Complaints[[#This Row],[ZipCode]],dZipNeighborhood[ZipCode],dZipNeighborhood[Neighborhood])","v":"Queen Anne"}]
["Land Use","2020-05-20","Completed","Completed","98107",{"$f":"_xlfn.XLOOKUP(--fSeattle2020Complaints[[#This Row],[ZipCode]],dZipNeighborhood[ZipCode],dZipNeighborhood[Neighborhood])","v":"Ballard"}]
["Land Use","2020-09-28","Completed","Completed","98115",{"$f":"_xlfn.XLOOKUP(--fSeattle2020Complaints[[#This Row],[ZipCode]],dZipNeighborhood[ZipCode],dZipNeighborhood[Neighborhood])","v":"Greenlake"}]
["Construction","2020-07-22","Completed","Completed","98136",{"$f":"_xlfn.XLOOKUP(--fSeattle2020Complaints[[#This Row],[ZipCode]],dZipNeighborhood[ZipCode],dZipNeighborhood[Neighborhood])","v":"Seaview"}]
["Land UseTree ,","2020-11-12","Completed","Completed","98136",{"$f":"_xlfn.XLOOKUP(--fSeattle2020Complaints[[#This Row],[ZipCode]],dZipNeighborhood[ZipCode],dZipNeighborhood[Neighborhood])","v":"Seaview"}]

{"sheet":"Seattle2020ComplaintDashboard","index":2,"n_rows":0,"n_cols":0,"rows_kept":0,"cut":false,"hidden":false,"merged":[]}

{"sheet":"P(2)","index":3,"n_rows":47,"n_cols":4,"rows_kept":47,"cut":false,"hidden":false,"merged":[]}
[]
["Instructions:"]
["Imagine your boss just sent you a CSV file with over one million rows of data, and she asks you calculate the average daily revenue and average monthly revenue for each product."]
["She wants you to create the two Data Model Reports as shown to the right on the Sheet \"Ave Revenue Reports\" =>"]
["You are using a Data Model solution because there are over one million rows of data in the Fact table AND because the average monthly and daily calculations are easier to accomplish with DAX Formulas (as compared to worksheet and Standard PivotTable)."]
["The Fact table data is in the file named \"fSalesProject5.csv\"."]
["The dProduct table is stored in an Excel Table below."]
["Import both tables into the Power Pivot Data Model using Power Query."]
["In the Data Model, create a Date Table."]
["Create Relationships between the Tables."]
["Create the DAX Measures:"]
["Total Revenue"]
["Total COGS"]
["Average Monthly Revenue"]
["Average Daily Revenue (you can use the dDate table in 1st argument of AVERAGEX)"]
["Hide any fields that you do not need in the Reporting area."]
["Be sure to name things with names that communicate their meaning."]
["Be sure to sort the 2nd report (Ave. Rev by Day of Week) to show averages biggest to smallest."]
[]
[]
[]
[]
[]
[]
["Product","Retail Price","Standard Cost","Category"]
["Alpine",23.95,10.09,"Beginner"]
["Aspen",23.95,9.48,"Beginner"]
["Bellen",26.99,10.75,"Beginner"]
["Bower Aussie Round",45,18.45,"Competition"]
["Carlota",21.95,8.48,"Beginner"]
["Carlota Doublers",71,30.25,"Freestyle"]
["Crested Beaut",19.95,8.5,"Intermediate"]
["Darnell Tri Fly",11.95,5.25,"Beginner"]
["Eagle",23.95,8.9699999999999989,"Intermediate"]
["Fire Aspen",23.5,9.5500000000000007,"Advanced"]
["Frido Fast Catch",41.95,21.45,"Competition"]
["Fun Fly",6.99,3.25,"Beginner"]
["GelFast",26,11.04,"Competition"]
["Majestic Beaut",28.95,11.49,"Intermediate"]
["Manu LD",252,100.25,"Advanced"]
["Manu MTA",122,49.78,"Competition"]
["Phoenix",25.95,10.85,"Intermediate"]
["Quad",41.95,16,"Freestyle"]
["Sunset",25.5,10.51,"Competition"]
["Sunshine",21.95,8.65,"Beginner"]
["Sunspot",14.5,6,"Novelty"]
["Yanaki",25.99,10.02,"Intermediate"]

{"sheet":"Ave Revenue Reports","index":4,"n_rows":0,"n_cols":0,"rows_kept":0,"cut":false,"hidden":false,"merged":[]}