{"text_format":"1","workbook":"xlsx","n_sheets":37,"sheets":["TOC","Formulas","Functions&Names","Formatting as Facade","Cell References","Totals","Jan","Feb","Mar","ERRORS","Order of Precedence","Date Math","IF","IF (an)","Sales Analysis","Sales Analysis(an)","HWSolutions==>","P34-52","P52-53","P54-62","P62-64","P64-77 Qrt(1)","P64-77 Qrt(2)","P64-77 Qrt(3)","P64-77 Qrt(4)","P64-77 Total","P77-79 Qrt (1)","P77-79 Qrt (2)","P77-79 Qrt (3)","P77-79 Qrt (4)","P77-79 Summary","P82-83","P84-85","P85-87 1st Half","P85-87 2nd Half","P85-87 Summary","Sheet3"],"not_rendered":{"charts":1,"images":2,"macros":0,"external_links":0,"defined_names":4,"comments":0,"pivot_tables":0},"unopened":[],"bounds":{"document_bytes":16777216,"sheet_cells":100000,"rows_first":2000,"rows_last":500,"rows_between":2000,"halvings":0,"cell_chars":16384,"cell_head_chars":4096},"cells_cut":0,"cells_raw":0,"read":"whole","date_system":"1900"}

{"sheet":"TOC","index":0,"n_rows":17,"n_cols":2,"rows_kept":17,"cut":false,"hidden":false,"merged":[]}
["Topics","Breif Description"]
["Formulas","Start With = Sign"]
["Functions","Built In Algorithms To Make Calculations Easy"]
["Formatting","Format is just a Façade!"]
["Cell References","We Must Know How To Use All Four Types Of Cell References"]
["Errors","Remember To Use Excel Help If You Get An Error That You Don't Understand"]
{"$rows_left_out":12}
{"sheet":"Formulas","index":1,"n_rows":14,"n_cols":16,"rows_kept":14,"cut":false,"hidden":false,"merged":[]}
[null,null,null,null,null,null,null,null,null,null,null,null,"Gross Pay","Deduction Rate","Deduction"]
[null,null,null,null,null,null,null,null,null,null,null,null,525.25,6.2E-2]
[]
[null,null,null,null,null,null,null,null,null,null,null,null,"Score1","Score2","Score3","Total"]
[null,null,null,null,null,null,null,null,null,null,null,null,20,22,24]
[]
{"$rows_left_out":9}
{"sheet":"Functions&Names","index":2,"n_rows":371,"n_cols":5,"rows_kept":371,"cut":false,"hidden":false,"merged":[]}
["Sales"]
[1439]
[2915]
[1923]
[6497]
[9767]
{"$rows_left_out":366}
{"sheet":"Formatting as Facade","index":3,"n_rows":15,"n_cols":11,"rows_kept":15,"cut":false,"hidden":false,"merged":[]}
["Formatting is like a façade on a house: it is only what is on top. Formatting does not necessarily reflect the underlying number"]
["General","Number","Currency","Accounting","Date","Time","Percentage","Fraction"]
["No commas, shows as many decimals as you type in","Shows commas and as many decimals as you tell it to show","Shows \"floating\" dollar sign, commas and as many decimals as you tell it to show ","Shows \"fixed\" dollar sign, commas and as many decimals as you tell it to show ","Shows date format, underneath is the number of days since Jan. 1, 1900","Shows time format, underneath is the proportion of one 24 hour day","Shows Percentage format (slides decimal to right two positions and then adds the percentage symbol). What is underneath is a decimal or whole number (.06 or 1 ))","Division represented with a numerator and a denominator and a line between the two"]
[12569.456980000001,12569.456980000001,12569.456980000001,12569.456980000001,"2006-07-03","08:00:00",0.06,0.25]
[12569.456980000001,12569.456980000001,12569.456980000001,12569.456980000001,38901,0.33333333333333298,0.06,0.25]
[12569.456980000001,12569.456980000001,12569.456980000001,12569.456980000001,38901,0.33333333333333298,0.06,0.25]
{"$rows_left_out":10}
{"sheet":"Cell References","index":4,"n_rows":28,"n_cols":21,"rows_kept":28,"cut":false,"hidden":false,"merged":[]}
[{"$f":"ROW()&\")\"","v":"1)"},"There are 4 types of cell references: Relative, Absolute (or \"locked\"), Mixed with Column \"locked\", Mixed with Row \"locked\""]
["2)","Relative Cell Reference means that if the formula is looking at a cell reference that is three cells to the left, when you copy the formula to any other cell, the cell reference will still be looking three cells to the left."]
["3)","“Absolute” means that if the formula is looking at a particular cell reference, when you copy the formula to any other cell, the cell reference will still be looking at that particular cell reference. If the Absolute Cell reference is $A$1, the formula will always look at cell A1. It is as if the formula is locked on the cell A1 throughout copy action\n"]
["4)","Mixed with Row \"locked\" means that cell refence remains absolute or locked when copying across rows and remains relative when copying across columns. “Locks cell reference when copying it vertically, but not horizontally”\n\n"]
["5)","Mixed with Column \"locked\" means that cell refence remains absolute or locked when copying across columns\nand remains relative when copying across rows. “Locks cell reference when copying it horizontally, but not vertically”\n"]
["6)","When using cell references in formulas that you will copy to other cells, ask 2 questions of each cell reference to determine which of the 4 types of cell references to use"]
{"$rows_left_out":23}
{"sheet":"Totals","index":5,"n_rows":17,"n_cols":8,"rows_kept":17,"cut":false,"hidden":false,"merged":[]}
["Three Month Totals"]
[null,"Dept 1","Dept 2","Dept 3","Dept 4","Dept 5","Dept 6","Totals"]
["Product 1",null,null,null,null,null,null,{"$f":"SUM(B3:G3)","v":0}]
["Product 2",null,null,null,null,null,null,0]
["Product 3",null,null,null,null,null,null,0]
["Product 4",null,null,null,null,null,null,0]
{"$rows_left_out":12}
{"sheet":"Jan","index":6,"n_rows":17,"n_cols":8,"rows_kept":17,"cut":false,"hidden":false,"merged":[]}
["Jan"]
[null,"Dept 1","Dept 2","Dept 3","Dept 4","Dept 5","Dept 6","Totals"]
["Product 1",{"$f":"IF(AND(ISEVEN(ROW()),ISODD(COLUMN())),RANDBETWEEN(100,500),RANDBETWEEN(50,300))","v":291},{"$f":"IF(AND(ISEVEN(ROW()),ISODD(COLUMN())),RANDBETWEEN(100,500),RANDBETWEEN(50,300))","v":175},282,188,249,216,{"$f":"SUM(B3:G3)","v":1401}]
["Product 2",93,201,121,398,211,291,1315]
["Product 3",277,185,80,227,75,249,1093]
["Product 4",81,377,272,252,212,473,1667]
{"$rows_left_out":12}
{"sheet":"Feb","index":7,"n_rows":17,"n_cols":8,"rows_kept":17,"cut":false,"hidden":false,"merged":[]}
["Feb"]
[null,"Dept 1","Dept 2","Dept 3","Dept 4","Dept 5","Dept 6","Totals"]
["Product 1",{"$f":"IF(AND(ISEVEN(ROW()),ISODD(COLUMN())),RANDBETWEEN(100,500),RANDBETWEEN(50,300))","v":181},{"$f":"IF(EVEN(ROW()),RANDBETWEEN(100,500),RANDBETWEEN(50,300))","v":149},425,462,471,425,{"$f":"SUM(B3:G3)","v":2113}]
["Product 2",499,208,142,256,127,405,1637]
["Product 3",263,443,309,284,277,282,1858]
["Product 4",139,248,122,251,447,162,1369]
{"$rows_left_out":12}
{"sheet":"Mar","index":8,"n_rows":17,"n_cols":8,"rows_kept":17,"cut":false,"hidden":false,"merged":[]}
["Mar"]
[null,"Dept 1","Dept 2","Dept 3","Dept 4","Dept 5","Dept 6","Totals"]
["Product 1",{"$f":"IF(AND(ISEVEN(ROW()),ISODD(COLUMN())),RANDBETWEEN(100,500),RANDBETWEEN(50,300))","v":179},{"$f":"IF(AND(ISEVEN(ROW()),ISODD(COLUMN())),RANDBETWEEN(100,500),RANDBETWEEN(50,300))","v":164},191,141,128,77,{"$f":"SUM(B3:G3)","v":880}]
["Product 2",261,203,76,282,235,236,1293]
["Product 3",218,148,238,275,292,90,1261]
["Product 4",279,114,289,384,74,389,1529]
{"$rows_left_out":12}
{"sheet":"ERRORS","index":9,"n_rows":9,"n_cols":10,"rows_kept":9,"cut":false,"hidden":false,"merged":[]}
["Error Message","Description of Error","Example","Example",null,"VLOOKUP TABLE",null,null,"Bond Inputs"]
["#######","Column width not wide enough to display data (values), or negative date or time","The column that is narrower than the number it contains",101010101010,null,1,"Red",null,"Face Vaule",400000]
[{"$error":"#NAME?"},"Text that is not a \"name\" is being used in a formula","A formula like \"=red\" where red is not an Excel name",{"$f":"red","v":{"$error":"#NAME?"}},null,2,"Blue",null,"Coupon Rate",0.05]
[{"$error":"#N/A"},"Not Available/ No Answer","VLOOKUP function can not find an answer",{"$f":"VLOOKUP(E4,$F$2:$G$3,2)","v":{"$error":"#N/A"}},null,null,null,null,"years",20]
[{"$error":"#REF!"},"Formula is using cell reference that has been deleted, or other invalid cell reference","Formula said \"=A1\" then cell A1 was deleted.",{"$f":"#REF!","v":{"$error":"#REF!"}},null,null,null,null,"periods/year",4]
[{"$error":"#VALUE!"},"Invalid operand or argument type (argument in a function)","The formula \"=F1:G2\" confused Excel because it does not know what to do with the \":\" (unless it was an array function).",{"$f":"F2:G3","v":{"$error":"#VALUE!"}},{"$f":"F3+G3","v":{"$error":"#VALUE!"}},null,null,null,"Annual Discount Rate",6.5250000000000002E-2]
{"$rows_left_out":4}
{"sheet":"Order of Precedence","index":10,"n_rows":34,"n_cols":11,"rows_kept":34,"cut":false,"hidden":false,"merged":[]}
["Arithmetic operation signs in Excel:"]
[" ( ) represents Parentheses"]
[" ^ represents Exponents (powers and roots)"]
[" * represents Multiplication"]
[" /  represents Division"]
[" + represents Addition"]
{"$rows_left_out":29}
{"sheet":"Date Math","index":11,"n_rows":7,"n_cols":2,"rows_kept":7,"cut":false,"hidden":false,"merged":[]}
["Invoice Due Date","2008-01-20"]
["Today",{"$f":"TODAY()","v":"2008-03-19"}]
["Days Over Due"]
[]
["Loan Issue Date","2008-03-12"]
["Term of Loan",90]
{"$rows_left_out":2}
{"sheet":"IF","index":12,"n_rows":42,"n_cols":7,"rows_kept":42,"cut":false,"hidden":false,"merged":[]}
["IF function:\nLogical Test that evaluates to TRUE or FALSE,\nWhat to put in cell if TRUE,\nWhat to put in cell if FALSE"]
[]
["TRUE / FALSE examples:"]
["Revenue:",5000,null,"Does DR = CR?","DR","CR"]
["Hurdle to get bonus:",4000,null,null,500,499.99]
["Is Revenue greater than Hurdle?"]
{"$rows_left_out":37}
{"sheet":"IF (an)","index":13,"n_rows":42,"n_cols":7,"rows_kept":42,"cut":false,"hidden":false,"merged":[]}
["IF function:\nLogical Test that evaluates to TRUE or FALSE,\nWhat to put in cell if TRUE,\nWhat to put in cell if FALSE"]
[]
["TRUE / FALSE examples:"]
["Revenue:",5000,null,"Does DR = CR?","DR","CR"]
["Hurdle to get bonus:",4000,null,{"$f":"E5=F5","v":false},500,499.99]
["Is Revenue greater than Hurdle?",{"$f":"B4>=B5","v":true}]
{"$rows_left_out":37}
{"sheet":"Sales Analysis","index":14,"n_rows":16,"n_cols":10,"rows_kept":16,"cut":false,"hidden":false,"merged":[]}
["Rad Corp.",null,null,"Units",null,null,null,null,null,"Total Costs"]
["Income Statement"]
["June, 2008"]
["Sales"]
["Variable Costs"]
["Contribution Margin"]
{"$rows_left_out":11}
{"sheet":"Sales Analysis(an)","index":15,"n_rows":21,"n_cols":10,"rows_kept":21,"cut":false,"hidden":false,"merged":[]}
["Rad Corp.",null,null,"Units",{"$f":"TRANSPOSE(A4:A8)","v":"Sales"},"Variable Costs","Contribution Margin","Fixed Costs","Net Income","Total Costs"]
["Income Statement",null,null,{"$f":"B15","v":0},{"$f":"D2*B$12","v":0},{"$f":"D2*B$13","v":0},{"$f":"E2-F2","v":0},{"$f":"B$14","v":79250},{"$f":"G2-H2","v":-79250},{"$f":"H2+F2","v":79250}]
["June, 2008",null,null,{"$f":"D2+B$16","v":1000},{"$f":"D3*B$12","v":30000},{"$f":"D3*B$13","v":13690},16310,{"$f":"B$14","v":79250},-62940,{"$f":"H3+F3","v":92940}]
["Sales",{"$f":"B$11*B12","v":150000},null,{"$f":"D3+B$16","v":2000},{"$f":"D4*B$12","v":60000},{"$f":"D4*B$13","v":27380},32620,{"$f":"B$14","v":79250},-46630,106630]
["Variable Costs",{"$f":"B$11*B13","v":68450},null,{"$f":"D4+B$16","v":3000},{"$f":"D5*B$12","v":90000},{"$f":"D5*B$13","v":41070},48930,{"$f":"B$14","v":79250},-30320,120320]
["Contribution Margin",{"$f":"B4-B5","v":81550},null,{"$f":"D5+B$16","v":4000},{"$f":"D6*B$12","v":120000},{"$f":"D6*B$13","v":54760},65240,{"$f":"B$14","v":79250},-14010,134010]
{"$rows_left_out":16}
{"sheet":"HWSolutions==>","index":16,"n_rows":0,"n_cols":0,"rows_kept":0,"cut":false,"hidden":false,"merged":[]}

{"sheet":"P34-52","index":17,"n_rows":20,"n_cols":5,"rows_kept":20,"cut":false,"hidden":false,"merged":[]}
["TZEdge Material Analysis"]
[]
["Material Price Quotes:"]
["Component","Description","Quantity","Unit","Cost/Unit"]
["Leather","Exterior leather",1,"sf",19.86]
["Internal Arch Support","Molesole arch support",1000,"lot",2235]
{"$rows_left_out":15}
{"sheet":"P52-53","index":18,"n_rows":20,"n_cols":4,"rows_kept":20,"cut":false,"hidden":false,"merged":[]}
["TZEdge Labor Analysis"]
[]
["Labor Input Data"]
["Description","Production Rate","Unit","$/Hour"]
["Delivery of Boxes to Product Line",15,"boxes/hr",10.15]
["Cutting of Leather",20,"shoes/hr",22.4]
{"$rows_left_out":15}
{"sheet":"P54-62","index":19,"n_rows":20,"n_cols":5,"rows_kept":20,"cut":false,"hidden":false,"merged":[]}
["Material Price Quotes:"]
["Component","Original Option","Textured Leather","High Top","Average"]
["Leather",24.427799999999998,{"$f":"B19*B3","v":48.855599999999995},{"$f":"B3*B20","v":30.534749999999995},{"$f":"AVERAGE(B3:D3)","v":34.606050000000003}]
["Internal Arch Support",2.2349999999999999,{"$f":"B4","v":2.2349999999999999},{"$f":"C4","v":2.2349999999999999},2.2349999999999999]
["Trim (applique set & logo)",11.64,1.57,{"$f":"B5","v":11.64},8.2833333333333332]
["Laces",1.4804999999999999,{"$f":"B6","v":1.4804999999999999},{"$f":"B19*B6","v":2.9609999999999999},1.974]
{"$rows_left_out":15}
{"sheet":"P62-64","index":20,"n_rows":25,"n_cols":6,"rows_kept":25,"cut":false,"hidden":false,"merged":[]}
["TZEdge Labor Cost Comparison"]
["Manufacturing Tasks Per Shoe:","Original Option",{"$f":"B16","v":"Textured Leather"},"High Top","Min Costs","Max Costs"]
["Delivery of Boxes to Production Line",0.14000000000000001,{"$f":"IF(B17=\"\",\"\",$B3*B17)","v":0.12600000000000003},0.14000000000000001,{"$f":"MIN($B3:$D3)","v":0.12600000000000003},{"$f":"MAX($B3:$D3)","v":0.14000000000000001}]
["Cutting of Leather",1.1200000000000001,1.1200000000000001,1.1200000000000001,1.1200000000000001,1.1200000000000001]
["Attachment of Appliques",2.0299999999999998,"",2.0299999999999998,2.0299999999999998,2.0299999999999998]
["Sewing of Logos to Leather",1.1100000000000001,0.55500000000000005,1.1100000000000001,0.55500000000000005,1.1100000000000001]
{"$rows_left_out":20}
{"sheet":"P64-77 Qrt(1)","index":21,"n_rows":18,"n_cols":5,"rows_kept":18,"cut":false,"hidden":false,"merged":[[0,3,0,4],[4,0,4,1],[5,0,5,1]]}
["Number of Shoes\nPer Pair",2,null,"TZEdge First \nQuarter Budget"]
["Overhead % of Labor",{"$f":"0.25","v":0.25}]
[]
[null,null,"Low Priced","Medium Priced","High Priced"]
["Sales Volume:",null,1000,750,350]
["Selling Price Per Pair:",null,200,225,250]
{"$rows_left_out":13}
{"sheet":"P64-77 Qrt(2)","index":22,"n_rows":18,"n_cols":5,"rows_kept":18,"cut":false,"hidden":false,"merged":[[0,3,0,4],[4,0,4,1],[5,0,5,1]]}
["Number of Shoes\nPer Pair",2,null,"TZEdge First \nQuarter Budget"]
["Overhead % of Labor",{"$f":"0.25","v":0.25}]
[]
[null,null,"Low Priced","Medium Priced","High Priced"]
["Sales Volume:",null,1000,750,350]
["Selling Price Per Pair:",null,200,225,250]
{"$rows_left_out":13}
{"sheet":"P64-77 Qrt(3)","index":23,"n_rows":18,"n_cols":5,"rows_kept":18,"cut":false,"hidden":false,"merged":[[0,3,0,4],[4,0,4,1],[5,0,5,1]]}
["Number of Shoes\nPer Pair",2,null,"TZEdge First \nQuarter Budget"]
["Overhead % of Labor",{"$f":"0.25","v":0.25}]
[]
[null,null,"Low Priced","Medium Priced","High Priced"]
["Sales Volume:",null,1000,750,350]
["Selling Price Per Pair:",null,200,225,250]
{"$rows_left_out":13}
{"sheet":"P64-77 Qrt(4)","index":24,"n_rows":18,"n_cols":5,"rows_kept":18,"cut":false,"hidden":false,"merged":[[0,3,0,4],[4,0,4,1],[5,0,5,1]]}
["Number of Shoes\nPer Pair",2,null,"TZEdge First \nQuarter Budget"]
["Overhead % of Labor",{"$f":"0.25","v":0.25}]
[]
[null,null,"Low Priced","Medium Priced","High Priced"]
["Sales Volume:",null,3700,2200,980]
["Selling Price Per Pair:",null,200,225,250]
{"$rows_left_out":13}
{"sheet":"P64-77 Total","index":25,"n_rows":18,"n_cols":5,"rows_kept":18,"cut":false,"hidden":false,"merged":[[0,3,0,4],[4,0,4,1],[5,0,5,1]]}
["Number of Shoes\nPer Pair",2,null,"TZEdge First \nQuarter Budget"]
["Overhead % of Labor",{"$f":"0.25","v":0.25}]
[]
[null,null,"Low Priced","Medium Priced","High Priced"]
["Sales Volume:",null,{"$f":"SUM('P64-77 Qrt(1):P64-77 Qrt(4)'!C5)","v":6700},{"$f":"SUM('P64-77 Qrt(1):P64-77 Qrt(4)'!D5)","v":4450},{"$f":"SUM('P64-77 Qrt(1):P64-77 Qrt(4)'!E5)","v":2030}]
["Selling Price Per Pair:",null,200,225,250]
{"$rows_left_out":13}
{"sheet":"P77-79 Qrt (1)","index":26,"n_rows":18,"n_cols":4,"rows_kept":18,"cut":false,"hidden":false,"merged":[[4,0,4,1],[5,0,5,1]]}
["Number of Shoes\nPer Pair",2,"TZEdge 1st \nQuarter Budget Textured Leather Option"]
["Overhead % of Labor",0.35]
[]
[null,null,"Low Priced","High Priced"]
["Sales Volume:",null,660,225]
["Selling Price Per Pair:",null,225,275]
{"$rows_left_out":13}
{"sheet":"P77-79 Qrt (2)","index":27,"n_rows":18,"n_cols":4,"rows_kept":18,"cut":false,"hidden":false,"merged":[[4,0,4,1],[5,0,5,1]]}
["Number of Shoes\nPer Pair",2,"TZEdge 2nd \nQuarter Budget Textured Leather Option"]
["Overhead % of Labor",0.35]
[]
[null,null,"Low Priced","High Priced"]
["Sales Volume:",null,800,289]
["Selling Price Per Pair:",null,225,275]
{"$rows_left_out":13}
{"sheet":"P77-79 Qrt (3)","index":28,"n_rows":18,"n_cols":4,"rows_kept":18,"cut":false,"hidden":false,"merged":[[4,0,4,1],[5,0,5,1]]}
["Number of Shoes\nPer Pair",2,"TZEdge 3rd \nQuarter Budget Textured Leather Option"]
["Overhead % of Labor",0.35]
[]
[null,null,"Low Priced","High Priced"]
["Sales Volume:",null,1050,335]
["Selling Price Per Pair:",null,225,275]
{"$rows_left_out":13}
{"sheet":"P77-79 Qrt (4)","index":29,"n_rows":18,"n_cols":4,"rows_kept":18,"cut":false,"hidden":false,"merged":[[4,0,4,1],[5,0,5,1]]}
["Number of Shoes\nPer Pair",2,"TZEdge 4th \nQuarter Budget Textured Leather Option"]
["Overhead % of Labor",0.35]
[]
[null,null,"Low Priced","High Priced"]
["Sales Volume:",null,1200,350]
["Selling Price Per Pair:",null,225,275]
{"$rows_left_out":13}
{"sheet":"P77-79 Summary","index":30,"n_rows":20,"n_cols":4,"rows_kept":20,"cut":false,"hidden":false,"merged":[[4,0,4,1],[5,0,5,1]]}
["Number of Shoes\nPer Pair",2,"TZEdge Yearly \nQuarter Budget Textured Leather Option"]
["Overhead % of Labor",0.35]
[]
[null,null,"Low Priced","High Priced"]
["Sales Volume:",null,{"$f":"SUM('P77-79 Qrt (1):P77-79 Qrt (4)'!C5)","v":3710},{"$f":"SUM('P77-79 Qrt (1):P77-79 Qrt (4)'!D5)","v":1199}]
["Selling Price Per Pair:",null,225,275]
{"$rows_left_out":15}
{"sheet":"P82-83","index":31,"n_rows":28,"n_cols":4,"rows_kept":28,"cut":false,"hidden":false,"merged":[]}
["Computer Purchase Analysis"]
[null,"Dell","HP","Lenovo"]
["GHz",2.13,2.4,2.13]
["RAM",1,1,2.5]
["Hard drive",250,200,250]
["Keyboard","Included","Included","Included"]
{"$rows_left_out":23}
{"sheet":"P84-85","index":32,"n_rows":24,"n_cols":9,"rows_kept":24,"cut":false,"hidden":false,"merged":[]}
["Goal of homework: Help employee to select the most appropriate position based on a number of criteria"]
["Criteria 1","Amount of disposable income"]
["Criteria 2"]
["Criteria 3"]
[]
["Assumptions"]
{"$rows_left_out":19}
{"sheet":"P85-87 1st Half","index":33,"n_rows":34,"n_cols":7,"rows_kept":34,"cut":false,"hidden":false,"merged":[]}
[null,"Jan -June Sales Summary - Actual"]
[]
["Model","Sales Volume","Mfg. Cost per Vehicle","Total Cost","Markup Percentage","Total Sales to Dealers","% of total Volume"]
["XP207",80,37881,{"$f":"B4*C4","v":3030480},0.25,{"$f":"D4*(1+E4)","v":3788100},{"$f":"B4/B$29","v":7.2721983855719588E-4}]
["XP212",187,37296,{"$f":"B5*C5","v":6974352},0.25,8717940,1.6998763726274453E-3]
["XP208",654,35301,23086854,0.25,28858567.5,5.945022180205076E-3]
{"$rows_left_out":29}
{"sheet":"P85-87 2nd Half","index":34,"n_rows":34,"n_cols":7,"rows_kept":34,"cut":false,"hidden":false,"merged":[]}
[null,"July -Dec Sales Summary - Projected"]
[]
["Model","Sales Volume","Mfg. Cost per Vehicle","Total Cost","Markup Percentage","Total Sales to Dealers","% of total Volume"]
["XP207",136,37881,{"$f":"IF(B4=\"\",\"\",B4*C4)","v":5151816},0.25,{"$f":"D4*(1+E4)","v":6439770},{"$f":"B4/B$29","v":1.3138319454373321E-3}]
["XP212",null,37296,"",0.25,null,0]
["XP208",886,35301,31276686,0.25,39095857.5,8.5592287033637963E-3]
{"$rows_left_out":29}
{"sheet":"P85-87 Summary","index":35,"n_rows":26,"n_cols":8,"rows_kept":26,"cut":false,"hidden":false,"merged":[]}
["Model","Annual Volume","Jan-Jun Sales to Dealers","Jul-Dec Sales to Dealers","Total Sales to Dealers","% Total Sales to Dealers Jan-Jun","% Total Sales to Dealers Jul-Dec","%Total Sales to Dealers Annual"]
[{"$f":"IF('P85-87 1st Half'!A4='P85-87 2nd Half'!A4,'P85-87 1st Half'!A4,\"Labels Not Equal\")","v":"XP207"},{"$f":"SUM('P85-87 1st Half:P85-87 2nd Half'!B4)","v":216},{"$f":"'P85-87 1st Half'!F4","v":3788100},{"$f":"'P85-87 2nd Half'!F4","v":6439770},{"$f":"SUM(C2:D2)","v":10227870},{"$f":"C2/C$26","v":1.3924471439796446E-3},2.5100713298815938E-3,1.9348850912957404E-3]
[{"$f":"IF('P85-87 1st Half'!A5='P85-87 2nd Half'!A5,'P85-87 1st Half'!A5,\"Labels Not Equal\")","v":"XP212"},{"$f":"SUM('P85-87 1st Half:P85-87 2nd Half'!B5)","v":187},{"$f":"'P85-87 1st Half'!F5","v":8717940},{"$f":"'P85-87 2nd Half'!F5","v":0},8717940,3.2045803052680507E-3,0,1.6492399818154499E-3]
[{"$f":"IF('P85-87 1st Half'!A6='P85-87 2nd Half'!A6,'P85-87 1st Half'!A6,\"Labels Not Equal\")","v":"XP208"},{"$f":"SUM('P85-87 1st Half:P85-87 2nd Half'!B6)","v":1540},{"$f":"'P85-87 1st Half'!F6","v":28858567.5},{"$f":"'P85-87 2nd Half'!F6","v":39095857.5},67954425,1.0607964387085556E-2,1.5238648434320837E-2,1.2855462947815581E-2]
[{"$f":"IF('P85-87 1st Half'!A7='P85-87 2nd Half'!A7,'P85-87 1st Half'!A7,\"Labels Not Equal\")","v":"XP217"},{"$f":"SUM('P85-87 1st Half:P85-87 2nd Half'!B7)","v":1553},{"$f":"'P85-87 1st Half'!F7","v":31572791.280000001},{"$f":"'P85-87 2nd Half'!F7","v":31776749.879999999},63349541.159999996,1.1605671192761919E-2,1.2385831921109975E-2,1.1984321538200022E-2]
[{"$f":"IF('P85-87 1st Half'!A8='P85-87 2nd Half'!A8,'P85-87 1st Half'!A8,\"Labels Not Equal\")","v":"XP220"},{"$f":"SUM('P85-87 1st Half:P85-87 2nd Half'!B8)","v":2863},{"$f":"'P85-87 1st Half'!F8","v":59393102.25},{"$f":"'P85-87 2nd Half'!F8","v":55889915.880000003},115283018.13,2.1831988490299492E-2,2.1784578561017245E-2,2.1808978121477252E-2]
{"$rows_left_out":21}
{"sheet":"Sheet3","index":36,"n_rows":0,"n_cols":0,"rows_kept":0,"cut":false,"hidden":false,"merged":[]}