{"text_format":"1","workbook":"xlsx","n_sheets":15,"sheets":["WhatIsStatistics","Accounting","Finance","Marketing","Production","RealWorldData","ScalesOfMeasurement","CrossSectional","TimeSeries","TimeSeries (2)","StatisticalStudies","DescriptiveStatistics","InferentialStatisticsTerms","InferentialStatisticsExample","Sheet1"],"not_rendered":{"charts":10,"images":1,"macros":1,"external_links":0,"defined_names":8,"comments":1,"pivot_tables":6},"unopened":[],"bounds":{"document_bytes":16777216,"sheet_cells":100000,"rows_first":2000,"rows_last":500,"rows_between":2000,"halvings":0,"cell_chars":16384,"cell_head_chars":4096},"cells_cut":0,"cells_raw":0,"read":"whole","date_system":"1900"}

{"sheet":"WhatIsStatistics","index":0,"n_rows":7,"n_cols":1,"rows_kept":7,"cut":false,"hidden":false,"merged":[]}
["Statistics are used everywhere"]
["The Art And Science Of Collecting, Analyzing, Presenting, And Interpreting Data."]
["Art because we have to be artful in the way we set up the data and preset data."]
["Science because we must use the Scientific Methods of Experiment and Probability (nothing is really absolute, except for maybe pure Math!)."]
["Data are small chunks such as first name, profit for month. Data is not information. Information is data presented in a useful way."]
["Interpreting Data means that we make useful information from data (using statistics) so that we can make decisions."]
["Because the future is always uncertain, we use statistics to interpret past data so that we can make decisions about the future (and hopefully reduce future uncertainty).\n"]

{"sheet":"Accounting","index":1,"n_rows":84,"n_cols":5,"rows_kept":84,"cut":false,"hidden":false,"merged":[]}
["Accounting/Auditing: Taking Samples of Invoices (Chapter 7)"]
[]
["Invoice","Amount",null,null,"Every kth"]
[1027,4063,null,{"$f":"MOD(ROW(A4),E$4)=0","v":false},6]
[1028,1175]
[1029,550,null,"Invoice","Amount"]
[1030,411,null,1029,550]
[1031,4152,null,1035,5073]
[1032,575,null,1041,665]
[1033,922,null,1047,5400]
[1034,1249,null,1053,545]
[1035,5073,null,1059,4048]
[1036,542,null,1065,405]
[1037,511,null,1071,2273]
[1038,838,null,1077,439]
[1039,5431,null,1083,5505]
[1040,667,null,1089,874]
[1041,665,null,1095,4265]
[1042,762,null,1101,860]
[1043,3145,null,1107,4111]
[1044,938]
[1045,1182]
[1046,981]
[1047,5400]
[1048,458]
[1049,622]
[1050,1074]
[1051,5611]
[1052,966]
[1053,545]
[1054,558]
[1055,4239]
[1056,1168]
[1057,518]
[1058,444]
[1059,4048]
[1060,1187]
[1061,1054]
[1062,777]
[1063,2237]
[1064,1039]
[1065,405]
[1066,756]
[1067,4499]
[1068,709]
[1069,1141]
[1070,1205]
[1071,2273]
[1072,695]
[1073,988]
[1074,996]
[1075,4690]
[1076,427]
[1077,439]
[1078,666]
[1079,4315]
[1080,1075]
[1081,532]
[1082,764]
[1083,5505]
[1084,688]
[1085,673]
[1086,440]
[1087,4013]
[1088,505]
[1089,874]
[1090,1121]
[1091,4512]
[1092,510]
[1093,816]
[1094,878]
[1095,4265]
[1096,828]
[1097,471]
[1098,549]
[1099,5590]
[1100,1211]
[1101,860]
[1102,1191]
[1103,2323]
[1104,939]
[1105,895]
[1106,592]
[1107,4111]

{"sheet":"Finance","index":2,"n_rows":12,"n_cols":4,"rows_kept":12,"cut":false,"hidden":false,"merged":[]}
["Finance and Economics: Projecting Stock Returns (Chapter 5)"]
[]
["State of Economy","Probability of State"]
["Good",0.25]
["Fair",0.55000000000000004]
["Poor",{"$f":"1-SUM(B4:B5)","v":0.19999999999999996}]
[]
["Stock return if state occurs","Prob * Return"]
[0.17,{"$f":"A9*B4","v":4.2500000000000003E-2}]
[0.12,{"$f":"A10*B5","v":6.6000000000000003E-2}]
[3.5000000000000003E-2,{"$f":"A11*B6","v":6.9999999999999993E-3},null,"check"]
["Expected Return",{"$f":"SUM(B9:B11)","v":0.11550000000000002},null,{"$f":"SUM(B4:B6*A9:A11)","v":0.11550000000000002}]

{"sheet":"Marketing","index":3,"n_rows":16,"n_cols":5,"rows_kept":16,"cut":false,"hidden":false,"merged":[]}
["Marketing: Frequency of Sales Tables and Pie Charts (Chapter 2)"]
[]
["Car Type Sold",null,"Car Type Sold","Frequency"]
["Toyota",null,"Toyota",{"$f":"COUNTIF($A$4:$A$16,C4)","v":5}]
["Honda",null,"Honda",{"$f":"COUNTIF($A$4:$A$16,C5)","v":4}]
["Toyota",null,"Ford",{"$f":"COUNTIF($A$4:$A$16,C6)","v":2}]
["Ford",null,"Subaru",{"$f":"COUNTIF($A$4:$A$16,C7)","v":2}]
["Honda"]
["Toyota",null,null,null,"Better"]
["Honda"]
["Toyota"]
["Ford"]
["Honda"]
["Toyota"]
["Subaru"]
["Subaru"]

{"sheet":"Production","index":4,"n_rows":602,"n_cols":8,"rows_kept":602,"cut":false,"hidden":false,"merged":[]}
["Production: Sampling box weight to see if filling machine is filling accurately (chapter 9)"]
["H0 : Mu = 10 grams"]
["H1 : Mu <> 10 grams"]
["Historical Average =",10,"grams"]
["Historical Standard Deviation =",0.5,"grams"]
["Level of Significance =",0.05]
["Level of Significance Divided by 2 =",{"$f":"B6/2","v":2.5000000000000001E-2}]
["Sample Mean = AVERAGE =",{"$f":"AVERAGE(A22:A99)","v":9.8924743589743649},"grams"]
["Sample Standard Deviation = STDEV =",{"$f":"STDEV(A22:A99)","v":0.23443686184374282},"grams"]
["Sample size = COUNT =",{"$f":"COUNT($A$22:$A$99)","v":78}]
["Standard Error",{"$f":"B5/SQRT(B10)","v":5.6613851707229781E-2},"grams"]
["z",{"$f":"(B8-B4)/B11","v":-1.8992814970740406}]
["X",{"$f":"B12*B11+B4","v":9.8924743589743649},{"$f":"D102","v":"P(9.892)"},null,null,null,null,{"$f":"VLOOKUP(B13,B103:C602,2)","v":0.77880751766756706}]
["p-value =",{"$f":"IF(B8<B4,2*NORMDIST(B8,B4,B5/SQRT(B10),1),2*(1-NORMDIST(B8,B4,B5/SQRT(B10),1)))","v":5.752747432345974E-2}]
["p-value =",{"$f":"2*(1-NORMSDIST(ABS(B12)))","v":5.7527474323459726E-2}]
[{"$f":"IF(B15>B6,\"Because the p-value is greater than our alpha, it is reasonable to assume that the machine is filling accurately\",\" Because the p-value is less than or equal to our alpha, it is reasonable to assume that the machine is not filling accurately\")","v":"Because the p-value is greater than our alpha, it is reasonable to assume that the machine is filling accurately"}]
[]
[]
[]
[]
["Sample data"]
[{"$f":"RANDBETWEEN(9500,10300)/1000","v":9.9410000000000007}]
[10.164999999999999]
[9.8339999999999996]
[9.6379999999999999]
[9.6349999999999998]
[9.5419999999999998]
[9.65]
[9.9649999999999999]
[10.1]
[9.6289999999999996]
[9.5440000000000005]
[9.6080000000000005]
[9.8780000000000001]
[9.7479999999999993]
[9.625]
[9.8670000000000009]
[9.8580000000000005]
[10.185]
[10.058]
[10.294]
[10.266]
[9.6300000000000008]
[9.9239999999999995]
[9.7029999999999994]
[10.016999999999999]
[9.6270000000000007]
[10.156000000000001]
[10.215999999999999]
[10.093]
[9.8729999999999993]
[9.9540000000000006]
[10.129]
[10.186]
[10.026999999999999]
[9.9939999999999998]
[9.8550000000000004]
[10.08]
[9.6069999999999993]
[10.052]
[10.234999999999999]
[9.9209999999999994]
[9.9049999999999994]
[9.7070000000000007]
[10.153]
[9.5250000000000004]
[9.657]
[10.141999999999999]
[10.138999999999999]
[9.9039999999999999]
[10.09]
[9.5939999999999994]
[9.9659999999999993]
[9.7240000000000002]
[9.6920000000000002]
[10.074]
[9.5830000000000002]
[9.6720000000000006]
[9.5510000000000002]
[9.8149999999999995]
[10.269]
[9.9550000000000001]
[9.9689999999999994]
[10.295999999999999]
[10.191000000000001]
[{"$f":"RANDBETWEEN(9500,10300)/1000","v":9.5429999999999993}]
[9.8469999999999995]
[10.138999999999999]
[10.032]
[10.26]
[9.7240000000000002]
[9.5370000000000008]
[9.8219999999999992]
[9.6289999999999996]
[10.249000000000001]
[9.8460000000000001]
[9.5660000000000007]
[9.8450000000000006]
[9.6920000000000002]
[]
["Chart Data:"]
["z","X","P(Exactly x)",{"$f":"\"P(\"&ROUND(B8,3)&\")\"","v":"P(9.892)"},"P(alpha)"]
[{"$f":"(B103-B$4)/B$11","v":-35.327043465311391},8,{"$f":"NORMDIST(B103,B$4,B$5,0)","v":2.6766045152977074E-4},{"$f":"IF(C103<=B$14/2,C103,0)","v":2.6766045152977074E-4},{"$f":"IF(C103<=B$6/2,C103,0)","v":2.6766045152977074E-4}]
[-35.150408247984835,{"$f":"B103+0.01","v":8.01},2.8989512084778157E-4,2.8989512084778157E-4,2.8989512084778157E-4]
[-34.973773030658286,{"$f":"B104+0.01","v":8.02},3.1385126813106339E-4,3.1385126813106339E-4,3.1385126813106339E-4]
[-34.79713781333173,8.0299999999999994,3.3965119885868533E-4,3.3965119885868533E-4,3.3965119885868533E-4]
[-34.620502596005181,8.0399999999999991,3.6742499600491161E-4,3.6742499600491161E-4,3.6742499600491161E-4]
[-34.443867378678625,8.0499999999999989,3.9731094278554186E-4,3.9731094278554186E-4,3.9731094278554186E-4]
[-34.267232161352069,8.0599999999999987,4.2945596300072948E-4,4.2945596300072948E-4,4.2945596300072948E-4]
[-34.090596944025521,8.0699999999999985,4.640160793138794E-4,4.640160793138794E-4,4.640160793138794E-4]
[-33.913961726698965,8.0799999999999983,5.0115688978171489E-4,5.0115688978171489E-4,5.0115688978171489E-4]
[-33.737326509372416,8.0899999999999981,5.4105406292303377E-4,5.4105406292303377E-4,5.4105406292303377E-4]
[-33.56069129204586,8.0999999999999979,5.8389385158291068E-4,5.8389385158291068E-4,5.8389385158291068E-4]
[-33.384056074719304,8.1099999999999977,6.2987362581503248E-4,6.2987362581503248E-4,6.2987362581503248E-4]
[-33.207420857392755,8.1199999999999974,6.7920242496729633E-4,6.7920242496729633E-4,6.7920242496729633E-4]
[-33.030785640066199,8.1299999999999972,7.3210152911465571E-4,7.3210152911465571E-4,7.3210152911465571E-4]
[-32.854150422739643,8.139999999999997,7.8880504993829564E-4,7.8880504993829564E-4,7.8880504993829564E-4]
[-32.677515205413094,8.1499999999999968,8.4956054110148335E-4,8.4956054110148335E-4,8.4956054110148335E-4]
[-32.500879988086538,8.1599999999999966,9.1462962811969084E-4,9.1462962811969084E-4,9.1462962811969084E-4]
[-32.324244770759989,8.1699999999999964,9.8428865766576087E-4,9.8428865766576087E-4,9.8428865766576087E-4]
[-32.147609553433433,8.1799999999999962,1.0588293661898404E-3,1.0588293661898404E-3,1.0588293661898404E-3]
[-31.970974336106881,8.1899999999999959,1.1385595676684718E-3,1.1385595676684718E-3,1.1385595676684718E-3]
[-31.794339118780329,8.1999999999999957,1.2238038602275069E-3,1.2238038602275069E-3,1.2238038602275069E-3]
[-31.617703901453773,8.2099999999999955,1.3149043513093108E-3,1.3149043513093108E-3,1.3149043513093108E-3]
[-31.44106868412722,8.2199999999999953,1.412221400976026E-3,1.412221400976026E-3,1.412221400976026E-3]
[-31.264433466800668,8.2299999999999951,1.5161343828573679E-3,1.5161343828573679E-3,1.5161343828573679E-3]
[-31.087798249474115,8.2399999999999949,1.6270424621635578E-3,1.6270424621635578E-3,1.6270424621635578E-3]
[-30.911163032147563,8.2499999999999947,1.7453653900914553E-3,1.7453653900914553E-3,1.7453653900914553E-3]
[-30.734527814821007,8.2599999999999945,1.8715443138548878E-3,1.8715443138548878E-3,1.8715443138548878E-3]
[-30.557892597494455,8.2699999999999942,2.006042601468395E-3,2.006042601468395E-3,2.006042601468395E-3]
[-30.381257380167902,8.279999999999994,2.1493466803073815E-3,2.1493466803073815E-3,2.1493466803073815E-3]
[-30.20462216284135,8.2899999999999938,2.3019668883568706E-3,2.3019668883568706E-3,2.3019668883568706E-3]
[-30.027986945514794,8.2999999999999936,2.4644383369459301E-3,2.4644383369459301E-3,2.4644383369459301E-3]
[-29.851351728188241,8.3099999999999934,2.6373217836453645E-3,2.6373217836453645E-3,2.6373217836453645E-3]
[-29.674716510861689,8.3199999999999932,2.8212045138826369E-3,2.8212045138826369E-3,2.8212045138826369E-3]
[-29.498081293535137,8.329999999999993,3.0167012297004727E-3,3.0167012297004727E-3,3.0167012297004727E-3]
[-29.321446076208584,8.3399999999999928,3.2244549439540918E-3,3.2244549439540918E-3,3.2244549439540918E-3]
[-29.144810858882028,8.3499999999999925,3.4451378781071912E-3,3.4451378781071912E-3,3.4451378781071912E-3]
[-28.968175641555476,8.3599999999999923,3.6794523616483724E-3,3.6794523616483724E-3,3.6794523616483724E-3]
[-28.791540424228923,8.3699999999999921,3.9281317310085493E-3,3.9281317310085493E-3,3.9281317310085493E-3]
[-28.614905206902371,8.3799999999999919,4.1919412257156678E-3,4.1919412257156678E-3,4.1919412257156678E-3]
[-28.438269989575815,8.3899999999999917,4.4716788793768385E-3,4.4716788793768385E-3,4.4716788793768385E-3]
[-28.261634772249263,8.3999999999999915,4.7681764029294266E-3,4.7681764029294266E-3,4.7681764029294266E-3]
[-28.08499955492271,8.4099999999999913,5.0823000574527627E-3,5.0823000574527627E-3,5.0823000574527627E-3]
[-27.908364337596158,8.419999999999991,5.4149515136810971E-3,5.4149515136810971E-3,5.4149515136810971E-3]
[-27.731729120269605,8.4299999999999908,5.7670686952065453E-3,5.7670686952065453E-3,5.7670686952065453E-3]
[-27.555093902943049,8.4399999999999906,6.1396266022091268E-3,6.1396266022091268E-3,6.1396266022091268E-3]
[-27.378458685616497,8.4499999999999904,6.5336381123994548E-3,6.5336381123994548E-3,6.5336381123994548E-3]
[-27.201823468289945,8.4599999999999902,6.950154755709456E-3,6.950154755709456E-3,6.950154755709456E-3]
[-27.025188250963392,8.46999999999999,7.390267459117617E-3,7.390267459117617E-3,7.390267459117617E-3]
[-26.848553033636836,8.4799999999999898,7.8551072578490703E-3,7.8551072578490703E-3,7.8551072578490703E-3]
[-26.671917816310284,8.4899999999999896,8.3458459690473989E-3,8.3458459690473989E-3,8.3458459690473989E-3]
[-26.495282598983732,8.4999999999999893,8.8636968238754478E-3,8.8636968238754478E-3,8.8636968238754478E-3]
[-26.318647381657179,8.5099999999999891,9.4099150538673494E-3,9.4099150538673494E-3,9.4099150538673494E-3]
[-26.142012164330627,8.5199999999999889,9.9857984272240952E-3,9.9857984272240952E-3,9.9857984272240952E-3]
[-25.965376947004071,8.5299999999999887,1.0592687730621334E-2,1.0592687730621334E-2,1.0592687730621334E-2]
[-25.788741729677518,8.5399999999999885,1.1231967191981178E-2,1.1231967191981178E-2,1.1231967191981178E-2]
[-25.612106512350966,8.5499999999999883,1.1905064839550903E-2,1.1905064839550903E-2,1.1905064839550903E-2]
[-25.435471295024414,8.5599999999999881,1.2613452792530983E-2,1.2613452792530983E-2,1.2613452792530983E-2]
[-25.258836077697861,8.5699999999999878,1.3358647478404305E-2,1.3358647478404305E-2,1.3358647478404305E-2]
[-25.082200860371305,8.5799999999999876,1.4142209772037907E-2,1.4142209772037907E-2,1.4142209772037907E-2]
[-24.905565643044753,8.5899999999999874,1.4965745051560056E-2,1.4965745051560056E-2,1.4965745051560056E-2]
[-24.7289304257182,8.5999999999999872,1.5830903165958796E-2,1.5830903165958796E-2,1.5830903165958796E-2]
[-24.552295208391648,8.609999999999987,1.6739378309304848E-2,1.6739378309304848E-2,1.6739378309304848E-2]
[-24.375659991065092,8.6199999999999868,1.7692908796473155E-2,1.7692908796473155E-2,1.7692908796473155E-2]
[-24.19902477373854,8.6299999999999866,1.8693276735223197E-2,1.8693276735223197E-2,1.8693276735223197E-2]
[{"$f":"(B167-B$4)/B$11","v":-24.022389556411987},8.6399999999999864,{"$f":"NORMDIST(B167,B$4,B$5,0)","v":1.9742307589500806E-2},{"$f":"IF(C167<=B$14/2,C167,0)","v":1.9742307589500806E-2},{"$f":"IF(C167<=B$6/2,C167,0)","v":1.9742307589500806E-2}]
[-23.845754339085435,8.6499999999999861,2.0841869628843636E-2,2.0841869628843636E-2,2.0841869628843636E-2]
[-23.669119121758882,{"$f":"B168+0.01","v":8.6599999999999859},2.1993873258809502E-2,2.1993873258809502E-2,2.1993873258809502E-2]
[-23.492483904432326,8.6699999999999857,2.3200270227403372E-2,2.3200270227403372E-2,2.3200270227403372E-2]
[-23.315848687105774,8.6799999999999855,2.4463052702554073E-2,2.4463052702554073E-2,2.4463052702554073E-2]
[-23.139213469779222,8.6899999999999853,2.5784252215788624E-2,2.5784252215788624E-2,0]
[-22.962578252452669,8.6999999999999851,2.716593846736913E-2,2.716593846736913E-2,0]
[-22.785943035126113,8.7099999999999849,2.8610217988297156E-2,2.8610217988297156E-2,0]
[-22.609307817799561,8.7199999999999847,3.0119232654752533E-2,0,0]
[-22.432672600473008,8.7299999999999844,3.1695158050719131E-2,0,0]
[-22.256037383146456,8.7399999999999842,3.3340201674759477E-2,0,0]
[-22.079402165819904,8.749999999999984,3.505660098713427E-2,0,0]
[-21.902766948493348,8.7599999999999838,3.6846621293721134E-2,0,0]
[-21.726131731166795,8.7699999999999836,3.8712553463470793E-2,0,0]
[-21.549496513840243,8.7799999999999834,4.0656711476448372E-2,0,0]
[-21.37286129651369,8.7899999999999832,4.2681429799842081E-2,0,0]
[-21.196226079187134,8.7999999999999829,4.4789060589682121E-2,0,0]
[-21.019590861860582,8.8099999999999827,4.6981970716398869E-2,0,0]
[-20.84295564453403,8.8199999999999825,4.9262538612760948E-2,0,0]
[-20.666320427207477,8.8299999999999823,5.1633150943171099E-2,0,0]
[-20.489685209880925,8.8399999999999821,5.4096199093759061E-2,0,0]
[-20.313049992554369,8.8499999999999819,5.6654075483197612E-2,0,0]
[-20.136414775227816,8.8599999999999817,5.9309169694677581E-2,0,0]
[-19.959779557901264,8.8699999999999815,6.2063864430011308E-2,0,0]
[-19.783144340574712,8.8799999999999812,6.4920531287389477E-2,0,0]
[-19.606509123248156,8.889999999999981,6.7881526364892669E-2,0,0]
[-19.429873905921603,8.8999999999999808,7.0949185692456895E-2,0,0]
[-19.253238688595051,8.9099999999999806,7.412582049560669E-2,0,0]
[-19.076603471268498,8.9199999999999804,7.741371229490468E-2,0,0]
[-18.899968253941946,8.9299999999999802,8.081510784571376E-2,0,0]
[-18.72333303661539,8.93999999999998,8.4332213923533475E-2,0,0]
[-18.546697819288838,8.9499999999999797,8.7967191960846916E-2,0,0]
[-18.370062601962285,8.9599999999999795,9.172215254210199E-2,0,0]
[-18.193427384635733,8.9699999999999793,9.5599149764145921E-2,0,0]
[-18.016792167309177,8.9799999999999791,9.9600175470133057E-2,0,0]
[-17.840156949982624,8.9899999999999789,0.10372715336563228,0,0]
[-17.663521732656072,8.9999999999999787,0.10798193302636691,0,0]
[-17.48688651532952,9.0099999999999785,0.11236628380772651,0,0]
[-17.310251298002967,9.0199999999999783,0.11688188866689296,0,0]
[-17.133616080676411,9.029999999999978,0.12153033790911921,0,0]
[-16.956980863349859,9.0399999999999778,0.12631312287038651,0,0]
[-16.780345646023306,9.0499999999999776,0.13123162954934203,0,0]
[-16.603710428696754,9.0599999999999774,0.13628713220207755,0,0]
[-16.427075211370198,9.0699999999999772,0.14148078691395477,0,0]
[-16.250439994043646,9.079999999999977,0.14681362516330135,0,0]
[-16.073804776717093,9.0899999999999768,0.15228654739240177,0,0]
[-15.897169559390541,9.0999999999999766,0.157900316601775,0,0]
[-15.720534342063987,9.1099999999999763,0.16365555198427184,0,0]
[-15.543899124737434,9.1199999999999761,0.16955272261603022,0,0]
[-15.36726390741088,9.1299999999999759,0.17559214122179656,0,0]
[-15.190628690084328,9.1399999999999757,0.18177395803255053,0,0]
[-15.013993472757774,9.1499999999999755,0.18809815475375818,0,0]
[-14.837358255431221,9.1599999999999753,0.19456453866291884,0,0]
[-14.660723038104669,9.1699999999999751,0.20117273685536449,0,0]
[-14.484087820778115,9.1799999999999748,0.20792219065751125,0,0]
[-14.307452603451562,9.1899999999999746,0.21481215022694999,0,0]
[-14.130817386125008,9.1999999999999744,0.22184166935889293,0,0]
[-13.954182168798456,9.2099999999999742,0.22900960051856609,0,0]
[-13.777546951471901,9.219999999999974,0.23631459011914541,0,0]
[-13.600911734145349,9.2299999999999738,0.24375507406478383,0,0]
[-13.424276516818795,9.2399999999999736,0.2513292735781561,0,0]
[-13.247641299492242,9.2499999999999734,0.25903519133176273,0,0]
[-13.07100608216569,9.2599999999999731,0.26687060790198341,0,0]
[-12.894370864839136,9.2699999999999729,0.27483307856454181,0,0]
[{"$f":"(B231-B$4)/B$11","v":-12.717735647512583},9.2799999999999727,{"$f":"NORMDIST(B231,B$4,B$5,0)","v":0.28291993044965535},{"$f":"IF(C231<=B$14/2,C231,0)","v":0},{"$f":"IF(C231<=B$6/2,C231,0)","v":0}]
[-12.541100430186029,9.2899999999999725,0.29112826007467246,0,0]
[-12.364465212859477,{"$f":"B232+0.01","v":9.2999999999999723},0.2994549312714665,0,0]
[-12.187829995532923,9.3099999999999721,0.30789657352524369,0,0]
[-12.01119477820637,9.3199999999999719,0.31644958074074186,0,0]
[-11.834559560879816,9.3299999999999716,0.3251101104510436,0,0]
[-11.657924343553264,9.3399999999999714,0.33387408348340253,0,0]
[-11.481289126226711,9.3499999999999712,0.34273718409558906,0,0]
[-11.304653908900157,9.359999999999971,0.35169486059529864,0,0]
[-11.128018691573605,9.3699999999999708,0.36074232645413418,0,0]
[-10.95138347424705,9.3799999999999706,0.36987456192658363,0,0]
[-10.774748256920498,9.3899999999999704,0.37908631618325306,0,0]
[-10.598113039593944,9.3999999999999702,0.38837210996639809,0,0]
[-10.421477822267391,9.4099999999999699,0.39772623877452357,0,0]
[-10.244842604940839,9.4199999999999697,0.40714277658149028,0,0]
[-10.068207387614285,9.4299999999999695,0.41661558009418775,0,0]
[-9.8915721702877324,9.4399999999999693,0.42613829355140648,0,0]
[-9.7149369529611782,9.4499999999999691,0.43570435406507141,0,0]
[-9.5383017356346258,9.4599999999999689,0.44530699750349234,0,0]
[-9.3616665183080716,9.4699999999999687,0.45493926491474157,0,0]
[-9.1850313009815192,9.4799999999999685,0.46459400948670193,0,0]
[-9.008396083654965,9.4899999999999682,0.47426390403872848,0,0]
[-8.8317608663284126,9.499999999999968,0.48394144903825581,0,0]
[-8.6551256490018602,9.5099999999999678,0.49361898113405428,0,0]
[-8.478490431675306,9.5199999999999676,0.50328868219620293,0,0]
[-8.3018552143487536,9.5299999999999674,0.51294258885120925,0,0]
[-8.1252199970221994,9.5399999999999672,0.52257260249907467,0,0]
[-7.948584779695647,9.549999999999967,0.53217049979747799,0,0]
[-7.7719495623690937,9.5599999999999667,0.54172794359664433,0,0]
[-7.5953143450425404,9.5699999999999665,0.55123649430688171,0,0]
[-7.4186791277159871,9.5799999999999663,0.56068762167920938,0,0]
[-7.2420439103894338,9.5899999999999661,0.57007271697798279,0,0]
[-7.0654086930628806,9.5999999999999659,0.57938310552293393,0,0]
[-6.8887734757363273,9.6099999999999657,0.58861005957661872,0,0]
[-6.712138258409774,9.6199999999999655,0.5977448115518742,0,0]
[-6.5355030410832207,9.6299999999999653,0.60677856751256898,0,0]
[-6.3588678237566683,9.639999999999965,0.61570252093967492,0,0]
[-6.182232606430115,9.6499999999999648,0.62450786673349179,0,0]
[-6.0055973891035617,9.6599999999999646,0.63318581542175512,0,0]
[-5.8289621717770084,9.6699999999999644,0.64172760754231495,0,0]
[-5.6523269544504551,9.6799999999999642,0.65012452816813449,0,0]
[-5.4756917371239018,9.689999999999964,0.65836792154150015,0,0]
[-5.2990565197973485,9.6999999999999638,0.66644920578357036,0,0]
[-5.1224213024707952,9.7099999999999635,0.67435988764473265,0,0]
[-4.9457860851442428,9.7199999999999633,0.68209157726067715,0,0]
[-4.7691508678176895,9.7299999999999631,0.68963600287863924,0,0]
[-4.5925156504911362,9.7399999999999629,0.69698502551792219,0,0]
[-4.4158804331645829,9.7499999999999627,0.70413065352857274,0,0]
[-4.2392452158380296,9.7599999999999625,0.71106505701196854,0,0]
[-4.0626099985114763,9.7699999999999623,0.7177805820670643,0,0]
[-3.8859747811849235,9.7799999999999621,0.72426976482616023,0,0]
[-3.7093395638583702,9.7899999999999618,0.73052534524428447,0,0]
[-3.5327043465318169,9.7999999999999616,0.73654028060662402,0,0]
[-3.3560691292052636,9.8099999999999614,0.74230775871891019,0,0]
[-3.1794339118787103,9.8199999999999612,0.74782121074623586,0,0]
[-3.0027986945521574,9.829999999999961,0.75307432366648797,0,0]
[-2.8261634772256041,9.8399999999999608,0.75806105230538434,0,0]
[-2.6495282598990508,9.8499999999999606,0.76277563092103018,0,0]
[-2.4728930425724975,9.8599999999999604,0.76721258430694006,0,0]
[-2.2962578252459447,9.8699999999999601,0.77136673838361614,0,0]
[-2.1196226079193914,9.8799999999999599,0.77523323025001334,0,0]
[-1.9429873905928381,9.8899999999999597,0.77880751766756706,0,0]
[-1.766352173266285,9.8999999999999595,0.7820853879508991,0,0]
[-1.5897169559397317,9.9099999999999593,0.78506296624084626,0,0]
[{"$f":"(B295-B$4)/B$11","v":-1.4130817386131787},9.9199999999999591,{"$f":"NORMDIST(B295,B$4,B$5,0)","v":0.78773672313707144},{"$f":"IF(C295<=B$14/2,C295,0)","v":0},{"$f":"IF(C295<=B$6/2,C295,0)","v":0}]
[-1.2364465212866254,9.9299999999999589,0.7901034816692134,0,0]
[-1.0598113039600723,{"$f":"B296+0.01","v":9.9399999999999586},0.79216042358730432,0,0]
[-0.88317608663351899,9.9499999999999584,0.79390509495401695,0,0]
[-0.7065408693069658,9.9599999999999582,0.79533541102321248,0,0]
[-0.52990565198041262,9.969999999999958,0.79644966039120979,0,0]
[-0.35327043465385943,9.9799999999999578,0.79724650840920741,0,0]
[-0.17663521732730622,9.9899999999999576,0.79772499984733092,0,0]
[-7.5304122330474977E-13,9.9999999999999574,0.79788456080286541,0,0]
[0.17663521732580015,10.009999999999957,0.79772499984733358,0,0]
[0.35327043465235336,10.019999999999957,0.79724650840921274,0,0]
[0.52990565197890649,10.029999999999957,0.7964496603912179,0,0]
[0.70654086930545967,10.039999999999957,0.79533541102322336,0,0]
[0.88317608663201286,10.049999999999956,0.7939050949540305,0,0]
[1.0598113039585662,10.059999999999956,0.79216042358732053,0,0]
[1.2364465212851192,10.069999999999956,0.79010348166923228,0,0]
[1.4130817386116725,10.079999999999956,0.78773672313709286,0,0]
[1.5897169559382256,10.089999999999955,0.78506296624087035,0,0]
[1.7663521732647789,10.099999999999955,0.78208538795092586,0,0]
[1.942987390591332,10.109999999999955,0.77880751766759626,0,0]
[2.119622607917885,10.119999999999955,0.77523323025004509,0,0]
[2.2962578252444383,10.129999999999955,0.77136673838365033,0,0]
[2.4728930425709916,10.139999999999954,0.7672125843069767,0,0]
[2.6495282598975449,10.149999999999954,0.76277563092106915,0,0]
[2.8261634772240982,10.159999999999954,0.75806105230542564,0,0]
[3.0027986945506511,10.169999999999954,0.7530743236665316,0,0]
[3.1794339118772044,10.179999999999954,0.74782121074628183,0,0]
[3.3560691292037577,10.189999999999953,0.74230775871895838,0,0]
[3.532704346530311,10.199999999999953,0.73654028060667431,0,0]
[3.7093395638568638,10.209999999999953,0.73052534524433665,0,0]
[3.8859747811834171,10.219999999999953,0.72426976482621463,0,0]
[4.06260999850997,10.229999999999952,0.71778058206712059,0,0]
[4.2392452158365233,10.239999999999952,0.71106505701202671,0,0]
[4.4158804331630765,10.249999999999952,0.7041306535286328,0,0]
[4.5925156504896298,10.259999999999952,0.69698502551798402,0,0]
[4.7691508678161831,10.269999999999952,0.68963600287870275,0,0]
[4.9457860851427364,10.279999999999951,0.68209157726074221,0,0]
[5.1224213024692897,10.289999999999951,0.67435988764479937,0,0]
[5.299056519795843,10.299999999999951,0.66644920578363853,0,0]
[5.4756917371223963,10.309999999999951,0.65836792154156976,0,0]
[5.6523269544489487,10.319999999999951,0.65012452816820543,0,0]
[5.828962171775502,10.32999999999995,0.64172760754238711,0,0]
[6.0055973891020553,10.33999999999995,0.63318581542182861,0,0]
[6.1822326064286086,10.34999999999995,0.6245078667335664,0,0]
[6.3588678237551619,10.35999999999995,0.61570252093975042,0,0]
[6.5355030410817152,10.369999999999949,0.60677856751264569,0,0]
[6.7121382584082685,10.379999999999949,0.59774481155195169,0,0]
[6.8887734757348218,10.389999999999949,0.5886100595766971,0,0]
[7.0654086930613742,10.399999999999949,0.57938310552301286,0,0]
[7.2420439103879275,10.409999999999949,0.5700727169780625,0,0]
[7.4186791277144808,10.419999999999948,0.56068762167928976,0,0]
[7.5953143450410341,10.429999999999948,0.55123649430696242,0,0]
[7.7719495623675874,10.439999999999948,0.5417279435967256,0,0]
[7.9485847796941407,10.449999999999948,0.5321704997975597,0,0]
[8.1252199970206931,10.459999999999948,0.52257260249915671,0,0]
[8.3018552143472473,10.469999999999947,0.51294258885129151,0,0]
[8.4784904316737997,10.479999999999947,0.50328868219628531,0,0]
[8.6551256490003539,10.489999999999947,0.49361898113413677,0,0]
[8.8317608663269063,10.499999999999947,0.4839414490383383,0,0]
[9.0083960836534605,10.509999999999946,0.47426390403881091,0,0]
[9.1850313009800129,10.519999999999946,0.46459400948678431,0,0]
[9.3616665183065653,10.529999999999946,0.45493926491482378,0,0]
[9.5383017356331194,10.539999999999946,0.44530699750357439,0,0]
[9.7149369529596719,10.549999999999946,0.43570435406515318,0,0]
[{"$f":"(B359-B$4)/B$11","v":9.891572170286226},10.559999999999945,{"$f":"NORMDIST(B359,B$4,B$5,0)","v":0.42613829355148786},{"$f":"IF(C359<=B$14/2,C359,0)","v":0},{"$f":"IF(C359<=B$6/2,C359,0)","v":0}]
[10.068207387612778,10.569999999999945,0.41661558009426869,0,0]
[10.244842604939333,{"$f":"B360+0.01","v":10.579999999999945},0.40714277658157089,0,0]
[10.421477822265885,10.589999999999945,0.39772623877460361,0,0]
[10.598113039592439,10.599999999999945,0.38837210996647759,0,0]
[10.774748256918992,10.609999999999944,0.37908631618333194,0,0]
[10.951383474245544,10.619999999999944,0.36987456192666185,0,0]
[11.128018691572098,10.629999999999944,0.36074232645421161,0,0]
[11.304653908898651,10.639999999999944,0.35169486059537541,0,0]
[11.481289126225205,10.649999999999944,0.34273718409566512,0,0]
[11.657924343551757,10.659999999999943,0.33387408348347763,0,0]
[11.834559560878311,10.669999999999943,0.32511011045111787,0,0]
[12.011194778204864,10.679999999999943,0.31644958074081525,0,0]
[12.187829995531418,10.689999999999943,0.30789657352531613,0,0]
[12.36446521285797,10.699999999999942,0.29945493127153799,0,0]
[12.541100430184523,10.709999999999942,0.29112826007474296,0,0]
[12.717735647511077,10.719999999999942,0.28291993044972485,0,0]
[12.894370864837629,10.729999999999942,0.27483307856461026,0,0]
[13.071006082164184,10.739999999999942,0.26687060790205069,0,0]
[13.247641299490736,10.749999999999941,0.25903519133182901,0,0]
[13.42427651681729,10.759999999999941,0.25132927357822121,0,0]
[13.600911734143843,10.769999999999941,0.24375507406484789,0,0]
[13.777546951470395,10.779999999999941,0.23631459011920825,0,0]
[13.954182168796949,10.789999999999941,0.22900960051862779,0,0]
[14.130817386123502,10.79999999999994,0.22184166935895347,0,0]
[14.307452603450056,10.80999999999994,0.21481215022700934,0,0]
[14.484087820776608,10.81999999999994,0.20792219065756939,0,0]
[14.660723038103162,10.82999999999994,0.20117273685542145,0,0]
[14.837358255429715,10.839999999999939,0.19456453866297455,0,0]
[15.013993472756269,10.849999999999939,0.18809815475381275,0,0]
[15.190628690082821,10.859999999999939,0.18177395803260385,0,0]
[15.367263907409374,10.869999999999939,0.17559214122184866,0,0]
[15.543899124735928,10.879999999999939,0.16955272261608109,0,0]
[15.72053434206248,10.889999999999938,0.16365555198432152,0,0]
[15.897169559389035,10.899999999999938,0.15790031660182346,0,0]
[16.073804776715587,10.909999999999938,0.15228654739244901,0,0]
[16.250439994042139,10.919999999999938,0.14681362516334742,0,0]
[16.427075211368695,10.929999999999938,0.14148078691399962,0,0]
[16.603710428695248,10.939999999999937,0.13628713220212127,0,0]
[16.7803456460218,10.949999999999937,0.13123162954938455,0,0]
[16.956980863348353,10.959999999999937,0.1263131228704279,0,0]
[17.133616080674905,10.969999999999937,0.12153033790915942,0,0]
[17.310251298001461,10.979999999999936,0.11688188866693204,0,0]
[17.486886515328013,10.989999999999936,0.11236628380776444,0,0]
[17.663521732654566,10.999999999999936,0.10798193302640373,0,0]
[17.840156949981118,11.009999999999936,0.10372715336566801,0,0]
[18.016792167307674,11.019999999999936,9.9600175470167682E-2,0,0]
[18.193427384634226,11.029999999999935,9.5599149764179506E-2,0,0]
[18.370062601960779,11.039999999999935,9.1722152542134533E-2,0,0]
[18.546697819287331,11.049999999999935,8.7967191960878419E-2,0,0]
[18.723333036613884,11.059999999999935,8.4332213923563951E-2,0,0]
[18.89996825394044,11.069999999999935,8.0815107845743264E-2,0,0]
[19.076603471266992,11.079999999999934,7.7413712294933185E-2,0,0]
[19.253238688593544,11.089999999999934,7.4125820495634237E-2,0,0]
[19.429873905920097,11.099999999999934,7.0949185692483527E-2,0,0]
[19.606509123246653,11.109999999999934,6.7881526364918371E-2,0,0]
[19.783144340573205,11.119999999999933,6.4920531287414263E-2,0,0]
[19.959779557899758,11.129999999999933,6.2063864430035233E-2,0,0]
[20.13641477522631,11.139999999999933,5.9309169694700646E-2,0,0]
[20.313049992552862,11.149999999999933,5.6654075483219858E-2,0,0]
[20.489685209879418,11.159999999999933,5.4096199093780467E-2,0,0]
[20.666320427205971,11.169999999999932,5.1633150943191694E-2,0,0]
[20.842955644532523,11.179999999999932,4.9262538612780765E-2,0,0]
[21.019590861859076,11.189999999999932,4.6981970716417923E-2,0,0]
[{"$f":"(B423-B$4)/B$11","v":21.196226079185632},11.199999999999932,{"$f":"NORMDIST(B423,B$4,B$5,0)","v":4.4789060589700461E-2},{"$f":"IF(C423<=B$14/2,C423,0)","v":0},{"$f":"IF(C423<=B$6/2,C423,0)","v":0}]
[21.372861296512184,11.209999999999932,4.2681429799859706E-2,0,0]
[21.549496513838736,{"$f":"B424+0.01","v":11.219999999999931},4.0656711476465289E-2,0,0]
[21.726131731165289,11.229999999999931,3.8712553463487023E-2,0,0]
[21.902766948491841,11.239999999999931,3.6846621293736725E-2,0,0]
[22.079402165818397,11.249999999999931,3.5056600987149224E-2,0,0]
[22.25603738314495,11.259999999999931,3.3340201674773792E-2,0,0]
[22.432672600471502,11.26999999999993,3.1695158050732856E-2,0,0]
[22.609307817798054,11.27999999999993,3.0119232654765682E-2,0,0]
[22.785943035124607,11.28999999999993,2.8610217988309733E-2,2.8610217988309733E-2,0]
[22.962578252451163,11.29999999999993,2.7165938467381169E-2,2.7165938467381169E-2,0]
[23.139213469777715,11.309999999999929,2.5784252215800146E-2,2.5784252215800146E-2,0]
[23.315848687104268,11.319999999999929,2.4463052702565088E-2,2.4463052702565088E-2,2.4463052702565088E-2]
[23.49248390443082,11.329999999999929,2.3200270227413892E-2,2.3200270227413892E-2,2.3200270227413892E-2]
[23.669119121757376,11.339999999999929,2.1993873258819553E-2,2.1993873258819553E-2,2.1993873258819553E-2]
[23.845754339083928,11.349999999999929,2.0841869628853222E-2,2.0841869628853222E-2,2.0841869628853222E-2]
[24.022389556410481,11.359999999999928,1.9742307589509969E-2,1.9742307589509969E-2,1.9742307589509969E-2]
[24.199024773737033,11.369999999999928,1.869327673523194E-2,1.869327673523194E-2,1.869327673523194E-2]
[24.375659991063586,11.379999999999928,1.7692908796481485E-2,1.7692908796481485E-2,1.7692908796481485E-2]
[24.552295208390142,11.389999999999928,1.6739378309312779E-2,1.6739378309312779E-2,1.6739378309312779E-2]
[24.728930425716694,11.399999999999928,1.5830903165966352E-2,1.5830903165966352E-2,1.5830903165966352E-2]
[24.905565643043246,11.409999999999927,1.4965745051567253E-2,1.4965745051567253E-2,1.4965745051567253E-2]
[25.082200860369799,11.419999999999927,1.4142209772044752E-2,1.4142209772044752E-2,1.4142209772044752E-2]
[25.258836077696355,11.429999999999927,1.3358647478410819E-2,1.3358647478410819E-2,1.3358647478410819E-2]
[25.435471295022907,11.439999999999927,1.2613452792537177E-2,1.2613452792537177E-2,1.2613452792537177E-2]
[25.61210651234946,11.449999999999926,1.1905064839556783E-2,1.1905064839556783E-2,1.1905064839556783E-2]
[25.788741729676012,11.459999999999926,1.1231967191986766E-2,1.1231967191986766E-2,1.1231967191986766E-2]
[25.965376947002564,11.469999999999926,1.0592687730626641E-2,1.0592687730626641E-2,1.0592687730626641E-2]
[26.14201216432912,11.479999999999926,9.9857984272291329E-3,9.9857984272291329E-3,9.9857984272291329E-3]
[26.318647381655673,11.489999999999926,9.4099150538721303E-3,9.4099150538721303E-3,9.4099150538721303E-3]
[26.495282598982225,11.499999999999925,8.8636968238799824E-3,8.8636968238799824E-3,8.8636968238799824E-3]
[26.671917816308778,11.509999999999925,8.3458459690516976E-3,8.3458459690516976E-3,8.3458459690516976E-3]
[26.848553033635334,11.519999999999925,7.8551072578531434E-3,7.8551072578531434E-3,7.8551072578531434E-3]
[27.025188250961886,11.529999999999925,7.3902674591214699E-3,7.3902674591214699E-3,7.3902674591214699E-3]
[27.201823468288438,11.539999999999925,6.9501547557131041E-3,6.9501547557131041E-3,6.9501547557131041E-3]
[27.378458685614991,11.549999999999924,6.5336381124029069E-3,6.5336381124029069E-3,6.5336381124029069E-3]
[27.555093902941543,11.559999999999924,6.1396266022123933E-3,6.1396266022123933E-3,6.1396266022123933E-3]
[27.731729120268099,11.569999999999924,5.767068695209634E-3,5.767068695209634E-3,5.767068695209634E-3]
[27.908364337594652,11.579999999999924,5.4149515136840158E-3,5.4149515136840158E-3,5.4149515136840158E-3]
[28.084999554921204,11.589999999999923,5.0823000574555218E-3,5.0823000574555218E-3,5.0823000574555218E-3]
[28.261634772247756,11.599999999999923,4.768176402932027E-3,4.768176402932027E-3,4.768176402932027E-3]
[28.438269989574312,11.609999999999923,4.4716788793792966E-3,4.4716788793792966E-3,4.4716788793792966E-3]
[28.614905206900865,11.619999999999923,4.1919412257179827E-3,4.1919412257179827E-3,4.1919412257179827E-3]
[28.791540424227417,11.629999999999923,3.9281317310107334E-3,3.9281317310107334E-3,3.9281317310107334E-3]
[28.96817564155397,11.639999999999922,3.6794523616504315E-3,3.6794523616504315E-3,3.6794523616504315E-3]
[29.144810858880522,11.649999999999922,3.4451378781091284E-3,3.4451378781091284E-3,3.4451378781091284E-3]
[29.321446076207078,11.659999999999922,3.2244549439559189E-3,3.2244549439559189E-3,3.2244549439559189E-3]
[29.49808129353363,11.669999999999922,3.0167012297021901E-3,3.0167012297021901E-3,3.0167012297021901E-3]
[29.674716510860183,11.679999999999922,2.8212045138842558E-3,2.8212045138842558E-3,2.8212045138842558E-3]
[29.851351728186735,11.689999999999921,2.637321783646885E-3,2.637321783646885E-3,2.637321783646885E-3]
[30.027986945513291,11.699999999999921,2.4644383369473596E-3,2.4644383369473596E-3,2.4644383369473596E-3]
[30.204622162839843,11.709999999999921,2.301966888358212E-3,2.301966888358212E-3,2.301966888358212E-3]
[30.381257380166396,11.719999999999921,2.1493466803086435E-3,2.1493466803086435E-3,2.1493466803086435E-3]
[30.557892597492948,11.72999999999992,2.0060426014695799E-3,2.0060426014695799E-3,2.0060426014695799E-3]
[30.734527814819501,11.73999999999992,1.8715443138559982E-3,1.8715443138559982E-3,1.8715443138559982E-3]
[30.911163032146057,11.74999999999992,1.7453653900924967E-3,1.7453653900924967E-3,1.7453653900924967E-3]
[31.087798249472609,11.75999999999992,1.6270424621645345E-3,1.6270424621645345E-3,1.6270424621645345E-3]
[31.264433466799161,11.76999999999992,1.5161343828582838E-3,1.5161343828582838E-3,1.5161343828582838E-3]
[31.441068684125714,11.779999999999919,1.4122214009768827E-3,1.4122214009768827E-3,1.4122214009768827E-3]
[31.61770390145227,11.789999999999919,1.3149043513101131E-3,1.3149043513101131E-3,1.3149043513101131E-3]
[31.794339118778822,11.799999999999919,1.2238038602282581E-3,1.2238038602282581E-3,1.2238038602282581E-3]
[31.970974336105375,11.809999999999919,1.1385595676691748E-3,1.1385595676691748E-3,1.1385595676691748E-3]
[32.147609553431927,11.819999999999919,1.0588293661904977E-3,1.0588293661904977E-3,1.0588293661904977E-3]
[32.324244770758483,11.829999999999918,9.842886576663754E-4,9.842886576663754E-4,9.842886576663754E-4]
[{"$f":"(B487-B$4)/B$11","v":32.500879988085032},11.839999999999918,{"$f":"NORMDIST(B487,B$4,B$5,0)","v":9.1462962812026525E-4},{"$f":"IF(C487<=B$14/2,C487,0)","v":9.1462962812026525E-4},{"$f":"IF(C487<=B$6/2,C487,0)","v":9.1462962812026525E-4}]
[32.677515205411588,11.849999999999918,8.4956054110201895E-4,8.4956054110201895E-4,8.4956054110201895E-4]
[32.854150422738144,{"$f":"B488+0.01","v":11.859999999999918},7.8880504993879589E-4,7.8880504993879589E-4,7.8880504993879589E-4]
[33.030785640064693,11.869999999999918,7.3210152911512257E-4,7.3210152911512257E-4,7.3210152911512257E-4]
[33.207420857391249,11.879999999999917,6.7920242496773186E-4,6.7920242496773186E-4,6.7920242496773186E-4]
[33.384056074717797,11.889999999999917,6.2987362581543808E-4,6.2987362581543808E-4,6.2987362581543808E-4]
[33.560691292044353,11.899999999999917,5.8389385158328928E-4,5.8389385158328928E-4,5.8389385158328928E-4]
[33.737326509370909,11.909999999999917,5.4105406292338657E-4,5.4105406292338657E-4,5.4105406292338657E-4]
[33.913961726697458,11.919999999999916,5.0115688978204286E-4,5.0115688978204286E-4,5.0115688978204286E-4]
[34.090596944024014,11.929999999999916,4.6401607931418476E-4,4.6401607931418476E-4,4.6401607931418476E-4]
[34.267232161350563,11.939999999999916,4.2945596300101365E-4,4.2945596300101365E-4,4.2945596300101365E-4]
[34.443867378677119,11.949999999999916,3.9731094278580624E-4,3.9731094278580624E-4,3.9731094278580624E-4]
[34.620502596003675,11.959999999999916,3.6742499600515702E-4,3.6742499600515702E-4,3.6742499600515702E-4]
[34.797137813330224,11.969999999999915,3.3965119885891372E-4,3.3965119885891372E-4,3.3965119885891372E-4]
[34.97377303065678,11.979999999999915,3.1385126813127524E-4,3.1385126813127524E-4,3.1385126813127524E-4]
[35.150408247983329,11.989999999999915,2.8989512084797852E-4,2.8989512084797852E-4,2.8989512084797852E-4]
[35.327043465309885,11.999999999999915,2.6766045152995331E-4,2.6766045152995331E-4,2.6766045152995331E-4]
[35.503678682636441,12.009999999999915,2.4703232668221671E-4,2.4703232668221671E-4,2.4703232668221671E-4]
[35.680313899962989,12.019999999999914,2.2790279613788713E-4,2.2790279613788713E-4,2.2790279613788713E-4]
[35.856949117289545,12.029999999999914,2.1017052086094693E-4,2.1017052086094693E-4,2.1017052086094693E-4]
[36.033584334616101,12.039999999999914,1.9374041679757483E-4,1.9374041679757483E-4,1.9374041679757483E-4]
[36.21021955194265,12.049999999999914,1.7852331435439206E-4,1.7852331435439206E-4,1.7852331435439206E-4]
[36.386854769269206,12.059999999999913,1.6443563307268913E-4,1.6443563307268913E-4,1.6443563307268913E-4]
[36.563489986595755,12.069999999999913,1.5139907106043106E-4,1.5139907106043106E-4,1.5139907106043106E-4]
[36.740125203922311,12.079999999999913,1.3934030873852965E-4,1.3934030873852965E-4,1.3934030873852965E-4]
[36.916760421248867,12.089999999999913,1.2819072645430535E-4,1.2819072645430535E-4,1.2819072645430535E-4]
[37.093395638575416,12.099999999999913,1.1788613551316619E-4,1.1788613551316619E-4,1.1788613551316619E-4]
[37.270030855901972,12.109999999999912,1.0836652217916037E-4,1.0836652217916037E-4,1.0836652217916037E-4]
[37.446666073228521,12.119999999999912,9.9575804196098462E-5,9.9575804196098462E-5,9.9575804196098462E-5]
[37.623301290555077,12.129999999999912,9.1461599383271027E-5,9.1461599383271027E-5,9.1461599383271027E-5]
[37.799936507881633,12.139999999999912,8.3975005863298042E-5,8.3975005863298042E-5,8.3975005863298042E-5]
[37.976571725208181,12.149999999999912,7.707039348423286E-5,7.707039348423286E-5,7.707039348423286E-5]
[38.153206942534737,12.159999999999911,7.0705206003600458E-5,7.0705206003600458E-5,7.0705206003600458E-5]
[38.329842159861286,12.169999999999911,6.4839773608477537E-5,6.4839773608477537E-5,6.4839773608477537E-5]
[38.506477377187842,12.179999999999911,5.9437135352930646E-5,5.9437135352930646E-5,5.9437135352930646E-5]
[38.683112594514398,12.189999999999911,5.4462871102027792E-5,5.4462871102027792E-5,5.4462871102027792E-5]
[38.859747811840947,12.19999999999991,4.9884942580146407E-5,4.9884942580146407E-5,4.9884942580146407E-5]
[39.036383029167503,12.20999999999991,4.5673543130330107E-5,4.5673543130330107E-5,4.5673543130330107E-5]
[39.213018246494059,12.21999999999991,4.1800955800934303E-5,4.1800955800934303E-5,4.1800955800934303E-5]
[39.389653463820608,12.22999999999991,3.8241419385666245E-5,3.8241419385666245E-5,3.8241419385666245E-5]
[39.566288681147164,12.23999999999991,3.4971002053306656E-5,3.4971002053306656E-5,3.4971002053306656E-5]
[39.742923898473713,12.249999999999909,3.1967482213837018E-5,3.1967482213837018E-5,3.1967482213837018E-5]
[39.919559115800269,12.259999999999909,2.9210236278329801E-5,2.9210236278329801E-5,2.9210236278329801E-5]
[40.096194333126824,12.269999999999909,2.6680132980733716E-5,2.6680132980733716E-5,2.6680132980733716E-5]
[40.272829550453373,12.279999999999909,2.4359433940557653E-5,2.4359433940557653E-5,2.4359433940557653E-5]
[40.449464767779929,12.289999999999909,2.2231700156374218E-5,2.2231700156374218E-5,2.2231700156374218E-5]
[40.626099985106478,12.299999999999908,2.0281704130990596E-5,2.0281704130990596E-5,2.0281704130990596E-5]
[40.802735202433034,12.309999999999908,1.8495347340026941E-5,1.8495347340026941E-5,1.8495347340026941E-5]
[40.97937041975959,12.319999999999908,1.685958276647195E-5,1.685958276647195E-5,1.685958276647195E-5]
[41.156005637086139,12.329999999999908,1.5362342234514148E-5,1.5362342234514148E-5,1.5362342234514148E-5]
[41.332640854412695,12.339999999999907,1.3992468286552889E-5,1.3992468286552889E-5,1.3992468286552889E-5]
[41.509276071739244,12.349999999999907,1.2739650357745315E-5,1.2739650357745315E-5,1.2739650357745315E-5]
[41.6859112890658,12.359999999999907,1.1594365012724728E-5,1.1594365012724728E-5,1.1594365012724728E-5]
[41.862546506392356,12.369999999999907,1.0547820019211919E-5,1.0547820019211919E-5,1.0547820019211919E-5]
[42.039181723718904,12.379999999999907,9.5919020431135629E-6,9.5919020431135629E-6,9.5919020431135629E-6]
[42.21581694104546,12.389999999999906,8.7191277593510796E-6,8.7191277593510796E-6,8.7191277593510796E-6]
[42.392452158372009,12.399999999999906,7.922598182071286E-6,7.922598182071286E-6,7.922598182071286E-6]
[42.569087375698565,12.409999999999906,7.1959560270490272E-6,7.1959560270490272E-6,7.1959560270490272E-6]
[42.745722593025121,12.419999999999906,6.5333459279925033E-6,6.5333459279925033E-6,6.5333459279925033E-6]
[42.92235781035167,12.429999999999906,5.9293773370959906E-6,5.9293773370959906E-6,5.9293773370959906E-6]
[43.098993027678226,12.439999999999905,5.3790899485480153E-6,5.3790899485480153E-6,5.3790899485480153E-6]
[43.275628245004782,12.449999999999905,4.8779214917912538E-6,4.8779214917912538E-6,4.8779214917912538E-6]
[43.452263462331331,12.459999999999905,4.4216777491409743E-6,4.4216777491409743E-6,4.4216777491409743E-6]
[43.628898679657887,12.469999999999905,4.0065046599007574E-6,4.0065046599007574E-6,4.0065046599007574E-6]
[{"$f":"(B551-B$4)/B$11","v":43.805533896984436},12.479999999999905,{"$f":"NORMDIST(B551,B$4,B$5,0)","v":3.6288623803675035E-6},{"$f":"IF(C551<=B$14/2,C551,0)","v":3.6288623803675035E-6},{"$f":"IF(C551<=B$6/2,C551,0)","v":3.6288623803675035E-6}]
[43.982169114310992,12.489999999999904,3.2855011760932822E-6,3.2855011760932822E-6,3.2855011760932822E-6]
[44.158804331637548,{"$f":"B552+0.01","v":12.499999999999904},2.9734390294714477E-6,2.9734390294714477E-6,2.9734390294714477E-6]
[44.335439548964096,12.509999999999904,2.6899408521414789E-6,2.6899408521414789E-6,2.6899408521414789E-6]
[44.512074766290652,12.519999999999904,2.4324991978649997E-6,2.4324991978649997E-6,2.4324991978649997E-6]
[44.688709983617201,12.529999999999903,2.1988163774185546E-6,2.1988163774185546E-6,2.1988163774185546E-6]
[44.865345200943757,12.539999999999903,1.986787882681779E-6,1.986787882681779E-6,1.986787882681779E-6]
[45.041980418270313,12.549999999999903,1.7944870324784397E-6,1.7944870324784397E-6,1.7944870324784397E-6]
[45.218615635596862,12.559999999999903,1.6201507578578836E-6,1.6201507578578836E-6,1.6201507578578836E-6]
[45.395250852923418,12.569999999999903,1.4621664493921603E-6,1.4621664493921603E-6,1.4621664493921603E-6]
[45.571886070249967,12.579999999999902,1.3190597937163742E-6,1.3190597937163742E-6,1.3190597937163742E-6]
[45.748521287576523,12.589999999999902,1.1894835309627571E-6,1.1894835309627571E-6,1.1894835309627571E-6]
[45.925156504903079,12.599999999999902,1.0722070689406179E-6,1.0722070689406179E-6,1.0722070689406179E-6]
[46.101791722229628,12.609999999999902,9.6610689390092655E-7,9.6610689390092655E-7,9.6610689390092655E-7]
[46.278426939556184,12.619999999999902,8.701577215039215E-7,8.701577215039215E-7,8.701577215039215E-7]
[46.45506215688274,12.629999999999901,7.8342433518777594E-7,7.8342433518777594E-7,7.8342433518777594E-7]
[46.631697374209288,12.639999999999901,7.0505406252354529E-7,7.0505406252354529E-7,7.0505406252354529E-7]
[46.808332591535844,12.649999999999901,6.3426984334386106E-7,6.3426984334386106E-7,6.3426984334386106E-7]
[46.984967808862393,12.659999999999901,5.7036384645739907E-7,5.7036384645739907E-7,5.7036384645739907E-7]
[47.161603026188949,12.6699999999999,5.1269159461546322E-7,5.1269159461546322E-7,5.1269159461546322E-7]
[47.338238243515505,12.6799999999999,4.6066656008833471E-7,4.6066656008833471E-7,4.6066656008833471E-7]
[47.514873460842054,12.6899999999999,4.1375519574437563E-7,4.1375519574437563E-7,4.1375519574437563E-7]
[47.69150867816861,12.6999999999999,3.7147236891146043E-7,3.7147236891146043E-7,3.7147236891146043E-7]
[47.868143895495159,12.7099999999999,3.3337716754481956E-7,3.3337716754481956E-7,3.3337716754481956E-7]
[48.044779112821715,12.719999999999899,2.9906905033464666E-7,2.9906905033464666E-7,2.9906905033464666E-7]
[48.221414330148271,12.729999999999899,2.6818431436738989E-7,2.6818431436738989E-7,2.6818431436738989E-7]
[48.39804954747482,12.739999999999899,2.4039285581283106E-7,2.4039285581283106E-7,2.4039285581283106E-7]
[48.574684764801376,12.749999999999899,2.1539520085110544E-7,2.1539520085110544E-7,2.1539520085110544E-7]
[48.751319982127924,12.759999999999899,1.9291978568568323E-7,1.9291978568568323E-7,1.9291978568568323E-7]
[48.92795519945448,12.769999999999898,1.7272046601581461E-7,1.7272046601581461E-7,1.7272046601581461E-7]
[49.104590416781036,12.779999999999898,1.5457423777063331E-7,1.5457423777063331E-7,1.5457423777063331E-7]
[49.281225634107585,12.789999999999898,1.3827915224240565E-7,1.3827915224240565E-7,1.3827915224240565E-7]
[49.457860851434141,12.799999999999898,1.236524100034586E-7,1.236524100034586E-7,1.236524100034586E-7]
[49.634496068760697,12.809999999999897,1.1052861915512173E-7,1.1052861915512173E-7,1.1052861915512173E-7]
[49.811131286087246,12.819999999999897,9.875820454232317E-8,9.875820454232317E-8,9.875820454232317E-8]
[49.987766503413802,12.829999999999897,8.8205955578848947E-8,8.8205955578848947E-8,8.8205955578848947E-8]
[50.164401720740351,12.839999999999897,7.8749701270089321E-8,7.8749701270089321E-8,7.8749701270089321E-8]
[50.341036938066907,12.849999999999897,7.0279101896491571E-8,7.0279101896491571E-8,7.0279101896491571E-8]
[50.517672155393463,12.859999999999896,6.2694547635913748E-8,6.2694547635913748E-8,6.2694547635913748E-8]
[50.694307372720012,12.869999999999896,5.5906155160376038E-8,5.5906155160376038E-8,5.5906155160376038E-8]
[50.870942590046567,12.879999999999896,4.9832853945961641E-8,4.9832853945961641E-8,4.9832853945961641E-8]
[51.047577807373116,12.889999999999896,4.4401554687211501E-8,4.4401554687211501E-8,4.4401554687211501E-8]
[51.224213024699672,12.899999999999896,3.9546392812537254E-8,3.9546392812537254E-8,3.9546392812537254E-8]
[51.400848242026228,12.909999999999895,3.5208040658014593E-8,3.5208040658014593E-8,3.5208040658014593E-8]
[51.577483459352777,12.919999999999895,3.1333082376303439E-8,3.1333082376303439E-8,3.1333082376303439E-8]
[51.754118676679333,12.929999999999895,2.7873446138129144E-8,2.7873446138129144E-8,2.7873446138129144E-8]
[51.930753894005882,12.939999999999895,2.4785888628330898E-8,2.4785888628330898E-8,2.4785888628330898E-8]
[52.107389111332438,12.949999999999894,2.2031527249392092E-8,2.2031527249392092E-8,2.2031527249392092E-8]
[52.284024328658994,12.959999999999894,1.9575415824906837E-8,1.9575415824906837E-8,1.9575415824906837E-8]
[52.460659545985543,12.969999999999894,1.7386159945782274E-8,1.7386159945782274E-8,1.7386159945782274E-8]
[52.637294763312099,12.979999999999894,1.5435568425160579E-8,1.5435568425160579E-8,1.5435568425160579E-8]
[52.813929980638648,12.989999999999894,1.3698337625988989E-8,1.3698337625988989E-8,1.3698337625988989E-8]

{"sheet":"RealWorldData","index":5,"n_rows":604,"n_cols":9,"rows_kept":604,"cut":false,"hidden":false,"merged":[]}
["Data","Facts and figures collected, summarized, analyzed, and interpreted. "]
["Data Set","The data collected in a particular study"]
[{"$f":"\"Number of \"&A5&\" = \"&\"Number of \"&A7","v":"Number of Elements = Number of Observation"},"A data set with n elements contains n observations"]
["Total pieces of data ","Number of elements * # of variables"]
["Elements","Are the entities on which data are collected (Also called Primary Keys in Database & Excel)"]
["Variables","Characteristic of interest for the elements (Also called Fields in Database & Excel)"]
["Observation","The set of measurements collected for a particular element  (or primary key)"]
[]
["Company Name","Market Stock Value","Qtrly Rev Growth","EBITDA","Earnings per Share","P/E Ratio"]
["Whole Foods Market Inc. ","3.19B",0.27600000000000002,"510.27M",1.153,19.71]
["Kroger Co.","18.91B",0.115,"3.78B",1.7949999999999999,16.16]
["Safeway","12.27B",7.2999999999999995E-2,"2.93B",2.04,13.74]
[]
["Date","Sales Rep","Customer","Sales","COGS","Region",null,"Row Labels","Count of Sales"]
[{"$f":"RANDBETWEEN(38500,TODAY())","v":"2010-05-31"},{"$f":"CHOOSE(RANDBETWEEN(1,5),\"Sioux\",\"Chin\",\"Tina\",\"Joy\",\"Tom\")","v":"Chin"},{"$f":"CHOOSE(RANDBETWEEN(1,5),\"PCC\",\"Whole Foods\",\"Safeway\",\"Fred Myer\",\"Coop\")","v":"Fred Myer"},{"$f":"IF(MOD(ROW(),17)=0,RANDBETWEEN(500,1250),IF(MOD(ROW(),10)=0,RANDBETWEEN(1000,2000),RANDBETWEEN(50,250)))","v":117},{"$f":"D15*RANDBETWEEN(40,80)/100","v":60.84},{"$f":"CHOOSE(RANDBETWEEN(1,5),\"West\",\"NorthWest\",\"MidWest\",\"NorthEast\",\"East\")","v":"West"},null,"0-249",498]
[{"$f":"RANDBETWEEN(38500,TODAY())","v":"2009-02-03"},{"$f":"CHOOSE(RANDBETWEEN(1,5),\"Sioux\",\"Chin\",\"Tina\",\"Joy\",\"Tom\")","v":"Chin"},{"$f":"CHOOSE(RANDBETWEEN(1,5),\"PCC\",\"Whole Foods\",\"Safeway\",\"Fred Myer\",\"Coop\")","v":"Safeway"},{"$f":"IF(MOD(ROW(),17)=0,RANDBETWEEN(500,1250),IF(MOD(ROW(),10)=0,RANDBETWEEN(1000,2000),RANDBETWEEN(50,250)))","v":232},{"$f":"D16*RANDBETWEEN(40,80)/100","v":116},{"$f":"CHOOSE(RANDBETWEEN(1,5),\"West\",\"NorthWest\",\"MidWest\",\"NorthEast\",\"East\")","v":"MidWest"},null,"250-499",1]
["2005-09-05","Joy","PCC",695,479.55,"MidWest",null,"500-749",6]
["2007-05-10","Joy","Fred Myer",226,106.22,"East",null,"750-999",18]
["2008-08-01","Chin","Fred Myer",107,55.64,"East",null,"1000-1249",31]
["2008-08-25","Joy","Fred Myer",1256,615.44000000000005,"East",null,"1250-1499",11]
["2005-12-14","Tom","Fred Myer",234,152.1,"West",null,"1500-1749",11]
["2008-08-06","Sioux","Coop",174,109.62,"East",null,"1750-1999",14]
["2007-07-19","Joy","Whole Foods",178,137.06,"West",null,"Grand Total",590]
["2009-09-10","Tina","Fred Myer",127,52.07,"NorthWest"]
["2006-04-10","Tom","Fred Myer",51,35.19,"East"]
["2006-02-19","Tina","Coop",184,86.48,"NorthEast"]
["2008-06-27","Tom","Safeway",118,90.86,"East"]
["2006-07-31","Chin","Coop",94,48.88,"East"]
["2008-12-07","Chin","PCC",90,56.7,"East"]
["2007-02-09","Joy","Coop",1285,642.5,"East"]
["2006-05-01","Chin","Whole Foods",202,159.58000000000001,"NorthWest"]
["2006-12-24","Tina","Coop",61,40.26,"East"]
["2005-09-05","Joy","PCC",77,57.75,"NorthEast"]
["2010-03-10","Tina","Coop",519,264.69,"NorthEast"]
["2007-07-06","Sioux","Coop",111,63.27,"NorthEast"]
["2008-02-26","Joy","Safeway",99,73.260000000000005,"NorthWest"]
["2008-01-11","Tom","Fred Myer",210,161.69999999999999,"MidWest"]
["2010-01-17","Joy","Safeway",189,109.62,"West"]
["2009-05-12","Sioux","Safeway",171,97.47,"NorthEast"]
["2010-06-10","Joy","Safeway",1516,970.24,"West"]
["2009-08-02","Chin","Safeway",219,135.78,"NorthWest"]
["2009-08-07","Chin","Safeway",89,48.06,"MidWest"]
["2006-09-07","Sioux","Safeway",203,87.29,"NorthEast"]
["2006-07-15","Tina","Fred Myer",173,88.23,"NorthEast"]
["2009-03-12","Tina","PCC",241,192.8,"East"]
["2010-01-07","Joy","Whole Foods",103,62.83,"MidWest"]
["2007-07-18","Chin","Fred Myer",206,127.72,"West"]
["2009-06-12","Tom","Coop",156,82.68,"East"]
["2009-06-12","Tom","Safeway",123,76.260000000000005,"NorthWest"]
["2008-08-10","Chin","PCC",1392,737.76,"West"]
["2007-02-01","Tina","PCC",722,505.4,"West"]
["2007-11-08","Tina","PCC",68,34,"West"]
["2007-08-11","Sioux","PCC",183,111.63,"West"]
["2005-08-10","Tina","Fred Myer",214,169.06,"East"]
["2007-07-30","Joy","PCC",154,100.1,"NorthWest"]
["2007-11-19","Joy","Safeway",52,21.84,"West"]
["2008-11-08","Joy","Coop",175,77,"East"]
["2008-03-26","Sioux","Coop",194,139.68,"NorthEast"]
["2009-04-08","Tom","Safeway",121,62.92,"NorthWest"]
["2007-10-25","Tom","Safeway",1720,1032,"West"]
["2008-11-08","Tina","Fred Myer",128,58.88,"East"]
["2010-01-13","Tom","Fred Myer",178,90.78,"MidWest"]
["2007-01-20","Chin","Fred Myer",152,91.2,"NorthWest"]
["2006-01-04","Tina","Safeway",50,34,"MidWest"]
["2007-04-29","Chin","Coop",159,71.55,"NorthWest"]
["2008-12-29","Tom","Coop",70,53.2,"West"]
["2005-11-19","Tom","Fred Myer",216,157.68,"MidWest"]
["2008-05-03","Sioux","PCC",631,448.01,"NorthEast"]
["2006-08-24","Tom","Safeway",235,159.80000000000001,"NorthEast"]
["2009-08-14","Tom","Fred Myer",1296,544.32000000000005,"East"]
["2008-12-06","Tina","Coop",90,63.9,"MidWest"]
["2010-06-15","Joy","Fred Myer",142,96.56,"East"]
["2008-12-20","Joy","Whole Foods",72,50.4,"West"]
["2006-09-01","Joy","PCC",142,96.56,"West"]
["2007-02-23","Joy","Safeway",244,107.36,"NorthWest"]
["2008-10-28","Tom","Whole Foods",63,32.76,"East"]
["2008-06-28","Tina","PCC",119,74.97,"West"]
["2010-06-13","Tom","PCC",61,44.53,"MidWest"]
["2006-11-30","Sioux","Fred Myer",234,170.82,"NorthWest"]
[{"$f":"RANDBETWEEN(38500,TODAY())","v":"2009-12-31"},{"$f":"CHOOSE(RANDBETWEEN(1,5),\"Sioux\",\"Chin\",\"Tina\",\"Joy\",\"Tom\")","v":"Sioux"},{"$f":"CHOOSE(RANDBETWEEN(1,5),\"PCC\",\"Whole Foods\",\"Safeway\",\"Fred Myer\",\"Coop\")","v":"Whole Foods"},{"$f":"IF(MOD(ROW(),17)=0,RANDBETWEEN(500,1250),IF(MOD(ROW(),10)=0,RANDBETWEEN(1000,2000),RANDBETWEEN(50,250)))","v":1411},{"$f":"D80*RANDBETWEEN(40,80)/100","v":987.7},{"$f":"CHOOSE(RANDBETWEEN(1,5),\"West\",\"NorthWest\",\"MidWest\",\"NorthEast\",\"East\")","v":"MidWest"}]
["2008-01-13","Joy","Whole Foods",100,77,"MidWest"]
["2007-02-26","Chin","PCC",101,60.6,"East"]
["2010-04-23","Tina","Coop",198,126.72,"East"]
["2006-02-07","Chin","Fred Myer",231,94.71,"NorthEast"]
["2007-09-05","Sioux","PCC",542,314.36,"NorthEast"]
["2006-11-07","Joy","Whole Foods",163,118.99,"NorthWest"]
["2008-05-02","Sioux","Fred Myer",178,110.36,"West"]
["2006-01-10","Tina","Fred Myer",130,85.8,"East"]
["2007-09-25","Tina","Coop",152,62.32,"MidWest"]
["2008-10-08","Chin","Fred Myer",1067,778.91,"MidWest"]
["2005-09-27","Chin","PCC",80,57.6,"NorthWest"]
["2009-08-10","Tina","Fred Myer",173,95.15,"West"]
["2007-08-07","Chin","Fred Myer",120,51.6,"NorthEast"]
["2009-09-21","Joy","Coop",178,99.68,"NorthEast"]
["2008-11-01","Sioux","PCC",197,122.14,"MidWest"]
["2007-08-18","Chin","Coop",250,147.5,"NorthWest"]
["2010-01-18","Tom","Fred Myer",175,92.75,"East"]
["2010-01-02","Sioux","PCC",170,117.3,"West"]
["2005-08-14","Tom","Whole Foods",198,122.76,"NorthWest"]
["2007-04-30","Tina","Whole Foods",1602,1185.48,"East"]
["2009-06-11","Chin","Fred Myer",119,67.83,"NorthEast"]
["2008-11-26","Tom","Coop",1014,436.02,"West"]
["2006-08-24","Chin","PCC",202,84.84,"NorthEast"]
["2006-03-17","Tom","Whole Foods",87,51.33,"NorthEast"]
["2007-07-23","Chin","Fred Myer",134,97.82,"East"]
["2007-01-30","Chin","Fred Myer",186,96.72,"MidWest"]
["2007-12-10","Joy","PCC",139,65.33,"NorthEast"]
["2009-07-03","Chin","Fred Myer",113,58.76,"West"]
["2008-04-14","Joy","Whole Foods",210,86.1,"MidWest"]
["2009-06-10","Chin","Fred Myer",1775,1295.75,"MidWest"]
["2007-07-23","Joy","Whole Foods",146,71.540000000000006,"East"]
["2008-07-02","Sioux","Fred Myer",240,175.2,"MidWest"]
["2009-03-23","Sioux","PCC",123,70.11,"NorthEast"]
["2009-05-11","Sioux","Whole Foods",189,115.29,"West"]
["2006-06-21","Joy","Whole Foods",200,130,"West"]
["2009-02-19","Joy","Whole Foods",157,103.62,"MidWest"]
["2007-01-23","Sioux","PCC",247,163.02000000000001,"NorthEast"]
["2008-03-21","Tina","Whole Foods",56,41.44,"NorthEast"]
["2009-07-05","Joy","PCC",757,446.63,"West"]
["2010-05-03","Sioux","Coop",1790,930.8,"West"]
["2008-03-10","Chin","Fred Myer",88,43.12,"NorthEast"]
["2006-11-10","Chin","Fred Myer",235,112.8,"East"]
["2008-03-03","Joy","Coop",68,37.4,"NorthWest"]
["2009-04-18","Tina","PCC",236,169.92,"NorthWest"]
["2005-07-18","Tina","Fred Myer",133,101.08,"MidWest"]
["2009-08-30","Joy","Safeway",136,81.599999999999994,"NorthEast"]
["2007-02-22","Tina","PCC",196,137.19999999999999,"NorthWest"]
["2009-01-16","Joy","Fred Myer",114,78.66,"NorthEast"]
["2009-09-23","Joy","PCC",97,62.08,"East"]
["2009-12-30","Tom","Coop",1286,720.16,"MidWest"]
["2006-12-22","Tina","Coop",136,103.36,"MidWest"]
["2010-02-17","Tina","Safeway",96,75.84,"West"]
["2008-09-14","Sioux","PCC",144,59.04,"NorthEast"]
["2006-08-08","Tom","PCC",167,93.52,"MidWest"]
["2005-12-18","Chin","Whole Foods",157,78.5,"MidWest"]
["2007-10-08","Joy","Fred Myer",888,488.4,"MidWest"]
["2008-02-06","Chin","Fred Myer",205,82,"East"]
["2006-04-20","Chin","Safeway",205,116.85,"West"]
["2006-06-20","Tina","Safeway",176,135.52000000000001,"NorthWest"]
["2009-01-18","Tina","PCC",1047,502.56,"MidWest"]
["2006-05-17","Chin","Whole Foods",98,43.12,"NorthEast"]
["2009-03-28","Tom","Safeway",203,119.77,"NorthWest"]
["2009-10-24","Sioux","Fred Myer",135,67.5,"NorthWest"]
[{"$f":"RANDBETWEEN(38500,TODAY())","v":"2006-12-02"},{"$f":"CHOOSE(RANDBETWEEN(1,5),\"Sioux\",\"Chin\",\"Tina\",\"Joy\",\"Tom\")","v":"Chin"},{"$f":"CHOOSE(RANDBETWEEN(1,5),\"PCC\",\"Whole Foods\",\"Safeway\",\"Fred Myer\",\"Coop\")","v":"Coop"},{"$f":"IF(MOD(ROW(),17)=0,RANDBETWEEN(500,1250),IF(MOD(ROW(),10)=0,RANDBETWEEN(1000,2000),RANDBETWEEN(50,250)))","v":115},{"$f":"D144*RANDBETWEEN(40,80)/100","v":82.8},{"$f":"CHOOSE(RANDBETWEEN(1,5),\"West\",\"NorthWest\",\"MidWest\",\"NorthEast\",\"East\")","v":"West"}]
["2007-08-06","Joy","PCC",141,66.27,"MidWest"]
["2009-09-24","Chin","Safeway",129,54.18,"NorthWest"]
["2009-08-15","Chin","PCC",163,66.83,"West"]
["2009-02-20","Tina","Coop",110,75.900000000000006,"East"]
["2006-01-11","Tom","Fred Myer",90,58.5,"West"]
["2009-02-28","Joy","PCC",1490,610.9,"NorthEast"]
["2007-07-17","Tom","Coop",80,42.4,"NorthEast"]
["2008-07-18","Joy","Safeway",191,110.78,"West"]
["2005-12-07","Tina","PCC",885,389.4,"NorthWest"]
["2008-03-05","Tina","PCC",146,116.8,"East"]
["2006-08-19","Joy","Whole Foods",172,129,"NorthWest"]
["2010-05-18","Tina","Coop",75,56.25,"NorthWest"]
["2008-04-24","Sioux","Safeway",96,68.16,"NorthWest"]
["2008-12-02","Sioux","Safeway",201,112.56,"NorthWest"]
["2007-08-30","Sioux","Whole Foods",201,90.45,"NorthWest"]
["2008-02-28","Chin","Safeway",1274,522.34,"West"]
["2007-03-15","Tina","Whole Foods",113,61.02,"MidWest"]
["2010-05-26","Tina","Whole Foods",54,30.24,"MidWest"]
["2007-05-23","Sioux","Whole Foods",213,134.19,"NorthWest"]
["2010-03-17","Sioux","Whole Foods",162,115.02,"NorthWest"]
["2007-03-18","Tom","Whole Foods",147,113.19,"NorthWest"]
["2009-02-13","Sioux","Fred Myer",62,41.54,"East"]
["2005-07-23","Tina","Safeway",244,141.52000000000001,"NorthEast"]
["2009-11-13","Sioux","Coop",50,25.5,"East"]
["2007-04-26","Tina","Coop",111,69.930000000000007,"MidWest"]
["2008-03-03","Sioux","Safeway",627,307.23,"MidWest"]
["2007-01-07","Tina","Coop",163,120.62,"East"]
["2005-11-09","Tom","Fred Myer",193,96.5,"NorthWest"]
["2009-12-22","Sioux","PCC",177,107.97,"NorthWest"]
["2008-03-28","Joy","PCC",70,55.3,"West"]
["2009-04-22","Sioux","Safeway",234,177.84,"NorthEast"]
["2005-07-02","Chin","Fred Myer",54,41.04,"NorthWest"]
["2006-04-23","Sioux","Whole Foods",246,174.66,"NorthWest"]
["2005-06-28","Tom","Whole Foods",225,103.5,"NorthEast"]
["2005-12-15","Sioux","Whole Foods",85,34,"East"]
["2006-04-30","Tina","Fred Myer",1790,1306.7,"NorthEast"]
["2009-12-31","Sioux","Whole Foods",200,138,"NorthEast"]
["2008-05-03","Chin","Fred Myer",63,45.36,"West"]
["2007-06-24","Joy","Coop",124,53.32,"West"]
["2006-09-26","Joy","PCC",167,118.57,"East"]
["2010-04-02","Joy","Fred Myer",240,182.4,"West"]
["2010-04-24","Sioux","Whole Foods",172,108.36,"East"]
["2006-08-18","Joy","Safeway",849,551.85,"East"]
["2005-06-16","Chin","Fred Myer",207,124.2,"West"]
["2008-01-02","Tina","PCC",144,60.48,"NorthWest"]
["2006-05-07","Tom","PCC",1396,1033.04,"NorthWest"]
["2006-11-03","Tom","Fred Myer",215,103.2,"West"]
["2006-05-27","Tom","PCC",242,174.24,"West"]
["2007-01-23","Chin","Coop",150,84,"MidWest"]
["2005-06-24","Tom","PCC",72,51.84,"MidWest"]
["2008-06-19","Sioux","Safeway",231,133.97999999999999,"West"]
["2006-09-29","Sioux","Whole Foods",138,91.08,"NorthEast"]
["2009-02-19","Tom","Coop",168,102.48,"NorthWest"]
["2008-05-26","Tina","Safeway",234,166.14,"MidWest"]
["2007-11-01","Chin","Whole Foods",89,40.94,"MidWest"]
["2009-04-30","Chin","PCC",1476,723.24,"East"]
["2007-12-04","Joy","Whole Foods",238,159.46,"MidWest"]
["2007-08-24","Tom","Whole Foods",73,43.07,"West"]
["2008-03-01","Tom","Safeway",216,151.19999999999999,"MidWest"]
["2007-04-29","Sioux","Coop",1180,861.4,"NorthWest"]
["2005-12-14","Tina","Fred Myer",150,84,"MidWest"]
["2008-08-24","Tina","Fred Myer",89,56.96,"West"]
["2009-05-18","Chin","PCC",110,47.3,"NorthEast"]
[{"$f":"RANDBETWEEN(38500,TODAY())","v":"2007-07-12"},{"$f":"CHOOSE(RANDBETWEEN(1,5),\"Sioux\",\"Chin\",\"Tina\",\"Joy\",\"Tom\")","v":"Sioux"},{"$f":"CHOOSE(RANDBETWEEN(1,5),\"PCC\",\"Whole Foods\",\"Safeway\",\"Fred Myer\",\"Coop\")","v":"Safeway"},{"$f":"IF(MOD(ROW(),17)=0,RANDBETWEEN(500,1250),IF(MOD(ROW(),10)=0,RANDBETWEEN(1000,2000),RANDBETWEEN(50,250)))","v":154},{"$f":"D208*RANDBETWEEN(40,80)/100","v":78.540000000000006},{"$f":"CHOOSE(RANDBETWEEN(1,5),\"West\",\"NorthWest\",\"MidWest\",\"NorthEast\",\"East\")","v":"NorthEast"}]
["2007-06-13","Tom","Whole Foods",228,104.88,"NorthEast"]
["2006-04-08","Chin","Safeway",1542,1033.1400000000001,"NorthWest"]
["2009-09-26","Tom","Whole Foods",108,76.680000000000007,"West"]
["2006-08-08","Tom","Coop",55,25.3,"NorthEast"]
["2009-03-15","Tina","Whole Foods",249,99.6,"NorthEast"]
["2005-11-23","Tom","PCC",82,36.08,"West"]
["2010-06-03","Tina","Fred Myer",88,51.04,"NorthWest"]
["2005-06-08","Chin","Coop",88,60.72,"East"]
["2009-03-03","Chin","PCC",249,154.38,"MidWest"]
["2009-08-18","Chin","Fred Myer",84,36.119999999999997,"West"]
["2008-10-26","Chin","Whole Foods",224,154.56,"NorthWest"]
["2007-12-29","Tina","Whole Foods",1000,550,"NorthWest"]
["2010-04-26","Sioux","PCC",1047,481.62,"MidWest"]
["2006-10-24","Tom","PCC",119,65.45,"East"]
["2008-09-05","Chin","Whole Foods",79,50.56,"MidWest"]
["2005-11-27","Joy","PCC",230,103.5,"East"]
["2008-07-29","Chin","Safeway",209,140.03,"MidWest"]
["2009-12-12","Sioux","Safeway",161,115.92,"East"]
["2010-01-01","Sioux","Coop",183,75.03,"West"]
["2005-11-15","Chin","Safeway",187,112.2,"NorthEast"]
["2005-08-16","Joy","PCC",217,132.37,"MidWest"]
["2007-10-02","Joy","Coop",1226,956.28,"East"]
["2009-09-02","Joy","Safeway",71,56.09,"NorthEast"]
["2009-03-25","Tom","PCC",166,102.92,"West"]
["2008-12-22","Chin","Coop",203,156.31,"East"]
["2007-02-28","Tina","PCC",117,56.16,"NorthEast"]
["2009-12-02","Sioux","PCC",71,42.6,"MidWest"]
["2009-03-07","Tina","Whole Foods",224,109.76,"NorthWest"]
["2006-11-02","Sioux","Safeway",225,94.5,"MidWest"]
["2008-10-15","Tom","PCC",1097,844.69,"East"]
["2009-10-13","Joy","Safeway",148,115.44,"East"]
["2006-05-24","Tom","PCC",1839,956.28,"East"]
["2005-11-08","Joy","Coop",178,129.94,"MidWest"]
["2008-11-28","Tom","Whole Foods",108,56.16,"West"]
["2008-11-12","Chin","Coop",104,75.92,"East"]
["2007-09-04","Tina","Safeway",192,126.72,"NorthWest"]
["2008-09-02","Sioux","Safeway",190,125.4,"NorthWest"]
["2006-12-04","Chin","PCC",70,28.7,"West"]
["2009-10-11","Tina","PCC",138,82.8,"West"]
["2006-02-13","Sioux","Fred Myer",131,56.33,"MidWest"]
["2007-08-03","Tina","Whole Foods",220,94.6,"NorthEast"]
["2007-05-10","Tom","Coop",1217,742.37,"NorthWest"]
["2007-09-22","Chin","Safeway",124,68.2,"MidWest"]
["2007-03-19","Chin","Safeway",138,96.6,"NorthEast"]
["2008-09-22","Chin","Whole Foods",239,129.06,"NorthWest"]
["2006-02-19","Chin","PCC",82,41.82,"West"]
["2008-04-05","Tina","Coop",757,507.19,"East"]
["2009-04-06","Chin","Coop",122,81.739999999999995,"MidWest"]
["2006-06-29","Tom","Safeway",75,33.75,"East"]
["2006-10-31","Tom","Fred Myer",220,165,"East"]
["2009-06-19","Joy","PCC",208,133.12,"East"]
["2007-04-30","Chin","Whole Foods",1513,862.41,"West"]
["2008-03-06","Sioux","Whole Foods",72,34.56,"MidWest"]
["2006-11-15","Chin","Fred Myer",141,74.73,"West"]
["2006-01-15","Sioux","Fred Myer",152,86.64,"MidWest"]
["2006-01-12","Tina","Coop",123,75.03,"NorthEast"]
["2009-11-08","Tina","Safeway",149,81.95,"East"]
["2006-07-31","Tom","Coop",194,85.36,"East"]
["2008-10-17","Tom","PCC",99,68.31,"East"]
["2005-09-21","Tom","Fred Myer",93,40.92,"NorthWest"]
["2008-06-09","Tom","Whole Foods",214,117.7,"NorthWest"]
["2008-07-01","Tom","PCC",1914,1205.82,"West"]
["2008-04-23","Sioux","Whole Foods",83,51.46,"MidWest"]
[{"$f":"RANDBETWEEN(38500,TODAY())","v":"2008-07-31"},{"$f":"CHOOSE(RANDBETWEEN(1,5),\"Sioux\",\"Chin\",\"Tina\",\"Joy\",\"Tom\")","v":"Chin"},{"$f":"CHOOSE(RANDBETWEEN(1,5),\"PCC\",\"Whole Foods\",\"Safeway\",\"Fred Myer\",\"Coop\")","v":"Coop"},{"$f":"IF(MOD(ROW(),17)=0,RANDBETWEEN(500,1250),IF(MOD(ROW(),10)=0,RANDBETWEEN(1000,2000),RANDBETWEEN(50,250)))","v":890},{"$f":"D272*RANDBETWEEN(40,80)/100","v":658.6},{"$f":"CHOOSE(RANDBETWEEN(1,5),\"West\",\"NorthWest\",\"MidWest\",\"NorthEast\",\"East\")","v":"MidWest"}]
["2006-02-28","Tom","Safeway",79,51.35,"MidWest"]
["2005-07-10","Joy","PCC",168,114.24,"NorthEast"]
["2008-08-30","Sioux","Coop",221,145.86000000000001,"West"]
["2006-03-03","Tina","Safeway",99,78.209999999999994,"West"]
["2006-12-19","Tina","Whole Foods",157,108.33,"East"]
["2006-02-01","Chin","Coop",165,87.45,"MidWest"]
["2005-12-15","Tina","Whole Foods",74,48.84,"NorthWest"]
["2006-10-05","Joy","PCC",1235,765.7,"NorthWest"]
["2006-07-04","Sioux","Fred Myer",59,30.68,"West"]
["2005-12-23","Tom","Fred Myer",146,109.5,"NorthWest"]
["2009-06-14","Tina","Safeway",203,142.1,"MidWest"]
["2007-07-24","Chin","Coop",196,127.4,"NorthEast"]
["2006-07-08","Tom","PCC",150,103.5,"MidWest"]
["2006-09-05","Sioux","Fred Myer",124,70.680000000000007,"NorthWest"]
["2007-03-14","Tom","Safeway",223,115.96,"West"]
["2008-12-27","Sioux","Safeway",85,58.65,"NorthWest"]
["2009-04-28","Joy","Safeway",902,496.1,"East"]
["2006-11-09","Chin","Coop",1743,1376.97,"MidWest"]
["2010-05-16","Tom","PCC",65,30.55,"East"]
["2007-10-07","Sioux","Fred Myer",213,170.4,"West"]
["2007-12-04","Tina","Safeway",61,34.770000000000003,"MidWest"]
["2006-05-16","Chin","Coop",157,114.61,"NorthWest"]
["2006-07-20","Tom","PCC",106,58.3,"West"]
["2007-06-28","Tom","PCC",144,83.52,"MidWest"]
["2008-09-16","Tina","PCC",187,110.33,"NorthWest"]
["2005-07-20","Tom","Whole Foods",216,166.32,"West"]
["2008-10-09","Sioux","Safeway",63,34.65,"West"]
["2007-12-13","Chin","PCC",1877,1069.8900000000001,"NorthEast"]
["2007-01-31","Tom","Fred Myer",138,55.2,"East"]
["2010-05-12","Joy","Coop",143,94.38,"MidWest"]
["2005-10-03","Sioux","Fred Myer",101,48.48,"West"]
["2008-02-27","Tina","PCC",174,97.44,"West"]
["2005-07-13","Tom","PCC",130,68.900000000000006,"NorthWest"]
["2006-10-26","Tom","Whole Foods",801,512.64,"MidWest"]
["2006-11-21","Chin","Whole Foods",95,71.25,"NorthEast"]
["2006-07-06","Chin","PCC",145,66.7,"NorthEast"]
["2006-04-01","Chin","PCC",54,43.2,"West"]
["2009-10-24","Tina","Whole Foods",1173,680.34,"East"]
["2010-01-27","Tom","Coop",181,114.03,"West"]
["2009-03-16","Tom","Coop",194,141.62,"East"]
["2008-02-20","Sioux","Coop",242,118.58,"NorthWest"]
["2009-02-19","Sioux","PCC",234,168.48,"NorthWest"]
["2008-12-05","Sioux","Coop",96,55.68,"NorthEast"]
["2009-10-11","Sioux","Fred Myer",224,91.84,"East"]
["2010-03-01","Sioux","Fred Myer",56,43.68,"MidWest"]
["2010-02-05","Tina","Coop",77,55.44,"West"]
["2006-07-09","Chin","Coop",193,125.45,"NorthEast"]
["2009-08-20","Tina","Whole Foods",1459,1123.43,"NorthEast"]
["2007-06-04","Sioux","Coop",205,94.3,"NorthEast"]
["2006-04-25","Chin","Whole Foods",134,101.84,"NorthWest"]
["2009-06-02","Sioux","Whole Foods",589,394.63,"East"]
["2005-06-11","Chin","Whole Foods",159,116.07,"MidWest"]
["2010-02-08","Chin","PCC",201,98.49,"MidWest"]
["2007-11-07","Chin","PCC",107,75.97,"NorthWest"]
["2007-12-07","Joy","Fred Myer",202,141.4,"East"]
["2007-01-31","Tom","Safeway",202,86.86,"West"]
["2007-03-04","Joy","Coop",195,107.25,"East"]
["2008-04-14","Sioux","Whole Foods",1377,1060.29,"NorthEast"]
["2009-04-14","Tom","Fred Myer",170,90.1,"East"]
["2007-10-01","Chin","PCC",67,52.26,"NorthEast"]
["2008-03-02","Tina","PCC",131,102.18,"MidWest"]
["2010-03-29","Tom","Fred Myer",147,61.74,"MidWest"]
["2008-05-17","Tom","PCC",129,73.53,"West"]
[{"$f":"RANDBETWEEN(38500,TODAY())","v":"2006-02-11"},{"$f":"CHOOSE(RANDBETWEEN(1,5),\"Sioux\",\"Chin\",\"Tina\",\"Joy\",\"Tom\")","v":"Tom"},{"$f":"CHOOSE(RANDBETWEEN(1,5),\"PCC\",\"Whole Foods\",\"Safeway\",\"Fred Myer\",\"Coop\")","v":"Whole Foods"},{"$f":"IF(MOD(ROW(),17)=0,RANDBETWEEN(500,1250),IF(MOD(ROW(),10)=0,RANDBETWEEN(1000,2000),RANDBETWEEN(50,250)))","v":140},{"$f":"D336*RANDBETWEEN(40,80)/100","v":91},{"$f":"CHOOSE(RANDBETWEEN(1,5),\"West\",\"NorthWest\",\"MidWest\",\"NorthEast\",\"East\")","v":"NorthEast"}]
["2006-01-23","Tina","Safeway",128,66.56,"West"]
["2009-08-06","Tom","Coop",117,73.709999999999994,"MidWest"]
["2007-10-31","Joy","Fred Myer",203,160.37,"NorthWest"]
["2006-11-27","Tom","Safeway",1212,787.8,"West"]
["2010-05-19","Tina","Safeway",221,150.28,"East"]
["2010-01-09","Tina","Coop",56,24.64,"NorthWest"]
["2006-01-10","Joy","Safeway",105,49.35,"NorthWest"]
["2005-12-07","Chin","Safeway",85,51.85,"NorthEast"]
["2006-07-19","Tom","Fred Myer",96,75.84,"NorthEast"]
["2007-12-04","Chin","Safeway",69,39.33,"NorthWest"]
["2008-04-27","Joy","Fred Myer",211,132.93,"West"]
["2008-11-14","Tom","PCC",99,39.6,"NorthWest"]
["2008-04-10","Tom","PCC",229,141.97999999999999,"NorthEast"]
["2006-06-03","Chin","Whole Foods",1742,1149.72,"NorthWest"]
["2007-02-09","Tina","Coop",175,80.5,"West"]
["2009-05-19","Tina","Safeway",198,89.1,"MidWest"]
["2009-03-13","Tom","Safeway",51,24.99,"East"]
["2007-02-09","Tom","Fred Myer",243,179.82,"MidWest"]
["2009-02-02","Sioux","Coop",198,122.76,"West"]
["2007-08-02","Tina","Fred Myer",50,35,"West"]
["2006-08-26","Joy","Safeway",571,348.31,"MidWest"]
["2007-01-30","Sioux","Safeway",84,49.56,"East"]
["2009-02-27","Sioux","Coop",138,70.38,"West"]
["2006-03-10","Tom","Safeway",1018,763.5,"East"]
["2010-04-22","Joy","Whole Foods",51,22.95,"MidWest"]
["2006-11-25","Joy","Safeway",82,39.36,"NorthWest"]
["2008-11-16","Tom","Fred Myer",190,138.69999999999999,"East"]
["2008-04-22","Sioux","Whole Foods",196,123.48,"MidWest"]
["2009-04-16","Sioux","Fred Myer",131,91.7,"NorthWest"]
["2005-08-08","Tina","Safeway",84,49.56,"MidWest"]
["2007-07-14","Chin","PCC",208,166.4,"MidWest"]
["2005-12-19","Sioux","Coop",91,44.59,"NorthEast"]
["2009-08-23","Tina","Coop",152,79.040000000000006,"NorthEast"]
["2008-02-14","Sioux","Coop",1000,400,"MidWest"]
["2006-06-29","Tina","Safeway",93,71.61,"NorthEast"]
["2005-08-07","Chin","Whole Foods",216,146.88,"NorthWest"]
["2008-09-04","Joy","Fred Myer",246,130.38,"NorthEast"]
["2008-01-13","Joy","Safeway",1212,545.4,"MidWest"]
["2009-09-02","Tina","Whole Foods",64,38.4,"NorthWest"]
["2006-03-07","Tina","Safeway",61,43.31,"West"]
["2006-09-27","Sioux","Coop",101,67.67,"West"]
["2007-09-16","Chin","Coop",133,79.8,"MidWest"]
["2009-11-15","Chin","Safeway",175,120.75,"NorthEast"]
["2009-02-09","Joy","Fred Myer",1492,925.04,"NorthWest"]
["2007-08-20","Tom","Safeway",181,115.84,"MidWest"]
["2010-01-19","Joy","PCC",88,68.64,"West"]
["2009-03-07","Chin","Safeway",133,70.489999999999995,"West"]
["2007-04-18","Chin","Safeway",168,107.52,"MidWest"]
["2006-03-02","Joy","Coop",249,126.99,"NorthEast"]
["2008-05-16","Chin","Coop",218,152.6,"MidWest"]
["2007-09-12","Sioux","Whole Foods",50,22,"West"]
["2009-09-13","Chin","PCC",99,64.349999999999994,"West"]
["2009-01-27","Sioux","Safeway",53,26.5,"NorthWest"]
["2005-08-14","Sioux","Safeway",1324,1059.2,"East"]
["2010-02-16","Sioux","Coop",795,596.25,"NorthEast"]
["2005-08-20","Tom","Whole Foods",213,138.44999999999999,"East"]
["2007-12-27","Joy","Coop",158,123.24,"NorthWest"]
["2010-03-15","Tina","Safeway",165,95.7,"East"]
["2009-09-08","Tom","Coop",99,41.58,"West"]
["2005-11-13","Joy","PCC",50,30,"East"]
["2008-12-23","Tom","Whole Foods",148,65.12,"MidWest"]
["2008-04-20","Chin","Whole Foods",136,106.08,"NorthWest"]
["2006-12-04","Tom","Fred Myer",191,76.400000000000006,"NorthWest"]
[{"$f":"RANDBETWEEN(38500,TODAY())","v":"2009-11-15"},{"$f":"CHOOSE(RANDBETWEEN(1,5),\"Sioux\",\"Chin\",\"Tina\",\"Joy\",\"Tom\")","v":"Tom"},{"$f":"CHOOSE(RANDBETWEEN(1,5),\"PCC\",\"Whole Foods\",\"Safeway\",\"Fred Myer\",\"Coop\")","v":"Whole Foods"},{"$f":"IF(MOD(ROW(),17)=0,RANDBETWEEN(500,1250),IF(MOD(ROW(),10)=0,RANDBETWEEN(1000,2000),RANDBETWEEN(50,250)))","v":1851},{"$f":"D400*RANDBETWEEN(40,80)/100","v":814.44},{"$f":"CHOOSE(RANDBETWEEN(1,5),\"West\",\"NorthWest\",\"MidWest\",\"NorthEast\",\"East\")","v":"West"}]
["2005-06-15","Tom","Coop",213,159.75,"NorthEast"]
["2008-07-19","Chin","Safeway",77,61.6,"NorthEast"]
["2007-11-15","Chin","Whole Foods",223,167.25,"West"]
["2009-02-24","Tom","PCC",154,117.04,"MidWest"]
["2006-06-26","Sioux","Fred Myer",97,65.959999999999994,"NorthEast"]
["2007-10-11","Sioux","Fred Myer",134,101.84,"NorthEast"]
["2006-11-08","Joy","PCC",179,110.98,"MidWest"]
["2009-05-30","Joy","Safeway",1105,740.35,"West"]
["2007-06-04","Tina","Safeway",236,96.76,"West"]
["2008-05-28","Sioux","Fred Myer",1712,684.8,"MidWest"]
["2005-08-12","Tom","Whole Foods",209,91.96,"NorthWest"]
["2006-03-20","Sioux","Coop",213,129.93,"NorthEast"]
["2009-11-23","Joy","Safeway",95,55.1,"NorthEast"]
["2005-12-26","Chin","Coop",154,118.58,"East"]
["2006-12-25","Chin","PCC",199,105.47,"MidWest"]
["2006-04-05","Chin","Safeway",103,42.23,"NorthEast"]
["2008-02-24","Sioux","Whole Foods",156,74.88,"West"]
["2008-06-19","Tom","Whole Foods",138,84.18,"MidWest"]
["2007-02-16","Sioux","PCC",232,129.91999999999999,"East"]
["2008-01-10","Joy","Whole Foods",1976,810.16,"NorthWest"]
["2008-02-27","Joy","Fred Myer",80,59.2,"NorthWest"]
["2005-10-28","Sioux","Coop",188,120.32,"NorthWest"]
["2005-06-26","Sioux","Fred Myer",120,87.6,"NorthEast"]
["2009-01-15","Sioux","Whole Foods",153,82.62,"West"]
["2008-08-12","Tom","Coop",848,534.24,"West"]
["2010-02-10","Sioux","Whole Foods",85,62.9,"NorthWest"]
["2006-10-23","Chin","Whole Foods",194,120.28,"West"]
["2010-04-19","Tina","Coop",92,65.319999999999993,"NorthWest"]
["2007-12-13","Sioux","Fred Myer",218,126.44,"MidWest"]
["2009-03-18","Chin","Fred Myer",1183,626.99,"NorthWest"]
["2005-09-17","Sioux","Whole Foods",93,65.099999999999994,"NorthWest"]
["2009-04-24","Tina","Fred Myer",215,105.35,"NorthWest"]
["2006-05-18","Tina","Safeway",72,34.56,"NorthEast"]
["2007-08-06","Tom","Coop",88,64.239999999999995,"NorthWest"]
["2006-02-14","Sioux","PCC",183,89.67,"West"]
["2007-11-16","Joy","Whole Foods",194,141.62,"NorthWest"]
["2009-03-14","Chin","Fred Myer",218,150.41999999999999,"NorthEast"]
["2005-12-11","Sioux","Coop",234,142.74,"NorthEast"]
["2006-03-28","Tom","Coop",200,110,"West"]
["2006-04-05","Sioux","PCC",1926,1425.24,"NorthEast"]
["2008-01-21","Tom","Safeway",203,121.8,"MidWest"]
["2010-04-02","Tom","Safeway",643,315.07,"MidWest"]
["2006-10-27","Tom","Whole Foods",201,110.55,"NorthWest"]
["2010-03-04","Sioux","PCC",187,143.99,"MidWest"]
["2009-10-18","Joy","PCC",175,106.75,"NorthEast"]
["2007-11-04","Tina","PCC",196,94.08,"MidWest"]
["2007-02-20","Tom","PCC",229,183.2,"West"]
["2006-11-27","Joy","Safeway",233,114.17,"NorthWest"]
["2008-03-02","Sioux","Safeway",190,104.5,"NorthWest"]
["2010-01-15","Tom","Whole Foods",1851,1110.5999999999999,"West"]
["2005-09-07","Tom","Whole Foods",123,88.56,"West"]
["2006-12-09","Tina","PCC",160,107.2,"MidWest"]
["2007-08-16","Joy","PCC",111,75.48,"NorthEast"]
["2010-04-03","Sioux","PCC",75,39,"MidWest"]
["2006-10-26","Chin","Fred Myer",97,57.23,"West"]
["2007-08-24","Sioux","Fred Myer",232,111.36,"NorthEast"]
["2005-11-13","Chin","Fred Myer",81,46.98,"West"]
["2006-03-10","Joy","Whole Foods",235,110.45,"MidWest"]
["2005-09-21","Sioux","PCC",973,661.64,"NorthEast"]
["2009-08-28","Chin","PCC",1619,1246.6300000000001,"NorthEast"]
["2006-09-16","Chin","Safeway",130,75.400000000000006,"East"]
["2009-12-15","Chin","Fred Myer",133,77.14,"East"]
["2008-11-11","Sioux","Safeway",194,87.3,"NorthWest"]
[{"$f":"RANDBETWEEN(38500,TODAY())","v":"2009-10-18"},{"$f":"CHOOSE(RANDBETWEEN(1,5),\"Sioux\",\"Chin\",\"Tina\",\"Joy\",\"Tom\")","v":"Tom"},{"$f":"CHOOSE(RANDBETWEEN(1,5),\"PCC\",\"Whole Foods\",\"Safeway\",\"Fred Myer\",\"Coop\")","v":"Whole Foods"},{"$f":"IF(MOD(ROW(),17)=0,RANDBETWEEN(500,1250),IF(MOD(ROW(),10)=0,RANDBETWEEN(1000,2000),RANDBETWEEN(50,250)))","v":153},{"$f":"D464*RANDBETWEEN(40,80)/100","v":119.34},{"$f":"CHOOSE(RANDBETWEEN(1,5),\"West\",\"NorthWest\",\"MidWest\",\"NorthEast\",\"East\")","v":"East"}]
["2006-05-07","Tom","PCC",220,129.80000000000001,"NorthWest"]
["2008-10-07","Sioux","Coop",192,124.8,"MidWest"]
["2007-04-24","Chin","Fred Myer",184,136.16,"NorthEast"]
["2007-07-11","Tina","Whole Foods",73,49.64,"East"]
["2008-12-17","Tina","Safeway",53,29.68,"West"]
["2009-04-25","Chin","PCC",1933,1063.1500000000001,"East"]
["2010-03-22","Chin","Coop",82,63.96,"NorthEast"]
["2007-07-13","Joy","Whole Foods",111,61.05,"NorthWest"]
["2009-10-12","Joy","Coop",58,44.66,"NorthEast"]
["2009-10-27","Tom","PCC",112,75.040000000000006,"NorthWest"]
["2009-04-19","Chin","Coop",238,154.69999999999999,"NorthEast"]
["2007-04-08","Joy","Coop",745,447,"East"]
["2008-05-15","Chin","PCC",180,127.8,"NorthWest"]
["2006-08-28","Joy","Coop",152,92.72,"NorthEast"]
["2006-03-07","Sioux","Fred Myer",204,150.96,"NorthEast"]
["2006-11-26","Tom","Fred Myer",1705,716.1,"MidWest"]
["2006-05-19","Sioux","Coop",60,42.6,"NorthEast"]
["2009-09-18","Chin","Coop",240,139.19999999999999,"NorthEast"]
["2010-04-21","Tom","Safeway",185,98.05,"West"]
["2008-08-16","Chin","Whole Foods",105,53.55,"West"]
["2009-01-14","Chin","Fred Myer",208,131.04,"West"]
["2006-07-19","Tina","Coop",161,119.14,"NorthWest"]
["2010-05-13","Joy","Whole Foods",109,85.02,"MidWest"]
["2009-01-23","Tina","Safeway",239,148.18,"NorthWest"]
["2006-08-15","Tina","Coop",193,123.52,"West"]
["2010-01-25","Tina","PCC",1273,801.99,"West"]
["2010-03-21","Tom","Whole Foods",114,86.64,"West"]
["2006-06-19","Sioux","Fred Myer",53,30.21,"MidWest"]
["2008-05-18","Sioux","Safeway",811,413.61,"NorthEast"]
["2009-06-03","Chin","Safeway",144,57.6,"NorthEast"]
["2008-02-03","Tina","Whole Foods",185,81.400000000000006,"MidWest"]
["2005-05-31","Tina","Coop",101,44.44,"MidWest"]
["2010-02-18","Joy","Fred Myer",160,64,"NorthWest"]
["2008-02-15","Tom","Fred Myer",234,154.44,"West"]
["2006-01-17","Tom","PCC",244,119.56,"West"]
["2009-04-07","Tom","Whole Foods",1775,1331.25,"West"]
["2006-08-06","Tina","Fred Myer",161,99.82,"East"]
["2007-05-26","Tina","Fred Myer",197,135.93,"East"]
["2007-06-25","Tina","Whole Foods",50,29,"MidWest"]
["2006-12-22","Tina","Safeway",59,28.91,"MidWest"]
["2007-10-07","Sioux","Safeway",197,141.84,"West"]
["2008-08-16","Joy","Safeway",217,160.58000000000001,"NorthEast"]
["2006-07-09","Chin","PCC",244,117.12,"MidWest"]
["2009-07-23","Tina","PCC",173,115.91,"West"]
["2007-05-12","Sioux","Safeway",222,97.68,"West"]
["2008-08-10","Chin","Whole Foods",868,677.04,"NorthEast"]
["2008-09-16","Joy","PCC",213,155.49,"NorthWest"]
["2007-06-05","Chin","PCC",230,135.69999999999999,"NorthWest"]
["2005-09-04","Tina","Whole Foods",236,110.92,"NorthEast"]
["2008-10-18","Chin","PCC",236,99.12,"West"]
["2006-12-06","Sioux","Coop",185,112.85,"East"]
["2010-02-24","Joy","Safeway",173,89.96,"NorthEast"]
["2005-05-31","Tom","Whole Foods",114,57,"MidWest"]
["2010-04-05","Tom","Coop",199,83.58,"NorthEast"]
["2009-08-12","Sioux","PCC",78,47.58,"West"]
["2006-06-09","Tina","Whole Foods",1507,949.41,"NorthWest"]
["2008-05-22","Sioux","Safeway",61,38.43,"NorthEast"]
["2007-11-19","Chin","Fred Myer",240,110.4,"West"]
["2009-07-22","Tom","Safeway",89,56.96,"East"]
["2005-10-25","Joy","PCC",56,39.76,"West"]
["2008-04-29","Tom","Coop",89,51.62,"NorthEast"]
["2006-05-01","Sioux","Whole Foods",154,123.2,"MidWest"]
["2007-11-11","Sioux","Safeway",1188,748.44,"NorthEast"]
[{"$f":"RANDBETWEEN(38500,TODAY())","v":"2007-06-12"},{"$f":"CHOOSE(RANDBETWEEN(1,5),\"Sioux\",\"Chin\",\"Tina\",\"Joy\",\"Tom\")","v":"Tom"},{"$f":"CHOOSE(RANDBETWEEN(1,5),\"PCC\",\"Whole Foods\",\"Safeway\",\"Fred Myer\",\"Coop\")","v":"Safeway"},{"$f":"IF(MOD(ROW(),17)=0,RANDBETWEEN(500,1250),IF(MOD(ROW(),10)=0,RANDBETWEEN(1000,2000),RANDBETWEEN(50,250)))","v":185},{"$f":"D528*RANDBETWEEN(40,80)/100","v":88.8},{"$f":"CHOOSE(RANDBETWEEN(1,5),\"West\",\"NorthWest\",\"MidWest\",\"NorthEast\",\"East\")","v":"NorthWest"}]
["2008-10-02","Tina","Fred Myer",83,48.97,"NorthEast"]
["2010-02-25","Tina","Fred Myer",1506,1084.32,"NorthWest"]
["2007-10-27","Sioux","Whole Foods",65,27.95,"NorthWest"]
["2010-02-09","Sioux","Safeway",203,146.16,"NorthEast"]
["2009-03-24","Sioux","Safeway",172,134.16,"East"]
["2007-09-26","Tina","Coop",80,44,"East"]
["2008-10-04","Tina","Coop",51,20.399999999999999,"West"]
["2006-02-17","Tina","Fred Myer",124,95.48,"East"]
["2006-06-17","Tom","Fred Myer",115,67.849999999999994,"NorthEast"]
["2006-12-30","Sioux","Whole Foods",211,124.49,"East"]
["2005-12-12","Sioux","Safeway",246,115.62,"East"]
["2010-06-07","Tina","Coop",1983,1308.78,"West"]
["2007-09-04","Tom","Fred Myer",116,76.56,"West"]
["2009-09-11","Sioux","Fred Myer",124,66.959999999999994,"NorthEast"]
["2009-11-14","Tom","PCC",133,70.489999999999995,"West"]
["2009-08-18","Joy","Safeway",1214,619.14,"NorthEast"]
["2006-03-18","Joy","Coop",173,114.18,"East"]
["2006-02-14","Joy","Fred Myer",128,80.64,"East"]
["2007-02-05","Chin","PCC",55,27.5,"West"]
["2007-09-21","Sioux","Whole Foods",236,167.56,"NorthWest"]
["2008-09-02","Tom","Fred Myer",102,49.98,"NorthWest"]
["2007-05-20","Joy","Coop",1272,610.55999999999995,"NorthEast"]
["2006-08-22","Tina","PCC",134,64.319999999999993,"West"]
["2006-03-20","Tina","Coop",73,53.29,"MidWest"]
["2009-06-04","Tina","Coop",79,46.61,"East"]
["2007-03-29","Tom","Safeway",136,61.2,"NorthWest"]
["2009-03-11","Tina","PCC",117,93.6,"MidWest"]
["2009-02-12","Joy","Fred Myer",141,94.47,"West"]
["2008-03-28","Sioux","Safeway",85,68,"NorthWest"]
["2005-08-07","Joy","Coop",115,81.650000000000006,"NorthWest"]
["2008-07-24","Tom","Coop",149,107.28,"NorthEast"]
["2005-11-13","Sioux","PCC",1662,698.04,"East"]
["2005-08-15","Joy","Fred Myer",773,595.21,"East"]
["2005-10-30","Tom","PCC",198,158.4,"West"]
["2006-11-19","Joy","Safeway",113,59.89,"NorthWest"]
["2005-07-18","Tom","Coop",68,50.32,"East"]
["2007-10-07","Tina","Coop",97,69.84,"West"]
["2006-07-28","Sioux","Fred Myer",155,116.25,"West"]
["2007-07-24","Tina","PCC",175,122.5,"NorthWest"]
["2007-07-17","Tina","Coop",137,54.8,"NorthEast"]
["2006-05-03","Sioux","Safeway",202,139.38,"West"]
["2008-04-13","Joy","Coop",1274,687.96,"West"]
["2006-09-17","Tina","Coop",57,32.49,"NorthWest"]
["2005-12-07","Joy","Fred Myer",126,79.38,"NorthWest"]
["2007-10-17","Sioux","Fred Myer",90,52.2,"NorthWest"]
["2005-09-11","Tom","Safeway",152,98.8,"West"]
["2009-08-10","Sioux","PCC",59,28.32,"MidWest"]
["2006-07-29","Sioux","Fred Myer",179,123.51,"MidWest"]
["2006-06-12","Tina","Safeway",221,103.87,"NorthEast"]
["2007-04-30","Tom","Whole Foods",548,224.68,"East"]
["2007-02-17","Sioux","Fred Myer",192,84.48,"East"]
["2009-06-07","Tina","Coop",1276,931.48,"NorthEast"]
["2007-05-25","Chin","PCC",162,92.34,"MidWest"]
["2008-02-24","Chin","PCC",161,78.89,"East"]
["2006-04-25","Tina","Whole Foods",133,99.75,"NorthEast"]
["2007-04-07","Sioux","PCC",125,75,"NorthEast"]
["2008-05-17","Tina","Safeway",154,106.26,"MidWest"]
["2007-12-22","Joy","Safeway",243,145.80000000000001,"East"]
["2007-12-08","Tom","PCC",246,113.16,"East"]
["2009-08-27","Chin","Safeway",53,30.21,"West"]
["2007-08-12","Sioux","Whole Foods",79,34.76,"West"]
["2008-05-20","Joy","PCC",1650,1237.5,"NorthWest"]
["2007-01-07","Tom","Whole Foods",228,98.04,"NorthEast"]
[{"$f":"RANDBETWEEN(38500,TODAY())","v":"2006-12-17"},{"$f":"CHOOSE(RANDBETWEEN(1,5),\"Sioux\",\"Chin\",\"Tina\",\"Joy\",\"Tom\")","v":"Tina"},{"$f":"CHOOSE(RANDBETWEEN(1,5),\"PCC\",\"Whole Foods\",\"Safeway\",\"Fred Myer\",\"Coop\")","v":"Whole Foods"},{"$f":"IF(MOD(ROW(),17)=0,RANDBETWEEN(500,1250),IF(MOD(ROW(),10)=0,RANDBETWEEN(1000,2000),RANDBETWEEN(50,250)))","v":175},{"$f":"D592*RANDBETWEEN(40,80)/100","v":129.5},{"$f":"CHOOSE(RANDBETWEEN(1,5),\"West\",\"NorthWest\",\"MidWest\",\"NorthEast\",\"East\")","v":"MidWest"}]
["2005-11-17","Tina","Whole Foods",58,37.119999999999997,"East"]
["2007-08-01","Tom","PCC",227,115.77,"MidWest"]
["2006-02-08","Joy","Fred Myer",528,300.95999999999998,"NorthWest"]
["2006-04-09","Tom","Safeway",88,43.12,"NorthEast"]
["2005-12-22","Joy","PCC",75,54.75,"East"]
["2007-06-12","Tom","Fred Myer",66,39.6,"NorthEast"]
["2008-12-04","Sioux","Fred Myer",84,59.64,"West"]
["2006-05-13","Chin","Coop",1239,941.64,"East"]
["2005-12-13","Chin","PCC",109,67.58,"NorthWest"]
["2010-03-25","Tina","PCC",221,132.6,"East"]
["2006-05-31","Joy","Whole Foods",109,78.48,"NorthEast"]
["2008-04-10","Sioux","PCC",225,121.5,"NorthEast"]

{"sheet":"ScalesOfMeasurement","index":6,"n_rows":389,"n_cols":24,"rows_kept":389,"cut":false,"hidden":false,"merged":[]}
["Nominal","Categories or names are used. There is no order or rank to the categories. You count how many are in each category. You cannot calculate a mean (average)",null,null,null,null,"Ordinal","Categories or names are used. There is an order or rank to the categories, but you do not know the distance between each category. You count how many are in each category. You cannot calculate a mean (average)",null,null,null,null,"Interval",null,"The numeric data is ranked or ordered and has a fixed unit between each rank. Interval data is usually a scale such as scores on a test or temperature. Zero is just a point on the scale.",null,null,null,null,null,null,null,"Ratio","The numeric data is ranked or ordered and has a fixed unit between each rank and zero means that nothing exists"]
["Categorical Data. Categorical Variable is non-numeric (counting the number of observations in each category).",null,null,null,null,null,null,null,null,null,null,null,"Quantitative Data. Quantitative Variable is numeric (how much or how many)."]
[]
["Student","Phone Type",null,"Row Labels","Count of Phone Type",null,"Student","Rate Instructor",null,"Row Labels","Count of Rate Instructor",null,"Fahrenheit",null,"Celsius",null,"Test Scores",null,"Shoe Size?",null,"Scores From Test",null,"Customer Name","Amount in Bank"]
["Student 01","Motorola",null,"iPhone",104,null,"Student 01","OK",null,"Excelent",56,null,-10,null,{"$f":"CONVERT(M5,\"F\",\"C\")","v":-23.333333333333332},null,0,null,0,null,3.5,null,"Joe",0]
["Student 02","Motorola",null,"Motorola",52,null,"Student 02","Poor",null,"Good",47,null,-9,null,{"$f":"CONVERT(M6,\"F\",\"C\")","v":-22.777777777777779},null,1,null,2,null,2.5,null,"Sioux",500]
["Student 03","Samsung",null,"Nokia",89,null,"Student 03","Good",null,"OK",105,null,-8,null,-22.222222222222221,null,2,null,4,null,4,null,"Dean",6000]
["Student 04","Nokia",null,"Samsung",50,null,"Student 04","Good",null,"Poor",177,null,-7,null,-21.666666666666668,null,3,null,6,null,5,null,"Joe",25.25]
["Student 05","Motorola",null,"Sony Erickson",42,null,"Student 05","OK",null,"Grand Total",385,null,-6,null,-21.111111111111111,null,4,null,8,null,4.5,null,"Tina",7500]
["Student 06","Nokia",null,"Sprint",48,null,"Student 06","Poor",null,null,null,null,-5,null,-20.555555555555554,null,5,null,10,null,4,null,"Amy",4525.5]
["Student 07","Sprint",null,"Grand Total",385,null,"Student 07","Poor",null,null,null,null,-4,null,-20,null,null,null,12,null,5,null,"Ming",526.5]
["Student 08","iPhone",null,null,null,null,"Student 08","OK",null,null,null,null,-3,null,-19.444444444444443,null,null,null,14]
["Student 09","Motorola",null,"Mean = AVEARGE =",{"$f":"E5/E5","v":1},null,"Student 09","Poor",null,"Mean = AVEARGE =",{"$f":"K5/K5","v":1},null,-2,null,-18.888888888888889]
["Student 10","iPhone",null,null,null,null,"Student 10","Poor",null,null,null,null,-1,null,-18.333333333333332,null,null,null,"Mean = AVEARGE =",null,{"$f":"AVERAGE(U5:U11)","v":4.0714285714285712},null,"Mean = AVEARGE =",{"$f":"AVERAGE(X5:X11)","v":2725.3214285714284}]
["Student 11","Samsung",null,null,null,null,"Student 11","Poor",null,null,null,null,0,null,-17.777777777777779]
["Student 12","Motorola",null,null,null,null,"Student 12","OK",null,null,null,null,1,null,-17.222222222222221]
["Student 13","Samsung",null,null,null,null,"Student 13","Excelent",null,null,null,null,2,null,-16.666666666666668]
["Student 14","iPhone",null,null,null,null,"Student 14","Excelent",null,null,null,null,3,null,-16.111111111111111]
["Student 15","Nokia",null,null,null,null,"Student 15","Poor",null,null,null,null,4,null,-15.555555555555555]
["Student 16","Nokia",null,null,null,null,"Student 16","Poor",null,null,null,null,5,null,-15]
["Student 17","Sprint",null,null,null,null,"Student 17","Good",null,null,null,null,6,null,-14.444444444444445]
["Student 18","Sony Erickson",null,null,null,null,"Student 18","Poor",null,null,null,null,7,null,-13.888888888888889]
["Student 19","Nokia",null,null,null,null,"Student 19","Excelent",null,null,null,null,8,null,-13.333333333333332]
["Student 20","Nokia",null,null,null,null,"Student 20","Poor",null,null,null,null,9,null,-12.777777777777777]
["Student 21","iPhone",null,null,null,null,"Student 21","OK",null,null,null,null,10,null,-12.222222222222221]
["Student 22","iPhone",null,null,null,null,"Student 22","OK",null,null,null,null,11,null,-11.666666666666666]
["Student 23","Nokia",null,null,null,null,"Student 23","OK",null,null,null,null,12,null,-11.111111111111111]
["Student 24","Samsung",null,null,null,null,"Student 24","Excelent",null,null,null,null,13,null,-10.555555555555555]
["Student 25","iPhone",null,null,null,null,"Student 25","OK",null,null,null,null,14,null,-10]
["Student 26","iPhone",null,null,null,null,"Student 26","OK",null,null,null,null,15,null,-9.4444444444444446]
["Student 27","iPhone",null,null,null,null,"Student 27","Poor",null,null,null,null,16,null,-8.8888888888888893]
["Student 28","Sprint",null,null,null,null,"Student 28","OK",null,null,null,null,17,null,-8.3333333333333339]
["Student 29","iPhone",null,null,null,null,"Student 29","Good",null,null,null,null,18,null,-7.7777777777777777]
["Student 30","Sony Erickson",null,null,null,null,"Student 30","Excelent",null,null,null,null,19,null,-7.2222222222222223]
["Student 31","Samsung",null,null,null,null,"Student 31","Excelent",null,null,null,null,20,null,-6.6666666666666661]
["Student 32","Nokia",null,null,null,null,"Student 32","OK",null,null,null,null,21,null,-6.1111111111111107]
["Student 33","iPhone",null,null,null,null,"Student 33","Good",null,null,null,null,22,null,-5.5555555555555554]
["Student 34","Nokia",null,null,null,null,"Student 34","Poor",null,null,null,null,23,null,-5]
["Student 35","iPhone",null,null,null,null,"Student 35","Poor",null,null,null,null,24,null,-4.4444444444444446]
["Student 36","Samsung",null,null,null,null,"Student 36","Poor",null,null,null,null,25,null,-3.8888888888888888]
["Student 37","Sony Erickson",null,null,null,null,"Student 37","Excelent",null,null,null,null,26,null,-3.333333333333333]
["Student 38","iPhone",null,null,null,null,"Student 38","Poor",null,null,null,null,27,null,-2.7777777777777777]
["Student 39","Sony Erickson",null,null,null,null,"Student 39","OK",null,null,null,null,28,null,-2.2222222222222223]
["Student 40","Nokia",null,null,null,null,"Student 40","Poor",null,null,null,null,29,null,-1.6666666666666665]
["Student 41","Nokia",null,null,null,null,"Student 41","Excelent",null,null,null,null,30,null,-1.1111111111111112]
["Student 42","Sony Erickson",null,null,null,null,"Student 42","OK",null,null,null,null,31,null,-0.55555555555555558]
["Student 43","Sprint",null,null,null,null,"Student 43","OK",null,null,null,null,32,null,0]
["Student 44","Nokia",null,null,null,null,"Student 44","Poor",null,null,null,null,33,null,0.55555555555555558]
["Student 45","Nokia",null,null,null,null,"Student 45","Poor",null,null,null,null,34,null,1.1111111111111112]
["Student 46","Motorola",null,null,null,null,"Student 46","Poor",null,null,null,null,35,null,1.6666666666666665]
["Student 47","Samsung",null,null,null,null,"Student 47","OK",null,null,null,null,36,null,2.2222222222222223]
["Student 48","iPhone",null,null,null,null,"Student 48","Good",null,null,null,null,37,null,2.7777777777777777]
["Student 49","Nokia",null,null,null,null,"Student 49","Good",null,null,null,null,38,null,3.333333333333333]
["Student 50","Nokia",null,null,null,null,"Student 50","OK",null,null,null,null,39,null,3.8888888888888888]
["Student 51","Sprint",null,null,null,null,"Student 51","Excelent",null,null,null,null,40,null,4.4444444444444446]
["Student 52","Nokia",null,null,null,null,"Student 52","Poor",null,null,null,null,41,null,5]
["Student 53","Nokia",null,null,null,null,"Student 53","Excelent",null,null,null,null,42,null,5.5555555555555554]
["Student 54","Sprint",null,null,null,null,"Student 54","Good",null,null,null,null,43,null,6.1111111111111107]
["Student 55","Sony Erickson",null,null,null,null,"Student 55","Poor",null,null,null,null,44,null,6.6666666666666661]
["Student 56","Nokia",null,null,null,null,"Student 56","Poor",null,null,null,null,45,null,7.2222222222222223]
["Student 57","iPhone",null,null,null,null,"Student 57","Good",null,null,null,null,46,null,7.7777777777777777]
["Student 58","Samsung",null,null,null,null,"Student 58","Poor"]
["Student 59","Motorola",null,null,null,null,"Student 59","OK"]
["Student 60","iPhone",null,null,null,null,"Student 60","Poor"]
["Student 61","Sony Erickson",null,null,null,null,"Student 61","Poor"]
["Student 62","Nokia",null,null,null,null,"Student 62","OK"]
["Student 63","Nokia",null,null,null,null,"Student 63","Poor"]
["Student 64","iPhone",null,null,null,null,"Student 64","Poor"]
["Student 65","iPhone",null,null,null,null,"Student 65","Poor"]
["Student 66","iPhone",null,null,null,null,"Student 66","Poor"]
["Student 67","iPhone",null,null,null,null,"Student 67","OK"]
["Student 68","Sprint",null,null,null,null,"Student 68","Poor"]
["Student 69","iPhone",null,null,null,null,"Student 69","Poor"]
["Student 70","Nokia",null,null,null,null,"Student 70","Poor"]
["Student 71","Motorola",null,null,null,null,"Student 71","Poor"]
["Student 72","Sprint",null,null,null,null,"Student 72","Good"]
["Student 73","iPhone",null,null,null,null,"Student 73","OK"]
["Student 74","Sony Erickson",null,null,null,null,"Student 74","Excelent"]
["Student 75","Nokia",null,null,null,null,"Student 75","Poor"]
["Student 76","Motorola",null,null,null,null,"Student 76","Good"]
["Student 77","iPhone",null,null,null,null,"Student 77","Poor"]
["Student 78","Motorola",null,null,null,null,"Student 78","OK"]
["Student 79","Nokia",null,null,null,null,"Student 79","Good"]
["Student 80","Motorola",null,null,null,null,"Student 80","Poor"]
["Student 81","Nokia",null,null,null,null,"Student 81","Poor"]
["Student 82","Sprint",null,null,null,null,"Student 82","Poor"]
["Student 83","Sprint",null,null,null,null,"Student 83","Poor"]
["Student 84","iPhone",null,null,null,null,"Student 84","Poor"]
["Student 85","iPhone",null,null,null,null,"Student 85","Good"]
["Student 86","iPhone",null,null,null,null,"Student 86","OK"]
["Student 87","iPhone",null,null,null,null,"Student 87","OK"]
["Student 88","Sprint",null,null,null,null,"Student 88","Good"]
["Student 89","Motorola",null,null,null,null,"Student 89","Poor"]
["Student 90","Sony Erickson",null,null,null,null,"Student 90","OK"]
["Student 91","Motorola",null,null,null,null,"Student 91","Poor"]
["Student 92","Samsung",null,null,null,null,"Student 92","Good"]
["Student 93","Nokia",null,null,null,null,"Student 93","Good"]
["Student 94","Sony Erickson",null,null,null,null,"Student 94","Poor"]
["Student 95","iPhone",null,null,null,null,"Student 95","OK"]
["Student 96","Nokia",null,null,null,null,"Student 96","Poor"]
["Student 97","iPhone",null,null,null,null,"Student 97","Poor"]
["Student 98","Nokia",null,null,null,null,"Student 98","Poor"]
["Student 99","Sony Erickson",null,null,null,null,"Student 99","Poor"]
["Student 100","Sprint",null,null,null,null,"Student 100","Poor"]
["Student 101","Nokia",null,null,null,null,"Student 101","Poor"]
["Student 102","iPhone",null,null,null,null,"Student 102","Poor"]
["Student 103","Sprint",null,null,null,null,"Student 103","Poor"]
["Student 104","Sony Erickson",null,null,null,null,"Student 104","Poor"]
["Student 105","Motorola",null,null,null,null,"Student 105","Poor"]
["Student 106","Nokia",null,null,null,null,"Student 106","Poor"]
["Student 107","iPhone",null,null,null,null,"Student 107","OK"]
["Student 108","Nokia",null,null,null,null,"Student 108","Excelent"]
["Student 109","Nokia",null,null,null,null,"Student 109","Poor"]
["Student 110","Motorola",null,null,null,null,"Student 110","Excelent"]
["Student 111","iPhone",null,null,null,null,"Student 111","OK"]
["Student 112","Nokia",null,null,null,null,"Student 112","Good"]
["Student 113","Nokia",null,null,null,null,"Student 113","Poor"]
["Student 114","Nokia",null,null,null,null,"Student 114","Good"]
["Student 115","Motorola",null,null,null,null,"Student 115","OK"]
["Student 116","Sprint",null,null,null,null,"Student 116","OK"]
["Student 117","Sprint",null,null,null,null,"Student 117","Poor"]
["Student 118","Sprint",null,null,null,null,"Student 118","Excelent"]
["Student 119","Nokia",null,null,null,null,"Student 119","Excelent"]
["Student 120","Nokia",null,null,null,null,"Student 120","Excelent"]
["Student 121","Sprint",null,null,null,null,"Student 121","Excelent"]
["Student 122","Nokia",null,null,null,null,"Student 122","OK"]
["Student 123","Samsung",null,null,null,null,"Student 123","Good"]
["Student 124","Samsung",null,null,null,null,"Student 124","Poor"]
["Student 125","Samsung",null,null,null,null,"Student 125","Poor"]
["Student 126","Samsung",null,null,null,null,"Student 126","Excelent"]
["Student 127","Motorola",null,null,null,null,"Student 127","Poor"]
["Student 128","Sony Erickson",null,null,null,null,"Student 128","Poor"]
["Student 129","Motorola",null,null,null,null,"Student 129","OK"]
["Student 130","iPhone",null,null,null,null,"Student 130","Poor"]
["Student 131","iPhone",null,null,null,null,"Student 131","Poor"]
["Student 132","Sprint",null,null,null,null,"Student 132","Poor"]
["Student 133","Samsung",null,null,null,null,"Student 133","OK"]
["Student 134","Nokia",null,null,null,null,"Student 134","Poor"]
["Student 135","Motorola",null,null,null,null,"Student 135","OK"]
["Student 136","Nokia",null,null,null,null,"Student 136","Poor"]
["Student 137","Motorola",null,null,null,null,"Student 137","Poor"]
["Student 138","Sony Erickson",null,null,null,null,"Student 138","OK"]
["Student 139","Samsung",null,null,null,null,"Student 139","Excelent"]
["Student 140","Nokia",null,null,null,null,"Student 140","OK"]
["Student 141","iPhone",null,null,null,null,"Student 141","Poor"]
["Student 142","Motorola",null,null,null,null,"Student 142","Poor"]
["Student 143","iPhone",null,null,null,null,"Student 143","Poor"]
["Student 144","Samsung",null,null,null,null,"Student 144","Poor"]
["Student 145","Motorola",null,null,null,null,"Student 145","OK"]
["Student 146","Nokia",null,null,null,null,"Student 146","Poor"]
["Student 147","Motorola",null,null,null,null,"Student 147","Poor"]
["Student 148","Samsung",null,null,null,null,"Student 148","OK"]
["Student 149","Sprint",null,null,null,null,"Student 149","Poor"]
["Student 150","Samsung",null,null,null,null,"Student 150","Excelent"]
["Student 151","Sony Erickson",null,null,null,null,"Student 151","Excelent"]
["Student 152","Nokia",null,null,null,null,"Student 152","Excelent"]
["Student 153","iPhone",null,null,null,null,"Student 153","OK"]
["Student 154","Sprint",null,null,null,null,"Student 154","Poor"]
["Student 155","iPhone",null,null,null,null,"Student 155","OK"]
["Student 156","iPhone",null,null,null,null,"Student 156","Poor"]
["Student 157","Samsung",null,null,null,null,"Student 157","Poor"]
["Student 158","Nokia",null,null,null,null,"Student 158","Poor"]
["Student 159","Nokia",null,null,null,null,"Student 159","Poor"]
["Student 160","iPhone",null,null,null,null,"Student 160","Poor"]
["Student 161","Sony Erickson",null,null,null,null,"Student 161","OK"]
["Student 162","Nokia",null,null,null,null,"Student 162","Poor"]
["Student 163","Sprint",null,null,null,null,"Student 163","Poor"]
["Student 164","Nokia",null,null,null,null,"Student 164","Excelent"]
["Student 165","Samsung",null,null,null,null,"Student 165","Good"]
["Student 166","iPhone",null,null,null,null,"Student 166","OK"]
["Student 167","Samsung",null,null,null,null,"Student 167","Good"]
["Student 168","Motorola",null,null,null,null,"Student 168","OK"]
["Student 169","Sony Erickson",null,null,null,null,"Student 169","Poor"]
["Student 170","Nokia",null,null,null,null,"Student 170","Poor"]
["Student 171","Nokia",null,null,null,null,"Student 171","OK"]
["Student 172","Nokia",null,null,null,null,"Student 172","OK"]
["Student 173","Nokia",null,null,null,null,"Student 173","Poor"]
["Student 174","iPhone",null,null,null,null,"Student 174","OK"]
["Student 175","Motorola",null,null,null,null,"Student 175","Good"]
["Student 176","Sprint",null,null,null,null,"Student 176","Poor"]
["Student 177","iPhone",null,null,null,null,"Student 177","Excelent"]
["Student 178","Motorola",null,null,null,null,"Student 178","Poor"]
["Student 179","Nokia",null,null,null,null,"Student 179","Poor"]
["Student 180","iPhone",null,null,null,null,"Student 180","Poor"]
["Student 181","iPhone",null,null,null,null,"Student 181","OK"]
["Student 182","iPhone",null,null,null,null,"Student 182","Poor"]
["Student 183","Sprint",null,null,null,null,"Student 183","Poor"]
["Student 184","Nokia",null,null,null,null,"Student 184","Poor"]
["Student 185","iPhone",null,null,null,null,"Student 185","Poor"]
["Student 186","iPhone",null,null,null,null,"Student 186","OK"]
["Student 187","Sprint",null,null,null,null,"Student 187","Poor"]
["Student 188","Motorola",null,null,null,null,"Student 188","Poor"]
["Student 189","iPhone",null,null,null,null,"Student 189","Good"]
["Student 190","iPhone",null,null,null,null,"Student 190","Good"]
["Student 191","iPhone",null,null,null,null,"Student 191","OK"]
["Student 192","Sony Erickson",null,null,null,null,"Student 192","Good"]
["Student 193","iPhone",null,null,null,null,"Student 193","Poor"]
["Student 194","Motorola",null,null,null,null,"Student 194","OK"]
["Student 195","iPhone",null,null,null,null,"Student 195","Good"]
["Student 196","Nokia",null,null,null,null,"Student 196","Poor"]
["Student 197","Sony Erickson",null,null,null,null,"Student 197","OK"]
["Student 198","Samsung",null,null,null,null,"Student 198","Poor"]
["Student 199","Sprint",null,null,null,null,"Student 199","OK"]
["Student 200","iPhone",null,null,null,null,"Student 200","Poor"]
["Student 201","Motorola",null,null,null,null,"Student 201","Good"]
["Student 202","iPhone",null,null,null,null,"Student 202","OK"]
["Student 203","iPhone",null,null,null,null,"Student 203","Excelent"]
["Student 204","Sprint",null,null,null,null,"Student 204","Good"]
["Student 205","Sprint",null,null,null,null,"Student 205","Poor"]
["Student 206","iPhone",null,null,null,null,"Student 206","Poor"]
["Student 207","Sony Erickson",null,null,null,null,"Student 207","Poor"]
["Student 208","Motorola",null,null,null,null,"Student 208","Poor"]
["Student 209","iPhone",null,null,null,null,"Student 209","Poor"]
["Student 210","iPhone",null,null,null,null,"Student 210","Poor"]
["Student 211","Samsung",null,null,null,null,"Student 211","Poor"]
["Student 212","Sprint",null,null,null,null,"Student 212","Excelent"]
["Student 213","iPhone",null,null,null,null,"Student 213","Excelent"]
["Student 214","iPhone",null,null,null,null,"Student 214","Excelent"]
["Student 215","Nokia",null,null,null,null,"Student 215","OK"]
["Student 216","iPhone",null,null,null,null,"Student 216","Excelent"]
["Student 217","Sprint",null,null,null,null,"Student 217","Poor"]
["Student 218","iPhone",null,null,null,null,"Student 218","Poor"]
["Student 219","Nokia",null,null,null,null,"Student 219","OK"]
["Student 220","iPhone",null,null,null,null,"Student 220","Poor"]
["Student 221","Nokia",null,null,null,null,"Student 221","OK"]
["Student 222","Sprint",null,null,null,null,"Student 222","OK"]
["Student 223","Nokia",null,null,null,null,"Student 223","Poor"]
["Student 224","Nokia",null,null,null,null,"Student 224","Poor"]
["Student 225","Samsung",null,null,null,null,"Student 225","OK"]
["Student 226","iPhone",null,null,null,null,"Student 226","OK"]
["Student 227","iPhone",null,null,null,null,"Student 227","Poor"]
["Student 228","Sprint",null,null,null,null,"Student 228","OK"]
["Student 229","Motorola",null,null,null,null,"Student 229","Poor"]
["Student 230","Sprint",null,null,null,null,"Student 230","Poor"]
["Student 231","iPhone",null,null,null,null,"Student 231","Poor"]
["Student 232","iPhone",null,null,null,null,"Student 232","Poor"]
["Student 233","Sony Erickson",null,null,null,null,"Student 233","Poor"]
["Student 234","Sprint",null,null,null,null,"Student 234","OK"]
["Student 235","iPhone",null,null,null,null,"Student 235","Poor"]
["Student 236","iPhone",null,null,null,null,"Student 236","Poor"]
["Student 237","Samsung",null,null,null,null,"Student 237","Poor"]
["Student 238","Sony Erickson",null,null,null,null,"Student 238","Good"]
["Student 239","Sony Erickson",null,null,null,null,"Student 239","Excelent"]
["Student 240","iPhone",null,null,null,null,"Student 240","Good"]
["Student 241","Motorola",null,null,null,null,"Student 241","Poor"]
["Student 242","Samsung",null,null,null,null,"Student 242","Poor"]
["Student 243","iPhone",null,null,null,null,"Student 243","Poor"]
["Student 244","Nokia",null,null,null,null,"Student 244","Poor"]
["Student 245","Sony Erickson",null,null,null,null,"Student 245","OK"]
["Student 246","Samsung",null,null,null,null,"Student 246","OK"]
["Student 247","Nokia",null,null,null,null,"Student 247","Good"]
["Student 248","Motorola",null,null,null,null,"Student 248","OK"]
["Student 249","Sony Erickson",null,null,null,null,"Student 249","OK"]
["Student 250","Sprint",null,null,null,null,"Student 250","Poor"]
["Student 251","Nokia",null,null,null,null,"Student 251","Poor"]
["Student 252","Sony Erickson",null,null,null,null,"Student 252","OK"]
["Student 253","Nokia",null,null,null,null,"Student 253","OK"]
["Student 254","Sony Erickson",null,null,null,null,"Student 254","OK"]
["Student 255","iPhone",null,null,null,null,"Student 255","Poor"]
["Student 256","iPhone",null,null,null,null,"Student 256","OK"]
["Student 257","Motorola",null,null,null,null,"Student 257","OK"]
["Student 258","Sony Erickson",null,null,null,null,"Student 258","Excelent"]
["Student 259","Samsung",null,null,null,null,"Student 259","Good"]
["Student 260","Samsung",null,null,null,null,"Student 260","Excelent"]
["Student 261","Motorola",null,null,null,null,"Student 261","Poor"]
["Student 262","iPhone",null,null,null,null,"Student 262","OK"]
["Student 263","iPhone",null,null,null,null,"Student 263","OK"]
["Student 264","Samsung",null,null,null,null,"Student 264","OK"]
["Student 265","Sony Erickson",null,null,null,null,"Student 265","Poor"]
["Student 266","Sony Erickson",null,null,null,null,"Student 266","OK"]
["Student 267","Motorola",null,null,null,null,"Student 267","OK"]
["Student 268","Motorola",null,null,null,null,"Student 268","Excelent"]
["Student 269","iPhone",null,null,null,null,"Student 269","Poor"]
["Student 270","Nokia",null,null,null,null,"Student 270","Excelent"]
["Student 271","Sony Erickson",null,null,null,null,"Student 271","OK"]
["Student 272","Nokia",null,null,null,null,"Student 272","Excelent"]
["Student 273","Sprint",null,null,null,null,"Student 273","Poor"]
["Student 274","iPhone",null,null,null,null,"Student 274","Good"]
["Student 275","Nokia",null,null,null,null,"Student 275","Excelent"]
["Student 276","Nokia",null,null,null,null,"Student 276","Excelent"]
["Student 277","Samsung",null,null,null,null,"Student 277","Poor"]
["Student 278","Sony Erickson",null,null,null,null,"Student 278","Excelent"]
["Student 279","Samsung",null,null,null,null,"Student 279","Poor"]
["Student 280","Nokia",null,null,null,null,"Student 280","Poor"]
["Student 281","Samsung",null,null,null,null,"Student 281","Poor"]
["Student 282","Sprint",null,null,null,null,"Student 282","Poor"]
["Student 283","Sony Erickson",null,null,null,null,"Student 283","OK"]
["Student 284","Motorola",null,null,null,null,"Student 284","OK"]
["Student 285","Samsung",null,null,null,null,"Student 285","Poor"]
["Student 286","Nokia",null,null,null,null,"Student 286","Excelent"]
["Student 287","Samsung",null,null,null,null,"Student 287","Excelent"]
["Student 288","Samsung",null,null,null,null,"Student 288","OK"]
["Student 289","Motorola",null,null,null,null,"Student 289","Poor"]
["Student 290","iPhone",null,null,null,null,"Student 290","Poor"]
["Student 291","Nokia",null,null,null,null,"Student 291","Good"]
["Student 292","Nokia",null,null,null,null,"Student 292","Poor"]
["Student 293","Nokia",null,null,null,null,"Student 293","OK"]
["Student 294","Motorola",null,null,null,null,"Student 294","Poor"]
["Student 295","Sprint",null,null,null,null,"Student 295","Excelent"]
["Student 296","Motorola",null,null,null,null,"Student 296","Excelent"]
["Student 297","Motorola",null,null,null,null,"Student 297","Good"]
["Student 298","Nokia",null,null,null,null,"Student 298","OK"]
["Student 299","Sprint",null,null,null,null,"Student 299","OK"]
["Student 300","iPhone",null,null,null,null,"Student 300","Excelent"]
["Student 301","iPhone",null,null,null,null,"Student 301","Poor"]
["Student 302","Nokia",null,null,null,null,"Student 302","Poor"]
["Student 303","Nokia",null,null,null,null,"Student 303","Poor"]
["Student 304","Nokia",null,null,null,null,"Student 304","OK"]
["Student 305","Nokia",null,null,null,null,"Student 305","Excelent"]
["Student 306","Samsung",null,null,null,null,"Student 306","Poor"]
["Student 307","Samsung",null,null,null,null,"Student 307","Poor"]
["Student 308","iPhone",null,null,null,null,"Student 308","OK"]
["Student 309","Motorola",null,null,null,null,"Student 309","OK"]
["Student 310","Sprint",null,null,null,null,"Student 310","Good"]
["Student 311","iPhone",null,null,null,null,"Student 311","OK"]
["Student 312","iPhone",null,null,null,null,"Student 312","Poor"]
["Student 313","Nokia",null,null,null,null,"Student 313","Poor"]
["Student 314","Samsung",null,null,null,null,"Student 314","Excelent"]
["Student 315","Samsung",null,null,null,null,"Student 315","Good"]
["Student 316","iPhone",null,null,null,null,"Student 316","Good"]
["Student 317","Samsung",null,null,null,null,"Student 317","Poor"]
["Student 318","Samsung",null,null,null,null,"Student 318","OK"]
["Student 319","Motorola",null,null,null,null,"Student 319","Excelent"]
["Student 320","Sony Erickson",null,null,null,null,"Student 320","Good"]
["Student 321","iPhone",null,null,null,null,"Student 321","Poor"]
["Student 322","Nokia",null,null,null,null,"Student 322","Poor"]
["Student 323","iPhone",null,null,null,null,"Student 323","Poor"]
["Student 324","Samsung",null,null,null,null,"Student 324","Good"]
["Student 325","Sony Erickson",null,null,null,null,"Student 325","Poor"]
["Student 326","Motorola",null,null,null,null,"Student 326","Poor"]
["Student 327","iPhone",null,null,null,null,"Student 327","Poor"]
["Student 328","Sprint",null,null,null,null,"Student 328","Excelent"]
["Student 329","Motorola",null,null,null,null,"Student 329","Poor"]
["Student 330","Samsung",null,null,null,null,"Student 330","OK"]
["Student 331","Nokia",null,null,null,null,"Student 331","OK"]
["Student 332","Sony Erickson",null,null,null,null,"Student 332","Poor"]
["Student 333","iPhone",null,null,null,null,"Student 333","Poor"]
["Student 334","Samsung",null,null,null,null,"Student 334","Good"]
["Student 335","iPhone",null,null,null,null,"Student 335","OK"]
["Student 336","iPhone",null,null,null,null,"Student 336","OK"]
["Student 337","Nokia",null,null,null,null,"Student 337","Excelent"]
["Student 338","Motorola",null,null,null,null,"Student 338","Excelent"]
["Student 339","Nokia",null,null,null,null,"Student 339","Good"]
["Student 340","Nokia",null,null,null,null,"Student 340","Poor"]
["Student 341","Samsung",null,null,null,null,"Student 341","Excelent"]
["Student 342","iPhone",null,null,null,null,"Student 342","Good"]
["Student 343","iPhone",null,null,null,null,"Student 343","Good"]
["Student 344","Sprint",null,null,null,null,"Student 344","OK"]
["Student 345","Nokia",null,null,null,null,"Student 345","Excelent"]
["Student 346","Sprint",null,null,null,null,"Student 346","Poor"]
["Student 347","Sony Erickson",null,null,null,null,"Student 347","Poor"]
["Student 348","Motorola",null,null,null,null,"Student 348","OK"]
["Student 349","iPhone",null,null,null,null,"Student 349","OK"]
["Student 350","Sprint",null,null,null,null,"Student 350","Poor"]
["Student 351","Sony Erickson",null,null,null,null,"Student 351","OK"]
["Student 352","iPhone",null,null,null,null,"Student 352","Poor"]
["Student 353","iPhone",null,null,null,null,"Student 353","OK"]
["Student 354","Motorola",null,null,null,null,"Student 354","OK"]
["Student 355","Motorola",null,null,null,null,"Student 355","OK"]
["Student 356","Samsung",null,null,null,null,"Student 356","Excelent"]
["Student 357","Nokia",null,null,null,null,"Student 357","OK"]
["Student 358","iPhone",null,null,null,null,"Student 358","Poor"]
["Student 359","Sprint",null,null,null,null,"Student 359","Poor"]
["Student 360","Sprint",null,null,null,null,"Student 360","Excelent"]
["Student 361","iPhone",null,null,null,null,"Student 361","Poor"]
["Student 362","Sony Erickson",null,null,null,null,"Student 362","OK"]
["Student 363","Nokia",null,null,null,null,"Student 363","Poor"]
["Student 364","Nokia",null,null,null,null,"Student 364","OK"]
["Student 365","Motorola",null,null,null,null,"Student 365","Excelent"]
["Student 366","Sony Erickson",null,null,null,null,"Student 366","OK"]
["Student 367","Nokia",null,null,null,null,"Student 367","Excelent"]
["Student 368","iPhone",null,null,null,null,"Student 368","Poor"]
["Student 369","Sony Erickson",null,null,null,null,"Student 369","OK"]
["Student 370","Nokia",null,null,null,null,"Student 370","Poor"]
["Student 371","Samsung",null,null,null,null,"Student 371","Poor"]
["Student 372","iPhone",null,null,null,null,"Student 372","Good"]
["Student 373","Motorola",null,null,null,null,"Student 373","Poor"]
["Student 374","iPhone",null,null,null,null,"Student 374","Poor"]
["Student 375","Sprint",null,null,null,null,"Student 375","Good"]
["Student 376","Nokia",null,null,null,null,"Student 376","OK"]
["Student 377","Sony Erickson",null,null,null,null,"Student 377","Poor"]
["Student 378","Sprint",null,null,null,null,"Student 378","Poor"]
["Student 379","Samsung",null,null,null,null,"Student 379","OK"]
["Student 380","Samsung",null,null,null,null,"Student 380","Poor"]
["Student 381","Sprint",null,null,null,null,"Student 381","Good"]
["Student 382","iPhone",null,null,null,null,"Student 382","Poor"]
["Student 383","iPhone",null,null,null,null,"Student 383","Poor"]
["Student 384","iPhone",null,null,null,null,"Student 384","OK"]
["Student 385","iPhone",null,null,null,null,"Student 385","Excelent"]

{"sheet":"CrossSectional","index":7,"n_rows":20,"n_cols":7,"rows_kept":20,"cut":false,"hidden":false,"merged":[]}
["County","Date","Number of Building Permits Issued",null,"Date","County","Permits Issued"]
["County 01","2007-06-30",173,null,"2007-06-30"]
["County 02","2007-06-30",172,null,null,"County 06",0]
["County 03","2007-06-30",248,null,null,"County 10",62]
["County 04","2007-06-30",152,null,null,"County 14",67]
["County 05","2007-06-30",73,null,null,"County 11",67]
["County 06","2007-06-30",0,null,null,"County 05",73]
["County 07","2007-06-30",98,null,null,"County 17",80]
["County 08","2007-06-30",126,null,null,"County 07",98]
["County 09","2007-06-30",231,null,null,"County 08",126]
["County 10","2007-06-30",62,null,null,"County 13",149]
["County 11","2007-06-30",67,null,null,"County 04",152]
["County 12","2007-06-30",186,null,null,"County 02",172]
["County 13","2007-06-30",149,null,null,"County 01",173]
["County 14","2007-06-30",67,null,null,"County 16",178]
["County 15","2007-06-30",220,null,null,"County 12",186]
["County 16","2007-06-30",178,null,null,"County 15",220]
["County 17","2007-06-30",80,null,null,"County 09",231]
[null,null,null,null,null,"County 03",248]
[null,null,null,null,"Grand Total",null,2282]

{"sheet":"TimeSeries","index":8,"n_rows":19,"n_cols":7,"rows_kept":19,"cut":false,"hidden":false,"merged":[]}
["County","Date","Number of Building Permits Issued",null,"County","Date","Building Permits Issued"]
["LUCAS","2007-06-30",100,null,"LUCAS","2007-06-30",100]
["LUCAS","2007-07-31",80,null,null,"2007-07-31",80]
["LUCAS","2007-08-31",95,null,null,"2007-08-31",95]
["LUCAS","2007-09-30",65,null,null,"2007-09-30",65]
["LUCAS","2007-10-31",50,null,null,"2007-10-31",50]
["LUCAS","2007-11-30",60,null,null,"2007-11-30",60]
["LUCAS","2007-12-31",27,null,null,"2007-12-31",27]
["LUCAS","2008-01-31",15,null,null,"2008-01-31",15]
["LUCAS","2008-02-29",20,null,null,"2008-02-29",20]
["LUCAS","2008-03-31",30,null,null,"2008-03-31",30]
["LUCAS","2008-04-30",32,null,null,"2008-04-30",32]
["LUCAS","2008-05-31",15,null,null,"2008-05-31",15]
["LUCAS","2008-06-30",10,null,null,"2008-06-30",10]
["LUCAS","2008-07-31",22,null,null,"2008-07-31",22]
["LUCAS","2008-08-31",41,null,null,"2008-08-31",41]
["LUCAS","2008-09-30",37,null,null,"2008-09-30",37]
["LUCAS","2008-10-31",66,null,null,"2008-10-31",66]
[null,null,null,null,"Grand Total",null,765]

{"sheet":"TimeSeries (2)","index":9,"n_rows":24,"n_cols":7,"rows_kept":24,"cut":false,"hidden":false,"merged":[]}
["Sales of Organic Foods (In Millions)"]
[null,2005,2006,2007,2008]
["Whole Foods",5000000000,6000000000,8500000000,7900000000]
["Safeway",500000000,2000000000,3000000000,2520000000]
["Trader Joes",1000000000,1200000000,1300000000,1250000000]
[]
[]
[null,null,null,null,null,null,"Time Series ==>"]
[]
[]
[]
[]
[]
[]
[]
[]
[]
[]
[]
[]
[]
[]
[]
[null,null,null,null,null,null,"Cross-sectional ==>"]

{"sheet":"StatisticalStudies","index":10,"n_rows":0,"n_cols":0,"rows_kept":0,"cut":false,"hidden":false,"merged":[]}

{"sheet":"DescriptiveStatistics","index":11,"n_rows":52,"n_cols":9,"rows_kept":52,"cut":false,"hidden":false,"merged":[]}
["Data Set",null,null,null,"Descriptive Statistics: Numerical Measure"]
["Cost of Parts",null,null,null,"Mean = (Add up all values)/(Count all observation) = AVERAGE = ",{"$f":"AVERAGE(A3:A52)","v":78.98},"\"Typical Value\""]
[109]
[105,null,null,null,"Descriptive Statistics: Tabular Method"]
[105,null,null,null,"Part Cost Category","Part Frequency","Percent Frequency"]
[104,null,null,null,{"$f":"DOLLAR(C15,0)&\" up to \"&DOLLAR(D15,0)","v":"$50 up to $60"},{"$f":"COUNTIF($A$3:$A$52,\"<\"&D15)-COUNTIF($A$3:$A$52,\"<\"&C15)","v":2},{"$f":"F6/$F$12","v":0.04}]
[101,null,null,null,"$60 up to $70",13,0.26]
[99,null,null,null,"$70 up to $80",16,0.32]
[98,null,null,null,"$80 up to $90",7,0.14000000000000001]
[97,null,null,null,"$90 up to $100",7,0.14000000000000001]
[97,null,null,null,"$100 up to $110",5,0.1]
[97,null,null,null,null,{"$f":"SUM(F6:F11)","v":50},{"$f":"SUM(G6:G11)","v":1}]
[93,null,null,null,null,null,null,null,"Statistical Inference (Creating reasonable estimates from a sample)"]
[91,null,null,null,null,null,null,null,"In our budget projections we will use the average of $79 to help project future parts costs. "]
[89,null,{"$f":"F46","v":50},{"$f":"C15+F$45","v":60}]
[88,null,{"$f":"D15","v":60},70]
[85,null,{"$f":"D16","v":70},80]
[83,null,{"$f":"D17","v":80},90]
[82,null,{"$f":"D18","v":90},100]
[80,null,{"$f":"D19","v":100},110]
[80]
[79]
[79]
[79]
[78]
[77]
[76]
[75]
[75,null,null,null,null,"Values"]
[75,null,null,null,"Row Labels","Frequency","% Frequency"]
[74,null,null,null,"50-59",2,0.04]
[74,null,null,null,"60-69",13,0.26]
[73,null,null,null,"70-79",16,0.32]
[72,null,null,null,"80-89",7,0.14000000000000001]
[72,null,null,null,"90-99",7,0.14000000000000001]
[71,null,null,null,"100-110",5,0.1]
[71,null,null,null,"Grand Total",50,1]
[69]
[69,null,null,null,"Count Observations =n =",{"$f":"COUNT(DescriptiveStatistics!$A$3:$A$52)","v":50}]
[69,null,null,null,"Max",{"$f":"MAX(DescriptiveStatistics!$A$3:$A$52)","v":109}]
[68,null,null,null,"Min",{"$f":"MIN(DescriptiveStatistics!$A$3:$A$52)","v":52}]
[68,null,null,null,"k = # of Classes = ",6]
[68,null,null,null,"k = # of Classes = 2^k >= n",{"$f":"2^F42>=F39","v":true}]
[67,null,null,null,"Estimate class width =",{"$f":"(F40-F41)/F42","v":9.5}]
[66,null,null,null,"ROUNDUP",{"$f":"ROUNDUP(F44,0)","v":10}]
[65,null,null,null,"Lower Limit of First =",50]
[62]
[62]
[62]
[62]
[57]
[52]

{"sheet":"InferentialStatisticsTerms","index":12,"n_rows":17,"n_cols":10,"rows_kept":17,"cut":false,"hidden":false,"merged":[]}
["Population","The set of all elements of interest in a particular study"]
["Sample","A subset of the population"]
["Statistical inference","The process of using data obtained from a sample to make estimates and test hypotheses about the characteristics of a population",null,null,null,null,null,null,null,50000]
["Census","Collecting data for a population"]
["Sample survey\n","Collecting data for a sample"]
[]
["Population:\nALL Students In Class","Sample:\nJust Some of the students in the class"]
["Student 01",{"$f":"INDEX($A$8:$A$17,RANDBETWEEN(1,COUNTA($A$8:$A$17)))","v":"Student 10"}]
["Student 02",{"$f":"INDEX($A$8:$A$17,RANDBETWEEN(1,COUNTA($A$8:$A$17)))","v":"Student 02"}]
["Student 03",{"$f":"INDEX($A$8:$A$17,RANDBETWEEN(1,COUNTA($A$8:$A$17)))","v":"Student 08"}]
["Student 04"]
["Student 05"]
["Student 06"]
["Student 07"]
["Student 08"]
["Student 09"]
["Student 10"]

{"sheet":"InferentialStatisticsExample","index":13,"n_rows":602,"n_cols":8,"rows_kept":602,"cut":false,"hidden":false,"merged":[]}
["Production: Sampling box weight to see if filling machine is filling accurately (chapter 9)"]
["H0 : Mu = 10 grams"]
["H1 : Mu <> 10 grams"]
["Historical Average =",10,"grams"]
["Historical Standard Deviation =",0.5,"grams"]
["Level of Significance =",0.05]
["Level of Significance Divided by 2 =",{"$f":"B6/2","v":2.5000000000000001E-2}]
["Sample Mean = AVERAGE =",{"$f":"AVERAGE(A22:A99)","v":9.931756410256412},"grams"]
["Sample Standard Deviation = STDEV =",{"$f":"STDEV(A22:A99)","v":0.2224251332323752},"grams"]
["Sample size = COUNT =",{"$f":"COUNT($A$22:$A$99)","v":78}]
["Standard Error",{"$f":"B5/SQRT(B10)","v":5.6613851707229781E-2},"grams"]
["z",{"$f":"(B8-B4)/B11","v":-1.2054221305503063}]
["X",{"$f":"B12*B11+B4","v":9.931756410256412},{"$f":"D102","v":"P(9.932)"},null,null,null,null,{"$f":"VLOOKUP(B13,B103:C602,2)","v":0.7901034816692134}]
["p-value =",{"$f":"IF(B8<B4,2*NORMDIST(B8,B4,B5/SQRT(B10),1),2*(1-NORMDIST(B8,B4,B5/SQRT(B10),1)))","v":0.22804038236235416}]
["p-value =",{"$f":"2*(1-NORMSDIST(ABS(B12)))","v":0.22804038236235424}]
[{"$f":"IF(B15>B6,\"Because the p-value is greater than our alpha, it is reasonable to assume that the machine is filling accurately\",\" Because the p-value is less than or equal to our alpha, it is reasonable to assume that the machine is not filling accurately\")","v":"Because the p-value is greater than our alpha, it is reasonable to assume that the machine is filling accurately"}]
[]
[]
[]
[]
["Sample data"]
[{"$f":"RANDBETWEEN(9500,10300)/1000","v":10.226000000000001}]
[9.61]
[9.5879999999999992]
[9.6470000000000002]
[9.8819999999999997]
[9.5389999999999997]
[10.022]
[10.143000000000001]
[9.9]
[10.141999999999999]
[9.8190000000000008]
[9.7840000000000007]
[9.9860000000000007]
[9.9879999999999995]
[9.7949999999999999]
[9.6720000000000006]
[10.06]
[10.130000000000001]
[9.8740000000000006]
[9.5719999999999992]
[9.8179999999999996]
[10.022]
[9.8620000000000001]
[9.8710000000000004]
[9.7159999999999993]
[10.061999999999999]
[9.6910000000000007]
[9.7490000000000006]
[9.7460000000000004]
[10.035]
[10.148999999999999]
[10.170999999999999]
[10.298999999999999]
[10.015000000000001]
[9.9499999999999993]
[10.115]
[9.827]
[10.282]
[9.7859999999999996]
[9.9960000000000004]
[9.9260000000000002]
[9.6229999999999993]
[9.5]
[10.212]
[9.9849999999999994]
[10.112]
[10.102]
[9.69]
[10.238]
[9.827]
[10.180999999999999]
[10.183999999999999]
[9.7929999999999993]
[10.180999999999999]
[10.196999999999999]
[9.8539999999999992]
[9.7100000000000009]
[10.098000000000001]
[10.234]
[9.7949999999999999]
[9.6280000000000001]
[10.090999999999999]
[9.7430000000000003]
[10.105]
[{"$f":"RANDBETWEEN(9500,10300)/1000","v":9.6180000000000003}]
[9.6069999999999993]
[9.5790000000000006]
[10.02]
[10.173999999999999]
[10.27]
[9.5410000000000004]
[9.84]
[10.254]
[9.9049999999999994]
[9.859]
[10.239000000000001]
[10.135]
[10.086]
[]
["Chart Data:"]
["z","X","P(Exactly x)",{"$f":"\"P(\"&ROUND(B8,3)&\")\"","v":"P(9.932)"},"P(alpha)"]
[{"$f":"(B103-B$4)/B$11","v":-35.327043465311391},8,{"$f":"NORMDIST(B103,B$4,B$5,0)","v":2.6766045152977074E-4},{"$f":"IF(C103<=B$14/2,C103,0)","v":2.6766045152977074E-4},{"$f":"IF(C103<=B$6/2,C103,0)","v":2.6766045152977074E-4}]
[-35.150408247984835,{"$f":"B103+0.01","v":8.01},2.8989512084778157E-4,2.8989512084778157E-4,2.8989512084778157E-4]
[-34.973773030658286,{"$f":"B104+0.01","v":8.02},3.1385126813106339E-4,3.1385126813106339E-4,3.1385126813106339E-4]
[-34.79713781333173,8.0299999999999994,3.3965119885868533E-4,3.3965119885868533E-4,3.3965119885868533E-4]
[-34.620502596005181,8.0399999999999991,3.6742499600491161E-4,3.6742499600491161E-4,3.6742499600491161E-4]
[-34.443867378678625,8.0499999999999989,3.9731094278554186E-4,3.9731094278554186E-4,3.9731094278554186E-4]
[-34.267232161352069,8.0599999999999987,4.2945596300072948E-4,4.2945596300072948E-4,4.2945596300072948E-4]
[-34.090596944025521,8.0699999999999985,4.640160793138794E-4,4.640160793138794E-4,4.640160793138794E-4]
[-33.913961726698965,8.0799999999999983,5.0115688978171489E-4,5.0115688978171489E-4,5.0115688978171489E-4]
[-33.737326509372416,8.0899999999999981,5.4105406292303377E-4,5.4105406292303377E-4,5.4105406292303377E-4]
[-33.56069129204586,8.0999999999999979,5.8389385158291068E-4,5.8389385158291068E-4,5.8389385158291068E-4]
[-33.384056074719304,8.1099999999999977,6.2987362581503248E-4,6.2987362581503248E-4,6.2987362581503248E-4]
[-33.207420857392755,8.1199999999999974,6.7920242496729633E-4,6.7920242496729633E-4,6.7920242496729633E-4]
[-33.030785640066199,8.1299999999999972,7.3210152911465571E-4,7.3210152911465571E-4,7.3210152911465571E-4]
[-32.854150422739643,8.139999999999997,7.8880504993829564E-4,7.8880504993829564E-4,7.8880504993829564E-4]
[-32.677515205413094,8.1499999999999968,8.4956054110148335E-4,8.4956054110148335E-4,8.4956054110148335E-4]
[-32.500879988086538,8.1599999999999966,9.1462962811969084E-4,9.1462962811969084E-4,9.1462962811969084E-4]
[-32.324244770759989,8.1699999999999964,9.8428865766576087E-4,9.8428865766576087E-4,9.8428865766576087E-4]
[-32.147609553433433,8.1799999999999962,1.0588293661898404E-3,1.0588293661898404E-3,1.0588293661898404E-3]
[-31.970974336106881,8.1899999999999959,1.1385595676684718E-3,1.1385595676684718E-3,1.1385595676684718E-3]
[-31.794339118780329,8.1999999999999957,1.2238038602275069E-3,1.2238038602275069E-3,1.2238038602275069E-3]
[-31.617703901453773,8.2099999999999955,1.3149043513093108E-3,1.3149043513093108E-3,1.3149043513093108E-3]
[-31.44106868412722,8.2199999999999953,1.412221400976026E-3,1.412221400976026E-3,1.412221400976026E-3]
[-31.264433466800668,8.2299999999999951,1.5161343828573679E-3,1.5161343828573679E-3,1.5161343828573679E-3]
[-31.087798249474115,8.2399999999999949,1.6270424621635578E-3,1.6270424621635578E-3,1.6270424621635578E-3]
[-30.911163032147563,8.2499999999999947,1.7453653900914553E-3,1.7453653900914553E-3,1.7453653900914553E-3]
[-30.734527814821007,8.2599999999999945,1.8715443138548878E-3,1.8715443138548878E-3,1.8715443138548878E-3]
[-30.557892597494455,8.2699999999999942,2.006042601468395E-3,2.006042601468395E-3,2.006042601468395E-3]
[-30.381257380167902,8.279999999999994,2.1493466803073815E-3,2.1493466803073815E-3,2.1493466803073815E-3]
[-30.20462216284135,8.2899999999999938,2.3019668883568706E-3,2.3019668883568706E-3,2.3019668883568706E-3]
[-30.027986945514794,8.2999999999999936,2.4644383369459301E-3,2.4644383369459301E-3,2.4644383369459301E-3]
[-29.851351728188241,8.3099999999999934,2.6373217836453645E-3,2.6373217836453645E-3,2.6373217836453645E-3]
[-29.674716510861689,8.3199999999999932,2.8212045138826369E-3,2.8212045138826369E-3,2.8212045138826369E-3]
[-29.498081293535137,8.329999999999993,3.0167012297004727E-3,3.0167012297004727E-3,3.0167012297004727E-3]
[-29.321446076208584,8.3399999999999928,3.2244549439540918E-3,3.2244549439540918E-3,3.2244549439540918E-3]
[-29.144810858882028,8.3499999999999925,3.4451378781071912E-3,3.4451378781071912E-3,3.4451378781071912E-3]
[-28.968175641555476,8.3599999999999923,3.6794523616483724E-3,3.6794523616483724E-3,3.6794523616483724E-3]
[-28.791540424228923,8.3699999999999921,3.9281317310085493E-3,3.9281317310085493E-3,3.9281317310085493E-3]
[-28.614905206902371,8.3799999999999919,4.1919412257156678E-3,4.1919412257156678E-3,4.1919412257156678E-3]
[-28.438269989575815,8.3899999999999917,4.4716788793768385E-3,4.4716788793768385E-3,4.4716788793768385E-3]
[-28.261634772249263,8.3999999999999915,4.7681764029294266E-3,4.7681764029294266E-3,4.7681764029294266E-3]
[-28.08499955492271,8.4099999999999913,5.0823000574527627E-3,5.0823000574527627E-3,5.0823000574527627E-3]
[-27.908364337596158,8.419999999999991,5.4149515136810971E-3,5.4149515136810971E-3,5.4149515136810971E-3]
[-27.731729120269605,8.4299999999999908,5.7670686952065453E-3,5.7670686952065453E-3,5.7670686952065453E-3]
[-27.555093902943049,8.4399999999999906,6.1396266022091268E-3,6.1396266022091268E-3,6.1396266022091268E-3]
[-27.378458685616497,8.4499999999999904,6.5336381123994548E-3,6.5336381123994548E-3,6.5336381123994548E-3]
[-27.201823468289945,8.4599999999999902,6.950154755709456E-3,6.950154755709456E-3,6.950154755709456E-3]
[-27.025188250963392,8.46999999999999,7.390267459117617E-3,7.390267459117617E-3,7.390267459117617E-3]
[-26.848553033636836,8.4799999999999898,7.8551072578490703E-3,7.8551072578490703E-3,7.8551072578490703E-3]
[-26.671917816310284,8.4899999999999896,8.3458459690473989E-3,8.3458459690473989E-3,8.3458459690473989E-3]
[-26.495282598983732,8.4999999999999893,8.8636968238754478E-3,8.8636968238754478E-3,8.8636968238754478E-3]
[-26.318647381657179,8.5099999999999891,9.4099150538673494E-3,9.4099150538673494E-3,9.4099150538673494E-3]
[-26.142012164330627,8.5199999999999889,9.9857984272240952E-3,9.9857984272240952E-3,9.9857984272240952E-3]
[-25.965376947004071,8.5299999999999887,1.0592687730621334E-2,1.0592687730621334E-2,1.0592687730621334E-2]
[-25.788741729677518,8.5399999999999885,1.1231967191981178E-2,1.1231967191981178E-2,1.1231967191981178E-2]
[-25.612106512350966,8.5499999999999883,1.1905064839550903E-2,1.1905064839550903E-2,1.1905064839550903E-2]
[-25.435471295024414,8.5599999999999881,1.2613452792530983E-2,1.2613452792530983E-2,1.2613452792530983E-2]
[-25.258836077697861,8.5699999999999878,1.3358647478404305E-2,1.3358647478404305E-2,1.3358647478404305E-2]
[-25.082200860371305,8.5799999999999876,1.4142209772037907E-2,1.4142209772037907E-2,1.4142209772037907E-2]
[-24.905565643044753,8.5899999999999874,1.4965745051560056E-2,1.4965745051560056E-2,1.4965745051560056E-2]
[-24.7289304257182,8.5999999999999872,1.5830903165958796E-2,1.5830903165958796E-2,1.5830903165958796E-2]
[-24.552295208391648,8.609999999999987,1.6739378309304848E-2,1.6739378309304848E-2,1.6739378309304848E-2]
[-24.375659991065092,8.6199999999999868,1.7692908796473155E-2,1.7692908796473155E-2,1.7692908796473155E-2]
[-24.19902477373854,8.6299999999999866,1.8693276735223197E-2,1.8693276735223197E-2,1.8693276735223197E-2]
[{"$f":"(B167-B$4)/B$11","v":-24.022389556411987},8.6399999999999864,{"$f":"NORMDIST(B167,B$4,B$5,0)","v":1.9742307589500806E-2},{"$f":"IF(C167<=B$14/2,C167,0)","v":1.9742307589500806E-2},{"$f":"IF(C167<=B$6/2,C167,0)","v":1.9742307589500806E-2}]
[-23.845754339085435,8.6499999999999861,2.0841869628843636E-2,2.0841869628843636E-2,2.0841869628843636E-2]
[-23.669119121758882,{"$f":"B168+0.01","v":8.6599999999999859},2.1993873258809502E-2,2.1993873258809502E-2,2.1993873258809502E-2]
[-23.492483904432326,8.6699999999999857,2.3200270227403372E-2,2.3200270227403372E-2,2.3200270227403372E-2]
[-23.315848687105774,8.6799999999999855,2.4463052702554073E-2,2.4463052702554073E-2,2.4463052702554073E-2]
[-23.139213469779222,8.6899999999999853,2.5784252215788624E-2,2.5784252215788624E-2,0]
[-22.962578252452669,8.6999999999999851,2.716593846736913E-2,2.716593846736913E-2,0]
[-22.785943035126113,8.7099999999999849,2.8610217988297156E-2,2.8610217988297156E-2,0]
[-22.609307817799561,8.7199999999999847,3.0119232654752533E-2,3.0119232654752533E-2,0]
[-22.432672600473008,8.7299999999999844,3.1695158050719131E-2,3.1695158050719131E-2,0]
[-22.256037383146456,8.7399999999999842,3.3340201674759477E-2,3.3340201674759477E-2,0]
[-22.079402165819904,8.749999999999984,3.505660098713427E-2,3.505660098713427E-2,0]
[-21.902766948493348,8.7599999999999838,3.6846621293721134E-2,3.6846621293721134E-2,0]
[-21.726131731166795,8.7699999999999836,3.8712553463470793E-2,3.8712553463470793E-2,0]
[-21.549496513840243,8.7799999999999834,4.0656711476448372E-2,4.0656711476448372E-2,0]
[-21.37286129651369,8.7899999999999832,4.2681429799842081E-2,4.2681429799842081E-2,0]
[-21.196226079187134,8.7999999999999829,4.4789060589682121E-2,4.4789060589682121E-2,0]
[-21.019590861860582,8.8099999999999827,4.6981970716398869E-2,4.6981970716398869E-2,0]
[-20.84295564453403,8.8199999999999825,4.9262538612760948E-2,4.9262538612760948E-2,0]
[-20.666320427207477,8.8299999999999823,5.1633150943171099E-2,5.1633150943171099E-2,0]
[-20.489685209880925,8.8399999999999821,5.4096199093759061E-2,5.4096199093759061E-2,0]
[-20.313049992554369,8.8499999999999819,5.6654075483197612E-2,5.6654075483197612E-2,0]
[-20.136414775227816,8.8599999999999817,5.9309169694677581E-2,5.9309169694677581E-2,0]
[-19.959779557901264,8.8699999999999815,6.2063864430011308E-2,6.2063864430011308E-2,0]
[-19.783144340574712,8.8799999999999812,6.4920531287389477E-2,6.4920531287389477E-2,0]
[-19.606509123248156,8.889999999999981,6.7881526364892669E-2,6.7881526364892669E-2,0]
[-19.429873905921603,8.8999999999999808,7.0949185692456895E-2,7.0949185692456895E-2,0]
[-19.253238688595051,8.9099999999999806,7.412582049560669E-2,7.412582049560669E-2,0]
[-19.076603471268498,8.9199999999999804,7.741371229490468E-2,7.741371229490468E-2,0]
[-18.899968253941946,8.9299999999999802,8.081510784571376E-2,8.081510784571376E-2,0]
[-18.72333303661539,8.93999999999998,8.4332213923533475E-2,8.4332213923533475E-2,0]
[-18.546697819288838,8.9499999999999797,8.7967191960846916E-2,8.7967191960846916E-2,0]
[-18.370062601962285,8.9599999999999795,9.172215254210199E-2,9.172215254210199E-2,0]
[-18.193427384635733,8.9699999999999793,9.5599149764145921E-2,9.5599149764145921E-2,0]
[-18.016792167309177,8.9799999999999791,9.9600175470133057E-2,9.9600175470133057E-2,0]
[-17.840156949982624,8.9899999999999789,0.10372715336563228,0.10372715336563228,0]
[-17.663521732656072,8.9999999999999787,0.10798193302636691,0.10798193302636691,0]
[-17.48688651532952,9.0099999999999785,0.11236628380772651,0.11236628380772651,0]
[-17.310251298002967,9.0199999999999783,0.11688188866689296,0,0]
[-17.133616080676411,9.029999999999978,0.12153033790911921,0,0]
[-16.956980863349859,9.0399999999999778,0.12631312287038651,0,0]
[-16.780345646023306,9.0499999999999776,0.13123162954934203,0,0]
[-16.603710428696754,9.0599999999999774,0.13628713220207755,0,0]
[-16.427075211370198,9.0699999999999772,0.14148078691395477,0,0]
[-16.250439994043646,9.079999999999977,0.14681362516330135,0,0]
[-16.073804776717093,9.0899999999999768,0.15228654739240177,0,0]
[-15.897169559390541,9.0999999999999766,0.157900316601775,0,0]
[-15.720534342063987,9.1099999999999763,0.16365555198427184,0,0]
[-15.543899124737434,9.1199999999999761,0.16955272261603022,0,0]
[-15.36726390741088,9.1299999999999759,0.17559214122179656,0,0]
[-15.190628690084328,9.1399999999999757,0.18177395803255053,0,0]
[-15.013993472757774,9.1499999999999755,0.18809815475375818,0,0]
[-14.837358255431221,9.1599999999999753,0.19456453866291884,0,0]
[-14.660723038104669,9.1699999999999751,0.20117273685536449,0,0]
[-14.484087820778115,9.1799999999999748,0.20792219065751125,0,0]
[-14.307452603451562,9.1899999999999746,0.21481215022694999,0,0]
[-14.130817386125008,9.1999999999999744,0.22184166935889293,0,0]
[-13.954182168798456,9.2099999999999742,0.22900960051856609,0,0]
[-13.777546951471901,9.219999999999974,0.23631459011914541,0,0]
[-13.600911734145349,9.2299999999999738,0.24375507406478383,0,0]
[-13.424276516818795,9.2399999999999736,0.2513292735781561,0,0]
[-13.247641299492242,9.2499999999999734,0.25903519133176273,0,0]
[-13.07100608216569,9.2599999999999731,0.26687060790198341,0,0]
[-12.894370864839136,9.2699999999999729,0.27483307856454181,0,0]
[{"$f":"(B231-B$4)/B$11","v":-12.717735647512583},9.2799999999999727,{"$f":"NORMDIST(B231,B$4,B$5,0)","v":0.28291993044965535},{"$f":"IF(C231<=B$14/2,C231,0)","v":0},{"$f":"IF(C231<=B$6/2,C231,0)","v":0}]
[-12.541100430186029,9.2899999999999725,0.29112826007467246,0,0]
[-12.364465212859477,{"$f":"B232+0.01","v":9.2999999999999723},0.2994549312714665,0,0]
[-12.187829995532923,9.3099999999999721,0.30789657352524369,0,0]
[-12.01119477820637,9.3199999999999719,0.31644958074074186,0,0]
[-11.834559560879816,9.3299999999999716,0.3251101104510436,0,0]
[-11.657924343553264,9.3399999999999714,0.33387408348340253,0,0]
[-11.481289126226711,9.3499999999999712,0.34273718409558906,0,0]
[-11.304653908900157,9.359999999999971,0.35169486059529864,0,0]
[-11.128018691573605,9.3699999999999708,0.36074232645413418,0,0]
[-10.95138347424705,9.3799999999999706,0.36987456192658363,0,0]
[-10.774748256920498,9.3899999999999704,0.37908631618325306,0,0]
[-10.598113039593944,9.3999999999999702,0.38837210996639809,0,0]
[-10.421477822267391,9.4099999999999699,0.39772623877452357,0,0]
[-10.244842604940839,9.4199999999999697,0.40714277658149028,0,0]
[-10.068207387614285,9.4299999999999695,0.41661558009418775,0,0]
[-9.8915721702877324,9.4399999999999693,0.42613829355140648,0,0]
[-9.7149369529611782,9.4499999999999691,0.43570435406507141,0,0]
[-9.5383017356346258,9.4599999999999689,0.44530699750349234,0,0]
[-9.3616665183080716,9.4699999999999687,0.45493926491474157,0,0]
[-9.1850313009815192,9.4799999999999685,0.46459400948670193,0,0]
[-9.008396083654965,9.4899999999999682,0.47426390403872848,0,0]
[-8.8317608663284126,9.499999999999968,0.48394144903825581,0,0]
[-8.6551256490018602,9.5099999999999678,0.49361898113405428,0,0]
[-8.478490431675306,9.5199999999999676,0.50328868219620293,0,0]
[-8.3018552143487536,9.5299999999999674,0.51294258885120925,0,0]
[-8.1252199970221994,9.5399999999999672,0.52257260249907467,0,0]
[-7.948584779695647,9.549999999999967,0.53217049979747799,0,0]
[-7.7719495623690937,9.5599999999999667,0.54172794359664433,0,0]
[-7.5953143450425404,9.5699999999999665,0.55123649430688171,0,0]
[-7.4186791277159871,9.5799999999999663,0.56068762167920938,0,0]
[-7.2420439103894338,9.5899999999999661,0.57007271697798279,0,0]
[-7.0654086930628806,9.5999999999999659,0.57938310552293393,0,0]
[-6.8887734757363273,9.6099999999999657,0.58861005957661872,0,0]
[-6.712138258409774,9.6199999999999655,0.5977448115518742,0,0]
[-6.5355030410832207,9.6299999999999653,0.60677856751256898,0,0]
[-6.3588678237566683,9.639999999999965,0.61570252093967492,0,0]
[-6.182232606430115,9.6499999999999648,0.62450786673349179,0,0]
[-6.0055973891035617,9.6599999999999646,0.63318581542175512,0,0]
[-5.8289621717770084,9.6699999999999644,0.64172760754231495,0,0]
[-5.6523269544504551,9.6799999999999642,0.65012452816813449,0,0]
[-5.4756917371239018,9.689999999999964,0.65836792154150015,0,0]
[-5.2990565197973485,9.6999999999999638,0.66644920578357036,0,0]
[-5.1224213024707952,9.7099999999999635,0.67435988764473265,0,0]
[-4.9457860851442428,9.7199999999999633,0.68209157726067715,0,0]
[-4.7691508678176895,9.7299999999999631,0.68963600287863924,0,0]
[-4.5925156504911362,9.7399999999999629,0.69698502551792219,0,0]
[-4.4158804331645829,9.7499999999999627,0.70413065352857274,0,0]
[-4.2392452158380296,9.7599999999999625,0.71106505701196854,0,0]
[-4.0626099985114763,9.7699999999999623,0.7177805820670643,0,0]
[-3.8859747811849235,9.7799999999999621,0.72426976482616023,0,0]
[-3.7093395638583702,9.7899999999999618,0.73052534524428447,0,0]
[-3.5327043465318169,9.7999999999999616,0.73654028060662402,0,0]
[-3.3560691292052636,9.8099999999999614,0.74230775871891019,0,0]
[-3.1794339118787103,9.8199999999999612,0.74782121074623586,0,0]
[-3.0027986945521574,9.829999999999961,0.75307432366648797,0,0]
[-2.8261634772256041,9.8399999999999608,0.75806105230538434,0,0]
[-2.6495282598990508,9.8499999999999606,0.76277563092103018,0,0]
[-2.4728930425724975,9.8599999999999604,0.76721258430694006,0,0]
[-2.2962578252459447,9.8699999999999601,0.77136673838361614,0,0]
[-2.1196226079193914,9.8799999999999599,0.77523323025001334,0,0]
[-1.9429873905928381,9.8899999999999597,0.77880751766756706,0,0]
[-1.766352173266285,9.8999999999999595,0.7820853879508991,0,0]
[-1.5897169559397317,9.9099999999999593,0.78506296624084626,0,0]
[{"$f":"(B295-B$4)/B$11","v":-1.4130817386131787},9.9199999999999591,{"$f":"NORMDIST(B295,B$4,B$5,0)","v":0.78773672313707144},{"$f":"IF(C295<=B$14/2,C295,0)","v":0},{"$f":"IF(C295<=B$6/2,C295,0)","v":0}]
[-1.2364465212866254,9.9299999999999589,0.7901034816692134,0,0]
[-1.0598113039600723,{"$f":"B296+0.01","v":9.9399999999999586},0.79216042358730432,0,0]
[-0.88317608663351899,9.9499999999999584,0.79390509495401695,0,0]
[-0.7065408693069658,9.9599999999999582,0.79533541102321248,0,0]
[-0.52990565198041262,9.969999999999958,0.79644966039120979,0,0]
[-0.35327043465385943,9.9799999999999578,0.79724650840920741,0,0]
[-0.17663521732730622,9.9899999999999576,0.79772499984733092,0,0]
[-7.5304122330474977E-13,9.9999999999999574,0.79788456080286541,0,0]
[0.17663521732580015,10.009999999999957,0.79772499984733358,0,0]
[0.35327043465235336,10.019999999999957,0.79724650840921274,0,0]
[0.52990565197890649,10.029999999999957,0.7964496603912179,0,0]
[0.70654086930545967,10.039999999999957,0.79533541102322336,0,0]
[0.88317608663201286,10.049999999999956,0.7939050949540305,0,0]
[1.0598113039585662,10.059999999999956,0.79216042358732053,0,0]
[1.2364465212851192,10.069999999999956,0.79010348166923228,0,0]
[1.4130817386116725,10.079999999999956,0.78773672313709286,0,0]
[1.5897169559382256,10.089999999999955,0.78506296624087035,0,0]
[1.7663521732647789,10.099999999999955,0.78208538795092586,0,0]
[1.942987390591332,10.109999999999955,0.77880751766759626,0,0]
[2.119622607917885,10.119999999999955,0.77523323025004509,0,0]
[2.2962578252444383,10.129999999999955,0.77136673838365033,0,0]
[2.4728930425709916,10.139999999999954,0.7672125843069767,0,0]
[2.6495282598975449,10.149999999999954,0.76277563092106915,0,0]
[2.8261634772240982,10.159999999999954,0.75806105230542564,0,0]
[3.0027986945506511,10.169999999999954,0.7530743236665316,0,0]
[3.1794339118772044,10.179999999999954,0.74782121074628183,0,0]
[3.3560691292037577,10.189999999999953,0.74230775871895838,0,0]
[3.532704346530311,10.199999999999953,0.73654028060667431,0,0]
[3.7093395638568638,10.209999999999953,0.73052534524433665,0,0]
[3.8859747811834171,10.219999999999953,0.72426976482621463,0,0]
[4.06260999850997,10.229999999999952,0.71778058206712059,0,0]
[4.2392452158365233,10.239999999999952,0.71106505701202671,0,0]
[4.4158804331630765,10.249999999999952,0.7041306535286328,0,0]
[4.5925156504896298,10.259999999999952,0.69698502551798402,0,0]
[4.7691508678161831,10.269999999999952,0.68963600287870275,0,0]
[4.9457860851427364,10.279999999999951,0.68209157726074221,0,0]
[5.1224213024692897,10.289999999999951,0.67435988764479937,0,0]
[5.299056519795843,10.299999999999951,0.66644920578363853,0,0]
[5.4756917371223963,10.309999999999951,0.65836792154156976,0,0]
[5.6523269544489487,10.319999999999951,0.65012452816820543,0,0]
[5.828962171775502,10.32999999999995,0.64172760754238711,0,0]
[6.0055973891020553,10.33999999999995,0.63318581542182861,0,0]
[6.1822326064286086,10.34999999999995,0.6245078667335664,0,0]
[6.3588678237551619,10.35999999999995,0.61570252093975042,0,0]
[6.5355030410817152,10.369999999999949,0.60677856751264569,0,0]
[6.7121382584082685,10.379999999999949,0.59774481155195169,0,0]
[6.8887734757348218,10.389999999999949,0.5886100595766971,0,0]
[7.0654086930613742,10.399999999999949,0.57938310552301286,0,0]
[7.2420439103879275,10.409999999999949,0.5700727169780625,0,0]
[7.4186791277144808,10.419999999999948,0.56068762167928976,0,0]
[7.5953143450410341,10.429999999999948,0.55123649430696242,0,0]
[7.7719495623675874,10.439999999999948,0.5417279435967256,0,0]
[7.9485847796941407,10.449999999999948,0.5321704997975597,0,0]
[8.1252199970206931,10.459999999999948,0.52257260249915671,0,0]
[8.3018552143472473,10.469999999999947,0.51294258885129151,0,0]
[8.4784904316737997,10.479999999999947,0.50328868219628531,0,0]
[8.6551256490003539,10.489999999999947,0.49361898113413677,0,0]
[8.8317608663269063,10.499999999999947,0.4839414490383383,0,0]
[9.0083960836534605,10.509999999999946,0.47426390403881091,0,0]
[9.1850313009800129,10.519999999999946,0.46459400948678431,0,0]
[9.3616665183065653,10.529999999999946,0.45493926491482378,0,0]
[9.5383017356331194,10.539999999999946,0.44530699750357439,0,0]
[9.7149369529596719,10.549999999999946,0.43570435406515318,0,0]
[{"$f":"(B359-B$4)/B$11","v":9.891572170286226},10.559999999999945,{"$f":"NORMDIST(B359,B$4,B$5,0)","v":0.42613829355148786},{"$f":"IF(C359<=B$14/2,C359,0)","v":0},{"$f":"IF(C359<=B$6/2,C359,0)","v":0}]
[10.068207387612778,10.569999999999945,0.41661558009426869,0,0]
[10.244842604939333,{"$f":"B360+0.01","v":10.579999999999945},0.40714277658157089,0,0]
[10.421477822265885,10.589999999999945,0.39772623877460361,0,0]
[10.598113039592439,10.599999999999945,0.38837210996647759,0,0]
[10.774748256918992,10.609999999999944,0.37908631618333194,0,0]
[10.951383474245544,10.619999999999944,0.36987456192666185,0,0]
[11.128018691572098,10.629999999999944,0.36074232645421161,0,0]
[11.304653908898651,10.639999999999944,0.35169486059537541,0,0]
[11.481289126225205,10.649999999999944,0.34273718409566512,0,0]
[11.657924343551757,10.659999999999943,0.33387408348347763,0,0]
[11.834559560878311,10.669999999999943,0.32511011045111787,0,0]
[12.011194778204864,10.679999999999943,0.31644958074081525,0,0]
[12.187829995531418,10.689999999999943,0.30789657352531613,0,0]
[12.36446521285797,10.699999999999942,0.29945493127153799,0,0]
[12.541100430184523,10.709999999999942,0.29112826007474296,0,0]
[12.717735647511077,10.719999999999942,0.28291993044972485,0,0]
[12.894370864837629,10.729999999999942,0.27483307856461026,0,0]
[13.071006082164184,10.739999999999942,0.26687060790205069,0,0]
[13.247641299490736,10.749999999999941,0.25903519133182901,0,0]
[13.42427651681729,10.759999999999941,0.25132927357822121,0,0]
[13.600911734143843,10.769999999999941,0.24375507406484789,0,0]
[13.777546951470395,10.779999999999941,0.23631459011920825,0,0]
[13.954182168796949,10.789999999999941,0.22900960051862779,0,0]
[14.130817386123502,10.79999999999994,0.22184166935895347,0,0]
[14.307452603450056,10.80999999999994,0.21481215022700934,0,0]
[14.484087820776608,10.81999999999994,0.20792219065756939,0,0]
[14.660723038103162,10.82999999999994,0.20117273685542145,0,0]
[14.837358255429715,10.839999999999939,0.19456453866297455,0,0]
[15.013993472756269,10.849999999999939,0.18809815475381275,0,0]
[15.190628690082821,10.859999999999939,0.18177395803260385,0,0]
[15.367263907409374,10.869999999999939,0.17559214122184866,0,0]
[15.543899124735928,10.879999999999939,0.16955272261608109,0,0]
[15.72053434206248,10.889999999999938,0.16365555198432152,0,0]
[15.897169559389035,10.899999999999938,0.15790031660182346,0,0]
[16.073804776715587,10.909999999999938,0.15228654739244901,0,0]
[16.250439994042139,10.919999999999938,0.14681362516334742,0,0]
[16.427075211368695,10.929999999999938,0.14148078691399962,0,0]
[16.603710428695248,10.939999999999937,0.13628713220212127,0,0]
[16.7803456460218,10.949999999999937,0.13123162954938455,0,0]
[16.956980863348353,10.959999999999937,0.1263131228704279,0,0]
[17.133616080674905,10.969999999999937,0.12153033790915942,0,0]
[17.310251298001461,10.979999999999936,0.11688188866693204,0,0]
[17.486886515328013,10.989999999999936,0.11236628380776444,0.11236628380776444,0]
[17.663521732654566,10.999999999999936,0.10798193302640373,0.10798193302640373,0]
[17.840156949981118,11.009999999999936,0.10372715336566801,0.10372715336566801,0]
[18.016792167307674,11.019999999999936,9.9600175470167682E-2,9.9600175470167682E-2,0]
[18.193427384634226,11.029999999999935,9.5599149764179506E-2,9.5599149764179506E-2,0]
[18.370062601960779,11.039999999999935,9.1722152542134533E-2,9.1722152542134533E-2,0]
[18.546697819287331,11.049999999999935,8.7967191960878419E-2,8.7967191960878419E-2,0]
[18.723333036613884,11.059999999999935,8.4332213923563951E-2,8.4332213923563951E-2,0]
[18.89996825394044,11.069999999999935,8.0815107845743264E-2,8.0815107845743264E-2,0]
[19.076603471266992,11.079999999999934,7.7413712294933185E-2,7.7413712294933185E-2,0]
[19.253238688593544,11.089999999999934,7.4125820495634237E-2,7.4125820495634237E-2,0]
[19.429873905920097,11.099999999999934,7.0949185692483527E-2,7.0949185692483527E-2,0]
[19.606509123246653,11.109999999999934,6.7881526364918371E-2,6.7881526364918371E-2,0]
[19.783144340573205,11.119999999999933,6.4920531287414263E-2,6.4920531287414263E-2,0]
[19.959779557899758,11.129999999999933,6.2063864430035233E-2,6.2063864430035233E-2,0]
[20.13641477522631,11.139999999999933,5.9309169694700646E-2,5.9309169694700646E-2,0]
[20.313049992552862,11.149999999999933,5.6654075483219858E-2,5.6654075483219858E-2,0]
[20.489685209879418,11.159999999999933,5.4096199093780467E-2,5.4096199093780467E-2,0]
[20.666320427205971,11.169999999999932,5.1633150943191694E-2,5.1633150943191694E-2,0]
[20.842955644532523,11.179999999999932,4.9262538612780765E-2,4.9262538612780765E-2,0]
[21.019590861859076,11.189999999999932,4.6981970716417923E-2,4.6981970716417923E-2,0]
[{"$f":"(B423-B$4)/B$11","v":21.196226079185632},11.199999999999932,{"$f":"NORMDIST(B423,B$4,B$5,0)","v":4.4789060589700461E-2},{"$f":"IF(C423<=B$14/2,C423,0)","v":4.4789060589700461E-2},{"$f":"IF(C423<=B$6/2,C423,0)","v":0}]
[21.372861296512184,11.209999999999932,4.2681429799859706E-2,4.2681429799859706E-2,0]
[21.549496513838736,{"$f":"B424+0.01","v":11.219999999999931},4.0656711476465289E-2,4.0656711476465289E-2,0]
[21.726131731165289,11.229999999999931,3.8712553463487023E-2,3.8712553463487023E-2,0]
[21.902766948491841,11.239999999999931,3.6846621293736725E-2,3.6846621293736725E-2,0]
[22.079402165818397,11.249999999999931,3.5056600987149224E-2,3.5056600987149224E-2,0]
[22.25603738314495,11.259999999999931,3.3340201674773792E-2,3.3340201674773792E-2,0]
[22.432672600471502,11.26999999999993,3.1695158050732856E-2,3.1695158050732856E-2,0]
[22.609307817798054,11.27999999999993,3.0119232654765682E-2,3.0119232654765682E-2,0]
[22.785943035124607,11.28999999999993,2.8610217988309733E-2,2.8610217988309733E-2,0]
[22.962578252451163,11.29999999999993,2.7165938467381169E-2,2.7165938467381169E-2,0]
[23.139213469777715,11.309999999999929,2.5784252215800146E-2,2.5784252215800146E-2,0]
[23.315848687104268,11.319999999999929,2.4463052702565088E-2,2.4463052702565088E-2,2.4463052702565088E-2]
[23.49248390443082,11.329999999999929,2.3200270227413892E-2,2.3200270227413892E-2,2.3200270227413892E-2]
[23.669119121757376,11.339999999999929,2.1993873258819553E-2,2.1993873258819553E-2,2.1993873258819553E-2]
[23.845754339083928,11.349999999999929,2.0841869628853222E-2,2.0841869628853222E-2,2.0841869628853222E-2]
[24.022389556410481,11.359999999999928,1.9742307589509969E-2,1.9742307589509969E-2,1.9742307589509969E-2]
[24.199024773737033,11.369999999999928,1.869327673523194E-2,1.869327673523194E-2,1.869327673523194E-2]
[24.375659991063586,11.379999999999928,1.7692908796481485E-2,1.7692908796481485E-2,1.7692908796481485E-2]
[24.552295208390142,11.389999999999928,1.6739378309312779E-2,1.6739378309312779E-2,1.6739378309312779E-2]
[24.728930425716694,11.399999999999928,1.5830903165966352E-2,1.5830903165966352E-2,1.5830903165966352E-2]
[24.905565643043246,11.409999999999927,1.4965745051567253E-2,1.4965745051567253E-2,1.4965745051567253E-2]
[25.082200860369799,11.419999999999927,1.4142209772044752E-2,1.4142209772044752E-2,1.4142209772044752E-2]
[25.258836077696355,11.429999999999927,1.3358647478410819E-2,1.3358647478410819E-2,1.3358647478410819E-2]
[25.435471295022907,11.439999999999927,1.2613452792537177E-2,1.2613452792537177E-2,1.2613452792537177E-2]
[25.61210651234946,11.449999999999926,1.1905064839556783E-2,1.1905064839556783E-2,1.1905064839556783E-2]
[25.788741729676012,11.459999999999926,1.1231967191986766E-2,1.1231967191986766E-2,1.1231967191986766E-2]
[25.965376947002564,11.469999999999926,1.0592687730626641E-2,1.0592687730626641E-2,1.0592687730626641E-2]
[26.14201216432912,11.479999999999926,9.9857984272291329E-3,9.9857984272291329E-3,9.9857984272291329E-3]
[26.318647381655673,11.489999999999926,9.4099150538721303E-3,9.4099150538721303E-3,9.4099150538721303E-3]
[26.495282598982225,11.499999999999925,8.8636968238799824E-3,8.8636968238799824E-3,8.8636968238799824E-3]
[26.671917816308778,11.509999999999925,8.3458459690516976E-3,8.3458459690516976E-3,8.3458459690516976E-3]
[26.848553033635334,11.519999999999925,7.8551072578531434E-3,7.8551072578531434E-3,7.8551072578531434E-3]
[27.025188250961886,11.529999999999925,7.3902674591214699E-3,7.3902674591214699E-3,7.3902674591214699E-3]
[27.201823468288438,11.539999999999925,6.9501547557131041E-3,6.9501547557131041E-3,6.9501547557131041E-3]
[27.378458685614991,11.549999999999924,6.5336381124029069E-3,6.5336381124029069E-3,6.5336381124029069E-3]
[27.555093902941543,11.559999999999924,6.1396266022123933E-3,6.1396266022123933E-3,6.1396266022123933E-3]
[27.731729120268099,11.569999999999924,5.767068695209634E-3,5.767068695209634E-3,5.767068695209634E-3]
[27.908364337594652,11.579999999999924,5.4149515136840158E-3,5.4149515136840158E-3,5.4149515136840158E-3]
[28.084999554921204,11.589999999999923,5.0823000574555218E-3,5.0823000574555218E-3,5.0823000574555218E-3]
[28.261634772247756,11.599999999999923,4.768176402932027E-3,4.768176402932027E-3,4.768176402932027E-3]
[28.438269989574312,11.609999999999923,4.4716788793792966E-3,4.4716788793792966E-3,4.4716788793792966E-3]
[28.614905206900865,11.619999999999923,4.1919412257179827E-3,4.1919412257179827E-3,4.1919412257179827E-3]
[28.791540424227417,11.629999999999923,3.9281317310107334E-3,3.9281317310107334E-3,3.9281317310107334E-3]
[28.96817564155397,11.639999999999922,3.6794523616504315E-3,3.6794523616504315E-3,3.6794523616504315E-3]
[29.144810858880522,11.649999999999922,3.4451378781091284E-3,3.4451378781091284E-3,3.4451378781091284E-3]
[29.321446076207078,11.659999999999922,3.2244549439559189E-3,3.2244549439559189E-3,3.2244549439559189E-3]
[29.49808129353363,11.669999999999922,3.0167012297021901E-3,3.0167012297021901E-3,3.0167012297021901E-3]
[29.674716510860183,11.679999999999922,2.8212045138842558E-3,2.8212045138842558E-3,2.8212045138842558E-3]
[29.851351728186735,11.689999999999921,2.637321783646885E-3,2.637321783646885E-3,2.637321783646885E-3]
[30.027986945513291,11.699999999999921,2.4644383369473596E-3,2.4644383369473596E-3,2.4644383369473596E-3]
[30.204622162839843,11.709999999999921,2.301966888358212E-3,2.301966888358212E-3,2.301966888358212E-3]
[30.381257380166396,11.719999999999921,2.1493466803086435E-3,2.1493466803086435E-3,2.1493466803086435E-3]
[30.557892597492948,11.72999999999992,2.0060426014695799E-3,2.0060426014695799E-3,2.0060426014695799E-3]
[30.734527814819501,11.73999999999992,1.8715443138559982E-3,1.8715443138559982E-3,1.8715443138559982E-3]
[30.911163032146057,11.74999999999992,1.7453653900924967E-3,1.7453653900924967E-3,1.7453653900924967E-3]
[31.087798249472609,11.75999999999992,1.6270424621645345E-3,1.6270424621645345E-3,1.6270424621645345E-3]
[31.264433466799161,11.76999999999992,1.5161343828582838E-3,1.5161343828582838E-3,1.5161343828582838E-3]
[31.441068684125714,11.779999999999919,1.4122214009768827E-3,1.4122214009768827E-3,1.4122214009768827E-3]
[31.61770390145227,11.789999999999919,1.3149043513101131E-3,1.3149043513101131E-3,1.3149043513101131E-3]
[31.794339118778822,11.799999999999919,1.2238038602282581E-3,1.2238038602282581E-3,1.2238038602282581E-3]
[31.970974336105375,11.809999999999919,1.1385595676691748E-3,1.1385595676691748E-3,1.1385595676691748E-3]
[32.147609553431927,11.819999999999919,1.0588293661904977E-3,1.0588293661904977E-3,1.0588293661904977E-3]
[32.324244770758483,11.829999999999918,9.842886576663754E-4,9.842886576663754E-4,9.842886576663754E-4]
[{"$f":"(B487-B$4)/B$11","v":32.500879988085032},11.839999999999918,{"$f":"NORMDIST(B487,B$4,B$5,0)","v":9.1462962812026525E-4},{"$f":"IF(C487<=B$14/2,C487,0)","v":9.1462962812026525E-4},{"$f":"IF(C487<=B$6/2,C487,0)","v":9.1462962812026525E-4}]
[32.677515205411588,11.849999999999918,8.4956054110201895E-4,8.4956054110201895E-4,8.4956054110201895E-4]
[32.854150422738144,{"$f":"B488+0.01","v":11.859999999999918},7.8880504993879589E-4,7.8880504993879589E-4,7.8880504993879589E-4]
[33.030785640064693,11.869999999999918,7.3210152911512257E-4,7.3210152911512257E-4,7.3210152911512257E-4]
[33.207420857391249,11.879999999999917,6.7920242496773186E-4,6.7920242496773186E-4,6.7920242496773186E-4]
[33.384056074717797,11.889999999999917,6.2987362581543808E-4,6.2987362581543808E-4,6.2987362581543808E-4]
[33.560691292044353,11.899999999999917,5.8389385158328928E-4,5.8389385158328928E-4,5.8389385158328928E-4]
[33.737326509370909,11.909999999999917,5.4105406292338657E-4,5.4105406292338657E-4,5.4105406292338657E-4]
[33.913961726697458,11.919999999999916,5.0115688978204286E-4,5.0115688978204286E-4,5.0115688978204286E-4]
[34.090596944024014,11.929999999999916,4.6401607931418476E-4,4.6401607931418476E-4,4.6401607931418476E-4]
[34.267232161350563,11.939999999999916,4.2945596300101365E-4,4.2945596300101365E-4,4.2945596300101365E-4]
[34.443867378677119,11.949999999999916,3.9731094278580624E-4,3.9731094278580624E-4,3.9731094278580624E-4]
[34.620502596003675,11.959999999999916,3.6742499600515702E-4,3.6742499600515702E-4,3.6742499600515702E-4]
[34.797137813330224,11.969999999999915,3.3965119885891372E-4,3.3965119885891372E-4,3.3965119885891372E-4]
[34.97377303065678,11.979999999999915,3.1385126813127524E-4,3.1385126813127524E-4,3.1385126813127524E-4]
[35.150408247983329,11.989999999999915,2.8989512084797852E-4,2.8989512084797852E-4,2.8989512084797852E-4]
[35.327043465309885,11.999999999999915,2.6766045152995331E-4,2.6766045152995331E-4,2.6766045152995331E-4]
[35.503678682636441,12.009999999999915,2.4703232668221671E-4,2.4703232668221671E-4,2.4703232668221671E-4]
[35.680313899962989,12.019999999999914,2.2790279613788713E-4,2.2790279613788713E-4,2.2790279613788713E-4]
[35.856949117289545,12.029999999999914,2.1017052086094693E-4,2.1017052086094693E-4,2.1017052086094693E-4]
[36.033584334616101,12.039999999999914,1.9374041679757483E-4,1.9374041679757483E-4,1.9374041679757483E-4]
[36.21021955194265,12.049999999999914,1.7852331435439206E-4,1.7852331435439206E-4,1.7852331435439206E-4]
[36.386854769269206,12.059999999999913,1.6443563307268913E-4,1.6443563307268913E-4,1.6443563307268913E-4]
[36.563489986595755,12.069999999999913,1.5139907106043106E-4,1.5139907106043106E-4,1.5139907106043106E-4]
[36.740125203922311,12.079999999999913,1.3934030873852965E-4,1.3934030873852965E-4,1.3934030873852965E-4]
[36.916760421248867,12.089999999999913,1.2819072645430535E-4,1.2819072645430535E-4,1.2819072645430535E-4]
[37.093395638575416,12.099999999999913,1.1788613551316619E-4,1.1788613551316619E-4,1.1788613551316619E-4]
[37.270030855901972,12.109999999999912,1.0836652217916037E-4,1.0836652217916037E-4,1.0836652217916037E-4]
[37.446666073228521,12.119999999999912,9.9575804196098462E-5,9.9575804196098462E-5,9.9575804196098462E-5]
[37.623301290555077,12.129999999999912,9.1461599383271027E-5,9.1461599383271027E-5,9.1461599383271027E-5]
[37.799936507881633,12.139999999999912,8.3975005863298042E-5,8.3975005863298042E-5,8.3975005863298042E-5]
[37.976571725208181,12.149999999999912,7.707039348423286E-5,7.707039348423286E-5,7.707039348423286E-5]
[38.153206942534737,12.159999999999911,7.0705206003600458E-5,7.0705206003600458E-5,7.0705206003600458E-5]
[38.329842159861286,12.169999999999911,6.4839773608477537E-5,6.4839773608477537E-5,6.4839773608477537E-5]
[38.506477377187842,12.179999999999911,5.9437135352930646E-5,5.9437135352930646E-5,5.9437135352930646E-5]
[38.683112594514398,12.189999999999911,5.4462871102027792E-5,5.4462871102027792E-5,5.4462871102027792E-5]
[38.859747811840947,12.19999999999991,4.9884942580146407E-5,4.9884942580146407E-5,4.9884942580146407E-5]
[39.036383029167503,12.20999999999991,4.5673543130330107E-5,4.5673543130330107E-5,4.5673543130330107E-5]
[39.213018246494059,12.21999999999991,4.1800955800934303E-5,4.1800955800934303E-5,4.1800955800934303E-5]
[39.389653463820608,12.22999999999991,3.8241419385666245E-5,3.8241419385666245E-5,3.8241419385666245E-5]
[39.566288681147164,12.23999999999991,3.4971002053306656E-5,3.4971002053306656E-5,3.4971002053306656E-5]
[39.742923898473713,12.249999999999909,3.1967482213837018E-5,3.1967482213837018E-5,3.1967482213837018E-5]
[39.919559115800269,12.259999999999909,2.9210236278329801E-5,2.9210236278329801E-5,2.9210236278329801E-5]
[40.096194333126824,12.269999999999909,2.6680132980733716E-5,2.6680132980733716E-5,2.6680132980733716E-5]
[40.272829550453373,12.279999999999909,2.4359433940557653E-5,2.4359433940557653E-5,2.4359433940557653E-5]
[40.449464767779929,12.289999999999909,2.2231700156374218E-5,2.2231700156374218E-5,2.2231700156374218E-5]
[40.626099985106478,12.299999999999908,2.0281704130990596E-5,2.0281704130990596E-5,2.0281704130990596E-5]
[40.802735202433034,12.309999999999908,1.8495347340026941E-5,1.8495347340026941E-5,1.8495347340026941E-5]
[40.97937041975959,12.319999999999908,1.685958276647195E-5,1.685958276647195E-5,1.685958276647195E-5]
[41.156005637086139,12.329999999999908,1.5362342234514148E-5,1.5362342234514148E-5,1.5362342234514148E-5]
[41.332640854412695,12.339999999999907,1.3992468286552889E-5,1.3992468286552889E-5,1.3992468286552889E-5]
[41.509276071739244,12.349999999999907,1.2739650357745315E-5,1.2739650357745315E-5,1.2739650357745315E-5]
[41.6859112890658,12.359999999999907,1.1594365012724728E-5,1.1594365012724728E-5,1.1594365012724728E-5]
[41.862546506392356,12.369999999999907,1.0547820019211919E-5,1.0547820019211919E-5,1.0547820019211919E-5]
[42.039181723718904,12.379999999999907,9.5919020431135629E-6,9.5919020431135629E-6,9.5919020431135629E-6]
[42.21581694104546,12.389999999999906,8.7191277593510796E-6,8.7191277593510796E-6,8.7191277593510796E-6]
[42.392452158372009,12.399999999999906,7.922598182071286E-6,7.922598182071286E-6,7.922598182071286E-6]
[42.569087375698565,12.409999999999906,7.1959560270490272E-6,7.1959560270490272E-6,7.1959560270490272E-6]
[42.745722593025121,12.419999999999906,6.5333459279925033E-6,6.5333459279925033E-6,6.5333459279925033E-6]
[42.92235781035167,12.429999999999906,5.9293773370959906E-6,5.9293773370959906E-6,5.9293773370959906E-6]
[43.098993027678226,12.439999999999905,5.3790899485480153E-6,5.3790899485480153E-6,5.3790899485480153E-6]
[43.275628245004782,12.449999999999905,4.8779214917912538E-6,4.8779214917912538E-6,4.8779214917912538E-6]
[43.452263462331331,12.459999999999905,4.4216777491409743E-6,4.4216777491409743E-6,4.4216777491409743E-6]
[43.628898679657887,12.469999999999905,4.0065046599007574E-6,4.0065046599007574E-6,4.0065046599007574E-6]
[{"$f":"(B551-B$4)/B$11","v":43.805533896984436},12.479999999999905,{"$f":"NORMDIST(B551,B$4,B$5,0)","v":3.6288623803675035E-6},{"$f":"IF(C551<=B$14/2,C551,0)","v":3.6288623803675035E-6},{"$f":"IF(C551<=B$6/2,C551,0)","v":3.6288623803675035E-6}]
[43.982169114310992,12.489999999999904,3.2855011760932822E-6,3.2855011760932822E-6,3.2855011760932822E-6]
[44.158804331637548,{"$f":"B552+0.01","v":12.499999999999904},2.9734390294714477E-6,2.9734390294714477E-6,2.9734390294714477E-6]
[44.335439548964096,12.509999999999904,2.6899408521414789E-6,2.6899408521414789E-6,2.6899408521414789E-6]
[44.512074766290652,12.519999999999904,2.4324991978649997E-6,2.4324991978649997E-6,2.4324991978649997E-6]
[44.688709983617201,12.529999999999903,2.1988163774185546E-6,2.1988163774185546E-6,2.1988163774185546E-6]
[44.865345200943757,12.539999999999903,1.986787882681779E-6,1.986787882681779E-6,1.986787882681779E-6]
[45.041980418270313,12.549999999999903,1.7944870324784397E-6,1.7944870324784397E-6,1.7944870324784397E-6]
[45.218615635596862,12.559999999999903,1.6201507578578836E-6,1.6201507578578836E-6,1.6201507578578836E-6]
[45.395250852923418,12.569999999999903,1.4621664493921603E-6,1.4621664493921603E-6,1.4621664493921603E-6]
[45.571886070249967,12.579999999999902,1.3190597937163742E-6,1.3190597937163742E-6,1.3190597937163742E-6]
[45.748521287576523,12.589999999999902,1.1894835309627571E-6,1.1894835309627571E-6,1.1894835309627571E-6]
[45.925156504903079,12.599999999999902,1.0722070689406179E-6,1.0722070689406179E-6,1.0722070689406179E-6]
[46.101791722229628,12.609999999999902,9.6610689390092655E-7,9.6610689390092655E-7,9.6610689390092655E-7]
[46.278426939556184,12.619999999999902,8.701577215039215E-7,8.701577215039215E-7,8.701577215039215E-7]
[46.45506215688274,12.629999999999901,7.8342433518777594E-7,7.8342433518777594E-7,7.8342433518777594E-7]
[46.631697374209288,12.639999999999901,7.0505406252354529E-7,7.0505406252354529E-7,7.0505406252354529E-7]
[46.808332591535844,12.649999999999901,6.3426984334386106E-7,6.3426984334386106E-7,6.3426984334386106E-7]
[46.984967808862393,12.659999999999901,5.7036384645739907E-7,5.7036384645739907E-7,5.7036384645739907E-7]
[47.161603026188949,12.6699999999999,5.1269159461546322E-7,5.1269159461546322E-7,5.1269159461546322E-7]
[47.338238243515505,12.6799999999999,4.6066656008833471E-7,4.6066656008833471E-7,4.6066656008833471E-7]
[47.514873460842054,12.6899999999999,4.1375519574437563E-7,4.1375519574437563E-7,4.1375519574437563E-7]
[47.69150867816861,12.6999999999999,3.7147236891146043E-7,3.7147236891146043E-7,3.7147236891146043E-7]
[47.868143895495159,12.7099999999999,3.3337716754481956E-7,3.3337716754481956E-7,3.3337716754481956E-7]
[48.044779112821715,12.719999999999899,2.9906905033464666E-7,2.9906905033464666E-7,2.9906905033464666E-7]
[48.221414330148271,12.729999999999899,2.6818431436738989E-7,2.6818431436738989E-7,2.6818431436738989E-7]
[48.39804954747482,12.739999999999899,2.4039285581283106E-7,2.4039285581283106E-7,2.4039285581283106E-7]
[48.574684764801376,12.749999999999899,2.1539520085110544E-7,2.1539520085110544E-7,2.1539520085110544E-7]
[48.751319982127924,12.759999999999899,1.9291978568568323E-7,1.9291978568568323E-7,1.9291978568568323E-7]
[48.92795519945448,12.769999999999898,1.7272046601581461E-7,1.7272046601581461E-7,1.7272046601581461E-7]
[49.104590416781036,12.779999999999898,1.5457423777063331E-7,1.5457423777063331E-7,1.5457423777063331E-7]
[49.281225634107585,12.789999999999898,1.3827915224240565E-7,1.3827915224240565E-7,1.3827915224240565E-7]
[49.457860851434141,12.799999999999898,1.236524100034586E-7,1.236524100034586E-7,1.236524100034586E-7]
[49.634496068760697,12.809999999999897,1.1052861915512173E-7,1.1052861915512173E-7,1.1052861915512173E-7]
[49.811131286087246,12.819999999999897,9.875820454232317E-8,9.875820454232317E-8,9.875820454232317E-8]
[49.987766503413802,12.829999999999897,8.8205955578848947E-8,8.8205955578848947E-8,8.8205955578848947E-8]
[50.164401720740351,12.839999999999897,7.8749701270089321E-8,7.8749701270089321E-8,7.8749701270089321E-8]
[50.341036938066907,12.849999999999897,7.0279101896491571E-8,7.0279101896491571E-8,7.0279101896491571E-8]
[50.517672155393463,12.859999999999896,6.2694547635913748E-8,6.2694547635913748E-8,6.2694547635913748E-8]
[50.694307372720012,12.869999999999896,5.5906155160376038E-8,5.5906155160376038E-8,5.5906155160376038E-8]
[50.870942590046567,12.879999999999896,4.9832853945961641E-8,4.9832853945961641E-8,4.9832853945961641E-8]
[51.047577807373116,12.889999999999896,4.4401554687211501E-8,4.4401554687211501E-8,4.4401554687211501E-8]
[51.224213024699672,12.899999999999896,3.9546392812537254E-8,3.9546392812537254E-8,3.9546392812537254E-8]
[51.400848242026228,12.909999999999895,3.5208040658014593E-8,3.5208040658014593E-8,3.5208040658014593E-8]
[51.577483459352777,12.919999999999895,3.1333082376303439E-8,3.1333082376303439E-8,3.1333082376303439E-8]
[51.754118676679333,12.929999999999895,2.7873446138129144E-8,2.7873446138129144E-8,2.7873446138129144E-8]
[51.930753894005882,12.939999999999895,2.4785888628330898E-8,2.4785888628330898E-8,2.4785888628330898E-8]
[52.107389111332438,12.949999999999894,2.2031527249392092E-8,2.2031527249392092E-8,2.2031527249392092E-8]
[52.284024328658994,12.959999999999894,1.9575415824906837E-8,1.9575415824906837E-8,1.9575415824906837E-8]
[52.460659545985543,12.969999999999894,1.7386159945782274E-8,1.7386159945782274E-8,1.7386159945782274E-8]
[52.637294763312099,12.979999999999894,1.5435568425160579E-8,1.5435568425160579E-8,1.5435568425160579E-8]
[52.813929980638648,12.989999999999894,1.3698337625988989E-8,1.3698337625988989E-8,1.3698337625988989E-8]

{"sheet":"Sheet1","index":14,"n_rows":0,"n_cols":0,"rows_kept":0,"cut":false,"hidden":false,"merged":[]}