{"text_format":"1","workbook":"xlsx","n_sheets":32,"sheets":["Objectives","% Change & Rate","% Change & Rate (an)","WhatIsStatistics","Accounting","Accounting (an)","Finance","Finance (an)","Marketing","Marketing (an)","Production","Art","PT(1an)","Data Set","PT(2an)","ExcelTable","ExcelTable (an)","CrossSectional","TimeSeries","TimeSeries (2)","TimeSeries (2an)","Data","SM(1)","SM(2)","SM(3)","StatisticalStudies","DataAcquisition","Ethics","D & I","DescriptiveStatistics","InferentialStatisticsTerms","Science"],"not_rendered":{"charts":13,"images":2,"macros":1,"external_links":0,"defined_names":12,"comments":0,"pivot_tables":7},"unopened":[],"bounds":{"document_bytes":16777216,"sheet_cells":100000,"rows_first":2000,"rows_last":500,"rows_between":2000,"halvings":0,"cell_chars":16384,"cell_head_chars":4096},"cells_cut":0,"cells_raw":0,"read":"whole","date_system":"1900"}

{"sheet":"Objectives","index":0,"n_rows":9,"n_cols":1,"rows_kept":9,"cut":false,"hidden":false,"merged":[]}
["% Change & Rate"]
["Define Statistics"]
["Examples of Where Statistics are used"]
["Data & Data Sets and Terminology"]
["Excel Tables"]
["Cross Sectional and Time Series Data"]
["Scales Of Measurement"]
["Descriptive Statistics"]
["Inferential Statistics"]

{"sheet":"% Change & Rate","index":1,"n_rows":16,"n_cols":12,"rows_kept":16,"cut":false,"hidden":false,"merged":[]}
["Percentage Change Formula",null,null,"Ending Balance Rate Formula"]
["Begin Of Year Stock Value",25,null,"Increase Sales by 10%",null,null,"Increase Sales by 10%",null,null,"Decrease Sales by 10%"]
["End of Year Stock Value",30.25]
["Amount of Change = End - Beg",null,null,"Jan","Feb",null,"Jan","Feb",null,"Jan","Feb"]
["Amount of Change/Beg",null,null,100,null,null,100,null,null,100,null,"% Change"]
["(End - Beg)/Beg",null,null,null,null,null,null,null,null,100,null,"End Balance Rate"]
["End/Beg-1",null,null,"Ending Balance Rate",1.1000000000000001,null,"% Change",0.1,null,"% Change",-0.1]
[]
[null,null,null,null,"100 * 10% = 10",null,null,null,null,"Beg",100]
[null,null,null,null,"100 + 10 = 110",null,null,null,null,"End",90]
[null,null,null,null,"100 + 100 * 10%",null,null,null,null,"% Change"]
[null,null,null,null,"100*1 + 100 * 10%",null,null,null,null,"End Balance Rate"]
[null,null,null,null,"100*(1 + 10%)"]
["Apply General Number Formatting (wipes away all",null,null,null,"100*(1 + 0.1)"]
["other Number Formatting) ==> Ctrl + Shift + ~",null,null,null,"100*(1.1)"]
[null,null,null,null,"100*1.1"]

{"sheet":"% Change & Rate (an)","index":2,"n_rows":16,"n_cols":12,"rows_kept":16,"cut":false,"hidden":false,"merged":[]}
["Percentage Change Formula",null,null,"Ending Balance Rate Formula"]
["Begin Of Year Stock Value",25,null,"Increase Sales by 10%",null,null,"Increase Sales by 10%",null,null,"Decrease Sales by 10%"]
["End of Year Stock Value",30.25]
["Amount of Change = End - Beg",{"$f":"B3-B2","v":5.25},null,"Jan","Feb",null,"Jan","Feb",null,"Jan","Feb"]
["Amount of Change/Beg",{"$f":"B4/B2","v":0.21},null,100,{"$f":"D5*E7","v":110.00000000000001},null,100,{"$f":"G5*(1+H7)","v":110.00000000000001},null,100,{"$f":"J5*(1+K7)","v":90},"% Change"]
["(End - Beg)/Beg",{"$f":"(B3-B2)/B2","v":0.21},null,null,null,null,null,null,null,100,{"$f":"J6*K12","v":90},"End Balance"]
["End/Beg-1",{"$f":"B3/B2-1","v":0.20999999999999996},null,"Ending Balance Rate",1.1000000000000001,null,"% Change",0.1,null,"% Change",-0.1]
[]
[null,null,null,null,"100 * 10% = 10",null,null,null,null,"Beg",100]
[null,null,null,null,"100 + 10 = 110",null,null,null,null,"End",90]
[null,null,null,null,"100 + 100 * 10%",null,null,null,null,"% Change",{"$f":"K10/K9-1","v":-9.9999999999999978E-2}]
[null,null,null,null,"100*1 + 100 * 10%",null,null,null,null,"End Balance Rate",{"$f":"1+K11","v":0.9}]
[null,null,null,null,"100*(1 + 10%)"]
["Apply General Number Formatting (wipes away all",null,null,null,"100*(1 + 0.1)"]
["other Number Formatting) ==> Ctrl + Shift + ~",null,null,null,"100*(1.1)"]
[null,null,null,null,"100*1.1"]

{"sheet":"WhatIsStatistics","index":3,"n_rows":8,"n_cols":1,"rows_kept":8,"cut":false,"hidden":false,"merged":[]}
["A \"Statistic\" can be a numerical fact, like Google has a \"5%\" return last month or the test average was 79 points."]
["Statistics as a discipline = The Art And Science Of Collecting, Analyzing, Presenting, And Interpreting Data."]
["Art because we have to be artful in the way we preset data."]
["Science because we must use the Scientific Methods of Experiment and Probability."]
["Statistics are used everywhere"]
["Data are small chunks such as first name, profit for month. Data is not information. Information is data presented in a useful way."]
["Interpreting Data means that we make useful information from data (using statistics) so that we can make decisions."]
["Because the future is always uncertain, we use statistics to interpret past data so that we can make decisions about the future (and hopefully reduce future uncertainty)."]

{"sheet":"Accounting","index":4,"n_rows":86,"n_cols":5,"rows_kept":86,"cut":false,"hidden":false,"merged":[]}
["Accounting/Auditing: Taking Samples of Invoices (Chapter 7)"]
[]
[]
[]
["Invoice","Amount",null,null,"Every kth"]
[1027,4063,null,{"$f":"MOD(ROW(A6),E$6)=0","v":true},6]
[1028,1175]
[1029,550]
[1030,411]
[1031,4152]
[1032,575]
[1033,922]
[1034,1249]
[1035,5073]
[1036,542]
[1037,511]
[1038,838]
[1039,5431]
[1040,667]
[1041,665]
[1042,762]
[1043,3145]
[1044,938]
[1045,1182]
[1046,981]
[1047,5400]
[1048,458]
[1049,622]
[1050,1074]
[1051,5611]
[1052,966]
[1053,545]
[1054,558]
[1055,4239]
[1056,1168]
[1057,518]
[1058,444]
[1059,4048]
[1060,1187]
[1061,1054]
[1062,777]
[1063,2237]
[1064,1039]
[1065,405]
[1066,756]
[1067,4499]
[1068,709]
[1069,1141]
[1070,1205]
[1071,2273]
[1072,695]
[1073,988]
[1074,996]
[1075,4690]
[1076,427]
[1077,439]
[1078,666]
[1079,4315]
[1080,1075]
[1081,532]
[1082,764]
[1083,5505]
[1084,688]
[1085,673]
[1086,440]
[1087,4013]
[1088,505]
[1089,874]
[1090,1121]
[1091,4512]
[1092,510]
[1093,816]
[1094,878]
[1095,4265]
[1096,828]
[1097,471]
[1098,549]
[1099,5590]
[1100,1211]
[1101,860]
[1102,1191]
[1103,2323]
[1104,939]
[1105,895]
[1106,592]
[1107,4111]

{"sheet":"Accounting (an)","index":5,"n_rows":86,"n_cols":5,"rows_kept":86,"cut":false,"hidden":false,"merged":[]}
["Accounting/Auditing: Taking Samples of Invoices (Chapter 7)"]
[]
[]
[]
["Invoice","Amount",null,null,"Every kth"]
[1027,4063,null,{"$f":"MOD(ROW(A6),E$6)=0","v":true},6]
[1028,1175]
[1029,550,null,"Invoice","Amount"]
[1030,411,null,1027,4063]
[1031,4152,null,1033,922]
[1032,575,null,1039,5431]
[1033,922,null,1045,1182]
[1034,1249,null,1051,5611]
[1035,5073,null,1057,518]
[1036,542,null,1063,2237]
[1037,511,null,1069,1141]
[1038,838,null,1075,4690]
[1039,5431,null,1081,532]
[1040,667,null,1087,4013]
[1041,665,null,1093,816]
[1042,762,null,1099,5590]
[1043,3145,null,1105,895]
[1044,938]
[1045,1182]
[1046,981]
[1047,5400]
[1048,458]
[1049,622]
[1050,1074]
[1051,5611]
[1052,966]
[1053,545]
[1054,558]
[1055,4239]
[1056,1168]
[1057,518]
[1058,444]
[1059,4048]
[1060,1187]
[1061,1054]
[1062,777]
[1063,2237]
[1064,1039]
[1065,405]
[1066,756]
[1067,4499]
[1068,709]
[1069,1141]
[1070,1205]
[1071,2273]
[1072,695]
[1073,988]
[1074,996]
[1075,4690]
[1076,427]
[1077,439]
[1078,666]
[1079,4315]
[1080,1075]
[1081,532]
[1082,764]
[1083,5505]
[1084,688]
[1085,673]
[1086,440]
[1087,4013]
[1088,505]
[1089,874]
[1090,1121]
[1091,4512]
[1092,510]
[1093,816]
[1094,878]
[1095,4265]
[1096,828]
[1097,471]
[1098,549]
[1099,5590]
[1100,1211]
[1101,860]
[1102,1191]
[1103,2323]
[1104,939]
[1105,895]
[1106,592]
[1107,4111]

{"sheet":"Finance","index":6,"n_rows":11,"n_cols":3,"rows_kept":11,"cut":false,"hidden":false,"merged":[]}
["Finance and Economics: Projecting Stock Returns (Chapter 5)"]
[]
["Estimates For Stock A"]
["State of Economy","Probability of State","Stock return if state occurs"]
["Good",0.25,0.17]
["Fair",0.55000000000000004,0.12]
["Poor",{"$f":"1-SUM(B5:B6)","v":0.19999999999999996},3.5000000000000003E-2]
[]
[null,"Expected Return"]
[]
[null,"**Individual Number: \"A Statistic\""]

{"sheet":"Finance (an)","index":7,"n_rows":11,"n_cols":3,"rows_kept":11,"cut":false,"hidden":false,"merged":[]}
["Finance and Economics: Projecting Stock Returns (Chapter 5)"]
[]
["Estimates For Stock A"]
["State of Economy","Probability of State","Stock return if state occurs"]
["Good",0.25,0.17]
["Fair",0.55000000000000004,0.12]
["Poor",{"$f":"1-SUM(B5:B6)","v":0.19999999999999996},3.5000000000000003E-2]
[]
[null,"Expected Return",{"$f":"SUMPRODUCT(B5:B7,C5:C7)","v":0.11550000000000002}]
[]
[null,"**Individual Number: \"A Statistic\""]

{"sheet":"Marketing","index":8,"n_rows":16,"n_cols":8,"rows_kept":16,"cut":false,"hidden":false,"merged":[]}
["Marketing: Frequency of Sales Tables and Pie Charts (Chapter 2)"]
[null,null,null,null,null,null,null,"Better"]
["Car Type Sold",null,"Car Type Sold","Frequency","% Frequency\nRelative Frequency"]
["Toyota",null,"Toyota"]
["Honda",null,"Honda"]
["Toyota",null,"Ford"]
["Ford",null,"Subaru"]
["Honda",null,"Total"]
["Toyota"]
["Honda"]
["Toyota"]
["Ford"]
["Honda"]
["Toyota"]
["Subaru"]
["Subaru"]

{"sheet":"Marketing (an)","index":9,"n_rows":16,"n_cols":8,"rows_kept":16,"cut":false,"hidden":false,"merged":[]}
["Marketing: Frequency of Sales Tables and Pie Charts (Chapter 2)"]
[null,null,null,null,null,null,null,"Better"]
["Car Type Sold",null,"Car Type Sold","Frequency","% Frequency\nRelative Frequency"]
["Toyota",null,"Toyota",{"$f":"COUNTIF($A$4:$A$16,C4)","v":5},{"$f":"D4/$D$8","v":0.38461538461538464}]
["Honda",null,"Honda",{"$f":"COUNTIF($A$4:$A$16,C5)","v":4},{"$f":"D5/$D$8","v":0.30769230769230771}]
["Toyota",null,"Ford",2,0.15384615384615385]
["Ford",null,"Subaru",2,0.15384615384615385]
["Honda",null,"Total",{"$f":"SUM(D4:D7)","v":13},{"$f":"SUM(E4:E7)","v":1}]
["Toyota"]
["Honda"]
["Toyota"]
["Ford"]
["Honda"]
["Toyota"]
["Subaru"]
["Subaru"]

{"sheet":"Production","index":10,"n_rows":602,"n_cols":8,"rows_kept":602,"cut":false,"hidden":false,"merged":[]}
["Production: Sampling box weight to see if filling machine is filling accurately (chapter 9)"]
["H0 : Mu = 10 grams"]
["H1 : Mu <> 10 grams"]
["Historical Average =",10,"grams"]
["Historical Standard Deviation =",0.5,"grams"]
["Level of Significance =",0.05]
["Level of Significance Divided by 2 =",{"$f":"B6/2","v":2.5000000000000001E-2}]
["Sample Mean = AVERAGE =",{"$f":"AVERAGE(A22:A99)","v":9.906153846153849},"grams"]
["Sample Standard Deviation = STDEV =",{"$f":"STDEV(A22:A99)","v":0.23859088915466239},"grams"]
["Sample size = COUNT =",{"$f":"COUNT($A$22:$A$99)","v":78}]
["Standard Error",{"$f":"B5/SQRT(B10)","v":5.6613851707229781E-2},"grams"]
["z",{"$f":"(B8-B4)/B11","v":-1.6576535779876385}]
["X",{"$f":"B12*B11+B4","v":9.906153846153849},{"$f":"D102","v":"P(9.906)"},null,null,null,null,{"$f":"VLOOKUP(B13,B103:C602,2)","v":0.7820853879508991}]
["p-value =",{"$f":"IF(B8<B4,2*NORMDIST(B8,B4,B5/SQRT(B10),1),2*(1-NORMDIST(B8,B4,B5/SQRT(B10),1)))","v":9.7387408736488323E-2}]
["p-value =",{"$f":"2*(1-NORMSDIST(ABS(B12)))","v":9.7387408736488323E-2}]
[{"$f":"IF(B15>B6,\"Because the p-value is greater than our alpha, it is reasonable to assume that the machine is filling accurately\",\" Because the p-value is less than or equal to our alpha, it is reasonable to assume that the machine is not filling accurately\")","v":"Because the p-value is greater than our alpha, it is reasonable to assume that the machine is filling accurately"}]
[]
[]
[]
[]
["Sample data"]
[{"$f":"RANDBETWEEN(9500,10300)/1000","v":9.8689999999999998}]
[10.191000000000001]
[10.042]
[9.907]
[9.73]
[10.297000000000001]
[10.144]
[9.8149999999999995]
[9.6620000000000008]
[9.5960000000000001]
[10.016]
[9.7140000000000004]
[9.5]
[9.6920000000000002]
[10.215999999999999]
[9.7319999999999993]
[9.7149999999999999]
[10.238]
[9.8230000000000004]
[10.215]
[9.9860000000000007]
[9.8320000000000007]
[9.6679999999999993]
[10.218999999999999]
[9.702]
[9.6709999999999994]
[10.164]
[10.138]
[10.137]
[10.1]
[9.9629999999999992]
[9.6329999999999991]
[9.7409999999999997]
[10.08]
[9.7569999999999997]
[9.6059999999999999]
[9.9550000000000001]
[10.252000000000001]
[9.5440000000000005]
[9.9939999999999998]
[10.039999999999999]
[9.51]
[9.9949999999999992]
[9.7989999999999995]
[10.236000000000001]
[9.5220000000000002]
[10.166]
[9.6219999999999999]
[10.045]
[9.609]
[9.577]
[10.195]
[9.8290000000000006]
[9.9619999999999997]
[10.16]
[10.026999999999999]
[9.6219999999999999]
[9.6310000000000002]
[9.5229999999999997]
[10.137]
[10.125]
[9.9930000000000003]
[10.239000000000001]
[9.8889999999999993]
[{"$f":"RANDBETWEEN(9500,10300)/1000","v":10.090999999999999}]
[9.9659999999999993]
[9.7680000000000007]
[9.7569999999999997]
[9.6910000000000007]
[9.9290000000000003]
[10.042999999999999]
[10.045999999999999]
[9.9009999999999998]
[9.5660000000000007]
[10.234]
[10.244]
[10.218]
[9.5169999999999995]
[]
["Chart Data:"]
["z","X","P(Exactly x)",{"$f":"\"P(\"&ROUND(B8,3)&\")\"","v":"P(9.906)"},"P(alpha)"]
[{"$f":"(B103-B$4)/B$11","v":-35.327043465311391},8,{"$f":"NORMDIST(B103,B$4,B$5,0)","v":2.6766045152977074E-4},{"$f":"IF(C103<=B$14/2,C103,0)","v":2.6766045152977074E-4},{"$f":"IF(C103<=B$6/2,C103,0)","v":2.6766045152977074E-4}]
[-35.150408247984835,{"$f":"B103+0.01","v":8.01},2.8989512084778157E-4,2.8989512084778157E-4,2.8989512084778157E-4]
[-34.973773030658286,{"$f":"B104+0.01","v":8.02},3.1385126813106339E-4,3.1385126813106339E-4,3.1385126813106339E-4]
[-34.79713781333173,8.0299999999999994,3.3965119885868533E-4,3.3965119885868533E-4,3.3965119885868533E-4]
[-34.620502596005181,8.0399999999999991,3.6742499600491161E-4,3.6742499600491161E-4,3.6742499600491161E-4]
[-34.443867378678625,8.0499999999999989,3.9731094278554186E-4,3.9731094278554186E-4,3.9731094278554186E-4]
[-34.267232161352069,8.0599999999999987,4.2945596300072948E-4,4.2945596300072948E-4,4.2945596300072948E-4]
[-34.090596944025521,8.0699999999999985,4.640160793138794E-4,4.640160793138794E-4,4.640160793138794E-4]
[-33.913961726698965,8.0799999999999983,5.0115688978171489E-4,5.0115688978171489E-4,5.0115688978171489E-4]
[-33.737326509372416,8.0899999999999981,5.4105406292303377E-4,5.4105406292303377E-4,5.4105406292303377E-4]
[-33.56069129204586,8.0999999999999979,5.8389385158291068E-4,5.8389385158291068E-4,5.8389385158291068E-4]
[-33.384056074719304,8.1099999999999977,6.2987362581503248E-4,6.2987362581503248E-4,6.2987362581503248E-4]
[-33.207420857392755,8.1199999999999974,6.7920242496729633E-4,6.7920242496729633E-4,6.7920242496729633E-4]
[-33.030785640066199,8.1299999999999972,7.3210152911465571E-4,7.3210152911465571E-4,7.3210152911465571E-4]
[-32.854150422739643,8.139999999999997,7.8880504993829564E-4,7.8880504993829564E-4,7.8880504993829564E-4]
[-32.677515205413094,8.1499999999999968,8.4956054110148335E-4,8.4956054110148335E-4,8.4956054110148335E-4]
[-32.500879988086538,8.1599999999999966,9.1462962811969084E-4,9.1462962811969084E-4,9.1462962811969084E-4]
[-32.324244770759989,8.1699999999999964,9.8428865766576087E-4,9.8428865766576087E-4,9.8428865766576087E-4]
[-32.147609553433433,8.1799999999999962,1.0588293661898404E-3,1.0588293661898404E-3,1.0588293661898404E-3]
[-31.970974336106881,8.1899999999999959,1.1385595676684718E-3,1.1385595676684718E-3,1.1385595676684718E-3]
[-31.794339118780329,8.1999999999999957,1.2238038602275069E-3,1.2238038602275069E-3,1.2238038602275069E-3]
[-31.617703901453773,8.2099999999999955,1.3149043513093108E-3,1.3149043513093108E-3,1.3149043513093108E-3]
[-31.44106868412722,8.2199999999999953,1.412221400976026E-3,1.412221400976026E-3,1.412221400976026E-3]
[-31.264433466800668,8.2299999999999951,1.5161343828573679E-3,1.5161343828573679E-3,1.5161343828573679E-3]
[-31.087798249474115,8.2399999999999949,1.6270424621635578E-3,1.6270424621635578E-3,1.6270424621635578E-3]
[-30.911163032147563,8.2499999999999947,1.7453653900914553E-3,1.7453653900914553E-3,1.7453653900914553E-3]
[-30.734527814821007,8.2599999999999945,1.8715443138548878E-3,1.8715443138548878E-3,1.8715443138548878E-3]
[-30.557892597494455,8.2699999999999942,2.006042601468395E-3,2.006042601468395E-3,2.006042601468395E-3]
[-30.381257380167902,8.279999999999994,2.1493466803073815E-3,2.1493466803073815E-3,2.1493466803073815E-3]
[-30.20462216284135,8.2899999999999938,2.3019668883568706E-3,2.3019668883568706E-3,2.3019668883568706E-3]
[-30.027986945514794,8.2999999999999936,2.4644383369459301E-3,2.4644383369459301E-3,2.4644383369459301E-3]
[-29.851351728188241,8.3099999999999934,2.6373217836453645E-3,2.6373217836453645E-3,2.6373217836453645E-3]
[-29.674716510861689,8.3199999999999932,2.8212045138826369E-3,2.8212045138826369E-3,2.8212045138826369E-3]
[-29.498081293535137,8.329999999999993,3.0167012297004727E-3,3.0167012297004727E-3,3.0167012297004727E-3]
[-29.321446076208584,8.3399999999999928,3.2244549439540918E-3,3.2244549439540918E-3,3.2244549439540918E-3]
[-29.144810858882028,8.3499999999999925,3.4451378781071912E-3,3.4451378781071912E-3,3.4451378781071912E-3]
[-28.968175641555476,8.3599999999999923,3.6794523616483724E-3,3.6794523616483724E-3,3.6794523616483724E-3]
[-28.791540424228923,8.3699999999999921,3.9281317310085493E-3,3.9281317310085493E-3,3.9281317310085493E-3]
[-28.614905206902371,8.3799999999999919,4.1919412257156678E-3,4.1919412257156678E-3,4.1919412257156678E-3]
[-28.438269989575815,8.3899999999999917,4.4716788793768385E-3,4.4716788793768385E-3,4.4716788793768385E-3]
[-28.261634772249263,8.3999999999999915,4.7681764029294266E-3,4.7681764029294266E-3,4.7681764029294266E-3]
[-28.08499955492271,8.4099999999999913,5.0823000574527627E-3,5.0823000574527627E-3,5.0823000574527627E-3]
[-27.908364337596158,8.419999999999991,5.4149515136810971E-3,5.4149515136810971E-3,5.4149515136810971E-3]
[-27.731729120269605,8.4299999999999908,5.7670686952065453E-3,5.7670686952065453E-3,5.7670686952065453E-3]
[-27.555093902943049,8.4399999999999906,6.1396266022091268E-3,6.1396266022091268E-3,6.1396266022091268E-3]
[-27.378458685616497,8.4499999999999904,6.5336381123994548E-3,6.5336381123994548E-3,6.5336381123994548E-3]
[-27.201823468289945,8.4599999999999902,6.950154755709456E-3,6.950154755709456E-3,6.950154755709456E-3]
[-27.025188250963392,8.46999999999999,7.390267459117617E-3,7.390267459117617E-3,7.390267459117617E-3]
[-26.848553033636836,8.4799999999999898,7.8551072578490703E-3,7.8551072578490703E-3,7.8551072578490703E-3]
[-26.671917816310284,8.4899999999999896,8.3458459690473989E-3,8.3458459690473989E-3,8.3458459690473989E-3]
[-26.495282598983732,8.4999999999999893,8.8636968238754478E-3,8.8636968238754478E-3,8.8636968238754478E-3]
[-26.318647381657179,8.5099999999999891,9.4099150538673494E-3,9.4099150538673494E-3,9.4099150538673494E-3]
[-26.142012164330627,8.5199999999999889,9.9857984272240952E-3,9.9857984272240952E-3,9.9857984272240952E-3]
[-25.965376947004071,8.5299999999999887,1.0592687730621334E-2,1.0592687730621334E-2,1.0592687730621334E-2]
[-25.788741729677518,8.5399999999999885,1.1231967191981178E-2,1.1231967191981178E-2,1.1231967191981178E-2]
[-25.612106512350966,8.5499999999999883,1.1905064839550903E-2,1.1905064839550903E-2,1.1905064839550903E-2]
[-25.435471295024414,8.5599999999999881,1.2613452792530983E-2,1.2613452792530983E-2,1.2613452792530983E-2]
[-25.258836077697861,8.5699999999999878,1.3358647478404305E-2,1.3358647478404305E-2,1.3358647478404305E-2]
[-25.082200860371305,8.5799999999999876,1.4142209772037907E-2,1.4142209772037907E-2,1.4142209772037907E-2]
[-24.905565643044753,8.5899999999999874,1.4965745051560056E-2,1.4965745051560056E-2,1.4965745051560056E-2]
[-24.7289304257182,8.5999999999999872,1.5830903165958796E-2,1.5830903165958796E-2,1.5830903165958796E-2]
[-24.552295208391648,8.609999999999987,1.6739378309304848E-2,1.6739378309304848E-2,1.6739378309304848E-2]
[-24.375659991065092,8.6199999999999868,1.7692908796473155E-2,1.7692908796473155E-2,1.7692908796473155E-2]
[-24.19902477373854,8.6299999999999866,1.8693276735223197E-2,1.8693276735223197E-2,1.8693276735223197E-2]
[{"$f":"(B167-B$4)/B$11","v":-24.022389556411987},8.6399999999999864,{"$f":"NORMDIST(B167,B$4,B$5,0)","v":1.9742307589500806E-2},{"$f":"IF(C167<=B$14/2,C167,0)","v":1.9742307589500806E-2},{"$f":"IF(C167<=B$6/2,C167,0)","v":1.9742307589500806E-2}]
[-23.845754339085435,8.6499999999999861,2.0841869628843636E-2,2.0841869628843636E-2,2.0841869628843636E-2]
[-23.669119121758882,{"$f":"B168+0.01","v":8.6599999999999859},2.1993873258809502E-2,2.1993873258809502E-2,2.1993873258809502E-2]
[-23.492483904432326,8.6699999999999857,2.3200270227403372E-2,2.3200270227403372E-2,2.3200270227403372E-2]
[-23.315848687105774,8.6799999999999855,2.4463052702554073E-2,2.4463052702554073E-2,2.4463052702554073E-2]
[-23.139213469779222,8.6899999999999853,2.5784252215788624E-2,2.5784252215788624E-2,0]
[-22.962578252452669,8.6999999999999851,2.716593846736913E-2,2.716593846736913E-2,0]
[-22.785943035126113,8.7099999999999849,2.8610217988297156E-2,2.8610217988297156E-2,0]
[-22.609307817799561,8.7199999999999847,3.0119232654752533E-2,3.0119232654752533E-2,0]
[-22.432672600473008,8.7299999999999844,3.1695158050719131E-2,3.1695158050719131E-2,0]
[-22.256037383146456,8.7399999999999842,3.3340201674759477E-2,3.3340201674759477E-2,0]
[-22.079402165819904,8.749999999999984,3.505660098713427E-2,3.505660098713427E-2,0]
[-21.902766948493348,8.7599999999999838,3.6846621293721134E-2,3.6846621293721134E-2,0]
[-21.726131731166795,8.7699999999999836,3.8712553463470793E-2,3.8712553463470793E-2,0]
[-21.549496513840243,8.7799999999999834,4.0656711476448372E-2,4.0656711476448372E-2,0]
[-21.37286129651369,8.7899999999999832,4.2681429799842081E-2,4.2681429799842081E-2,0]
[-21.196226079187134,8.7999999999999829,4.4789060589682121E-2,4.4789060589682121E-2,0]
[-21.019590861860582,8.8099999999999827,4.6981970716398869E-2,4.6981970716398869E-2,0]
[-20.84295564453403,8.8199999999999825,4.9262538612760948E-2,0,0]
[-20.666320427207477,8.8299999999999823,5.1633150943171099E-2,0,0]
[-20.489685209880925,8.8399999999999821,5.4096199093759061E-2,0,0]
[-20.313049992554369,8.8499999999999819,5.6654075483197612E-2,0,0]
[-20.136414775227816,8.8599999999999817,5.9309169694677581E-2,0,0]
[-19.959779557901264,8.8699999999999815,6.2063864430011308E-2,0,0]
[-19.783144340574712,8.8799999999999812,6.4920531287389477E-2,0,0]
[-19.606509123248156,8.889999999999981,6.7881526364892669E-2,0,0]
[-19.429873905921603,8.8999999999999808,7.0949185692456895E-2,0,0]
[-19.253238688595051,8.9099999999999806,7.412582049560669E-2,0,0]
[-19.076603471268498,8.9199999999999804,7.741371229490468E-2,0,0]
[-18.899968253941946,8.9299999999999802,8.081510784571376E-2,0,0]
[-18.72333303661539,8.93999999999998,8.4332213923533475E-2,0,0]
[-18.546697819288838,8.9499999999999797,8.7967191960846916E-2,0,0]
[-18.370062601962285,8.9599999999999795,9.172215254210199E-2,0,0]
[-18.193427384635733,8.9699999999999793,9.5599149764145921E-2,0,0]
[-18.016792167309177,8.9799999999999791,9.9600175470133057E-2,0,0]
[-17.840156949982624,8.9899999999999789,0.10372715336563228,0,0]
[-17.663521732656072,8.9999999999999787,0.10798193302636691,0,0]
[-17.48688651532952,9.0099999999999785,0.11236628380772651,0,0]
[-17.310251298002967,9.0199999999999783,0.11688188866689296,0,0]
[-17.133616080676411,9.029999999999978,0.12153033790911921,0,0]
[-16.956980863349859,9.0399999999999778,0.12631312287038651,0,0]
[-16.780345646023306,9.0499999999999776,0.13123162954934203,0,0]
[-16.603710428696754,9.0599999999999774,0.13628713220207755,0,0]
[-16.427075211370198,9.0699999999999772,0.14148078691395477,0,0]
[-16.250439994043646,9.079999999999977,0.14681362516330135,0,0]
[-16.073804776717093,9.0899999999999768,0.15228654739240177,0,0]
[-15.897169559390541,9.0999999999999766,0.157900316601775,0,0]
[-15.720534342063987,9.1099999999999763,0.16365555198427184,0,0]
[-15.543899124737434,9.1199999999999761,0.16955272261603022,0,0]
[-15.36726390741088,9.1299999999999759,0.17559214122179656,0,0]
[-15.190628690084328,9.1399999999999757,0.18177395803255053,0,0]
[-15.013993472757774,9.1499999999999755,0.18809815475375818,0,0]
[-14.837358255431221,9.1599999999999753,0.19456453866291884,0,0]
[-14.660723038104669,9.1699999999999751,0.20117273685536449,0,0]
[-14.484087820778115,9.1799999999999748,0.20792219065751125,0,0]
[-14.307452603451562,9.1899999999999746,0.21481215022694999,0,0]
[-14.130817386125008,9.1999999999999744,0.22184166935889293,0,0]
[-13.954182168798456,9.2099999999999742,0.22900960051856609,0,0]
[-13.777546951471901,9.219999999999974,0.23631459011914541,0,0]
[-13.600911734145349,9.2299999999999738,0.24375507406478383,0,0]
[-13.424276516818795,9.2399999999999736,0.2513292735781561,0,0]
[-13.247641299492242,9.2499999999999734,0.25903519133176273,0,0]
[-13.07100608216569,9.2599999999999731,0.26687060790198341,0,0]
[-12.894370864839136,9.2699999999999729,0.27483307856454181,0,0]
[{"$f":"(B231-B$4)/B$11","v":-12.717735647512583},9.2799999999999727,{"$f":"NORMDIST(B231,B$4,B$5,0)","v":0.28291993044965535},{"$f":"IF(C231<=B$14/2,C231,0)","v":0},{"$f":"IF(C231<=B$6/2,C231,0)","v":0}]
[-12.541100430186029,9.2899999999999725,0.29112826007467246,0,0]
[-12.364465212859477,{"$f":"B232+0.01","v":9.2999999999999723},0.2994549312714665,0,0]
[-12.187829995532923,9.3099999999999721,0.30789657352524369,0,0]
[-12.01119477820637,9.3199999999999719,0.31644958074074186,0,0]
[-11.834559560879816,9.3299999999999716,0.3251101104510436,0,0]
[-11.657924343553264,9.3399999999999714,0.33387408348340253,0,0]
[-11.481289126226711,9.3499999999999712,0.34273718409558906,0,0]
[-11.304653908900157,9.359999999999971,0.35169486059529864,0,0]
[-11.128018691573605,9.3699999999999708,0.36074232645413418,0,0]
[-10.95138347424705,9.3799999999999706,0.36987456192658363,0,0]
[-10.774748256920498,9.3899999999999704,0.37908631618325306,0,0]
[-10.598113039593944,9.3999999999999702,0.38837210996639809,0,0]
[-10.421477822267391,9.4099999999999699,0.39772623877452357,0,0]
[-10.244842604940839,9.4199999999999697,0.40714277658149028,0,0]
[-10.068207387614285,9.4299999999999695,0.41661558009418775,0,0]
[-9.8915721702877324,9.4399999999999693,0.42613829355140648,0,0]
[-9.7149369529611782,9.4499999999999691,0.43570435406507141,0,0]
[-9.5383017356346258,9.4599999999999689,0.44530699750349234,0,0]
[-9.3616665183080716,9.4699999999999687,0.45493926491474157,0,0]
[-9.1850313009815192,9.4799999999999685,0.46459400948670193,0,0]
[-9.008396083654965,9.4899999999999682,0.47426390403872848,0,0]
[-8.8317608663284126,9.499999999999968,0.48394144903825581,0,0]
[-8.6551256490018602,9.5099999999999678,0.49361898113405428,0,0]
[-8.478490431675306,9.5199999999999676,0.50328868219620293,0,0]
[-8.3018552143487536,9.5299999999999674,0.51294258885120925,0,0]
[-8.1252199970221994,9.5399999999999672,0.52257260249907467,0,0]
[-7.948584779695647,9.549999999999967,0.53217049979747799,0,0]
[-7.7719495623690937,9.5599999999999667,0.54172794359664433,0,0]
[-7.5953143450425404,9.5699999999999665,0.55123649430688171,0,0]
[-7.4186791277159871,9.5799999999999663,0.56068762167920938,0,0]
[-7.2420439103894338,9.5899999999999661,0.57007271697798279,0,0]
[-7.0654086930628806,9.5999999999999659,0.57938310552293393,0,0]
[-6.8887734757363273,9.6099999999999657,0.58861005957661872,0,0]
[-6.712138258409774,9.6199999999999655,0.5977448115518742,0,0]
[-6.5355030410832207,9.6299999999999653,0.60677856751256898,0,0]
[-6.3588678237566683,9.639999999999965,0.61570252093967492,0,0]
[-6.182232606430115,9.6499999999999648,0.62450786673349179,0,0]
[-6.0055973891035617,9.6599999999999646,0.63318581542175512,0,0]
[-5.8289621717770084,9.6699999999999644,0.64172760754231495,0,0]
[-5.6523269544504551,9.6799999999999642,0.65012452816813449,0,0]
[-5.4756917371239018,9.689999999999964,0.65836792154150015,0,0]
[-5.2990565197973485,9.6999999999999638,0.66644920578357036,0,0]
[-5.1224213024707952,9.7099999999999635,0.67435988764473265,0,0]
[-4.9457860851442428,9.7199999999999633,0.68209157726067715,0,0]
[-4.7691508678176895,9.7299999999999631,0.68963600287863924,0,0]
[-4.5925156504911362,9.7399999999999629,0.69698502551792219,0,0]
[-4.4158804331645829,9.7499999999999627,0.70413065352857274,0,0]
[-4.2392452158380296,9.7599999999999625,0.71106505701196854,0,0]
[-4.0626099985114763,9.7699999999999623,0.7177805820670643,0,0]
[-3.8859747811849235,9.7799999999999621,0.72426976482616023,0,0]
[-3.7093395638583702,9.7899999999999618,0.73052534524428447,0,0]
[-3.5327043465318169,9.7999999999999616,0.73654028060662402,0,0]
[-3.3560691292052636,9.8099999999999614,0.74230775871891019,0,0]
[-3.1794339118787103,9.8199999999999612,0.74782121074623586,0,0]
[-3.0027986945521574,9.829999999999961,0.75307432366648797,0,0]
[-2.8261634772256041,9.8399999999999608,0.75806105230538434,0,0]
[-2.6495282598990508,9.8499999999999606,0.76277563092103018,0,0]
[-2.4728930425724975,9.8599999999999604,0.76721258430694006,0,0]
[-2.2962578252459447,9.8699999999999601,0.77136673838361614,0,0]
[-2.1196226079193914,9.8799999999999599,0.77523323025001334,0,0]
[-1.9429873905928381,9.8899999999999597,0.77880751766756706,0,0]
[-1.766352173266285,9.8999999999999595,0.7820853879508991,0,0]
[-1.5897169559397317,9.9099999999999593,0.78506296624084626,0,0]
[{"$f":"(B295-B$4)/B$11","v":-1.4130817386131787},9.9199999999999591,{"$f":"NORMDIST(B295,B$4,B$5,0)","v":0.78773672313707144},{"$f":"IF(C295<=B$14/2,C295,0)","v":0},{"$f":"IF(C295<=B$6/2,C295,0)","v":0}]
[-1.2364465212866254,9.9299999999999589,0.7901034816692134,0,0]
[-1.0598113039600723,{"$f":"B296+0.01","v":9.9399999999999586},0.79216042358730432,0,0]
[-0.88317608663351899,9.9499999999999584,0.79390509495401695,0,0]
[-0.7065408693069658,9.9599999999999582,0.79533541102321248,0,0]
[-0.52990565198041262,9.969999999999958,0.79644966039120979,0,0]
[-0.35327043465385943,9.9799999999999578,0.79724650840920741,0,0]
[-0.17663521732730622,9.9899999999999576,0.79772499984733092,0,0]
[-7.5304122330474977E-13,9.9999999999999574,0.79788456080286541,0,0]
[0.17663521732580015,10.009999999999957,0.79772499984733358,0,0]
[0.35327043465235336,10.019999999999957,0.79724650840921274,0,0]
[0.52990565197890649,10.029999999999957,0.7964496603912179,0,0]
[0.70654086930545967,10.039999999999957,0.79533541102322336,0,0]
[0.88317608663201286,10.049999999999956,0.7939050949540305,0,0]
[1.0598113039585662,10.059999999999956,0.79216042358732053,0,0]
[1.2364465212851192,10.069999999999956,0.79010348166923228,0,0]
[1.4130817386116725,10.079999999999956,0.78773672313709286,0,0]
[1.5897169559382256,10.089999999999955,0.78506296624087035,0,0]
[1.7663521732647789,10.099999999999955,0.78208538795092586,0,0]
[1.942987390591332,10.109999999999955,0.77880751766759626,0,0]
[2.119622607917885,10.119999999999955,0.77523323025004509,0,0]
[2.2962578252444383,10.129999999999955,0.77136673838365033,0,0]
[2.4728930425709916,10.139999999999954,0.7672125843069767,0,0]
[2.6495282598975449,10.149999999999954,0.76277563092106915,0,0]
[2.8261634772240982,10.159999999999954,0.75806105230542564,0,0]
[3.0027986945506511,10.169999999999954,0.7530743236665316,0,0]
[3.1794339118772044,10.179999999999954,0.74782121074628183,0,0]
[3.3560691292037577,10.189999999999953,0.74230775871895838,0,0]
[3.532704346530311,10.199999999999953,0.73654028060667431,0,0]
[3.7093395638568638,10.209999999999953,0.73052534524433665,0,0]
[3.8859747811834171,10.219999999999953,0.72426976482621463,0,0]
[4.06260999850997,10.229999999999952,0.71778058206712059,0,0]
[4.2392452158365233,10.239999999999952,0.71106505701202671,0,0]
[4.4158804331630765,10.249999999999952,0.7041306535286328,0,0]
[4.5925156504896298,10.259999999999952,0.69698502551798402,0,0]
[4.7691508678161831,10.269999999999952,0.68963600287870275,0,0]
[4.9457860851427364,10.279999999999951,0.68209157726074221,0,0]
[5.1224213024692897,10.289999999999951,0.67435988764479937,0,0]
[5.299056519795843,10.299999999999951,0.66644920578363853,0,0]
[5.4756917371223963,10.309999999999951,0.65836792154156976,0,0]
[5.6523269544489487,10.319999999999951,0.65012452816820543,0,0]
[5.828962171775502,10.32999999999995,0.64172760754238711,0,0]
[6.0055973891020553,10.33999999999995,0.63318581542182861,0,0]
[6.1822326064286086,10.34999999999995,0.6245078667335664,0,0]
[6.3588678237551619,10.35999999999995,0.61570252093975042,0,0]
[6.5355030410817152,10.369999999999949,0.60677856751264569,0,0]
[6.7121382584082685,10.379999999999949,0.59774481155195169,0,0]
[6.8887734757348218,10.389999999999949,0.5886100595766971,0,0]
[7.0654086930613742,10.399999999999949,0.57938310552301286,0,0]
[7.2420439103879275,10.409999999999949,0.5700727169780625,0,0]
[7.4186791277144808,10.419999999999948,0.56068762167928976,0,0]
[7.5953143450410341,10.429999999999948,0.55123649430696242,0,0]
[7.7719495623675874,10.439999999999948,0.5417279435967256,0,0]
[7.9485847796941407,10.449999999999948,0.5321704997975597,0,0]
[8.1252199970206931,10.459999999999948,0.52257260249915671,0,0]
[8.3018552143472473,10.469999999999947,0.51294258885129151,0,0]
[8.4784904316737997,10.479999999999947,0.50328868219628531,0,0]
[8.6551256490003539,10.489999999999947,0.49361898113413677,0,0]
[8.8317608663269063,10.499999999999947,0.4839414490383383,0,0]
[9.0083960836534605,10.509999999999946,0.47426390403881091,0,0]
[9.1850313009800129,10.519999999999946,0.46459400948678431,0,0]
[9.3616665183065653,10.529999999999946,0.45493926491482378,0,0]
[9.5383017356331194,10.539999999999946,0.44530699750357439,0,0]
[9.7149369529596719,10.549999999999946,0.43570435406515318,0,0]
[{"$f":"(B359-B$4)/B$11","v":9.891572170286226},10.559999999999945,{"$f":"NORMDIST(B359,B$4,B$5,0)","v":0.42613829355148786},{"$f":"IF(C359<=B$14/2,C359,0)","v":0},{"$f":"IF(C359<=B$6/2,C359,0)","v":0}]
[10.068207387612778,10.569999999999945,0.41661558009426869,0,0]
[10.244842604939333,{"$f":"B360+0.01","v":10.579999999999945},0.40714277658157089,0,0]
[10.421477822265885,10.589999999999945,0.39772623877460361,0,0]
[10.598113039592439,10.599999999999945,0.38837210996647759,0,0]
[10.774748256918992,10.609999999999944,0.37908631618333194,0,0]
[10.951383474245544,10.619999999999944,0.36987456192666185,0,0]
[11.128018691572098,10.629999999999944,0.36074232645421161,0,0]
[11.304653908898651,10.639999999999944,0.35169486059537541,0,0]
[11.481289126225205,10.649999999999944,0.34273718409566512,0,0]
[11.657924343551757,10.659999999999943,0.33387408348347763,0,0]
[11.834559560878311,10.669999999999943,0.32511011045111787,0,0]
[12.011194778204864,10.679999999999943,0.31644958074081525,0,0]
[12.187829995531418,10.689999999999943,0.30789657352531613,0,0]
[12.36446521285797,10.699999999999942,0.29945493127153799,0,0]
[12.541100430184523,10.709999999999942,0.29112826007474296,0,0]
[12.717735647511077,10.719999999999942,0.28291993044972485,0,0]
[12.894370864837629,10.729999999999942,0.27483307856461026,0,0]
[13.071006082164184,10.739999999999942,0.26687060790205069,0,0]
[13.247641299490736,10.749999999999941,0.25903519133182901,0,0]
[13.42427651681729,10.759999999999941,0.25132927357822121,0,0]
[13.600911734143843,10.769999999999941,0.24375507406484789,0,0]
[13.777546951470395,10.779999999999941,0.23631459011920825,0,0]
[13.954182168796949,10.789999999999941,0.22900960051862779,0,0]
[14.130817386123502,10.79999999999994,0.22184166935895347,0,0]
[14.307452603450056,10.80999999999994,0.21481215022700934,0,0]
[14.484087820776608,10.81999999999994,0.20792219065756939,0,0]
[14.660723038103162,10.82999999999994,0.20117273685542145,0,0]
[14.837358255429715,10.839999999999939,0.19456453866297455,0,0]
[15.013993472756269,10.849999999999939,0.18809815475381275,0,0]
[15.190628690082821,10.859999999999939,0.18177395803260385,0,0]
[15.367263907409374,10.869999999999939,0.17559214122184866,0,0]
[15.543899124735928,10.879999999999939,0.16955272261608109,0,0]
[15.72053434206248,10.889999999999938,0.16365555198432152,0,0]
[15.897169559389035,10.899999999999938,0.15790031660182346,0,0]
[16.073804776715587,10.909999999999938,0.15228654739244901,0,0]
[16.250439994042139,10.919999999999938,0.14681362516334742,0,0]
[16.427075211368695,10.929999999999938,0.14148078691399962,0,0]
[16.603710428695248,10.939999999999937,0.13628713220212127,0,0]
[16.7803456460218,10.949999999999937,0.13123162954938455,0,0]
[16.956980863348353,10.959999999999937,0.1263131228704279,0,0]
[17.133616080674905,10.969999999999937,0.12153033790915942,0,0]
[17.310251298001461,10.979999999999936,0.11688188866693204,0,0]
[17.486886515328013,10.989999999999936,0.11236628380776444,0,0]
[17.663521732654566,10.999999999999936,0.10798193302640373,0,0]
[17.840156949981118,11.009999999999936,0.10372715336566801,0,0]
[18.016792167307674,11.019999999999936,9.9600175470167682E-2,0,0]
[18.193427384634226,11.029999999999935,9.5599149764179506E-2,0,0]
[18.370062601960779,11.039999999999935,9.1722152542134533E-2,0,0]
[18.546697819287331,11.049999999999935,8.7967191960878419E-2,0,0]
[18.723333036613884,11.059999999999935,8.4332213923563951E-2,0,0]
[18.89996825394044,11.069999999999935,8.0815107845743264E-2,0,0]
[19.076603471266992,11.079999999999934,7.7413712294933185E-2,0,0]
[19.253238688593544,11.089999999999934,7.4125820495634237E-2,0,0]
[19.429873905920097,11.099999999999934,7.0949185692483527E-2,0,0]
[19.606509123246653,11.109999999999934,6.7881526364918371E-2,0,0]
[19.783144340573205,11.119999999999933,6.4920531287414263E-2,0,0]
[19.959779557899758,11.129999999999933,6.2063864430035233E-2,0,0]
[20.13641477522631,11.139999999999933,5.9309169694700646E-2,0,0]
[20.313049992552862,11.149999999999933,5.6654075483219858E-2,0,0]
[20.489685209879418,11.159999999999933,5.4096199093780467E-2,0,0]
[20.666320427205971,11.169999999999932,5.1633150943191694E-2,0,0]
[20.842955644532523,11.179999999999932,4.9262538612780765E-2,0,0]
[21.019590861859076,11.189999999999932,4.6981970716417923E-2,4.6981970716417923E-2,0]
[{"$f":"(B423-B$4)/B$11","v":21.196226079185632},11.199999999999932,{"$f":"NORMDIST(B423,B$4,B$5,0)","v":4.4789060589700461E-2},{"$f":"IF(C423<=B$14/2,C423,0)","v":4.4789060589700461E-2},{"$f":"IF(C423<=B$6/2,C423,0)","v":0}]
[21.372861296512184,11.209999999999932,4.2681429799859706E-2,4.2681429799859706E-2,0]
[21.549496513838736,{"$f":"B424+0.01","v":11.219999999999931},4.0656711476465289E-2,4.0656711476465289E-2,0]
[21.726131731165289,11.229999999999931,3.8712553463487023E-2,3.8712553463487023E-2,0]
[21.902766948491841,11.239999999999931,3.6846621293736725E-2,3.6846621293736725E-2,0]
[22.079402165818397,11.249999999999931,3.5056600987149224E-2,3.5056600987149224E-2,0]
[22.25603738314495,11.259999999999931,3.3340201674773792E-2,3.3340201674773792E-2,0]
[22.432672600471502,11.26999999999993,3.1695158050732856E-2,3.1695158050732856E-2,0]
[22.609307817798054,11.27999999999993,3.0119232654765682E-2,3.0119232654765682E-2,0]
[22.785943035124607,11.28999999999993,2.8610217988309733E-2,2.8610217988309733E-2,0]
[22.962578252451163,11.29999999999993,2.7165938467381169E-2,2.7165938467381169E-2,0]
[23.139213469777715,11.309999999999929,2.5784252215800146E-2,2.5784252215800146E-2,0]
[23.315848687104268,11.319999999999929,2.4463052702565088E-2,2.4463052702565088E-2,2.4463052702565088E-2]
[23.49248390443082,11.329999999999929,2.3200270227413892E-2,2.3200270227413892E-2,2.3200270227413892E-2]
[23.669119121757376,11.339999999999929,2.1993873258819553E-2,2.1993873258819553E-2,2.1993873258819553E-2]
[23.845754339083928,11.349999999999929,2.0841869628853222E-2,2.0841869628853222E-2,2.0841869628853222E-2]
[24.022389556410481,11.359999999999928,1.9742307589509969E-2,1.9742307589509969E-2,1.9742307589509969E-2]
[24.199024773737033,11.369999999999928,1.869327673523194E-2,1.869327673523194E-2,1.869327673523194E-2]
[24.375659991063586,11.379999999999928,1.7692908796481485E-2,1.7692908796481485E-2,1.7692908796481485E-2]
[24.552295208390142,11.389999999999928,1.6739378309312779E-2,1.6739378309312779E-2,1.6739378309312779E-2]
[24.728930425716694,11.399999999999928,1.5830903165966352E-2,1.5830903165966352E-2,1.5830903165966352E-2]
[24.905565643043246,11.409999999999927,1.4965745051567253E-2,1.4965745051567253E-2,1.4965745051567253E-2]
[25.082200860369799,11.419999999999927,1.4142209772044752E-2,1.4142209772044752E-2,1.4142209772044752E-2]
[25.258836077696355,11.429999999999927,1.3358647478410819E-2,1.3358647478410819E-2,1.3358647478410819E-2]
[25.435471295022907,11.439999999999927,1.2613452792537177E-2,1.2613452792537177E-2,1.2613452792537177E-2]
[25.61210651234946,11.449999999999926,1.1905064839556783E-2,1.1905064839556783E-2,1.1905064839556783E-2]
[25.788741729676012,11.459999999999926,1.1231967191986766E-2,1.1231967191986766E-2,1.1231967191986766E-2]
[25.965376947002564,11.469999999999926,1.0592687730626641E-2,1.0592687730626641E-2,1.0592687730626641E-2]
[26.14201216432912,11.479999999999926,9.9857984272291329E-3,9.9857984272291329E-3,9.9857984272291329E-3]
[26.318647381655673,11.489999999999926,9.4099150538721303E-3,9.4099150538721303E-3,9.4099150538721303E-3]
[26.495282598982225,11.499999999999925,8.8636968238799824E-3,8.8636968238799824E-3,8.8636968238799824E-3]
[26.671917816308778,11.509999999999925,8.3458459690516976E-3,8.3458459690516976E-3,8.3458459690516976E-3]
[26.848553033635334,11.519999999999925,7.8551072578531434E-3,7.8551072578531434E-3,7.8551072578531434E-3]
[27.025188250961886,11.529999999999925,7.3902674591214699E-3,7.3902674591214699E-3,7.3902674591214699E-3]
[27.201823468288438,11.539999999999925,6.9501547557131041E-3,6.9501547557131041E-3,6.9501547557131041E-3]
[27.378458685614991,11.549999999999924,6.5336381124029069E-3,6.5336381124029069E-3,6.5336381124029069E-3]
[27.555093902941543,11.559999999999924,6.1396266022123933E-3,6.1396266022123933E-3,6.1396266022123933E-3]
[27.731729120268099,11.569999999999924,5.767068695209634E-3,5.767068695209634E-3,5.767068695209634E-3]
[27.908364337594652,11.579999999999924,5.4149515136840158E-3,5.4149515136840158E-3,5.4149515136840158E-3]
[28.084999554921204,11.589999999999923,5.0823000574555218E-3,5.0823000574555218E-3,5.0823000574555218E-3]
[28.261634772247756,11.599999999999923,4.768176402932027E-3,4.768176402932027E-3,4.768176402932027E-3]
[28.438269989574312,11.609999999999923,4.4716788793792966E-3,4.4716788793792966E-3,4.4716788793792966E-3]
[28.614905206900865,11.619999999999923,4.1919412257179827E-3,4.1919412257179827E-3,4.1919412257179827E-3]
[28.791540424227417,11.629999999999923,3.9281317310107334E-3,3.9281317310107334E-3,3.9281317310107334E-3]
[28.96817564155397,11.639999999999922,3.6794523616504315E-3,3.6794523616504315E-3,3.6794523616504315E-3]
[29.144810858880522,11.649999999999922,3.4451378781091284E-3,3.4451378781091284E-3,3.4451378781091284E-3]
[29.321446076207078,11.659999999999922,3.2244549439559189E-3,3.2244549439559189E-3,3.2244549439559189E-3]
[29.49808129353363,11.669999999999922,3.0167012297021901E-3,3.0167012297021901E-3,3.0167012297021901E-3]
[29.674716510860183,11.679999999999922,2.8212045138842558E-3,2.8212045138842558E-3,2.8212045138842558E-3]
[29.851351728186735,11.689999999999921,2.637321783646885E-3,2.637321783646885E-3,2.637321783646885E-3]
[30.027986945513291,11.699999999999921,2.4644383369473596E-3,2.4644383369473596E-3,2.4644383369473596E-3]
[30.204622162839843,11.709999999999921,2.301966888358212E-3,2.301966888358212E-3,2.301966888358212E-3]
[30.381257380166396,11.719999999999921,2.1493466803086435E-3,2.1493466803086435E-3,2.1493466803086435E-3]
[30.557892597492948,11.72999999999992,2.0060426014695799E-3,2.0060426014695799E-3,2.0060426014695799E-3]
[30.734527814819501,11.73999999999992,1.8715443138559982E-3,1.8715443138559982E-3,1.8715443138559982E-3]
[30.911163032146057,11.74999999999992,1.7453653900924967E-3,1.7453653900924967E-3,1.7453653900924967E-3]
[31.087798249472609,11.75999999999992,1.6270424621645345E-3,1.6270424621645345E-3,1.6270424621645345E-3]
[31.264433466799161,11.76999999999992,1.5161343828582838E-3,1.5161343828582838E-3,1.5161343828582838E-3]
[31.441068684125714,11.779999999999919,1.4122214009768827E-3,1.4122214009768827E-3,1.4122214009768827E-3]
[31.61770390145227,11.789999999999919,1.3149043513101131E-3,1.3149043513101131E-3,1.3149043513101131E-3]
[31.794339118778822,11.799999999999919,1.2238038602282581E-3,1.2238038602282581E-3,1.2238038602282581E-3]
[31.970974336105375,11.809999999999919,1.1385595676691748E-3,1.1385595676691748E-3,1.1385595676691748E-3]
[32.147609553431927,11.819999999999919,1.0588293661904977E-3,1.0588293661904977E-3,1.0588293661904977E-3]
[32.324244770758483,11.829999999999918,9.842886576663754E-4,9.842886576663754E-4,9.842886576663754E-4]
[{"$f":"(B487-B$4)/B$11","v":32.500879988085032},11.839999999999918,{"$f":"NORMDIST(B487,B$4,B$5,0)","v":9.1462962812026525E-4},{"$f":"IF(C487<=B$14/2,C487,0)","v":9.1462962812026525E-4},{"$f":"IF(C487<=B$6/2,C487,0)","v":9.1462962812026525E-4}]
[32.677515205411588,11.849999999999918,8.4956054110201895E-4,8.4956054110201895E-4,8.4956054110201895E-4]
[32.854150422738144,{"$f":"B488+0.01","v":11.859999999999918},7.8880504993879589E-4,7.8880504993879589E-4,7.8880504993879589E-4]
[33.030785640064693,11.869999999999918,7.3210152911512257E-4,7.3210152911512257E-4,7.3210152911512257E-4]
[33.207420857391249,11.879999999999917,6.7920242496773186E-4,6.7920242496773186E-4,6.7920242496773186E-4]
[33.384056074717797,11.889999999999917,6.2987362581543808E-4,6.2987362581543808E-4,6.2987362581543808E-4]
[33.560691292044353,11.899999999999917,5.8389385158328928E-4,5.8389385158328928E-4,5.8389385158328928E-4]
[33.737326509370909,11.909999999999917,5.4105406292338657E-4,5.4105406292338657E-4,5.4105406292338657E-4]
[33.913961726697458,11.919999999999916,5.0115688978204286E-4,5.0115688978204286E-4,5.0115688978204286E-4]
[34.090596944024014,11.929999999999916,4.6401607931418476E-4,4.6401607931418476E-4,4.6401607931418476E-4]
[34.267232161350563,11.939999999999916,4.2945596300101365E-4,4.2945596300101365E-4,4.2945596300101365E-4]
[34.443867378677119,11.949999999999916,3.9731094278580624E-4,3.9731094278580624E-4,3.9731094278580624E-4]
[34.620502596003675,11.959999999999916,3.6742499600515702E-4,3.6742499600515702E-4,3.6742499600515702E-4]
[34.797137813330224,11.969999999999915,3.3965119885891372E-4,3.3965119885891372E-4,3.3965119885891372E-4]
[34.97377303065678,11.979999999999915,3.1385126813127524E-4,3.1385126813127524E-4,3.1385126813127524E-4]
[35.150408247983329,11.989999999999915,2.8989512084797852E-4,2.8989512084797852E-4,2.8989512084797852E-4]
[35.327043465309885,11.999999999999915,2.6766045152995331E-4,2.6766045152995331E-4,2.6766045152995331E-4]
[35.503678682636441,12.009999999999915,2.4703232668221671E-4,2.4703232668221671E-4,2.4703232668221671E-4]
[35.680313899962989,12.019999999999914,2.2790279613788713E-4,2.2790279613788713E-4,2.2790279613788713E-4]
[35.856949117289545,12.029999999999914,2.1017052086094693E-4,2.1017052086094693E-4,2.1017052086094693E-4]
[36.033584334616101,12.039999999999914,1.9374041679757483E-4,1.9374041679757483E-4,1.9374041679757483E-4]
[36.21021955194265,12.049999999999914,1.7852331435439206E-4,1.7852331435439206E-4,1.7852331435439206E-4]
[36.386854769269206,12.059999999999913,1.6443563307268913E-4,1.6443563307268913E-4,1.6443563307268913E-4]
[36.563489986595755,12.069999999999913,1.5139907106043106E-4,1.5139907106043106E-4,1.5139907106043106E-4]
[36.740125203922311,12.079999999999913,1.3934030873852965E-4,1.3934030873852965E-4,1.3934030873852965E-4]
[36.916760421248867,12.089999999999913,1.2819072645430535E-4,1.2819072645430535E-4,1.2819072645430535E-4]
[37.093395638575416,12.099999999999913,1.1788613551316619E-4,1.1788613551316619E-4,1.1788613551316619E-4]
[37.270030855901972,12.109999999999912,1.0836652217916037E-4,1.0836652217916037E-4,1.0836652217916037E-4]
[37.446666073228521,12.119999999999912,9.9575804196098462E-5,9.9575804196098462E-5,9.9575804196098462E-5]
[37.623301290555077,12.129999999999912,9.1461599383271027E-5,9.1461599383271027E-5,9.1461599383271027E-5]
[37.799936507881633,12.139999999999912,8.3975005863298042E-5,8.3975005863298042E-5,8.3975005863298042E-5]
[37.976571725208181,12.149999999999912,7.707039348423286E-5,7.707039348423286E-5,7.707039348423286E-5]
[38.153206942534737,12.159999999999911,7.0705206003600458E-5,7.0705206003600458E-5,7.0705206003600458E-5]
[38.329842159861286,12.169999999999911,6.4839773608477537E-5,6.4839773608477537E-5,6.4839773608477537E-5]
[38.506477377187842,12.179999999999911,5.9437135352930646E-5,5.9437135352930646E-5,5.9437135352930646E-5]
[38.683112594514398,12.189999999999911,5.4462871102027792E-5,5.4462871102027792E-5,5.4462871102027792E-5]
[38.859747811840947,12.19999999999991,4.9884942580146407E-5,4.9884942580146407E-5,4.9884942580146407E-5]
[39.036383029167503,12.20999999999991,4.5673543130330107E-5,4.5673543130330107E-5,4.5673543130330107E-5]
[39.213018246494059,12.21999999999991,4.1800955800934303E-5,4.1800955800934303E-5,4.1800955800934303E-5]
[39.389653463820608,12.22999999999991,3.8241419385666245E-5,3.8241419385666245E-5,3.8241419385666245E-5]
[39.566288681147164,12.23999999999991,3.4971002053306656E-5,3.4971002053306656E-5,3.4971002053306656E-5]
[39.742923898473713,12.249999999999909,3.1967482213837018E-5,3.1967482213837018E-5,3.1967482213837018E-5]
[39.919559115800269,12.259999999999909,2.9210236278329801E-5,2.9210236278329801E-5,2.9210236278329801E-5]
[40.096194333126824,12.269999999999909,2.6680132980733716E-5,2.6680132980733716E-5,2.6680132980733716E-5]
[40.272829550453373,12.279999999999909,2.4359433940557653E-5,2.4359433940557653E-5,2.4359433940557653E-5]
[40.449464767779929,12.289999999999909,2.2231700156374218E-5,2.2231700156374218E-5,2.2231700156374218E-5]
[40.626099985106478,12.299999999999908,2.0281704130990596E-5,2.0281704130990596E-5,2.0281704130990596E-5]
[40.802735202433034,12.309999999999908,1.8495347340026941E-5,1.8495347340026941E-5,1.8495347340026941E-5]
[40.97937041975959,12.319999999999908,1.685958276647195E-5,1.685958276647195E-5,1.685958276647195E-5]
[41.156005637086139,12.329999999999908,1.5362342234514148E-5,1.5362342234514148E-5,1.5362342234514148E-5]
[41.332640854412695,12.339999999999907,1.3992468286552889E-5,1.3992468286552889E-5,1.3992468286552889E-5]
[41.509276071739244,12.349999999999907,1.2739650357745315E-5,1.2739650357745315E-5,1.2739650357745315E-5]
[41.6859112890658,12.359999999999907,1.1594365012724728E-5,1.1594365012724728E-5,1.1594365012724728E-5]
[41.862546506392356,12.369999999999907,1.0547820019211919E-5,1.0547820019211919E-5,1.0547820019211919E-5]
[42.039181723718904,12.379999999999907,9.5919020431135629E-6,9.5919020431135629E-6,9.5919020431135629E-6]
[42.21581694104546,12.389999999999906,8.7191277593510796E-6,8.7191277593510796E-6,8.7191277593510796E-6]
[42.392452158372009,12.399999999999906,7.922598182071286E-6,7.922598182071286E-6,7.922598182071286E-6]
[42.569087375698565,12.409999999999906,7.1959560270490272E-6,7.1959560270490272E-6,7.1959560270490272E-6]
[42.745722593025121,12.419999999999906,6.5333459279925033E-6,6.5333459279925033E-6,6.5333459279925033E-6]
[42.92235781035167,12.429999999999906,5.9293773370959906E-6,5.9293773370959906E-6,5.9293773370959906E-6]
[43.098993027678226,12.439999999999905,5.3790899485480153E-6,5.3790899485480153E-6,5.3790899485480153E-6]
[43.275628245004782,12.449999999999905,4.8779214917912538E-6,4.8779214917912538E-6,4.8779214917912538E-6]
[43.452263462331331,12.459999999999905,4.4216777491409743E-6,4.4216777491409743E-6,4.4216777491409743E-6]
[43.628898679657887,12.469999999999905,4.0065046599007574E-6,4.0065046599007574E-6,4.0065046599007574E-6]
[{"$f":"(B551-B$4)/B$11","v":43.805533896984436},12.479999999999905,{"$f":"NORMDIST(B551,B$4,B$5,0)","v":3.6288623803675035E-6},{"$f":"IF(C551<=B$14/2,C551,0)","v":3.6288623803675035E-6},{"$f":"IF(C551<=B$6/2,C551,0)","v":3.6288623803675035E-6}]
[43.982169114310992,12.489999999999904,3.2855011760932822E-6,3.2855011760932822E-6,3.2855011760932822E-6]
[44.158804331637548,{"$f":"B552+0.01","v":12.499999999999904},2.9734390294714477E-6,2.9734390294714477E-6,2.9734390294714477E-6]
[44.335439548964096,12.509999999999904,2.6899408521414789E-6,2.6899408521414789E-6,2.6899408521414789E-6]
[44.512074766290652,12.519999999999904,2.4324991978649997E-6,2.4324991978649997E-6,2.4324991978649997E-6]
[44.688709983617201,12.529999999999903,2.1988163774185546E-6,2.1988163774185546E-6,2.1988163774185546E-6]
[44.865345200943757,12.539999999999903,1.986787882681779E-6,1.986787882681779E-6,1.986787882681779E-6]
[45.041980418270313,12.549999999999903,1.7944870324784397E-6,1.7944870324784397E-6,1.7944870324784397E-6]
[45.218615635596862,12.559999999999903,1.6201507578578836E-6,1.6201507578578836E-6,1.6201507578578836E-6]
[45.395250852923418,12.569999999999903,1.4621664493921603E-6,1.4621664493921603E-6,1.4621664493921603E-6]
[45.571886070249967,12.579999999999902,1.3190597937163742E-6,1.3190597937163742E-6,1.3190597937163742E-6]
[45.748521287576523,12.589999999999902,1.1894835309627571E-6,1.1894835309627571E-6,1.1894835309627571E-6]
[45.925156504903079,12.599999999999902,1.0722070689406179E-6,1.0722070689406179E-6,1.0722070689406179E-6]
[46.101791722229628,12.609999999999902,9.6610689390092655E-7,9.6610689390092655E-7,9.6610689390092655E-7]
[46.278426939556184,12.619999999999902,8.701577215039215E-7,8.701577215039215E-7,8.701577215039215E-7]
[46.45506215688274,12.629999999999901,7.8342433518777594E-7,7.8342433518777594E-7,7.8342433518777594E-7]
[46.631697374209288,12.639999999999901,7.0505406252354529E-7,7.0505406252354529E-7,7.0505406252354529E-7]
[46.808332591535844,12.649999999999901,6.3426984334386106E-7,6.3426984334386106E-7,6.3426984334386106E-7]
[46.984967808862393,12.659999999999901,5.7036384645739907E-7,5.7036384645739907E-7,5.7036384645739907E-7]
[47.161603026188949,12.6699999999999,5.1269159461546322E-7,5.1269159461546322E-7,5.1269159461546322E-7]
[47.338238243515505,12.6799999999999,4.6066656008833471E-7,4.6066656008833471E-7,4.6066656008833471E-7]
[47.514873460842054,12.6899999999999,4.1375519574437563E-7,4.1375519574437563E-7,4.1375519574437563E-7]
[47.69150867816861,12.6999999999999,3.7147236891146043E-7,3.7147236891146043E-7,3.7147236891146043E-7]
[47.868143895495159,12.7099999999999,3.3337716754481956E-7,3.3337716754481956E-7,3.3337716754481956E-7]
[48.044779112821715,12.719999999999899,2.9906905033464666E-7,2.9906905033464666E-7,2.9906905033464666E-7]
[48.221414330148271,12.729999999999899,2.6818431436738989E-7,2.6818431436738989E-7,2.6818431436738989E-7]
[48.39804954747482,12.739999999999899,2.4039285581283106E-7,2.4039285581283106E-7,2.4039285581283106E-7]
[48.574684764801376,12.749999999999899,2.1539520085110544E-7,2.1539520085110544E-7,2.1539520085110544E-7]
[48.751319982127924,12.759999999999899,1.9291978568568323E-7,1.9291978568568323E-7,1.9291978568568323E-7]
[48.92795519945448,12.769999999999898,1.7272046601581461E-7,1.7272046601581461E-7,1.7272046601581461E-7]
[49.104590416781036,12.779999999999898,1.5457423777063331E-7,1.5457423777063331E-7,1.5457423777063331E-7]
[49.281225634107585,12.789999999999898,1.3827915224240565E-7,1.3827915224240565E-7,1.3827915224240565E-7]
[49.457860851434141,12.799999999999898,1.236524100034586E-7,1.236524100034586E-7,1.236524100034586E-7]
[49.634496068760697,12.809999999999897,1.1052861915512173E-7,1.1052861915512173E-7,1.1052861915512173E-7]
[49.811131286087246,12.819999999999897,9.875820454232317E-8,9.875820454232317E-8,9.875820454232317E-8]
[49.987766503413802,12.829999999999897,8.8205955578848947E-8,8.8205955578848947E-8,8.8205955578848947E-8]
[50.164401720740351,12.839999999999897,7.8749701270089321E-8,7.8749701270089321E-8,7.8749701270089321E-8]
[50.341036938066907,12.849999999999897,7.0279101896491571E-8,7.0279101896491571E-8,7.0279101896491571E-8]
[50.517672155393463,12.859999999999896,6.2694547635913748E-8,6.2694547635913748E-8,6.2694547635913748E-8]
[50.694307372720012,12.869999999999896,5.5906155160376038E-8,5.5906155160376038E-8,5.5906155160376038E-8]
[50.870942590046567,12.879999999999896,4.9832853945961641E-8,4.9832853945961641E-8,4.9832853945961641E-8]
[51.047577807373116,12.889999999999896,4.4401554687211501E-8,4.4401554687211501E-8,4.4401554687211501E-8]
[51.224213024699672,12.899999999999896,3.9546392812537254E-8,3.9546392812537254E-8,3.9546392812537254E-8]
[51.400848242026228,12.909999999999895,3.5208040658014593E-8,3.5208040658014593E-8,3.5208040658014593E-8]
[51.577483459352777,12.919999999999895,3.1333082376303439E-8,3.1333082376303439E-8,3.1333082376303439E-8]
[51.754118676679333,12.929999999999895,2.7873446138129144E-8,2.7873446138129144E-8,2.7873446138129144E-8]
[51.930753894005882,12.939999999999895,2.4785888628330898E-8,2.4785888628330898E-8,2.4785888628330898E-8]
[52.107389111332438,12.949999999999894,2.2031527249392092E-8,2.2031527249392092E-8,2.2031527249392092E-8]
[52.284024328658994,12.959999999999894,1.9575415824906837E-8,1.9575415824906837E-8,1.9575415824906837E-8]
[52.460659545985543,12.969999999999894,1.7386159945782274E-8,1.7386159945782274E-8,1.7386159945782274E-8]
[52.637294763312099,12.979999999999894,1.5435568425160579E-8,1.5435568425160579E-8,1.5435568425160579E-8]
[52.813929980638648,12.989999999999894,1.3698337625988989E-8,1.3698337625988989E-8,1.3698337625988989E-8]

{"sheet":"Art","index":11,"n_rows":591,"n_cols":6,"rows_kept":591,"cut":false,"hidden":false,"merged":[]}
["Date","Sales Rep","Customer","Sales","COGS","Region"]
["2009-01-10","Sioux","Safeway",1102,562.02,"East"]
["2010-06-07","Tina","Fred Myer",207,101.43,"NorthEast"]
["2005-10-26","Tom","Whole Foods",219,96.36,"NorthEast"]
["2010-03-30","Sioux","PCC",1322,859.3,"NorthWest"]
["2007-09-29","Sioux","Whole Foods",178,115.7,"MidWest"]
["2010-05-06","Chin","Coop",142,89.46,"MidWest"]
["2006-03-18","Sioux","Fred Myer",67,42.88,"East"]
["2007-02-04","Chin","Whole Foods",207,111.78,"NorthWest"]
["2010-08-07","Sioux","Safeway",249,139.44,"West"]
["2011-04-03","Chin","Whole Foods",194,124.16,"NorthWest"]
["2007-02-15","Sioux","Whole Foods",235,119.85,"NorthEast"]
["2006-06-19","Sioux","Safeway",122,53.68,"East"]
["2009-05-20","Tina","Safeway",230,115,"NorthWest"]
["2010-02-08","Tom","Coop",1942,893.32,"MidWest"]
["2009-08-12","Tom","Whole Foods",178,110.36,"NorthWest"]
["2007-10-08","Joy","Whole Foods",180,106.2,"MidWest"]
["2009-12-12","Tina","Fred Myer",196,137.19999999999999,"NorthWest"]
["2009-08-03","Tina","Whole Foods",564,315.83999999999997,"NorthEast"]
["2006-11-10","Joy","Whole Foods",171,126.54,"NorthWest"]
["2009-10-15","Tina","PCC",210,157.5,"MidWest"]
["2005-11-25","Joy","Coop",231,115.5,"NorthWest"]
["2005-08-26","Chin","Whole Foods",109,50.14,"NorthWest"]
["2011-05-29","Chin","Safeway",167,78.489999999999995,"MidWest"]
["2007-12-01","Sioux","PCC",1650,1303.5,"West"]
["2009-05-15","Sioux","Safeway",183,122.61,"MidWest"]
["2011-06-19","Joy","Fred Myer",128,74.239999999999995,"West"]
["2009-02-15","Joy","Whole Foods",161,98.21,"East"]
["2010-01-20","Tina","Whole Foods",157,114.61,"West"]
["2006-08-26","Joy","Whole Foods",131,77.290000000000006,"NorthWest"]
["2008-01-09","Sioux","Coop",114,61.56,"NorthEast"]
["2010-04-01","Chin","Safeway",237,168.27,"MidWest"]
["2009-09-30","Joy","Safeway",122,82.96,"East"]
["2006-03-27","Chin","Safeway",201,118.59,"NorthWest"]
["2006-07-17","Joy","Coop",1804,1100.44,"East"]
["2009-03-24","Tina","Safeway",1237,519.54,"East"]
["2008-05-02","Chin","Coop",182,81.900000000000006,"NorthEast"]
["2007-09-15","Tom","Safeway",67,30.82,"NorthWest"]
["2005-07-04","Tom","Whole Foods",234,156.78,"East"]
["2006-12-02","Tina","Coop",250,162.5,"West"]
["2008-12-04","Tina","PCC",237,184.86,"MidWest"]
["2009-05-20","Sioux","Safeway",60,31.2,"MidWest"]
["2009-01-12","Sioux","Fred Myer",231,177.87,"NorthEast"]
["2005-09-02","Tina","Fred Myer",80,48,"MidWest"]
["2009-11-10","Joy","Whole Foods",1241,620.5,"NorthWest"]
["2010-05-06","Sioux","PCC",224,100.8,"NorthWest"]
["2011-03-04","Tina","Coop",110,50.6,"West"]
["2007-10-09","Tina","PCC",131,94.32,"NorthEast"]
["2010-05-09","Chin","Coop",230,108.1,"MidWest"]
["2007-07-25","Chin","PCC",163,94.54,"MidWest"]
["2011-04-01","Chin","PCC",89,65.86,"NorthEast"]
["2008-10-22","Joy","Coop",215,152.65,"West"]
["2008-01-21","Sioux","Fred Myer",796,541.28,"East"]
["2007-10-27","Tom","Coop",230,170.2,"East"]
["2010-05-22","Chin","Fred Myer",1719,842.31,"West"]
["2011-03-09","Tina","Fred Myer",161,119.14,"East"]
["2006-02-12","Tina","Fred Myer",173,131.47999999999999,"MidWest"]
["2009-04-27","Sioux","PCC",196,143.08000000000001,"MidWest"]
["2008-06-27","Tom","Safeway",172,87.72,"East"]
["2007-05-18","Chin","Coop",75,35.25,"NorthWest"]
["2010-04-22","Chin","Fred Myer",220,160.6,"NorthEast"]
["2010-09-06","Chin","Fred Myer",93,44.64,"East"]
["2011-02-09","Tina","Coop",166,73.040000000000006,"NorthWest"]
["2008-04-11","Sioux","Safeway",54,40.5,"MidWest"]
["2010-12-31","Joy","Safeway",1281,781.41,"West"]
["2008-01-07","Chin","Whole Foods",212,127.2,"East"]
["2009-03-31","Chin","PCC",210,84,"MidWest"]
["2009-04-07","Chin","Safeway",98,46.06,"NorthWest"]
["2005-08-14","Tina","Fred Myer",213,134.19,"West"]
["2011-05-02","Chin","Coop",800,408,"NorthEast"]
["2006-11-24","Tina","Whole Foods",116,55.68,"MidWest"]
["2009-11-13","Chin","Safeway",200,120,"West"]
["2008-07-20","Joy","PCC",65,33.799999999999997,"NorthEast"]
["2008-11-07","Tina","PCC",173,79.58,"East"]
["2007-05-02","Tina","Fred Myer",1868,1064.76,"East"]
["2006-11-14","Tom","PCC",71,48.28,"NorthWest"]
["2005-12-07","Sioux","PCC",71,45.44,"NorthEast"]
["2008-01-20","Joy","Whole Foods",103,45.32,"East"]
["2009-10-01","Joy","Whole Foods",204,95.88,"West"]
["2010-03-10","Chin","Safeway",79,42.66,"MidWest"]
["2006-01-13","Sioux","Safeway",234,159.12,"West"]
["2011-06-08","Sioux","Whole Foods",226,94.92,"MidWest"]
["2006-03-18","Tom","Safeway",136,97.92,"West"]
["2009-04-09","Tom","Safeway",159,108.12,"MidWest"]
["2006-06-09","Tom","Fred Myer",1624,665.84,"MidWest"]
["2011-03-25","Tom","Whole Foods",104,71.760000000000005,"West"]
["2008-09-15","Tina","PCC",746,581.88,"West"]
["2009-08-22","Tom","Coop",145,116,"NorthEast"]
["2006-05-03","Chin","Fred Myer",167,91.85,"West"]
["2009-08-09","Joy","PCC",236,148.68,"MidWest"]
["2010-01-08","Tina","Coop",116,90.48,"NorthEast"]
["2006-05-16","Sioux","Coop",208,149.76,"NorthWest"]
["2010-01-12","Tom","Whole Foods",170,91.8,"MidWest"]
["2010-06-07","Sioux","Whole Foods",211,120.27,"East"]
["2008-11-13","Tom","Fred Myer",1268,735.44,"NorthEast"]
["2007-04-06","Tina","Coop",209,106.59,"NorthWest"]
["2010-02-24","Tina","PCC",212,116.6,"MidWest"]
["2005-11-09","Chin","Whole Foods",138,66.239999999999995,"NorthWest"]
["2011-01-29","Chin","Fred Myer",116,46.4,"West"]
["2006-08-20","Tina","Whole Foods",232,176.32,"NorthEast"]
["2011-04-13","Tina","Fred Myer",145,65.25,"East"]
["2005-06-28","Joy","Safeway",114,66.12,"MidWest"]
["2008-07-30","Chin","Fred Myer",235,152.75,"West"]
["2009-01-09","Joy","Whole Foods",1050,787.5,"MidWest"]
["2009-04-17","Joy","Fred Myer",1296,855.36,"NorthEast"]
["2008-12-23","Tom","Safeway",223,140.49,"NorthEast"]
["2009-05-29","Joy","Fred Myer",212,169.6,"West"]
["2005-08-30","Sioux","Safeway",93,45.57,"NorthEast"]
["2007-07-14","Joy","Whole Foods",198,91.08,"NorthEast"]
["2009-11-04","Joy","Coop",162,100.44,"NorthEast"]
["2007-11-14","Tina","PCC",134,87.1,"East"]
["2005-12-15","Joy","Whole Foods",167,71.81,"NorthWest"]
["2011-02-04","Tina","PCC",145,60.9,"West"]
["2010-11-08","Tina","Fred Myer",222,146.52000000000001,"East"]
["2005-10-14","Tina","Whole Foods",1954,1406.88,"MidWest"]
["2011-06-01","Tom","Whole Foods",117,90.09,"West"]
["2008-03-29","Sioux","PCC",109,43.6,"West"]
["2006-06-26","Tom","Whole Foods",190,117.8,"MidWest"]
["2010-07-18","Sioux","Fred Myer",91,41.86,"West"]
["2006-02-09","Sioux","PCC",241,101.22,"West"]
["2009-08-23","Joy","Safeway",1209,495.69,"MidWest"]
["2006-09-08","Joy","Whole Foods",79,52.14,"NorthWest"]
["2008-07-01","Tina","Whole Foods",195,124.8,"East"]
["2008-06-06","Tom","Coop",128,57.6,"East"]
["2007-09-18","Tina","Whole Foods",1714,719.88,"NorthWest"]
["2009-11-13","Tina","PCC",79,62.41,"MidWest"]
["2007-04-28","Tom","PCC",195,146.25,"NorthWest"]
["2005-10-04","Joy","Safeway",166,83,"East"]
["2007-02-28","Tom","Whole Foods",181,106.79,"West"]
["2006-04-21","Chin","Safeway",119,47.6,"NorthEast"]
["2006-11-14","Sioux","PCC",179,82.34,"West"]
["2009-12-08","Tina","PCC",108,59.4,"West"]
["2009-12-06","Sioux","Whole Foods",178,76.540000000000006,"MidWest"]
["2010-10-06","Tina","Whole Foods",120,84,"East"]
["2008-10-05","Joy","Whole Foods",1455,858.45,"NorthWest"]
["2008-04-07","Joy","Fred Myer",101,70.7,"NorthEast"]
["2009-10-18","Chin","Coop",142,100.82,"West"]
["2009-03-30","Tina","PCC",849,679.2,"West"]
["2006-02-13","Sioux","PCC",67,28.81,"East"]
["2006-12-29","Joy","Safeway",209,123.31,"East"]
["2009-05-20","Tom","Fred Myer",185,114.7,"West"]
["2006-03-27","Joy","Whole Foods",121,78.650000000000006,"West"]
["2008-03-30","Chin","PCC",100,73,"West"]
["2007-11-09","Chin","PCC",230,96.6,"NorthWest"]
["2007-07-29","Joy","Whole Foods",1969,1220.78,"NorthWest"]
["2007-05-21","Tom","Whole Foods",128,88.32,"NorthEast"]
["2010-03-15","Tina","PCC",137,86.31,"NorthEast"]
["2006-07-28","Tina","Fred Myer",141,63.45,"West"]
["2007-12-13","Chin","Coop",205,96.35,"West"]
["2006-11-15","Tina","Whole Foods",234,98.28,"MidWest"]
["2010-10-13","Chin","Whole Foods",141,94.47,"West"]
["2009-04-05","Sioux","PCC",178,117.48,"MidWest"]
["2008-01-29","Tina","Fred Myer",208,162.24,"MidWest"]
["2008-01-17","Sioux","Fred Myer",63,47.88,"West"]
["2006-09-16","Chin","Fred Myer",593,296.5,"West"]
["2010-05-19","Tom","Coop",225,164.25,"NorthEast"]
["2005-08-26","Chin","Coop",182,129.22,"West"]
["2007-12-29","Tina","Whole Foods",238,109.48,"East"]
["2008-03-13","Joy","Safeway",214,149.80000000000001,"East"]
["2006-08-22","Tom","Coop",60,31.8,"NorthWest"]
["2005-09-26","Tina","Fred Myer",242,137.94,"MidWest"]
["2008-12-26","Sioux","Coop",161,103.04,"NorthWest"]
["2010-08-17","Joy","Whole Foods",128,97.28,"East"]
["2010-01-23","Tom","PCC",182,109.2,"MidWest"]
["2009-11-12","Joy","Whole Foods",1205,626.6,"NorthWest"]
["2009-01-29","Tina","PCC",193,137.03,"MidWest"]
["2006-12-08","Tina","Whole Foods",75,39,"NorthWest"]
["2009-11-12","Tom","PCC",200,158,"NorthWest"]
["2007-05-28","Tina","Whole Foods",238,173.74,"NorthWest"]
["2008-11-27","Tom","Fred Myer",238,159.46,"East"]
["2006-11-11","Chin","PCC",167,80.16,"NorthWest"]
["2011-02-27","Tom","PCC",793,444.08,"West"]
["2007-03-31","Chin","Whole Foods",142,102.24,"East"]
["2005-09-16","Sioux","Safeway",180,73.8,"West"]
["2006-09-19","Joy","Whole Foods",1429,1086.04,"MidWest"]
["2007-01-17","Tom","Safeway",240,124.8,"West"]
["2009-05-08","Tina","Whole Foods",197,82.74,"MidWest"]
["2009-01-05","Joy","PCC",213,104.37,"West"]
["2011-06-03","Tom","Fred Myer",178,121.04,"NorthEast"]
["2009-02-07","Tom","PCC",50,21,"West"]
["2007-10-14","Tom","Coop",174,100.92,"NorthEast"]
["2007-09-10","Chin","Whole Foods",85,60.35,"NorthEast"]
["2010-02-26","Tina","PCC",133,58.52,"West"]
["2007-04-16","Joy","Whole Foods",194,122.22,"NorthEast"]
["2006-11-29","Tina","PCC",1423,711.5,"NorthWest"]
["2005-11-01","Tina","Fred Myer",201,134.66999999999999,"West"]
["2006-01-31","Joy","Coop",98,49.98,"East"]
["2009-06-14","Sioux","Safeway",154,66.22,"NorthEast"]
["2007-03-16","Tom","Coop",895,545.95000000000005,"NorthEast"]
["2011-01-25","Chin","Whole Foods",244,126.88,"East"]
["2011-03-24","Chin","Whole Foods",110,47.3,"MidWest"]
["2007-02-24","Tom","PCC",65,27.3,"West"]
["2011-06-06","Tina","Coop",239,138.62,"West"]
["2007-05-15","Sioux","Safeway",52,40.56,"NorthWest"]
["2005-07-05","Tom","Fred Myer",1233,875.43,"MidWest"]
["2006-06-24","Tina","Safeway",69,28.29,"MidWest"]
["2009-03-08","Joy","Whole Foods",53,40.28,"West"]
["2005-09-11","Joy","Coop",180,135,"East"]
["2011-04-02","Chin","Fred Myer",75,46.5,"NorthWest"]
["2008-01-24","Tina","Fred Myer",143,97.24,"West"]
["2008-06-17","Chin","Safeway",114,61.56,"MidWest"]
["2008-09-20","Tom","Fred Myer",161,64.400000000000006,"NorthEast"]
["2007-07-01","Tom","Coop",63,28.35,"NorthEast"]
["2010-04-14","Chin","Fred Myer",180,73.8,"NorthEast"]
["2010-01-27","Sioux","Whole Foods",1993,1494.75,"NorthWest"]
["2006-05-28","Sioux","PCC",702,322.92,"MidWest"]
["2009-02-24","Tina","Fred Myer",213,129.93,"MidWest"]
["2005-07-22","Sioux","Whole Foods",128,84.48,"East"]
["2005-06-16","Tom","Whole Foods",124,89.28,"East"]
["2010-03-22","Sioux","Safeway",58,45.24,"MidWest"]
["2008-10-04","Tom","Coop",166,76.36,"NorthWest"]
["2011-02-09","Joy","Fred Myer",175,92.75,"East"]
["2006-12-28","Tom","PCC",147,69.09,"MidWest"]
["2006-05-30","Joy","Safeway",186,74.400000000000006,"MidWest"]
["2011-05-09","Chin","Fred Myer",1204,505.68,"NorthEast"]
["2007-05-12","Sioux","Fred Myer",163,68.459999999999994,"NorthEast"]
["2009-09-28","Sioux","Whole Foods",80,34.4,"MidWest"]
["2008-05-04","Sioux","Fred Myer",231,180.18,"East"]
["2006-08-18","Tom","Coop",238,164.22,"NorthWest"]
["2007-06-28","Joy","Whole Foods",55,25.3,"MidWest"]
["2006-09-10","Joy","Safeway",116,88.16,"NorthWest"]
["2005-10-08","Sioux","PCC",138,73.14,"East"]
["2006-05-13","Chin","Whole Foods",833,383.18,"NorthWest"]
["2009-01-26","Sioux","Whole Foods",130,71.5,"NorthWest"]
["2005-09-05","Tina","PCC",1936,1103.52,"MidWest"]
["2010-04-02","Chin","PCC",216,172.8,"NorthWest"]
["2011-05-29","Tom","Whole Foods",151,95.13,"NorthWest"]
["2009-09-12","Tina","Whole Foods",114,70.680000000000007,"NorthWest"]
["2007-11-16","Chin","Safeway",226,119.78,"West"]
["2006-11-13","Tina","Safeway",219,116.07,"NorthEast"]
["2006-07-20","Tina","Fred Myer",124,66.959999999999994,"NorthWest"]
["2007-08-03","Joy","Whole Foods",149,98.34,"NorthWest"]
["2007-11-23","Tom","Safeway",231,99.33,"West"]
["2009-05-30","Chin","Fred Myer",93,73.47,"NorthWest"]
["2011-02-06","Tom","Whole Foods",1411,564.4,"NorthEast"]
["2010-12-30","Tina","Safeway",54,34.56,"East"]
["2006-11-29","Tina","PCC",217,167.09,"NorthWest"]
["2007-02-11","Sioux","PCC",55,41.8,"NorthWest"]
["2006-02-15","Chin","Whole Foods",230,149.5,"West"]
["2008-03-05","Joy","PCC",1082,551.82000000000005,"NorthWest"]
["2007-04-22","Sioux","Whole Foods",238,147.56,"West"]
["2008-01-12","Tina","PCC",142,103.66,"West"]
["2007-12-31","Joy","Fred Myer",140,77,"MidWest"]
["2010-09-07","Chin","PCC",206,158.62,"MidWest"]
["2010-11-24","Sioux","Coop",1966,1179.5999999999999,"East"]
["2007-09-18","Joy","Fred Myer",141,71.91,"West"]
["2008-07-06","Sioux","Safeway",200,96,"NorthEast"]
["2009-02-14","Tina","Coop",225,135,"West"]
["2007-03-03","Chin","Coop",115,89.7,"NorthEast"]
["2008-09-15","Sioux","Safeway",164,88.56,"East"]
["2009-08-07","Sioux","PCC",96,67.2,"MidWest"]
["2009-11-01","Sioux","Safeway",89,65.86,"NorthEast"]
["2010-10-19","Joy","Coop",103,51.5,"NorthWest"]
["2006-01-02","Chin","Fred Myer",172,111.8,"NorthEast"]
["2010-12-05","Joy","Whole Foods",1532,796.64,"NorthEast"]
["2005-10-12","Joy","Coop",132,97.68,"MidWest"]
["2007-05-31","Sioux","Whole Foods",563,377.21,"MidWest"]
["2010-03-04","Sioux","Fred Myer",220,123.2,"NorthEast"]
["2006-07-18","Sioux","Fred Myer",178,138.84,"MidWest"]
["2009-12-08","Joy","Fred Myer",138,66.239999999999995,"NorthEast"]
["2010-12-09","Joy","Whole Foods",106,73.14,"MidWest"]
["2006-08-23","Tina","Fred Myer",204,118.32,"MidWest"]
["2005-10-04","Tom","Safeway",61,29.28,"NorthEast"]
["2010-02-22","Tom","Fred Myer",182,136.5,"West"]
["2011-03-23","Joy","Safeway",1768,760.24,"NorthWest"]
["2009-05-27","Sioux","Whole Foods",250,112.5,"West"]
["2007-04-30","Tom","Coop",52,29.64,"NorthWest"]
["2011-03-07","Sioux","Safeway",247,153.13999999999999,"East"]
["2009-11-10","Joy","Coop",153,85.68,"MidWest"]
["2009-06-02","Chin","Safeway",153,104.04,"West"]
["2009-05-12","Chin","Safeway",63,47.88,"MidWest"]
["2007-07-10","Chin","Whole Foods",69,33.81,"NorthWest"]
["2010-06-25","Tina","Fred Myer",226,122.04,"NorthEast"]
["2011-03-31","Sioux","Whole Foods",774,580.5,"West"]
["2008-06-29","Tom","Coop",1229,553.04999999999995,"NorthEast"]
["2008-05-22","Tina","Fred Myer",69,29.67,"East"]
["2009-09-08","Sioux","Whole Foods",219,159.87,"NorthWest"]
["2007-06-19","Tom","Safeway",118,54.28,"West"]
["2008-01-30","Chin","Safeway",122,71.98,"East"]
["2007-05-19","Tina","Whole Foods",158,124.82,"East"]
["2005-09-19","Chin","Coop",238,161.84,"East"]
["2007-12-06","Chin","Fred Myer",179,84.13,"East"]
["2007-10-10","Chin","Whole Foods",135,72.900000000000006,"MidWest"]
["2007-08-17","Sioux","Fred Myer",84,62.16,"East"]
["2007-09-26","Tina","Coop",1549,728.03,"MidWest"]
["2010-04-16","Chin","Fred Myer",157,109.9,"NorthWest"]
["2010-05-15","Sioux","Coop",87,34.799999999999997,"West"]
["2005-10-18","Chin","PCC",117,79.56,"NorthEast"]
["2009-08-29","Chin","Safeway",112,47.04,"NorthWest"]
["2010-09-04","Chin","Coop",56,43.12,"NorthWest"]
["2007-02-03","Joy","Whole Foods",988,770.64,"East"]
["2007-07-25","Chin","Safeway",132,63.36,"MidWest"]
["2006-12-30","Joy","Safeway",219,164.25,"NorthEast"]
["2006-06-15","Tina","Whole Foods",111,49.95,"NorthEast"]
["2006-02-09","Sioux","Safeway",1386,900.9,"MidWest"]
["2009-09-26","Tina","Whole Foods",111,68.819999999999993,"West"]
["2010-11-20","Sioux","Coop",92,63.48,"NorthWest"]
["2006-09-08","Chin","Fred Myer",128,99.84,"MidWest"]
["2010-06-26","Tina","PCC",158,107.44,"NorthWest"]
["2011-03-08","Tina","PCC",108,64.8,"NorthEast"]
["2009-11-21","Chin","Whole Foods",69,33.119999999999997,"West"]
["2006-07-27","Tina","Coop",109,57.77,"NorthWest"]
["2006-12-09","Sioux","Fred Myer",219,142.35,"East"]
["2010-10-15","Tom","PCC",142,68.16,"NorthEast"]
["2005-10-14","Sioux","Coop",1988,1510.88,"MidWest"]
["2010-10-30","Tina","Whole Foods",146,74.459999999999994,"NorthEast"]
["2009-11-30","Sioux","Safeway",210,102.9,"West"]
["2009-01-29","Tom","Whole Foods",883,397.35,"NorthEast"]
["2006-04-23","Tina","Coop",52,24.44,"MidWest"]
["2005-09-08","Tom","PCC",79,35.549999999999997,"NorthEast"]
["2009-11-24","Joy","Safeway",212,97.52,"West"]
["2010-05-19","Sioux","Coop",174,114.84,"NorthEast"]
["2009-01-19","Sioux","Safeway",74,35.520000000000003,"NorthWest"]
["2008-08-24","Tom","Whole Foods",157,95.77,"East"]
["2006-12-13","Chin","Whole Foods",1159,834.48,"MidWest"]
["2009-04-04","Tom","Safeway",146,61.32,"East"]
["2005-10-20","Joy","PCC",138,57.96,"MidWest"]
["2007-06-04","Tom","PCC",145,100.05,"East"]
["2008-02-24","Sioux","Coop",232,183.28,"NorthWest"]
["2006-04-20","Sioux","PCC",236,174.64,"NorthEast"]
["2007-11-18","Tina","Whole Foods",192,140.16,"East"]
["2011-03-10","Sioux","Safeway",226,99.44,"West"]
["2006-04-04","Tina","Whole Foods",124,57.04,"NorthWest"]
["2007-12-08","Chin","Fred Myer",185,123.95,"MidWest"]
["2005-10-10","Tina","Whole Foods",1217,559.82000000000005,"NorthEast"]
["2008-04-08","Tina","Whole Foods",101,76.760000000000005,"West"]
["2005-11-04","Joy","Whole Foods",91,56.42,"West"]
["2007-02-25","Joy","Coop",82,33.619999999999997,"East"]
["2005-12-05","Chin","PCC",232,92.8,"NorthEast"]
["2008-12-10","Joy","Coop",164,75.44,"East"]
["2010-06-10","Joy","Safeway",176,119.68,"East"]
["2007-09-23","Tom","Safeway",72,32.4,"NorthEast"]
["2010-10-11","Joy","Fred Myer",190,134.9,"MidWest"]
["2006-07-03","Tina","Safeway",183,118.95,"NorthEast"]
["2007-04-25","Tom","Whole Foods",1490,1147.3,"MidWest"]
["2010-09-12","Chin","Fred Myer",150,109.5,"MidWest"]
["2011-02-09","Sioux","Safeway",250,160,"East"]
["2008-02-10","Sioux","Coop",63,37.799999999999997,"NorthWest"]
["2008-04-29","Tina","PCC",56,23.52,"East"]
["2006-04-06","Tom","PCC",170,76.5,"NorthEast"]
["2006-01-23","Sioux","Fred Myer",90,72,"West"]
["2005-06-04","Tom","Coop",1199,803.33,"West"]
["2011-03-24","Joy","Whole Foods",152,82.08,"MidWest"]
["2008-06-23","Chin","Coop",97,73.72,"MidWest"]
["2008-05-18","Joy","Whole Foods",1041,676.65,"East"]
["2007-12-17","Joy","Safeway",59,40.71,"NorthWest"]
["2005-07-26","Chin","PCC",93,46.5,"MidWest"]
["2005-08-23","Sioux","Whole Foods",211,160.36000000000001,"East"]
["2010-08-11","Tom","Whole Foods",109,54.5,"East"]
["2006-05-31","Tina","Safeway",78,32.76,"NorthEast"]
["2007-07-27","Tom","Coop",146,97.82,"MidWest"]
["2010-03-31","Sioux","PCC",132,89.76,"NorthEast"]
["2009-01-21","Tom","Coop",66,49.5,"NorthWest"]
["2008-11-26","Chin","Fred Myer",83,58.1,"West"]
["2005-08-01","Joy","PCC",1976,1284.4000000000001,"West"]
["2010-02-09","Tom","PCC",243,179.82,"East"]
["2009-01-23","Tom","Safeway",219,113.88,"NorthWest"]
["2008-04-24","Chin","Fred Myer",190,115.9,"East"]
["2007-07-29","Tina","Safeway",1211,532.84,"MidWest"]
["2007-12-19","Sioux","PCC",123,60.27,"West"]
["2009-05-02","Chin","Whole Foods",64,29.44,"East"]
["2008-12-30","Chin","Safeway",126,59.22,"MidWest"]
["2009-06-24","Tom","Whole Foods",118,59,"West"]
["2006-07-04","Joy","Fred Myer",226,101.7,"West"]
["2008-01-23","Sioux","PCC",1708,1144.3599999999999,"MidWest"]
["2010-06-18","Chin","Fred Myer",65,40.950000000000003,"East"]
["2005-07-19","Joy","PCC",123,76.260000000000005,"MidWest"]
["2006-12-04","Tina","Safeway",221,97.24,"NorthEast"]
["2006-03-02","Tom","Safeway",92,43.24,"East"]
["2007-12-12","Sioux","Fred Myer",66,27.72,"MidWest"]
["2006-04-06","Sioux","Fred Myer",166,89.64,"NorthEast"]
["2010-10-26","Tom","Safeway",245,117.6,"NorthWest"]
["2007-02-07","Tina","Coop",51,29.58,"East"]
["2005-12-08","Sioux","Fred Myer",146,65.7,"MidWest"]
["2005-11-24","Chin","Fred Myer",1739,1130.3499999999999,"East"]
["2007-02-15","Joy","Safeway",1239,854.91,"NorthEast"]
["2008-11-16","Sioux","Whole Foods",179,93.08,"West"]
["2009-12-30","Tina","Coop",229,137.4,"West"]
["2008-11-30","Sioux","Whole Foods",170,79.900000000000006,"NorthWest"]
["2006-05-14","Chin","Fred Myer",125,80,"MidWest"]
["2008-06-25","Tom","Fred Myer",109,57.77,"West"]
["2006-04-18","Chin","PCC",60,27,"MidWest"]
["2007-12-18","Joy","Safeway",198,91.08,"East"]
["2008-04-28","Joy","Coop",247,163.02000000000001,"West"]
["2011-04-06","Tom","Safeway",1065,553.79999999999995,"MidWest"]
["2007-05-11","Joy","Fred Myer",150,81,"NorthWest"]
["2008-09-22","Tina","Whole Foods",53,30.21,"NorthEast"]
["2008-06-30","Tina","Fred Myer",105,43.05,"East"]
["2009-05-05","Sioux","Fred Myer",226,92.66,"NorthWest"]
["2010-11-19","Tina","Coop",110,58.3,"East"]
["2009-11-22","Tina","Coop",217,108.5,"NorthWest"]
["2008-05-09","Joy","Whole Foods",190,138.69999999999999,"West"]
["2005-06-09","Tina","Safeway",833,416.5,"NorthWest"]
["2007-04-07","Tina","Coop",224,120.96,"NorthEast"]
["2006-12-14","Tina","PCC",1819,1164.1600000000001,"NorthEast"]
["2009-02-20","Chin","Fred Myer",72,30.24,"East"]
["2007-08-07","Sioux","Whole Foods",189,136.08000000000001,"East"]
["2008-01-21","Joy","PCC",121,70.180000000000007,"East"]
["2010-03-09","Chin","Whole Foods",76,53.2,"NorthWest"]
["2008-07-26","Tina","Fred Myer",52,35.880000000000003,"MidWest"]
["2006-03-24","Tina","Fred Myer",160,107.2,"NorthWest"]
["2010-09-13","Joy","Safeway",198,142.56,"NorthEast"]
["2008-11-09","Tina","Coop",52,22.36,"NorthWest"]
["2010-02-08","Chin","Whole Foods",183,144.57,"NorthWest"]
["2009-04-23","Sioux","PCC",1765,794.25,"West"]
["2006-09-12","Tom","Coop",242,164.56,"NorthWest"]
["2011-02-16","Tina","Fred Myer",68,31.28,"MidWest"]
["2007-01-07","Joy","Whole Foods",147,89.67,"NorthEast"]
["2010-12-01","Chin","Safeway",75,35.25,"NorthEast"]
["2007-04-12","Sioux","Coop",897,520.26,"NorthEast"]
["2007-01-05","Tom","PCC",63,28.98,"NorthEast"]
["2009-08-23","Tom","Fred Myer",107,55.64,"East"]
["2010-01-14","Sioux","Coop",111,76.59,"MidWest"]
["2007-01-06","Tom","Whole Foods",147,70.56,"NorthEast"]
["2010-09-20","Tina","Coop",1970,1103.2,"East"]
["2010-06-18","Sioux","PCC",217,160.58000000000001,"West"]
["2009-06-02","Sioux","Coop",120,64.8,"NorthEast"]
["2009-02-21","Chin","PCC",222,99.9,"MidWest"]
["2007-07-09","Tina","Fred Myer",191,114.6,"East"]
["2011-02-25","Sioux","PCC",147,101.43,"MidWest"]
["2007-07-03","Tom","Whole Foods",195,79.95,"West"]
["2008-01-09","Chin","PCC",234,182.52,"NorthEast"]
["2008-04-01","Joy","Coop",86,61.92,"MidWest"]
["2008-08-12","Tom","Fred Myer",216,159.84,"NorthEast"]
["2010-05-26","Tom","Coop",1447,1070.78,"NorthEast"]
["2008-05-27","Tom","Safeway",75,47.25,"NorthEast"]
["2006-01-30","Tina","Safeway",678,366.12,"West"]
["2011-03-30","Chin","Fred Myer",79,48.19,"East"]
["2005-09-12","Chin","Safeway",121,61.71,"East"]
["2007-01-24","Tom","Coop",154,80.08,"East"]
["2006-01-21","Chin","Coop",76,37.24,"NorthEast"]
["2009-04-06","Chin","Whole Foods",222,115.44,"MidWest"]
["2006-07-31","Tom","Fred Myer",99,50.49,"NorthWest"]
["2011-02-03","Tom","PCC",73,39.42,"NorthWest"]
["2011-05-12","Tina","Fred Myer",1081,745.89,"NorthEast"]
["2008-07-10","Sioux","Safeway",218,91.56,"East"]
["2006-08-21","Joy","Fred Myer",98,47.04,"East"]
["2007-07-11","Sioux","Fred Myer",110,57.2,"East"]
["2008-01-27","Joy","Coop",193,137.03,"West"]
["2007-07-12","Tom","PCC",154,63.14,"NorthWest"]
["2010-09-29","Joy","Safeway",72,47.52,"NorthWest"]
["2010-11-16","Tom","Fred Myer",118,79.06,"NorthEast"]
["2006-04-18","Chin","Safeway",68,52.36,"NorthWest"]
["2010-02-25","Sioux","Coop",1070,577.79999999999995,"NorthEast"]
["2010-05-19","Joy","Fred Myer",1550,1007.5,"West"]
["2011-06-04","Sioux","Coop",164,104.96,"East"]
["2005-12-07","Sioux","Coop",55,41.8,"MidWest"]
["2010-12-30","Tina","Whole Foods",208,164.32,"NorthEast"]
["2010-02-12","Sioux","Coop",132,68.64,"East"]
["2007-11-20","Joy","PCC",227,181.6,"NorthWest"]
["2007-03-15","Chin","PCC",219,122.64,"NorthEast"]
["2008-03-24","Chin","Whole Foods",58,35.96,"MidWest"]
["2007-09-15","Chin","Safeway",177,92.04,"NorthWest"]
["2006-05-05","Tina","Safeway",177,88.5,"East"]
["2007-11-07","Chin","Fred Myer",1023,583.11,"NorthWest"]
["2008-08-25","Sioux","Coop",137,72.61,"West"]
["2007-08-11","Joy","PCC",71,43.31,"West"]
["2009-07-24","Sioux","Whole Foods",243,128.79,"MidWest"]
["2006-12-16","Sioux","Whole Foods",235,159.80000000000001,"MidWest"]
["2009-06-15","Sioux","PCC",176,75.680000000000007,"West"]
["2010-10-10","Chin","PCC",1118,458.38,"NorthWest"]
["2011-01-07","Chin","Coop",66,38.94,"West"]
["2011-03-27","Chin","Coop",133,99.75,"West"]
["2008-05-28","Joy","Coop",173,112.45,"East"]
["2008-06-09","Chin","PCC",1647,872.91,"MidWest"]
["2006-03-13","Joy","Whole Foods",218,165.68,"East"]
["2010-10-25","Sioux","Coop",187,143.99,"NorthWest"]
["2007-09-26","Joy","Whole Foods",160,108.8,"MidWest"]
["2006-09-15","Tom","Coop",138,66.239999999999995,"MidWest"]
["2007-10-18","Tom","Coop",234,166.14,"NorthWest"]
["2006-12-02","Chin","PCC",101,61.61,"West"]
["2007-04-27","Joy","Fred Myer",181,132.13,"NorthWest"]
["2005-12-08","Sioux","Safeway",77,46.97,"NorthEast"]
["2007-01-10","Tom","Coop",219,116.07,"West"]
["2008-07-15","Sioux","Safeway",1166,897.82,"MidWest"]
["2010-10-06","Tina","Coop",150,106.5,"NorthWest"]
["2005-10-15","Tom","Coop",226,178.54,"MidWest"]
["2010-08-02","Tom","PCC",902,523.16,"West"]
["2008-07-15","Tom","Safeway",138,59.34,"MidWest"]
["2010-07-31","Chin","Fred Myer",199,79.599999999999994,"NorthWest"]
["2010-05-17","Joy","PCC",130,66.3,"East"]
["2007-10-18","Tina","PCC",106,60.42,"NorthEast"]
["2010-04-07","Tina","Coop",196,96.04,"West"]
["2008-12-03","Chin","Fred Myer",145,82.65,"NorthEast"]
["2005-11-21","Tina","Fred Myer",1764,1146.5999999999999,"East"]
["2006-06-16","Sioux","Whole Foods",131,85.15,"West"]
["2010-12-03","Chin","Safeway",58,35.380000000000003,"MidWest"]
["2009-12-12","Chin","Whole Foods",54,39.42,"NorthWest"]
["2009-04-07","Joy","PCC",65,27.3,"NorthWest"]
["2007-10-13","Sioux","Fred Myer",111,75.48,"NorthEast"]
["2010-09-16","Joy","Fred Myer",234,180.18,"NorthEast"]
["2010-12-30","Tom","Fred Myer",194,87.3,"West"]
["2008-05-25","Sioux","PCC",153,93.33,"NorthEast"]
["2006-01-19","Chin","Fred Myer",248,143.84,"NorthEast"]
["2010-11-19","Tom","PCC",879,676.83,"MidWest"]
["2007-10-12","Chin","Whole Foods",189,107.73,"MidWest"]
["2010-12-03","Joy","PCC",141,71.91,"NorthEast"]
["2010-01-31","Sioux","Safeway",79,52.93,"NorthEast"]
["2006-05-03","Chin","PCC",86,40.42,"East"]
["2007-05-11","Joy","Fred Myer",165,92.4,"West"]
["2007-05-17","Chin","Safeway",206,142.13999999999999,"East"]
["2010-02-19","Joy","Coop",129,68.37,"NorthEast"]
["2008-04-05","Tina","PCC",164,83.64,"MidWest"]
["2009-08-12","Tina","Safeway",226,101.7,"West"]
["2006-01-31","Tom","PCC",1229,663.66,"NorthEast"]
["2009-04-23","Tom","PCC",127,52.07,"East"]
["2009-09-11","Tina","Safeway",218,167.86,"NorthWest"]
["2011-02-06","Tom","Coop",88,45.76,"West"]
["2010-05-31","Sioux","Safeway",144,87.84,"NorthEast"]
["2005-06-18","Sioux","PCC",220,151.80000000000001,"NorthEast"]
["2005-07-19","Tina","Safeway",209,87.78,"NorthEast"]
["2006-07-23","Joy","Coop",543,331.23,"NorthEast"]
["2010-08-31","Joy","Whole Foods",117,59.67,"NorthEast"]
["2006-12-04","Joy","Coop",113,90.4,"West"]
["2009-12-18","Tom","Fred Myer",1270,850.9,"West"]
["2007-05-06","Sioux","PCC",70,53.9,"West"]
["2006-03-09","Tom","Coop",144,97.92,"NorthEast"]
["2008-10-07","Tom","Coop",247,121.03,"East"]
["2006-04-11","Sioux","Fred Myer",73,55.48,"NorthWest"]
["2010-04-30","Tom","Coop",64,44.16,"MidWest"]
["2011-04-20","Chin","Coop",68,46.92,"NorthWest"]
["2007-01-22","Sioux","Coop",189,143.63999999999999,"West"]
["2010-01-03","Joy","Coop",147,107.31,"East"]
["2008-06-17","Joy","PCC",67,33.5,"MidWest"]
["2009-02-07","Joy","PCC",1583,680.69,"NorthWest"]
["2009-12-28","Tom","Fred Myer",184,99.36,"NorthEast"]
["2006-05-16","Sioux","Whole Foods",151,83.05,"East"]
["2007-04-13","Joy","Whole Foods",160,94.4,"MidWest"]
["2006-07-30","Tom","Coop",1233,517.86,"East"]
["2005-11-15","Tina","Safeway",246,182.04,"NorthEast"]
["2008-12-26","Chin","Safeway",57,35.909999999999997,"NorthEast"]
["2007-11-19","Joy","Safeway",58,31.32,"West"]
["2011-04-24","Joy","Fred Myer",153,104.04,"East"]
["2009-03-02","Tom","PCC",237,180.12,"West"]
["2010-03-23","Joy","Safeway",1688,776.48,"NorthEast"]
["2005-11-25","Chin","PCC",128,78.08,"East"]
["2005-09-21","Tom","Whole Foods",136,97.92,"MidWest"]
["2007-09-01","Tina","Coop",161,93.38,"West"]
["2009-05-08","Chin","Whole Foods",239,124.28,"NorthWest"]
["2010-05-12","Chin","Coop",126,79.38,"MidWest"]
["2010-11-30","Tom","Fred Myer",152,80.56,"West"]
["2006-09-19","Chin","Coop",98,67.62,"MidWest"]
["2010-05-04","Tom","Whole Foods",87,34.799999999999997,"NorthEast"]
["2009-08-14","Tom","Fred Myer",224,136.63999999999999,"East"]
["2009-10-02","Sioux","Safeway",1507,994.62,"NorthWest"]
["2006-07-18","Chin","Fred Myer",671,516.66999999999996,"NorthEast"]
["2005-09-26","Sioux","PCC",68,42.16,"East"]
["2008-03-29","Tina","PCC",92,38.64,"NorthWest"]
["2008-07-04","Sioux","Safeway",244,139.08000000000001,"East"]
["2009-12-11","Tom","Coop",225,114.75,"East"]
["2006-07-29","Tom","Safeway",68,28.56,"NorthEast"]
["2010-10-04","Sioux","PCC",132,96.36,"West"]
["2007-01-31","Sioux","PCC",143,80.08,"NorthEast"]
["2005-10-10","Joy","Coop",239,112.33,"East"]
["2011-04-22","Tina","Coop",1986,1290.9000000000001,"East"]
["2008-06-21","Tom","PCC",85,68,"NorthWest"]
["2010-01-14","Tom","Safeway",54,22.68,"East"]
["2011-02-02","Joy","Coop",243,104.49,"East"]
["2008-08-07","Tina","PCC",242,169.4,"West"]
["2007-11-18","Sioux","Coop",147,117.6,"NorthWest"]
["2007-11-17","Sioux","Fred Myer",106,73.14,"West"]
["2010-09-09","Chin","PCC",153,117.81,"West"]
["2007-11-13","Sioux","Coop",1011,657.15,"East"]
["2007-07-15","Tina","Safeway",152,104.88,"NorthEast"]
["2009-07-28","Tom","Coop",1685,1162.6500000000001,"East"]
["2008-09-08","Tina","Coop",160,128,"West"]
["2008-04-22","Joy","Fred Myer",228,111.72,"East"]
["2009-06-22","Sioux","Coop",224,112,"MidWest"]
["2009-08-12","Tom","Safeway",135,95.85,"NorthWest"]
["2008-02-13","Joy","PCC",99,52.47,"MidWest"]
["2006-05-05","Tom","Fred Myer",167,66.8,"East"]
["2009-02-21","Tom","Whole Foods",239,114.72,"NorthEast"]
["2005-07-30","Joy","Safeway",240,182.4,"East"]
["2011-05-01","Sioux","Fred Myer",144,66.239999999999995,"MidWest"]
["2009-10-31","Sioux","PCC",1481,636.83000000000004,"MidWest"]
["2007-04-05","Joy","Coop",112,86.24,"West"]
["2007-05-31","Tina","Coop",245,107.8,"East"]
["2009-07-18","Chin","Safeway",185,112.85,"West"]
["2009-12-12","Tina","Whole Foods",115,88.55,"NorthEast"]
["2010-05-16","Sioux","Fred Myer",730,372.3,"West"]
["2011-05-08","Joy","Safeway",181,108.6,"MidWest"]
["2005-11-28","Sioux","Whole Foods",119,54.74,"NorthEast"]
["2005-06-04","Tina","PCC",57,40.47,"NorthWest"]
["2006-06-25","Sioux","PCC",213,140.58000000000001,"East"]
["2010-10-12","Tom","Safeway",1412,833.08,"East"]
["2007-01-21","Tina","Safeway",125,80,"East"]
["2007-01-29","Chin","Coop",240,132,"MidWest"]
["2010-04-17","Chin","Safeway",86,62.78,"MidWest"]
["2008-04-25","Sioux","Whole Foods",82,40.18,"NorthWest"]
["2010-03-30","Joy","Safeway",133,59.85,"MidWest"]
["2007-12-19","Chin","Whole Foods",140,109.2,"NorthWest"]

{"sheet":"PT(1an)","index":12,"n_rows":12,"n_cols":2,"rows_kept":12,"cut":false,"hidden":false,"merged":[]}
[]
[]
["Row Labels","Sum of Sales"]
["0-249",75013]
["250-499",750]
["500-749",5790]
["750-999",11122]
["1000-1249",28854]
["1250-1499",19371]
["1500-1749",22895]
["1750-2000",30468]
["Grand Total",194263]

{"sheet":"Data Set","index":13,"n_rows":173,"n_cols":13,"rows_kept":173,"cut":false,"hidden":false,"merged":[]}
["Elements","Are the entities on which data are collected.  (Also called Primary Keys in Database & Excel)"]
["Variables","Characteristic or attribute of interest for the elements (Also called Fields in Database & Excel)",null,null,null,null,"** Column Headers, Column Labels",null,null,"**Variable = attribute or property that describes a person or thing (Conrad Carlberg)"]
["Observation","The set of measurements collected for a particular element (Also called Records in Database & Excel)"]
[]
["Company Name","Market Stock Value","Qtrly Rev Growth","EBITDA","Earnings per Share","P/E Ratio"]
["Whole Foods Market Inc. ","3.19B",0.27600000000000002,"510.27M",1.153,19.71]
["Kroger Co.","18.91B",0.115,"3.78B",1.7949999999999999,16.16]
["Safeway","12.27B",7.2999999999999995E-2,"2.93B",2.04,13.74]
[]
["Student ID","First","Last","Address","City","State"]
[8805859878,"Sioux","RadCool","14 13th Ave","Seattle","WA"]
[8805856589,"Chin","Pham","1344 Birch St.","Burien","WA"]
[8805852111,"Shelia","Dawn","5845 104th SW","Seattle","WA"]
[]
["Data","Facts and figures collected, summarized, analyzed, and interpreted. "]
["Data Set","The data collected in a particular study"]
["Number of Elements = Number of Observation","A data set with n elements contains n observations"]
["Total pieces of data ","Number of elements * # of variables"]
["Source of Data","Individual Companies, Data Companies, Trade Groups, Internet, Governments…"]
["Data Warehousing","Capturing, storing and maintaining data"]
["Data Mining","Creating useful information from large data sets (Like Amazon or Google)"]
[]
["Date","Open","High","Low","Close","Volume","Adj Close","Stock","% Monthly Return"]
["2004-10-01",27.82,28.89,27.55,27.97,65742900,22.38,"MSFT",1.1754068716093968E-2]
["2004-11-01",28.16,30.2,26.1,26.81,86446000,23.91,"MSFT",6.8364611260053776E-2,null,"Stock","Mean Monthly Return","StdDev"]
["2004-12-01",26.95,27.44,26.68,26.72,84488000,23.83,"MSFT",-3.3458803847763452E-3,null,"GOOG",2.6707495619597618E-2,0.11589014392691382]
["2005-01-03",26.8,27.1,25.64,26.28,79642800,23.44,"MSFT",-1.6365925304238194E-2,null,"MSFT",5.6751671392806782E-3,7.4469743916409828E-2]
["2005-02-01",26.25,26.5,25.13,25.16,75992300,22.51,"MSFT",-3.9675767918088689E-2]
["2005-03-01",25.19,25.79,23.82,24.17,72899700,21.62,"MSFT",-3.9537983118614006E-2]
["2005-04-01",24.24,25.45,23.94,25.3,77090200,22.63,"MSFT",4.6716003700277398E-2,null,"Stock","Mean Monthly Return","Variability In Returns"]
["2005-05-02",25.23,26.09,24.64,25.8,62699700,23.15,"MSFT",2.297834732655768E-2,null,"GOOG",{"$f":"AVERAGEIF($H$24:$H$173,K31,$I$24:$I$173)","v":2.6707495619597618E-2},{"$f":"_xlfn.STDEV.S(IF($H$24:$H$173=K31,$I$24:$I$173))","v":0.11589014392691382}]
["2005-06-01",25.73,26,24.82,24.84,62956700,22.29,"MSFT",-3.7149028077753776E-2,null,"MSFT",{"$f":"AVERAGEIF($H$24:$H$173,K32,$I$24:$I$173)","v":5.6751671392806782E-3},{"$f":"_xlfn.STDEV.S(IF($H$24:$H$173=K32,$I$24:$I$173))","v":7.4469743916409828E-2}]
["2005-07-01",24.85,26.48,24.5,25.61,69046600,22.98,"MSFT",3.0955585464333746E-2]
["2005-08-01",25.81,27.94,25.76,27.38,65529900,24.64,"MSFT",7.2236727589207961E-2]
["2005-09-01",27.38,27.39,25.12,25.73,66976400,23.16,"MSFT",-6.0064935064935043E-2]
["2005-10-03",25.71,25.8,24.25,25.7,72132400,23.13,"MSFT",-1.2953367875647714E-3]
["2005-11-01",25.61,28.25,25.61,27.68,71469100,24.99,"MSFT",8.0415045395590079E-2]
["2005-12-01",27.73,28.1,26.1,26.15,62892300,23.61,"MSFT",-5.5222088835534144E-2]
["2006-01-03",26.25,28.38,26.1,28.15,74173200,25.41,"MSFT",7.6238881829733263E-2]
["2006-02-01",27.96,28.07,26.34,26.87,58565000,24.34,"MSFT",-4.2109405745769379E-2]
["2006-03-01",26.98,28.22,26.62,27.21,65223100,24.65,"MSFT",1.2736236647493682E-2]
["2006-04-03",27.67,27.94,24,24.15,107219900,21.87,"MSFT",-0.11277890466531426]
["2006-05-01",24.32,25,22.45,22.65,110427000,20.6,"MSFT",-5.8070416095107436E-2]
["2006-06-01",22.74,23.65,21.46,23.3,92940200,21.19,"MSFT",2.8640776699029091E-2]
["2006-07-03",23.53,24.6,22.23,24.06,68627600,21.88,"MSFT",3.2562529495044679E-2]
["2006-08-01",24.02,26.25,23.85,25.7,50459500,23.45,"MSFT",7.1755027422303552E-2]
["2006-09-01",25.89,27.52,25.39,27.35,56588300,24.96,"MSFT",6.4392324093816677E-2]
["2006-10-02",27.32,28.85,27.15,28.71,61492200,26.2,"MSFT",4.9679487179487225E-2]
["2006-11-01",28.78,30,28.58,29.36,61544700,26.89,"MSFT",2.6335877862595503E-2]
["2006-12-01",29.23,30.26,28.8,29.86,58945000,27.34,"MSFT",1.673484566753447E-2]
["2007-01-03",29.91,31.48,29.4,30.86,69924300,28.26,"MSFT",3.3650329188003036E-2]
["2007-02-01",30.84,30.94,27.79,28.17,72483300,25.89,"MSFT",-8.3864118895966011E-2]
["2007-03-01",27.82,28.55,26.6,27.87,59843900,25.61,"MSFT",-1.0814986481266997E-2]
["2007-04-02",27.89,30.74,27.56,29.94,51337600,27.51,"MSFT",7.4189769621241686E-2]
["2007-05-01",29.94,31.16,29.9,30.69,64202000,28.29,"MSFT",2.8353326063249584E-2]
["2007-06-01",30.79,30.9,29.04,29.47,59647900,27.17,"MSFT",-3.9589961117002415E-2]
["2007-07-02",29.67,31.84,28.95,28.99,64862000,26.73,"MSFT",-1.619433198380571E-2]
["2007-08-01",28.95,30.1,27.51,28.73,55264800,26.58,"MSFT",-5.6116722783390305E-3]
["2007-09-04",28.5,29.85,28.27,29.46,61223000,27.25,"MSFT",2.5206922498118844E-2]
["2007-10-01",29.46,37,29.29,36.81,85080900,34.049999999999997,"MSFT",0.24954128440366952]
["2007-11-01",36.53,37.5,32.68,33.6,90498800,31.19,"MSFT",-8.3994126284875015E-2]
["2007-12-03",33.5,36.72,32.630000000000003,35.6,55002300,33.04,"MSFT",5.9313882654696837E-2]
["2008-01-02",35.79,35.96,31.04,32.6,97806800,30.26,"MSFT",-8.4140435835351024E-2]
["2008-02-01",31.06,33.25,27.02,27.2,122053500,25.35,"MSFT",-0.16226040978189027]
["2008-03-03",27.24,29.59,26.87,28.38,74958500,26.44,"MSFT",4.2998027613412315E-2]
["2008-04-01",28.83,32.1,27.93,28.52,69066000,26.58,"MSFT",5.2950075642963501E-3]
["2008-05-01",28.5,30.53,27.95,28.32,69931800,26.49,"MSFT",-3.3860045146726359E-3]
["2008-06-02",28.24,29.57,27.11,27.51,77058100,25.73,"MSFT",-2.8690071725179234E-2]
["2008-07-01",27.27,27.91,24.87,25.72,77180100,24.05,"MSFT",-6.5293431791682899E-2]
["2008-08-01",25.92,28.5,25.07,27.29,59889700,25.62,"MSFT",6.5280665280665229E-2]
["2008-09-02",27.67,27.76,23.5,26.69,96891900,25.06,"MSFT",-2.1857923497267895E-2]
["2008-10-01",26.38,27.47,20.65,22.33,136418800,20.97,"MSFT",-0.16320830007980847]
["2008-11-03",22.48,23.66,17.5,20.22,95976900,19.11,"MSFT",-8.8698140200286102E-2]
["2008-12-01",19.88,21.25,18.47,19.440000000000001,72425500,18.38,"MSFT",-3.8199895342752477E-2]
["2009-01-02",19.53,21,16.75,17.100000000000001,81319400,16.170000000000002,"MSFT",-0.12023939064200206]
["2009-02-02",17.03,19.93,16.100000000000001,16.149999999999999,81560000,15.37,"MSFT",-4.9474335188621099E-2]
["2009-03-02",15.96,18.88,14.87,18.37,78069100,17.48,"MSFT",0.13728041639557587]
["2009-04-01",18.23,21.2,18.18,20.260000000000002,78563800,19.28,"MSFT",0.10297482837528604]
["2009-05-01",20.190000000000001,20.94,19.010000000000002,20.89,57362800,20.010000000000002,"MSFT",3.7863070539419175E-2]
["2009-06-01",21,24.34,20.86,23.77,67163500,22.77,"MSFT",0.13793103448275845]
["2009-07-01",24.05,25.72,22,23.52,71441700,22.53,"MSFT",-1.0540184453227908E-2]
["2009-08-03",23.82,25.49,23.03,24.65,49659200,23.74,"MSFT",5.3706169551708705E-2]
["2009-09-01",24.35,26.25,23.76,25.72,52500600,24.77,"MSFT",4.3386689132266287E-2]
["2009-10-01",25.41,29.35,24.43,27.73,72581900,26.71,"MSFT",7.8320549051271726E-2]
["2009-11-02",27.7,30.14,27.41,29.41,53121400,28.45,"MSFT",6.514414077124675E-2]
["2009-12-01",29.52,31.5,29.25,30.48,43297000,29.49,"MSFT",3.6555360281194993E-2]
["2010-01-04",30.62,31.24,27.66,28.18,81765200,27.26,"MSFT",-7.5618853848762213E-2]
["2010-02-01",28.39,29.03,27.57,28.67,58684900,27.87,"MSFT",2.2377109317681665E-2]
["2010-03-01",28.77,30.57,28.24,29.29,51043300,28.47,"MSFT",2.152852529601712E-2]
["2010-04-01",29.35,31.58,28.62,30.54,65821100,29.69,"MSFT",4.2852125043906009E-2]
["2010-05-03",30.67,31.06,24.56,25.8,89381300,25.19,"MSFT",-0.15156618390030308]
["2010-06-01",25.53,26.93,22.95,23.01,79675500,22.47,"MSFT",-0.10797935688765392]
["2010-07-01",23.09,26.41,22.73,25.81,71053500,25.2,"MSFT",0.12149532710280386]
["2010-08-02",25.99,26.38,23.32,23.47,61156600,23.04,"MSFT",-8.5714285714285743E-2]
["2010-09-01",23.67,25.53,23.54,24.49,63542900,24.04,"MSFT",4.3402777777777679E-2]
["2010-10-01",24.77,27.2,23.78,26.67,66458300,26.18,"MSFT",8.9018302828618889E-2]
["2010-11-01",26.88,28.87,24.93,25.26,68402700,24.95,"MSFT",-4.6982429335370557E-2]
["2010-12-01",25.57,28.4,25.56,27.91,48111900,27.57,"MSFT",0.10501002004008031]
["2004-10-01",130.80000000000001,199.95,128.9,190.64,13249000,190.64,"GOOG",0.47098765432098766]
["2004-11-01",193.55,201.6,161.31,181.98,13585400,181.98,"GOOG",-4.5425933697020526E-2]
["2004-12-01",181.95,199.88,168.47,192.79,6955000,192.79,"GOOG",5.9402132102428951E-2]
["2005-01-03",197.4,205.3,176.29,195.62,10738000,195.62,"GOOG",1.467918460501072E-2]
["2005-02-01",194.38,216.8,181,187.99,17548800,187.99,"GOOG",-3.9004191800429355E-2]
["2005-03-01",189.29,189.85,172.57,180.51,8123500,180.51,"GOOG",-3.9789350497366982E-2]
["2005-04-01",181.76,224.74,179.84,220,11231400,220,"GOOG",0.2187690432663012]
["2005-05-02",222.05,278.39999999999998,220.21,277.27,13143100,277.27,"GOOG",0.26031818181818167]
["2005-06-01",283.2,309.25,267.43,294.14999999999998,18368000,294.14999999999998,"GOOG",6.0879287337252563E-2]
["2005-07-01",295.04000000000002,317.8,286.99,287.76,10665600,287.76,"GOOG",-2.1723610402855642E-2]
["2005-08-01",288.12,299.72000000000003,273.35000000000002,286,6435000,286,"GOOG",-6.1162079510702627E-3]
["2005-09-01",285.91000000000003,320.95,285,316.45999999999998,8538300,316.45999999999998,"GOOG",0.10650349650349633]
["2005-10-03",313.63,374.75,290.68,372.14,9871600,372.14,"GOOG",0.175946407128863]
["2005-11-01",371.86,431.24,369.01,404.91,10822000,404.91,"GOOG",8.8058257644972437E-2]
["2005-12-01",409.2,446.21,399.01,414.86,9826200,414.86,"GOOG",2.4573361981674813E-2]
["2006-01-03",422.52,475.11,394.74,432.66,16055300,432.66,"GOOG",4.2906040592006978E-2]
["2006-02-01",389.03,406.5,337.83,362.62,17734800,362.62,"GOOG",-0.16188230943466009]
["2006-03-01",368.56,399,331.55,390,14925400,390,"GOOG",7.550603938006728E-2]
["2006-04-03",389.53,450.72,387.93,417.94,10143900,417.94,"GOOG",7.1641025641025591E-2]
["2006-05-01",418.47,419.44,360.57,371.82,8360000,371.82,"GOOG",-0.11035076805283062]
["2006-06-01",373.54,419.33,371.6,419.33,6756300,419.33,"GOOG",0.127776881286644]
["2006-07-03",420.04,427.89,377.69,386.6,6605800,386.6,"GOOG",-7.8053084682707996E-2]
["2006-08-01",385.11,390,363.36,378.53,4779600,378.53,"GOOG",-2.0874288670460595E-2]
["2006-09-01",380.99,418.69,376.72,401.9,6243100,401.9,"GOOG",6.1738831796687155E-2]
["2006-10-02",401.9,491.96,398.19,476.39,7490800,476.39,"GOOG",0.1853446130878329]
["2006-11-01",478.76,513,465.06,484.81,5905600,484.81,"GOOG",1.767459434496943E-2]
["2006-12-01",485.98,492.4,452.34,460.48,4711100,460.48,"GOOG",-5.0184608403291975E-2]
["2007-01-03",466,513,461.11,501.5,6839600,501.5,"GOOG",8.9080958999305127E-2]
["2007-02-01",506,506.01,443.04,449.45,6418200,449.45,"GOOG",-0.10378863409770689]
["2007-03-01",442.67,466,437,458.16,5522500,458.16,"GOOG",1.9379241294916083E-2]
["2007-04-02",457.76,492.5,452.12,471.38,4829900,471.38,"GOOG",2.8854548629299703E-2]
["2007-05-01",472.19,508.78,457.41,497.91,4932000,497.91,"GOOG",5.62815562815564E-2]
["2007-06-01",501,534.99,497.59,522.70000000000005,6329900,522.70000000000005,"GOOG",4.9788114317848686E-2]
["2007-07-02",525.49,558.58000000000004,498.88,510,5757200,510,"GOOG",-2.4296919839296049E-2]
["2007-08-01",510.5,526.82000000000005,480.46,515.25,3985700,515.25,"GOOG",1.0294117647058787E-2]
["2007-09-04",515.02,571.79,510.88,567.27,3792200,567.27,"GOOG",0.10096069868995627]
["2007-10-01",569.97,707,569.61,707,7057700,707,"GOOG",0.24632009448763381]
["2007-11-01",702.79,747.24,616.02,693,8539500,693,"GOOG",-1.980198019801982E-2]
["2007-12-03",691.01,724.8,652.5,691.48,4384500,691.48,"GOOG",-2.1933621933621916E-3]
["2008-01-02",692.87,697.37,519,564.29999999999995,8221900,564.29999999999995,"GOOG",-0.18392433620639792]
["2008-02-01",528.66999999999996,541.04,446.85,471.18,9330500,471.18,"GOOG",-0.16501860712387018]
["2008-03-03",471.51,472.72,412.11,440.47,7503000,440.47,"GOOG",-6.5176790186340594E-2]
["2008-04-01",447.74,584.86,441,574.29,6861200,574.29,"GOOG",0.30381183735555184]
["2008-05-01",578.30999999999995,602.45000000000005,537.80999999999995,585.79999999999995,5136000,585.79999999999995,"GOOG",2.0042138989012415E-2]
["2008-06-02",582.5,588.04,515.09,526.41999999999996,4645200,526.41999999999996,"GOOG",-0.10136565380675999]
["2008-07-01",519.58000000000004,555.67999999999995,465.6,473.75,4861400,473.75,"GOOG",-0.10005318946848518]
["2008-08-01",472.51,510.66,461.9,463.29,3460100,463.29,"GOOG",-2.2079155672823148E-2]
["2008-09-02",476.77,482.18,380.71,400.52,6531600,400.52,"GOOG",-0.13548749163590845]
["2008-10-01",411.15,416.98,309.44,359.36,8987700,359.36,"GOOG",-0.10276640367522216]
["2008-11-03",357.58,372.36,247.3,292.95999999999998,8452500,292.95999999999998,"GOOG",-0.18477292965271608]
["2008-12-01",286.68,329.5,262.58,307.64999999999998,5267900,307.64999999999998,"GOOG",5.0143364281813207E-2]
["2009-01-02",308.60000000000002,352.33,282.75,338.53,5727600,338.53,"GOOG",0.10037380139769225]
["2009-02-02",334.29,381,329.55,337.99,6158100,337.99,"GOOG",-1.595131893775914E-3]
["2009-03-02",333.33,359.16,289.45,348.06,5346800,348.06,"GOOG",2.9793780881091081E-2]
["2009-04-01",343.78,403.75,340.61,395.97,4389900,395.97,"GOOG",0.13764868126185137]
["2009-05-01",395.03,417.23,384.69,417.23,2984100,417.23,"GOOG",5.369093618203391E-2]
["2009-06-01",418.73,447.34,401.89,421.59,3320600,421.59,"GOOG",1.0449871773362318E-2]
["2009-07-01",424.2,452.7,395.98,443.05,3448900,443.05,"GOOG",5.0902535638891022E-2]
["2009-08-03",448.74,474.35,438.56,461.67,2414100,461.67,"GOOG",4.2026859270962724E-2]
["2009-09-01",459.68,507,452.59,495.85,2581900,495.85,"GOOG",7.4035566530205488E-2]
["2009-10-01",493,561.64,482.6,536.12,3665500,536.12,"GOOG",8.1214076837753391E-2]
["2009-11-02",537.08000000000004,587.05999999999995,528.24,583,2131500,583,"GOOG",8.7443109751548231E-2]
["2009-12-01",588.13,625.99,579.17999999999995,619.98,1992700,619.98,"GOOG",6.3430531732418638E-2]
["2010-01-04",626.95000000000005,629.51,525.61,529.94000000000005,4907400,529.94000000000005,"GOOG",-0.14523049130617105]
["2010-02-01",534.6,547.5,520,526.79999999999995,2846500,526.79999999999995,"GOOG",-5.9251990791412412E-3]
["2010-03-01",529.20000000000005,588.28,527.74,567.12,3774000,567.12,"GOOG",7.6537585421412313E-2]
["2010-04-01",571.35,597.84,521.03,525.70000000000005,3595000,525.70000000000005,"GOOG",-7.3035689095782175E-2]
["2010-05-03",526.5,532.91999999999996,460,485.63,4222800,485.63,"GOOG",-7.6222179950542257E-2]
["2010-06-01",480.43,509.25,444.72,444.95,2884800,444.95,"GOOG",-8.376747729753109E-2]
["2010-07-01",445.29,497.5,433.63,484.85,3402500,484.85,"GOOG",8.9672996965951324E-2]
["2010-08-02",488.99,508.6,447.65,450.02,2491000,450.02,"GOOG",-7.1836650510467281E-2]
["2010-09-01",454.98,536.85,452.5,525.79,2997300,525.79,"GOOG",0.16837029465357101]
["2010-10-01",530,624.74,518.85,613.70000000000005,3886900,613.70000000000005,"GOOG",0.16719602883280404]
["2010-11-01",615.73,630.85,553.30999999999995,555.71,3121800,555.71,"GOOG",-9.4492423007984327E-2]
["2010-12-01",563,607,562.4,593.97,1992000,593.97,"GOOG",6.8848860016915259E-2]

{"sheet":"PT(2an)","index":14,"n_rows":6,"n_cols":3,"rows_kept":6,"cut":false,"hidden":false,"merged":[]}
[]
[]
["Row Labels","Average of % Monthly Return","StdDev of % Monthly Return2"]
["GOOG",2.6707495619597618E-2,0.11589014392691382]
["MSFT",5.6751671392806782E-3,7.4469743916409828E-2]
["Grand Total",1.6191331379439147E-2,9.7651355750570823E-2]

{"sheet":"ExcelTable","index":15,"n_rows":9,"n_cols":7,"rows_kept":9,"cut":false,"hidden":false,"merged":[]}
["Date","Car","Amount",null,"Car","Total","Count"]
["2011-06-21","Camry",24000,null,"Camry"]
["2011-06-21","Rav",19000,null,"Rav"]
["2011-06-21","Accord",24100,null,"Accord"]
["2011-06-22","Camry",23550]
["2011-06-23","Rav",21500]
["2011-06-23","Accord",26500,null,"**Compare numeric value across category of interest"]
["2011-06-23","Accord",23000]
["2011-06-23","Rav",20950]

{"sheet":"ExcelTable (an)","index":16,"n_rows":9,"n_cols":7,"rows_kept":9,"cut":false,"hidden":false,"merged":[]}
["Date","Car","Amount",null,"Car","Total","Count"]
["2011-06-21","Camry",24000,null,"Camry",{"$f":"SUMIF($B$2:$B$9,E2,$C$2:$C$9)","v":47550},{"$f":"COUNTIF($B$2:$B$9,E2)","v":2}]
["2011-06-21","Rav",19000,null,"Rav",{"$f":"SUMIF($B$2:$B$9,E3,$C$2:$C$9)","v":61450},{"$f":"COUNTIF($B$2:$B$9,E3)","v":3}]
["2011-06-21","Accord",24100,null,"Accord",{"$f":"SUMIF($B$2:$B$9,E4,$C$2:$C$9)","v":73600},{"$f":"COUNTIF($B$2:$B$9,E4)","v":3}]
["2011-06-22","Camry",23550]
["2011-06-23","Rav",21500]
["2011-06-23","Accord",26500,null,"**Compare numeric value across category of interest"]
["2011-06-23","Accord",23000]
["2011-06-23","Rav",20950]

{"sheet":"CrossSectional","index":17,"n_rows":27,"n_cols":7,"rows_kept":27,"cut":false,"hidden":false,"merged":[]}
["Cross Sectional = One Point In Time"]
[]
["County","Date","Number of Building Permits Issued",null,"Date","County","Permits Issued"]
["County 01","2007-06-30",173,null,"2007-06-30"]
["County 02","2007-06-30",172,null,null,"County 06",0]
["County 03","2007-06-30",248,null,null,"County 10",62]
["County 04","2007-06-30",152,null,null,"County 14",67]
["County 05","2007-06-30",73,null,null,"County 11",67]
["County 06","2007-06-30",0,null,null,"County 05",73]
["County 07","2007-06-30",98,null,null,"County 17",80]
["County 08","2007-06-30",126,null,null,"County 07",98]
["County 09","2007-06-30",231,null,null,"County 08",126]
["County 10","2007-06-30",62,null,null,"County 13",149]
["County 11","2007-06-30",67,null,null,"County 04",152]
["County 12","2007-06-30",186,null,null,"County 02",172]
["County 13","2007-06-30",149,null,null,"County 01",173]
["County 14","2007-06-30",67,null,null,"County 16",178]
["County 15","2007-06-30",220,null,null,"County 12",186]
["County 16","2007-06-30",178,null,null,"County 15",220]
["County 17","2007-06-30",80,null,null,"County 09",231]
[null,null,null,null,null,"County 03",248]
[null,null,null,null,"Grand Total",null,2282]
[]
[]
[]
[]
["One Time, Many Categories"]

{"sheet":"TimeSeries","index":18,"n_rows":33,"n_cols":7,"rows_kept":33,"cut":false,"hidden":false,"merged":[]}
["Time Series = One or more categories across time"]
[]
["County","Date","Number of Building Permits Issued",null,"County","Date","Building Permits Issued"]
["LUCAS","2007-06-30",100,null,"LUCAS","2007-06-30",100]
["LUCAS","2007-07-31",80,null,null,"2007-07-31",80]
["LUCAS","2007-08-31",95,null,null,"2007-08-31",95]
["LUCAS","2007-09-30",65,null,null,"2007-09-30",65]
["LUCAS","2007-10-31",50,null,null,"2007-10-31",50]
["LUCAS","2007-11-30",60,null,null,"2007-11-30",60]
["LUCAS","2007-12-31",27,null,null,"2007-12-31",27]
["LUCAS","2008-01-31",15,null,null,"2008-01-31",15]
["LUCAS","2008-02-29",20,null,null,"2008-02-29",20]
["LUCAS","2008-03-31",30,null,null,"2008-03-31",30]
["LUCAS","2008-04-30",32,null,null,"2008-04-30",32]
["LUCAS","2008-05-31",15,null,null,"2008-05-31",15]
["LUCAS","2008-06-30",10,null,null,"2008-06-30",10]
["LUCAS","2008-07-31",22,null,null,"2008-07-31",22]
["LUCAS","2008-08-31",41,null,null,"2008-08-31",41]
["LUCAS","2008-09-30",37,null,null,"2008-09-30",37]
["LUCAS","2008-10-31",66,null,null,"2008-10-31",66]
[null,null,null,null,"Grand Total",null,765]
[]
[]
[]
[]
[]
[]
[]
[]
[]
[]
[]
["One Category, Many Times"]

{"sheet":"TimeSeries (2)","index":19,"n_rows":22,"n_cols":7,"rows_kept":22,"cut":false,"hidden":false,"merged":[]}
["Sales of Organic Foods (In Millions)"]
[null,2005,2006,2007,2008]
["Whole Foods",5000000000,6000000000,8500000000,7900000000]
["Safeway",500000000,2000000000,3000000000,2520000000]
["Trader Joes",1000000000,1200000000,1300000000,1250000000]
[]
[]
[null,null,null,null,null,null,"Time Series ==>"]
[]
[]
[]
[]
[]
[]
[]
[]
[]
[]
[]
[]
[]
[null,null,null,null,null,null,"Cross-sectional ==>"]

{"sheet":"TimeSeries (2an)","index":20,"n_rows":22,"n_cols":7,"rows_kept":22,"cut":false,"hidden":false,"merged":[]}
["Sales of Organic Foods (In Millions)"]
[null,2005,2006,2007,2008]
["Whole Foods",5000000000,6000000000,8500000000,7900000000]
["Safeway",500000000,2000000000,3000000000,2520000000]
["Trader Joes",1000000000,1200000000,1300000000,1250000000]
[]
[]
[null,null,null,null,null,null,"Time Series ==>"]
[]
[]
[]
[]
[]
[]
[]
[]
[]
[]
[]
[]
[]
[null,null,null,null,null,null,"Cross-sectional ==>"]

{"sheet":"Data","index":21,"n_rows":0,"n_cols":0,"rows_kept":0,"cut":false,"hidden":false,"merged":[]}

{"sheet":"SM(1)","index":22,"n_rows":685,"n_cols":39,"rows_kept":685,"cut":false,"hidden":false,"merged":[[17,20,19,21],[20,20,22,21],[17,28,19,29],[20,28,22,29]]}
["Nominal","When a variable (field) uses a category, label, or name to identify an attribute or characteristic of an element. There is no order or rank to the categories. You usually count how many are in each category. If you use a number as a category label, you cannot do arithmetic (+, -, *. /, ^) on it - you can only count.",null,null,null,null,null,"Ordinal","When a variable (field) uses a category, label, or name to identify an attribute or characteristic of an element.  There is an order or rank to the categories, but you do not know the distance between each ranked category. You usually count how many are in each category. In some cases when a number is used to represent the category, you can calculate an average.",null,null,null,null,null,"Interval","The numeric data is ranked or ordered and has a fixed unit between each rank. Interval data is usually a scale such as temperature or some tests like IQ or SAT. If zero is in the scale, it is just a point on the scale and zero does not indicate that nothing exists. You can perform subtraction to see the difference between two numbers and you can calculate an average, but the ratio of two numbers (division) not meaningful (like to calculate % change).",null,null,null,null,null,null,null,"Ratio","The numeric data is ranked or ordered and has a fixed unit between each rank and zero means that nothing exists and division (ratio) is okay (like to calculate % change).",null,null,null,null,null,null,null,null,null,null,"interval",null,null,"interval"]
["Categorical Data (Variable). Categories, labels or names are used to identify an attribute or characteristic of an element. Nominal or Ordinal. Non-numeric or numeric. Most of the time you are limited to counting.",null,null,null,null,null,null,null,null,null,null,null,null,null,"Quantitative Data (Variable). A number that tells us how much or how many.",null,null,null,null,null,null,null,null,null,null,null,null,null,null,null,null,null,null,null,null,300,null,null,1000]
[]
["Student","Phone Type","Phone Type",null,"Phone Type","Count of Phone Type",null,"Student","Rate Instructor","Rate Instructor",null,"Rate Instructor","Frequency (Count)",null,"Fahrenheit","Celsius",null,"Student","SAT scores",null,"Category","Frequency (Count)",null,"Kelvin",null,"Customer Name","Amount in Bank",null,"Category","Frequency (Count)",null,null,null,null,"Lower","Upper",null,"Lower","Upper"]
["Student 01","Motorola",{"$f":"VLOOKUP(B5,{\"iPhone\",1;\"Motorola\",2;\"Nokia\",3;\"Samsung\",4;\"Sony Erickson\",5;\"Sprint\",6},2,0)","v":2},null,"iPhone",104,null,"Student 01","OK",{"$f":"VLOOKUP(I5,{\"Excellent\",4;\"Poor\",1;\"Good\",3;\"OK\",2},2,0)","v":2},null,"Excellent",{"$f":"COUNTIF($I$5:$I$389,L5)","v":56},null,220,{"$f":"CONVERT(O5,\"F\",\"C\")","v":104.44444444444444},null,"Student 1",1501,null,{"$f":"AI5&\" up tp \"&AJ5","v":"600 up tp 900"},{"$f":"COUNTIFS($S$5:$S$17,\">=\"&AI5,$S$5:$S$17,\"<\"&AJ5)","v":0},null,{"$f":"CONVERT(O5,\"F\",\"K\")","v":377.59444444444443},null,"Joe",0,null,{"$f":"AL5&\" up tp \"&AM5","v":"0 up tp 1000"},{"$f":"COUNTIFS($AA$5:$AA$14,\">=\"&AL5,$AA$5:$AA$14,\"<\"&AM5)","v":5},null,null,null,null,600,{"$f":"AI5+$AJ$2","v":900},null,0,{"$f":"AL5+$AM$2","v":1000}]
["Student 02","Motorola",{"$f":"VLOOKUP(B6,{\"iPhone\",1;\"Motorola\",2;\"Nokia\",3;\"Samsung\",4;\"Sony Erickson\",5;\"Sprint\",6},2,0)","v":2},null,"Motorola",52,null,"Student 02","Poor",{"$f":"VLOOKUP(I6,{\"Excellent\",4;\"Poor\",1;\"Good\",3;\"OK\",2},2,0)","v":1},null,"Good",47,null,219,103.88888888888889,null,"Student 2",1499,null,"900 up tp 1200",6,null,{"$f":"CONVERT(O6,\"F\",\"K\")","v":377.03888888888889},null,"Sioux",500,null,{"$f":"AL6&\" up tp \"&AM6","v":"1000 up tp 2000"},{"$f":"COUNTIFS($AA$5:$AA$14,\">=\"&AL6,$AA$5:$AA$14,\"<\"&AM6)","v":1},null,null,null,null,{"$f":"AJ5","v":900},1200,null,{"$f":"AM5","v":1000},{"$f":"AL6+$AM$2","v":2000}]
["Student 03","Samsung",{"$f":"VLOOKUP(B7,{\"iPhone\",1;\"Motorola\",2;\"Nokia\",3;\"Samsung\",4;\"Sony Erickson\",5;\"Sprint\",6},2,0)","v":4},null,"Nokia",89,null,"Student 03","Good",{"$f":"VLOOKUP(I7,{\"Excellent\",4;\"Poor\",1;\"Good\",3;\"OK\",2},2,0)","v":3},null,"OK",105,null,218,103.33333333333333,null,"Student 3",1018,null,"1200 up tp 1500",1,null,376.48333333333329,null,"Dean",4589.7,null,"2000 up tp 3000",1,null,null,null,null,{"$f":"AJ6","v":1200},1500,null,{"$f":"AM6","v":2000},{"$f":"AL7+$AM$2","v":3000}]
["Student 04","Nokia",{"$f":"VLOOKUP(B8,{\"iPhone\",1;\"Motorola\",2;\"Nokia\",3;\"Samsung\",4;\"Sony Erickson\",5;\"Sprint\",6},2,0)","v":3},null,"Samsung",50,null,"Student 04","Good",{"$f":"VLOOKUP(I8,{\"Excellent\",4;\"Poor\",1;\"Good\",3;\"OK\",2},2,0)","v":3},null,"Poor",177,null,217,102.77777777777777,null,"Student 4",1718,null,"1500 up tp 1800",3,null,{"$f":"CONVERT(O8,\"F\",\"K\")","v":375.92777777777775},null,"Joe",25.25,null,"3000 up tp 4000",0,null,null,null,null,1500,1800,null,3000,4000]
["Student 05","Motorola",{"$f":"VLOOKUP(B9,{\"iPhone\",1;\"Motorola\",2;\"Nokia\",3;\"Samsung\",4;\"Sony Erickson\",5;\"Sprint\",6},2,0)","v":2},null,"Sony Erickson",42,null,"Student 05","OK",{"$f":"VLOOKUP(I9,{\"Excellent\",4;\"Poor\",1;\"Good\",3;\"OK\",2},2,0)","v":2},null,null,null,null,216,102.22222222222221,null,"Student 5",1953,null,"1800 up tp 2100",2,null,375.37222222222221,null,"Tina",158,null,"4000 up tp 5000",2,null,null,null,null,1800,2100,null,4000,5000]
["Student 06","Nokia",{"$f":"VLOOKUP(B10,{\"iPhone\",1;\"Motorola\",2;\"Nokia\",3;\"Samsung\",4;\"Sony Erickson\",5;\"Sprint\",6},2,0)","v":3},null,"Sprint",48,null,"Student 06","Poor",{"$f":"VLOOKUP(I10,{\"Excellent\",4;\"Poor\",1;\"Good\",3;\"OK\",2},2,0)","v":1},null,"Rate Instructor","Frequency (Count)",null,215,101.66666666666666,null,"Student 6",904,null,"2100 up tp 2400",1,null,374.81666666666661,null,"Amy",4525.5,null,"5000 up tp 6000",1,null,null,null,null,2100,2400,null,5000,6000]
["Student 07","Sprint",{"$f":"VLOOKUP(B11,{\"iPhone\",1;\"Motorola\",2;\"Nokia\",3;\"Samsung\",4;\"Sony Erickson\",5;\"Sprint\",6},2,0)","v":6},null,"Grand Total",385,null,"Student 07","Poor",{"$f":"VLOOKUP(I11,{\"Excellent\",4;\"Poor\",1;\"Good\",3;\"OK\",2},2,0)","v":1},null,4,{"$f":"COUNTIF($J$5:$J$389,L11)","v":56},null,214,101.11111111111111,null,"Student 7",1697,null,null,null,null,374.26111111111106,null,"Ming",526.5]
["Student 08","iPhone",{"$f":"VLOOKUP(B12,{\"iPhone\",1;\"Motorola\",2;\"Nokia\",3;\"Samsung\",4;\"Sony Erickson\",5;\"Sprint\",6},2,0)","v":1},null,null,null,null,"Student 08","OK",{"$f":"VLOOKUP(I12,{\"Excellent\",4;\"Poor\",1;\"Good\",3;\"OK\",2},2,0)","v":2},null,3,{"$f":"COUNTIF($J$5:$J$389,L12)","v":47},null,213,100.55555555555556,null,"Student 8",959,null,"Average",{"$f":"AVERAGE(S5:S17)","v":1415.4615384615386},null,373.70555555555552,null,"Pham",2258.1999999999998,null,"Average",{"$f":"AVERAGE(AA5:AA14)","v":1931.05}]
["Student 09","Motorola",{"$f":"VLOOKUP(B13,{\"iPhone\",1;\"Motorola\",2;\"Nokia\",3;\"Samsung\",4;\"Sony Erickson\",5;\"Sprint\",6},2,0)","v":2},null,null,null,null,"Student 09","Poor",{"$f":"VLOOKUP(I13,{\"Excellent\",4;\"Poor\",1;\"Good\",3;\"OK\",2},2,0)","v":1},null,2,105,null,212,100,null,"Student 9",960,null,null,null,null,373.15,null,"Phil",{"$f":"AA12/2","v":1129.0999999999999}]
["Student 10","iPhone",{"$f":"VLOOKUP(B14,{\"iPhone\",1;\"Motorola\",2;\"Nokia\",3;\"Samsung\",4;\"Sony Erickson\",5;\"Sprint\",6},2,0)","v":1},null,null,null,null,"Student 10","Poor",{"$f":"VLOOKUP(I14,{\"Excellent\",4;\"Poor\",1;\"Good\",3;\"OK\",2},2,0)","v":1},null,1,177,null,211,99.444444444444443,null,"Student 10",1808,null,"Student 6",{"$f":"VLOOKUP(U14,$R$5:$S$17,2,0)","v":904},null,372.59444444444443,null,"Shelia",5598.25,null,{"$f":"Z13","v":"Phil"},{"$f":"VLOOKUP(AC14,$Z$5:$AA$14,2,0)","v":1129.0999999999999}]
["Student 11","Samsung",{"$f":"VLOOKUP(B15,{\"iPhone\",1;\"Motorola\",2;\"Nokia\",3;\"Samsung\",4;\"Sony Erickson\",5;\"Sprint\",6},2,0)","v":4},null,null,null,null,"Student 11","Poor",{"$f":"VLOOKUP(I15,{\"Excellent\",4;\"Poor\",1;\"Good\",3;\"OK\",2},2,0)","v":1},null,null,null,null,210,98.888888888888886,null,"Student 11",2183,null,"Student 10",1808,null,372.03888888888889,null,null,null,null,{"$f":"Z12","v":"Pham"},{"$f":"VLOOKUP(AC15,$Z$5:$AA$14,2,0)","v":2258.1999999999998}]
["Student 12","Motorola",{"$f":"VLOOKUP(B16,{\"iPhone\",1;\"Motorola\",2;\"Nokia\",3;\"Samsung\",4;\"Sony Erickson\",5;\"Sprint\",6},2,0)","v":2},null,null,null,null,"Student 12","OK",{"$f":"VLOOKUP(I16,{\"Excellent\",4;\"Poor\",1;\"Good\",3;\"OK\",2},2,0)","v":2},null,"Average",{"$f":"AVERAGE(J5:J389)","v":1.9532467532467532},null,209,98.333333333333329,null,"Student 12",1124,null,"Ratio",{"$f":"V15/V14","v":2},null,371.48333333333329,null,null,null,null,"Ratio",{"$f":"AD15/AD14","v":2}]
["Student 13","Samsung",{"$f":"VLOOKUP(B17,{\"iPhone\",1;\"Motorola\",2;\"Nokia\",3;\"Samsung\",4;\"Sony Erickson\",5;\"Sprint\",6},2,0)","v":4},null,null,null,null,"Student 13","Excellent",{"$f":"VLOOKUP(I17,{\"Excellent\",4;\"Poor\",1;\"Good\",3;\"OK\",2},2,0)","v":4},null,null,null,null,208,97.777777777777771,null,"Student 13",1077,null,"% Change",{"$f":"V15/V14-1","v":1},null,370.92777777777775,null,null,null,null,"% Change",{"$f":"AD15/AD14-1","v":1}]
["Student 14","iPhone",{"$f":"VLOOKUP(B18,{\"iPhone\",1;\"Motorola\",2;\"Nokia\",3;\"Samsung\",4;\"Sony Erickson\",5;\"Sprint\",6},2,0)","v":1},null,null,null,null,"Student 14","Excellent",{"$f":"VLOOKUP(I18,{\"Excellent\",4;\"Poor\",1;\"Good\",3;\"OK\",2},2,0)","v":4},null,null,null,null,207,97.222222222222214,null,null,null,null,{"$f":"V15&\"/\"&V14&\" does not tell us that \"&U15&\" did twice as good as \"&U14&\".\"","v":"1808/904 does not tell us that Student 10 did twice as good as Student 6."},null,null,370.37222222222221,null,null,null,null,{"$f":"AD15&\"/\"&AD14&\" tells us that \"&AC15&\" has twice as much as \"&AC14&\".\"","v":"2258.2/1129.1 tells us that Pham has twice as much as Phil."}]
["Student 15","Nokia",{"$f":"VLOOKUP(B19,{\"iPhone\",1;\"Motorola\",2;\"Nokia\",3;\"Samsung\",4;\"Sony Erickson\",5;\"Sprint\",6},2,0)","v":3},null,null,null,null,"Student 15","Poor",{"$f":"VLOOKUP(I19,{\"Excellent\",4;\"Poor\",1;\"Good\",3;\"OK\",2},2,0)","v":1},null,null,null,null,206,96.666666666666657,null,null,null,null,null,null,null,369.81666666666661]
["Student 16","Nokia",{"$f":"VLOOKUP(B20,{\"iPhone\",1;\"Motorola\",2;\"Nokia\",3;\"Samsung\",4;\"Sony Erickson\",5;\"Sprint\",6},2,0)","v":3},null,null,null,null,"Student 16","Poor",{"$f":"VLOOKUP(I20,{\"Excellent\",4;\"Poor\",1;\"Good\",3;\"OK\",2},2,0)","v":1},null,null,null,null,205,96.111111111111114,null,null,null,null,null,null,null,369.26111111111106]
["Student 17","Sprint",{"$f":"VLOOKUP(B21,{\"iPhone\",1;\"Motorola\",2;\"Nokia\",3;\"Samsung\",4;\"Sony Erickson\",5;\"Sprint\",6},2,0)","v":6},null,null,null,null,"Student 17","Good",{"$f":"VLOOKUP(I21,{\"Excellent\",4;\"Poor\",1;\"Good\",3;\"OK\",2},2,0)","v":3},null,null,null,null,204,95.555555555555557,null,null,null,null,"Ratio meaningless because zero does not mean that nothing exists.",null,null,368.70555555555552,null,null,null,null,"Ratio meaningful because zero means that nothing exists."]
["Student 18","Sony Erickson",{"$f":"VLOOKUP(B22,{\"iPhone\",1;\"Motorola\",2;\"Nokia\",3;\"Samsung\",4;\"Sony Erickson\",5;\"Sprint\",6},2,0)","v":5},null,null,null,null,"Student 18","Poor",{"$f":"VLOOKUP(I22,{\"Excellent\",4;\"Poor\",1;\"Good\",3;\"OK\",2},2,0)","v":1},null,null,null,null,203,95,null,null,null,null,null,null,null,368.15]
["Student 19","Nokia",{"$f":"VLOOKUP(B23,{\"iPhone\",1;\"Motorola\",2;\"Nokia\",3;\"Samsung\",4;\"Sony Erickson\",5;\"Sprint\",6},2,0)","v":3},null,null,null,null,"Student 19","Excellent",{"$f":"VLOOKUP(I23,{\"Excellent\",4;\"Poor\",1;\"Good\",3;\"OK\",2},2,0)","v":4},null,null,null,null,202,94.444444444444443,null,null,null,null,null,null,null,367.59444444444443]
["Student 20","Nokia",{"$f":"VLOOKUP(B24,{\"iPhone\",1;\"Motorola\",2;\"Nokia\",3;\"Samsung\",4;\"Sony Erickson\",5;\"Sprint\",6},2,0)","v":3},null,null,null,null,"Student 20","Poor",{"$f":"VLOOKUP(I24,{\"Excellent\",4;\"Poor\",1;\"Good\",3;\"OK\",2},2,0)","v":1},null,null,null,null,201,93.888888888888886,null,null,null,null,null,null,null,367.03888888888889]
["Student 21","iPhone",{"$f":"VLOOKUP(B25,{\"iPhone\",1;\"Motorola\",2;\"Nokia\",3;\"Samsung\",4;\"Sony Erickson\",5;\"Sprint\",6},2,0)","v":1},null,null,null,null,"Student 21","OK",{"$f":"VLOOKUP(I25,{\"Excellent\",4;\"Poor\",1;\"Good\",3;\"OK\",2},2,0)","v":2},null,null,null,null,200,93.333333333333329,null,null,null,null,null,null,null,366.48333333333329]
["Student 22","iPhone",{"$f":"VLOOKUP(B26,{\"iPhone\",1;\"Motorola\",2;\"Nokia\",3;\"Samsung\",4;\"Sony Erickson\",5;\"Sprint\",6},2,0)","v":1},null,null,null,null,"Student 22","OK",{"$f":"VLOOKUP(I26,{\"Excellent\",4;\"Poor\",1;\"Good\",3;\"OK\",2},2,0)","v":2},null,null,null,null,199,92.777777777777771,null,null,null,null,null,null,null,365.92777777777775]
["Student 23","Nokia",{"$f":"VLOOKUP(B27,{\"iPhone\",1;\"Motorola\",2;\"Nokia\",3;\"Samsung\",4;\"Sony Erickson\",5;\"Sprint\",6},2,0)","v":3},null,null,null,null,"Student 23","OK",{"$f":"VLOOKUP(I27,{\"Excellent\",4;\"Poor\",1;\"Good\",3;\"OK\",2},2,0)","v":2},null,null,null,null,198,92.222222222222214,null,null,null,null,null,null,null,365.37222222222221]
["Student 24","Samsung",{"$f":"VLOOKUP(B28,{\"iPhone\",1;\"Motorola\",2;\"Nokia\",3;\"Samsung\",4;\"Sony Erickson\",5;\"Sprint\",6},2,0)","v":4},null,null,null,null,"Student 24","Excellent",{"$f":"VLOOKUP(I28,{\"Excellent\",4;\"Poor\",1;\"Good\",3;\"OK\",2},2,0)","v":4},null,null,null,null,197,91.666666666666671,null,null,null,null,null,null,null,364.81666666666666]
["Student 25","iPhone",{"$f":"VLOOKUP(B29,{\"iPhone\",1;\"Motorola\",2;\"Nokia\",3;\"Samsung\",4;\"Sony Erickson\",5;\"Sprint\",6},2,0)","v":1},null,null,null,null,"Student 25","OK",{"$f":"VLOOKUP(I29,{\"Excellent\",4;\"Poor\",1;\"Good\",3;\"OK\",2},2,0)","v":2},null,null,null,null,196,91.111111111111114,null,null,null,null,null,null,null,364.26111111111106]
["Student 26","iPhone",{"$f":"VLOOKUP(B30,{\"iPhone\",1;\"Motorola\",2;\"Nokia\",3;\"Samsung\",4;\"Sony Erickson\",5;\"Sprint\",6},2,0)","v":1},null,null,null,null,"Student 26","OK",{"$f":"VLOOKUP(I30,{\"Excellent\",4;\"Poor\",1;\"Good\",3;\"OK\",2},2,0)","v":2},null,null,null,null,195,90.555555555555557,null,null,null,null,null,null,null,363.70555555555552]
["Student 27","iPhone",{"$f":"VLOOKUP(B31,{\"iPhone\",1;\"Motorola\",2;\"Nokia\",3;\"Samsung\",4;\"Sony Erickson\",5;\"Sprint\",6},2,0)","v":1},null,null,null,null,"Student 27","Poor",{"$f":"VLOOKUP(I31,{\"Excellent\",4;\"Poor\",1;\"Good\",3;\"OK\",2},2,0)","v":1},null,null,null,null,194,90,null,null,null,null,null,null,null,363.15]
["Student 28","Sprint",{"$f":"VLOOKUP(B32,{\"iPhone\",1;\"Motorola\",2;\"Nokia\",3;\"Samsung\",4;\"Sony Erickson\",5;\"Sprint\",6},2,0)","v":6},null,null,null,null,"Student 28","OK",{"$f":"VLOOKUP(I32,{\"Excellent\",4;\"Poor\",1;\"Good\",3;\"OK\",2},2,0)","v":2},null,null,null,null,193,89.444444444444443,null,null,null,null,null,null,null,362.59444444444443]
["Student 29","iPhone",{"$f":"VLOOKUP(B33,{\"iPhone\",1;\"Motorola\",2;\"Nokia\",3;\"Samsung\",4;\"Sony Erickson\",5;\"Sprint\",6},2,0)","v":1},null,null,null,null,"Student 29","Good",{"$f":"VLOOKUP(I33,{\"Excellent\",4;\"Poor\",1;\"Good\",3;\"OK\",2},2,0)","v":3},null,null,null,null,192,88.888888888888886,null,null,null,null,null,null,null,362.03888888888889]
["Student 30","Sony Erickson",{"$f":"VLOOKUP(B34,{\"iPhone\",1;\"Motorola\",2;\"Nokia\",3;\"Samsung\",4;\"Sony Erickson\",5;\"Sprint\",6},2,0)","v":5},null,null,null,null,"Student 30","Excellent",{"$f":"VLOOKUP(I34,{\"Excellent\",4;\"Poor\",1;\"Good\",3;\"OK\",2},2,0)","v":4},null,null,null,null,191,88.333333333333329,null,null,null,null,null,null,null,361.48333333333329]
["Student 31","Samsung",{"$f":"VLOOKUP(B35,{\"iPhone\",1;\"Motorola\",2;\"Nokia\",3;\"Samsung\",4;\"Sony Erickson\",5;\"Sprint\",6},2,0)","v":4},null,null,null,null,"Student 31","Excellent",{"$f":"VLOOKUP(I35,{\"Excellent\",4;\"Poor\",1;\"Good\",3;\"OK\",2},2,0)","v":4},null,null,null,null,190,87.777777777777771,null,null,null,null,null,null,null,360.92777777777775]
["Student 32","Nokia",{"$f":"VLOOKUP(B36,{\"iPhone\",1;\"Motorola\",2;\"Nokia\",3;\"Samsung\",4;\"Sony Erickson\",5;\"Sprint\",6},2,0)","v":3},null,null,null,null,"Student 32","OK",{"$f":"VLOOKUP(I36,{\"Excellent\",4;\"Poor\",1;\"Good\",3;\"OK\",2},2,0)","v":2},null,null,null,null,189,87.222222222222214,null,null,null,null,null,null,null,360.37222222222221]
["Student 33","iPhone",{"$f":"VLOOKUP(B37,{\"iPhone\",1;\"Motorola\",2;\"Nokia\",3;\"Samsung\",4;\"Sony Erickson\",5;\"Sprint\",6},2,0)","v":1},null,null,null,null,"Student 33","Good",{"$f":"VLOOKUP(I37,{\"Excellent\",4;\"Poor\",1;\"Good\",3;\"OK\",2},2,0)","v":3},null,null,null,null,188,86.666666666666671,null,null,null,null,null,null,null,359.81666666666666]
["Student 34","Nokia",{"$f":"VLOOKUP(B38,{\"iPhone\",1;\"Motorola\",2;\"Nokia\",3;\"Samsung\",4;\"Sony Erickson\",5;\"Sprint\",6},2,0)","v":3},null,null,null,null,"Student 34","Poor",{"$f":"VLOOKUP(I38,{\"Excellent\",4;\"Poor\",1;\"Good\",3;\"OK\",2},2,0)","v":1},null,null,null,null,187,86.111111111111114,null,null,null,null,null,null,null,359.26111111111106]
["Student 35","iPhone",{"$f":"VLOOKUP(B39,{\"iPhone\",1;\"Motorola\",2;\"Nokia\",3;\"Samsung\",4;\"Sony Erickson\",5;\"Sprint\",6},2,0)","v":1},null,null,null,null,"Student 35","Poor",{"$f":"VLOOKUP(I39,{\"Excellent\",4;\"Poor\",1;\"Good\",3;\"OK\",2},2,0)","v":1},null,null,null,null,186,85.555555555555557,null,null,null,null,null,null,null,358.70555555555552]
["Student 36","Samsung",{"$f":"VLOOKUP(B40,{\"iPhone\",1;\"Motorola\",2;\"Nokia\",3;\"Samsung\",4;\"Sony Erickson\",5;\"Sprint\",6},2,0)","v":4},null,null,null,null,"Student 36","Poor",{"$f":"VLOOKUP(I40,{\"Excellent\",4;\"Poor\",1;\"Good\",3;\"OK\",2},2,0)","v":1},null,null,null,null,185,85,null,null,null,null,null,null,null,358.15]
["Student 37","Sony Erickson",{"$f":"VLOOKUP(B41,{\"iPhone\",1;\"Motorola\",2;\"Nokia\",3;\"Samsung\",4;\"Sony Erickson\",5;\"Sprint\",6},2,0)","v":5},null,null,null,null,"Student 37","Excellent",{"$f":"VLOOKUP(I41,{\"Excellent\",4;\"Poor\",1;\"Good\",3;\"OK\",2},2,0)","v":4},null,null,null,null,184,84.444444444444443,null,null,null,null,null,null,null,357.59444444444443]
["Student 38","iPhone",{"$f":"VLOOKUP(B42,{\"iPhone\",1;\"Motorola\",2;\"Nokia\",3;\"Samsung\",4;\"Sony Erickson\",5;\"Sprint\",6},2,0)","v":1},null,null,null,null,"Student 38","Poor",{"$f":"VLOOKUP(I42,{\"Excellent\",4;\"Poor\",1;\"Good\",3;\"OK\",2},2,0)","v":1},null,null,null,null,183,83.888888888888886,null,null,null,null,null,null,null,357.03888888888889]
["Student 39","Sony Erickson",{"$f":"VLOOKUP(B43,{\"iPhone\",1;\"Motorola\",2;\"Nokia\",3;\"Samsung\",4;\"Sony Erickson\",5;\"Sprint\",6},2,0)","v":5},null,null,null,null,"Student 39","OK",{"$f":"VLOOKUP(I43,{\"Excellent\",4;\"Poor\",1;\"Good\",3;\"OK\",2},2,0)","v":2},null,null,null,null,182,83.333333333333329,null,null,null,null,null,null,null,356.48333333333329]
["Student 40","Nokia",{"$f":"VLOOKUP(B44,{\"iPhone\",1;\"Motorola\",2;\"Nokia\",3;\"Samsung\",4;\"Sony Erickson\",5;\"Sprint\",6},2,0)","v":3},null,null,null,null,"Student 40","Poor",{"$f":"VLOOKUP(I44,{\"Excellent\",4;\"Poor\",1;\"Good\",3;\"OK\",2},2,0)","v":1},null,null,null,null,181,82.777777777777771,null,null,null,null,null,null,null,355.92777777777775]
["Student 41","Nokia",{"$f":"VLOOKUP(B45,{\"iPhone\",1;\"Motorola\",2;\"Nokia\",3;\"Samsung\",4;\"Sony Erickson\",5;\"Sprint\",6},2,0)","v":3},null,null,null,null,"Student 41","Excellent",{"$f":"VLOOKUP(I45,{\"Excellent\",4;\"Poor\",1;\"Good\",3;\"OK\",2},2,0)","v":4},null,null,null,null,180,82.222222222222214,null,null,null,null,null,null,null,355.37222222222221]
["Student 42","Sony Erickson",{"$f":"VLOOKUP(B46,{\"iPhone\",1;\"Motorola\",2;\"Nokia\",3;\"Samsung\",4;\"Sony Erickson\",5;\"Sprint\",6},2,0)","v":5},null,null,null,null,"Student 42","OK",{"$f":"VLOOKUP(I46,{\"Excellent\",4;\"Poor\",1;\"Good\",3;\"OK\",2},2,0)","v":2},null,null,null,null,179,81.666666666666671,null,null,null,null,null,null,null,354.81666666666666]
["Student 43","Sprint",{"$f":"VLOOKUP(B47,{\"iPhone\",1;\"Motorola\",2;\"Nokia\",3;\"Samsung\",4;\"Sony Erickson\",5;\"Sprint\",6},2,0)","v":6},null,null,null,null,"Student 43","OK",{"$f":"VLOOKUP(I47,{\"Excellent\",4;\"Poor\",1;\"Good\",3;\"OK\",2},2,0)","v":2},null,null,null,null,178,81.111111111111114,null,null,null,null,null,null,null,354.26111111111106]
["Student 44","Nokia",{"$f":"VLOOKUP(B48,{\"iPhone\",1;\"Motorola\",2;\"Nokia\",3;\"Samsung\",4;\"Sony Erickson\",5;\"Sprint\",6},2,0)","v":3},null,null,null,null,"Student 44","Poor",{"$f":"VLOOKUP(I48,{\"Excellent\",4;\"Poor\",1;\"Good\",3;\"OK\",2},2,0)","v":1},null,null,null,null,177,80.555555555555557,null,null,null,null,null,null,null,353.70555555555552]
["Student 45","Nokia",{"$f":"VLOOKUP(B49,{\"iPhone\",1;\"Motorola\",2;\"Nokia\",3;\"Samsung\",4;\"Sony Erickson\",5;\"Sprint\",6},2,0)","v":3},null,null,null,null,"Student 45","Poor",{"$f":"VLOOKUP(I49,{\"Excellent\",4;\"Poor\",1;\"Good\",3;\"OK\",2},2,0)","v":1},null,null,null,null,176,80,null,null,null,null,null,null,null,353.15]
["Student 46","Motorola",{"$f":"VLOOKUP(B50,{\"iPhone\",1;\"Motorola\",2;\"Nokia\",3;\"Samsung\",4;\"Sony Erickson\",5;\"Sprint\",6},2,0)","v":2},null,null,null,null,"Student 46","Poor",{"$f":"VLOOKUP(I50,{\"Excellent\",4;\"Poor\",1;\"Good\",3;\"OK\",2},2,0)","v":1},null,null,null,null,175,79.444444444444443,null,null,null,null,null,null,null,352.59444444444443]
["Student 47","Samsung",{"$f":"VLOOKUP(B51,{\"iPhone\",1;\"Motorola\",2;\"Nokia\",3;\"Samsung\",4;\"Sony Erickson\",5;\"Sprint\",6},2,0)","v":4},null,null,null,null,"Student 47","OK",{"$f":"VLOOKUP(I51,{\"Excellent\",4;\"Poor\",1;\"Good\",3;\"OK\",2},2,0)","v":2},null,null,null,null,174,78.888888888888886,null,null,null,null,null,null,null,352.03888888888889]
["Student 48","iPhone",{"$f":"VLOOKUP(B52,{\"iPhone\",1;\"Motorola\",2;\"Nokia\",3;\"Samsung\",4;\"Sony Erickson\",5;\"Sprint\",6},2,0)","v":1},null,null,null,null,"Student 48","Good",{"$f":"VLOOKUP(I52,{\"Excellent\",4;\"Poor\",1;\"Good\",3;\"OK\",2},2,0)","v":3},null,null,null,null,173,78.333333333333329,null,null,null,null,null,null,null,351.48333333333329]
["Student 49","Nokia",{"$f":"VLOOKUP(B53,{\"iPhone\",1;\"Motorola\",2;\"Nokia\",3;\"Samsung\",4;\"Sony Erickson\",5;\"Sprint\",6},2,0)","v":3},null,null,null,null,"Student 49","Good",{"$f":"VLOOKUP(I53,{\"Excellent\",4;\"Poor\",1;\"Good\",3;\"OK\",2},2,0)","v":3},null,null,null,null,172,77.777777777777771,null,null,null,null,null,null,null,350.92777777777775]
["Student 50","Nokia",{"$f":"VLOOKUP(B54,{\"iPhone\",1;\"Motorola\",2;\"Nokia\",3;\"Samsung\",4;\"Sony Erickson\",5;\"Sprint\",6},2,0)","v":3},null,null,null,null,"Student 50","OK",{"$f":"VLOOKUP(I54,{\"Excellent\",4;\"Poor\",1;\"Good\",3;\"OK\",2},2,0)","v":2},null,null,null,null,171,77.222222222222214,null,null,null,null,null,null,null,350.37222222222221]
["Student 51","Sprint",{"$f":"VLOOKUP(B55,{\"iPhone\",1;\"Motorola\",2;\"Nokia\",3;\"Samsung\",4;\"Sony Erickson\",5;\"Sprint\",6},2,0)","v":6},null,null,null,null,"Student 51","Excellent",{"$f":"VLOOKUP(I55,{\"Excellent\",4;\"Poor\",1;\"Good\",3;\"OK\",2},2,0)","v":4},null,null,null,null,170,76.666666666666671,null,null,null,null,null,null,null,349.81666666666666]
["Student 52","Nokia",{"$f":"VLOOKUP(B56,{\"iPhone\",1;\"Motorola\",2;\"Nokia\",3;\"Samsung\",4;\"Sony Erickson\",5;\"Sprint\",6},2,0)","v":3},null,null,null,null,"Student 52","Poor",{"$f":"VLOOKUP(I56,{\"Excellent\",4;\"Poor\",1;\"Good\",3;\"OK\",2},2,0)","v":1},null,null,null,null,169,76.111111111111114,null,null,null,null,null,null,null,349.26111111111106]
["Student 53","Nokia",{"$f":"VLOOKUP(B57,{\"iPhone\",1;\"Motorola\",2;\"Nokia\",3;\"Samsung\",4;\"Sony Erickson\",5;\"Sprint\",6},2,0)","v":3},null,null,null,null,"Student 53","Excellent",{"$f":"VLOOKUP(I57,{\"Excellent\",4;\"Poor\",1;\"Good\",3;\"OK\",2},2,0)","v":4},null,null,null,null,168,75.555555555555557,null,null,null,null,null,null,null,348.70555555555552]
["Student 54","Sprint",{"$f":"VLOOKUP(B58,{\"iPhone\",1;\"Motorola\",2;\"Nokia\",3;\"Samsung\",4;\"Sony Erickson\",5;\"Sprint\",6},2,0)","v":6},null,null,null,null,"Student 54","Good",{"$f":"VLOOKUP(I58,{\"Excellent\",4;\"Poor\",1;\"Good\",3;\"OK\",2},2,0)","v":3},null,null,null,null,167,75,null,null,null,null,null,null,null,348.15]
["Student 55","Sony Erickson",{"$f":"VLOOKUP(B59,{\"iPhone\",1;\"Motorola\",2;\"Nokia\",3;\"Samsung\",4;\"Sony Erickson\",5;\"Sprint\",6},2,0)","v":5},null,null,null,null,"Student 55","Poor",{"$f":"VLOOKUP(I59,{\"Excellent\",4;\"Poor\",1;\"Good\",3;\"OK\",2},2,0)","v":1},null,null,null,null,166,74.444444444444443,null,null,null,null,null,null,null,347.59444444444443]
["Student 56","Nokia",{"$f":"VLOOKUP(B60,{\"iPhone\",1;\"Motorola\",2;\"Nokia\",3;\"Samsung\",4;\"Sony Erickson\",5;\"Sprint\",6},2,0)","v":3},null,null,null,null,"Student 56","Poor",{"$f":"VLOOKUP(I60,{\"Excellent\",4;\"Poor\",1;\"Good\",3;\"OK\",2},2,0)","v":1},null,null,null,null,165,73.888888888888886,null,null,null,null,null,null,null,347.03888888888889]
["Student 57","iPhone",{"$f":"VLOOKUP(B61,{\"iPhone\",1;\"Motorola\",2;\"Nokia\",3;\"Samsung\",4;\"Sony Erickson\",5;\"Sprint\",6},2,0)","v":1},null,null,null,null,"Student 57","Good",{"$f":"VLOOKUP(I61,{\"Excellent\",4;\"Poor\",1;\"Good\",3;\"OK\",2},2,0)","v":3},null,null,null,null,164,73.333333333333329,null,null,null,null,null,null,null,346.48333333333329]
["Student 58","Samsung",{"$f":"VLOOKUP(B62,{\"iPhone\",1;\"Motorola\",2;\"Nokia\",3;\"Samsung\",4;\"Sony Erickson\",5;\"Sprint\",6},2,0)","v":4},null,null,null,null,"Student 58","Poor",{"$f":"VLOOKUP(I62,{\"Excellent\",4;\"Poor\",1;\"Good\",3;\"OK\",2},2,0)","v":1},null,null,null,null,163,72.777777777777771,null,null,null,null,null,null,null,345.92777777777775]
["Student 59","Motorola",{"$f":"VLOOKUP(B63,{\"iPhone\",1;\"Motorola\",2;\"Nokia\",3;\"Samsung\",4;\"Sony Erickson\",5;\"Sprint\",6},2,0)","v":2},null,null,null,null,"Student 59","OK",{"$f":"VLOOKUP(I63,{\"Excellent\",4;\"Poor\",1;\"Good\",3;\"OK\",2},2,0)","v":2},null,null,null,null,162,72.222222222222214,null,null,null,null,null,null,null,345.37222222222221]
["Student 60","iPhone",{"$f":"VLOOKUP(B64,{\"iPhone\",1;\"Motorola\",2;\"Nokia\",3;\"Samsung\",4;\"Sony Erickson\",5;\"Sprint\",6},2,0)","v":1},null,null,null,null,"Student 60","Poor",{"$f":"VLOOKUP(I64,{\"Excellent\",4;\"Poor\",1;\"Good\",3;\"OK\",2},2,0)","v":1},null,null,null,null,161,71.666666666666671,null,null,null,null,null,null,null,344.81666666666666]
["Student 61","Sony Erickson",{"$f":"VLOOKUP(B65,{\"iPhone\",1;\"Motorola\",2;\"Nokia\",3;\"Samsung\",4;\"Sony Erickson\",5;\"Sprint\",6},2,0)","v":5},null,null,null,null,"Student 61","Poor",{"$f":"VLOOKUP(I65,{\"Excellent\",4;\"Poor\",1;\"Good\",3;\"OK\",2},2,0)","v":1},null,null,null,null,160,71.111111111111114,null,null,null,null,null,null,null,344.26111111111106]
["Student 62","Nokia",{"$f":"VLOOKUP(B66,{\"iPhone\",1;\"Motorola\",2;\"Nokia\",3;\"Samsung\",4;\"Sony Erickson\",5;\"Sprint\",6},2,0)","v":3},null,null,null,null,"Student 62","OK",{"$f":"VLOOKUP(I66,{\"Excellent\",4;\"Poor\",1;\"Good\",3;\"OK\",2},2,0)","v":2},null,null,null,null,159,70.555555555555557,null,null,null,null,null,null,null,343.70555555555552]
["Student 63","Nokia",{"$f":"VLOOKUP(B67,{\"iPhone\",1;\"Motorola\",2;\"Nokia\",3;\"Samsung\",4;\"Sony Erickson\",5;\"Sprint\",6},2,0)","v":3},null,null,null,null,"Student 63","Poor",{"$f":"VLOOKUP(I67,{\"Excellent\",4;\"Poor\",1;\"Good\",3;\"OK\",2},2,0)","v":1},null,null,null,null,158,70,null,null,null,null,null,null,null,343.15]
["Student 64","iPhone",{"$f":"VLOOKUP(B68,{\"iPhone\",1;\"Motorola\",2;\"Nokia\",3;\"Samsung\",4;\"Sony Erickson\",5;\"Sprint\",6},2,0)","v":1},null,null,null,null,"Student 64","Poor",{"$f":"VLOOKUP(I68,{\"Excellent\",4;\"Poor\",1;\"Good\",3;\"OK\",2},2,0)","v":1},null,null,null,null,157,69.444444444444443,null,null,null,null,null,null,null,342.59444444444443]
["Student 65","iPhone",{"$f":"VLOOKUP(B69,{\"iPhone\",1;\"Motorola\",2;\"Nokia\",3;\"Samsung\",4;\"Sony Erickson\",5;\"Sprint\",6},2,0)","v":1},null,null,null,null,"Student 65","Poor",{"$f":"VLOOKUP(I69,{\"Excellent\",4;\"Poor\",1;\"Good\",3;\"OK\",2},2,0)","v":1},null,null,null,null,156,{"$f":"CONVERT(O69,\"F\",\"C\")","v":68.888888888888886},null,null,null,null,null,null,null,342.03888888888889]
["Student 66","iPhone",{"$f":"VLOOKUP(B70,{\"iPhone\",1;\"Motorola\",2;\"Nokia\",3;\"Samsung\",4;\"Sony Erickson\",5;\"Sprint\",6},2,0)","v":1},null,null,null,null,"Student 66","Poor",{"$f":"VLOOKUP(I70,{\"Excellent\",4;\"Poor\",1;\"Good\",3;\"OK\",2},2,0)","v":1},null,null,null,null,155,68.333333333333329,null,null,null,null,null,null,null,341.48333333333329]
["Student 67","iPhone",{"$f":"VLOOKUP(B71,{\"iPhone\",1;\"Motorola\",2;\"Nokia\",3;\"Samsung\",4;\"Sony Erickson\",5;\"Sprint\",6},2,0)","v":1},null,null,null,null,"Student 67","OK",{"$f":"VLOOKUP(I71,{\"Excellent\",4;\"Poor\",1;\"Good\",3;\"OK\",2},2,0)","v":2},null,null,null,null,154,67.777777777777771,null,null,null,null,null,null,null,340.92777777777775]
["Student 68","Sprint",{"$f":"VLOOKUP(B72,{\"iPhone\",1;\"Motorola\",2;\"Nokia\",3;\"Samsung\",4;\"Sony Erickson\",5;\"Sprint\",6},2,0)","v":6},null,null,null,null,"Student 68","Poor",{"$f":"VLOOKUP(I72,{\"Excellent\",4;\"Poor\",1;\"Good\",3;\"OK\",2},2,0)","v":1},null,null,null,null,153,67.222222222222214,null,null,null,null,null,null,null,{"$f":"CONVERT(O72,\"F\",\"K\")","v":340.37222222222221}]
["Student 69","iPhone",{"$f":"VLOOKUP(B73,{\"iPhone\",1;\"Motorola\",2;\"Nokia\",3;\"Samsung\",4;\"Sony Erickson\",5;\"Sprint\",6},2,0)","v":1},null,null,null,null,"Student 69","Poor",{"$f":"VLOOKUP(I73,{\"Excellent\",4;\"Poor\",1;\"Good\",3;\"OK\",2},2,0)","v":1},null,null,null,null,152,66.666666666666671,null,null,null,null,null,null,null,339.81666666666666]
["Student 70","Nokia",{"$f":"VLOOKUP(B74,{\"iPhone\",1;\"Motorola\",2;\"Nokia\",3;\"Samsung\",4;\"Sony Erickson\",5;\"Sprint\",6},2,0)","v":3},null,null,null,null,"Student 70","Poor",{"$f":"VLOOKUP(I74,{\"Excellent\",4;\"Poor\",1;\"Good\",3;\"OK\",2},2,0)","v":1},null,null,null,null,151,66.111111111111114,null,null,null,null,null,null,null,339.26111111111106]
["Student 71","Motorola",{"$f":"VLOOKUP(B75,{\"iPhone\",1;\"Motorola\",2;\"Nokia\",3;\"Samsung\",4;\"Sony Erickson\",5;\"Sprint\",6},2,0)","v":2},null,null,null,null,"Student 71","Poor",{"$f":"VLOOKUP(I75,{\"Excellent\",4;\"Poor\",1;\"Good\",3;\"OK\",2},2,0)","v":1},null,null,null,null,150,65.555555555555557,null,null,null,null,null,null,null,338.70555555555552]
["Student 72","Sprint",{"$f":"VLOOKUP(B76,{\"iPhone\",1;\"Motorola\",2;\"Nokia\",3;\"Samsung\",4;\"Sony Erickson\",5;\"Sprint\",6},2,0)","v":6},null,null,null,null,"Student 72","Good",{"$f":"VLOOKUP(I76,{\"Excellent\",4;\"Poor\",1;\"Good\",3;\"OK\",2},2,0)","v":3},null,null,null,null,149,65,null,null,null,null,null,null,null,338.15]
["Student 73","iPhone",{"$f":"VLOOKUP(B77,{\"iPhone\",1;\"Motorola\",2;\"Nokia\",3;\"Samsung\",4;\"Sony Erickson\",5;\"Sprint\",6},2,0)","v":1},null,null,null,null,"Student 73","OK",{"$f":"VLOOKUP(I77,{\"Excellent\",4;\"Poor\",1;\"Good\",3;\"OK\",2},2,0)","v":2},null,null,null,null,148,64.444444444444443,null,null,null,null,null,null,null,337.59444444444443]
["Student 74","Sony Erickson",{"$f":"VLOOKUP(B78,{\"iPhone\",1;\"Motorola\",2;\"Nokia\",3;\"Samsung\",4;\"Sony Erickson\",5;\"Sprint\",6},2,0)","v":5},null,null,null,null,"Student 74","Excellent",{"$f":"VLOOKUP(I78,{\"Excellent\",4;\"Poor\",1;\"Good\",3;\"OK\",2},2,0)","v":4},null,null,null,null,147,63.888888888888886,null,null,null,null,null,null,null,337.03888888888889]
["Student 75","Nokia",{"$f":"VLOOKUP(B79,{\"iPhone\",1;\"Motorola\",2;\"Nokia\",3;\"Samsung\",4;\"Sony Erickson\",5;\"Sprint\",6},2,0)","v":3},null,null,null,null,"Student 75","Poor",{"$f":"VLOOKUP(I79,{\"Excellent\",4;\"Poor\",1;\"Good\",3;\"OK\",2},2,0)","v":1},null,null,null,null,146,63.333333333333329,null,null,null,null,null,null,null,336.48333333333329]
["Student 76","Motorola",{"$f":"VLOOKUP(B80,{\"iPhone\",1;\"Motorola\",2;\"Nokia\",3;\"Samsung\",4;\"Sony Erickson\",5;\"Sprint\",6},2,0)","v":2},null,null,null,null,"Student 76","Good",{"$f":"VLOOKUP(I80,{\"Excellent\",4;\"Poor\",1;\"Good\",3;\"OK\",2},2,0)","v":3},null,null,null,null,145,62.777777777777779,null,null,null,null,null,null,null,335.92777777777775]
["Student 77","iPhone",{"$f":"VLOOKUP(B81,{\"iPhone\",1;\"Motorola\",2;\"Nokia\",3;\"Samsung\",4;\"Sony Erickson\",5;\"Sprint\",6},2,0)","v":1},null,null,null,null,"Student 77","Poor",{"$f":"VLOOKUP(I81,{\"Excellent\",4;\"Poor\",1;\"Good\",3;\"OK\",2},2,0)","v":1},null,null,null,null,144,62.222222222222221,null,null,null,null,null,null,null,335.37222222222221]
["Student 78","Motorola",{"$f":"VLOOKUP(B82,{\"iPhone\",1;\"Motorola\",2;\"Nokia\",3;\"Samsung\",4;\"Sony Erickson\",5;\"Sprint\",6},2,0)","v":2},null,null,null,null,"Student 78","OK",{"$f":"VLOOKUP(I82,{\"Excellent\",4;\"Poor\",1;\"Good\",3;\"OK\",2},2,0)","v":2},null,null,null,null,143,61.666666666666664,null,null,null,null,null,null,null,334.81666666666666]
["Student 79","Nokia",{"$f":"VLOOKUP(B83,{\"iPhone\",1;\"Motorola\",2;\"Nokia\",3;\"Samsung\",4;\"Sony Erickson\",5;\"Sprint\",6},2,0)","v":3},null,null,null,null,"Student 79","Good",{"$f":"VLOOKUP(I83,{\"Excellent\",4;\"Poor\",1;\"Good\",3;\"OK\",2},2,0)","v":3},null,null,null,null,142,61.111111111111107,null,null,null,null,null,null,null,334.26111111111106]
["Student 80","Motorola",{"$f":"VLOOKUP(B84,{\"iPhone\",1;\"Motorola\",2;\"Nokia\",3;\"Samsung\",4;\"Sony Erickson\",5;\"Sprint\",6},2,0)","v":2},null,null,null,null,"Student 80","Poor",{"$f":"VLOOKUP(I84,{\"Excellent\",4;\"Poor\",1;\"Good\",3;\"OK\",2},2,0)","v":1},null,null,null,null,141,60.555555555555557,null,null,null,null,null,null,null,333.70555555555552]
["Student 81","Nokia",{"$f":"VLOOKUP(B85,{\"iPhone\",1;\"Motorola\",2;\"Nokia\",3;\"Samsung\",4;\"Sony Erickson\",5;\"Sprint\",6},2,0)","v":3},null,null,null,null,"Student 81","Poor",{"$f":"VLOOKUP(I85,{\"Excellent\",4;\"Poor\",1;\"Good\",3;\"OK\",2},2,0)","v":1},null,null,null,null,140,60,null,null,null,null,null,null,null,333.15]
["Student 82","Sprint",{"$f":"VLOOKUP(B86,{\"iPhone\",1;\"Motorola\",2;\"Nokia\",3;\"Samsung\",4;\"Sony Erickson\",5;\"Sprint\",6},2,0)","v":6},null,null,null,null,"Student 82","Poor",{"$f":"VLOOKUP(I86,{\"Excellent\",4;\"Poor\",1;\"Good\",3;\"OK\",2},2,0)","v":1},null,null,null,null,139,59.444444444444443,null,null,null,null,null,null,null,332.59444444444443]
["Student 83","Sprint",{"$f":"VLOOKUP(B87,{\"iPhone\",1;\"Motorola\",2;\"Nokia\",3;\"Samsung\",4;\"Sony Erickson\",5;\"Sprint\",6},2,0)","v":6},null,null,null,null,"Student 83","Poor",{"$f":"VLOOKUP(I87,{\"Excellent\",4;\"Poor\",1;\"Good\",3;\"OK\",2},2,0)","v":1},null,null,null,null,138,58.888888888888886,null,null,null,null,null,null,null,332.03888888888889]
["Student 84","iPhone",{"$f":"VLOOKUP(B88,{\"iPhone\",1;\"Motorola\",2;\"Nokia\",3;\"Samsung\",4;\"Sony Erickson\",5;\"Sprint\",6},2,0)","v":1},null,null,null,null,"Student 84","Poor",{"$f":"VLOOKUP(I88,{\"Excellent\",4;\"Poor\",1;\"Good\",3;\"OK\",2},2,0)","v":1},null,null,null,null,137,58.333333333333329,null,null,null,null,null,null,null,331.48333333333329]
["Student 85","iPhone",{"$f":"VLOOKUP(B89,{\"iPhone\",1;\"Motorola\",2;\"Nokia\",3;\"Samsung\",4;\"Sony Erickson\",5;\"Sprint\",6},2,0)","v":1},null,null,null,null,"Student 85","Good",{"$f":"VLOOKUP(I89,{\"Excellent\",4;\"Poor\",1;\"Good\",3;\"OK\",2},2,0)","v":3},null,null,null,null,136,57.777777777777779,null,null,null,null,null,null,null,330.92777777777775]
["Student 86","iPhone",{"$f":"VLOOKUP(B90,{\"iPhone\",1;\"Motorola\",2;\"Nokia\",3;\"Samsung\",4;\"Sony Erickson\",5;\"Sprint\",6},2,0)","v":1},null,null,null,null,"Student 86","OK",{"$f":"VLOOKUP(I90,{\"Excellent\",4;\"Poor\",1;\"Good\",3;\"OK\",2},2,0)","v":2},null,null,null,null,135,57.222222222222221,null,null,null,null,null,null,null,330.37222222222221]
["Student 87","iPhone",{"$f":"VLOOKUP(B91,{\"iPhone\",1;\"Motorola\",2;\"Nokia\",3;\"Samsung\",4;\"Sony Erickson\",5;\"Sprint\",6},2,0)","v":1},null,null,null,null,"Student 87","OK",{"$f":"VLOOKUP(I91,{\"Excellent\",4;\"Poor\",1;\"Good\",3;\"OK\",2},2,0)","v":2},null,null,null,null,134,56.666666666666664,null,null,null,null,null,null,null,329.81666666666666]
["Student 88","Sprint",{"$f":"VLOOKUP(B92,{\"iPhone\",1;\"Motorola\",2;\"Nokia\",3;\"Samsung\",4;\"Sony Erickson\",5;\"Sprint\",6},2,0)","v":6},null,null,null,null,"Student 88","Good",{"$f":"VLOOKUP(I92,{\"Excellent\",4;\"Poor\",1;\"Good\",3;\"OK\",2},2,0)","v":3},null,null,null,null,133,56.111111111111107,null,null,null,null,null,null,null,329.26111111111106]
["Student 89","Motorola",{"$f":"VLOOKUP(B93,{\"iPhone\",1;\"Motorola\",2;\"Nokia\",3;\"Samsung\",4;\"Sony Erickson\",5;\"Sprint\",6},2,0)","v":2},null,null,null,null,"Student 89","Poor",{"$f":"VLOOKUP(I93,{\"Excellent\",4;\"Poor\",1;\"Good\",3;\"OK\",2},2,0)","v":1},null,null,null,null,132,55.555555555555557,null,null,null,null,null,null,null,328.70555555555552]
["Student 90","Sony Erickson",{"$f":"VLOOKUP(B94,{\"iPhone\",1;\"Motorola\",2;\"Nokia\",3;\"Samsung\",4;\"Sony Erickson\",5;\"Sprint\",6},2,0)","v":5},null,null,null,null,"Student 90","OK",{"$f":"VLOOKUP(I94,{\"Excellent\",4;\"Poor\",1;\"Good\",3;\"OK\",2},2,0)","v":2},null,null,null,null,131,55,null,null,null,null,null,null,null,328.15]
["Student 91","Motorola",{"$f":"VLOOKUP(B95,{\"iPhone\",1;\"Motorola\",2;\"Nokia\",3;\"Samsung\",4;\"Sony Erickson\",5;\"Sprint\",6},2,0)","v":2},null,null,null,null,"Student 91","Poor",{"$f":"VLOOKUP(I95,{\"Excellent\",4;\"Poor\",1;\"Good\",3;\"OK\",2},2,0)","v":1},null,null,null,null,130,54.444444444444443,null,null,null,null,null,null,null,327.59444444444443]
["Student 92","Samsung",{"$f":"VLOOKUP(B96,{\"iPhone\",1;\"Motorola\",2;\"Nokia\",3;\"Samsung\",4;\"Sony Erickson\",5;\"Sprint\",6},2,0)","v":4},null,null,null,null,"Student 92","Good",{"$f":"VLOOKUP(I96,{\"Excellent\",4;\"Poor\",1;\"Good\",3;\"OK\",2},2,0)","v":3},null,null,null,null,129,53.888888888888886,null,null,null,null,null,null,null,327.03888888888889]
["Student 93","Nokia",{"$f":"VLOOKUP(B97,{\"iPhone\",1;\"Motorola\",2;\"Nokia\",3;\"Samsung\",4;\"Sony Erickson\",5;\"Sprint\",6},2,0)","v":3},null,null,null,null,"Student 93","Good",{"$f":"VLOOKUP(I97,{\"Excellent\",4;\"Poor\",1;\"Good\",3;\"OK\",2},2,0)","v":3},null,null,null,null,128,53.333333333333329,null,null,null,null,null,null,null,326.48333333333329]
["Student 94","Sony Erickson",{"$f":"VLOOKUP(B98,{\"iPhone\",1;\"Motorola\",2;\"Nokia\",3;\"Samsung\",4;\"Sony Erickson\",5;\"Sprint\",6},2,0)","v":5},null,null,null,null,"Student 94","Poor",{"$f":"VLOOKUP(I98,{\"Excellent\",4;\"Poor\",1;\"Good\",3;\"OK\",2},2,0)","v":1},null,null,null,null,127,52.777777777777779,null,null,null,null,null,null,null,325.92777777777775]
["Student 95","iPhone",{"$f":"VLOOKUP(B99,{\"iPhone\",1;\"Motorola\",2;\"Nokia\",3;\"Samsung\",4;\"Sony Erickson\",5;\"Sprint\",6},2,0)","v":1},null,null,null,null,"Student 95","OK",{"$f":"VLOOKUP(I99,{\"Excellent\",4;\"Poor\",1;\"Good\",3;\"OK\",2},2,0)","v":2},null,null,null,null,126,52.222222222222221,null,null,null,null,null,null,null,325.37222222222221]
["Student 96","Nokia",{"$f":"VLOOKUP(B100,{\"iPhone\",1;\"Motorola\",2;\"Nokia\",3;\"Samsung\",4;\"Sony Erickson\",5;\"Sprint\",6},2,0)","v":3},null,null,null,null,"Student 96","Poor",{"$f":"VLOOKUP(I100,{\"Excellent\",4;\"Poor\",1;\"Good\",3;\"OK\",2},2,0)","v":1},null,null,null,null,125,51.666666666666664,null,null,null,null,null,null,null,324.81666666666666]
["Student 97","iPhone",{"$f":"VLOOKUP(B101,{\"iPhone\",1;\"Motorola\",2;\"Nokia\",3;\"Samsung\",4;\"Sony Erickson\",5;\"Sprint\",6},2,0)","v":1},null,null,null,null,"Student 97","Poor",{"$f":"VLOOKUP(I101,{\"Excellent\",4;\"Poor\",1;\"Good\",3;\"OK\",2},2,0)","v":1},null,null,null,null,124,51.111111111111107,null,null,null,null,null,null,null,324.26111111111106]
["Student 98","Nokia",{"$f":"VLOOKUP(B102,{\"iPhone\",1;\"Motorola\",2;\"Nokia\",3;\"Samsung\",4;\"Sony Erickson\",5;\"Sprint\",6},2,0)","v":3},null,null,null,null,"Student 98","Poor",{"$f":"VLOOKUP(I102,{\"Excellent\",4;\"Poor\",1;\"Good\",3;\"OK\",2},2,0)","v":1},null,null,null,null,123,50.555555555555557,null,null,null,null,null,null,null,323.70555555555552]
["Student 99","Sony Erickson",{"$f":"VLOOKUP(B103,{\"iPhone\",1;\"Motorola\",2;\"Nokia\",3;\"Samsung\",4;\"Sony Erickson\",5;\"Sprint\",6},2,0)","v":5},null,null,null,null,"Student 99","Poor",{"$f":"VLOOKUP(I103,{\"Excellent\",4;\"Poor\",1;\"Good\",3;\"OK\",2},2,0)","v":1},null,null,null,null,122,50,null,null,null,null,null,null,null,323.14999999999998]
["Student 100","Sprint",{"$f":"VLOOKUP(B104,{\"iPhone\",1;\"Motorola\",2;\"Nokia\",3;\"Samsung\",4;\"Sony Erickson\",5;\"Sprint\",6},2,0)","v":6},null,null,null,null,"Student 100","Poor",{"$f":"VLOOKUP(I104,{\"Excellent\",4;\"Poor\",1;\"Good\",3;\"OK\",2},2,0)","v":1},null,null,null,null,121,49.444444444444443,null,null,null,null,null,null,null,322.59444444444443]
["Student 101","Nokia",{"$f":"VLOOKUP(B105,{\"iPhone\",1;\"Motorola\",2;\"Nokia\",3;\"Samsung\",4;\"Sony Erickson\",5;\"Sprint\",6},2,0)","v":3},null,null,null,null,"Student 101","Poor",{"$f":"VLOOKUP(I105,{\"Excellent\",4;\"Poor\",1;\"Good\",3;\"OK\",2},2,0)","v":1},null,null,null,null,120,48.888888888888886,null,null,null,null,null,null,null,322.03888888888889]
["Student 102","iPhone",{"$f":"VLOOKUP(B106,{\"iPhone\",1;\"Motorola\",2;\"Nokia\",3;\"Samsung\",4;\"Sony Erickson\",5;\"Sprint\",6},2,0)","v":1},null,null,null,null,"Student 102","Poor",{"$f":"VLOOKUP(I106,{\"Excellent\",4;\"Poor\",1;\"Good\",3;\"OK\",2},2,0)","v":1},null,null,null,null,119,48.333333333333329,null,null,null,null,null,null,null,321.48333333333329]
["Student 103","Sprint",{"$f":"VLOOKUP(B107,{\"iPhone\",1;\"Motorola\",2;\"Nokia\",3;\"Samsung\",4;\"Sony Erickson\",5;\"Sprint\",6},2,0)","v":6},null,null,null,null,"Student 103","Poor",{"$f":"VLOOKUP(I107,{\"Excellent\",4;\"Poor\",1;\"Good\",3;\"OK\",2},2,0)","v":1},null,null,null,null,118,47.777777777777779,null,null,null,null,null,null,null,320.92777777777775]
["Student 104","Sony Erickson",{"$f":"VLOOKUP(B108,{\"iPhone\",1;\"Motorola\",2;\"Nokia\",3;\"Samsung\",4;\"Sony Erickson\",5;\"Sprint\",6},2,0)","v":5},null,null,null,null,"Student 104","Poor",{"$f":"VLOOKUP(I108,{\"Excellent\",4;\"Poor\",1;\"Good\",3;\"OK\",2},2,0)","v":1},null,null,null,null,117,47.222222222222221,null,null,null,null,null,null,null,320.37222222222221]
["Student 105","Motorola",{"$f":"VLOOKUP(B109,{\"iPhone\",1;\"Motorola\",2;\"Nokia\",3;\"Samsung\",4;\"Sony Erickson\",5;\"Sprint\",6},2,0)","v":2},null,null,null,null,"Student 105","Poor",{"$f":"VLOOKUP(I109,{\"Excellent\",4;\"Poor\",1;\"Good\",3;\"OK\",2},2,0)","v":1},null,null,null,null,116,46.666666666666664,null,null,null,null,null,null,null,319.81666666666666]
["Student 106","Nokia",{"$f":"VLOOKUP(B110,{\"iPhone\",1;\"Motorola\",2;\"Nokia\",3;\"Samsung\",4;\"Sony Erickson\",5;\"Sprint\",6},2,0)","v":3},null,null,null,null,"Student 106","Poor",{"$f":"VLOOKUP(I110,{\"Excellent\",4;\"Poor\",1;\"Good\",3;\"OK\",2},2,0)","v":1},null,null,null,null,115,46.111111111111107,null,null,null,null,null,null,null,319.26111111111106]
["Student 107","iPhone",{"$f":"VLOOKUP(B111,{\"iPhone\",1;\"Motorola\",2;\"Nokia\",3;\"Samsung\",4;\"Sony Erickson\",5;\"Sprint\",6},2,0)","v":1},null,null,null,null,"Student 107","OK",{"$f":"VLOOKUP(I111,{\"Excellent\",4;\"Poor\",1;\"Good\",3;\"OK\",2},2,0)","v":2},null,null,null,null,114,45.555555555555557,null,null,null,null,null,null,null,318.70555555555552]
["Student 108","Nokia",{"$f":"VLOOKUP(B112,{\"iPhone\",1;\"Motorola\",2;\"Nokia\",3;\"Samsung\",4;\"Sony Erickson\",5;\"Sprint\",6},2,0)","v":3},null,null,null,null,"Student 108","Excellent",{"$f":"VLOOKUP(I112,{\"Excellent\",4;\"Poor\",1;\"Good\",3;\"OK\",2},2,0)","v":4},null,null,null,null,113,45,null,null,null,null,null,null,null,318.14999999999998]
["Student 109","Nokia",{"$f":"VLOOKUP(B113,{\"iPhone\",1;\"Motorola\",2;\"Nokia\",3;\"Samsung\",4;\"Sony Erickson\",5;\"Sprint\",6},2,0)","v":3},null,null,null,null,"Student 109","Poor",{"$f":"VLOOKUP(I113,{\"Excellent\",4;\"Poor\",1;\"Good\",3;\"OK\",2},2,0)","v":1},null,null,null,null,112,44.444444444444443,null,null,null,null,null,null,null,317.59444444444443]
["Student 110","Motorola",{"$f":"VLOOKUP(B114,{\"iPhone\",1;\"Motorola\",2;\"Nokia\",3;\"Samsung\",4;\"Sony Erickson\",5;\"Sprint\",6},2,0)","v":2},null,null,null,null,"Student 110","Excellent",{"$f":"VLOOKUP(I114,{\"Excellent\",4;\"Poor\",1;\"Good\",3;\"OK\",2},2,0)","v":4},null,null,null,null,111,43.888888888888886,null,null,null,null,null,null,null,317.03888888888889]
["Student 111","iPhone",{"$f":"VLOOKUP(B115,{\"iPhone\",1;\"Motorola\",2;\"Nokia\",3;\"Samsung\",4;\"Sony Erickson\",5;\"Sprint\",6},2,0)","v":1},null,null,null,null,"Student 111","OK",{"$f":"VLOOKUP(I115,{\"Excellent\",4;\"Poor\",1;\"Good\",3;\"OK\",2},2,0)","v":2},null,null,null,null,110,43.333333333333336,null,null,null,null,null,null,null,316.48333333333329]
["Student 112","Nokia",{"$f":"VLOOKUP(B116,{\"iPhone\",1;\"Motorola\",2;\"Nokia\",3;\"Samsung\",4;\"Sony Erickson\",5;\"Sprint\",6},2,0)","v":3},null,null,null,null,"Student 112","Good",{"$f":"VLOOKUP(I116,{\"Excellent\",4;\"Poor\",1;\"Good\",3;\"OK\",2},2,0)","v":3},null,null,null,null,109,42.777777777777779,null,null,null,null,null,null,null,315.92777777777775]
["Student 113","Nokia",{"$f":"VLOOKUP(B117,{\"iPhone\",1;\"Motorola\",2;\"Nokia\",3;\"Samsung\",4;\"Sony Erickson\",5;\"Sprint\",6},2,0)","v":3},null,null,null,null,"Student 113","Poor",{"$f":"VLOOKUP(I117,{\"Excellent\",4;\"Poor\",1;\"Good\",3;\"OK\",2},2,0)","v":1},null,null,null,null,108,42.222222222222221,null,null,null,null,null,null,null,315.37222222222221]
["Student 114","Nokia",{"$f":"VLOOKUP(B118,{\"iPhone\",1;\"Motorola\",2;\"Nokia\",3;\"Samsung\",4;\"Sony Erickson\",5;\"Sprint\",6},2,0)","v":3},null,null,null,null,"Student 114","Good",{"$f":"VLOOKUP(I118,{\"Excellent\",4;\"Poor\",1;\"Good\",3;\"OK\",2},2,0)","v":3},null,null,null,null,107,41.666666666666664,null,null,null,null,null,null,null,314.81666666666666]
["Student 115","Motorola",{"$f":"VLOOKUP(B119,{\"iPhone\",1;\"Motorola\",2;\"Nokia\",3;\"Samsung\",4;\"Sony Erickson\",5;\"Sprint\",6},2,0)","v":2},null,null,null,null,"Student 115","OK",{"$f":"VLOOKUP(I119,{\"Excellent\",4;\"Poor\",1;\"Good\",3;\"OK\",2},2,0)","v":2},null,null,null,null,106,41.111111111111107,null,null,null,null,null,null,null,314.26111111111106]
["Student 116","Sprint",{"$f":"VLOOKUP(B120,{\"iPhone\",1;\"Motorola\",2;\"Nokia\",3;\"Samsung\",4;\"Sony Erickson\",5;\"Sprint\",6},2,0)","v":6},null,null,null,null,"Student 116","OK",{"$f":"VLOOKUP(I120,{\"Excellent\",4;\"Poor\",1;\"Good\",3;\"OK\",2},2,0)","v":2},null,null,null,null,105,40.555555555555557,null,null,null,null,null,null,null,313.70555555555552]
["Student 117","Sprint",{"$f":"VLOOKUP(B121,{\"iPhone\",1;\"Motorola\",2;\"Nokia\",3;\"Samsung\",4;\"Sony Erickson\",5;\"Sprint\",6},2,0)","v":6},null,null,null,null,"Student 117","Poor",{"$f":"VLOOKUP(I121,{\"Excellent\",4;\"Poor\",1;\"Good\",3;\"OK\",2},2,0)","v":1},null,null,null,null,104,40,null,null,null,null,null,null,null,313.14999999999998]
["Student 118","Sprint",{"$f":"VLOOKUP(B122,{\"iPhone\",1;\"Motorola\",2;\"Nokia\",3;\"Samsung\",4;\"Sony Erickson\",5;\"Sprint\",6},2,0)","v":6},null,null,null,null,"Student 118","Excellent",{"$f":"VLOOKUP(I122,{\"Excellent\",4;\"Poor\",1;\"Good\",3;\"OK\",2},2,0)","v":4},null,null,null,null,103,39.444444444444443,null,null,null,null,null,null,null,312.59444444444443]
["Student 119","Nokia",{"$f":"VLOOKUP(B123,{\"iPhone\",1;\"Motorola\",2;\"Nokia\",3;\"Samsung\",4;\"Sony Erickson\",5;\"Sprint\",6},2,0)","v":3},null,null,null,null,"Student 119","Excellent",{"$f":"VLOOKUP(I123,{\"Excellent\",4;\"Poor\",1;\"Good\",3;\"OK\",2},2,0)","v":4},null,null,null,null,102,38.888888888888886,null,null,null,null,null,null,null,312.03888888888889]
["Student 120","Nokia",{"$f":"VLOOKUP(B124,{\"iPhone\",1;\"Motorola\",2;\"Nokia\",3;\"Samsung\",4;\"Sony Erickson\",5;\"Sprint\",6},2,0)","v":3},null,null,null,null,"Student 120","Excellent",{"$f":"VLOOKUP(I124,{\"Excellent\",4;\"Poor\",1;\"Good\",3;\"OK\",2},2,0)","v":4},null,null,null,null,101,38.333333333333336,null,null,null,null,null,null,null,311.48333333333329]
["Student 121","Sprint",{"$f":"VLOOKUP(B125,{\"iPhone\",1;\"Motorola\",2;\"Nokia\",3;\"Samsung\",4;\"Sony Erickson\",5;\"Sprint\",6},2,0)","v":6},null,null,null,null,"Student 121","Excellent",{"$f":"VLOOKUP(I125,{\"Excellent\",4;\"Poor\",1;\"Good\",3;\"OK\",2},2,0)","v":4},null,null,null,null,100,37.777777777777779,null,null,null,null,null,null,null,310.92777777777775]
["Student 122","Nokia",{"$f":"VLOOKUP(B126,{\"iPhone\",1;\"Motorola\",2;\"Nokia\",3;\"Samsung\",4;\"Sony Erickson\",5;\"Sprint\",6},2,0)","v":3},null,null,null,null,"Student 122","OK",{"$f":"VLOOKUP(I126,{\"Excellent\",4;\"Poor\",1;\"Good\",3;\"OK\",2},2,0)","v":2},null,null,null,null,99,37.222222222222221,null,null,null,null,null,null,null,310.37222222222221]
["Student 123","Samsung",{"$f":"VLOOKUP(B127,{\"iPhone\",1;\"Motorola\",2;\"Nokia\",3;\"Samsung\",4;\"Sony Erickson\",5;\"Sprint\",6},2,0)","v":4},null,null,null,null,"Student 123","Good",{"$f":"VLOOKUP(I127,{\"Excellent\",4;\"Poor\",1;\"Good\",3;\"OK\",2},2,0)","v":3},null,null,null,null,98,36.666666666666664,null,null,null,null,null,null,null,309.81666666666666]
["Student 124","Samsung",{"$f":"VLOOKUP(B128,{\"iPhone\",1;\"Motorola\",2;\"Nokia\",3;\"Samsung\",4;\"Sony Erickson\",5;\"Sprint\",6},2,0)","v":4},null,null,null,null,"Student 124","Poor",{"$f":"VLOOKUP(I128,{\"Excellent\",4;\"Poor\",1;\"Good\",3;\"OK\",2},2,0)","v":1},null,null,null,null,97,36.111111111111107,null,null,null,null,null,null,null,309.26111111111106]
["Student 125","Samsung",{"$f":"VLOOKUP(B129,{\"iPhone\",1;\"Motorola\",2;\"Nokia\",3;\"Samsung\",4;\"Sony Erickson\",5;\"Sprint\",6},2,0)","v":4},null,null,null,null,"Student 125","Poor",{"$f":"VLOOKUP(I129,{\"Excellent\",4;\"Poor\",1;\"Good\",3;\"OK\",2},2,0)","v":1},null,null,null,null,96,35.555555555555557,null,null,null,null,null,null,null,308.70555555555552]
["Student 126","Samsung",{"$f":"VLOOKUP(B130,{\"iPhone\",1;\"Motorola\",2;\"Nokia\",3;\"Samsung\",4;\"Sony Erickson\",5;\"Sprint\",6},2,0)","v":4},null,null,null,null,"Student 126","Excellent",{"$f":"VLOOKUP(I130,{\"Excellent\",4;\"Poor\",1;\"Good\",3;\"OK\",2},2,0)","v":4},null,null,null,null,95,35,null,null,null,null,null,null,null,308.14999999999998]
["Student 127","Motorola",{"$f":"VLOOKUP(B131,{\"iPhone\",1;\"Motorola\",2;\"Nokia\",3;\"Samsung\",4;\"Sony Erickson\",5;\"Sprint\",6},2,0)","v":2},null,null,null,null,"Student 127","Poor",{"$f":"VLOOKUP(I131,{\"Excellent\",4;\"Poor\",1;\"Good\",3;\"OK\",2},2,0)","v":1},null,null,null,null,94,34.444444444444443,null,null,null,null,null,null,null,307.59444444444443]
["Student 128","Sony Erickson",{"$f":"VLOOKUP(B132,{\"iPhone\",1;\"Motorola\",2;\"Nokia\",3;\"Samsung\",4;\"Sony Erickson\",5;\"Sprint\",6},2,0)","v":5},null,null,null,null,"Student 128","Poor",{"$f":"VLOOKUP(I132,{\"Excellent\",4;\"Poor\",1;\"Good\",3;\"OK\",2},2,0)","v":1},null,null,null,null,93,33.888888888888886,null,null,null,null,null,null,null,307.03888888888889]
["Student 129","Motorola",{"$f":"VLOOKUP(B133,{\"iPhone\",1;\"Motorola\",2;\"Nokia\",3;\"Samsung\",4;\"Sony Erickson\",5;\"Sprint\",6},2,0)","v":2},null,null,null,null,"Student 129","OK",{"$f":"VLOOKUP(I133,{\"Excellent\",4;\"Poor\",1;\"Good\",3;\"OK\",2},2,0)","v":2},null,null,null,null,92,{"$f":"CONVERT(O133,\"F\",\"C\")","v":33.333333333333336},null,null,null,null,null,null,null,306.48333333333329]
["Student 130","iPhone",{"$f":"VLOOKUP(B134,{\"iPhone\",1;\"Motorola\",2;\"Nokia\",3;\"Samsung\",4;\"Sony Erickson\",5;\"Sprint\",6},2,0)","v":1},null,null,null,null,"Student 130","Poor",{"$f":"VLOOKUP(I134,{\"Excellent\",4;\"Poor\",1;\"Good\",3;\"OK\",2},2,0)","v":1},null,null,null,null,91,32.777777777777779,null,null,null,null,null,null,null,305.92777777777775]
["Student 131","iPhone",{"$f":"VLOOKUP(B135,{\"iPhone\",1;\"Motorola\",2;\"Nokia\",3;\"Samsung\",4;\"Sony Erickson\",5;\"Sprint\",6},2,0)","v":1},null,null,null,null,"Student 131","Poor",{"$f":"VLOOKUP(I135,{\"Excellent\",4;\"Poor\",1;\"Good\",3;\"OK\",2},2,0)","v":1},null,null,null,null,90,32.222222222222221,null,null,null,null,null,null,null,305.37222222222221]
["Student 132","Sprint",{"$f":"VLOOKUP(B136,{\"iPhone\",1;\"Motorola\",2;\"Nokia\",3;\"Samsung\",4;\"Sony Erickson\",5;\"Sprint\",6},2,0)","v":6},null,null,null,null,"Student 132","Poor",{"$f":"VLOOKUP(I136,{\"Excellent\",4;\"Poor\",1;\"Good\",3;\"OK\",2},2,0)","v":1},null,null,null,null,89,31.666666666666664,null,null,null,null,null,null,null,{"$f":"CONVERT(O136,\"F\",\"K\")","v":304.81666666666666}]
["Student 133","Samsung",{"$f":"VLOOKUP(B137,{\"iPhone\",1;\"Motorola\",2;\"Nokia\",3;\"Samsung\",4;\"Sony Erickson\",5;\"Sprint\",6},2,0)","v":4},null,null,null,null,"Student 133","OK",{"$f":"VLOOKUP(I137,{\"Excellent\",4;\"Poor\",1;\"Good\",3;\"OK\",2},2,0)","v":2},null,null,null,null,88,31.111111111111111,null,null,null,null,null,null,null,304.26111111111106]
["Student 134","Nokia",{"$f":"VLOOKUP(B138,{\"iPhone\",1;\"Motorola\",2;\"Nokia\",3;\"Samsung\",4;\"Sony Erickson\",5;\"Sprint\",6},2,0)","v":3},null,null,null,null,"Student 134","Poor",{"$f":"VLOOKUP(I138,{\"Excellent\",4;\"Poor\",1;\"Good\",3;\"OK\",2},2,0)","v":1},null,null,null,null,87,30.555555555555554,null,null,null,null,null,null,null,303.70555555555552]
["Student 135","Motorola",{"$f":"VLOOKUP(B139,{\"iPhone\",1;\"Motorola\",2;\"Nokia\",3;\"Samsung\",4;\"Sony Erickson\",5;\"Sprint\",6},2,0)","v":2},null,null,null,null,"Student 135","OK",{"$f":"VLOOKUP(I139,{\"Excellent\",4;\"Poor\",1;\"Good\",3;\"OK\",2},2,0)","v":2},null,null,null,null,86,30,null,null,null,null,null,null,null,303.14999999999998]
["Student 136","Nokia",{"$f":"VLOOKUP(B140,{\"iPhone\",1;\"Motorola\",2;\"Nokia\",3;\"Samsung\",4;\"Sony Erickson\",5;\"Sprint\",6},2,0)","v":3},null,null,null,null,"Student 136","Poor",{"$f":"VLOOKUP(I140,{\"Excellent\",4;\"Poor\",1;\"Good\",3;\"OK\",2},2,0)","v":1},null,null,null,null,85,29.444444444444443,null,null,null,null,null,null,null,302.59444444444443]
["Student 137","Motorola",{"$f":"VLOOKUP(B141,{\"iPhone\",1;\"Motorola\",2;\"Nokia\",3;\"Samsung\",4;\"Sony Erickson\",5;\"Sprint\",6},2,0)","v":2},null,null,null,null,"Student 137","Poor",{"$f":"VLOOKUP(I141,{\"Excellent\",4;\"Poor\",1;\"Good\",3;\"OK\",2},2,0)","v":1},null,null,null,null,84,28.888888888888889,null,null,null,null,null,null,null,302.03888888888889]
["Student 138","Sony Erickson",{"$f":"VLOOKUP(B142,{\"iPhone\",1;\"Motorola\",2;\"Nokia\",3;\"Samsung\",4;\"Sony Erickson\",5;\"Sprint\",6},2,0)","v":5},null,null,null,null,"Student 138","OK",{"$f":"VLOOKUP(I142,{\"Excellent\",4;\"Poor\",1;\"Good\",3;\"OK\",2},2,0)","v":2},null,null,null,null,83,28.333333333333332,null,null,null,null,null,null,null,301.48333333333329]
["Student 139","Samsung",{"$f":"VLOOKUP(B143,{\"iPhone\",1;\"Motorola\",2;\"Nokia\",3;\"Samsung\",4;\"Sony Erickson\",5;\"Sprint\",6},2,0)","v":4},null,null,null,null,"Student 139","Excellent",{"$f":"VLOOKUP(I143,{\"Excellent\",4;\"Poor\",1;\"Good\",3;\"OK\",2},2,0)","v":4},null,null,null,null,82,27.777777777777779,null,null,null,null,null,null,null,300.92777777777775]
["Student 140","Nokia",{"$f":"VLOOKUP(B144,{\"iPhone\",1;\"Motorola\",2;\"Nokia\",3;\"Samsung\",4;\"Sony Erickson\",5;\"Sprint\",6},2,0)","v":3},null,null,null,null,"Student 140","OK",{"$f":"VLOOKUP(I144,{\"Excellent\",4;\"Poor\",1;\"Good\",3;\"OK\",2},2,0)","v":2},null,null,null,null,81,27.222222222222221,null,null,null,null,null,null,null,300.37222222222221]
["Student 141","iPhone",{"$f":"VLOOKUP(B145,{\"iPhone\",1;\"Motorola\",2;\"Nokia\",3;\"Samsung\",4;\"Sony Erickson\",5;\"Sprint\",6},2,0)","v":1},null,null,null,null,"Student 141","Poor",{"$f":"VLOOKUP(I145,{\"Excellent\",4;\"Poor\",1;\"Good\",3;\"OK\",2},2,0)","v":1},null,null,null,null,80,26.666666666666664,null,null,null,null,null,null,null,299.81666666666666]
["Student 142","Motorola",{"$f":"VLOOKUP(B146,{\"iPhone\",1;\"Motorola\",2;\"Nokia\",3;\"Samsung\",4;\"Sony Erickson\",5;\"Sprint\",6},2,0)","v":2},null,null,null,null,"Student 142","Poor",{"$f":"VLOOKUP(I146,{\"Excellent\",4;\"Poor\",1;\"Good\",3;\"OK\",2},2,0)","v":1},null,null,null,null,79,26.111111111111111,null,null,null,null,null,null,null,299.26111111111106]
["Student 143","iPhone",{"$f":"VLOOKUP(B147,{\"iPhone\",1;\"Motorola\",2;\"Nokia\",3;\"Samsung\",4;\"Sony Erickson\",5;\"Sprint\",6},2,0)","v":1},null,null,null,null,"Student 143","Poor",{"$f":"VLOOKUP(I147,{\"Excellent\",4;\"Poor\",1;\"Good\",3;\"OK\",2},2,0)","v":1},null,null,null,null,78,25.555555555555554,null,null,null,null,null,null,null,298.70555555555552]
["Student 144","Samsung",{"$f":"VLOOKUP(B148,{\"iPhone\",1;\"Motorola\",2;\"Nokia\",3;\"Samsung\",4;\"Sony Erickson\",5;\"Sprint\",6},2,0)","v":4},null,null,null,null,"Student 144","Poor",{"$f":"VLOOKUP(I148,{\"Excellent\",4;\"Poor\",1;\"Good\",3;\"OK\",2},2,0)","v":1},null,null,null,null,77,25,null,null,null,null,null,null,null,298.14999999999998]
["Student 145","Motorola",{"$f":"VLOOKUP(B149,{\"iPhone\",1;\"Motorola\",2;\"Nokia\",3;\"Samsung\",4;\"Sony Erickson\",5;\"Sprint\",6},2,0)","v":2},null,null,null,null,"Student 145","OK",{"$f":"VLOOKUP(I149,{\"Excellent\",4;\"Poor\",1;\"Good\",3;\"OK\",2},2,0)","v":2},null,null,null,null,76,24.444444444444443,null,null,null,null,null,null,null,297.59444444444443]
["Student 146","Nokia",{"$f":"VLOOKUP(B150,{\"iPhone\",1;\"Motorola\",2;\"Nokia\",3;\"Samsung\",4;\"Sony Erickson\",5;\"Sprint\",6},2,0)","v":3},null,null,null,null,"Student 146","Poor",{"$f":"VLOOKUP(I150,{\"Excellent\",4;\"Poor\",1;\"Good\",3;\"OK\",2},2,0)","v":1},null,null,null,null,75,23.888888888888889,null,null,null,null,null,null,null,297.03888888888889]
["Student 147","Motorola",{"$f":"VLOOKUP(B151,{\"iPhone\",1;\"Motorola\",2;\"Nokia\",3;\"Samsung\",4;\"Sony Erickson\",5;\"Sprint\",6},2,0)","v":2},null,null,null,null,"Student 147","Poor",{"$f":"VLOOKUP(I151,{\"Excellent\",4;\"Poor\",1;\"Good\",3;\"OK\",2},2,0)","v":1},null,null,null,null,74,23.333333333333332,null,null,null,null,null,null,null,296.48333333333329]
["Student 148","Samsung",{"$f":"VLOOKUP(B152,{\"iPhone\",1;\"Motorola\",2;\"Nokia\",3;\"Samsung\",4;\"Sony Erickson\",5;\"Sprint\",6},2,0)","v":4},null,null,null,null,"Student 148","OK",{"$f":"VLOOKUP(I152,{\"Excellent\",4;\"Poor\",1;\"Good\",3;\"OK\",2},2,0)","v":2},null,null,null,null,73,22.777777777777779,null,null,null,null,null,null,null,295.92777777777775]
["Student 149","Sprint",{"$f":"VLOOKUP(B153,{\"iPhone\",1;\"Motorola\",2;\"Nokia\",3;\"Samsung\",4;\"Sony Erickson\",5;\"Sprint\",6},2,0)","v":6},null,null,null,null,"Student 149","Poor",{"$f":"VLOOKUP(I153,{\"Excellent\",4;\"Poor\",1;\"Good\",3;\"OK\",2},2,0)","v":1},null,null,null,null,72,22.222222222222221,null,null,null,null,null,null,null,295.37222222222221]
["Student 150","Samsung",{"$f":"VLOOKUP(B154,{\"iPhone\",1;\"Motorola\",2;\"Nokia\",3;\"Samsung\",4;\"Sony Erickson\",5;\"Sprint\",6},2,0)","v":4},null,null,null,null,"Student 150","Excellent",{"$f":"VLOOKUP(I154,{\"Excellent\",4;\"Poor\",1;\"Good\",3;\"OK\",2},2,0)","v":4},null,null,null,null,71,21.666666666666668,null,null,null,null,null,null,null,294.81666666666666]
["Student 151","Sony Erickson",{"$f":"VLOOKUP(B155,{\"iPhone\",1;\"Motorola\",2;\"Nokia\",3;\"Samsung\",4;\"Sony Erickson\",5;\"Sprint\",6},2,0)","v":5},null,null,null,null,"Student 151","Excellent",{"$f":"VLOOKUP(I155,{\"Excellent\",4;\"Poor\",1;\"Good\",3;\"OK\",2},2,0)","v":4},null,null,null,null,70,21.111111111111111,null,null,null,null,null,null,null,294.26111111111106]
["Student 152","Nokia",{"$f":"VLOOKUP(B156,{\"iPhone\",1;\"Motorola\",2;\"Nokia\",3;\"Samsung\",4;\"Sony Erickson\",5;\"Sprint\",6},2,0)","v":3},null,null,null,null,"Student 152","Excellent",{"$f":"VLOOKUP(I156,{\"Excellent\",4;\"Poor\",1;\"Good\",3;\"OK\",2},2,0)","v":4},null,null,null,null,69,20.555555555555554,null,null,null,null,null,null,null,293.70555555555552]
["Student 153","iPhone",{"$f":"VLOOKUP(B157,{\"iPhone\",1;\"Motorola\",2;\"Nokia\",3;\"Samsung\",4;\"Sony Erickson\",5;\"Sprint\",6},2,0)","v":1},null,null,null,null,"Student 153","OK",{"$f":"VLOOKUP(I157,{\"Excellent\",4;\"Poor\",1;\"Good\",3;\"OK\",2},2,0)","v":2},null,null,null,null,68,20,null,null,null,null,null,null,null,293.14999999999998]
["Student 154","Sprint",{"$f":"VLOOKUP(B158,{\"iPhone\",1;\"Motorola\",2;\"Nokia\",3;\"Samsung\",4;\"Sony Erickson\",5;\"Sprint\",6},2,0)","v":6},null,null,null,null,"Student 154","Poor",{"$f":"VLOOKUP(I158,{\"Excellent\",4;\"Poor\",1;\"Good\",3;\"OK\",2},2,0)","v":1},null,null,null,null,67,19.444444444444443,null,null,null,null,null,null,null,292.59444444444443]
["Student 155","iPhone",{"$f":"VLOOKUP(B159,{\"iPhone\",1;\"Motorola\",2;\"Nokia\",3;\"Samsung\",4;\"Sony Erickson\",5;\"Sprint\",6},2,0)","v":1},null,null,null,null,"Student 155","OK",{"$f":"VLOOKUP(I159,{\"Excellent\",4;\"Poor\",1;\"Good\",3;\"OK\",2},2,0)","v":2},null,null,null,null,66,18.888888888888889,null,null,null,null,null,null,null,292.03888888888889]
["Student 156","iPhone",{"$f":"VLOOKUP(B160,{\"iPhone\",1;\"Motorola\",2;\"Nokia\",3;\"Samsung\",4;\"Sony Erickson\",5;\"Sprint\",6},2,0)","v":1},null,null,null,null,"Student 156","Poor",{"$f":"VLOOKUP(I160,{\"Excellent\",4;\"Poor\",1;\"Good\",3;\"OK\",2},2,0)","v":1},null,null,null,null,65,18.333333333333332,null,null,null,null,null,null,null,291.48333333333329]
["Student 157","Samsung",{"$f":"VLOOKUP(B161,{\"iPhone\",1;\"Motorola\",2;\"Nokia\",3;\"Samsung\",4;\"Sony Erickson\",5;\"Sprint\",6},2,0)","v":4},null,null,null,null,"Student 157","Poor",{"$f":"VLOOKUP(I161,{\"Excellent\",4;\"Poor\",1;\"Good\",3;\"OK\",2},2,0)","v":1},null,null,null,null,64,17.777777777777779,null,null,null,null,null,null,null,290.92777777777775]
["Student 158","Nokia",{"$f":"VLOOKUP(B162,{\"iPhone\",1;\"Motorola\",2;\"Nokia\",3;\"Samsung\",4;\"Sony Erickson\",5;\"Sprint\",6},2,0)","v":3},null,null,null,null,"Student 158","Poor",{"$f":"VLOOKUP(I162,{\"Excellent\",4;\"Poor\",1;\"Good\",3;\"OK\",2},2,0)","v":1},null,null,null,null,63,17.222222222222221,null,null,null,null,null,null,null,290.37222222222221]
["Student 159","Nokia",{"$f":"VLOOKUP(B163,{\"iPhone\",1;\"Motorola\",2;\"Nokia\",3;\"Samsung\",4;\"Sony Erickson\",5;\"Sprint\",6},2,0)","v":3},null,null,null,null,"Student 159","Poor",{"$f":"VLOOKUP(I163,{\"Excellent\",4;\"Poor\",1;\"Good\",3;\"OK\",2},2,0)","v":1},null,null,null,null,62,16.666666666666668,null,null,null,null,null,null,null,289.81666666666666]
["Student 160","iPhone",{"$f":"VLOOKUP(B164,{\"iPhone\",1;\"Motorola\",2;\"Nokia\",3;\"Samsung\",4;\"Sony Erickson\",5;\"Sprint\",6},2,0)","v":1},null,null,null,null,"Student 160","Poor",{"$f":"VLOOKUP(I164,{\"Excellent\",4;\"Poor\",1;\"Good\",3;\"OK\",2},2,0)","v":1},null,null,null,null,61,16.111111111111111,null,null,null,null,null,null,null,289.26111111111106]
["Student 161","Sony Erickson",{"$f":"VLOOKUP(B165,{\"iPhone\",1;\"Motorola\",2;\"Nokia\",3;\"Samsung\",4;\"Sony Erickson\",5;\"Sprint\",6},2,0)","v":5},null,null,null,null,"Student 161","OK",{"$f":"VLOOKUP(I165,{\"Excellent\",4;\"Poor\",1;\"Good\",3;\"OK\",2},2,0)","v":2},null,null,null,null,60,15.555555555555555,null,null,null,null,null,null,null,288.70555555555552]
["Student 162","Nokia",{"$f":"VLOOKUP(B166,{\"iPhone\",1;\"Motorola\",2;\"Nokia\",3;\"Samsung\",4;\"Sony Erickson\",5;\"Sprint\",6},2,0)","v":3},null,null,null,null,"Student 162","Poor",{"$f":"VLOOKUP(I166,{\"Excellent\",4;\"Poor\",1;\"Good\",3;\"OK\",2},2,0)","v":1},null,null,null,null,59,15,null,null,null,null,null,null,null,288.14999999999998]
["Student 163","Sprint",{"$f":"VLOOKUP(B167,{\"iPhone\",1;\"Motorola\",2;\"Nokia\",3;\"Samsung\",4;\"Sony Erickson\",5;\"Sprint\",6},2,0)","v":6},null,null,null,null,"Student 163","Poor",{"$f":"VLOOKUP(I167,{\"Excellent\",4;\"Poor\",1;\"Good\",3;\"OK\",2},2,0)","v":1},null,null,null,null,58,14.444444444444445,null,null,null,null,null,null,null,287.59444444444443]
["Student 164","Nokia",{"$f":"VLOOKUP(B168,{\"iPhone\",1;\"Motorola\",2;\"Nokia\",3;\"Samsung\",4;\"Sony Erickson\",5;\"Sprint\",6},2,0)","v":3},null,null,null,null,"Student 164","Excellent",{"$f":"VLOOKUP(I168,{\"Excellent\",4;\"Poor\",1;\"Good\",3;\"OK\",2},2,0)","v":4},null,null,null,null,57,13.888888888888889,null,null,null,null,null,null,null,287.03888888888889]
["Student 165","Samsung",{"$f":"VLOOKUP(B169,{\"iPhone\",1;\"Motorola\",2;\"Nokia\",3;\"Samsung\",4;\"Sony Erickson\",5;\"Sprint\",6},2,0)","v":4},null,null,null,null,"Student 165","Good",{"$f":"VLOOKUP(I169,{\"Excellent\",4;\"Poor\",1;\"Good\",3;\"OK\",2},2,0)","v":3},null,null,null,null,56,13.333333333333332,null,null,null,null,null,null,null,286.48333333333329]
["Student 166","iPhone",{"$f":"VLOOKUP(B170,{\"iPhone\",1;\"Motorola\",2;\"Nokia\",3;\"Samsung\",4;\"Sony Erickson\",5;\"Sprint\",6},2,0)","v":1},null,null,null,null,"Student 166","OK",{"$f":"VLOOKUP(I170,{\"Excellent\",4;\"Poor\",1;\"Good\",3;\"OK\",2},2,0)","v":2},null,null,null,null,55,12.777777777777777,null,null,null,null,null,null,null,285.92777777777775]
["Student 167","Samsung",{"$f":"VLOOKUP(B171,{\"iPhone\",1;\"Motorola\",2;\"Nokia\",3;\"Samsung\",4;\"Sony Erickson\",5;\"Sprint\",6},2,0)","v":4},null,null,null,null,"Student 167","Good",{"$f":"VLOOKUP(I171,{\"Excellent\",4;\"Poor\",1;\"Good\",3;\"OK\",2},2,0)","v":3},null,null,null,null,54,12.222222222222221,null,null,null,null,null,null,null,285.37222222222221]
["Student 168","Motorola",{"$f":"VLOOKUP(B172,{\"iPhone\",1;\"Motorola\",2;\"Nokia\",3;\"Samsung\",4;\"Sony Erickson\",5;\"Sprint\",6},2,0)","v":2},null,null,null,null,"Student 168","OK",{"$f":"VLOOKUP(I172,{\"Excellent\",4;\"Poor\",1;\"Good\",3;\"OK\",2},2,0)","v":2},null,null,null,null,53,11.666666666666666,null,null,null,null,null,null,null,284.81666666666666]
["Student 169","Sony Erickson",{"$f":"VLOOKUP(B173,{\"iPhone\",1;\"Motorola\",2;\"Nokia\",3;\"Samsung\",4;\"Sony Erickson\",5;\"Sprint\",6},2,0)","v":5},null,null,null,null,"Student 169","Poor",{"$f":"VLOOKUP(I173,{\"Excellent\",4;\"Poor\",1;\"Good\",3;\"OK\",2},2,0)","v":1},null,null,null,null,52,11.111111111111111,null,null,null,null,null,null,null,284.26111111111106]
["Student 170","Nokia",{"$f":"VLOOKUP(B174,{\"iPhone\",1;\"Motorola\",2;\"Nokia\",3;\"Samsung\",4;\"Sony Erickson\",5;\"Sprint\",6},2,0)","v":3},null,null,null,null,"Student 170","Poor",{"$f":"VLOOKUP(I174,{\"Excellent\",4;\"Poor\",1;\"Good\",3;\"OK\",2},2,0)","v":1},null,null,null,null,51,10.555555555555555,null,null,null,null,null,null,null,283.70555555555552]
["Student 171","Nokia",{"$f":"VLOOKUP(B175,{\"iPhone\",1;\"Motorola\",2;\"Nokia\",3;\"Samsung\",4;\"Sony Erickson\",5;\"Sprint\",6},2,0)","v":3},null,null,null,null,"Student 171","OK",{"$f":"VLOOKUP(I175,{\"Excellent\",4;\"Poor\",1;\"Good\",3;\"OK\",2},2,0)","v":2},null,null,null,null,50,10,null,null,null,null,null,null,null,283.14999999999998]
["Student 172","Nokia",{"$f":"VLOOKUP(B176,{\"iPhone\",1;\"Motorola\",2;\"Nokia\",3;\"Samsung\",4;\"Sony Erickson\",5;\"Sprint\",6},2,0)","v":3},null,null,null,null,"Student 172","OK",{"$f":"VLOOKUP(I176,{\"Excellent\",4;\"Poor\",1;\"Good\",3;\"OK\",2},2,0)","v":2},null,null,null,null,49,9.4444444444444446,null,null,null,null,null,null,null,282.59444444444443]
["Student 173","Nokia",{"$f":"VLOOKUP(B177,{\"iPhone\",1;\"Motorola\",2;\"Nokia\",3;\"Samsung\",4;\"Sony Erickson\",5;\"Sprint\",6},2,0)","v":3},null,null,null,null,"Student 173","Poor",{"$f":"VLOOKUP(I177,{\"Excellent\",4;\"Poor\",1;\"Good\",3;\"OK\",2},2,0)","v":1},null,null,null,null,48,8.8888888888888893,null,null,null,null,null,null,null,282.03888888888889]
["Student 174","iPhone",{"$f":"VLOOKUP(B178,{\"iPhone\",1;\"Motorola\",2;\"Nokia\",3;\"Samsung\",4;\"Sony Erickson\",5;\"Sprint\",6},2,0)","v":1},null,null,null,null,"Student 174","OK",{"$f":"VLOOKUP(I178,{\"Excellent\",4;\"Poor\",1;\"Good\",3;\"OK\",2},2,0)","v":2},null,null,null,null,47,8.3333333333333339,null,null,null,null,null,null,null,281.48333333333329]
["Student 175","Motorola",{"$f":"VLOOKUP(B179,{\"iPhone\",1;\"Motorola\",2;\"Nokia\",3;\"Samsung\",4;\"Sony Erickson\",5;\"Sprint\",6},2,0)","v":2},null,null,null,null,"Student 175","Good",{"$f":"VLOOKUP(I179,{\"Excellent\",4;\"Poor\",1;\"Good\",3;\"OK\",2},2,0)","v":3},null,null,null,null,46,7.7777777777777777,null,null,null,null,null,null,null,280.92777777777775]
["Student 176","Sprint",{"$f":"VLOOKUP(B180,{\"iPhone\",1;\"Motorola\",2;\"Nokia\",3;\"Samsung\",4;\"Sony Erickson\",5;\"Sprint\",6},2,0)","v":6},null,null,null,null,"Student 176","Poor",{"$f":"VLOOKUP(I180,{\"Excellent\",4;\"Poor\",1;\"Good\",3;\"OK\",2},2,0)","v":1},null,null,null,null,45,7.2222222222222223,null,null,null,null,null,null,null,280.37222222222221]
["Student 177","iPhone",{"$f":"VLOOKUP(B181,{\"iPhone\",1;\"Motorola\",2;\"Nokia\",3;\"Samsung\",4;\"Sony Erickson\",5;\"Sprint\",6},2,0)","v":1},null,null,null,null,"Student 177","Excellent",{"$f":"VLOOKUP(I181,{\"Excellent\",4;\"Poor\",1;\"Good\",3;\"OK\",2},2,0)","v":4},null,null,null,null,44,6.6666666666666661,null,null,null,null,null,null,null,279.81666666666666]
["Student 178","Motorola",{"$f":"VLOOKUP(B182,{\"iPhone\",1;\"Motorola\",2;\"Nokia\",3;\"Samsung\",4;\"Sony Erickson\",5;\"Sprint\",6},2,0)","v":2},null,null,null,null,"Student 178","Poor",{"$f":"VLOOKUP(I182,{\"Excellent\",4;\"Poor\",1;\"Good\",3;\"OK\",2},2,0)","v":1},null,null,null,null,43,6.1111111111111107,null,null,null,null,null,null,null,279.26111111111106]
["Student 179","Nokia",{"$f":"VLOOKUP(B183,{\"iPhone\",1;\"Motorola\",2;\"Nokia\",3;\"Samsung\",4;\"Sony Erickson\",5;\"Sprint\",6},2,0)","v":3},null,null,null,null,"Student 179","Poor",{"$f":"VLOOKUP(I183,{\"Excellent\",4;\"Poor\",1;\"Good\",3;\"OK\",2},2,0)","v":1},null,null,null,null,42,5.5555555555555554,null,null,null,null,null,null,null,278.70555555555552]
["Student 180","iPhone",{"$f":"VLOOKUP(B184,{\"iPhone\",1;\"Motorola\",2;\"Nokia\",3;\"Samsung\",4;\"Sony Erickson\",5;\"Sprint\",6},2,0)","v":1},null,null,null,null,"Student 180","Poor",{"$f":"VLOOKUP(I184,{\"Excellent\",4;\"Poor\",1;\"Good\",3;\"OK\",2},2,0)","v":1},null,null,null,null,41,5,null,null,null,null,null,null,null,278.14999999999998]
["Student 181","iPhone",{"$f":"VLOOKUP(B185,{\"iPhone\",1;\"Motorola\",2;\"Nokia\",3;\"Samsung\",4;\"Sony Erickson\",5;\"Sprint\",6},2,0)","v":1},null,null,null,null,"Student 181","OK",{"$f":"VLOOKUP(I185,{\"Excellent\",4;\"Poor\",1;\"Good\",3;\"OK\",2},2,0)","v":2},null,null,null,null,40,4.4444444444444446,null,null,null,null,null,null,null,277.59444444444443]
["Student 182","iPhone",{"$f":"VLOOKUP(B186,{\"iPhone\",1;\"Motorola\",2;\"Nokia\",3;\"Samsung\",4;\"Sony Erickson\",5;\"Sprint\",6},2,0)","v":1},null,null,null,null,"Student 182","Poor",{"$f":"VLOOKUP(I186,{\"Excellent\",4;\"Poor\",1;\"Good\",3;\"OK\",2},2,0)","v":1},null,null,null,null,39,3.8888888888888888,null,null,null,null,null,null,null,277.03888888888889]
["Student 183","Sprint",{"$f":"VLOOKUP(B187,{\"iPhone\",1;\"Motorola\",2;\"Nokia\",3;\"Samsung\",4;\"Sony Erickson\",5;\"Sprint\",6},2,0)","v":6},null,null,null,null,"Student 183","Poor",{"$f":"VLOOKUP(I187,{\"Excellent\",4;\"Poor\",1;\"Good\",3;\"OK\",2},2,0)","v":1},null,null,null,null,38,3.333333333333333,null,null,null,null,null,null,null,276.48333333333329]
["Student 184","Nokia",{"$f":"VLOOKUP(B188,{\"iPhone\",1;\"Motorola\",2;\"Nokia\",3;\"Samsung\",4;\"Sony Erickson\",5;\"Sprint\",6},2,0)","v":3},null,null,null,null,"Student 184","Poor",{"$f":"VLOOKUP(I188,{\"Excellent\",4;\"Poor\",1;\"Good\",3;\"OK\",2},2,0)","v":1},null,null,null,null,37,2.7777777777777777,null,null,null,null,null,null,null,275.92777777777775]
["Student 185","iPhone",{"$f":"VLOOKUP(B189,{\"iPhone\",1;\"Motorola\",2;\"Nokia\",3;\"Samsung\",4;\"Sony Erickson\",5;\"Sprint\",6},2,0)","v":1},null,null,null,null,"Student 185","Poor",{"$f":"VLOOKUP(I189,{\"Excellent\",4;\"Poor\",1;\"Good\",3;\"OK\",2},2,0)","v":1},null,null,null,null,36,2.2222222222222223,null,null,null,null,null,null,null,275.37222222222221]
["Student 186","iPhone",{"$f":"VLOOKUP(B190,{\"iPhone\",1;\"Motorola\",2;\"Nokia\",3;\"Samsung\",4;\"Sony Erickson\",5;\"Sprint\",6},2,0)","v":1},null,null,null,null,"Student 186","OK",{"$f":"VLOOKUP(I190,{\"Excellent\",4;\"Poor\",1;\"Good\",3;\"OK\",2},2,0)","v":2},null,null,null,null,35,1.6666666666666665,null,null,null,null,null,null,null,274.81666666666666]
["Student 187","Sprint",{"$f":"VLOOKUP(B191,{\"iPhone\",1;\"Motorola\",2;\"Nokia\",3;\"Samsung\",4;\"Sony Erickson\",5;\"Sprint\",6},2,0)","v":6},null,null,null,null,"Student 187","Poor",{"$f":"VLOOKUP(I191,{\"Excellent\",4;\"Poor\",1;\"Good\",3;\"OK\",2},2,0)","v":1},null,null,null,null,34,1.1111111111111112,null,null,null,null,null,null,null,274.26111111111106]
["Student 188","Motorola",{"$f":"VLOOKUP(B192,{\"iPhone\",1;\"Motorola\",2;\"Nokia\",3;\"Samsung\",4;\"Sony Erickson\",5;\"Sprint\",6},2,0)","v":2},null,null,null,null,"Student 188","Poor",{"$f":"VLOOKUP(I192,{\"Excellent\",4;\"Poor\",1;\"Good\",3;\"OK\",2},2,0)","v":1},null,null,null,null,33,0.55555555555555558,null,null,null,null,null,null,null,273.70555555555552]
["Student 189","iPhone",{"$f":"VLOOKUP(B193,{\"iPhone\",1;\"Motorola\",2;\"Nokia\",3;\"Samsung\",4;\"Sony Erickson\",5;\"Sprint\",6},2,0)","v":1},null,null,null,null,"Student 189","Good",{"$f":"VLOOKUP(I193,{\"Excellent\",4;\"Poor\",1;\"Good\",3;\"OK\",2},2,0)","v":3},null,null,null,null,32,0,null,null,null,null,null,null,null,273.14999999999998]
["Student 190","iPhone",{"$f":"VLOOKUP(B194,{\"iPhone\",1;\"Motorola\",2;\"Nokia\",3;\"Samsung\",4;\"Sony Erickson\",5;\"Sprint\",6},2,0)","v":1},null,null,null,null,"Student 190","Good",{"$f":"VLOOKUP(I194,{\"Excellent\",4;\"Poor\",1;\"Good\",3;\"OK\",2},2,0)","v":3},null,null,null,null,31,-0.55555555555555558,null,null,null,null,null,null,null,272.59444444444443]
["Student 191","iPhone",{"$f":"VLOOKUP(B195,{\"iPhone\",1;\"Motorola\",2;\"Nokia\",3;\"Samsung\",4;\"Sony Erickson\",5;\"Sprint\",6},2,0)","v":1},null,null,null,null,"Student 191","OK",{"$f":"VLOOKUP(I195,{\"Excellent\",4;\"Poor\",1;\"Good\",3;\"OK\",2},2,0)","v":2},null,null,null,null,30,-1.1111111111111112,null,null,null,null,null,null,null,272.03888888888889]
["Student 192","Sony Erickson",{"$f":"VLOOKUP(B196,{\"iPhone\",1;\"Motorola\",2;\"Nokia\",3;\"Samsung\",4;\"Sony Erickson\",5;\"Sprint\",6},2,0)","v":5},null,null,null,null,"Student 192","Good",{"$f":"VLOOKUP(I196,{\"Excellent\",4;\"Poor\",1;\"Good\",3;\"OK\",2},2,0)","v":3},null,null,null,null,29,-1.6666666666666665,null,null,null,null,null,null,null,271.48333333333329]
["Student 193","iPhone",{"$f":"VLOOKUP(B197,{\"iPhone\",1;\"Motorola\",2;\"Nokia\",3;\"Samsung\",4;\"Sony Erickson\",5;\"Sprint\",6},2,0)","v":1},null,null,null,null,"Student 193","Poor",{"$f":"VLOOKUP(I197,{\"Excellent\",4;\"Poor\",1;\"Good\",3;\"OK\",2},2,0)","v":1},null,null,null,null,28,{"$f":"CONVERT(O197,\"F\",\"C\")","v":-2.2222222222222223},null,null,null,null,null,null,null,270.92777777777775]
["Student 194","Motorola",{"$f":"VLOOKUP(B198,{\"iPhone\",1;\"Motorola\",2;\"Nokia\",3;\"Samsung\",4;\"Sony Erickson\",5;\"Sprint\",6},2,0)","v":2},null,null,null,null,"Student 194","OK",{"$f":"VLOOKUP(I198,{\"Excellent\",4;\"Poor\",1;\"Good\",3;\"OK\",2},2,0)","v":2},null,null,null,null,27,-2.7777777777777777,null,null,null,null,null,null,null,270.37222222222221]
["Student 195","iPhone",{"$f":"VLOOKUP(B199,{\"iPhone\",1;\"Motorola\",2;\"Nokia\",3;\"Samsung\",4;\"Sony Erickson\",5;\"Sprint\",6},2,0)","v":1},null,null,null,null,"Student 195","Good",{"$f":"VLOOKUP(I199,{\"Excellent\",4;\"Poor\",1;\"Good\",3;\"OK\",2},2,0)","v":3},null,null,null,null,26,-3.333333333333333,null,null,null,null,null,null,null,269.81666666666666]
["Student 196","Nokia",{"$f":"VLOOKUP(B200,{\"iPhone\",1;\"Motorola\",2;\"Nokia\",3;\"Samsung\",4;\"Sony Erickson\",5;\"Sprint\",6},2,0)","v":3},null,null,null,null,"Student 196","Poor",{"$f":"VLOOKUP(I200,{\"Excellent\",4;\"Poor\",1;\"Good\",3;\"OK\",2},2,0)","v":1},null,null,null,null,25,-3.8888888888888888,null,null,null,null,null,null,null,{"$f":"CONVERT(O200,\"F\",\"K\")","v":269.26111111111106}]
["Student 197","Sony Erickson",{"$f":"VLOOKUP(B201,{\"iPhone\",1;\"Motorola\",2;\"Nokia\",3;\"Samsung\",4;\"Sony Erickson\",5;\"Sprint\",6},2,0)","v":5},null,null,null,null,"Student 197","OK",{"$f":"VLOOKUP(I201,{\"Excellent\",4;\"Poor\",1;\"Good\",3;\"OK\",2},2,0)","v":2},null,null,null,null,24,-4.4444444444444446,null,null,null,null,null,null,null,268.70555555555552]
["Student 198","Samsung",{"$f":"VLOOKUP(B202,{\"iPhone\",1;\"Motorola\",2;\"Nokia\",3;\"Samsung\",4;\"Sony Erickson\",5;\"Sprint\",6},2,0)","v":4},null,null,null,null,"Student 198","Poor",{"$f":"VLOOKUP(I202,{\"Excellent\",4;\"Poor\",1;\"Good\",3;\"OK\",2},2,0)","v":1},null,null,null,null,23,-5,null,null,null,null,null,null,null,268.14999999999998]
["Student 199","Sprint",{"$f":"VLOOKUP(B203,{\"iPhone\",1;\"Motorola\",2;\"Nokia\",3;\"Samsung\",4;\"Sony Erickson\",5;\"Sprint\",6},2,0)","v":6},null,null,null,null,"Student 199","OK",{"$f":"VLOOKUP(I203,{\"Excellent\",4;\"Poor\",1;\"Good\",3;\"OK\",2},2,0)","v":2},null,null,null,null,22,-5.5555555555555554,null,null,null,null,null,null,null,267.59444444444443]
["Student 200","iPhone",{"$f":"VLOOKUP(B204,{\"iPhone\",1;\"Motorola\",2;\"Nokia\",3;\"Samsung\",4;\"Sony Erickson\",5;\"Sprint\",6},2,0)","v":1},null,null,null,null,"Student 200","Poor",{"$f":"VLOOKUP(I204,{\"Excellent\",4;\"Poor\",1;\"Good\",3;\"OK\",2},2,0)","v":1},null,null,null,null,21,-6.1111111111111107,null,null,null,null,null,null,null,267.03888888888889]
["Student 201","Motorola",{"$f":"VLOOKUP(B205,{\"iPhone\",1;\"Motorola\",2;\"Nokia\",3;\"Samsung\",4;\"Sony Erickson\",5;\"Sprint\",6},2,0)","v":2},null,null,null,null,"Student 201","Good",{"$f":"VLOOKUP(I205,{\"Excellent\",4;\"Poor\",1;\"Good\",3;\"OK\",2},2,0)","v":3},null,null,null,null,20,-6.6666666666666661,null,null,null,null,null,null,null,266.48333333333329]
["Student 202","iPhone",{"$f":"VLOOKUP(B206,{\"iPhone\",1;\"Motorola\",2;\"Nokia\",3;\"Samsung\",4;\"Sony Erickson\",5;\"Sprint\",6},2,0)","v":1},null,null,null,null,"Student 202","OK",{"$f":"VLOOKUP(I206,{\"Excellent\",4;\"Poor\",1;\"Good\",3;\"OK\",2},2,0)","v":2},null,null,null,null,19,-7.2222222222222223,null,null,null,null,null,null,null,265.92777777777775]
["Student 203","iPhone",{"$f":"VLOOKUP(B207,{\"iPhone\",1;\"Motorola\",2;\"Nokia\",3;\"Samsung\",4;\"Sony Erickson\",5;\"Sprint\",6},2,0)","v":1},null,null,null,null,"Student 203","Excellent",{"$f":"VLOOKUP(I207,{\"Excellent\",4;\"Poor\",1;\"Good\",3;\"OK\",2},2,0)","v":4},null,null,null,null,18,-7.7777777777777777,null,null,null,null,null,null,null,265.37222222222221]
["Student 204","Sprint",{"$f":"VLOOKUP(B208,{\"iPhone\",1;\"Motorola\",2;\"Nokia\",3;\"Samsung\",4;\"Sony Erickson\",5;\"Sprint\",6},2,0)","v":6},null,null,null,null,"Student 204","Good",{"$f":"VLOOKUP(I208,{\"Excellent\",4;\"Poor\",1;\"Good\",3;\"OK\",2},2,0)","v":3},null,null,null,null,17,-8.3333333333333339,null,null,null,null,null,null,null,264.81666666666666]
["Student 205","Sprint",{"$f":"VLOOKUP(B209,{\"iPhone\",1;\"Motorola\",2;\"Nokia\",3;\"Samsung\",4;\"Sony Erickson\",5;\"Sprint\",6},2,0)","v":6},null,null,null,null,"Student 205","Poor",{"$f":"VLOOKUP(I209,{\"Excellent\",4;\"Poor\",1;\"Good\",3;\"OK\",2},2,0)","v":1},null,null,null,null,16,-8.8888888888888893,null,null,null,null,null,null,null,264.26111111111106]
["Student 206","iPhone",{"$f":"VLOOKUP(B210,{\"iPhone\",1;\"Motorola\",2;\"Nokia\",3;\"Samsung\",4;\"Sony Erickson\",5;\"Sprint\",6},2,0)","v":1},null,null,null,null,"Student 206","Poor",{"$f":"VLOOKUP(I210,{\"Excellent\",4;\"Poor\",1;\"Good\",3;\"OK\",2},2,0)","v":1},null,null,null,null,15,-9.4444444444444446,null,null,null,null,null,null,null,263.70555555555552]
["Student 207","Sony Erickson",{"$f":"VLOOKUP(B211,{\"iPhone\",1;\"Motorola\",2;\"Nokia\",3;\"Samsung\",4;\"Sony Erickson\",5;\"Sprint\",6},2,0)","v":5},null,null,null,null,"Student 207","Poor",{"$f":"VLOOKUP(I211,{\"Excellent\",4;\"Poor\",1;\"Good\",3;\"OK\",2},2,0)","v":1},null,null,null,null,14,-10,null,null,null,null,null,null,null,263.14999999999998]
["Student 208","Motorola",{"$f":"VLOOKUP(B212,{\"iPhone\",1;\"Motorola\",2;\"Nokia\",3;\"Samsung\",4;\"Sony Erickson\",5;\"Sprint\",6},2,0)","v":2},null,null,null,null,"Student 208","Poor",{"$f":"VLOOKUP(I212,{\"Excellent\",4;\"Poor\",1;\"Good\",3;\"OK\",2},2,0)","v":1},null,null,null,null,13,-10.555555555555555,null,null,null,null,null,null,null,262.59444444444443]
["Student 209","iPhone",{"$f":"VLOOKUP(B213,{\"iPhone\",1;\"Motorola\",2;\"Nokia\",3;\"Samsung\",4;\"Sony Erickson\",5;\"Sprint\",6},2,0)","v":1},null,null,null,null,"Student 209","Poor",{"$f":"VLOOKUP(I213,{\"Excellent\",4;\"Poor\",1;\"Good\",3;\"OK\",2},2,0)","v":1},null,null,null,null,12,-11.111111111111111,null,null,null,null,null,null,null,262.03888888888889]
["Student 210","iPhone",{"$f":"VLOOKUP(B214,{\"iPhone\",1;\"Motorola\",2;\"Nokia\",3;\"Samsung\",4;\"Sony Erickson\",5;\"Sprint\",6},2,0)","v":1},null,null,null,null,"Student 210","Poor",{"$f":"VLOOKUP(I214,{\"Excellent\",4;\"Poor\",1;\"Good\",3;\"OK\",2},2,0)","v":1},null,null,null,null,11,-11.666666666666666,null,null,null,null,null,null,null,261.48333333333329]
["Student 211","Samsung",{"$f":"VLOOKUP(B215,{\"iPhone\",1;\"Motorola\",2;\"Nokia\",3;\"Samsung\",4;\"Sony Erickson\",5;\"Sprint\",6},2,0)","v":4},null,null,null,null,"Student 211","Poor",{"$f":"VLOOKUP(I215,{\"Excellent\",4;\"Poor\",1;\"Good\",3;\"OK\",2},2,0)","v":1},null,null,null,null,10,-12.222222222222221,null,null,null,null,null,null,null,260.92777777777775]
["Student 212","Sprint",{"$f":"VLOOKUP(B216,{\"iPhone\",1;\"Motorola\",2;\"Nokia\",3;\"Samsung\",4;\"Sony Erickson\",5;\"Sprint\",6},2,0)","v":6},null,null,null,null,"Student 212","Excellent",{"$f":"VLOOKUP(I216,{\"Excellent\",4;\"Poor\",1;\"Good\",3;\"OK\",2},2,0)","v":4},null,null,null,null,9,-12.777777777777777,null,null,null,null,null,null,null,260.37222222222221]
["Student 213","iPhone",{"$f":"VLOOKUP(B217,{\"iPhone\",1;\"Motorola\",2;\"Nokia\",3;\"Samsung\",4;\"Sony Erickson\",5;\"Sprint\",6},2,0)","v":1},null,null,null,null,"Student 213","Excellent",{"$f":"VLOOKUP(I217,{\"Excellent\",4;\"Poor\",1;\"Good\",3;\"OK\",2},2,0)","v":4},null,null,null,null,8,-13.333333333333332,null,null,null,null,null,null,null,259.81666666666666]
["Student 214","iPhone",{"$f":"VLOOKUP(B218,{\"iPhone\",1;\"Motorola\",2;\"Nokia\",3;\"Samsung\",4;\"Sony Erickson\",5;\"Sprint\",6},2,0)","v":1},null,null,null,null,"Student 214","Excellent",{"$f":"VLOOKUP(I218,{\"Excellent\",4;\"Poor\",1;\"Good\",3;\"OK\",2},2,0)","v":4},null,null,null,null,7,-13.888888888888889,null,null,null,null,null,null,null,259.26111111111106]
["Student 215","Nokia",{"$f":"VLOOKUP(B219,{\"iPhone\",1;\"Motorola\",2;\"Nokia\",3;\"Samsung\",4;\"Sony Erickson\",5;\"Sprint\",6},2,0)","v":3},null,null,null,null,"Student 215","OK",{"$f":"VLOOKUP(I219,{\"Excellent\",4;\"Poor\",1;\"Good\",3;\"OK\",2},2,0)","v":2},null,null,null,null,6,-14.444444444444445,null,null,null,null,null,null,null,258.70555555555552]
["Student 216","iPhone",{"$f":"VLOOKUP(B220,{\"iPhone\",1;\"Motorola\",2;\"Nokia\",3;\"Samsung\",4;\"Sony Erickson\",5;\"Sprint\",6},2,0)","v":1},null,null,null,null,"Student 216","Excellent",{"$f":"VLOOKUP(I220,{\"Excellent\",4;\"Poor\",1;\"Good\",3;\"OK\",2},2,0)","v":4},null,null,null,null,5,-15,null,null,null,null,null,null,null,258.14999999999998]
["Student 217","Sprint",{"$f":"VLOOKUP(B221,{\"iPhone\",1;\"Motorola\",2;\"Nokia\",3;\"Samsung\",4;\"Sony Erickson\",5;\"Sprint\",6},2,0)","v":6},null,null,null,null,"Student 217","Poor",{"$f":"VLOOKUP(I221,{\"Excellent\",4;\"Poor\",1;\"Good\",3;\"OK\",2},2,0)","v":1},null,null,null,null,4,-15.555555555555555,null,null,null,null,null,null,null,257.59444444444443]
["Student 218","iPhone",{"$f":"VLOOKUP(B222,{\"iPhone\",1;\"Motorola\",2;\"Nokia\",3;\"Samsung\",4;\"Sony Erickson\",5;\"Sprint\",6},2,0)","v":1},null,null,null,null,"Student 218","Poor",{"$f":"VLOOKUP(I222,{\"Excellent\",4;\"Poor\",1;\"Good\",3;\"OK\",2},2,0)","v":1},null,null,null,null,3,-16.111111111111111,null,null,null,null,null,null,null,257.03888888888889]
["Student 219","Nokia",{"$f":"VLOOKUP(B223,{\"iPhone\",1;\"Motorola\",2;\"Nokia\",3;\"Samsung\",4;\"Sony Erickson\",5;\"Sprint\",6},2,0)","v":3},null,null,null,null,"Student 219","OK",{"$f":"VLOOKUP(I223,{\"Excellent\",4;\"Poor\",1;\"Good\",3;\"OK\",2},2,0)","v":2},null,null,null,null,2,-16.666666666666668,null,null,null,null,null,null,null,256.48333333333329]
["Student 220","iPhone",{"$f":"VLOOKUP(B224,{\"iPhone\",1;\"Motorola\",2;\"Nokia\",3;\"Samsung\",4;\"Sony Erickson\",5;\"Sprint\",6},2,0)","v":1},null,null,null,null,"Student 220","Poor",{"$f":"VLOOKUP(I224,{\"Excellent\",4;\"Poor\",1;\"Good\",3;\"OK\",2},2,0)","v":1},null,null,null,null,1,-17.222222222222221,null,null,null,null,null,null,null,255.92777777777775]
["Student 221","Nokia",{"$f":"VLOOKUP(B225,{\"iPhone\",1;\"Motorola\",2;\"Nokia\",3;\"Samsung\",4;\"Sony Erickson\",5;\"Sprint\",6},2,0)","v":3},null,null,null,null,"Student 221","OK",{"$f":"VLOOKUP(I225,{\"Excellent\",4;\"Poor\",1;\"Good\",3;\"OK\",2},2,0)","v":2},null,null,null,null,0,-17.777777777777779,null,null,null,null,null,null,null,255.37222222222221]
["Student 222","Sprint",{"$f":"VLOOKUP(B226,{\"iPhone\",1;\"Motorola\",2;\"Nokia\",3;\"Samsung\",4;\"Sony Erickson\",5;\"Sprint\",6},2,0)","v":6},null,null,null,null,"Student 222","OK",{"$f":"VLOOKUP(I226,{\"Excellent\",4;\"Poor\",1;\"Good\",3;\"OK\",2},2,0)","v":2},null,null,null,null,-1,-18.333333333333332,null,null,null,null,null,null,null,254.81666666666663]
["Student 223","Nokia",{"$f":"VLOOKUP(B227,{\"iPhone\",1;\"Motorola\",2;\"Nokia\",3;\"Samsung\",4;\"Sony Erickson\",5;\"Sprint\",6},2,0)","v":3},null,null,null,null,"Student 223","Poor",{"$f":"VLOOKUP(I227,{\"Excellent\",4;\"Poor\",1;\"Good\",3;\"OK\",2},2,0)","v":1},null,null,null,null,-2,-18.888888888888889,null,null,null,null,null,null,null,254.26111111111109]
["Student 224","Nokia",{"$f":"VLOOKUP(B228,{\"iPhone\",1;\"Motorola\",2;\"Nokia\",3;\"Samsung\",4;\"Sony Erickson\",5;\"Sprint\",6},2,0)","v":3},null,null,null,null,"Student 224","Poor",{"$f":"VLOOKUP(I228,{\"Excellent\",4;\"Poor\",1;\"Good\",3;\"OK\",2},2,0)","v":1},null,null,null,null,-3,-19.444444444444443,null,null,null,null,null,null,null,253.70555555555552]
["Student 225","Samsung",{"$f":"VLOOKUP(B229,{\"iPhone\",1;\"Motorola\",2;\"Nokia\",3;\"Samsung\",4;\"Sony Erickson\",5;\"Sprint\",6},2,0)","v":4},null,null,null,null,"Student 225","OK",{"$f":"VLOOKUP(I229,{\"Excellent\",4;\"Poor\",1;\"Good\",3;\"OK\",2},2,0)","v":2},null,null,null,null,-4,-20,null,null,null,null,null,null,null,253.14999999999998]
["Student 226","iPhone",{"$f":"VLOOKUP(B230,{\"iPhone\",1;\"Motorola\",2;\"Nokia\",3;\"Samsung\",4;\"Sony Erickson\",5;\"Sprint\",6},2,0)","v":1},null,null,null,null,"Student 226","OK",{"$f":"VLOOKUP(I230,{\"Excellent\",4;\"Poor\",1;\"Good\",3;\"OK\",2},2,0)","v":2},null,null,null,null,-5,-20.555555555555554,null,null,null,null,null,null,null,252.59444444444443]
["Student 227","iPhone",{"$f":"VLOOKUP(B231,{\"iPhone\",1;\"Motorola\",2;\"Nokia\",3;\"Samsung\",4;\"Sony Erickson\",5;\"Sprint\",6},2,0)","v":1},null,null,null,null,"Student 227","Poor",{"$f":"VLOOKUP(I231,{\"Excellent\",4;\"Poor\",1;\"Good\",3;\"OK\",2},2,0)","v":1},null,null,null,null,-6,-21.111111111111111,null,null,null,null,null,null,null,252.03888888888886]
["Student 228","Sprint",{"$f":"VLOOKUP(B232,{\"iPhone\",1;\"Motorola\",2;\"Nokia\",3;\"Samsung\",4;\"Sony Erickson\",5;\"Sprint\",6},2,0)","v":6},null,null,null,null,"Student 228","OK",{"$f":"VLOOKUP(I232,{\"Excellent\",4;\"Poor\",1;\"Good\",3;\"OK\",2},2,0)","v":2},null,null,null,null,-7,-21.666666666666668,null,null,null,null,null,null,null,251.48333333333332]
["Student 229","Motorola",{"$f":"VLOOKUP(B233,{\"iPhone\",1;\"Motorola\",2;\"Nokia\",3;\"Samsung\",4;\"Sony Erickson\",5;\"Sprint\",6},2,0)","v":2},null,null,null,null,"Student 229","Poor",{"$f":"VLOOKUP(I233,{\"Excellent\",4;\"Poor\",1;\"Good\",3;\"OK\",2},2,0)","v":1},null,null,null,null,-8,-22.222222222222221,null,null,null,null,null,null,null,250.92777777777775]
["Student 230","Sprint",{"$f":"VLOOKUP(B234,{\"iPhone\",1;\"Motorola\",2;\"Nokia\",3;\"Samsung\",4;\"Sony Erickson\",5;\"Sprint\",6},2,0)","v":6},null,null,null,null,"Student 230","Poor",{"$f":"VLOOKUP(I234,{\"Excellent\",4;\"Poor\",1;\"Good\",3;\"OK\",2},2,0)","v":1},null,null,null,null,-9,-22.777777777777779,null,null,null,null,null,null,null,250.37222222222221]
["Student 231","iPhone",{"$f":"VLOOKUP(B235,{\"iPhone\",1;\"Motorola\",2;\"Nokia\",3;\"Samsung\",4;\"Sony Erickson\",5;\"Sprint\",6},2,0)","v":1},null,null,null,null,"Student 231","Poor",{"$f":"VLOOKUP(I235,{\"Excellent\",4;\"Poor\",1;\"Good\",3;\"OK\",2},2,0)","v":1},null,null,null,null,-10,-23.333333333333332,null,null,null,null,null,null,null,249.81666666666663]
["Student 232","iPhone",{"$f":"VLOOKUP(B236,{\"iPhone\",1;\"Motorola\",2;\"Nokia\",3;\"Samsung\",4;\"Sony Erickson\",5;\"Sprint\",6},2,0)","v":1},null,null,null,null,"Student 232","Poor",{"$f":"VLOOKUP(I236,{\"Excellent\",4;\"Poor\",1;\"Good\",3;\"OK\",2},2,0)","v":1},null,null,null,null,-11,-23.888888888888889,null,null,null,null,null,null,null,249.26111111111109]
["Student 233","Sony Erickson",{"$f":"VLOOKUP(B237,{\"iPhone\",1;\"Motorola\",2;\"Nokia\",3;\"Samsung\",4;\"Sony Erickson\",5;\"Sprint\",6},2,0)","v":5},null,null,null,null,"Student 233","Poor",{"$f":"VLOOKUP(I237,{\"Excellent\",4;\"Poor\",1;\"Good\",3;\"OK\",2},2,0)","v":1},null,null,null,null,-12,-24.444444444444443,null,null,null,null,null,null,null,248.70555555555552]
["Student 234","Sprint",{"$f":"VLOOKUP(B238,{\"iPhone\",1;\"Motorola\",2;\"Nokia\",3;\"Samsung\",4;\"Sony Erickson\",5;\"Sprint\",6},2,0)","v":6},null,null,null,null,"Student 234","OK",{"$f":"VLOOKUP(I238,{\"Excellent\",4;\"Poor\",1;\"Good\",3;\"OK\",2},2,0)","v":2},null,null,null,null,-13,-25,null,null,null,null,null,null,null,248.14999999999998]
["Student 235","iPhone",{"$f":"VLOOKUP(B239,{\"iPhone\",1;\"Motorola\",2;\"Nokia\",3;\"Samsung\",4;\"Sony Erickson\",5;\"Sprint\",6},2,0)","v":1},null,null,null,null,"Student 235","Poor",{"$f":"VLOOKUP(I239,{\"Excellent\",4;\"Poor\",1;\"Good\",3;\"OK\",2},2,0)","v":1},null,null,null,null,-14,-25.555555555555554,null,null,null,null,null,null,null,247.59444444444443]
["Student 236","iPhone",{"$f":"VLOOKUP(B240,{\"iPhone\",1;\"Motorola\",2;\"Nokia\",3;\"Samsung\",4;\"Sony Erickson\",5;\"Sprint\",6},2,0)","v":1},null,null,null,null,"Student 236","Poor",{"$f":"VLOOKUP(I240,{\"Excellent\",4;\"Poor\",1;\"Good\",3;\"OK\",2},2,0)","v":1},null,null,null,null,-15,-26.111111111111111,null,null,null,null,null,null,null,247.03888888888886]
["Student 237","Samsung",{"$f":"VLOOKUP(B241,{\"iPhone\",1;\"Motorola\",2;\"Nokia\",3;\"Samsung\",4;\"Sony Erickson\",5;\"Sprint\",6},2,0)","v":4},null,null,null,null,"Student 237","Poor",{"$f":"VLOOKUP(I241,{\"Excellent\",4;\"Poor\",1;\"Good\",3;\"OK\",2},2,0)","v":1},null,null,null,null,-16,-26.666666666666664,null,null,null,null,null,null,null,246.48333333333332]
["Student 238","Sony Erickson",{"$f":"VLOOKUP(B242,{\"iPhone\",1;\"Motorola\",2;\"Nokia\",3;\"Samsung\",4;\"Sony Erickson\",5;\"Sprint\",6},2,0)","v":5},null,null,null,null,"Student 238","Good",{"$f":"VLOOKUP(I242,{\"Excellent\",4;\"Poor\",1;\"Good\",3;\"OK\",2},2,0)","v":3},null,null,null,null,-17,-27.222222222222221,null,null,null,null,null,null,null,245.92777777777775]
["Student 239","Sony Erickson",{"$f":"VLOOKUP(B243,{\"iPhone\",1;\"Motorola\",2;\"Nokia\",3;\"Samsung\",4;\"Sony Erickson\",5;\"Sprint\",6},2,0)","v":5},null,null,null,null,"Student 239","Excellent",{"$f":"VLOOKUP(I243,{\"Excellent\",4;\"Poor\",1;\"Good\",3;\"OK\",2},2,0)","v":4},null,null,null,null,-18,-27.777777777777779,null,null,null,null,null,null,null,245.37222222222221]
["Student 240","iPhone",{"$f":"VLOOKUP(B244,{\"iPhone\",1;\"Motorola\",2;\"Nokia\",3;\"Samsung\",4;\"Sony Erickson\",5;\"Sprint\",6},2,0)","v":1},null,null,null,null,"Student 240","Good",{"$f":"VLOOKUP(I244,{\"Excellent\",4;\"Poor\",1;\"Good\",3;\"OK\",2},2,0)","v":3},null,null,null,null,-19,-28.333333333333332,null,null,null,null,null,null,null,244.81666666666663]
["Student 241","Motorola",{"$f":"VLOOKUP(B245,{\"iPhone\",1;\"Motorola\",2;\"Nokia\",3;\"Samsung\",4;\"Sony Erickson\",5;\"Sprint\",6},2,0)","v":2},null,null,null,null,"Student 241","Poor",{"$f":"VLOOKUP(I245,{\"Excellent\",4;\"Poor\",1;\"Good\",3;\"OK\",2},2,0)","v":1},null,null,null,null,-20,-28.888888888888889,null,null,null,null,null,null,null,244.26111111111109]
["Student 242","Samsung",{"$f":"VLOOKUP(B246,{\"iPhone\",1;\"Motorola\",2;\"Nokia\",3;\"Samsung\",4;\"Sony Erickson\",5;\"Sprint\",6},2,0)","v":4},null,null,null,null,"Student 242","Poor",{"$f":"VLOOKUP(I246,{\"Excellent\",4;\"Poor\",1;\"Good\",3;\"OK\",2},2,0)","v":1},null,null,null,null,-21,-29.444444444444443,null,null,null,null,null,null,null,243.70555555555552]
["Student 243","iPhone",{"$f":"VLOOKUP(B247,{\"iPhone\",1;\"Motorola\",2;\"Nokia\",3;\"Samsung\",4;\"Sony Erickson\",5;\"Sprint\",6},2,0)","v":1},null,null,null,null,"Student 243","Poor",{"$f":"VLOOKUP(I247,{\"Excellent\",4;\"Poor\",1;\"Good\",3;\"OK\",2},2,0)","v":1},null,null,null,null,-22,-30,null,null,null,null,null,null,null,243.14999999999998]
["Student 244","Nokia",{"$f":"VLOOKUP(B248,{\"iPhone\",1;\"Motorola\",2;\"Nokia\",3;\"Samsung\",4;\"Sony Erickson\",5;\"Sprint\",6},2,0)","v":3},null,null,null,null,"Student 244","Poor",{"$f":"VLOOKUP(I248,{\"Excellent\",4;\"Poor\",1;\"Good\",3;\"OK\",2},2,0)","v":1},null,null,null,null,-23,-30.555555555555554,null,null,null,null,null,null,null,242.59444444444443]
["Student 245","Sony Erickson",{"$f":"VLOOKUP(B249,{\"iPhone\",1;\"Motorola\",2;\"Nokia\",3;\"Samsung\",4;\"Sony Erickson\",5;\"Sprint\",6},2,0)","v":5},null,null,null,null,"Student 245","OK",{"$f":"VLOOKUP(I249,{\"Excellent\",4;\"Poor\",1;\"Good\",3;\"OK\",2},2,0)","v":2},null,null,null,null,-24,-31.111111111111111,null,null,null,null,null,null,null,242.03888888888886]
["Student 246","Samsung",{"$f":"VLOOKUP(B250,{\"iPhone\",1;\"Motorola\",2;\"Nokia\",3;\"Samsung\",4;\"Sony Erickson\",5;\"Sprint\",6},2,0)","v":4},null,null,null,null,"Student 246","OK",{"$f":"VLOOKUP(I250,{\"Excellent\",4;\"Poor\",1;\"Good\",3;\"OK\",2},2,0)","v":2},null,null,null,null,-25,-31.666666666666664,null,null,null,null,null,null,null,241.48333333333332]
["Student 247","Nokia",{"$f":"VLOOKUP(B251,{\"iPhone\",1;\"Motorola\",2;\"Nokia\",3;\"Samsung\",4;\"Sony Erickson\",5;\"Sprint\",6},2,0)","v":3},null,null,null,null,"Student 247","Good",{"$f":"VLOOKUP(I251,{\"Excellent\",4;\"Poor\",1;\"Good\",3;\"OK\",2},2,0)","v":3},null,null,null,null,-26,-32.222222222222221,null,null,null,null,null,null,null,240.92777777777775]
["Student 248","Motorola",{"$f":"VLOOKUP(B252,{\"iPhone\",1;\"Motorola\",2;\"Nokia\",3;\"Samsung\",4;\"Sony Erickson\",5;\"Sprint\",6},2,0)","v":2},null,null,null,null,"Student 248","OK",{"$f":"VLOOKUP(I252,{\"Excellent\",4;\"Poor\",1;\"Good\",3;\"OK\",2},2,0)","v":2},null,null,null,null,-27,-32.777777777777779,null,null,null,null,null,null,null,240.37222222222221]
["Student 249","Sony Erickson",{"$f":"VLOOKUP(B253,{\"iPhone\",1;\"Motorola\",2;\"Nokia\",3;\"Samsung\",4;\"Sony Erickson\",5;\"Sprint\",6},2,0)","v":5},null,null,null,null,"Student 249","OK",{"$f":"VLOOKUP(I253,{\"Excellent\",4;\"Poor\",1;\"Good\",3;\"OK\",2},2,0)","v":2},null,null,null,null,-28,-33.333333333333336,null,null,null,null,null,null,null,239.81666666666663]
["Student 250","Sprint",{"$f":"VLOOKUP(B254,{\"iPhone\",1;\"Motorola\",2;\"Nokia\",3;\"Samsung\",4;\"Sony Erickson\",5;\"Sprint\",6},2,0)","v":6},null,null,null,null,"Student 250","Poor",{"$f":"VLOOKUP(I254,{\"Excellent\",4;\"Poor\",1;\"Good\",3;\"OK\",2},2,0)","v":1},null,null,null,null,-29,-33.888888888888886,null,null,null,null,null,null,null,239.26111111111109]
["Student 251","Nokia",{"$f":"VLOOKUP(B255,{\"iPhone\",1;\"Motorola\",2;\"Nokia\",3;\"Samsung\",4;\"Sony Erickson\",5;\"Sprint\",6},2,0)","v":3},null,null,null,null,"Student 251","Poor",{"$f":"VLOOKUP(I255,{\"Excellent\",4;\"Poor\",1;\"Good\",3;\"OK\",2},2,0)","v":1},null,null,null,null,-30,-34.444444444444443,null,null,null,null,null,null,null,238.70555555555552]
["Student 252","Sony Erickson",{"$f":"VLOOKUP(B256,{\"iPhone\",1;\"Motorola\",2;\"Nokia\",3;\"Samsung\",4;\"Sony Erickson\",5;\"Sprint\",6},2,0)","v":5},null,null,null,null,"Student 252","OK",{"$f":"VLOOKUP(I256,{\"Excellent\",4;\"Poor\",1;\"Good\",3;\"OK\",2},2,0)","v":2},null,null,null,null,-31,-35,null,null,null,null,null,null,null,238.14999999999998]
["Student 253","Nokia",{"$f":"VLOOKUP(B257,{\"iPhone\",1;\"Motorola\",2;\"Nokia\",3;\"Samsung\",4;\"Sony Erickson\",5;\"Sprint\",6},2,0)","v":3},null,null,null,null,"Student 253","OK",{"$f":"VLOOKUP(I257,{\"Excellent\",4;\"Poor\",1;\"Good\",3;\"OK\",2},2,0)","v":2},null,null,null,null,-32,-35.555555555555557,null,null,null,null,null,null,null,237.59444444444443]
["Student 254","Sony Erickson",{"$f":"VLOOKUP(B258,{\"iPhone\",1;\"Motorola\",2;\"Nokia\",3;\"Samsung\",4;\"Sony Erickson\",5;\"Sprint\",6},2,0)","v":5},null,null,null,null,"Student 254","OK",{"$f":"VLOOKUP(I258,{\"Excellent\",4;\"Poor\",1;\"Good\",3;\"OK\",2},2,0)","v":2},null,null,null,null,-33,-36.111111111111107,null,null,null,null,null,null,null,237.03888888888886]
["Student 255","iPhone",{"$f":"VLOOKUP(B259,{\"iPhone\",1;\"Motorola\",2;\"Nokia\",3;\"Samsung\",4;\"Sony Erickson\",5;\"Sprint\",6},2,0)","v":1},null,null,null,null,"Student 255","Poor",{"$f":"VLOOKUP(I259,{\"Excellent\",4;\"Poor\",1;\"Good\",3;\"OK\",2},2,0)","v":1},null,null,null,null,-34,-36.666666666666664,null,null,null,null,null,null,null,236.48333333333332]
["Student 256","iPhone",{"$f":"VLOOKUP(B260,{\"iPhone\",1;\"Motorola\",2;\"Nokia\",3;\"Samsung\",4;\"Sony Erickson\",5;\"Sprint\",6},2,0)","v":1},null,null,null,null,"Student 256","OK",{"$f":"VLOOKUP(I260,{\"Excellent\",4;\"Poor\",1;\"Good\",3;\"OK\",2},2,0)","v":2},null,null,null,null,-35,-37.222222222222221,null,null,null,null,null,null,null,235.92777777777775]
["Student 257","Motorola",{"$f":"VLOOKUP(B261,{\"iPhone\",1;\"Motorola\",2;\"Nokia\",3;\"Samsung\",4;\"Sony Erickson\",5;\"Sprint\",6},2,0)","v":2},null,null,null,null,"Student 257","OK",{"$f":"VLOOKUP(I261,{\"Excellent\",4;\"Poor\",1;\"Good\",3;\"OK\",2},2,0)","v":2},null,null,null,null,-36,{"$f":"CONVERT(O261,\"F\",\"C\")","v":-37.777777777777779},null,null,null,null,null,null,null,235.37222222222221]
["Student 258","Sony Erickson",{"$f":"VLOOKUP(B262,{\"iPhone\",1;\"Motorola\",2;\"Nokia\",3;\"Samsung\",4;\"Sony Erickson\",5;\"Sprint\",6},2,0)","v":5},null,null,null,null,"Student 258","Excellent",{"$f":"VLOOKUP(I262,{\"Excellent\",4;\"Poor\",1;\"Good\",3;\"OK\",2},2,0)","v":4},null,null,null,null,-37,-38.333333333333336,null,null,null,null,null,null,null,234.81666666666663]
["Student 259","Samsung",{"$f":"VLOOKUP(B263,{\"iPhone\",1;\"Motorola\",2;\"Nokia\",3;\"Samsung\",4;\"Sony Erickson\",5;\"Sprint\",6},2,0)","v":4},null,null,null,null,"Student 259","Good",{"$f":"VLOOKUP(I263,{\"Excellent\",4;\"Poor\",1;\"Good\",3;\"OK\",2},2,0)","v":3},null,null,null,null,-38,-38.888888888888886,null,null,null,null,null,null,null,234.26111111111109]
["Student 260","Samsung",{"$f":"VLOOKUP(B264,{\"iPhone\",1;\"Motorola\",2;\"Nokia\",3;\"Samsung\",4;\"Sony Erickson\",5;\"Sprint\",6},2,0)","v":4},null,null,null,null,"Student 260","Excellent",{"$f":"VLOOKUP(I264,{\"Excellent\",4;\"Poor\",1;\"Good\",3;\"OK\",2},2,0)","v":4},null,null,null,null,-39,-39.444444444444443,null,null,null,null,null,null,null,{"$f":"CONVERT(O264,\"F\",\"K\")","v":233.70555555555552}]
["Student 261","Motorola",{"$f":"VLOOKUP(B265,{\"iPhone\",1;\"Motorola\",2;\"Nokia\",3;\"Samsung\",4;\"Sony Erickson\",5;\"Sprint\",6},2,0)","v":2},null,null,null,null,"Student 261","Poor",{"$f":"VLOOKUP(I265,{\"Excellent\",4;\"Poor\",1;\"Good\",3;\"OK\",2},2,0)","v":1},null,null,null,null,-40,-40,null,null,null,null,null,null,null,233.14999999999998]
["Student 262","iPhone",{"$f":"VLOOKUP(B266,{\"iPhone\",1;\"Motorola\",2;\"Nokia\",3;\"Samsung\",4;\"Sony Erickson\",5;\"Sprint\",6},2,0)","v":1},null,null,null,null,"Student 262","OK",{"$f":"VLOOKUP(I266,{\"Excellent\",4;\"Poor\",1;\"Good\",3;\"OK\",2},2,0)","v":2},null,null,null,null,-41,-40.555555555555557,null,null,null,null,null,null,null,232.59444444444443]
["Student 263","iPhone",{"$f":"VLOOKUP(B267,{\"iPhone\",1;\"Motorola\",2;\"Nokia\",3;\"Samsung\",4;\"Sony Erickson\",5;\"Sprint\",6},2,0)","v":1},null,null,null,null,"Student 263","OK",{"$f":"VLOOKUP(I267,{\"Excellent\",4;\"Poor\",1;\"Good\",3;\"OK\",2},2,0)","v":2},null,null,null,null,-42,-41.111111111111107,null,null,null,null,null,null,null,232.03888888888886]
["Student 264","Samsung",{"$f":"VLOOKUP(B268,{\"iPhone\",1;\"Motorola\",2;\"Nokia\",3;\"Samsung\",4;\"Sony Erickson\",5;\"Sprint\",6},2,0)","v":4},null,null,null,null,"Student 264","OK",{"$f":"VLOOKUP(I268,{\"Excellent\",4;\"Poor\",1;\"Good\",3;\"OK\",2},2,0)","v":2},null,null,null,null,-43,-41.666666666666664,null,null,null,null,null,null,null,231.48333333333332]
["Student 265","Sony Erickson",{"$f":"VLOOKUP(B269,{\"iPhone\",1;\"Motorola\",2;\"Nokia\",3;\"Samsung\",4;\"Sony Erickson\",5;\"Sprint\",6},2,0)","v":5},null,null,null,null,"Student 265","Poor",{"$f":"VLOOKUP(I269,{\"Excellent\",4;\"Poor\",1;\"Good\",3;\"OK\",2},2,0)","v":1},null,null,null,null,-44,-42.222222222222221,null,null,null,null,null,null,null,230.92777777777775]
["Student 266","Sony Erickson",{"$f":"VLOOKUP(B270,{\"iPhone\",1;\"Motorola\",2;\"Nokia\",3;\"Samsung\",4;\"Sony Erickson\",5;\"Sprint\",6},2,0)","v":5},null,null,null,null,"Student 266","OK",{"$f":"VLOOKUP(I270,{\"Excellent\",4;\"Poor\",1;\"Good\",3;\"OK\",2},2,0)","v":2},null,null,null,null,-45,-42.777777777777779,null,null,null,null,null,null,null,230.37222222222221]
["Student 267","Motorola",{"$f":"VLOOKUP(B271,{\"iPhone\",1;\"Motorola\",2;\"Nokia\",3;\"Samsung\",4;\"Sony Erickson\",5;\"Sprint\",6},2,0)","v":2},null,null,null,null,"Student 267","OK",{"$f":"VLOOKUP(I271,{\"Excellent\",4;\"Poor\",1;\"Good\",3;\"OK\",2},2,0)","v":2},null,null,null,null,-46,-43.333333333333336,null,null,null,null,null,null,null,229.81666666666663]
["Student 268","Motorola",{"$f":"VLOOKUP(B272,{\"iPhone\",1;\"Motorola\",2;\"Nokia\",3;\"Samsung\",4;\"Sony Erickson\",5;\"Sprint\",6},2,0)","v":2},null,null,null,null,"Student 268","Excellent",{"$f":"VLOOKUP(I272,{\"Excellent\",4;\"Poor\",1;\"Good\",3;\"OK\",2},2,0)","v":4},null,null,null,null,-47,-43.888888888888886,null,null,null,null,null,null,null,229.26111111111109]
["Student 269","iPhone",{"$f":"VLOOKUP(B273,{\"iPhone\",1;\"Motorola\",2;\"Nokia\",3;\"Samsung\",4;\"Sony Erickson\",5;\"Sprint\",6},2,0)","v":1},null,null,null,null,"Student 269","Poor",{"$f":"VLOOKUP(I273,{\"Excellent\",4;\"Poor\",1;\"Good\",3;\"OK\",2},2,0)","v":1},null,null,null,null,-48,-44.444444444444443,null,null,null,null,null,null,null,228.70555555555552]
["Student 270","Nokia",{"$f":"VLOOKUP(B274,{\"iPhone\",1;\"Motorola\",2;\"Nokia\",3;\"Samsung\",4;\"Sony Erickson\",5;\"Sprint\",6},2,0)","v":3},null,null,null,null,"Student 270","Excellent",{"$f":"VLOOKUP(I274,{\"Excellent\",4;\"Poor\",1;\"Good\",3;\"OK\",2},2,0)","v":4},null,null,null,null,-49,-45,null,null,null,null,null,null,null,228.14999999999998]
["Student 271","Sony Erickson",{"$f":"VLOOKUP(B275,{\"iPhone\",1;\"Motorola\",2;\"Nokia\",3;\"Samsung\",4;\"Sony Erickson\",5;\"Sprint\",6},2,0)","v":5},null,null,null,null,"Student 271","OK",{"$f":"VLOOKUP(I275,{\"Excellent\",4;\"Poor\",1;\"Good\",3;\"OK\",2},2,0)","v":2},null,null,null,null,-50,-45.555555555555557,null,null,null,null,null,null,null,227.59444444444443]
["Student 272","Nokia",{"$f":"VLOOKUP(B276,{\"iPhone\",1;\"Motorola\",2;\"Nokia\",3;\"Samsung\",4;\"Sony Erickson\",5;\"Sprint\",6},2,0)","v":3},null,null,null,null,"Student 272","Excellent",{"$f":"VLOOKUP(I276,{\"Excellent\",4;\"Poor\",1;\"Good\",3;\"OK\",2},2,0)","v":4},null,null,null,null,-51,-46.111111111111107,null,null,null,null,null,null,null,227.03888888888886]
["Student 273","Sprint",{"$f":"VLOOKUP(B277,{\"iPhone\",1;\"Motorola\",2;\"Nokia\",3;\"Samsung\",4;\"Sony Erickson\",5;\"Sprint\",6},2,0)","v":6},null,null,null,null,"Student 273","Poor",{"$f":"VLOOKUP(I277,{\"Excellent\",4;\"Poor\",1;\"Good\",3;\"OK\",2},2,0)","v":1},null,null,null,null,-52,-46.666666666666664,null,null,null,null,null,null,null,226.48333333333332]
["Student 274","iPhone",{"$f":"VLOOKUP(B278,{\"iPhone\",1;\"Motorola\",2;\"Nokia\",3;\"Samsung\",4;\"Sony Erickson\",5;\"Sprint\",6},2,0)","v":1},null,null,null,null,"Student 274","Good",{"$f":"VLOOKUP(I278,{\"Excellent\",4;\"Poor\",1;\"Good\",3;\"OK\",2},2,0)","v":3},null,null,null,null,-53,-47.222222222222221,null,null,null,null,null,null,null,225.92777777777775]
["Student 275","Nokia",{"$f":"VLOOKUP(B279,{\"iPhone\",1;\"Motorola\",2;\"Nokia\",3;\"Samsung\",4;\"Sony Erickson\",5;\"Sprint\",6},2,0)","v":3},null,null,null,null,"Student 275","Excellent",{"$f":"VLOOKUP(I279,{\"Excellent\",4;\"Poor\",1;\"Good\",3;\"OK\",2},2,0)","v":4},null,null,null,null,-54,-47.777777777777779,null,null,null,null,null,null,null,225.37222222222221]
["Student 276","Nokia",{"$f":"VLOOKUP(B280,{\"iPhone\",1;\"Motorola\",2;\"Nokia\",3;\"Samsung\",4;\"Sony Erickson\",5;\"Sprint\",6},2,0)","v":3},null,null,null,null,"Student 276","Excellent",{"$f":"VLOOKUP(I280,{\"Excellent\",4;\"Poor\",1;\"Good\",3;\"OK\",2},2,0)","v":4},null,null,null,null,-55,-48.333333333333329,null,null,null,null,null,null,null,224.81666666666666]
["Student 277","Samsung",{"$f":"VLOOKUP(B281,{\"iPhone\",1;\"Motorola\",2;\"Nokia\",3;\"Samsung\",4;\"Sony Erickson\",5;\"Sprint\",6},2,0)","v":4},null,null,null,null,"Student 277","Poor",{"$f":"VLOOKUP(I281,{\"Excellent\",4;\"Poor\",1;\"Good\",3;\"OK\",2},2,0)","v":1},null,null,null,null,-56,-48.888888888888886,null,null,null,null,null,null,null,224.26111111111109]
["Student 278","Sony Erickson",{"$f":"VLOOKUP(B282,{\"iPhone\",1;\"Motorola\",2;\"Nokia\",3;\"Samsung\",4;\"Sony Erickson\",5;\"Sprint\",6},2,0)","v":5},null,null,null,null,"Student 278","Excellent",{"$f":"VLOOKUP(I282,{\"Excellent\",4;\"Poor\",1;\"Good\",3;\"OK\",2},2,0)","v":4},null,null,null,null,-57,-49.444444444444443,null,null,null,null,null,null,null,223.70555555555552]
["Student 279","Samsung",{"$f":"VLOOKUP(B283,{\"iPhone\",1;\"Motorola\",2;\"Nokia\",3;\"Samsung\",4;\"Sony Erickson\",5;\"Sprint\",6},2,0)","v":4},null,null,null,null,"Student 279","Poor",{"$f":"VLOOKUP(I283,{\"Excellent\",4;\"Poor\",1;\"Good\",3;\"OK\",2},2,0)","v":1},null,null,null,null,-58,-50,null,null,null,null,null,null,null,223.14999999999998]
["Student 280","Nokia",{"$f":"VLOOKUP(B284,{\"iPhone\",1;\"Motorola\",2;\"Nokia\",3;\"Samsung\",4;\"Sony Erickson\",5;\"Sprint\",6},2,0)","v":3},null,null,null,null,"Student 280","Poor",{"$f":"VLOOKUP(I284,{\"Excellent\",4;\"Poor\",1;\"Good\",3;\"OK\",2},2,0)","v":1},null,null,null,null,-59,-50.555555555555557,null,null,null,null,null,null,null,222.59444444444443]
["Student 281","Samsung",{"$f":"VLOOKUP(B285,{\"iPhone\",1;\"Motorola\",2;\"Nokia\",3;\"Samsung\",4;\"Sony Erickson\",5;\"Sprint\",6},2,0)","v":4},null,null,null,null,"Student 281","Poor",{"$f":"VLOOKUP(I285,{\"Excellent\",4;\"Poor\",1;\"Good\",3;\"OK\",2},2,0)","v":1},null,null,null,null,-60,-51.111111111111107,null,null,null,null,null,null,null,222.03888888888886]
["Student 282","Sprint",{"$f":"VLOOKUP(B286,{\"iPhone\",1;\"Motorola\",2;\"Nokia\",3;\"Samsung\",4;\"Sony Erickson\",5;\"Sprint\",6},2,0)","v":6},null,null,null,null,"Student 282","Poor",{"$f":"VLOOKUP(I286,{\"Excellent\",4;\"Poor\",1;\"Good\",3;\"OK\",2},2,0)","v":1},null,null,null,null,-61,-51.666666666666664,null,null,null,null,null,null,null,221.48333333333332]
["Student 283","Sony Erickson",{"$f":"VLOOKUP(B287,{\"iPhone\",1;\"Motorola\",2;\"Nokia\",3;\"Samsung\",4;\"Sony Erickson\",5;\"Sprint\",6},2,0)","v":5},null,null,null,null,"Student 283","OK",{"$f":"VLOOKUP(I287,{\"Excellent\",4;\"Poor\",1;\"Good\",3;\"OK\",2},2,0)","v":2},null,null,null,null,-62,-52.222222222222221,null,null,null,null,null,null,null,220.92777777777775]
["Student 284","Motorola",{"$f":"VLOOKUP(B288,{\"iPhone\",1;\"Motorola\",2;\"Nokia\",3;\"Samsung\",4;\"Sony Erickson\",5;\"Sprint\",6},2,0)","v":2},null,null,null,null,"Student 284","OK",{"$f":"VLOOKUP(I288,{\"Excellent\",4;\"Poor\",1;\"Good\",3;\"OK\",2},2,0)","v":2},null,null,null,null,-63,-52.777777777777779,null,null,null,null,null,null,null,220.37222222222221]
["Student 285","Samsung",{"$f":"VLOOKUP(B289,{\"iPhone\",1;\"Motorola\",2;\"Nokia\",3;\"Samsung\",4;\"Sony Erickson\",5;\"Sprint\",6},2,0)","v":4},null,null,null,null,"Student 285","Poor",{"$f":"VLOOKUP(I289,{\"Excellent\",4;\"Poor\",1;\"Good\",3;\"OK\",2},2,0)","v":1},null,null,null,null,-64,-53.333333333333329,null,null,null,null,null,null,null,219.81666666666666]
["Student 286","Nokia",{"$f":"VLOOKUP(B290,{\"iPhone\",1;\"Motorola\",2;\"Nokia\",3;\"Samsung\",4;\"Sony Erickson\",5;\"Sprint\",6},2,0)","v":3},null,null,null,null,"Student 286","Excellent",{"$f":"VLOOKUP(I290,{\"Excellent\",4;\"Poor\",1;\"Good\",3;\"OK\",2},2,0)","v":4},null,null,null,null,-65,-53.888888888888886,null,null,null,null,null,null,null,219.26111111111109]
["Student 287","Samsung",{"$f":"VLOOKUP(B291,{\"iPhone\",1;\"Motorola\",2;\"Nokia\",3;\"Samsung\",4;\"Sony Erickson\",5;\"Sprint\",6},2,0)","v":4},null,null,null,null,"Student 287","Excellent",{"$f":"VLOOKUP(I291,{\"Excellent\",4;\"Poor\",1;\"Good\",3;\"OK\",2},2,0)","v":4},null,null,null,null,-66,-54.444444444444443,null,null,null,null,null,null,null,218.70555555555552]
["Student 288","Samsung",{"$f":"VLOOKUP(B292,{\"iPhone\",1;\"Motorola\",2;\"Nokia\",3;\"Samsung\",4;\"Sony Erickson\",5;\"Sprint\",6},2,0)","v":4},null,null,null,null,"Student 288","OK",{"$f":"VLOOKUP(I292,{\"Excellent\",4;\"Poor\",1;\"Good\",3;\"OK\",2},2,0)","v":2},null,null,null,null,-67,-55,null,null,null,null,null,null,null,218.14999999999998]
["Student 289","Motorola",{"$f":"VLOOKUP(B293,{\"iPhone\",1;\"Motorola\",2;\"Nokia\",3;\"Samsung\",4;\"Sony Erickson\",5;\"Sprint\",6},2,0)","v":2},null,null,null,null,"Student 289","Poor",{"$f":"VLOOKUP(I293,{\"Excellent\",4;\"Poor\",1;\"Good\",3;\"OK\",2},2,0)","v":1},null,null,null,null,-68,-55.555555555555557,null,null,null,null,null,null,null,217.59444444444443]
["Student 290","iPhone",{"$f":"VLOOKUP(B294,{\"iPhone\",1;\"Motorola\",2;\"Nokia\",3;\"Samsung\",4;\"Sony Erickson\",5;\"Sprint\",6},2,0)","v":1},null,null,null,null,"Student 290","Poor",{"$f":"VLOOKUP(I294,{\"Excellent\",4;\"Poor\",1;\"Good\",3;\"OK\",2},2,0)","v":1},null,null,null,null,-69,-56.111111111111107,null,null,null,null,null,null,null,217.03888888888886]
["Student 291","Nokia",{"$f":"VLOOKUP(B295,{\"iPhone\",1;\"Motorola\",2;\"Nokia\",3;\"Samsung\",4;\"Sony Erickson\",5;\"Sprint\",6},2,0)","v":3},null,null,null,null,"Student 291","Good",{"$f":"VLOOKUP(I295,{\"Excellent\",4;\"Poor\",1;\"Good\",3;\"OK\",2},2,0)","v":3},null,null,null,null,-70,-56.666666666666664,null,null,null,null,null,null,null,216.48333333333332]
["Student 292","Nokia",{"$f":"VLOOKUP(B296,{\"iPhone\",1;\"Motorola\",2;\"Nokia\",3;\"Samsung\",4;\"Sony Erickson\",5;\"Sprint\",6},2,0)","v":3},null,null,null,null,"Student 292","Poor",{"$f":"VLOOKUP(I296,{\"Excellent\",4;\"Poor\",1;\"Good\",3;\"OK\",2},2,0)","v":1},null,null,null,null,-71,-57.222222222222221,null,null,null,null,null,null,null,215.92777777777775]
["Student 293","Nokia",{"$f":"VLOOKUP(B297,{\"iPhone\",1;\"Motorola\",2;\"Nokia\",3;\"Samsung\",4;\"Sony Erickson\",5;\"Sprint\",6},2,0)","v":3},null,null,null,null,"Student 293","OK",{"$f":"VLOOKUP(I297,{\"Excellent\",4;\"Poor\",1;\"Good\",3;\"OK\",2},2,0)","v":2},null,null,null,null,-72,-57.777777777777779,null,null,null,null,null,null,null,215.37222222222221]
["Student 294","Motorola",{"$f":"VLOOKUP(B298,{\"iPhone\",1;\"Motorola\",2;\"Nokia\",3;\"Samsung\",4;\"Sony Erickson\",5;\"Sprint\",6},2,0)","v":2},null,null,null,null,"Student 294","Poor",{"$f":"VLOOKUP(I298,{\"Excellent\",4;\"Poor\",1;\"Good\",3;\"OK\",2},2,0)","v":1},null,null,null,null,-73,-58.333333333333329,null,null,null,null,null,null,null,214.81666666666666]
["Student 295","Sprint",{"$f":"VLOOKUP(B299,{\"iPhone\",1;\"Motorola\",2;\"Nokia\",3;\"Samsung\",4;\"Sony Erickson\",5;\"Sprint\",6},2,0)","v":6},null,null,null,null,"Student 295","Excellent",{"$f":"VLOOKUP(I299,{\"Excellent\",4;\"Poor\",1;\"Good\",3;\"OK\",2},2,0)","v":4},null,null,null,null,-74,-58.888888888888886,null,null,null,null,null,null,null,214.26111111111109]
["Student 296","Motorola",{"$f":"VLOOKUP(B300,{\"iPhone\",1;\"Motorola\",2;\"Nokia\",3;\"Samsung\",4;\"Sony Erickson\",5;\"Sprint\",6},2,0)","v":2},null,null,null,null,"Student 296","Excellent",{"$f":"VLOOKUP(I300,{\"Excellent\",4;\"Poor\",1;\"Good\",3;\"OK\",2},2,0)","v":4},null,null,null,null,-75,-59.444444444444443,null,null,null,null,null,null,null,213.70555555555552]
["Student 297","Motorola",{"$f":"VLOOKUP(B301,{\"iPhone\",1;\"Motorola\",2;\"Nokia\",3;\"Samsung\",4;\"Sony Erickson\",5;\"Sprint\",6},2,0)","v":2},null,null,null,null,"Student 297","Good",{"$f":"VLOOKUP(I301,{\"Excellent\",4;\"Poor\",1;\"Good\",3;\"OK\",2},2,0)","v":3},null,null,null,null,-76,-60,null,null,null,null,null,null,null,213.14999999999998]
["Student 298","Nokia",{"$f":"VLOOKUP(B302,{\"iPhone\",1;\"Motorola\",2;\"Nokia\",3;\"Samsung\",4;\"Sony Erickson\",5;\"Sprint\",6},2,0)","v":3},null,null,null,null,"Student 298","OK",{"$f":"VLOOKUP(I302,{\"Excellent\",4;\"Poor\",1;\"Good\",3;\"OK\",2},2,0)","v":2},null,null,null,null,-77,-60.555555555555557,null,null,null,null,null,null,null,212.59444444444443]
["Student 299","Sprint",{"$f":"VLOOKUP(B303,{\"iPhone\",1;\"Motorola\",2;\"Nokia\",3;\"Samsung\",4;\"Sony Erickson\",5;\"Sprint\",6},2,0)","v":6},null,null,null,null,"Student 299","OK",{"$f":"VLOOKUP(I303,{\"Excellent\",4;\"Poor\",1;\"Good\",3;\"OK\",2},2,0)","v":2},null,null,null,null,-78,-61.111111111111107,null,null,null,null,null,null,null,212.03888888888886]
["Student 300","iPhone",{"$f":"VLOOKUP(B304,{\"iPhone\",1;\"Motorola\",2;\"Nokia\",3;\"Samsung\",4;\"Sony Erickson\",5;\"Sprint\",6},2,0)","v":1},null,null,null,null,"Student 300","Excellent",{"$f":"VLOOKUP(I304,{\"Excellent\",4;\"Poor\",1;\"Good\",3;\"OK\",2},2,0)","v":4},null,null,null,null,-79,-61.666666666666664,null,null,null,null,null,null,null,211.48333333333332]
["Student 301","iPhone",{"$f":"VLOOKUP(B305,{\"iPhone\",1;\"Motorola\",2;\"Nokia\",3;\"Samsung\",4;\"Sony Erickson\",5;\"Sprint\",6},2,0)","v":1},null,null,null,null,"Student 301","Poor",{"$f":"VLOOKUP(I305,{\"Excellent\",4;\"Poor\",1;\"Good\",3;\"OK\",2},2,0)","v":1},null,null,null,null,-80,-62.222222222222221,null,null,null,null,null,null,null,210.92777777777775]
["Student 302","Nokia",{"$f":"VLOOKUP(B306,{\"iPhone\",1;\"Motorola\",2;\"Nokia\",3;\"Samsung\",4;\"Sony Erickson\",5;\"Sprint\",6},2,0)","v":3},null,null,null,null,"Student 302","Poor",{"$f":"VLOOKUP(I306,{\"Excellent\",4;\"Poor\",1;\"Good\",3;\"OK\",2},2,0)","v":1},null,null,null,null,-81,-62.777777777777779,null,null,null,null,null,null,null,210.37222222222221]
["Student 303","Nokia",{"$f":"VLOOKUP(B307,{\"iPhone\",1;\"Motorola\",2;\"Nokia\",3;\"Samsung\",4;\"Sony Erickson\",5;\"Sprint\",6},2,0)","v":3},null,null,null,null,"Student 303","Poor",{"$f":"VLOOKUP(I307,{\"Excellent\",4;\"Poor\",1;\"Good\",3;\"OK\",2},2,0)","v":1},null,null,null,null,-82,-63.333333333333329,null,null,null,null,null,null,null,209.81666666666666]
["Student 304","Nokia",{"$f":"VLOOKUP(B308,{\"iPhone\",1;\"Motorola\",2;\"Nokia\",3;\"Samsung\",4;\"Sony Erickson\",5;\"Sprint\",6},2,0)","v":3},null,null,null,null,"Student 304","OK",{"$f":"VLOOKUP(I308,{\"Excellent\",4;\"Poor\",1;\"Good\",3;\"OK\",2},2,0)","v":2},null,null,null,null,-83,-63.888888888888886,null,null,null,null,null,null,null,209.26111111111109]
["Student 305","Nokia",{"$f":"VLOOKUP(B309,{\"iPhone\",1;\"Motorola\",2;\"Nokia\",3;\"Samsung\",4;\"Sony Erickson\",5;\"Sprint\",6},2,0)","v":3},null,null,null,null,"Student 305","Excellent",{"$f":"VLOOKUP(I309,{\"Excellent\",4;\"Poor\",1;\"Good\",3;\"OK\",2},2,0)","v":4},null,null,null,null,-84,-64.444444444444443,null,null,null,null,null,null,null,208.70555555555552]
["Student 306","Samsung",{"$f":"VLOOKUP(B310,{\"iPhone\",1;\"Motorola\",2;\"Nokia\",3;\"Samsung\",4;\"Sony Erickson\",5;\"Sprint\",6},2,0)","v":4},null,null,null,null,"Student 306","Poor",{"$f":"VLOOKUP(I310,{\"Excellent\",4;\"Poor\",1;\"Good\",3;\"OK\",2},2,0)","v":1},null,null,null,null,-85,-65,null,null,null,null,null,null,null,208.14999999999998]
["Student 307","Samsung",{"$f":"VLOOKUP(B311,{\"iPhone\",1;\"Motorola\",2;\"Nokia\",3;\"Samsung\",4;\"Sony Erickson\",5;\"Sprint\",6},2,0)","v":4},null,null,null,null,"Student 307","Poor",{"$f":"VLOOKUP(I311,{\"Excellent\",4;\"Poor\",1;\"Good\",3;\"OK\",2},2,0)","v":1},null,null,null,null,-86,-65.555555555555557,null,null,null,null,null,null,null,207.59444444444443]
["Student 308","iPhone",{"$f":"VLOOKUP(B312,{\"iPhone\",1;\"Motorola\",2;\"Nokia\",3;\"Samsung\",4;\"Sony Erickson\",5;\"Sprint\",6},2,0)","v":1},null,null,null,null,"Student 308","OK",{"$f":"VLOOKUP(I312,{\"Excellent\",4;\"Poor\",1;\"Good\",3;\"OK\",2},2,0)","v":2},null,null,null,null,-87,-66.111111111111114,null,null,null,null,null,null,null,207.03888888888886]
["Student 309","Motorola",{"$f":"VLOOKUP(B313,{\"iPhone\",1;\"Motorola\",2;\"Nokia\",3;\"Samsung\",4;\"Sony Erickson\",5;\"Sprint\",6},2,0)","v":2},null,null,null,null,"Student 309","OK",{"$f":"VLOOKUP(I313,{\"Excellent\",4;\"Poor\",1;\"Good\",3;\"OK\",2},2,0)","v":2},null,null,null,null,-88,-66.666666666666671,null,null,null,null,null,null,null,206.48333333333329]
["Student 310","Sprint",{"$f":"VLOOKUP(B314,{\"iPhone\",1;\"Motorola\",2;\"Nokia\",3;\"Samsung\",4;\"Sony Erickson\",5;\"Sprint\",6},2,0)","v":6},null,null,null,null,"Student 310","Good",{"$f":"VLOOKUP(I314,{\"Excellent\",4;\"Poor\",1;\"Good\",3;\"OK\",2},2,0)","v":3},null,null,null,null,-89,-67.222222222222214,null,null,null,null,null,null,null,205.92777777777775]
["Student 311","iPhone",{"$f":"VLOOKUP(B315,{\"iPhone\",1;\"Motorola\",2;\"Nokia\",3;\"Samsung\",4;\"Sony Erickson\",5;\"Sprint\",6},2,0)","v":1},null,null,null,null,"Student 311","OK",{"$f":"VLOOKUP(I315,{\"Excellent\",4;\"Poor\",1;\"Good\",3;\"OK\",2},2,0)","v":2},null,null,null,null,-90,-67.777777777777771,null,null,null,null,null,null,null,205.37222222222221]
["Student 312","iPhone",{"$f":"VLOOKUP(B316,{\"iPhone\",1;\"Motorola\",2;\"Nokia\",3;\"Samsung\",4;\"Sony Erickson\",5;\"Sprint\",6},2,0)","v":1},null,null,null,null,"Student 312","Poor",{"$f":"VLOOKUP(I316,{\"Excellent\",4;\"Poor\",1;\"Good\",3;\"OK\",2},2,0)","v":1},null,null,null,null,-91,-68.333333333333329,null,null,null,null,null,null,null,204.81666666666666]
["Student 313","Nokia",{"$f":"VLOOKUP(B317,{\"iPhone\",1;\"Motorola\",2;\"Nokia\",3;\"Samsung\",4;\"Sony Erickson\",5;\"Sprint\",6},2,0)","v":3},null,null,null,null,"Student 313","Poor",{"$f":"VLOOKUP(I317,{\"Excellent\",4;\"Poor\",1;\"Good\",3;\"OK\",2},2,0)","v":1},null,null,null,null,-92,-68.888888888888886,null,null,null,null,null,null,null,204.26111111111109]
["Student 314","Samsung",{"$f":"VLOOKUP(B318,{\"iPhone\",1;\"Motorola\",2;\"Nokia\",3;\"Samsung\",4;\"Sony Erickson\",5;\"Sprint\",6},2,0)","v":4},null,null,null,null,"Student 314","Excellent",{"$f":"VLOOKUP(I318,{\"Excellent\",4;\"Poor\",1;\"Good\",3;\"OK\",2},2,0)","v":4},null,null,null,null,-93,-69.444444444444443,null,null,null,null,null,null,null,203.70555555555552]
["Student 315","Samsung",{"$f":"VLOOKUP(B319,{\"iPhone\",1;\"Motorola\",2;\"Nokia\",3;\"Samsung\",4;\"Sony Erickson\",5;\"Sprint\",6},2,0)","v":4},null,null,null,null,"Student 315","Good",{"$f":"VLOOKUP(I319,{\"Excellent\",4;\"Poor\",1;\"Good\",3;\"OK\",2},2,0)","v":3},null,null,null,null,-94,-70,null,null,null,null,null,null,null,203.14999999999998]
["Student 316","iPhone",{"$f":"VLOOKUP(B320,{\"iPhone\",1;\"Motorola\",2;\"Nokia\",3;\"Samsung\",4;\"Sony Erickson\",5;\"Sprint\",6},2,0)","v":1},null,null,null,null,"Student 316","Good",{"$f":"VLOOKUP(I320,{\"Excellent\",4;\"Poor\",1;\"Good\",3;\"OK\",2},2,0)","v":3},null,null,null,null,-95,-70.555555555555557,null,null,null,null,null,null,null,202.59444444444443]
["Student 317","Samsung",{"$f":"VLOOKUP(B321,{\"iPhone\",1;\"Motorola\",2;\"Nokia\",3;\"Samsung\",4;\"Sony Erickson\",5;\"Sprint\",6},2,0)","v":4},null,null,null,null,"Student 317","Poor",{"$f":"VLOOKUP(I321,{\"Excellent\",4;\"Poor\",1;\"Good\",3;\"OK\",2},2,0)","v":1},null,null,null,null,-96,-71.111111111111114,null,null,null,null,null,null,null,202.03888888888886]
["Student 318","Samsung",{"$f":"VLOOKUP(B322,{\"iPhone\",1;\"Motorola\",2;\"Nokia\",3;\"Samsung\",4;\"Sony Erickson\",5;\"Sprint\",6},2,0)","v":4},null,null,null,null,"Student 318","OK",{"$f":"VLOOKUP(I322,{\"Excellent\",4;\"Poor\",1;\"Good\",3;\"OK\",2},2,0)","v":2},null,null,null,null,-97,-71.666666666666671,null,null,null,null,null,null,null,201.48333333333329]
["Student 319","Motorola",{"$f":"VLOOKUP(B323,{\"iPhone\",1;\"Motorola\",2;\"Nokia\",3;\"Samsung\",4;\"Sony Erickson\",5;\"Sprint\",6},2,0)","v":2},null,null,null,null,"Student 319","Excellent",{"$f":"VLOOKUP(I323,{\"Excellent\",4;\"Poor\",1;\"Good\",3;\"OK\",2},2,0)","v":4},null,null,null,null,-98,-72.222222222222214,null,null,null,null,null,null,null,200.92777777777775]
["Student 320","Sony Erickson",{"$f":"VLOOKUP(B324,{\"iPhone\",1;\"Motorola\",2;\"Nokia\",3;\"Samsung\",4;\"Sony Erickson\",5;\"Sprint\",6},2,0)","v":5},null,null,null,null,"Student 320","Good",{"$f":"VLOOKUP(I324,{\"Excellent\",4;\"Poor\",1;\"Good\",3;\"OK\",2},2,0)","v":3},null,null,null,null,-99,-72.777777777777771,null,null,null,null,null,null,null,200.37222222222221]
["Student 321","iPhone",{"$f":"VLOOKUP(B325,{\"iPhone\",1;\"Motorola\",2;\"Nokia\",3;\"Samsung\",4;\"Sony Erickson\",5;\"Sprint\",6},2,0)","v":1},null,null,null,null,"Student 321","Poor",{"$f":"VLOOKUP(I325,{\"Excellent\",4;\"Poor\",1;\"Good\",3;\"OK\",2},2,0)","v":1},null,null,null,null,-100,{"$f":"CONVERT(O325,\"F\",\"C\")","v":-73.333333333333329},null,null,null,null,null,null,null,199.81666666666666]
["Student 322","Nokia",{"$f":"VLOOKUP(B326,{\"iPhone\",1;\"Motorola\",2;\"Nokia\",3;\"Samsung\",4;\"Sony Erickson\",5;\"Sprint\",6},2,0)","v":3},null,null,null,null,"Student 322","Poor",{"$f":"VLOOKUP(I326,{\"Excellent\",4;\"Poor\",1;\"Good\",3;\"OK\",2},2,0)","v":1},null,null,null,null,-101,-73.888888888888886,null,null,null,null,null,null,null,199.26111111111109]
["Student 323","iPhone",{"$f":"VLOOKUP(B327,{\"iPhone\",1;\"Motorola\",2;\"Nokia\",3;\"Samsung\",4;\"Sony Erickson\",5;\"Sprint\",6},2,0)","v":1},null,null,null,null,"Student 323","Poor",{"$f":"VLOOKUP(I327,{\"Excellent\",4;\"Poor\",1;\"Good\",3;\"OK\",2},2,0)","v":1},null,null,null,null,-102,-74.444444444444443,null,null,null,null,null,null,null,198.70555555555552]
["Student 324","Samsung",{"$f":"VLOOKUP(B328,{\"iPhone\",1;\"Motorola\",2;\"Nokia\",3;\"Samsung\",4;\"Sony Erickson\",5;\"Sprint\",6},2,0)","v":4},null,null,null,null,"Student 324","Good",{"$f":"VLOOKUP(I328,{\"Excellent\",4;\"Poor\",1;\"Good\",3;\"OK\",2},2,0)","v":3},null,null,null,null,-103,-75,null,null,null,null,null,null,null,{"$f":"CONVERT(O328,\"F\",\"K\")","v":198.14999999999998}]
["Student 325","Sony Erickson",{"$f":"VLOOKUP(B329,{\"iPhone\",1;\"Motorola\",2;\"Nokia\",3;\"Samsung\",4;\"Sony Erickson\",5;\"Sprint\",6},2,0)","v":5},null,null,null,null,"Student 325","Poor",{"$f":"VLOOKUP(I329,{\"Excellent\",4;\"Poor\",1;\"Good\",3;\"OK\",2},2,0)","v":1},null,null,null,null,-104,-75.555555555555557,null,null,null,null,null,null,null,197.59444444444443]
["Student 326","Motorola",{"$f":"VLOOKUP(B330,{\"iPhone\",1;\"Motorola\",2;\"Nokia\",3;\"Samsung\",4;\"Sony Erickson\",5;\"Sprint\",6},2,0)","v":2},null,null,null,null,"Student 326","Poor",{"$f":"VLOOKUP(I330,{\"Excellent\",4;\"Poor\",1;\"Good\",3;\"OK\",2},2,0)","v":1},null,null,null,null,-105,-76.111111111111114,null,null,null,null,null,null,null,197.03888888888886]
["Student 327","iPhone",{"$f":"VLOOKUP(B331,{\"iPhone\",1;\"Motorola\",2;\"Nokia\",3;\"Samsung\",4;\"Sony Erickson\",5;\"Sprint\",6},2,0)","v":1},null,null,null,null,"Student 327","Poor",{"$f":"VLOOKUP(I331,{\"Excellent\",4;\"Poor\",1;\"Good\",3;\"OK\",2},2,0)","v":1},null,null,null,null,-106,-76.666666666666671,null,null,null,null,null,null,null,196.48333333333329]
["Student 328","Sprint",{"$f":"VLOOKUP(B332,{\"iPhone\",1;\"Motorola\",2;\"Nokia\",3;\"Samsung\",4;\"Sony Erickson\",5;\"Sprint\",6},2,0)","v":6},null,null,null,null,"Student 328","Excellent",{"$f":"VLOOKUP(I332,{\"Excellent\",4;\"Poor\",1;\"Good\",3;\"OK\",2},2,0)","v":4},null,null,null,null,-107,-77.222222222222214,null,null,null,null,null,null,null,195.92777777777775]
["Student 329","Motorola",{"$f":"VLOOKUP(B333,{\"iPhone\",1;\"Motorola\",2;\"Nokia\",3;\"Samsung\",4;\"Sony Erickson\",5;\"Sprint\",6},2,0)","v":2},null,null,null,null,"Student 329","Poor",{"$f":"VLOOKUP(I333,{\"Excellent\",4;\"Poor\",1;\"Good\",3;\"OK\",2},2,0)","v":1},null,null,null,null,-108,-77.777777777777771,null,null,null,null,null,null,null,195.37222222222221]
["Student 330","Samsung",{"$f":"VLOOKUP(B334,{\"iPhone\",1;\"Motorola\",2;\"Nokia\",3;\"Samsung\",4;\"Sony Erickson\",5;\"Sprint\",6},2,0)","v":4},null,null,null,null,"Student 330","OK",{"$f":"VLOOKUP(I334,{\"Excellent\",4;\"Poor\",1;\"Good\",3;\"OK\",2},2,0)","v":2},null,null,null,null,-109,-78.333333333333329,null,null,null,null,null,null,null,194.81666666666666]
["Student 331","Nokia",{"$f":"VLOOKUP(B335,{\"iPhone\",1;\"Motorola\",2;\"Nokia\",3;\"Samsung\",4;\"Sony Erickson\",5;\"Sprint\",6},2,0)","v":3},null,null,null,null,"Student 331","OK",{"$f":"VLOOKUP(I335,{\"Excellent\",4;\"Poor\",1;\"Good\",3;\"OK\",2},2,0)","v":2},null,null,null,null,-110,-78.888888888888886,null,null,null,null,null,null,null,194.26111111111109]
["Student 332","Sony Erickson",{"$f":"VLOOKUP(B336,{\"iPhone\",1;\"Motorola\",2;\"Nokia\",3;\"Samsung\",4;\"Sony Erickson\",5;\"Sprint\",6},2,0)","v":5},null,null,null,null,"Student 332","Poor",{"$f":"VLOOKUP(I336,{\"Excellent\",4;\"Poor\",1;\"Good\",3;\"OK\",2},2,0)","v":1},null,null,null,null,-111,-79.444444444444443,null,null,null,null,null,null,null,193.70555555555552]
["Student 333","iPhone",{"$f":"VLOOKUP(B337,{\"iPhone\",1;\"Motorola\",2;\"Nokia\",3;\"Samsung\",4;\"Sony Erickson\",5;\"Sprint\",6},2,0)","v":1},null,null,null,null,"Student 333","Poor",{"$f":"VLOOKUP(I337,{\"Excellent\",4;\"Poor\",1;\"Good\",3;\"OK\",2},2,0)","v":1},null,null,null,null,-112,-80,null,null,null,null,null,null,null,193.14999999999998]
["Student 334","Samsung",{"$f":"VLOOKUP(B338,{\"iPhone\",1;\"Motorola\",2;\"Nokia\",3;\"Samsung\",4;\"Sony Erickson\",5;\"Sprint\",6},2,0)","v":4},null,null,null,null,"Student 334","Good",{"$f":"VLOOKUP(I338,{\"Excellent\",4;\"Poor\",1;\"Good\",3;\"OK\",2},2,0)","v":3},null,null,null,null,-113,-80.555555555555557,null,null,null,null,null,null,null,192.59444444444443]
["Student 335","iPhone",{"$f":"VLOOKUP(B339,{\"iPhone\",1;\"Motorola\",2;\"Nokia\",3;\"Samsung\",4;\"Sony Erickson\",5;\"Sprint\",6},2,0)","v":1},null,null,null,null,"Student 335","OK",{"$f":"VLOOKUP(I339,{\"Excellent\",4;\"Poor\",1;\"Good\",3;\"OK\",2},2,0)","v":2},null,null,null,null,-114,-81.111111111111114,null,null,null,null,null,null,null,192.03888888888886]
["Student 336","iPhone",{"$f":"VLOOKUP(B340,{\"iPhone\",1;\"Motorola\",2;\"Nokia\",3;\"Samsung\",4;\"Sony Erickson\",5;\"Sprint\",6},2,0)","v":1},null,null,null,null,"Student 336","OK",{"$f":"VLOOKUP(I340,{\"Excellent\",4;\"Poor\",1;\"Good\",3;\"OK\",2},2,0)","v":2},null,null,null,null,-115,-81.666666666666671,null,null,null,null,null,null,null,191.48333333333329]
["Student 337","Nokia",{"$f":"VLOOKUP(B341,{\"iPhone\",1;\"Motorola\",2;\"Nokia\",3;\"Samsung\",4;\"Sony Erickson\",5;\"Sprint\",6},2,0)","v":3},null,null,null,null,"Student 337","Excellent",{"$f":"VLOOKUP(I341,{\"Excellent\",4;\"Poor\",1;\"Good\",3;\"OK\",2},2,0)","v":4},null,null,null,null,-116,-82.222222222222214,null,null,null,null,null,null,null,190.92777777777775]
["Student 338","Motorola",{"$f":"VLOOKUP(B342,{\"iPhone\",1;\"Motorola\",2;\"Nokia\",3;\"Samsung\",4;\"Sony Erickson\",5;\"Sprint\",6},2,0)","v":2},null,null,null,null,"Student 338","Excellent",{"$f":"VLOOKUP(I342,{\"Excellent\",4;\"Poor\",1;\"Good\",3;\"OK\",2},2,0)","v":4},null,null,null,null,-117,-82.777777777777771,null,null,null,null,null,null,null,190.37222222222221]
["Student 339","Nokia",{"$f":"VLOOKUP(B343,{\"iPhone\",1;\"Motorola\",2;\"Nokia\",3;\"Samsung\",4;\"Sony Erickson\",5;\"Sprint\",6},2,0)","v":3},null,null,null,null,"Student 339","Good",{"$f":"VLOOKUP(I343,{\"Excellent\",4;\"Poor\",1;\"Good\",3;\"OK\",2},2,0)","v":3},null,null,null,null,-118,-83.333333333333329,null,null,null,null,null,null,null,189.81666666666666]
["Student 340","Nokia",{"$f":"VLOOKUP(B344,{\"iPhone\",1;\"Motorola\",2;\"Nokia\",3;\"Samsung\",4;\"Sony Erickson\",5;\"Sprint\",6},2,0)","v":3},null,null,null,null,"Student 340","Poor",{"$f":"VLOOKUP(I344,{\"Excellent\",4;\"Poor\",1;\"Good\",3;\"OK\",2},2,0)","v":1},null,null,null,null,-119,-83.888888888888886,null,null,null,null,null,null,null,189.26111111111109]
["Student 341","Samsung",{"$f":"VLOOKUP(B345,{\"iPhone\",1;\"Motorola\",2;\"Nokia\",3;\"Samsung\",4;\"Sony Erickson\",5;\"Sprint\",6},2,0)","v":4},null,null,null,null,"Student 341","Excellent",{"$f":"VLOOKUP(I345,{\"Excellent\",4;\"Poor\",1;\"Good\",3;\"OK\",2},2,0)","v":4},null,null,null,null,-120,-84.444444444444443,null,null,null,null,null,null,null,188.70555555555552]
["Student 342","iPhone",{"$f":"VLOOKUP(B346,{\"iPhone\",1;\"Motorola\",2;\"Nokia\",3;\"Samsung\",4;\"Sony Erickson\",5;\"Sprint\",6},2,0)","v":1},null,null,null,null,"Student 342","Good",{"$f":"VLOOKUP(I346,{\"Excellent\",4;\"Poor\",1;\"Good\",3;\"OK\",2},2,0)","v":3},null,null,null,null,-121,-85,null,null,null,null,null,null,null,188.14999999999998]
["Student 343","iPhone",{"$f":"VLOOKUP(B347,{\"iPhone\",1;\"Motorola\",2;\"Nokia\",3;\"Samsung\",4;\"Sony Erickson\",5;\"Sprint\",6},2,0)","v":1},null,null,null,null,"Student 343","Good",{"$f":"VLOOKUP(I347,{\"Excellent\",4;\"Poor\",1;\"Good\",3;\"OK\",2},2,0)","v":3},null,null,null,null,-122,-85.555555555555557,null,null,null,null,null,null,null,187.59444444444443]
["Student 344","Sprint",{"$f":"VLOOKUP(B348,{\"iPhone\",1;\"Motorola\",2;\"Nokia\",3;\"Samsung\",4;\"Sony Erickson\",5;\"Sprint\",6},2,0)","v":6},null,null,null,null,"Student 344","OK",{"$f":"VLOOKUP(I348,{\"Excellent\",4;\"Poor\",1;\"Good\",3;\"OK\",2},2,0)","v":2},null,null,null,null,-123,-86.111111111111114,null,null,null,null,null,null,null,187.03888888888886]
["Student 345","Nokia",{"$f":"VLOOKUP(B349,{\"iPhone\",1;\"Motorola\",2;\"Nokia\",3;\"Samsung\",4;\"Sony Erickson\",5;\"Sprint\",6},2,0)","v":3},null,null,null,null,"Student 345","Excellent",{"$f":"VLOOKUP(I349,{\"Excellent\",4;\"Poor\",1;\"Good\",3;\"OK\",2},2,0)","v":4},null,null,null,null,-124,-86.666666666666671,null,null,null,null,null,null,null,186.48333333333329]
["Student 346","Sprint",{"$f":"VLOOKUP(B350,{\"iPhone\",1;\"Motorola\",2;\"Nokia\",3;\"Samsung\",4;\"Sony Erickson\",5;\"Sprint\",6},2,0)","v":6},null,null,null,null,"Student 346","Poor",{"$f":"VLOOKUP(I350,{\"Excellent\",4;\"Poor\",1;\"Good\",3;\"OK\",2},2,0)","v":1},null,null,null,null,-125,-87.222222222222214,null,null,null,null,null,null,null,185.92777777777775]
["Student 347","Sony Erickson",{"$f":"VLOOKUP(B351,{\"iPhone\",1;\"Motorola\",2;\"Nokia\",3;\"Samsung\",4;\"Sony Erickson\",5;\"Sprint\",6},2,0)","v":5},null,null,null,null,"Student 347","Poor",{"$f":"VLOOKUP(I351,{\"Excellent\",4;\"Poor\",1;\"Good\",3;\"OK\",2},2,0)","v":1},null,null,null,null,-126,-87.777777777777771,null,null,null,null,null,null,null,185.37222222222221]
["Student 348","Motorola",{"$f":"VLOOKUP(B352,{\"iPhone\",1;\"Motorola\",2;\"Nokia\",3;\"Samsung\",4;\"Sony Erickson\",5;\"Sprint\",6},2,0)","v":2},null,null,null,null,"Student 348","OK",{"$f":"VLOOKUP(I352,{\"Excellent\",4;\"Poor\",1;\"Good\",3;\"OK\",2},2,0)","v":2},null,null,null,null,-127,-88.333333333333329,null,null,null,null,null,null,null,184.81666666666666]
["Student 349","iPhone",{"$f":"VLOOKUP(B353,{\"iPhone\",1;\"Motorola\",2;\"Nokia\",3;\"Samsung\",4;\"Sony Erickson\",5;\"Sprint\",6},2,0)","v":1},null,null,null,null,"Student 349","OK",{"$f":"VLOOKUP(I353,{\"Excellent\",4;\"Poor\",1;\"Good\",3;\"OK\",2},2,0)","v":2},null,null,null,null,-128,-88.888888888888886,null,null,null,null,null,null,null,184.26111111111109]
["Student 350","Sprint",{"$f":"VLOOKUP(B354,{\"iPhone\",1;\"Motorola\",2;\"Nokia\",3;\"Samsung\",4;\"Sony Erickson\",5;\"Sprint\",6},2,0)","v":6},null,null,null,null,"Student 350","Poor",{"$f":"VLOOKUP(I354,{\"Excellent\",4;\"Poor\",1;\"Good\",3;\"OK\",2},2,0)","v":1},null,null,null,null,-129,-89.444444444444443,null,null,null,null,null,null,null,183.70555555555552]
["Student 351","Sony Erickson",{"$f":"VLOOKUP(B355,{\"iPhone\",1;\"Motorola\",2;\"Nokia\",3;\"Samsung\",4;\"Sony Erickson\",5;\"Sprint\",6},2,0)","v":5},null,null,null,null,"Student 351","OK",{"$f":"VLOOKUP(I355,{\"Excellent\",4;\"Poor\",1;\"Good\",3;\"OK\",2},2,0)","v":2},null,null,null,null,-130,-90,null,null,null,null,null,null,null,183.14999999999998]
["Student 352","iPhone",{"$f":"VLOOKUP(B356,{\"iPhone\",1;\"Motorola\",2;\"Nokia\",3;\"Samsung\",4;\"Sony Erickson\",5;\"Sprint\",6},2,0)","v":1},null,null,null,null,"Student 352","Poor",{"$f":"VLOOKUP(I356,{\"Excellent\",4;\"Poor\",1;\"Good\",3;\"OK\",2},2,0)","v":1},null,null,null,null,-131,-90.555555555555557,null,null,null,null,null,null,null,182.59444444444443]
["Student 353","iPhone",{"$f":"VLOOKUP(B357,{\"iPhone\",1;\"Motorola\",2;\"Nokia\",3;\"Samsung\",4;\"Sony Erickson\",5;\"Sprint\",6},2,0)","v":1},null,null,null,null,"Student 353","OK",{"$f":"VLOOKUP(I357,{\"Excellent\",4;\"Poor\",1;\"Good\",3;\"OK\",2},2,0)","v":2},null,null,null,null,-132,-91.111111111111114,null,null,null,null,null,null,null,182.03888888888886]
["Student 354","Motorola",{"$f":"VLOOKUP(B358,{\"iPhone\",1;\"Motorola\",2;\"Nokia\",3;\"Samsung\",4;\"Sony Erickson\",5;\"Sprint\",6},2,0)","v":2},null,null,null,null,"Student 354","OK",{"$f":"VLOOKUP(I358,{\"Excellent\",4;\"Poor\",1;\"Good\",3;\"OK\",2},2,0)","v":2},null,null,null,null,-133,-91.666666666666671,null,null,null,null,null,null,null,181.48333333333329]
["Student 355","Motorola",{"$f":"VLOOKUP(B359,{\"iPhone\",1;\"Motorola\",2;\"Nokia\",3;\"Samsung\",4;\"Sony Erickson\",5;\"Sprint\",6},2,0)","v":2},null,null,null,null,"Student 355","OK",{"$f":"VLOOKUP(I359,{\"Excellent\",4;\"Poor\",1;\"Good\",3;\"OK\",2},2,0)","v":2},null,null,null,null,-134,-92.222222222222214,null,null,null,null,null,null,null,180.92777777777775]
["Student 356","Samsung",{"$f":"VLOOKUP(B360,{\"iPhone\",1;\"Motorola\",2;\"Nokia\",3;\"Samsung\",4;\"Sony Erickson\",5;\"Sprint\",6},2,0)","v":4},null,null,null,null,"Student 356","Excellent",{"$f":"VLOOKUP(I360,{\"Excellent\",4;\"Poor\",1;\"Good\",3;\"OK\",2},2,0)","v":4},null,null,null,null,-135,-92.777777777777771,null,null,null,null,null,null,null,180.37222222222221]
["Student 357","Nokia",{"$f":"VLOOKUP(B361,{\"iPhone\",1;\"Motorola\",2;\"Nokia\",3;\"Samsung\",4;\"Sony Erickson\",5;\"Sprint\",6},2,0)","v":3},null,null,null,null,"Student 357","OK",{"$f":"VLOOKUP(I361,{\"Excellent\",4;\"Poor\",1;\"Good\",3;\"OK\",2},2,0)","v":2},null,null,null,null,-136,-93.333333333333329,null,null,null,null,null,null,null,179.81666666666666]
["Student 358","iPhone",{"$f":"VLOOKUP(B362,{\"iPhone\",1;\"Motorola\",2;\"Nokia\",3;\"Samsung\",4;\"Sony Erickson\",5;\"Sprint\",6},2,0)","v":1},null,null,null,null,"Student 358","Poor",{"$f":"VLOOKUP(I362,{\"Excellent\",4;\"Poor\",1;\"Good\",3;\"OK\",2},2,0)","v":1},null,null,null,null,-137,-93.888888888888886,null,null,null,null,null,null,null,179.26111111111109]
["Student 359","Sprint",{"$f":"VLOOKUP(B363,{\"iPhone\",1;\"Motorola\",2;\"Nokia\",3;\"Samsung\",4;\"Sony Erickson\",5;\"Sprint\",6},2,0)","v":6},null,null,null,null,"Student 359","Poor",{"$f":"VLOOKUP(I363,{\"Excellent\",4;\"Poor\",1;\"Good\",3;\"OK\",2},2,0)","v":1},null,null,null,null,-138,-94.444444444444443,null,null,null,null,null,null,null,178.70555555555552]
["Student 360","Sprint",{"$f":"VLOOKUP(B364,{\"iPhone\",1;\"Motorola\",2;\"Nokia\",3;\"Samsung\",4;\"Sony Erickson\",5;\"Sprint\",6},2,0)","v":6},null,null,null,null,"Student 360","Excellent",{"$f":"VLOOKUP(I364,{\"Excellent\",4;\"Poor\",1;\"Good\",3;\"OK\",2},2,0)","v":4},null,null,null,null,-139,-95,null,null,null,null,null,null,null,178.14999999999998]
["Student 361","iPhone",{"$f":"VLOOKUP(B365,{\"iPhone\",1;\"Motorola\",2;\"Nokia\",3;\"Samsung\",4;\"Sony Erickson\",5;\"Sprint\",6},2,0)","v":1},null,null,null,null,"Student 361","Poor",{"$f":"VLOOKUP(I365,{\"Excellent\",4;\"Poor\",1;\"Good\",3;\"OK\",2},2,0)","v":1},null,null,null,null,-140,-95.555555555555557,null,null,null,null,null,null,null,177.59444444444443]
["Student 362","Sony Erickson",{"$f":"VLOOKUP(B366,{\"iPhone\",1;\"Motorola\",2;\"Nokia\",3;\"Samsung\",4;\"Sony Erickson\",5;\"Sprint\",6},2,0)","v":5},null,null,null,null,"Student 362","OK",{"$f":"VLOOKUP(I366,{\"Excellent\",4;\"Poor\",1;\"Good\",3;\"OK\",2},2,0)","v":2},null,null,null,null,-141,-96.111111111111114,null,null,null,null,null,null,null,177.03888888888886]
["Student 363","Nokia",{"$f":"VLOOKUP(B367,{\"iPhone\",1;\"Motorola\",2;\"Nokia\",3;\"Samsung\",4;\"Sony Erickson\",5;\"Sprint\",6},2,0)","v":3},null,null,null,null,"Student 363","Poor",{"$f":"VLOOKUP(I367,{\"Excellent\",4;\"Poor\",1;\"Good\",3;\"OK\",2},2,0)","v":1},null,null,null,null,-142,-96.666666666666657,null,null,null,null,null,null,null,176.48333333333332]
["Student 364","Nokia",{"$f":"VLOOKUP(B368,{\"iPhone\",1;\"Motorola\",2;\"Nokia\",3;\"Samsung\",4;\"Sony Erickson\",5;\"Sprint\",6},2,0)","v":3},null,null,null,null,"Student 364","OK",{"$f":"VLOOKUP(I368,{\"Excellent\",4;\"Poor\",1;\"Good\",3;\"OK\",2},2,0)","v":2},null,null,null,null,-143,-97.222222222222214,null,null,null,null,null,null,null,175.92777777777775]
["Student 365","Motorola",{"$f":"VLOOKUP(B369,{\"iPhone\",1;\"Motorola\",2;\"Nokia\",3;\"Samsung\",4;\"Sony Erickson\",5;\"Sprint\",6},2,0)","v":2},null,null,null,null,"Student 365","Excellent",{"$f":"VLOOKUP(I369,{\"Excellent\",4;\"Poor\",1;\"Good\",3;\"OK\",2},2,0)","v":4},null,null,null,null,-144,-97.777777777777771,null,null,null,null,null,null,null,175.37222222222221]
["Student 366","Sony Erickson",{"$f":"VLOOKUP(B370,{\"iPhone\",1;\"Motorola\",2;\"Nokia\",3;\"Samsung\",4;\"Sony Erickson\",5;\"Sprint\",6},2,0)","v":5},null,null,null,null,"Student 366","OK",{"$f":"VLOOKUP(I370,{\"Excellent\",4;\"Poor\",1;\"Good\",3;\"OK\",2},2,0)","v":2},null,null,null,null,-145,-98.333333333333329,null,null,null,null,null,null,null,174.81666666666666]
["Student 367","Nokia",{"$f":"VLOOKUP(B371,{\"iPhone\",1;\"Motorola\",2;\"Nokia\",3;\"Samsung\",4;\"Sony Erickson\",5;\"Sprint\",6},2,0)","v":3},null,null,null,null,"Student 367","Excellent",{"$f":"VLOOKUP(I371,{\"Excellent\",4;\"Poor\",1;\"Good\",3;\"OK\",2},2,0)","v":4},null,null,null,null,-146,-98.888888888888886,null,null,null,null,null,null,null,174.26111111111109]
["Student 368","iPhone",{"$f":"VLOOKUP(B372,{\"iPhone\",1;\"Motorola\",2;\"Nokia\",3;\"Samsung\",4;\"Sony Erickson\",5;\"Sprint\",6},2,0)","v":1},null,null,null,null,"Student 368","Poor",{"$f":"VLOOKUP(I372,{\"Excellent\",4;\"Poor\",1;\"Good\",3;\"OK\",2},2,0)","v":1},null,null,null,null,-147,-99.444444444444443,null,null,null,null,null,null,null,173.70555555555552]
["Student 369","Sony Erickson",{"$f":"VLOOKUP(B373,{\"iPhone\",1;\"Motorola\",2;\"Nokia\",3;\"Samsung\",4;\"Sony Erickson\",5;\"Sprint\",6},2,0)","v":5},null,null,null,null,"Student 369","OK",{"$f":"VLOOKUP(I373,{\"Excellent\",4;\"Poor\",1;\"Good\",3;\"OK\",2},2,0)","v":2},null,null,null,null,-148,-100,null,null,null,null,null,null,null,173.14999999999998]
["Student 370","Nokia",{"$f":"VLOOKUP(B374,{\"iPhone\",1;\"Motorola\",2;\"Nokia\",3;\"Samsung\",4;\"Sony Erickson\",5;\"Sprint\",6},2,0)","v":3},null,null,null,null,"Student 370","Poor",{"$f":"VLOOKUP(I374,{\"Excellent\",4;\"Poor\",1;\"Good\",3;\"OK\",2},2,0)","v":1},null,null,null,null,-149,-100.55555555555556,null,null,null,null,null,null,null,172.59444444444443]
["Student 371","Samsung",{"$f":"VLOOKUP(B375,{\"iPhone\",1;\"Motorola\",2;\"Nokia\",3;\"Samsung\",4;\"Sony Erickson\",5;\"Sprint\",6},2,0)","v":4},null,null,null,null,"Student 371","Poor",{"$f":"VLOOKUP(I375,{\"Excellent\",4;\"Poor\",1;\"Good\",3;\"OK\",2},2,0)","v":1},null,null,null,null,-150,-101.11111111111111,null,null,null,null,null,null,null,172.03888888888886]
["Student 372","iPhone",{"$f":"VLOOKUP(B376,{\"iPhone\",1;\"Motorola\",2;\"Nokia\",3;\"Samsung\",4;\"Sony Erickson\",5;\"Sprint\",6},2,0)","v":1},null,null,null,null,"Student 372","Good",{"$f":"VLOOKUP(I376,{\"Excellent\",4;\"Poor\",1;\"Good\",3;\"OK\",2},2,0)","v":3},null,null,null,null,-151,-101.66666666666666,null,null,null,null,null,null,null,171.48333333333332]
["Student 373","Motorola",{"$f":"VLOOKUP(B377,{\"iPhone\",1;\"Motorola\",2;\"Nokia\",3;\"Samsung\",4;\"Sony Erickson\",5;\"Sprint\",6},2,0)","v":2},null,null,null,null,"Student 373","Poor",{"$f":"VLOOKUP(I377,{\"Excellent\",4;\"Poor\",1;\"Good\",3;\"OK\",2},2,0)","v":1},null,null,null,null,-152,-102.22222222222221,null,null,null,null,null,null,null,170.92777777777775]
["Student 374","iPhone",{"$f":"VLOOKUP(B378,{\"iPhone\",1;\"Motorola\",2;\"Nokia\",3;\"Samsung\",4;\"Sony Erickson\",5;\"Sprint\",6},2,0)","v":1},null,null,null,null,"Student 374","Poor",{"$f":"VLOOKUP(I378,{\"Excellent\",4;\"Poor\",1;\"Good\",3;\"OK\",2},2,0)","v":1},null,null,null,null,-153,-102.77777777777777,null,null,null,null,null,null,null,170.37222222222221]
["Student 375","Sprint",{"$f":"VLOOKUP(B379,{\"iPhone\",1;\"Motorola\",2;\"Nokia\",3;\"Samsung\",4;\"Sony Erickson\",5;\"Sprint\",6},2,0)","v":6},null,null,null,null,"Student 375","Good",{"$f":"VLOOKUP(I379,{\"Excellent\",4;\"Poor\",1;\"Good\",3;\"OK\",2},2,0)","v":3},null,null,null,null,-154,-103.33333333333333,null,null,null,null,null,null,null,169.81666666666666]
["Student 376","Nokia",{"$f":"VLOOKUP(B380,{\"iPhone\",1;\"Motorola\",2;\"Nokia\",3;\"Samsung\",4;\"Sony Erickson\",5;\"Sprint\",6},2,0)","v":3},null,null,null,null,"Student 376","OK",{"$f":"VLOOKUP(I380,{\"Excellent\",4;\"Poor\",1;\"Good\",3;\"OK\",2},2,0)","v":2},null,null,null,null,-155,-103.88888888888889,null,null,null,null,null,null,null,169.26111111111109]
["Student 377","Sony Erickson",{"$f":"VLOOKUP(B381,{\"iPhone\",1;\"Motorola\",2;\"Nokia\",3;\"Samsung\",4;\"Sony Erickson\",5;\"Sprint\",6},2,0)","v":5},null,null,null,null,"Student 377","Poor",{"$f":"VLOOKUP(I381,{\"Excellent\",4;\"Poor\",1;\"Good\",3;\"OK\",2},2,0)","v":1},null,null,null,null,-156,-104.44444444444444,null,null,null,null,null,null,null,168.70555555555552]
["Student 378","Sprint",{"$f":"VLOOKUP(B382,{\"iPhone\",1;\"Motorola\",2;\"Nokia\",3;\"Samsung\",4;\"Sony Erickson\",5;\"Sprint\",6},2,0)","v":6},null,null,null,null,"Student 378","Poor",{"$f":"VLOOKUP(I382,{\"Excellent\",4;\"Poor\",1;\"Good\",3;\"OK\",2},2,0)","v":1},null,null,null,null,-157,-105,null,null,null,null,null,null,null,168.14999999999998]
["Student 379","Samsung",{"$f":"VLOOKUP(B383,{\"iPhone\",1;\"Motorola\",2;\"Nokia\",3;\"Samsung\",4;\"Sony Erickson\",5;\"Sprint\",6},2,0)","v":4},null,null,null,null,"Student 379","OK",{"$f":"VLOOKUP(I383,{\"Excellent\",4;\"Poor\",1;\"Good\",3;\"OK\",2},2,0)","v":2},null,null,null,null,-158,-105.55555555555556,null,null,null,null,null,null,null,167.59444444444443]
["Student 380","Samsung",{"$f":"VLOOKUP(B384,{\"iPhone\",1;\"Motorola\",2;\"Nokia\",3;\"Samsung\",4;\"Sony Erickson\",5;\"Sprint\",6},2,0)","v":4},null,null,null,null,"Student 380","Poor",{"$f":"VLOOKUP(I384,{\"Excellent\",4;\"Poor\",1;\"Good\",3;\"OK\",2},2,0)","v":1},null,null,null,null,-159,-106.11111111111111,null,null,null,null,null,null,null,167.03888888888886]
["Student 381","Sprint",{"$f":"VLOOKUP(B385,{\"iPhone\",1;\"Motorola\",2;\"Nokia\",3;\"Samsung\",4;\"Sony Erickson\",5;\"Sprint\",6},2,0)","v":6},null,null,null,null,"Student 381","Good",{"$f":"VLOOKUP(I385,{\"Excellent\",4;\"Poor\",1;\"Good\",3;\"OK\",2},2,0)","v":3},null,null,null,null,-160,-106.66666666666666,null,null,null,null,null,null,null,166.48333333333332]
["Student 382","iPhone",{"$f":"VLOOKUP(B386,{\"iPhone\",1;\"Motorola\",2;\"Nokia\",3;\"Samsung\",4;\"Sony Erickson\",5;\"Sprint\",6},2,0)","v":1},null,null,null,null,"Student 382","Poor",{"$f":"VLOOKUP(I386,{\"Excellent\",4;\"Poor\",1;\"Good\",3;\"OK\",2},2,0)","v":1},null,null,null,null,-161,-107.22222222222221,null,null,null,null,null,null,null,165.92777777777775]
["Student 383","iPhone",{"$f":"VLOOKUP(B387,{\"iPhone\",1;\"Motorola\",2;\"Nokia\",3;\"Samsung\",4;\"Sony Erickson\",5;\"Sprint\",6},2,0)","v":1},null,null,null,null,"Student 383","Poor",{"$f":"VLOOKUP(I387,{\"Excellent\",4;\"Poor\",1;\"Good\",3;\"OK\",2},2,0)","v":1},null,null,null,null,-162,-107.77777777777777,null,null,null,null,null,null,null,165.37222222222221]
["Student 384","iPhone",{"$f":"VLOOKUP(B388,{\"iPhone\",1;\"Motorola\",2;\"Nokia\",3;\"Samsung\",4;\"Sony Erickson\",5;\"Sprint\",6},2,0)","v":1},null,null,null,null,"Student 384","OK",{"$f":"VLOOKUP(I388,{\"Excellent\",4;\"Poor\",1;\"Good\",3;\"OK\",2},2,0)","v":2},null,null,null,null,-163,-108.33333333333333,null,null,null,null,null,null,null,164.81666666666666]
["Student 385","iPhone",{"$f":"VLOOKUP(B389,{\"iPhone\",1;\"Motorola\",2;\"Nokia\",3;\"Samsung\",4;\"Sony Erickson\",5;\"Sprint\",6},2,0)","v":1},null,null,null,null,"Student 385","Excellent",{"$f":"VLOOKUP(I389,{\"Excellent\",4;\"Poor\",1;\"Good\",3;\"OK\",2},2,0)","v":4},null,null,null,null,-164,{"$f":"CONVERT(O389,\"F\",\"C\")","v":-108.88888888888889},null,null,null,null,null,null,null,164.26111111111109]
[null,null,null,null,null,null,null,null,null,null,null,null,null,null,-165,-109.44444444444444,null,null,null,null,null,null,null,{"$f":"CONVERT(O390,\"F\",\"K\")","v":163.70555555555552}]
[null,null,null,null,null,null,null,null,null,null,null,null,null,null,-166,-110,null,null,null,null,null,null,null,163.14999999999998]
[null,null,null,null,null,null,null,null,null,null,null,null,null,null,-167,-110.55555555555556,null,null,null,null,null,null,null,162.59444444444443]
[null,null,null,null,null,null,null,null,null,null,null,null,null,null,-168,-111.11111111111111,null,null,null,null,null,null,null,162.03888888888886]
[null,null,null,null,null,null,null,null,null,null,null,null,null,null,-169,-111.66666666666666,null,null,null,null,null,null,null,161.48333333333332]
[null,null,null,null,null,null,null,null,null,null,null,null,null,null,-170,-112.22222222222221,null,null,null,null,null,null,null,160.92777777777775]
[null,null,null,null,null,null,null,null,null,null,null,null,null,null,-171,-112.77777777777777,null,null,null,null,null,null,null,160.37222222222221]
[null,null,null,null,null,null,null,null,null,null,null,null,null,null,-172,-113.33333333333333,null,null,null,null,null,null,null,159.81666666666666]
[null,null,null,null,null,null,null,null,null,null,null,null,null,null,-173,-113.88888888888889,null,null,null,null,null,null,null,159.26111111111109]
[null,null,null,null,null,null,null,null,null,null,null,null,null,null,-174,-114.44444444444444,null,null,null,null,null,null,null,158.70555555555552]
[null,null,null,null,null,null,null,null,null,null,null,null,null,null,-175,-115,null,null,null,null,null,null,null,158.14999999999998]
[null,null,null,null,null,null,null,null,null,null,null,null,null,null,-176,-115.55555555555556,null,null,null,null,null,null,null,157.59444444444443]
[null,null,null,null,null,null,null,null,null,null,null,null,null,null,-177,-116.11111111111111,null,null,null,null,null,null,null,157.03888888888886]
[null,null,null,null,null,null,null,null,null,null,null,null,null,null,-178,-116.66666666666666,null,null,null,null,null,null,null,156.48333333333332]
[null,null,null,null,null,null,null,null,null,null,null,null,null,null,-179,-117.22222222222221,null,null,null,null,null,null,null,155.92777777777775]
[null,null,null,null,null,null,null,null,null,null,null,null,null,null,-180,-117.77777777777777,null,null,null,null,null,null,null,155.37222222222221]
[null,null,null,null,null,null,null,null,null,null,null,null,null,null,-181,-118.33333333333333,null,null,null,null,null,null,null,154.81666666666666]
[null,null,null,null,null,null,null,null,null,null,null,null,null,null,-182,-118.88888888888889,null,null,null,null,null,null,null,154.26111111111109]
[null,null,null,null,null,null,null,null,null,null,null,null,null,null,-183,-119.44444444444444,null,null,null,null,null,null,null,153.70555555555552]
[null,null,null,null,null,null,null,null,null,null,null,null,null,null,-184,-120,null,null,null,null,null,null,null,153.14999999999998]
[null,null,null,null,null,null,null,null,null,null,null,null,null,null,-185,-120.55555555555556,null,null,null,null,null,null,null,152.59444444444443]
[null,null,null,null,null,null,null,null,null,null,null,null,null,null,-186,-121.11111111111111,null,null,null,null,null,null,null,152.03888888888886]
[null,null,null,null,null,null,null,null,null,null,null,null,null,null,-187,-121.66666666666666,null,null,null,null,null,null,null,151.48333333333332]
[null,null,null,null,null,null,null,null,null,null,null,null,null,null,-188,-122.22222222222221,null,null,null,null,null,null,null,150.92777777777775]
[null,null,null,null,null,null,null,null,null,null,null,null,null,null,-189,-122.77777777777777,null,null,null,null,null,null,null,150.37222222222221]
[null,null,null,null,null,null,null,null,null,null,null,null,null,null,-190,-123.33333333333333,null,null,null,null,null,null,null,149.81666666666666]
[null,null,null,null,null,null,null,null,null,null,null,null,null,null,-191,-123.88888888888889,null,null,null,null,null,null,null,149.26111111111109]
[null,null,null,null,null,null,null,null,null,null,null,null,null,null,-192,-124.44444444444444,null,null,null,null,null,null,null,148.70555555555552]
[null,null,null,null,null,null,null,null,null,null,null,null,null,null,-193,-125,null,null,null,null,null,null,null,148.14999999999998]
[null,null,null,null,null,null,null,null,null,null,null,null,null,null,-194,-125.55555555555556,null,null,null,null,null,null,null,147.59444444444443]
[null,null,null,null,null,null,null,null,null,null,null,null,null,null,-195,-126.11111111111111,null,null,null,null,null,null,null,147.03888888888886]
[null,null,null,null,null,null,null,null,null,null,null,null,null,null,-196,-126.66666666666666,null,null,null,null,null,null,null,146.48333333333332]
[null,null,null,null,null,null,null,null,null,null,null,null,null,null,-197,-127.22222222222221,null,null,null,null,null,null,null,145.92777777777775]
[null,null,null,null,null,null,null,null,null,null,null,null,null,null,-198,-127.77777777777777,null,null,null,null,null,null,null,145.37222222222221]
[null,null,null,null,null,null,null,null,null,null,null,null,null,null,-199,-128.33333333333334,null,null,null,null,null,null,null,144.81666666666663]
[null,null,null,null,null,null,null,null,null,null,null,null,null,null,-200,-128.88888888888889,null,null,null,null,null,null,null,144.26111111111109]
[null,null,null,null,null,null,null,null,null,null,null,null,null,null,-201,-129.44444444444443,null,null,null,null,null,null,null,143.70555555555555]
[null,null,null,null,null,null,null,null,null,null,null,null,null,null,-202,-130,null,null,null,null,null,null,null,143.14999999999998]
[null,null,null,null,null,null,null,null,null,null,null,null,null,null,-203,-130.55555555555554,null,null,null,null,null,null,null,142.59444444444443]
[null,null,null,null,null,null,null,null,null,null,null,null,null,null,-204,-131.11111111111111,null,null,null,null,null,null,null,142.03888888888886]
[null,null,null,null,null,null,null,null,null,null,null,null,null,null,-205,-131.66666666666666,null,null,null,null,null,null,null,141.48333333333332]
[null,null,null,null,null,null,null,null,null,null,null,null,null,null,-206,-132.22222222222223,null,null,null,null,null,null,null,140.92777777777775]
[null,null,null,null,null,null,null,null,null,null,null,null,null,null,-207,-132.77777777777777,null,null,null,null,null,null,null,140.37222222222221]
[null,null,null,null,null,null,null,null,null,null,null,null,null,null,-208,-133.33333333333334,null,null,null,null,null,null,null,139.81666666666663]
[null,null,null,null,null,null,null,null,null,null,null,null,null,null,-209,-133.88888888888889,null,null,null,null,null,null,null,139.26111111111109]
[null,null,null,null,null,null,null,null,null,null,null,null,null,null,-210,-134.44444444444443,null,null,null,null,null,null,null,138.70555555555555]
[null,null,null,null,null,null,null,null,null,null,null,null,null,null,-211,-135,null,null,null,null,null,null,null,138.14999999999998]
[null,null,null,null,null,null,null,null,null,null,null,null,null,null,-212,-135.55555555555554,null,null,null,null,null,null,null,137.59444444444443]
[null,null,null,null,null,null,null,null,null,null,null,null,null,null,-213,-136.11111111111111,null,null,null,null,null,null,null,137.03888888888886]
[null,null,null,null,null,null,null,null,null,null,null,null,null,null,-214,-136.66666666666666,null,null,null,null,null,null,null,136.48333333333332]
[null,null,null,null,null,null,null,null,null,null,null,null,null,null,-215,-137.22222222222223,null,null,null,null,null,null,null,135.92777777777775]
[null,null,null,null,null,null,null,null,null,null,null,null,null,null,-216,-137.77777777777777,null,null,null,null,null,null,null,135.37222222222221]
[null,null,null,null,null,null,null,null,null,null,null,null,null,null,-217,-138.33333333333334,null,null,null,null,null,null,null,134.81666666666663]
[null,null,null,null,null,null,null,null,null,null,null,null,null,null,-218,-138.88888888888889,null,null,null,null,null,null,null,134.26111111111109]
[null,null,null,null,null,null,null,null,null,null,null,null,null,null,-219,-139.44444444444443,null,null,null,null,null,null,null,133.70555555555555]
[null,null,null,null,null,null,null,null,null,null,null,null,null,null,-220,-140,null,null,null,null,null,null,null,133.14999999999998]
[null,null,null,null,null,null,null,null,null,null,null,null,null,null,-221,-140.55555555555554,null,null,null,null,null,null,null,132.59444444444443]
[null,null,null,null,null,null,null,null,null,null,null,null,null,null,-222,-141.11111111111111,null,null,null,null,null,null,null,132.03888888888886]
[null,null,null,null,null,null,null,null,null,null,null,null,null,null,-223,-141.66666666666666,null,null,null,null,null,null,null,131.48333333333332]
[null,null,null,null,null,null,null,null,null,null,null,null,null,null,-224,-142.22222222222223,null,null,null,null,null,null,null,130.92777777777775]
[null,null,null,null,null,null,null,null,null,null,null,null,null,null,-225,-142.77777777777777,null,null,null,null,null,null,null,130.37222222222221]
[null,null,null,null,null,null,null,null,null,null,null,null,null,null,-226,-143.33333333333334,null,null,null,null,null,null,null,129.81666666666663]
[null,null,null,null,null,null,null,null,null,null,null,null,null,null,-227,-143.88888888888889,null,null,null,null,null,null,null,129.26111111111109]
[null,null,null,null,null,null,null,null,null,null,null,null,null,null,-228,{"$f":"CONVERT(O453,\"F\",\"C\")","v":-144.44444444444443},null,null,null,null,null,null,null,128.70555555555555]
[null,null,null,null,null,null,null,null,null,null,null,null,null,null,-229,-145,null,null,null,null,null,null,null,{"$f":"CONVERT(O454,\"F\",\"K\")","v":128.14999999999998}]
[null,null,null,null,null,null,null,null,null,null,null,null,null,null,-230,-145.55555555555554,null,null,null,null,null,null,null,127.59444444444443]
[null,null,null,null,null,null,null,null,null,null,null,null,null,null,-231,-146.11111111111111,null,null,null,null,null,null,null,127.03888888888886]
[null,null,null,null,null,null,null,null,null,null,null,null,null,null,-232,-146.66666666666666,null,null,null,null,null,null,null,126.48333333333332]
[null,null,null,null,null,null,null,null,null,null,null,null,null,null,-233,-147.22222222222223,null,null,null,null,null,null,null,125.92777777777775]
[null,null,null,null,null,null,null,null,null,null,null,null,null,null,-234,-147.77777777777777,null,null,null,null,null,null,null,125.37222222222221]
[null,null,null,null,null,null,null,null,null,null,null,null,null,null,-235,-148.33333333333334,null,null,null,null,null,null,null,124.81666666666663]
[null,null,null,null,null,null,null,null,null,null,null,null,null,null,-236,-148.88888888888889,null,null,null,null,null,null,null,124.26111111111109]
[null,null,null,null,null,null,null,null,null,null,null,null,null,null,-237,-149.44444444444443,null,null,null,null,null,null,null,123.70555555555555]
[null,null,null,null,null,null,null,null,null,null,null,null,null,null,-238,-150,null,null,null,null,null,null,null,123.14999999999998]
[null,null,null,null,null,null,null,null,null,null,null,null,null,null,-239,-150.55555555555554,null,null,null,null,null,null,null,122.59444444444443]
[null,null,null,null,null,null,null,null,null,null,null,null,null,null,-240,-151.11111111111111,null,null,null,null,null,null,null,122.03888888888886]
[null,null,null,null,null,null,null,null,null,null,null,null,null,null,-241,-151.66666666666666,null,null,null,null,null,null,null,121.48333333333332]
[null,null,null,null,null,null,null,null,null,null,null,null,null,null,-242,-152.22222222222223,null,null,null,null,null,null,null,120.92777777777775]
[null,null,null,null,null,null,null,null,null,null,null,null,null,null,-243,-152.77777777777777,null,null,null,null,null,null,null,120.37222222222221]
[null,null,null,null,null,null,null,null,null,null,null,null,null,null,-244,-153.33333333333334,null,null,null,null,null,null,null,119.81666666666663]
[null,null,null,null,null,null,null,null,null,null,null,null,null,null,-245,-153.88888888888889,null,null,null,null,null,null,null,119.26111111111109]
[null,null,null,null,null,null,null,null,null,null,null,null,null,null,-246,-154.44444444444443,null,null,null,null,null,null,null,118.70555555555555]
[null,null,null,null,null,null,null,null,null,null,null,null,null,null,-247,-155,null,null,null,null,null,null,null,118.14999999999998]
[null,null,null,null,null,null,null,null,null,null,null,null,null,null,-248,-155.55555555555554,null,null,null,null,null,null,null,117.59444444444443]
[null,null,null,null,null,null,null,null,null,null,null,null,null,null,-249,-156.11111111111111,null,null,null,null,null,null,null,117.03888888888886]
[null,null,null,null,null,null,null,null,null,null,null,null,null,null,-250,-156.66666666666666,null,null,null,null,null,null,null,116.48333333333332]
[null,null,null,null,null,null,null,null,null,null,null,null,null,null,-251,-157.22222222222223,null,null,null,null,null,null,null,115.92777777777775]
[null,null,null,null,null,null,null,null,null,null,null,null,null,null,-252,-157.77777777777777,null,null,null,null,null,null,null,115.37222222222221]
[null,null,null,null,null,null,null,null,null,null,null,null,null,null,-253,-158.33333333333334,null,null,null,null,null,null,null,114.81666666666663]
[null,null,null,null,null,null,null,null,null,null,null,null,null,null,-254,-158.88888888888889,null,null,null,null,null,null,null,114.26111111111109]
[null,null,null,null,null,null,null,null,null,null,null,null,null,null,-255,-159.44444444444443,null,null,null,null,null,null,null,113.70555555555555]
[null,null,null,null,null,null,null,null,null,null,null,null,null,null,-256,-160,null,null,null,null,null,null,null,113.14999999999998]
[null,null,null,null,null,null,null,null,null,null,null,null,null,null,-257,-160.55555555555554,null,null,null,null,null,null,null,112.59444444444443]
[null,null,null,null,null,null,null,null,null,null,null,null,null,null,-258,-161.11111111111111,null,null,null,null,null,null,null,112.03888888888886]
[null,null,null,null,null,null,null,null,null,null,null,null,null,null,-259,-161.66666666666666,null,null,null,null,null,null,null,111.48333333333332]
[null,null,null,null,null,null,null,null,null,null,null,null,null,null,-260,-162.22222222222223,null,null,null,null,null,null,null,110.92777777777775]
[null,null,null,null,null,null,null,null,null,null,null,null,null,null,-261,-162.77777777777777,null,null,null,null,null,null,null,110.37222222222221]
[null,null,null,null,null,null,null,null,null,null,null,null,null,null,-262,-163.33333333333334,null,null,null,null,null,null,null,109.81666666666663]
[null,null,null,null,null,null,null,null,null,null,null,null,null,null,-263,-163.88888888888889,null,null,null,null,null,null,null,109.26111111111109]
[null,null,null,null,null,null,null,null,null,null,null,null,null,null,-264,-164.44444444444443,null,null,null,null,null,null,null,108.70555555555555]
[null,null,null,null,null,null,null,null,null,null,null,null,null,null,-265,-165,null,null,null,null,null,null,null,108.14999999999998]
[null,null,null,null,null,null,null,null,null,null,null,null,null,null,-266,-165.55555555555554,null,null,null,null,null,null,null,107.59444444444443]
[null,null,null,null,null,null,null,null,null,null,null,null,null,null,-267,-166.11111111111111,null,null,null,null,null,null,null,107.03888888888886]
[null,null,null,null,null,null,null,null,null,null,null,null,null,null,-268,-166.66666666666666,null,null,null,null,null,null,null,106.48333333333332]
[null,null,null,null,null,null,null,null,null,null,null,null,null,null,-269,-167.22222222222223,null,null,null,null,null,null,null,105.92777777777775]
[null,null,null,null,null,null,null,null,null,null,null,null,null,null,-270,-167.77777777777777,null,null,null,null,null,null,null,105.37222222222221]
[null,null,null,null,null,null,null,null,null,null,null,null,null,null,-271,-168.33333333333334,null,null,null,null,null,null,null,104.81666666666663]
[null,null,null,null,null,null,null,null,null,null,null,null,null,null,-272,-168.88888888888889,null,null,null,null,null,null,null,104.26111111111109]
[null,null,null,null,null,null,null,null,null,null,null,null,null,null,-273,-169.44444444444443,null,null,null,null,null,null,null,103.70555555555555]
[null,null,null,null,null,null,null,null,null,null,null,null,null,null,-274,-170,null,null,null,null,null,null,null,103.14999999999998]
[null,null,null,null,null,null,null,null,null,null,null,null,null,null,-275,-170.55555555555554,null,null,null,null,null,null,null,102.59444444444443]
[null,null,null,null,null,null,null,null,null,null,null,null,null,null,-276,-171.11111111111111,null,null,null,null,null,null,null,102.03888888888886]
[null,null,null,null,null,null,null,null,null,null,null,null,null,null,-277,-171.66666666666666,null,null,null,null,null,null,null,101.48333333333332]
[null,null,null,null,null,null,null,null,null,null,null,null,null,null,-278,-172.22222222222223,null,null,null,null,null,null,null,100.92777777777775]
[null,null,null,null,null,null,null,null,null,null,null,null,null,null,-279,-172.77777777777777,null,null,null,null,null,null,null,100.37222222222221]
[null,null,null,null,null,null,null,null,null,null,null,null,null,null,-280,-173.33333333333334,null,null,null,null,null,null,null,99.816666666666634]
[null,null,null,null,null,null,null,null,null,null,null,null,null,null,-281,-173.88888888888889,null,null,null,null,null,null,null,99.261111111111092]
[null,null,null,null,null,null,null,null,null,null,null,null,null,null,-282,-174.44444444444443,null,null,null,null,null,null,null,98.705555555555549]
[null,null,null,null,null,null,null,null,null,null,null,null,null,null,-283,-175,null,null,null,null,null,null,null,98.149999999999977]
[null,null,null,null,null,null,null,null,null,null,null,null,null,null,-284,-175.55555555555554,null,null,null,null,null,null,null,97.594444444444434]
[null,null,null,null,null,null,null,null,null,null,null,null,null,null,-285,-176.11111111111111,null,null,null,null,null,null,null,97.038888888888863]
[null,null,null,null,null,null,null,null,null,null,null,null,null,null,-286,-176.66666666666666,null,null,null,null,null,null,null,96.48333333333332]
[null,null,null,null,null,null,null,null,null,null,null,null,null,null,-287,-177.22222222222223,null,null,null,null,null,null,null,95.927777777777749]
[null,null,null,null,null,null,null,null,null,null,null,null,null,null,-288,-177.77777777777777,null,null,null,null,null,null,null,95.372222222222206]
[null,null,null,null,null,null,null,null,null,null,null,null,null,null,-289,-178.33333333333334,null,null,null,null,null,null,null,94.816666666666634]
[null,null,null,null,null,null,null,null,null,null,null,null,null,null,-290,-178.88888888888889,null,null,null,null,null,null,null,94.261111111111092]
[null,null,null,null,null,null,null,null,null,null,null,null,null,null,-291,-179.44444444444443,null,null,null,null,null,null,null,93.705555555555549]
[null,null,null,null,null,null,null,null,null,null,null,null,null,null,-292,{"$f":"CONVERT(O517,\"F\",\"C\")","v":-180},null,null,null,null,null,null,null,93.149999999999977]
[null,null,null,null,null,null,null,null,null,null,null,null,null,null,-293,-180.55555555555554,null,null,null,null,null,null,null,{"$f":"CONVERT(O518,\"F\",\"K\")","v":92.594444444444434}]
[null,null,null,null,null,null,null,null,null,null,null,null,null,null,-294,-181.11111111111111,null,null,null,null,null,null,null,92.038888888888863]
[null,null,null,null,null,null,null,null,null,null,null,null,null,null,-295,-181.66666666666666,null,null,null,null,null,null,null,91.48333333333332]
[null,null,null,null,null,null,null,null,null,null,null,null,null,null,-296,-182.22222222222223,null,null,null,null,null,null,null,90.927777777777749]
[null,null,null,null,null,null,null,null,null,null,null,null,null,null,-297,-182.77777777777777,null,null,null,null,null,null,null,90.372222222222206]
[null,null,null,null,null,null,null,null,null,null,null,null,null,null,-298,-183.33333333333334,null,null,null,null,null,null,null,89.816666666666634]
[null,null,null,null,null,null,null,null,null,null,null,null,null,null,-299,-183.88888888888889,null,null,null,null,null,null,null,89.261111111111092]
[null,null,null,null,null,null,null,null,null,null,null,null,null,null,-300,-184.44444444444443,null,null,null,null,null,null,null,88.705555555555549]
[null,null,null,null,null,null,null,null,null,null,null,null,null,null,-301,-185,null,null,null,null,null,null,null,88.149999999999977]
[null,null,null,null,null,null,null,null,null,null,null,null,null,null,-302,-185.55555555555554,null,null,null,null,null,null,null,87.594444444444434]
[null,null,null,null,null,null,null,null,null,null,null,null,null,null,-303,-186.11111111111111,null,null,null,null,null,null,null,87.038888888888863]
[null,null,null,null,null,null,null,null,null,null,null,null,null,null,-304,-186.66666666666666,null,null,null,null,null,null,null,86.48333333333332]
[null,null,null,null,null,null,null,null,null,null,null,null,null,null,-305,-187.22222222222223,null,null,null,null,null,null,null,85.927777777777749]
[null,null,null,null,null,null,null,null,null,null,null,null,null,null,-306,-187.77777777777777,null,null,null,null,null,null,null,85.372222222222206]
[null,null,null,null,null,null,null,null,null,null,null,null,null,null,-307,-188.33333333333334,null,null,null,null,null,null,null,84.816666666666634]
[null,null,null,null,null,null,null,null,null,null,null,null,null,null,-308,-188.88888888888889,null,null,null,null,null,null,null,84.261111111111092]
[null,null,null,null,null,null,null,null,null,null,null,null,null,null,-309,-189.44444444444443,null,null,null,null,null,null,null,83.705555555555549]
[null,null,null,null,null,null,null,null,null,null,null,null,null,null,-310,-190,null,null,null,null,null,null,null,83.149999999999977]
[null,null,null,null,null,null,null,null,null,null,null,null,null,null,-311,-190.55555555555554,null,null,null,null,null,null,null,82.594444444444434]
[null,null,null,null,null,null,null,null,null,null,null,null,null,null,-312,-191.11111111111111,null,null,null,null,null,null,null,82.038888888888863]
[null,null,null,null,null,null,null,null,null,null,null,null,null,null,-313,-191.66666666666666,null,null,null,null,null,null,null,81.48333333333332]
[null,null,null,null,null,null,null,null,null,null,null,null,null,null,-314,-192.22222222222223,null,null,null,null,null,null,null,80.927777777777749]
[null,null,null,null,null,null,null,null,null,null,null,null,null,null,-315,-192.77777777777777,null,null,null,null,null,null,null,80.372222222222206]
[null,null,null,null,null,null,null,null,null,null,null,null,null,null,-316,-193.33333333333331,null,null,null,null,null,null,null,79.816666666666663]
[null,null,null,null,null,null,null,null,null,null,null,null,null,null,-317,-193.88888888888889,null,null,null,null,null,null,null,79.261111111111092]
[null,null,null,null,null,null,null,null,null,null,null,null,null,null,-318,-194.44444444444443,null,null,null,null,null,null,null,78.705555555555549]
[null,null,null,null,null,null,null,null,null,null,null,null,null,null,-319,-195,null,null,null,null,null,null,null,78.149999999999977]
[null,null,null,null,null,null,null,null,null,null,null,null,null,null,-320,-195.55555555555554,null,null,null,null,null,null,null,77.594444444444434]
[null,null,null,null,null,null,null,null,null,null,null,null,null,null,-321,-196.11111111111111,null,null,null,null,null,null,null,77.038888888888863]
[null,null,null,null,null,null,null,null,null,null,null,null,null,null,-322,-196.66666666666666,null,null,null,null,null,null,null,76.48333333333332]
[null,null,null,null,null,null,null,null,null,null,null,null,null,null,-323,-197.22222222222223,null,null,null,null,null,null,null,75.927777777777749]
[null,null,null,null,null,null,null,null,null,null,null,null,null,null,-324,-197.77777777777777,null,null,null,null,null,null,null,75.372222222222206]
[null,null,null,null,null,null,null,null,null,null,null,null,null,null,-325,-198.33333333333331,null,null,null,null,null,null,null,74.816666666666663]
[null,null,null,null,null,null,null,null,null,null,null,null,null,null,-326,-198.88888888888889,null,null,null,null,null,null,null,74.261111111111092]
[null,null,null,null,null,null,null,null,null,null,null,null,null,null,-327,-199.44444444444443,null,null,null,null,null,null,null,73.705555555555549]
[null,null,null,null,null,null,null,null,null,null,null,null,null,null,-328,-200,null,null,null,null,null,null,null,73.149999999999977]
[null,null,null,null,null,null,null,null,null,null,null,null,null,null,-329,-200.55555555555554,null,null,null,null,null,null,null,72.594444444444434]
[null,null,null,null,null,null,null,null,null,null,null,null,null,null,-330,-201.11111111111111,null,null,null,null,null,null,null,72.038888888888863]
[null,null,null,null,null,null,null,null,null,null,null,null,null,null,-331,-201.66666666666666,null,null,null,null,null,null,null,71.48333333333332]
[null,null,null,null,null,null,null,null,null,null,null,null,null,null,-332,-202.22222222222223,null,null,null,null,null,null,null,70.927777777777749]
[null,null,null,null,null,null,null,null,null,null,null,null,null,null,-333,-202.77777777777777,null,null,null,null,null,null,null,70.372222222222206]
[null,null,null,null,null,null,null,null,null,null,null,null,null,null,-334,-203.33333333333331,null,null,null,null,null,null,null,69.816666666666663]
[null,null,null,null,null,null,null,null,null,null,null,null,null,null,-335,-203.88888888888889,null,null,null,null,null,null,null,69.261111111111092]
[null,null,null,null,null,null,null,null,null,null,null,null,null,null,-336,-204.44444444444443,null,null,null,null,null,null,null,68.705555555555549]
[null,null,null,null,null,null,null,null,null,null,null,null,null,null,-337,-205,null,null,null,null,null,null,null,68.149999999999977]
[null,null,null,null,null,null,null,null,null,null,null,null,null,null,-338,-205.55555555555554,null,null,null,null,null,null,null,67.594444444444434]
[null,null,null,null,null,null,null,null,null,null,null,null,null,null,-339,-206.11111111111111,null,null,null,null,null,null,null,67.038888888888863]
[null,null,null,null,null,null,null,null,null,null,null,null,null,null,-340,-206.66666666666666,null,null,null,null,null,null,null,66.48333333333332]
[null,null,null,null,null,null,null,null,null,null,null,null,null,null,-341,-207.22222222222223,null,null,null,null,null,null,null,65.927777777777749]
[null,null,null,null,null,null,null,null,null,null,null,null,null,null,-342,-207.77777777777777,null,null,null,null,null,null,null,65.372222222222206]
[null,null,null,null,null,null,null,null,null,null,null,null,null,null,-343,-208.33333333333331,null,null,null,null,null,null,null,64.816666666666663]
[null,null,null,null,null,null,null,null,null,null,null,null,null,null,-344,-208.88888888888889,null,null,null,null,null,null,null,64.261111111111092]
[null,null,null,null,null,null,null,null,null,null,null,null,null,null,-345,-209.44444444444443,null,null,null,null,null,null,null,63.705555555555549]
[null,null,null,null,null,null,null,null,null,null,null,null,null,null,-346,-210,null,null,null,null,null,null,null,63.149999999999977]
[null,null,null,null,null,null,null,null,null,null,null,null,null,null,-347,-210.55555555555554,null,null,null,null,null,null,null,62.594444444444434]
[null,null,null,null,null,null,null,null,null,null,null,null,null,null,-348,-211.11111111111111,null,null,null,null,null,null,null,62.038888888888863]
[null,null,null,null,null,null,null,null,null,null,null,null,null,null,-349,-211.66666666666666,null,null,null,null,null,null,null,61.48333333333332]
[null,null,null,null,null,null,null,null,null,null,null,null,null,null,-350,-212.22222222222223,null,null,null,null,null,null,null,60.927777777777749]
[null,null,null,null,null,null,null,null,null,null,null,null,null,null,-351,-212.77777777777777,null,null,null,null,null,null,null,60.372222222222206]
[null,null,null,null,null,null,null,null,null,null,null,null,null,null,-352,-213.33333333333331,null,null,null,null,null,null,null,59.816666666666663]
[null,null,null,null,null,null,null,null,null,null,null,null,null,null,-353,-213.88888888888889,null,null,null,null,null,null,null,59.261111111111092]
[null,null,null,null,null,null,null,null,null,null,null,null,null,null,-354,-214.44444444444443,null,null,null,null,null,null,null,58.705555555555549]
[null,null,null,null,null,null,null,null,null,null,null,null,null,null,-355,-215,null,null,null,null,null,null,null,58.149999999999977]
[null,null,null,null,null,null,null,null,null,null,null,null,null,null,-356,{"$f":"CONVERT(O581,\"F\",\"C\")","v":-215.55555555555554},null,null,null,null,null,null,null,57.594444444444434]
[null,null,null,null,null,null,null,null,null,null,null,null,null,null,-357,-216.11111111111111,null,null,null,null,null,null,null,{"$f":"CONVERT(O582,\"F\",\"K\")","v":57.038888888888863}]
[null,null,null,null,null,null,null,null,null,null,null,null,null,null,-358,-216.66666666666666,null,null,null,null,null,null,null,56.48333333333332]
[null,null,null,null,null,null,null,null,null,null,null,null,null,null,-359,-217.22222222222223,null,null,null,null,null,null,null,55.927777777777749]
[null,null,null,null,null,null,null,null,null,null,null,null,null,null,-360,-217.77777777777777,null,null,null,null,null,null,null,55.372222222222206]
[null,null,null,null,null,null,null,null,null,null,null,null,null,null,-361,-218.33333333333331,null,null,null,null,null,null,null,54.816666666666663]
[null,null,null,null,null,null,null,null,null,null,null,null,null,null,-362,-218.88888888888889,null,null,null,null,null,null,null,54.261111111111092]
[null,null,null,null,null,null,null,null,null,null,null,null,null,null,-363,-219.44444444444443,null,null,null,null,null,null,null,53.705555555555549]
[null,null,null,null,null,null,null,null,null,null,null,null,null,null,-364,-220,null,null,null,null,null,null,null,53.149999999999977]
[null,null,null,null,null,null,null,null,null,null,null,null,null,null,-365,-220.55555555555554,null,null,null,null,null,null,null,52.594444444444434]
[null,null,null,null,null,null,null,null,null,null,null,null,null,null,-366,-221.11111111111111,null,null,null,null,null,null,null,52.038888888888863]
[null,null,null,null,null,null,null,null,null,null,null,null,null,null,-367,-221.66666666666666,null,null,null,null,null,null,null,51.48333333333332]
[null,null,null,null,null,null,null,null,null,null,null,null,null,null,-368,-222.22222222222223,null,null,null,null,null,null,null,50.927777777777749]
[null,null,null,null,null,null,null,null,null,null,null,null,null,null,-369,-222.77777777777777,null,null,null,null,null,null,null,50.372222222222206]
[null,null,null,null,null,null,null,null,null,null,null,null,null,null,-370,-223.33333333333331,null,null,null,null,null,null,null,49.816666666666663]
[null,null,null,null,null,null,null,null,null,null,null,null,null,null,-371,-223.88888888888889,null,null,null,null,null,null,null,49.261111111111092]
[null,null,null,null,null,null,null,null,null,null,null,null,null,null,-372,-224.44444444444443,null,null,null,null,null,null,null,48.705555555555549]
[null,null,null,null,null,null,null,null,null,null,null,null,null,null,-373,-225,null,null,null,null,null,null,null,48.149999999999977]
[null,null,null,null,null,null,null,null,null,null,null,null,null,null,-374,-225.55555555555554,null,null,null,null,null,null,null,47.594444444444434]
[null,null,null,null,null,null,null,null,null,null,null,null,null,null,-375,-226.11111111111111,null,null,null,null,null,null,null,47.038888888888863]
[null,null,null,null,null,null,null,null,null,null,null,null,null,null,-376,-226.66666666666666,null,null,null,null,null,null,null,46.48333333333332]
[null,null,null,null,null,null,null,null,null,null,null,null,null,null,-377,-227.22222222222223,null,null,null,null,null,null,null,45.927777777777749]
[null,null,null,null,null,null,null,null,null,null,null,null,null,null,-378,-227.77777777777777,null,null,null,null,null,null,null,45.372222222222206]
[null,null,null,null,null,null,null,null,null,null,null,null,null,null,-379,-228.33333333333331,null,null,null,null,null,null,null,44.816666666666663]
[null,null,null,null,null,null,null,null,null,null,null,null,null,null,-380,-228.88888888888889,null,null,null,null,null,null,null,44.261111111111092]
[null,null,null,null,null,null,null,null,null,null,null,null,null,null,-381,-229.44444444444443,null,null,null,null,null,null,null,43.705555555555549]
[null,null,null,null,null,null,null,null,null,null,null,null,null,null,-382,-230,null,null,null,null,null,null,null,43.149999999999977]
[null,null,null,null,null,null,null,null,null,null,null,null,null,null,-383,-230.55555555555554,null,null,null,null,null,null,null,42.594444444444434]
[null,null,null,null,null,null,null,null,null,null,null,null,null,null,-384,-231.11111111111111,null,null,null,null,null,null,null,42.038888888888863]
[null,null,null,null,null,null,null,null,null,null,null,null,null,null,-385,-231.66666666666666,null,null,null,null,null,null,null,41.48333333333332]
[null,null,null,null,null,null,null,null,null,null,null,null,null,null,-386,-232.22222222222223,null,null,null,null,null,null,null,40.927777777777749]
[null,null,null,null,null,null,null,null,null,null,null,null,null,null,-387,-232.77777777777777,null,null,null,null,null,null,null,40.372222222222206]
[null,null,null,null,null,null,null,null,null,null,null,null,null,null,-388,-233.33333333333331,null,null,null,null,null,null,null,39.816666666666663]
[null,null,null,null,null,null,null,null,null,null,null,null,null,null,-389,-233.88888888888889,null,null,null,null,null,null,null,39.261111111111092]
[null,null,null,null,null,null,null,null,null,null,null,null,null,null,-390,-234.44444444444443,null,null,null,null,null,null,null,38.705555555555549]
[null,null,null,null,null,null,null,null,null,null,null,null,null,null,-391,-235,null,null,null,null,null,null,null,38.149999999999977]
[null,null,null,null,null,null,null,null,null,null,null,null,null,null,-392,-235.55555555555554,null,null,null,null,null,null,null,37.594444444444434]
[null,null,null,null,null,null,null,null,null,null,null,null,null,null,-393,-236.11111111111111,null,null,null,null,null,null,null,37.038888888888863]
[null,null,null,null,null,null,null,null,null,null,null,null,null,null,-394,-236.66666666666666,null,null,null,null,null,null,null,36.48333333333332]
[null,null,null,null,null,null,null,null,null,null,null,null,null,null,-395,-237.22222222222223,null,null,null,null,null,null,null,35.927777777777749]
[null,null,null,null,null,null,null,null,null,null,null,null,null,null,-396,-237.77777777777777,null,null,null,null,null,null,null,35.372222222222206]
[null,null,null,null,null,null,null,null,null,null,null,null,null,null,-397,-238.33333333333331,null,null,null,null,null,null,null,34.816666666666663]
[null,null,null,null,null,null,null,null,null,null,null,null,null,null,-398,-238.88888888888889,null,null,null,null,null,null,null,34.261111111111092]
[null,null,null,null,null,null,null,null,null,null,null,null,null,null,-399,-239.44444444444443,null,null,null,null,null,null,null,33.705555555555549]
[null,null,null,null,null,null,null,null,null,null,null,null,null,null,-400,-240,null,null,null,null,null,null,null,33.149999999999977]
[null,null,null,null,null,null,null,null,null,null,null,null,null,null,-401,-240.55555555555554,null,null,null,null,null,null,null,32.594444444444434]
[null,null,null,null,null,null,null,null,null,null,null,null,null,null,-402,-241.11111111111111,null,null,null,null,null,null,null,32.038888888888863]
[null,null,null,null,null,null,null,null,null,null,null,null,null,null,-403,-241.66666666666666,null,null,null,null,null,null,null,31.48333333333332]
[null,null,null,null,null,null,null,null,null,null,null,null,null,null,-404,-242.22222222222223,null,null,null,null,null,null,null,30.927777777777749]
[null,null,null,null,null,null,null,null,null,null,null,null,null,null,-405,-242.77777777777777,null,null,null,null,null,null,null,30.372222222222206]
[null,null,null,null,null,null,null,null,null,null,null,null,null,null,-406,-243.33333333333331,null,null,null,null,null,null,null,29.816666666666663]
[null,null,null,null,null,null,null,null,null,null,null,null,null,null,-407,-243.88888888888889,null,null,null,null,null,null,null,29.261111111111092]
[null,null,null,null,null,null,null,null,null,null,null,null,null,null,-408,-244.44444444444443,null,null,null,null,null,null,null,28.705555555555549]
[null,null,null,null,null,null,null,null,null,null,null,null,null,null,-409,-245,null,null,null,null,null,null,null,28.149999999999977]
[null,null,null,null,null,null,null,null,null,null,null,null,null,null,-410,-245.55555555555554,null,null,null,null,null,null,null,27.594444444444434]
[null,null,null,null,null,null,null,null,null,null,null,null,null,null,-411,-246.11111111111111,null,null,null,null,null,null,null,27.038888888888863]
[null,null,null,null,null,null,null,null,null,null,null,null,null,null,-412,-246.66666666666666,null,null,null,null,null,null,null,26.48333333333332]
[null,null,null,null,null,null,null,null,null,null,null,null,null,null,-413,-247.22222222222223,null,null,null,null,null,null,null,25.927777777777749]
[null,null,null,null,null,null,null,null,null,null,null,null,null,null,-414,-247.77777777777777,null,null,null,null,null,null,null,25.372222222222206]
[null,null,null,null,null,null,null,null,null,null,null,null,null,null,-415,-248.33333333333331,null,null,null,null,null,null,null,24.816666666666663]
[null,null,null,null,null,null,null,null,null,null,null,null,null,null,-416,-248.88888888888889,null,null,null,null,null,null,null,24.261111111111092]
[null,null,null,null,null,null,null,null,null,null,null,null,null,null,-417,-249.44444444444443,null,null,null,null,null,null,null,23.705555555555549]
[null,null,null,null,null,null,null,null,null,null,null,null,null,null,-418,-250,null,null,null,null,null,null,null,23.149999999999977]
[null,null,null,null,null,null,null,null,null,null,null,null,null,null,-419,-250.55555555555554,null,null,null,null,null,null,null,22.594444444444434]
[null,null,null,null,null,null,null,null,null,null,null,null,null,null,-420,{"$f":"CONVERT(O645,\"F\",\"C\")","v":-251.11111111111111},null,null,null,null,null,null,null,22.038888888888863]
[null,null,null,null,null,null,null,null,null,null,null,null,null,null,-421,-251.66666666666666,null,null,null,null,null,null,null,{"$f":"CONVERT(O646,\"F\",\"K\")","v":21.48333333333332}]
[null,null,null,null,null,null,null,null,null,null,null,null,null,null,-422,-252.22222222222223,null,null,null,null,null,null,null,20.927777777777749]
[null,null,null,null,null,null,null,null,null,null,null,null,null,null,-423,-252.77777777777777,null,null,null,null,null,null,null,20.372222222222206]
[null,null,null,null,null,null,null,null,null,null,null,null,null,null,-424,-253.33333333333331,null,null,null,null,null,null,null,19.816666666666663]
[null,null,null,null,null,null,null,null,null,null,null,null,null,null,-425,-253.88888888888889,null,null,null,null,null,null,null,19.261111111111092]
[null,null,null,null,null,null,null,null,null,null,null,null,null,null,-426,-254.44444444444443,null,null,null,null,null,null,null,18.705555555555549]
[null,null,null,null,null,null,null,null,null,null,null,null,null,null,-427,-255,null,null,null,null,null,null,null,18.149999999999977]
[null,null,null,null,null,null,null,null,null,null,null,null,null,null,-428,-255.55555555555554,null,null,null,null,null,null,null,17.594444444444434]
[null,null,null,null,null,null,null,null,null,null,null,null,null,null,-429,-256.11111111111109,null,null,null,null,null,null,null,17.038888888888891]
[null,null,null,null,null,null,null,null,null,null,null,null,null,null,-430,-256.66666666666669,null,null,null,null,null,null,null,16.483333333333292]
[null,null,null,null,null,null,null,null,null,null,null,null,null,null,-431,-257.22222222222223,null,null,null,null,null,null,null,15.927777777777749]
[null,null,null,null,null,null,null,null,null,null,null,null,null,null,-432,-257.77777777777777,null,null,null,null,null,null,null,15.372222222222206]
[null,null,null,null,null,null,null,null,null,null,null,null,null,null,-433,-258.33333333333331,null,null,null,null,null,null,null,14.816666666666663]
[null,null,null,null,null,null,null,null,null,null,null,null,null,null,-434,-258.88888888888886,null,null,null,null,null,null,null,14.26111111111112]
[null,null,null,null,null,null,null,null,null,null,null,null,null,null,-435,-259.44444444444446,null,null,null,null,null,null,null,13.70555555555552]
[null,null,null,null,null,null,null,null,null,null,null,null,null,null,-436,-260,null,null,null,null,null,null,null,13.149999999999977]
[null,null,null,null,null,null,null,null,null,null,null,null,null,null,-437,-260.55555555555554,null,null,null,null,null,null,null,12.594444444444434]
[null,null,null,null,null,null,null,null,null,null,null,null,null,null,-438,-261.11111111111109,null,null,null,null,null,null,null,12.038888888888891]
[null,null,null,null,null,null,null,null,null,null,null,null,null,null,-439,-261.66666666666669,null,null,null,null,null,null,null,11.483333333333292]
[null,null,null,null,null,null,null,null,null,null,null,null,null,null,-440,-262.22222222222223,null,null,null,null,null,null,null,10.927777777777749]
[null,null,null,null,null,null,null,null,null,null,null,null,null,null,-441,-262.77777777777777,null,null,null,null,null,null,null,10.372222222222206]
[null,null,null,null,null,null,null,null,null,null,null,null,null,null,-442,-263.33333333333331,null,null,null,null,null,null,null,9.8166666666666629]
[null,null,null,null,null,null,null,null,null,null,null,null,null,null,-443,-263.88888888888886,null,null,null,null,null,null,null,9.26111111111112]
[null,null,null,null,null,null,null,null,null,null,null,null,null,null,-444,-264.44444444444446,null,null,null,null,null,null,null,8.7055555555555202]
[null,null,null,null,null,null,null,null,null,null,null,null,null,null,-445,-265,null,null,null,null,null,null,null,8.1499999999999773]
[null,null,null,null,null,null,null,null,null,null,null,null,null,null,-446,-265.55555555555554,null,null,null,null,null,null,null,7.5944444444444343]
[null,null,null,null,null,null,null,null,null,null,null,null,null,null,-447,-266.11111111111109,null,null,null,null,null,null,null,7.0388888888888914]
[null,null,null,null,null,null,null,null,null,null,null,null,null,null,-448,-266.66666666666669,null,null,null,null,null,null,null,6.4833333333332916]
[null,null,null,null,null,null,null,null,null,null,null,null,null,null,-449,-267.22222222222223,null,null,null,null,null,null,null,5.9277777777777487]
[null,null,null,null,null,null,null,null,null,null,null,null,null,null,-450,-267.77777777777777,null,null,null,null,null,null,null,5.3722222222222058]
[null,null,null,null,null,null,null,null,null,null,null,null,null,null,-451,-268.33333333333331,null,null,null,null,null,null,null,4.8166666666666629]
[null,null,null,null,null,null,null,null,null,null,null,null,null,null,-452,-268.88888888888886,null,null,null,null,null,null,null,4.26111111111112]
[null,null,null,null,null,null,null,null,null,null,null,null,null,null,-453,-269.44444444444446,null,null,null,null,null,null,null,3.7055555555555202]
[null,null,null,null,null,null,null,null,null,null,null,null,null,null,-454,-270,null,null,null,null,null,null,null,3.1499999999999773]
[null,null,null,null,null,null,null,null,null,null,null,null,null,null,-455,-270.55555555555554,null,null,null,null,null,null,null,2.5944444444444343]
[null,null,null,null,null,null,null,null,null,null,null,null,null,null,-456,-271.11111111111109,null,null,null,null,null,null,null,2.0388888888888914]
[null,null,null,null,null,null,null,null,null,null,null,null,null,null,-457,-271.66666666666669,null,null,null,null,null,null,null,1.4833333333332916]
[null,null,null,null,null,null,null,null,null,null,null,null,null,null,-458,-272.22222222222223,null,null,null,null,null,null,null,0.92777777777774872]
[null,null,null,null,null,null,null,null,null,null,null,null,null,null,-459,-272.77777777777777,null,null,null,null,null,null,null,0.3722222222222058]
[null,null,null,null,null,null,null,null,null,null,null,null,null,null,{"$f":"CONVERT(0,\"K\",\"F\")","v":-459.66999999999996},-273.14999999999998,null,null,null,null,null,null,null,0]

{"sheet":"SM(2)","index":23,"n_rows":14,"n_cols":9,"rows_kept":14,"cut":false,"hidden":false,"merged":[]}
[null,"Nominal",null,"Ordinal",null,"Interval",null,"Ratio"]
["Student","Phone","Eye Color","Rank In Class\n(1-38)","Rating of Teacher (Bad, Okay, Good, Excellent)","Body Temperature","SAT Score (600 to 2400)","Score On Final\n(0 - 100)","Money In Bank"]
["Joe","iPhone","Green",12,"Okay",98.2,1509,81,6232]
["Chin","Samsung","Brown",10,"Good",99,1777,87,5553]
["Sioux","iPhone","Hazel",16,"Okay",98.7,1681,84,3131]
[]
[]
[null,"Nominal:",null,"Ordinal:",null,"Interval:",null,"Ratio:"]
[null,"Category",null,"Category",null,"Category",null,"Category"]
[null,"No Rank",null,"Rank",null,"Rank",null,"Rank"]
[null,null,null,"Don't Know Distance",null,"Know Distance",null,"Know Distance"]
[null,null,null,"Between Each Rank",null,"Between Each Rank",null,"Between Each Rank"]
[null,null,null,null,null,"Zero just a Point On Scale",null,"Zero = Nothing Exists"]
[null,null,null,null,null,"Ratio Not Okay",null,"Ratio Okay"]

{"sheet":"SM(3)","index":24,"n_rows":20,"n_cols":4,"rows_kept":20,"cut":false,"hidden":false,"merged":[]}
["Scales (Levels) of Measurements: Determines what calculations and presentation you can perform and the \"amount of information contained in the data\"."]
["Nominal","Ordinal","Interval","Ratio"]
["Examples:","Examples:","Examples:","Examples:"]
["Car Names","Bad, Okay, Good, Excellent","IQ Test or SAT score (0 does not mean total absences of smartness)","Test in Stats Class 0 - 100 (0 means you got none correct)"]
["Phone Names","*, **, ***, ****","Celsius or Fahrenheit (0 just a point, 80 degree not twice as big as 40 degree).","Kelvin (0 means the absence of molecular movement and thus the absence of mass E = mc2)"]
["Eye Color","Rank In Class, Race or Voting: 1, 2, 3","Race Results: 5:01 m, 4:89 m, 4:82 m","Total Score In Class, 642, 619, 598\nVoting Totals: 10786, 8801, 2022"]
[null,"Jan, Feb, Mar","Elapsed Time (Timing)","Dollars (Money), Weight, Height, Length"]
["Characteristics:","Characteristics:","Characteristics:","Characteristics:"]
["Categories or Labels (words or numbers).","Categories or Labels (words or numbers).","Numbers.","Numbers."]
["No Rank.","Categories are ranked and have an order, but you don’t know the distance between each ranking or ordered item.","Categories are ranked and the distance between each rank is fixed. Usually a scale like temperature or IQ or timed racing results.","Categories are ranked and the distance between each rank is fixed and zero means that nothing exists and rations are meaninful."]
["Nothing intrinsic in category except a name. Category just names the item.","In a race with rankings: You can say who got 1st, 2nd, 3rd, but you don't know by how much","If zero exists, it is just a point on the scale. Zero does not mean that nothing exists.","Zero means that nothing exists."]
["Information:","Information:","Information:","Information:"]
["Name","Name and Rank, but not distance","Name and Rank, Distance","Name and Rank, Distance, and more (like % change)"]
["Types of Calculations","Types of Calculations","Types of Calculations","Types of Calculations"]
["Counting Only, Can't use Bell Curve","Counting, and occasionally if the category is a number other calculations like average are okay, Can't use Bell Curve","Arithmetic like adding, subtraction, averages okay, but ratio is meaningless. Can use Bell Curve.","Arithmetic okay. Ratios okay. Can use Bell Curve."]
["Example of a chart presentation","Example of a chart presentation","Example of a chart presentation","Example of a chart presentation"]
["Column Chart with gaps between columns and categories are equidistance from each other.","Column Chart with gaps between columns and categories are equidistance from each other.","Column with no gaps","Column with no gaps"]
["Types of Data"]
["Categorical (Qualitative) Data (Variable). Categories, labels or names are used to identify an attribute or characteristic of an element. Nominal or Ordinal. Non-numeric or numeric. Most of the time you are limited to counting.",null,"Quantitative Data (Variable). A number that tells us how much or how many. Interval or Ratio."]
[null,null,"**Discrete Number Variable = How Many (counting - there are gaps between numbers)\n**Continuous Number Variable = How Much (measuring and the measurement depends on the measurement instrument - there are no gaps). Money is continuous (stocks. Bonds, interest are often tracked with partial pennies)."]

{"sheet":"StatisticalStudies","index":25,"n_rows":0,"n_cols":0,"rows_kept":0,"cut":false,"hidden":false,"merged":[]}

{"sheet":"DataAcquisition","index":26,"n_rows":0,"n_cols":0,"rows_kept":0,"cut":false,"hidden":false,"merged":[]}

{"sheet":"Ethics","index":27,"n_rows":3,"n_cols":1,"rows_kept":3,"cut":false,"hidden":false,"merged":[]}
["Unethical Statistics"]
["Running multiple samples until you get the result you want."]
["Unrepresentative Samples"]

{"sheet":"D & I","index":28,"n_rows":3,"n_cols":1,"rows_kept":3,"cut":false,"hidden":false,"merged":[]}
["Descriptive Statistics: Tabular, Graphical and Numerical summaries of data."]
[]
["Inferential Statistics: The process of using data obtained from a sample to make estimates and test hypotheses about the characteristics of a population"]

{"sheet":"DescriptiveStatistics","index":29,"n_rows":54,"n_cols":9,"rows_kept":54,"cut":false,"hidden":false,"merged":[]}
["Descriptive Statistics: Tabular, Graphical and Numerical summaries of data."]
[]
["Data Set",null,null,null,"Descriptive Statistics: Numerical Measure"]
["Sample of Cost of Parts",null,null,null,"Mean = (Add up all values)/(Count all observation) = AVERAGE = ",{"$f":"AVERAGE(A5:A54)","v":78.98},"\"Typical Value\""]
[109]
[105,null,null,null,"Descriptive Statistics: Tabular Method"]
[105,null,null,null,"Part Cost Category","Part Frequency","Percent Frequency"]
[104,null,null,null,{"$f":"DOLLAR(C17,0)&\" up to \"&DOLLAR(D17,0)","v":"$50 up to $60"},{"$f":"COUNTIF($A$5:$A$54,\"<\"&D17)-COUNTIF($A$5:$A$54,\"<\"&C17)","v":2},{"$f":"F8/$F$14","v":0.04}]
[101,null,null,null,"$60 up to $70",13,{"$f":"F9/$F$14","v":0.26}]
[99,null,null,null,"$70 up to $80",16,0.32]
[98,null,null,null,"$80 up to $90",7,0.14000000000000001]
[97,null,null,null,"$90 up to $100",7,0.14000000000000001]
[97,null,null,null,"$100 up to $110",5,0.1]
[97,null,null,null,null,{"$f":"SUM(F8:F13)","v":50},{"$f":"SUM(G8:G13)","v":1}]
[93,null,null,null,null,null,null,null,"Statistical Inference (Creating reasonable estimates from a sample)"]
[91,null,null,null,null,null,null,null,"In our budget projections we will use the average of $79 to help project future parts costs. "]
[89,null,{"$f":"F48","v":50},{"$f":"C17+F$47","v":60}]
[88,null,{"$f":"D17","v":60},70]
[85,null,{"$f":"D18","v":70},80]
[83,null,{"$f":"D19","v":80},90]
[82,null,{"$f":"D20","v":90},100]
[80,null,{"$f":"D21","v":100},110]
[80]
[79]
[79]
[79]
[78]
[77]
[76]
[75]
[75,null,null,null,null,"Values"]
[75,null,null,null,"Row Labels","Frequency","% Frequency"]
[74,null,null,null,"50-59",2,0.04]
[74,null,null,null,"60-69",13,0.26]
[73,null,null,null,"70-79",16,0.32]
[72,null,null,null,"80-89",7,0.14000000000000001]
[72,null,null,null,"90-99",7,0.14000000000000001]
[71,null,null,null,"100-110",5,0.1]
[71,null,null,null,"Grand Total",50,1]
[69]
[69,null,null,null,"Count Observations =n =",{"$f":"COUNT(DescriptiveStatistics!$A$5:$A$54)","v":50}]
[69,null,null,null,"Max",{"$f":"MAX(DescriptiveStatistics!$A$5:$A$54)","v":109}]
[68,null,null,null,"Min",{"$f":"MIN(DescriptiveStatistics!$A$5:$A$54)","v":52}]
[68,null,null,null,"k = # of Classes = ",6]
[68,null,null,null,"k = # of Classes = 2^k >= n",{"$f":"2^F44>=F41","v":true}]
[67,null,null,null,"Estimate class width =",{"$f":"(F42-F43)/F44","v":9.5}]
[66,null,null,null,"ROUNDUP",{"$f":"ROUNDUP(F46,0)","v":10}]
[65,null,null,null,"Lower Limit of First =",50]
[62]
[62]
[62]
[62]
[57]
[52]

{"sheet":"InferentialStatisticsTerms","index":30,"n_rows":17,"n_cols":10,"rows_kept":17,"cut":false,"hidden":false,"merged":[]}
["Population","The set of all elements of interest in a particular study"]
["Sample","A subset of the population"]
["Statistical inference","The process of using data obtained from a sample to make estimates and test hypotheses about the characteristics of a population",null,null,null,null,null,null,null,50000]
["Census","Collecting data for a population"]
["Sample survey\n","Collecting data for a sample"]
[]
["Population:\nALL Students In Class","Sample:\nJust Some of the students in the class"]
["Student 01",{"$f":"INDEX($A$8:$A$17,RANDBETWEEN(1,COUNTA($A$8:$A$17)))","v":"Student 05"}]
["Student 02",{"$f":"INDEX($A$8:$A$17,RANDBETWEEN(1,COUNTA($A$8:$A$17)))","v":"Student 07"}]
["Student 03",{"$f":"INDEX($A$8:$A$17,RANDBETWEEN(1,COUNTA($A$8:$A$17)))","v":"Student 07"}]
["Student 04"]
["Student 05"]
["Student 06"]
["Student 07"]
["Student 08"]
["Student 09"]
["Student 10"]

{"sheet":"Science","index":31,"n_rows":602,"n_cols":8,"rows_kept":602,"cut":false,"hidden":false,"merged":[]}
["Production: Sampling box weight to see if filling machine is filling accurately (chapter 9)"]
["H0 : Mu = 10 grams"]
["H1 : Mu <> 10 grams"]
["Historical Average =",10,"grams"]
["Historical Standard Deviation =",0.5,"grams"]
["Level of Significance =",0.05]
["Level of Significance Divided by 2 =",{"$f":"B6/2","v":2.5000000000000001E-2}]
["Sample Mean = AVERAGE =",{"$f":"AVERAGE(A22:A99)","v":9.8971794871794874},"grams"]
["Sample Standard Deviation = STDEV =",{"$f":"STDEV(A22:A99)","v":0.21837985157463488},"grams"]
["Sample size = COUNT =",{"$f":"COUNT($A$22:$A$99)","v":78}]
["Standard Error",{"$f":"B5/SQRT(B10)","v":5.6613851707229781E-2},"grams"]
["z",{"$f":"(B8-B4)/B11","v":-1.8161723627679285}]
["X",{"$f":"B12*B11+B4","v":9.8971794871794874},{"$f":"D102","v":"P(9.897)"},null,null,null,null,{"$f":"VLOOKUP(B13,B103:C602,2)","v":0.77880751766756706}]
["p-value =",{"$f":"IF(B8<B4,2*NORMDIST(B8,B4,B5/SQRT(B10),1),2*(1-NORMDIST(B8,B4,B5/SQRT(B10),1)))","v":6.9343936162487352E-2}]
["p-value =",{"$f":"2*(1-NORMSDIST(ABS(B12)))","v":6.9343936162487463E-2}]
[{"$f":"IF(B15>B6,\"Because the p-value is greater than our alpha, it is reasonable to assume that the machine is filling accurately\",\" Because the p-value is less than or equal to our alpha, it is reasonable to assume that the machine is not filling accurately\")","v":"Because the p-value is greater than our alpha, it is reasonable to assume that the machine is filling accurately"}]
[]
[]
[]
[]
["Sample data"]
[{"$f":"RANDBETWEEN(9500,10300)/1000","v":9.7520000000000007},null,"A",{"$f":"\"The average for the population is \"&TEXT($B$8,\"0.00\")","v":"The average for the population is 9.90"}]
[9.8670000000000009,null,"B",{"$f":"\"A reasonable esitimate of the average for the population is \"&TEXT($B$8,\"0.00\")","v":"A reasonable esitimate of the average for the population is 9.90"}]
[9.9499999999999993]
[10.202]
[9.6630000000000003]
[10.206]
[10.273999999999999]
[9.609]
[9.7669999999999995]
[9.69]
[9.8620000000000001]
[9.83]
[9.6959999999999997]
[9.7230000000000008]
[9.8580000000000005]
[10.173]
[9.6590000000000007]
[9.9489999999999998]
[9.56]
[10.157999999999999]
[9.7889999999999997]
[10.215999999999999]
[9.6329999999999991]
[9.77]
[9.8179999999999996]
[10.08]
[9.99]
[9.8350000000000009]
[9.7309999999999999]
[9.7919999999999998]
[10.282]
[9.9550000000000001]
[10.000999999999999]
[9.61]
[9.6280000000000001]
[10.106999999999999]
[9.7010000000000005]
[9.58]
[10.194000000000001]
[10.223000000000001]
[10.3]
[9.6910000000000007]
[9.8190000000000008]
[9.99]
[9.6080000000000005]
[9.7210000000000001]
[10.215]
[9.8840000000000003]
[10.129]
[9.891]
[10.141999999999999]
[9.5980000000000008]
[10.105]
[10.202999999999999]
[10.076000000000001]
[9.8019999999999996]
[9.8170000000000002]
[10.023999999999999]
[10.242000000000001]
[9.5429999999999993]
[9.6080000000000005]
[9.8439999999999994]
[9.7539999999999996]
[10.147]
[{"$f":"RANDBETWEEN(9500,10300)/1000","v":10.050000000000001}]
[10.090999999999999]
[9.5310000000000006]
[9.875]
[9.6219999999999999]
[9.9329999999999998]
[9.8030000000000008]
[10.125]
[10.025]
[9.9649999999999999]
[9.8390000000000004]
[9.5909999999999993]
[10.085000000000001]
[9.9090000000000007]
[]
["Chart Data:"]
["z","X","P(Exactly x)",{"$f":"\"P(\"&ROUND(B8,3)&\")\"","v":"P(9.897)"},"P(alpha)"]
[{"$f":"(B103-B$4)/B$11","v":-35.327043465311391},8,{"$f":"NORMDIST(B103,B$4,B$5,0)","v":2.6766045152977074E-4},{"$f":"IF(C103<=B$14/2,C103,0)","v":2.6766045152977074E-4},{"$f":"IF(C103<=B$6/2,C103,0)","v":2.6766045152977074E-4}]
[-35.150408247984835,{"$f":"B103+0.01","v":8.01},2.8989512084778157E-4,2.8989512084778157E-4,2.8989512084778157E-4]
[-34.973773030658286,{"$f":"B104+0.01","v":8.02},3.1385126813106339E-4,3.1385126813106339E-4,3.1385126813106339E-4]
[-34.79713781333173,8.0299999999999994,3.3965119885868533E-4,3.3965119885868533E-4,3.3965119885868533E-4]
[-34.620502596005181,8.0399999999999991,3.6742499600491161E-4,3.6742499600491161E-4,3.6742499600491161E-4]
[-34.443867378678625,8.0499999999999989,3.9731094278554186E-4,3.9731094278554186E-4,3.9731094278554186E-4]
[-34.267232161352069,8.0599999999999987,4.2945596300072948E-4,4.2945596300072948E-4,4.2945596300072948E-4]
[-34.090596944025521,8.0699999999999985,4.640160793138794E-4,4.640160793138794E-4,4.640160793138794E-4]
[-33.913961726698965,8.0799999999999983,5.0115688978171489E-4,5.0115688978171489E-4,5.0115688978171489E-4]
[-33.737326509372416,8.0899999999999981,5.4105406292303377E-4,5.4105406292303377E-4,5.4105406292303377E-4]
[-33.56069129204586,8.0999999999999979,5.8389385158291068E-4,5.8389385158291068E-4,5.8389385158291068E-4]
[-33.384056074719304,8.1099999999999977,6.2987362581503248E-4,6.2987362581503248E-4,6.2987362581503248E-4]
[-33.207420857392755,8.1199999999999974,6.7920242496729633E-4,6.7920242496729633E-4,6.7920242496729633E-4]
[-33.030785640066199,8.1299999999999972,7.3210152911465571E-4,7.3210152911465571E-4,7.3210152911465571E-4]
[-32.854150422739643,8.139999999999997,7.8880504993829564E-4,7.8880504993829564E-4,7.8880504993829564E-4]
[-32.677515205413094,8.1499999999999968,8.4956054110148335E-4,8.4956054110148335E-4,8.4956054110148335E-4]
[-32.500879988086538,8.1599999999999966,9.1462962811969084E-4,9.1462962811969084E-4,9.1462962811969084E-4]
[-32.324244770759989,8.1699999999999964,9.8428865766576087E-4,9.8428865766576087E-4,9.8428865766576087E-4]
[-32.147609553433433,8.1799999999999962,1.0588293661898404E-3,1.0588293661898404E-3,1.0588293661898404E-3]
[-31.970974336106881,8.1899999999999959,1.1385595676684718E-3,1.1385595676684718E-3,1.1385595676684718E-3]
[-31.794339118780329,8.1999999999999957,1.2238038602275069E-3,1.2238038602275069E-3,1.2238038602275069E-3]
[-31.617703901453773,8.2099999999999955,1.3149043513093108E-3,1.3149043513093108E-3,1.3149043513093108E-3]
[-31.44106868412722,8.2199999999999953,1.412221400976026E-3,1.412221400976026E-3,1.412221400976026E-3]
[-31.264433466800668,8.2299999999999951,1.5161343828573679E-3,1.5161343828573679E-3,1.5161343828573679E-3]
[-31.087798249474115,8.2399999999999949,1.6270424621635578E-3,1.6270424621635578E-3,1.6270424621635578E-3]
[-30.911163032147563,8.2499999999999947,1.7453653900914553E-3,1.7453653900914553E-3,1.7453653900914553E-3]
[-30.734527814821007,8.2599999999999945,1.8715443138548878E-3,1.8715443138548878E-3,1.8715443138548878E-3]
[-30.557892597494455,8.2699999999999942,2.006042601468395E-3,2.006042601468395E-3,2.006042601468395E-3]
[-30.381257380167902,8.279999999999994,2.1493466803073815E-3,2.1493466803073815E-3,2.1493466803073815E-3]
[-30.20462216284135,8.2899999999999938,2.3019668883568706E-3,2.3019668883568706E-3,2.3019668883568706E-3]
[-30.027986945514794,8.2999999999999936,2.4644383369459301E-3,2.4644383369459301E-3,2.4644383369459301E-3]
[-29.851351728188241,8.3099999999999934,2.6373217836453645E-3,2.6373217836453645E-3,2.6373217836453645E-3]
[-29.674716510861689,8.3199999999999932,2.8212045138826369E-3,2.8212045138826369E-3,2.8212045138826369E-3]
[-29.498081293535137,8.329999999999993,3.0167012297004727E-3,3.0167012297004727E-3,3.0167012297004727E-3]
[-29.321446076208584,8.3399999999999928,3.2244549439540918E-3,3.2244549439540918E-3,3.2244549439540918E-3]
[-29.144810858882028,8.3499999999999925,3.4451378781071912E-3,3.4451378781071912E-3,3.4451378781071912E-3]
[-28.968175641555476,8.3599999999999923,3.6794523616483724E-3,3.6794523616483724E-3,3.6794523616483724E-3]
[-28.791540424228923,8.3699999999999921,3.9281317310085493E-3,3.9281317310085493E-3,3.9281317310085493E-3]
[-28.614905206902371,8.3799999999999919,4.1919412257156678E-3,4.1919412257156678E-3,4.1919412257156678E-3]
[-28.438269989575815,8.3899999999999917,4.4716788793768385E-3,4.4716788793768385E-3,4.4716788793768385E-3]
[-28.261634772249263,8.3999999999999915,4.7681764029294266E-3,4.7681764029294266E-3,4.7681764029294266E-3]
[-28.08499955492271,8.4099999999999913,5.0823000574527627E-3,5.0823000574527627E-3,5.0823000574527627E-3]
[-27.908364337596158,8.419999999999991,5.4149515136810971E-3,5.4149515136810971E-3,5.4149515136810971E-3]
[-27.731729120269605,8.4299999999999908,5.7670686952065453E-3,5.7670686952065453E-3,5.7670686952065453E-3]
[-27.555093902943049,8.4399999999999906,6.1396266022091268E-3,6.1396266022091268E-3,6.1396266022091268E-3]
[-27.378458685616497,8.4499999999999904,6.5336381123994548E-3,6.5336381123994548E-3,6.5336381123994548E-3]
[-27.201823468289945,8.4599999999999902,6.950154755709456E-3,6.950154755709456E-3,6.950154755709456E-3]
[-27.025188250963392,8.46999999999999,7.390267459117617E-3,7.390267459117617E-3,7.390267459117617E-3]
[-26.848553033636836,8.4799999999999898,7.8551072578490703E-3,7.8551072578490703E-3,7.8551072578490703E-3]
[-26.671917816310284,8.4899999999999896,8.3458459690473989E-3,8.3458459690473989E-3,8.3458459690473989E-3]
[-26.495282598983732,8.4999999999999893,8.8636968238754478E-3,8.8636968238754478E-3,8.8636968238754478E-3]
[-26.318647381657179,8.5099999999999891,9.4099150538673494E-3,9.4099150538673494E-3,9.4099150538673494E-3]
[-26.142012164330627,8.5199999999999889,9.9857984272240952E-3,9.9857984272240952E-3,9.9857984272240952E-3]
[-25.965376947004071,8.5299999999999887,1.0592687730621334E-2,1.0592687730621334E-2,1.0592687730621334E-2]
[-25.788741729677518,8.5399999999999885,1.1231967191981178E-2,1.1231967191981178E-2,1.1231967191981178E-2]
[-25.612106512350966,8.5499999999999883,1.1905064839550903E-2,1.1905064839550903E-2,1.1905064839550903E-2]
[-25.435471295024414,8.5599999999999881,1.2613452792530983E-2,1.2613452792530983E-2,1.2613452792530983E-2]
[-25.258836077697861,8.5699999999999878,1.3358647478404305E-2,1.3358647478404305E-2,1.3358647478404305E-2]
[-25.082200860371305,8.5799999999999876,1.4142209772037907E-2,1.4142209772037907E-2,1.4142209772037907E-2]
[-24.905565643044753,8.5899999999999874,1.4965745051560056E-2,1.4965745051560056E-2,1.4965745051560056E-2]
[-24.7289304257182,8.5999999999999872,1.5830903165958796E-2,1.5830903165958796E-2,1.5830903165958796E-2]
[-24.552295208391648,8.609999999999987,1.6739378309304848E-2,1.6739378309304848E-2,1.6739378309304848E-2]
[-24.375659991065092,8.6199999999999868,1.7692908796473155E-2,1.7692908796473155E-2,1.7692908796473155E-2]
[-24.19902477373854,8.6299999999999866,1.8693276735223197E-2,1.8693276735223197E-2,1.8693276735223197E-2]
[{"$f":"(B167-B$4)/B$11","v":-24.022389556411987},8.6399999999999864,{"$f":"NORMDIST(B167,B$4,B$5,0)","v":1.9742307589500806E-2},{"$f":"IF(C167<=B$14/2,C167,0)","v":1.9742307589500806E-2},{"$f":"IF(C167<=B$6/2,C167,0)","v":1.9742307589500806E-2}]
[-23.845754339085435,8.6499999999999861,2.0841869628843636E-2,2.0841869628843636E-2,2.0841869628843636E-2]
[-23.669119121758882,{"$f":"B168+0.01","v":8.6599999999999859},2.1993873258809502E-2,2.1993873258809502E-2,2.1993873258809502E-2]
[-23.492483904432326,8.6699999999999857,2.3200270227403372E-2,2.3200270227403372E-2,2.3200270227403372E-2]
[-23.315848687105774,8.6799999999999855,2.4463052702554073E-2,2.4463052702554073E-2,2.4463052702554073E-2]
[-23.139213469779222,8.6899999999999853,2.5784252215788624E-2,2.5784252215788624E-2,0]
[-22.962578252452669,8.6999999999999851,2.716593846736913E-2,2.716593846736913E-2,0]
[-22.785943035126113,8.7099999999999849,2.8610217988297156E-2,2.8610217988297156E-2,0]
[-22.609307817799561,8.7199999999999847,3.0119232654752533E-2,3.0119232654752533E-2,0]
[-22.432672600473008,8.7299999999999844,3.1695158050719131E-2,3.1695158050719131E-2,0]
[-22.256037383146456,8.7399999999999842,3.3340201674759477E-2,3.3340201674759477E-2,0]
[-22.079402165819904,8.749999999999984,3.505660098713427E-2,0,0]
[-21.902766948493348,8.7599999999999838,3.6846621293721134E-2,0,0]
[-21.726131731166795,8.7699999999999836,3.8712553463470793E-2,0,0]
[-21.549496513840243,8.7799999999999834,4.0656711476448372E-2,0,0]
[-21.37286129651369,8.7899999999999832,4.2681429799842081E-2,0,0]
[-21.196226079187134,8.7999999999999829,4.4789060589682121E-2,0,0]
[-21.019590861860582,8.8099999999999827,4.6981970716398869E-2,0,0]
[-20.84295564453403,8.8199999999999825,4.9262538612760948E-2,0,0]
[-20.666320427207477,8.8299999999999823,5.1633150943171099E-2,0,0]
[-20.489685209880925,8.8399999999999821,5.4096199093759061E-2,0,0]
[-20.313049992554369,8.8499999999999819,5.6654075483197612E-2,0,0]
[-20.136414775227816,8.8599999999999817,5.9309169694677581E-2,0,0]
[-19.959779557901264,8.8699999999999815,6.2063864430011308E-2,0,0]
[-19.783144340574712,8.8799999999999812,6.4920531287389477E-2,0,0]
[-19.606509123248156,8.889999999999981,6.7881526364892669E-2,0,0]
[-19.429873905921603,8.8999999999999808,7.0949185692456895E-2,0,0]
[-19.253238688595051,8.9099999999999806,7.412582049560669E-2,0,0]
[-19.076603471268498,8.9199999999999804,7.741371229490468E-2,0,0]
[-18.899968253941946,8.9299999999999802,8.081510784571376E-2,0,0]
[-18.72333303661539,8.93999999999998,8.4332213923533475E-2,0,0]
[-18.546697819288838,8.9499999999999797,8.7967191960846916E-2,0,0]
[-18.370062601962285,8.9599999999999795,9.172215254210199E-2,0,0]
[-18.193427384635733,8.9699999999999793,9.5599149764145921E-2,0,0]
[-18.016792167309177,8.9799999999999791,9.9600175470133057E-2,0,0]
[-17.840156949982624,8.9899999999999789,0.10372715336563228,0,0]
[-17.663521732656072,8.9999999999999787,0.10798193302636691,0,0]
[-17.48688651532952,9.0099999999999785,0.11236628380772651,0,0]
[-17.310251298002967,9.0199999999999783,0.11688188866689296,0,0]
[-17.133616080676411,9.029999999999978,0.12153033790911921,0,0]
[-16.956980863349859,9.0399999999999778,0.12631312287038651,0,0]
[-16.780345646023306,9.0499999999999776,0.13123162954934203,0,0]
[-16.603710428696754,9.0599999999999774,0.13628713220207755,0,0]
[-16.427075211370198,9.0699999999999772,0.14148078691395477,0,0]
[-16.250439994043646,9.079999999999977,0.14681362516330135,0,0]
[-16.073804776717093,9.0899999999999768,0.15228654739240177,0,0]
[-15.897169559390541,9.0999999999999766,0.157900316601775,0,0]
[-15.720534342063987,9.1099999999999763,0.16365555198427184,0,0]
[-15.543899124737434,9.1199999999999761,0.16955272261603022,0,0]
[-15.36726390741088,9.1299999999999759,0.17559214122179656,0,0]
[-15.190628690084328,9.1399999999999757,0.18177395803255053,0,0]
[-15.013993472757774,9.1499999999999755,0.18809815475375818,0,0]
[-14.837358255431221,9.1599999999999753,0.19456453866291884,0,0]
[-14.660723038104669,9.1699999999999751,0.20117273685536449,0,0]
[-14.484087820778115,9.1799999999999748,0.20792219065751125,0,0]
[-14.307452603451562,9.1899999999999746,0.21481215022694999,0,0]
[-14.130817386125008,9.1999999999999744,0.22184166935889293,0,0]
[-13.954182168798456,9.2099999999999742,0.22900960051856609,0,0]
[-13.777546951471901,9.219999999999974,0.23631459011914541,0,0]
[-13.600911734145349,9.2299999999999738,0.24375507406478383,0,0]
[-13.424276516818795,9.2399999999999736,0.2513292735781561,0,0]
[-13.247641299492242,9.2499999999999734,0.25903519133176273,0,0]
[-13.07100608216569,9.2599999999999731,0.26687060790198341,0,0]
[-12.894370864839136,9.2699999999999729,0.27483307856454181,0,0]
[{"$f":"(B231-B$4)/B$11","v":-12.717735647512583},9.2799999999999727,{"$f":"NORMDIST(B231,B$4,B$5,0)","v":0.28291993044965535},{"$f":"IF(C231<=B$14/2,C231,0)","v":0},{"$f":"IF(C231<=B$6/2,C231,0)","v":0}]
[-12.541100430186029,9.2899999999999725,0.29112826007467246,0,0]
[-12.364465212859477,{"$f":"B232+0.01","v":9.2999999999999723},0.2994549312714665,0,0]
[-12.187829995532923,9.3099999999999721,0.30789657352524369,0,0]
[-12.01119477820637,9.3199999999999719,0.31644958074074186,0,0]
[-11.834559560879816,9.3299999999999716,0.3251101104510436,0,0]
[-11.657924343553264,9.3399999999999714,0.33387408348340253,0,0]
[-11.481289126226711,9.3499999999999712,0.34273718409558906,0,0]
[-11.304653908900157,9.359999999999971,0.35169486059529864,0,0]
[-11.128018691573605,9.3699999999999708,0.36074232645413418,0,0]
[-10.95138347424705,9.3799999999999706,0.36987456192658363,0,0]
[-10.774748256920498,9.3899999999999704,0.37908631618325306,0,0]
[-10.598113039593944,9.3999999999999702,0.38837210996639809,0,0]
[-10.421477822267391,9.4099999999999699,0.39772623877452357,0,0]
[-10.244842604940839,9.4199999999999697,0.40714277658149028,0,0]
[-10.068207387614285,9.4299999999999695,0.41661558009418775,0,0]
[-9.8915721702877324,9.4399999999999693,0.42613829355140648,0,0]
[-9.7149369529611782,9.4499999999999691,0.43570435406507141,0,0]
[-9.5383017356346258,9.4599999999999689,0.44530699750349234,0,0]
[-9.3616665183080716,9.4699999999999687,0.45493926491474157,0,0]
[-9.1850313009815192,9.4799999999999685,0.46459400948670193,0,0]
[-9.008396083654965,9.4899999999999682,0.47426390403872848,0,0]
[-8.8317608663284126,9.499999999999968,0.48394144903825581,0,0]
[-8.6551256490018602,9.5099999999999678,0.49361898113405428,0,0]
[-8.478490431675306,9.5199999999999676,0.50328868219620293,0,0]
[-8.3018552143487536,9.5299999999999674,0.51294258885120925,0,0]
[-8.1252199970221994,9.5399999999999672,0.52257260249907467,0,0]
[-7.948584779695647,9.549999999999967,0.53217049979747799,0,0]
[-7.7719495623690937,9.5599999999999667,0.54172794359664433,0,0]
[-7.5953143450425404,9.5699999999999665,0.55123649430688171,0,0]
[-7.4186791277159871,9.5799999999999663,0.56068762167920938,0,0]
[-7.2420439103894338,9.5899999999999661,0.57007271697798279,0,0]
[-7.0654086930628806,9.5999999999999659,0.57938310552293393,0,0]
[-6.8887734757363273,9.6099999999999657,0.58861005957661872,0,0]
[-6.712138258409774,9.6199999999999655,0.5977448115518742,0,0]
[-6.5355030410832207,9.6299999999999653,0.60677856751256898,0,0]
[-6.3588678237566683,9.639999999999965,0.61570252093967492,0,0]
[-6.182232606430115,9.6499999999999648,0.62450786673349179,0,0]
[-6.0055973891035617,9.6599999999999646,0.63318581542175512,0,0]
[-5.8289621717770084,9.6699999999999644,0.64172760754231495,0,0]
[-5.6523269544504551,9.6799999999999642,0.65012452816813449,0,0]
[-5.4756917371239018,9.689999999999964,0.65836792154150015,0,0]
[-5.2990565197973485,9.6999999999999638,0.66644920578357036,0,0]
[-5.1224213024707952,9.7099999999999635,0.67435988764473265,0,0]
[-4.9457860851442428,9.7199999999999633,0.68209157726067715,0,0]
[-4.7691508678176895,9.7299999999999631,0.68963600287863924,0,0]
[-4.5925156504911362,9.7399999999999629,0.69698502551792219,0,0]
[-4.4158804331645829,9.7499999999999627,0.70413065352857274,0,0]
[-4.2392452158380296,9.7599999999999625,0.71106505701196854,0,0]
[-4.0626099985114763,9.7699999999999623,0.7177805820670643,0,0]
[-3.8859747811849235,9.7799999999999621,0.72426976482616023,0,0]
[-3.7093395638583702,9.7899999999999618,0.73052534524428447,0,0]
[-3.5327043465318169,9.7999999999999616,0.73654028060662402,0,0]
[-3.3560691292052636,9.8099999999999614,0.74230775871891019,0,0]
[-3.1794339118787103,9.8199999999999612,0.74782121074623586,0,0]
[-3.0027986945521574,9.829999999999961,0.75307432366648797,0,0]
[-2.8261634772256041,9.8399999999999608,0.75806105230538434,0,0]
[-2.6495282598990508,9.8499999999999606,0.76277563092103018,0,0]
[-2.4728930425724975,9.8599999999999604,0.76721258430694006,0,0]
[-2.2962578252459447,9.8699999999999601,0.77136673838361614,0,0]
[-2.1196226079193914,9.8799999999999599,0.77523323025001334,0,0]
[-1.9429873905928381,9.8899999999999597,0.77880751766756706,0,0]
[-1.766352173266285,9.8999999999999595,0.7820853879508991,0,0]
[-1.5897169559397317,9.9099999999999593,0.78506296624084626,0,0]
[{"$f":"(B295-B$4)/B$11","v":-1.4130817386131787},9.9199999999999591,{"$f":"NORMDIST(B295,B$4,B$5,0)","v":0.78773672313707144},{"$f":"IF(C295<=B$14/2,C295,0)","v":0},{"$f":"IF(C295<=B$6/2,C295,0)","v":0}]
[-1.2364465212866254,9.9299999999999589,0.7901034816692134,0,0]
[-1.0598113039600723,{"$f":"B296+0.01","v":9.9399999999999586},0.79216042358730432,0,0]
[-0.88317608663351899,9.9499999999999584,0.79390509495401695,0,0]
[-0.7065408693069658,9.9599999999999582,0.79533541102321248,0,0]
[-0.52990565198041262,9.969999999999958,0.79644966039120979,0,0]
[-0.35327043465385943,9.9799999999999578,0.79724650840920741,0,0]
[-0.17663521732730622,9.9899999999999576,0.79772499984733092,0,0]
[-7.5304122330474977E-13,9.9999999999999574,0.79788456080286541,0,0]
[0.17663521732580015,10.009999999999957,0.79772499984733358,0,0]
[0.35327043465235336,10.019999999999957,0.79724650840921274,0,0]
[0.52990565197890649,10.029999999999957,0.7964496603912179,0,0]
[0.70654086930545967,10.039999999999957,0.79533541102322336,0,0]
[0.88317608663201286,10.049999999999956,0.7939050949540305,0,0]
[1.0598113039585662,10.059999999999956,0.79216042358732053,0,0]
[1.2364465212851192,10.069999999999956,0.79010348166923228,0,0]
[1.4130817386116725,10.079999999999956,0.78773672313709286,0,0]
[1.5897169559382256,10.089999999999955,0.78506296624087035,0,0]
[1.7663521732647789,10.099999999999955,0.78208538795092586,0,0]
[1.942987390591332,10.109999999999955,0.77880751766759626,0,0]
[2.119622607917885,10.119999999999955,0.77523323025004509,0,0]
[2.2962578252444383,10.129999999999955,0.77136673838365033,0,0]
[2.4728930425709916,10.139999999999954,0.7672125843069767,0,0]
[2.6495282598975449,10.149999999999954,0.76277563092106915,0,0]
[2.8261634772240982,10.159999999999954,0.75806105230542564,0,0]
[3.0027986945506511,10.169999999999954,0.7530743236665316,0,0]
[3.1794339118772044,10.179999999999954,0.74782121074628183,0,0]
[3.3560691292037577,10.189999999999953,0.74230775871895838,0,0]
[3.532704346530311,10.199999999999953,0.73654028060667431,0,0]
[3.7093395638568638,10.209999999999953,0.73052534524433665,0,0]
[3.8859747811834171,10.219999999999953,0.72426976482621463,0,0]
[4.06260999850997,10.229999999999952,0.71778058206712059,0,0]
[4.2392452158365233,10.239999999999952,0.71106505701202671,0,0]
[4.4158804331630765,10.249999999999952,0.7041306535286328,0,0]
[4.5925156504896298,10.259999999999952,0.69698502551798402,0,0]
[4.7691508678161831,10.269999999999952,0.68963600287870275,0,0]
[4.9457860851427364,10.279999999999951,0.68209157726074221,0,0]
[5.1224213024692897,10.289999999999951,0.67435988764479937,0,0]
[5.299056519795843,10.299999999999951,0.66644920578363853,0,0]
[5.4756917371223963,10.309999999999951,0.65836792154156976,0,0]
[5.6523269544489487,10.319999999999951,0.65012452816820543,0,0]
[5.828962171775502,10.32999999999995,0.64172760754238711,0,0]
[6.0055973891020553,10.33999999999995,0.63318581542182861,0,0]
[6.1822326064286086,10.34999999999995,0.6245078667335664,0,0]
[6.3588678237551619,10.35999999999995,0.61570252093975042,0,0]
[6.5355030410817152,10.369999999999949,0.60677856751264569,0,0]
[6.7121382584082685,10.379999999999949,0.59774481155195169,0,0]
[6.8887734757348218,10.389999999999949,0.5886100595766971,0,0]
[7.0654086930613742,10.399999999999949,0.57938310552301286,0,0]
[7.2420439103879275,10.409999999999949,0.5700727169780625,0,0]
[7.4186791277144808,10.419999999999948,0.56068762167928976,0,0]
[7.5953143450410341,10.429999999999948,0.55123649430696242,0,0]
[7.7719495623675874,10.439999999999948,0.5417279435967256,0,0]
[7.9485847796941407,10.449999999999948,0.5321704997975597,0,0]
[8.1252199970206931,10.459999999999948,0.52257260249915671,0,0]
[8.3018552143472473,10.469999999999947,0.51294258885129151,0,0]
[8.4784904316737997,10.479999999999947,0.50328868219628531,0,0]
[8.6551256490003539,10.489999999999947,0.49361898113413677,0,0]
[8.8317608663269063,10.499999999999947,0.4839414490383383,0,0]
[9.0083960836534605,10.509999999999946,0.47426390403881091,0,0]
[9.1850313009800129,10.519999999999946,0.46459400948678431,0,0]
[9.3616665183065653,10.529999999999946,0.45493926491482378,0,0]
[9.5383017356331194,10.539999999999946,0.44530699750357439,0,0]
[9.7149369529596719,10.549999999999946,0.43570435406515318,0,0]
[{"$f":"(B359-B$4)/B$11","v":9.891572170286226},10.559999999999945,{"$f":"NORMDIST(B359,B$4,B$5,0)","v":0.42613829355148786},{"$f":"IF(C359<=B$14/2,C359,0)","v":0},{"$f":"IF(C359<=B$6/2,C359,0)","v":0}]
[10.068207387612778,10.569999999999945,0.41661558009426869,0,0]
[10.244842604939333,{"$f":"B360+0.01","v":10.579999999999945},0.40714277658157089,0,0]
[10.421477822265885,10.589999999999945,0.39772623877460361,0,0]
[10.598113039592439,10.599999999999945,0.38837210996647759,0,0]
[10.774748256918992,10.609999999999944,0.37908631618333194,0,0]
[10.951383474245544,10.619999999999944,0.36987456192666185,0,0]
[11.128018691572098,10.629999999999944,0.36074232645421161,0,0]
[11.304653908898651,10.639999999999944,0.35169486059537541,0,0]
[11.481289126225205,10.649999999999944,0.34273718409566512,0,0]
[11.657924343551757,10.659999999999943,0.33387408348347763,0,0]
[11.834559560878311,10.669999999999943,0.32511011045111787,0,0]
[12.011194778204864,10.679999999999943,0.31644958074081525,0,0]
[12.187829995531418,10.689999999999943,0.30789657352531613,0,0]
[12.36446521285797,10.699999999999942,0.29945493127153799,0,0]
[12.541100430184523,10.709999999999942,0.29112826007474296,0,0]
[12.717735647511077,10.719999999999942,0.28291993044972485,0,0]
[12.894370864837629,10.729999999999942,0.27483307856461026,0,0]
[13.071006082164184,10.739999999999942,0.26687060790205069,0,0]
[13.247641299490736,10.749999999999941,0.25903519133182901,0,0]
[13.42427651681729,10.759999999999941,0.25132927357822121,0,0]
[13.600911734143843,10.769999999999941,0.24375507406484789,0,0]
[13.777546951470395,10.779999999999941,0.23631459011920825,0,0]
[13.954182168796949,10.789999999999941,0.22900960051862779,0,0]
[14.130817386123502,10.79999999999994,0.22184166935895347,0,0]
[14.307452603450056,10.80999999999994,0.21481215022700934,0,0]
[14.484087820776608,10.81999999999994,0.20792219065756939,0,0]
[14.660723038103162,10.82999999999994,0.20117273685542145,0,0]
[14.837358255429715,10.839999999999939,0.19456453866297455,0,0]
[15.013993472756269,10.849999999999939,0.18809815475381275,0,0]
[15.190628690082821,10.859999999999939,0.18177395803260385,0,0]
[15.367263907409374,10.869999999999939,0.17559214122184866,0,0]
[15.543899124735928,10.879999999999939,0.16955272261608109,0,0]
[15.72053434206248,10.889999999999938,0.16365555198432152,0,0]
[15.897169559389035,10.899999999999938,0.15790031660182346,0,0]
[16.073804776715587,10.909999999999938,0.15228654739244901,0,0]
[16.250439994042139,10.919999999999938,0.14681362516334742,0,0]
[16.427075211368695,10.929999999999938,0.14148078691399962,0,0]
[16.603710428695248,10.939999999999937,0.13628713220212127,0,0]
[16.7803456460218,10.949999999999937,0.13123162954938455,0,0]
[16.956980863348353,10.959999999999937,0.1263131228704279,0,0]
[17.133616080674905,10.969999999999937,0.12153033790915942,0,0]
[17.310251298001461,10.979999999999936,0.11688188866693204,0,0]
[17.486886515328013,10.989999999999936,0.11236628380776444,0,0]
[17.663521732654566,10.999999999999936,0.10798193302640373,0,0]
[17.840156949981118,11.009999999999936,0.10372715336566801,0,0]
[18.016792167307674,11.019999999999936,9.9600175470167682E-2,0,0]
[18.193427384634226,11.029999999999935,9.5599149764179506E-2,0,0]
[18.370062601960779,11.039999999999935,9.1722152542134533E-2,0,0]
[18.546697819287331,11.049999999999935,8.7967191960878419E-2,0,0]
[18.723333036613884,11.059999999999935,8.4332213923563951E-2,0,0]
[18.89996825394044,11.069999999999935,8.0815107845743264E-2,0,0]
[19.076603471266992,11.079999999999934,7.7413712294933185E-2,0,0]
[19.253238688593544,11.089999999999934,7.4125820495634237E-2,0,0]
[19.429873905920097,11.099999999999934,7.0949185692483527E-2,0,0]
[19.606509123246653,11.109999999999934,6.7881526364918371E-2,0,0]
[19.783144340573205,11.119999999999933,6.4920531287414263E-2,0,0]
[19.959779557899758,11.129999999999933,6.2063864430035233E-2,0,0]
[20.13641477522631,11.139999999999933,5.9309169694700646E-2,0,0]
[20.313049992552862,11.149999999999933,5.6654075483219858E-2,0,0]
[20.489685209879418,11.159999999999933,5.4096199093780467E-2,0,0]
[20.666320427205971,11.169999999999932,5.1633150943191694E-2,0,0]
[20.842955644532523,11.179999999999932,4.9262538612780765E-2,0,0]
[21.019590861859076,11.189999999999932,4.6981970716417923E-2,0,0]
[{"$f":"(B423-B$4)/B$11","v":21.196226079185632},11.199999999999932,{"$f":"NORMDIST(B423,B$4,B$5,0)","v":4.4789060589700461E-2},{"$f":"IF(C423<=B$14/2,C423,0)","v":0},{"$f":"IF(C423<=B$6/2,C423,0)","v":0}]
[21.372861296512184,11.209999999999932,4.2681429799859706E-2,0,0]
[21.549496513838736,{"$f":"B424+0.01","v":11.219999999999931},4.0656711476465289E-2,0,0]
[21.726131731165289,11.229999999999931,3.8712553463487023E-2,0,0]
[21.902766948491841,11.239999999999931,3.6846621293736725E-2,0,0]
[22.079402165818397,11.249999999999931,3.5056600987149224E-2,0,0]
[22.25603738314495,11.259999999999931,3.3340201674773792E-2,3.3340201674773792E-2,0]
[22.432672600471502,11.26999999999993,3.1695158050732856E-2,3.1695158050732856E-2,0]
[22.609307817798054,11.27999999999993,3.0119232654765682E-2,3.0119232654765682E-2,0]
[22.785943035124607,11.28999999999993,2.8610217988309733E-2,2.8610217988309733E-2,0]
[22.962578252451163,11.29999999999993,2.7165938467381169E-2,2.7165938467381169E-2,0]
[23.139213469777715,11.309999999999929,2.5784252215800146E-2,2.5784252215800146E-2,0]
[23.315848687104268,11.319999999999929,2.4463052702565088E-2,2.4463052702565088E-2,2.4463052702565088E-2]
[23.49248390443082,11.329999999999929,2.3200270227413892E-2,2.3200270227413892E-2,2.3200270227413892E-2]
[23.669119121757376,11.339999999999929,2.1993873258819553E-2,2.1993873258819553E-2,2.1993873258819553E-2]
[23.845754339083928,11.349999999999929,2.0841869628853222E-2,2.0841869628853222E-2,2.0841869628853222E-2]
[24.022389556410481,11.359999999999928,1.9742307589509969E-2,1.9742307589509969E-2,1.9742307589509969E-2]
[24.199024773737033,11.369999999999928,1.869327673523194E-2,1.869327673523194E-2,1.869327673523194E-2]
[24.375659991063586,11.379999999999928,1.7692908796481485E-2,1.7692908796481485E-2,1.7692908796481485E-2]
[24.552295208390142,11.389999999999928,1.6739378309312779E-2,1.6739378309312779E-2,1.6739378309312779E-2]
[24.728930425716694,11.399999999999928,1.5830903165966352E-2,1.5830903165966352E-2,1.5830903165966352E-2]
[24.905565643043246,11.409999999999927,1.4965745051567253E-2,1.4965745051567253E-2,1.4965745051567253E-2]
[25.082200860369799,11.419999999999927,1.4142209772044752E-2,1.4142209772044752E-2,1.4142209772044752E-2]
[25.258836077696355,11.429999999999927,1.3358647478410819E-2,1.3358647478410819E-2,1.3358647478410819E-2]
[25.435471295022907,11.439999999999927,1.2613452792537177E-2,1.2613452792537177E-2,1.2613452792537177E-2]
[25.61210651234946,11.449999999999926,1.1905064839556783E-2,1.1905064839556783E-2,1.1905064839556783E-2]
[25.788741729676012,11.459999999999926,1.1231967191986766E-2,1.1231967191986766E-2,1.1231967191986766E-2]
[25.965376947002564,11.469999999999926,1.0592687730626641E-2,1.0592687730626641E-2,1.0592687730626641E-2]
[26.14201216432912,11.479999999999926,9.9857984272291329E-3,9.9857984272291329E-3,9.9857984272291329E-3]
[26.318647381655673,11.489999999999926,9.4099150538721303E-3,9.4099150538721303E-3,9.4099150538721303E-3]
[26.495282598982225,11.499999999999925,8.8636968238799824E-3,8.8636968238799824E-3,8.8636968238799824E-3]
[26.671917816308778,11.509999999999925,8.3458459690516976E-3,8.3458459690516976E-3,8.3458459690516976E-3]
[26.848553033635334,11.519999999999925,7.8551072578531434E-3,7.8551072578531434E-3,7.8551072578531434E-3]
[27.025188250961886,11.529999999999925,7.3902674591214699E-3,7.3902674591214699E-3,7.3902674591214699E-3]
[27.201823468288438,11.539999999999925,6.9501547557131041E-3,6.9501547557131041E-3,6.9501547557131041E-3]
[27.378458685614991,11.549999999999924,6.5336381124029069E-3,6.5336381124029069E-3,6.5336381124029069E-3]
[27.555093902941543,11.559999999999924,6.1396266022123933E-3,6.1396266022123933E-3,6.1396266022123933E-3]
[27.731729120268099,11.569999999999924,5.767068695209634E-3,5.767068695209634E-3,5.767068695209634E-3]
[27.908364337594652,11.579999999999924,5.4149515136840158E-3,5.4149515136840158E-3,5.4149515136840158E-3]
[28.084999554921204,11.589999999999923,5.0823000574555218E-3,5.0823000574555218E-3,5.0823000574555218E-3]
[28.261634772247756,11.599999999999923,4.768176402932027E-3,4.768176402932027E-3,4.768176402932027E-3]
[28.438269989574312,11.609999999999923,4.4716788793792966E-3,4.4716788793792966E-3,4.4716788793792966E-3]
[28.614905206900865,11.619999999999923,4.1919412257179827E-3,4.1919412257179827E-3,4.1919412257179827E-3]
[28.791540424227417,11.629999999999923,3.9281317310107334E-3,3.9281317310107334E-3,3.9281317310107334E-3]
[28.96817564155397,11.639999999999922,3.6794523616504315E-3,3.6794523616504315E-3,3.6794523616504315E-3]
[29.144810858880522,11.649999999999922,3.4451378781091284E-3,3.4451378781091284E-3,3.4451378781091284E-3]
[29.321446076207078,11.659999999999922,3.2244549439559189E-3,3.2244549439559189E-3,3.2244549439559189E-3]
[29.49808129353363,11.669999999999922,3.0167012297021901E-3,3.0167012297021901E-3,3.0167012297021901E-3]
[29.674716510860183,11.679999999999922,2.8212045138842558E-3,2.8212045138842558E-3,2.8212045138842558E-3]
[29.851351728186735,11.689999999999921,2.637321783646885E-3,2.637321783646885E-3,2.637321783646885E-3]
[30.027986945513291,11.699999999999921,2.4644383369473596E-3,2.4644383369473596E-3,2.4644383369473596E-3]
[30.204622162839843,11.709999999999921,2.301966888358212E-3,2.301966888358212E-3,2.301966888358212E-3]
[30.381257380166396,11.719999999999921,2.1493466803086435E-3,2.1493466803086435E-3,2.1493466803086435E-3]
[30.557892597492948,11.72999999999992,2.0060426014695799E-3,2.0060426014695799E-3,2.0060426014695799E-3]
[30.734527814819501,11.73999999999992,1.8715443138559982E-3,1.8715443138559982E-3,1.8715443138559982E-3]
[30.911163032146057,11.74999999999992,1.7453653900924967E-3,1.7453653900924967E-3,1.7453653900924967E-3]
[31.087798249472609,11.75999999999992,1.6270424621645345E-3,1.6270424621645345E-3,1.6270424621645345E-3]
[31.264433466799161,11.76999999999992,1.5161343828582838E-3,1.5161343828582838E-3,1.5161343828582838E-3]
[31.441068684125714,11.779999999999919,1.4122214009768827E-3,1.4122214009768827E-3,1.4122214009768827E-3]
[31.61770390145227,11.789999999999919,1.3149043513101131E-3,1.3149043513101131E-3,1.3149043513101131E-3]
[31.794339118778822,11.799999999999919,1.2238038602282581E-3,1.2238038602282581E-3,1.2238038602282581E-3]
[31.970974336105375,11.809999999999919,1.1385595676691748E-3,1.1385595676691748E-3,1.1385595676691748E-3]
[32.147609553431927,11.819999999999919,1.0588293661904977E-3,1.0588293661904977E-3,1.0588293661904977E-3]
[32.324244770758483,11.829999999999918,9.842886576663754E-4,9.842886576663754E-4,9.842886576663754E-4]
[{"$f":"(B487-B$4)/B$11","v":32.500879988085032},11.839999999999918,{"$f":"NORMDIST(B487,B$4,B$5,0)","v":9.1462962812026525E-4},{"$f":"IF(C487<=B$14/2,C487,0)","v":9.1462962812026525E-4},{"$f":"IF(C487<=B$6/2,C487,0)","v":9.1462962812026525E-4}]
[32.677515205411588,11.849999999999918,8.4956054110201895E-4,8.4956054110201895E-4,8.4956054110201895E-4]
[32.854150422738144,{"$f":"B488+0.01","v":11.859999999999918},7.8880504993879589E-4,7.8880504993879589E-4,7.8880504993879589E-4]
[33.030785640064693,11.869999999999918,7.3210152911512257E-4,7.3210152911512257E-4,7.3210152911512257E-4]
[33.207420857391249,11.879999999999917,6.7920242496773186E-4,6.7920242496773186E-4,6.7920242496773186E-4]
[33.384056074717797,11.889999999999917,6.2987362581543808E-4,6.2987362581543808E-4,6.2987362581543808E-4]
[33.560691292044353,11.899999999999917,5.8389385158328928E-4,5.8389385158328928E-4,5.8389385158328928E-4]
[33.737326509370909,11.909999999999917,5.4105406292338657E-4,5.4105406292338657E-4,5.4105406292338657E-4]
[33.913961726697458,11.919999999999916,5.0115688978204286E-4,5.0115688978204286E-4,5.0115688978204286E-4]
[34.090596944024014,11.929999999999916,4.6401607931418476E-4,4.6401607931418476E-4,4.6401607931418476E-4]
[34.267232161350563,11.939999999999916,4.2945596300101365E-4,4.2945596300101365E-4,4.2945596300101365E-4]
[34.443867378677119,11.949999999999916,3.9731094278580624E-4,3.9731094278580624E-4,3.9731094278580624E-4]
[34.620502596003675,11.959999999999916,3.6742499600515702E-4,3.6742499600515702E-4,3.6742499600515702E-4]
[34.797137813330224,11.969999999999915,3.3965119885891372E-4,3.3965119885891372E-4,3.3965119885891372E-4]
[34.97377303065678,11.979999999999915,3.1385126813127524E-4,3.1385126813127524E-4,3.1385126813127524E-4]
[35.150408247983329,11.989999999999915,2.8989512084797852E-4,2.8989512084797852E-4,2.8989512084797852E-4]
[35.327043465309885,11.999999999999915,2.6766045152995331E-4,2.6766045152995331E-4,2.6766045152995331E-4]
[35.503678682636441,12.009999999999915,2.4703232668221671E-4,2.4703232668221671E-4,2.4703232668221671E-4]
[35.680313899962989,12.019999999999914,2.2790279613788713E-4,2.2790279613788713E-4,2.2790279613788713E-4]
[35.856949117289545,12.029999999999914,2.1017052086094693E-4,2.1017052086094693E-4,2.1017052086094693E-4]
[36.033584334616101,12.039999999999914,1.9374041679757483E-4,1.9374041679757483E-4,1.9374041679757483E-4]
[36.21021955194265,12.049999999999914,1.7852331435439206E-4,1.7852331435439206E-4,1.7852331435439206E-4]
[36.386854769269206,12.059999999999913,1.6443563307268913E-4,1.6443563307268913E-4,1.6443563307268913E-4]
[36.563489986595755,12.069999999999913,1.5139907106043106E-4,1.5139907106043106E-4,1.5139907106043106E-4]
[36.740125203922311,12.079999999999913,1.3934030873852965E-4,1.3934030873852965E-4,1.3934030873852965E-4]
[36.916760421248867,12.089999999999913,1.2819072645430535E-4,1.2819072645430535E-4,1.2819072645430535E-4]
[37.093395638575416,12.099999999999913,1.1788613551316619E-4,1.1788613551316619E-4,1.1788613551316619E-4]
[37.270030855901972,12.109999999999912,1.0836652217916037E-4,1.0836652217916037E-4,1.0836652217916037E-4]
[37.446666073228521,12.119999999999912,9.9575804196098462E-5,9.9575804196098462E-5,9.9575804196098462E-5]
[37.623301290555077,12.129999999999912,9.1461599383271027E-5,9.1461599383271027E-5,9.1461599383271027E-5]
[37.799936507881633,12.139999999999912,8.3975005863298042E-5,8.3975005863298042E-5,8.3975005863298042E-5]
[37.976571725208181,12.149999999999912,7.707039348423286E-5,7.707039348423286E-5,7.707039348423286E-5]
[38.153206942534737,12.159999999999911,7.0705206003600458E-5,7.0705206003600458E-5,7.0705206003600458E-5]
[38.329842159861286,12.169999999999911,6.4839773608477537E-5,6.4839773608477537E-5,6.4839773608477537E-5]
[38.506477377187842,12.179999999999911,5.9437135352930646E-5,5.9437135352930646E-5,5.9437135352930646E-5]
[38.683112594514398,12.189999999999911,5.4462871102027792E-5,5.4462871102027792E-5,5.4462871102027792E-5]
[38.859747811840947,12.19999999999991,4.9884942580146407E-5,4.9884942580146407E-5,4.9884942580146407E-5]
[39.036383029167503,12.20999999999991,4.5673543130330107E-5,4.5673543130330107E-5,4.5673543130330107E-5]
[39.213018246494059,12.21999999999991,4.1800955800934303E-5,4.1800955800934303E-5,4.1800955800934303E-5]
[39.389653463820608,12.22999999999991,3.8241419385666245E-5,3.8241419385666245E-5,3.8241419385666245E-5]
[39.566288681147164,12.23999999999991,3.4971002053306656E-5,3.4971002053306656E-5,3.4971002053306656E-5]
[39.742923898473713,12.249999999999909,3.1967482213837018E-5,3.1967482213837018E-5,3.1967482213837018E-5]
[39.919559115800269,12.259999999999909,2.9210236278329801E-5,2.9210236278329801E-5,2.9210236278329801E-5]
[40.096194333126824,12.269999999999909,2.6680132980733716E-5,2.6680132980733716E-5,2.6680132980733716E-5]
[40.272829550453373,12.279999999999909,2.4359433940557653E-5,2.4359433940557653E-5,2.4359433940557653E-5]
[40.449464767779929,12.289999999999909,2.2231700156374218E-5,2.2231700156374218E-5,2.2231700156374218E-5]
[40.626099985106478,12.299999999999908,2.0281704130990596E-5,2.0281704130990596E-5,2.0281704130990596E-5]
[40.802735202433034,12.309999999999908,1.8495347340026941E-5,1.8495347340026941E-5,1.8495347340026941E-5]
[40.97937041975959,12.319999999999908,1.685958276647195E-5,1.685958276647195E-5,1.685958276647195E-5]
[41.156005637086139,12.329999999999908,1.5362342234514148E-5,1.5362342234514148E-5,1.5362342234514148E-5]
[41.332640854412695,12.339999999999907,1.3992468286552889E-5,1.3992468286552889E-5,1.3992468286552889E-5]
[41.509276071739244,12.349999999999907,1.2739650357745315E-5,1.2739650357745315E-5,1.2739650357745315E-5]
[41.6859112890658,12.359999999999907,1.1594365012724728E-5,1.1594365012724728E-5,1.1594365012724728E-5]
[41.862546506392356,12.369999999999907,1.0547820019211919E-5,1.0547820019211919E-5,1.0547820019211919E-5]
[42.039181723718904,12.379999999999907,9.5919020431135629E-6,9.5919020431135629E-6,9.5919020431135629E-6]
[42.21581694104546,12.389999999999906,8.7191277593510796E-6,8.7191277593510796E-6,8.7191277593510796E-6]
[42.392452158372009,12.399999999999906,7.922598182071286E-6,7.922598182071286E-6,7.922598182071286E-6]
[42.569087375698565,12.409999999999906,7.1959560270490272E-6,7.1959560270490272E-6,7.1959560270490272E-6]
[42.745722593025121,12.419999999999906,6.5333459279925033E-6,6.5333459279925033E-6,6.5333459279925033E-6]
[42.92235781035167,12.429999999999906,5.9293773370959906E-6,5.9293773370959906E-6,5.9293773370959906E-6]
[43.098993027678226,12.439999999999905,5.3790899485480153E-6,5.3790899485480153E-6,5.3790899485480153E-6]
[43.275628245004782,12.449999999999905,4.8779214917912538E-6,4.8779214917912538E-6,4.8779214917912538E-6]
[43.452263462331331,12.459999999999905,4.4216777491409743E-6,4.4216777491409743E-6,4.4216777491409743E-6]
[43.628898679657887,12.469999999999905,4.0065046599007574E-6,4.0065046599007574E-6,4.0065046599007574E-6]
[{"$f":"(B551-B$4)/B$11","v":43.805533896984436},12.479999999999905,{"$f":"NORMDIST(B551,B$4,B$5,0)","v":3.6288623803675035E-6},{"$f":"IF(C551<=B$14/2,C551,0)","v":3.6288623803675035E-6},{"$f":"IF(C551<=B$6/2,C551,0)","v":3.6288623803675035E-6}]
[43.982169114310992,12.489999999999904,3.2855011760932822E-6,3.2855011760932822E-6,3.2855011760932822E-6]
[44.158804331637548,{"$f":"B552+0.01","v":12.499999999999904},2.9734390294714477E-6,2.9734390294714477E-6,2.9734390294714477E-6]
[44.335439548964096,12.509999999999904,2.6899408521414789E-6,2.6899408521414789E-6,2.6899408521414789E-6]
[44.512074766290652,12.519999999999904,2.4324991978649997E-6,2.4324991978649997E-6,2.4324991978649997E-6]
[44.688709983617201,12.529999999999903,2.1988163774185546E-6,2.1988163774185546E-6,2.1988163774185546E-6]
[44.865345200943757,12.539999999999903,1.986787882681779E-6,1.986787882681779E-6,1.986787882681779E-6]
[45.041980418270313,12.549999999999903,1.7944870324784397E-6,1.7944870324784397E-6,1.7944870324784397E-6]
[45.218615635596862,12.559999999999903,1.6201507578578836E-6,1.6201507578578836E-6,1.6201507578578836E-6]
[45.395250852923418,12.569999999999903,1.4621664493921603E-6,1.4621664493921603E-6,1.4621664493921603E-6]
[45.571886070249967,12.579999999999902,1.3190597937163742E-6,1.3190597937163742E-6,1.3190597937163742E-6]
[45.748521287576523,12.589999999999902,1.1894835309627571E-6,1.1894835309627571E-6,1.1894835309627571E-6]
[45.925156504903079,12.599999999999902,1.0722070689406179E-6,1.0722070689406179E-6,1.0722070689406179E-6]
[46.101791722229628,12.609999999999902,9.6610689390092655E-7,9.6610689390092655E-7,9.6610689390092655E-7]
[46.278426939556184,12.619999999999902,8.701577215039215E-7,8.701577215039215E-7,8.701577215039215E-7]
[46.45506215688274,12.629999999999901,7.8342433518777594E-7,7.8342433518777594E-7,7.8342433518777594E-7]
[46.631697374209288,12.639999999999901,7.0505406252354529E-7,7.0505406252354529E-7,7.0505406252354529E-7]
[46.808332591535844,12.649999999999901,6.3426984334386106E-7,6.3426984334386106E-7,6.3426984334386106E-7]
[46.984967808862393,12.659999999999901,5.7036384645739907E-7,5.7036384645739907E-7,5.7036384645739907E-7]
[47.161603026188949,12.6699999999999,5.1269159461546322E-7,5.1269159461546322E-7,5.1269159461546322E-7]
[47.338238243515505,12.6799999999999,4.6066656008833471E-7,4.6066656008833471E-7,4.6066656008833471E-7]
[47.514873460842054,12.6899999999999,4.1375519574437563E-7,4.1375519574437563E-7,4.1375519574437563E-7]
[47.69150867816861,12.6999999999999,3.7147236891146043E-7,3.7147236891146043E-7,3.7147236891146043E-7]
[47.868143895495159,12.7099999999999,3.3337716754481956E-7,3.3337716754481956E-7,3.3337716754481956E-7]
[48.044779112821715,12.719999999999899,2.9906905033464666E-7,2.9906905033464666E-7,2.9906905033464666E-7]
[48.221414330148271,12.729999999999899,2.6818431436738989E-7,2.6818431436738989E-7,2.6818431436738989E-7]
[48.39804954747482,12.739999999999899,2.4039285581283106E-7,2.4039285581283106E-7,2.4039285581283106E-7]
[48.574684764801376,12.749999999999899,2.1539520085110544E-7,2.1539520085110544E-7,2.1539520085110544E-7]
[48.751319982127924,12.759999999999899,1.9291978568568323E-7,1.9291978568568323E-7,1.9291978568568323E-7]
[48.92795519945448,12.769999999999898,1.7272046601581461E-7,1.7272046601581461E-7,1.7272046601581461E-7]
[49.104590416781036,12.779999999999898,1.5457423777063331E-7,1.5457423777063331E-7,1.5457423777063331E-7]
[49.281225634107585,12.789999999999898,1.3827915224240565E-7,1.3827915224240565E-7,1.3827915224240565E-7]
[49.457860851434141,12.799999999999898,1.236524100034586E-7,1.236524100034586E-7,1.236524100034586E-7]
[49.634496068760697,12.809999999999897,1.1052861915512173E-7,1.1052861915512173E-7,1.1052861915512173E-7]
[49.811131286087246,12.819999999999897,9.875820454232317E-8,9.875820454232317E-8,9.875820454232317E-8]
[49.987766503413802,12.829999999999897,8.8205955578848947E-8,8.8205955578848947E-8,8.8205955578848947E-8]
[50.164401720740351,12.839999999999897,7.8749701270089321E-8,7.8749701270089321E-8,7.8749701270089321E-8]
[50.341036938066907,12.849999999999897,7.0279101896491571E-8,7.0279101896491571E-8,7.0279101896491571E-8]
[50.517672155393463,12.859999999999896,6.2694547635913748E-8,6.2694547635913748E-8,6.2694547635913748E-8]
[50.694307372720012,12.869999999999896,5.5906155160376038E-8,5.5906155160376038E-8,5.5906155160376038E-8]
[50.870942590046567,12.879999999999896,4.9832853945961641E-8,4.9832853945961641E-8,4.9832853945961641E-8]
[51.047577807373116,12.889999999999896,4.4401554687211501E-8,4.4401554687211501E-8,4.4401554687211501E-8]
[51.224213024699672,12.899999999999896,3.9546392812537254E-8,3.9546392812537254E-8,3.9546392812537254E-8]
[51.400848242026228,12.909999999999895,3.5208040658014593E-8,3.5208040658014593E-8,3.5208040658014593E-8]
[51.577483459352777,12.919999999999895,3.1333082376303439E-8,3.1333082376303439E-8,3.1333082376303439E-8]
[51.754118676679333,12.929999999999895,2.7873446138129144E-8,2.7873446138129144E-8,2.7873446138129144E-8]
[51.930753894005882,12.939999999999895,2.4785888628330898E-8,2.4785888628330898E-8,2.4785888628330898E-8]
[52.107389111332438,12.949999999999894,2.2031527249392092E-8,2.2031527249392092E-8,2.2031527249392092E-8]
[52.284024328658994,12.959999999999894,1.9575415824906837E-8,1.9575415824906837E-8,1.9575415824906837E-8]
[52.460659545985543,12.969999999999894,1.7386159945782274E-8,1.7386159945782274E-8,1.7386159945782274E-8]
[52.637294763312099,12.979999999999894,1.5435568425160579E-8,1.5435568425160579E-8,1.5435568425160579E-8]
[52.813929980638648,12.989999999999894,1.3698337625988989E-8,1.3698337625988989E-8,1.3698337625988989E-8]